
##TITLE=AC1076_TOSA01_5835558_o7BCo1VUUa
##JCAMPDX= 6.0         $$ Bruker NMR JCAMP-DX V2.0
##DATA TYPE= NMR SPECTRUM
##DATA CLASS= NTUPLES
##ORIGIN= BRUKER
##OWNER= Administrator
$$ 1.72 TOPSPIN		Version 2.1
$$ 2012-04-10 10:32:34.484 -0500  Administrator@TOPSPIN
$$ Compression mode = diff/dup
##.OBSERVE FREQUENCY= 400.13188235
##.OBSERVE NUCLEUS= ^1H
##.ACQUISITION MODE= SIMULTANEOUS (DQD)
##.ACQUISITION SCHEME= undefined
##.AVERAGES= 8
##.DIGITISER RES= 22
##SPECTROMETER/DATA SYSTEM= spect
##.PULSE SEQUENCE= zg30
##.SOLVENT NAME= COFFEE_meoh
##.SHIFT REFERENCE= INTERNAL, COFFEE_meoh, 1, 14.98061
##AUDIT TRAIL= $$ (NUMBER, WHEN, WHO, WHERE, PROCESS, VERSION, WHAT)
$$ ##TITLE= Audit trail, TOPSPIN		Version 2.1
$$ ##JCAMPDX= 5.01
$$ ##ORIGIN= Bruker BioSpin GmbH
$$ ##OWNER= Administrator
$$ $$ C:\Bruker\TOPSPIN/data/COFFEE/nmr/AC1076_TOSA01_5835558_o7BCo1VUUa/10/pdata/1/auditp.txt
$$ ##AUDIT TRAIL=  $$ (NUMBER, WHEN, WHO, WHERE, PROCESS, VERSION, WHAT)
(   1,<2012-03-27 23:25:48.843 -0500>,<Administrator>,<TOPSPIN>,<go>,<TOPSPIN 2.1>,
      <created by zg
	started at 2012-03-27 23:24:41.921 -0500,
	POWCHK enabled, PULCHK disabled,
       configuration hash MD5:
       1A 1E CE 29 27 FD 77 03 67 4E F0 E3 C4 B2 CB 90
       data hash MD5: 64K
       20 B1 5C E4 CE FC AE 38 FA 94 D9 AC DF 2A 06 70>)
(   2,<2012-03-27 23:25:53.203 -0500>,<Administrator>,<TOPSPIN>,<proc1d>,<TOPSPIN 2.1>,
      <Start of raw data processing
       efp LB = 0 FT_mod = 6 PKNL = 1 PHC0 = 0 PHC1 = 0 SI = 32K 
       data hash MD5: 32K
       62 C2 12 B6 8E 8E 4A 0C 67 4A 01 50 10 9F 1E 4E>)
(   3,<2012-03-27 23:25:53.515 -0500>,<Administrator>,<TOPSPIN>,<proc1d>,<TOPSPIN 2.1>,
      <pk PHC0 = 214.9695 PHC1 = 0 
       data hash MD5: 32K
       EC EC 06 93 8B BB 30 5D 45 CC E7 65 7D 25 AD B0>)
(   4,<2012-03-27 23:25:53.609 -0500>,<Administrator>,<TOPSPIN>,<proc1d>,<TOPSPIN 2.1>,
      <abs ABSG = 1 
       data hash MD5: 32K
       D9 8B CA B8 FA 41 0B F0 29 ED 27 48 05 B6 FC 51>)
(   5,<2012-03-27 23:25:53.640 -0500>,<Administrator>,<TOPSPIN>,<proc1d>,<TOPSPIN 2.1>,
      <abs ABSG = 2 
       data hash MD5: 32K
       BC B4 D9 C5 44 8B 0F 9A BA 1A 0B 40 A1 BA 77 53>)
(   6,<2012-03-27 23:25:53.671 -0500>,<Administrator>,<TOPSPIN>,<proc1d>,<TOPSPIN 2.1>,
      <abs ABSG = 3 
       data hash MD5: 32K
       8D D8 B7 67 F0 5A 49 F4 48 1E 18 4D 2E E5 4D 36>)
(   7,<2012-03-27 23:25:53.703 -0500>,<Administrator>,<TOPSPIN>,<proc1d>,<TOPSPIN 2.1>,
      <abs ABSG = 4 
       data hash MD5: 32K
       CB B4 D9 0B A0 07 65 75 B5 80 B8 F5 CC 4E C0 75>)
(   8,<2012-03-27 23:25:53.734 -0500>,<Administrator>,<TOPSPIN>,<proc1d>,<TOPSPIN 2.1>,
      <abs ABSG = 5 
       data hash MD5: 32K
       46 D5 D4 57 6B 25 E8 88 F2 6C FC AE 9D A8 67 C5>)
(   9,<2012-03-27 23:25:58.593 -0500>,<Administrator>,<TOPSPIN>,<audit>,<TOPSPIN 2.1>,
      <user comment:
       ICON-NMR User ID: COFFEE
       data hash MD5: 32K
       46 D5 D4 57 6B 25 E8 88 F2 6C FC AE 9D A8 67 C5>)
$$ [...]
150 150 150 150 150 150 150 150
##$TP07= 0
##$TPNAME0= <>
##$TPNAME1= <>
##$TPNAME2= <>
##$TPNAME3= <>
##$TPNAME4= <>
##$TPNAME5= <>
##$TPNAME6= <>
##$TPNAME7= <>
##$TPOAL= (0..7)
0.5 0.5 0.5 0.5 0.5 0.5 0.5 0.5
##$TPOFFS= (0..7)
0 0 0 0 0 0 0 0
##$TUNHIN= 0
##$TUNHOUT= 0
##$TUNXOUT= 0
##$USERA1= <user>
##$USERA2= <user>
##$USERA3= <user>
##$USERA4= <user>
##$USERA5= <user>
##$V9= 5
##$VALIST= <valist>
##$VCLIST= <CCCCCCCCCCCCCCC>
##$VD= 0
##$VDLIST= <DDDDDDDDDDDDDDD>
##$VPLIST= <PPPPPPPPPPPPPPP>
##$VTLIST= <TTTTTTTTTTTTTTT>
##$WBST= 2048
##$WBSW= 25
##$XGAIN= (0..3)
0 0 0 0
##$XL= 0
##$YL= 0
##$YMAX_a= 538675
##$YMIN_a= -649292
##$ZGOPTNS= <>
##$ZL1= 120
##$ZL2= 120
##$ZL3= 120
##$ZL4= 120
##$ABSF1= 14.98061
##$ABSF2= -5.57192
##$ABSG= 5
##$ABSL= 3
##$ALPHA= 0
##$AQORDER= 0
##$ASSFAC= 0
##$ASSFACI= 0
##$ASSFACX= 0
##$ASSWID= 0
##$AUNMP= <proc_prof1d_extract_pilot.lims>
##$AXLEFT= 0
##$AXNAME= <>
##$AXNUC= <1H>
##$AXRIGHT= 0
##$AXTYPE= 0
##$AXUNIT= <>
##$AZFE= 0.1
##$AZFW= 0.1
##$BCFW= 0
##$BC_mod= 0
##$BYTORDP= 0
##$COROFFS= 0
##$CY= 15
##$DATMOD= 1
##$DC= 0
##$DFILT= <>
##$DTYPP= 0
##$F1P= 0
##$F2P= 0
##$FCOR= 0.5
##$FTSIZE= 32768
##$FT_mod= 6
##$GAMMA= 0
##$GB= 0
##$INTBC= 1
##$INTSCL= 1
##$ISEN= 128
##$LB= 0
##$LEV0= 0
##$LPBIN= 0
##$MAXI= 10000
##$MC2= 0
##$MEAN= 0
##$ME_mod= 0
##$MI= 0
##$NCOEF= 0
##$NC_proc= -8
##$NLEV= 6
##$NOISF1= 0
##$NOISF2= 0
##$NSP= 0
##$NTH_PI= 0
##$NZP= 0
##$OFFSET= 14.98061
##$PC= 1
##$PHC0= 214.9695
##$PHC1= 0
##$PH_mod= 1
##$PKNL= yes
##$PPARMOD= 0
##$PPDIAG= 0
##$PPIPTYP= 0
##$PPMPNUM= 2147483647
##$PPRESOL= 1
##$PSCAL= 4
##$PSIGN= 0
##$PYNMP= <proc.py>
##$REVERSE= no
##$SF= 400.13
##$SI= 32768
##$SIGF1= 0
##$SIGF2= 0
##$SINO= 400
##$SIOLD= 32768
##$SPECTYP= <>
##$SREGLST= <1H.CDCl3>
##$SSB= 0
##$STSI= 32768
##$STSR= 0
##$SW_p= 8223.68421052632
##$SYMM= 0
##$S_DEV= 0
##$TDeff= 65536
##$TDoff= 0
##$TI= <>
##$TILT= no
##$TM1= 0
##$TM2= 0
##$TOPLEV= 0
##$USERP1= <user>
##$USERP2= <user>
##$USERP3= <user>
##$USERP4= <user>
##$USERP5= <user>
##$WDW= 1
##$XDIM= 32768
##$YMAX_p= 470689767
##$YMIN_p= -739808
##$CURPLOT= <Network HP LaserJet P1505>
##$CURPRIN= <$Network HP LaserJet P1505>
##$DFORMAT= <normdp>
##$LAYOUT= <+/1D_H.xwp>
##$LFORMAT= <normlp>
##$PFORMAT= <normpl>
##$SURQMSG= 1
$$ End of Bruker specific parameters
$$ ---------------------------------
##NTUPLES= NMR SPECTRUM
##VAR_NAME=  FREQUENCY,     SPECTRUM/REAL,   SPECTRUM/IMAG
##SYMBOL=    X,             R,               I
##VAR_TYPE=  INDEPENDENT,   DEPENDENT,       DEPENDENT
##VAR_FORM=  AFFN,          ASDF,            ASDF
##VAR_DIM=   32768,         32768,           32768
##UNITS=     HZ,            ARBITRARY UNITS, ARBITRARY UNITS
##FACTOR=    0.250966925370066, 1,           1
##FIRST=     8223.43324360095, 64363,        -184159
##LAST=      0,             135320,          -233861
##MIN=       0,             -739808,         0
##MAX=       8223.43324360095, 470689767,    0
$$ Real data points
##PAGE= N=1
##DATA TABLE= (X++(R..R)), XYDATA
$$ [...]
19469E8778a29245A19041a16605K8648B948n99a40936N1933m7037A4134d83703
$$ 58778 -129245 119041 -116605 -87957 2948 2349 -140936 -89003 -136040 14134 -483703
19457B22091c14974b9497B85075b41384F3585P5630C5221c3010l1587J0426A87422
$$ 222091 -314974 -29497 285075 -241384 63585 139215 35221 -33010 -64597 -54171 187422
19445e57714e1633j24216A82668o85a4992A62499D0335j4003g1295E2484a85302
$$ -557714 -51633 -175849 182668 181983 -14992 162499 40335 26332 -71295 52484 -185302
19433d8898j02046H293b52638j28079i601j3289A09246b04269h405k06226M3121
$$ -48898 -150944 8293 -252638 -380717 -9601 -22890 109246 -204269 -8405 -214631 -171510
19422a71510d3514k1030B07498a35811A01691b44601i2962k37006D1055a48716
$$ -171510 -43514 -64544 207498 -135811 101691 -244601 -92962 -329968 41055 -148716
19411b17136A01324a28017I4266b69415A94924a58932c2937l5112o1229n4075
$$ -217136 101324 -128017 94266 -269415 194924 -158932 -32937 -68049 -129278 -183353
19401a83353f6192A83125b98118g6893j06873C02889a54810A17893g1914p7012
$$ -183353 -66192 183125 -298118 -76893 -183766 302889 -154810 117893 -71914 -148926
19391a48926G6309a48871B8310a40683e4308l79665A10872i8312D1182b5426k50194
$$ -148926 76309 -148871 28310 -140683 -54308 -433973 110872 -98312 41182 -25426 -275620
19380b75620c1327j93864N7754f4551A4639h913m200o0870A5823b98590a06831
$$ -275620 -31327 -225191 -167437 -64551 14639 -8913 -13113 -73983 15823 -298590 -106831
19368c7813F1443b97944A53104b6305p3866N553A27821b88809C2804b63840J7882
$$ -37813 61443 -297944 153104 -26305 -100171 -94618 127821 -288809 32804 -263840 -245958
19357b45958a16424m92350a22893j60816a19411j07725R6695k63367a72554f6196
$$ -245958 -116424 -608774 -122893 -283709 -119411 -227136 -130441 -393808 -172554 -66196
19346D6409a17496D9401J99077b36260A67427a82742j62346a50428B39641e24616
$$ 46409 -117496 49401 248478 -236260 167427 -182742 -345088 -150428 239641 -524616
19335c42085J26221L7641D1815a2663j61277h4698c6897p2206j34536k694A43766
$$ -342085 -215864 -178223 41815 -12663 -173940 -84698 -36897 -109103 -243639 -246333 143766
19323F0985J11822c86317G3280a4594k75707J39028c4793C61290e0936A0044c84045
$$ 60985 172807 -386317 73280 -14594 -290301 -151273 -34793 361290 -50936 10044 -384045
19311A55741K4597b82891A81971c58715h666A52138l2794a76476J0231b8699B3351
$$ 155741 180338 -282891 181971 -358715 -8666 152138 119344 -176476 -166245 -28699 23351
19299h6988l0158d2950k01170a00466A18444C2319a77442j49477Q7378d2011l83235
$$ -86988 -117146 -42950 -244120 -100466 118444 32319 -177442 -326919 -239541 -42011 -425246
19288d25246B70623b42706O1424D6498i0261j84232D7255F869c9617I2592a50784
$$ -425246 270623 -242706 -181282 46498 -90261 -274493 47255 6869 -39617 92592 -150784
19276a30410E9999a72811B67326a37236A39224j9106Q0139a31045A78704N6569
$$ -130410 59999 -172811 267326 -137236 139224 120118 200257 -131045 178704 235273
19266B35273c69317I1961f7027F2308a96542A21735i4999k52273J05957j29158
$$ 235273 -369317 91961 -67027 62308 -196542 121735 -94999 -347272 -241315 -370473
19256c70473A28612a8229H9825e7625r021j38416O1104c4886p5370d2481m7543
$$ -370473 128612 -18229 89825 -57625 -66646 -205062 -143958 -34886 -110256 -42481 -90024
19245i0024C8997N948b14533A04388e1642j60141d9808j13739B95044d43467c8887
$$ -90024 38997 44945 -214533 104388 -51642 -211783 -49808 -163547 295044 -443467 -38887
19233C5401g7117l22461A54514c2721j39218O4097a9185o4683C1244b90158K284
$$ 35401 -77117 -399578 154514 -32721 -171939 -107842 -19185 -83868 31244 -290158 -287874
19222b87874P0951B05706c91477G0220a60939N4750j53936a9041B4284f9976k2359
$$ -287874 -216923 205706 -391477 70220 -160939 -106189 -260125 -19041 24284 -69976 -92335
19211i2335L1491A31302a67353j87501A47965d0724b0091j29215A72921b12496
$$ -92335 -60844 131302 -167353 -354854 147965 -40724 -20091 -149306 172921 -212496
19200B484b6809k12501j26481b2153j90100Q9601k33501a54980j91900G0304a16507
$$ 2484 -26809 -239310 -365791 -22153 -212253 -122652 -356153 -154980 -346880 70304 -116507
19188f0816J3948B30081E3710a48372F1673h473o9218B711a57951L1156C3594
$$ -60816 -46868 230081 53710 -148372 61673 -8473 -77691 2711 -157951 -126795 33594
19176b05108K7996A63204B5428e8033j63386a08322l6334A08321A2085a51027
$$ -205108 -177112 163204 25428 -58033 -221419 -108322 -144656 108321 12085 -151027
19165b84647a8422C9130a48840A61471a01833E9002K95867b74795B96848A02642
$$ -284647 -18422 39130 -148840 161471 -101833 59002 354869 -274795 296848 102642
19154a19891M6392p0698j15373o0082F7356a11322c6173E1551p676d150B04664
$$ -119891 -73499 -144197 -259570 -319652 67356 -111322 -36173 51551 43875 -4150 204664
19142f8476C2567q253b66726B9962e51141b31325j42551a62996q4827f1310j0378
$$ -68476 32567 24314 -266726 29962 -551141 -231325 -373876 -162996 -247823 -61310 -71688
19131g1688j48982e1504l08297A17776A8962a89034B46966e6948j24691B9925
$$ -71688 -220670 -51504 -359801 117776 18962 -189034 246966 -56948 -181639 29925
19120a05198G5470b3807j17653J9607B77257c20900a34344c6362k65347B03740
$$ -105198 75470 -23807 -141460 -121853 277257 -320900 -134344 -36362 -301709 203740
19109a78411D7854a12911b7988A88655i3781Q090m1957H0695f5518a8359P843
$$ -178411 47854 -112911 -27988 188655 -93781 -85691 -127648 80695 -65518 -18359 -10516
19098a0516j57819A18458i5891A2862J47592p9212c1562J4494m60275j23575g4351
$$ -10516 -168335 118458 -95891 12862 160454 81242 -31562 -17068 -477343 -600918 -74351
19086D2344a10180j34348o8863i0044B17736b8479l22200R839a61100O9827H8199
$$ 42344 -110180 -244528 -313391 -90044 217736 -28479 -350679 -340840 -161100 -91273 88199
19074i1281B14517c32201b8448m5261b3695B19084a29110B53699a51467r6017
$$ -91281 214517 -332201 -28448 -73709 -23695 219084 -129110 253699 -151467 -247484
19064b47484J0625C54125j32412b35576A4788a21651E4209K31216a31041M4552
$$ -247484 -236859 354125 221713 -235576 14788 -121651 54209 285425 -131041 -86489
19054h6489j85022E3838i7628B88027g5819A7311K77212d9736k0524L975A43007
$$ -86489 -271511 53838 -97628 288027 -75819 17311 294523 -49736 -70260 -66285 143007
19042a09709f063k35369p7690j0668E5950a60120e0202A54643p4437g0687B931
$$ -109709 -6063 -241432 -319122 -329790 55950 -160120 -50202 154643 80206 -70687 2931
19030a2037E3052J33080b11822J3814K0776N0812C0284J02544f5170C77283d2583
$$ -12037 53052 186132 -211822 -198008 -177232 -126420 30284 132828 -65170 377283 -42583
19018c3434j39917k5618N1147I2732A4557O3229b5407k6280m2985a5121A60540
$$ -33434 -173351 -198969 -147822 92732 14557 77786 -25407 -51687 -94672 -15121 160540
19006B96067a01991n9031A40188p580N5123a54617A19443a22805D0232K5867N8446
$$ 296067 -101991 -161022 140188 132608 187731 -154617 119443 -122805 40232 66099 124545
18995A24545a26580e7204j22046B06629f6373n1552A8985e897m5096o6003H3058
$$ 124545 -126580 -57204 -179250 206629 -66373 -117925 18985 -5897 -50993 -116996 83058
18983G8901a47413A46622a23564A13437a97058k49575B0409a3392D3919J73820
$$ 78901 -147413 146622 -123564 113437 -197058 -446633 20409 -13392 43919 217739
18973B17739c12178O650J20072B07041k0146q0884c30423C3100K30959j26253
$$ 217739 -312178 -305528 -185456 207041 186895 106011 -330423 33100 264059 137806
18963A37806Q129a64652m0566B23193j08430l6809M07023j16404M0803F7875J79971
$$ 137806 145935 -164652 -205218 223193 114763 77954 484977 368573 409376 67875 247846
18952B47846j1134a68165B75710o5813K2078f6677r882K6333F2389Q4041a01840
$$ 247846 236712 -168165 275710 209897 231975 -66677 -76559 -50226 62389 146430 -101840
18940B74125e8162j60587B29498f799E550d5656m6113B62915b86309J41767A38570
$$ 274125 -58162 -218749 229498 -6799 5550 -45656 -91769 262915 -286309 -144542 138570
18928i053B39368a58366j9429P373b4127C19798D4996a66654g4125o1089A95610
$$ -9053 239368 -158366 -177795 -170422 -24127 319798 44996 -166654 -74125 -135214 195610
18916B16628A4745J46516f0615A11786D9478J28047J18099A13509a55187g2843
$$ 216628 14745 161261 -60615 111786 49478 177525 295624 113509 -155187 -72843
18905b49384e9208B8309a08040k92753a59671B50281p4421a42126j40644l8575
$$ -249384 -59208 28309 -108040 -400793 -159671 250281 175860 -142126 -282770 -321345
18895c21345A64287M4078J82514N5097K44206D7591a54979F4542g6208a4419A33573
$$ -321345 164287 208365 390879 445976 690182 47591 -154979 64542 -76208 -14419 133573
18883b39384P4119a8973k92686A52398E0526J80856b45244J01755O6270A25757
$$ -239384 -165265 -18973 -311659 152398 50526 231382 -245244 -143489 -77219 125757
18872c02124A9786a52975C3175b01389A633a30775f3793G5570C5611J75193c71276
$$ -302124 19786 -152975 33175 -201389 1633 -130775 -63793 75570 35611 210804 -371276
18860a16032A28230Q2153c27399a57650j44709J29768b7081l5295k60404g4646
$$ -116032 128230 210383 -327399 -157650 -302359 -172591 -27081 -62376 -322780 -74646
18849A48897c62232a28144A63638c05529R3713C78891A46984d40940J90021g1710
$$ 148897 -362232 -128144 163638 -305529 -211816 378891 146984 -440940 -250919 -71710
18838G3875G096b1406m0378j51835E7790L5288a97716C5469O6474a71764j96410
$$ 73875 7096 -21406 -61784 -213619 57790 93078 -197716 35469 101943 -171764 -368174
18827c68174h1952j69961g3484K5565a8217B63225G7466b99105R1773A76596e0077
$$ -368174 -81952 -251913 -73484 -47919 -18217 263225 77466 -299105 -207332 176596 -50077
18815a82873b0411A76029G5351b13867N8339A1795a51699e9318k87321a65636
$$ -182873 -20411 176029 75351 -213867 -155528 11795 -151699 -59318 -346639 -165636
18804a12980k49884A52837b77043B3111b31184j03818A04003k6911J4511J87152
$$ -112980 -362864 152837 -277043 23111 -231184 -335002 104003 77092 91603 278755
18794B78755o4942a06448l9712B86856N1275a37310A24531d43687A56914A165
$$ 278755 213813 -106448 -146160 286856 338131 -137310 124531 -443687 156914 1165
18783c5518j84287F3638f6481B61348j10111c30410a53268M2212A78217E036b94703
$$ -35518 -219805 63638 -66481 261348 151237 -330410 -153268 -111056 178217 5036 -294703
18771g1305j91649A85456K6206c20912C8472a24761P100A00369b08016f2556a3650
$$ -71305 -262954 185456 211662 -320912 38472 -124761 -117661 100369 -208016 -62556 -13650
18759a24095j63231H2539l8456L0178c6878p2798p424n070A17509b96228i3189
$$ -124095 -287326 82539 44083 74261 -36878 -109676 -117100 -122170 117509 -296228 -93189
18747a22578L9073C0309c0381l15571g7898k29110f4188A01304P0272b33771I4023
$$ -122578 -83505 30309 -30381 -345952 -77898 -307008 -64188 101304 171576 -233771 94023
18735a10378k73540I4495J70793c5729A20188a28239G642b41224C62800j72755
$$ -110378 -383918 94495 265288 -35729 120188 -128239 7642 -241224 362800 190045
18725A90045A8149a3257j07332k62807E9028a93476b8585A73450d39673F3604
$$ 190045 18149 -13257 -120589 -383396 59028 -193476 -28585 173450 -439673 63604
18714I2328B3039c51587J0321i4588A20843a94509k4177F010a90180A10837J65684
$$ 92328 23039 -351587 -341266 -94588 120843 -194509 -218686 6010 -190180 110837 276521
18703B76521a64271j06677i3604D6666c0484I9771k7414A2179P1129h0766n7943
$$ 276521 -164271 -270948 -93604 46666 -30484 99771 72357 12179 83308 -80766 -138709
18692a38709E4514b62889b240C45161e5541O21A44454b94352a18333A14205e1836
$$ -138709 54514 -262889 -2240 345161 -55541 -54920 144454 -294352 -118333 114205 -51836
18680c44360a2081D12205d0415a9278l72345A44374b9362k78333D4575J56420
$$ -344360 -12081 412205 -40415 -19278 -391623 144374 -29362 -307695 44575 200995
18670B00995b26072H1473b32971A66923a66457H2415c81088D0558j4784a60502
$$ 200995 -226072 81473 -232971 166923 -166457 82415 -381088 40558 25774 -160502
18659B87831j31461E1379b20603J02784I8883a77959o3336j5313h2235o6123F3591
$$ 287831 156370 51379 -220603 -117819 98883 -177959 -241295 -256608 -82235 -148358 63591
18647g1990A24617c1066j18796F7812j1909m734R0097F4058b05344B41992a57849
$$ -71990 124617 -31066 -149862 67812 55903 51169 141266 64058 -205344 241992 -157849
18635a11906H2290a49217J8757e2376j48847j6218j38833h1535j33732B18129
$$ -111906 82290 -149217 -130460 -52376 -201223 -217441 -356274 -81535 -215267 218129
18624h3618G5218a820E9763b08627F6946a25283K5573r4915A45345J6162a67915
$$ -83618 75218 -1820 59763 -208627 66946 -125283 -99710 -194625 145345 161507 -167915
18612a36151a8739B73754l425d45449g6110j5440j83797d5507G0928a87826M9547
$$ -136151 -18739 273754 270329 -445449 -76110 -91550 -275347 -45507 70928 -187826 -138279
18601a38279A62112f2845r3149k6917c118B92076A20414e1791A9434c97471J79721
$$ -138279 162112 -62845 -155994 -182911 -3118 292076 120414 -51791 19434 -397471 -217750
18590b17750C42749b58266B45903A11978C7277K7314K1439L2202R9123h4425r7501
$$ -217750 342749 -258266 245903 111978 37277 64591 86030 118232 217355 -84425 -181926
18579a81926j89205O8495P9767i0026k10889d8005k15762i3909k8662E4719d6872
$$ -181926 -371131 -302636 -222869 -90026 -300915 -48005 -263767 -93909 -122571 54719 -46872
18567A22609d4995j93740M9446m0154c5149k40388J05904K2925A75209a38087
$$ 122609 -44995 -238735 -189289 -229443 -35149 -275537 -169633 -146708 175209 -138087
18556a06326A50283m4007a03483o789G5330J40819a86873D050f6938b2916A68909
$$ -106326 150283 106276 -103483 -110272 75330 216149 -186873 4050 -66938 -22916 168909
18544f7560m161G5446b3989a0428j45490B01849G5845a32500A63482a73700B1833
$$ -67560 -71721 75446 -23989 -10428 -155918 201849 75845 -132500 163482 -173700 21833
18532H4980M7316K62145D3076d6232j96357B64164h4019j46854j17666B10461
$$ 84980 132296 394441 43076 -46232 -242589 264164 -84019 -230873 -348539 210461
18521e314n7357n4430M1584d964I7042a06374A38431j506d9197J8059E3464c31679
$$ -5314 -62671 -117101 -75517 -4964 97042 -106374 138431 136925 -49197 -31138 53464 -331679
18508a6525n7925B6591J8784a61152j60323J53838o229d4303k12191c8734l56913
$$ -16525 -74450 26591 45375 -161152 -321475 -167637 -173866 -44303 -256494 -38734 -395647
18497c95647A74455A0859Q1749c92830J79092D3908J10483g4882a6454j0919D0113
$$ -395647 174455 10859 92608 -392830 -213738 43908 154391 -74882 -16454 -27373 40113
18485a68639B90139A15548b40371R9390j7027j01923A8570a59287q4739J15268
$$ -168639 290139 115548 -240371 -140981 -158008 -259931 18570 -159287 -244026 -128758
18475a28758b3109k85546q6540i6547A99765h8304J3468m2885k32233b4533j42139
$$ -128758 -23109 -308655 -395195 -96547 199765 -88304 -74836 -117721 -349954 -24533 -166672
18464a66672j6311j33853A38687b55532A40652o8894B9183J03433a7740A17622
$$ -166672 -182983 -316836 138687 -255532 140652 71758 29183 132616 -17740 117622
18453C08216c28138J60563f3614j8359j85343c5840r0763k5565L7818A93487h7365
$$ 308216 -328138 -167575 -63614 -81973 -267316 -35840 -126603 -152168 -114350 193487 -87365
18441A00801c88385J64346Q1309J8616J9103a9288j64266K1289p3029C85053e6032
$$ 100801 -388385 -224039 -142730 -124114 -105011 -19288 -183554 -162265 -235294 385053 -56032
18429b48750C12848i8765j57145C507K4996b12930R5914C47291B2249L3303a58500
$$ -248750 312848 -98765 -255910 3507 28503 -212930 -117016 347291 22249 55552 -158500
18417B56449c65261b6819j63862b6890E4888e7359j70449E0127A2311e4102B2813
$$ 256449 -365261 -26819 -190681 -26890 54888 -57359 -227808 50127 12311 -54102 22813
18405A13278k8377C4863J69816N0219b36958a07618k43385J50132q4954C2165
$$ 113278 84901 34863 204679 254898 -236958 -107618 -351003 -200871 -285825 32165
18394h6907b5830A67648a95910C08605d58817a37586F3424e8555j43240F9880
$$ -86907 -25830 167648 -195910 308605 -458817 -137586 63424 -58555 -201795 69880
18383A16320J27413a11485D4622J19370b02972P8079r6489d222D07437I7052b86401
$$ 116320 243733 -111485 44622 163992 -202972 -124893 -221382 -4222 407437 97052 -286401
18371A39708c6881p6173j05064c0276l12073a13045A416a80077q8573j21620O4694
$$ 139708 -36881 -113054 -218118 -30276 -342349 -113045 1416 -180077 -268650 -390270 -325576
18360c25576A26883f7461A732a02286d5602c620k57834J23636q3118i5438b5026
$$ -325576 126883 -67461 1732 -102286 -45602 -3620 -261454 -137818 -220936 -95438 -25026
18348b97027c8508C14893o8161r7716c00614J45457A43180a20465b107A77094
$$ -297027 -38508 314893 246732 149016 -300614 -155157 143180 -120465 -2107 177094
18337c17865b2664A96760A2835h9842A76557g9399K9708D3126a57850D4363b92116
$$ -317865 -22664 196760 12835 -89842 176557 -79399 -49691 43126 -157850 44363 -292116
18325B19338c8690B28120a28046f2460A1499a15642J4515p6178o1097o3931J19625
$$ 219338 -38690 228120 -128046 -62460 11499 -115642 -101127 -177305 -238402 -302333 -182708
18314a82708f1948B05473o3405h0005i151j29018j99949B36329J15572A01893
$$ -182708 -61948 205473 142068 -80005 -9151 -138169 -338118 236329 351901 101893
18303A56399B4196K07258b4567A01566a21494A35137a3102j59648E8797M6097
$$ 156399 24196 231454 -24567 101566 -121494 135137 -13102 -172750 58797 104894
18293A04894b50642G154b65706D8863j6882O5595k1720c73473H4834h3428l2472
$$ 104894 -250642 7154 -265706 48863 31981 97576 75856 -373473 84834 -83428 -115900
18282a15900D11010C1657J31610n7002O3594c39365J60788a0566k26568q9592
$$ -115900 411010 31657 163267 106265 169859 -339365 -178577 -10566 -237134 -326726
18272c26726J47089k8905G134a81979c674C40175j10893j09623P993n5535J37812
$$ -326726 -179637 -208542 7134 -181979 -3674 340175 229282 119659 127652 72117 209929
18261B09929K0631b24007d3244k9361B2121a1124j80983h8037B12148c1756E3176
$$ 209929 230560 -224007 -43244 -72605 22121 -11124 -192107 -88037 212148 -31756 53176
18249d5408j3852p4594j1087M1756C13671c1725j5165k7421k29967A06264j2791
$$ -45408 -59260 -133854 -144941 -103185 313671 -31725 -46890 -74311 -304278 106264 93473
18238I3473l3920K16376b2634B95534j10076a44689p3485I4926J41840b20221
$$ 93473 59553 275929 -22634 295534 185458 -144689 -218174 94926 236766 -220221
18227F1561d1930J7685j4684B8412i8318l3331L8855d0250k4859B5542O9619C8779
$$ 61561 -41930 -24245 -38929 28412 -98318 -131649 -92794 -40250 -65109 25542 95161 38779
18214h1003j1698d3153k1234m0695f964j11705A04964n0565a70930N4810d7541
$$ -81003 -92701 -43153 -64387 -105082 -6964 -118669 104964 54399 -170930 -116120 -47541
18202B52048B1541a7148A42761a21355F6814a65911O2651j64421A39712a35303
$$ 252048 21541 -17148 142761 -121355 66814 -165911 -103260 -267681 139712 -135303
18191f1608A83760H3682c82834d6961k2879l50254c1541B28118a51994L4831k78418
$$ -61608 183760 83682 -382834 -46961 -69840 -420094 -31541 228118 -151994 -117163 -395581
18180c95581I7973a50352m80567A49693A8045i3407F3515N14865A89889r3530
$$ -395581 97973 -150352 -630919 149693 18045 -93407 63515 578380 189889 96359
18170I6359j2012b73656R3046D04401c5052I021f1082J257I5626b626k41343I4558
$$ 96359 84347 -273656 -180610 404401 -35052 9021 -61082 -59825 95626 -2626 -243969 94558
18157E9852g0434F1234J31072k6498c15552A9900d2759j40629A65070a29314A70632
$$ 59852 -70434 61234 192306 165808 -315552 19900 -42759 -183388 165070 -129314 170632
18145e1545A42424C7662a24830J8392M9738A20050k1721a17594j61017D8949b62072
$$ -51545 142424 37662 -124830 -106438 -56700 120050 98329 -117594 -278611 48949 -262072
18133A83294E3685i0509o9448j36461A43214o087F2552M3421c69271i8042F2131
$$ 183294 53685 -90509 -159957 -296418 143214 137127 62552 105973 -369271 -98042 62131
18121d28674E5777A3366a1031A55329C2309J95552M3873A16371a22365r9379E7634
$$ -428674 55777 13366 -11031 155329 32309 227861 271734 116371 -122365 -221744 57634
18109c48883J33410J2269B0531N3907k1457A4123J39470c33706A99000f1248a5846
$$ -348883 -215473 -203204 20531 74438 52981 14123 153593 -333706 199000 -61248 -15846
18097a05325A44588c93837a92417m5050F7300a05006B02602D725Q4016K8908l4839
$$ -105325 144588 -393837 -192417 -237467 67300 -105006 202602 4725 88741 117649 82810
18086H2810a6631A84857H7404a9594A52005N3738m4409J7923a91397E7162b05802
$$ 82810 -16631 184857 87404 -19594 152005 205743 161334 179257 -191397 57162 -205802
18074b1243A54547A8115K16710C0707N9851L791G305M175a12786D1435g5628a6101
$$ -21243 154547 18115 234825 30707 90558 94349 7305 11480 -112786 41435 -75628 -16101
18061a15940I3876b2194D9260b462A55504M8486b11068A00445A6433b1805k17903
$$ -115940 93876 -22194 49260 -2462 155504 203990 -211068 100445 16433 -21805 -239708
18050b39708B92524A14187d671A06013l7338C3471K3272h0869f579J227o1214
$$ -239708 292524 114187 -4671 106013 68675 33471 56743 -80869 -6579 -5352 -66566
18039f6566A4740g8021B56944a80136a2116A53198G1144h6572B59032a8901A6613
$$ -66566 14740 -78021 256944 -180136 -12116 153198 71144 -86572 259032 -18901 16613
18027d7988k17341J01876A72283a25798A26914c28987i8693k09202J16645f8889
$$ -47988 -265329 -163453 172283 -125798 126914 -328987 -98693 -307895 -191250 -68889
18016a21573A47590I873O8093a75033h723A425J02450c8301j93644a13214E5536
$$ -121573 147590 9873 77966 -175033 -8723 1425 103875 -38301 -231945 -113214 55536
18004B37270e6826F9515a68620b0589G3419a71069B49474I0612e3165k9904A52418
$$ 237270 -56826 69515 -168620 -20589 73419 -171069 249474 90612 -53165 -83069 152418
17992I2120b35661m9758I3216P3921b04448Q8083B50332G4436a28339B49051D6186
$$ 92120 -235661 -285419 93216 167137 -204448 -116365 250332 74436 -128339 249051 46186
17980B82910a78715G6647r484b10016c3632j178E4663a56987m3934F5066b92091
$$ 282910 -178715 76647 67163 -210016 -33632 -34810 54663 -156987 -200921 65066 -292091
17968A16365i4602I4709J22623b91965A96947a00134q071B12395o6251d3030F810
$$ 116365 -94602 94709 217332 -291965 196947 -100134 -108205 212395 146144 -43030 6810
17956A88882F2123Q8710a2214I053a60174J0489A48709a7980E54805H2919i8548
$$ 188882 62123 150833 -12214 9053 -160174 -149685 148709 -17980 554805 82919 -98548
17944a32379J401e0919j35539A20912J22114D5396c24438C5419L41494g0431l1203
$$ -132379 -130978 -50919 -186458 120912 243026 45396 -324438 35419 376913 -70431 -101634
17933a01634j34276G9213b41209d8607l0400G8126C7643J17429J50045d79A51180
$$ -101634 -235910 79213 -241209 -48607 -79007 78126 37643 155072 305117 -479 151180
17921c192A53630O8369e060B80312J27508E8445A8629i6845A18907i1564G1225
$$ -3192 153630 221999 -5060 280312 407820 58445 18629 -96845 118907 -91564 71225
17909G9392b56590H309g8456B4730a25046A47762g8598E4878m155d2020G6431
$$ 79392 -256590 8309 -78456 24730 -125046 147762 -78598 54878 50723 -42020 76431
17897H8474f3428A7570L27273c09895i2253A42315B2701K9203J99797b20141a3156
$$ 88474 -63428 17570 344843 -309895 -92253 142315 22701 51904 251701 -220141 -13156
17885d02028e5830A79215c403m9106j05735I5315l6280k6525n540j2019a74529
$$ -402028 -55830 179215 -3403 -52509 -158244 95315 59035 32510 26970 14951 -174529
17873c42061D337N8836e134p9140B53364a09136p4313A26545b09387Q4867L7827
$$ -342061 4337 63173 -5134 -84274 253364 -109136 -183449 126545 -209387 -124520 -86693
17862h6693A26130L51556B18153a4324B28273I4184J53338b59953D37364a66347
$$ -86693 126130 477686 218153 -14324 228273 94184 247522 -259953 437364 -166347
17851C9964P934P450B667d3024Q399B58171i2418c3197A86135N2502c1621C48572
$$ 39964 47898 55348 2667 -43024 -34625 258171 -92418 -33197 186135 238637 -31621 348572
17838A6614f5839B43631l2575A8765b9185l10180A98997J42222b68183D3317J68125
$$ 16614 -65839 243631 211056 18765 -29185 -339365 198997 341219 -268183 43317 211442
17827B11442m2220a96588h5917B48654l0564F8698a67645B03852a46144B67915
$$ 211442 169222 -196588 -85917 248654 218090 68698 -167645 203852 -146144 267915
17816E9392c43710a71406D0560K84697d2866q1084L6841E2707g1618G8427C3887
$$ 59392 -343710 -171406 40560 325257 -42866 -123950 -87109 52707 -71618 78427 33887
17804B0630a32368J4213A59624m8375f5422A91434A68Q1959C1233D211M7483P563
$$ 20630 -132368 -118155 159624 111249 -65422 191434 168 82127 31233 4211 51694 59257
17792E9257a68238O012B01157a9316j02902c1032G6325J10803g15j01830m4776
$$ 59257 -168238 -162226 201157 -19316 -122218 -31032 76325 187128 -715 -102545 -147321
17781a47321C1060d2510A7374b73144C33204a01729d5657K0542D3521m869i8147
$$ -147321 31060 -42510 17374 -273144 333204 -101729 -45657 -25115 43521 38652 -98147
17769A44428k9780L99700c90138a33708b5729l88056J35774Q1773D18098A0556
$$ 144428 114648 514348 -390138 -133708 -25729 -413785 -278011 -196238 418098 10556
17758C20822r4531a19625C63544H4794J25182q785j6879d3963C323b08349A60832
$$ 320822 226291 -119625 363544 84794 209976 201191 184312 -43963 3323 -208349 160832
17746A05148a55868B81709c0751C5232K11669A4550b89633A552K46099b9077j2495
$$ 105148 -155868 281709 -30751 35232 246901 14550 -289633 1552 247651 -29077 -41572
17735d1572C22903K04278d1412l8646C30361E3442N2629C7169J65696c419F0857
$$ -41572 322903 527181 -41412 -80058 330361 53442 106071 37169 202865 -3419 60857
17723b9349A91639a30840A64710h515A79064b82435E7054J98916i5622J5093J4306
$$ -29349 191639 -130840 164710 -8515 179064 -282435 57054 255970 -95622 -80529 -66223
17712f6223D69990A16947R4607D9744j9210J4062B366J55208b22992L5296D15123
$$ -66223 469990 116947 211554 49744 30534 44596 2366 157574 -222992 -187696 415123
17700A48821h4372A56122p1397K06604K2786f3958B3060a10019B27549q7225J95271
$$ 148821 -84372 156122 84725 291329 314115 -63958 23060 -110019 227549 140324 335595
17689C35595a06324I1691J23594H1656J41831k4221E3465P78715C09774f764F8946
$$ 335595 -106324 91691 215285 81656 223487 199266 53465 832180 309774 -6764 68946
17677b03131A53735a25949I8454J02359C0547g8721I7716M1109a80685A65108
$$ -203131 153735 -125949 98454 200813 30547 -78721 97716 138825 -180685 165108
17666A88559K84619A01185J00439I1362K36206c9301q1160l7562B15701a19820
$$ 188559 473178 101185 201624 91362 327568 -39301 -120461 -158023 215701 -119820
17655c28447C03903C1556K54412P0744A14671m1656l3659M18013G5146a78581
$$ -328447 303903 31556 285968 356712 114671 73015 39356 457369 75146 -178581
17644F7057M9385n460J34608b15300R8637M6465H6845R8666g067A63516I059J8616
$$ 67057 116442 110982 245590 -215300 -116663 -70198 86845 185511 -7067 163516 9059 27675
17632B7675K39018N4561j5211F5905J46243k8589N5071F9051f3907B27963a09250
$$ 27675 266693 321254 306043 65905 212148 183559 238630 69051 -63907 227963 -109250
17620A57631A4644i1964j4524B41556M82360B50170b2044A88556G0302a14688
$$ 157631 14644 -91964 -106488 241556 723916 250170 -22044 188556 70302 -114688
17609D89929b5012A6247L94356A59738c3271k32061A72735J79221J00862G5030
$$ 489929 -25012 16247 410603 159738 -33271 -265332 172735 351956 452818 75030
17598e7140A93305K96905A08892H789J73898a97511C92904j616n8868c9435B7655
$$ -57140 193305 490210 108892 8789 182687 -197511 392904 391288 332420 -39435 27655
17586c7351j39402H1882a58476A80773F4978r759J25796a34415H9393J00023A9363
$$ -37351 -176753 81882 -158476 180773 64978 55219 181015 -134415 89393 189416 19363
17574F4974Q1738l9566N7589o6288a41836O138N7006C1693J36844J09308p062
$$ 64974 146712 107146 164735 98447 -141836 -135698 -78692 31693 168537 277845 270783
17563B70783A17787L91348A60487J95273A49592M8092O3969m9932J83400A32851
$$ 270783 117787 509135 160487 355760 149592 197684 261653 211721 395121 132851
17552B97906f6059A16187e8081C17551G1278A2783a91240A18958J72129A05290
$$ 297906 -66059 116187 -58081 317551 71278 12783 -191240 118958 291087 105290
17541B4281N0356J3537L8901F2888J22151P5887Q3382e3772A13742J20751a18318
$$ 24281 74637 88174 127075 62888 185039 260926 344308 -53772 113742 234493 -118318
17529A63408L04328G1987J33330K94760B14522j0010M9472L0661l8047j2864e3684
$$ 163408 467736 71987 205317 500077 214522 204512 253984 284645 246598 233734 -53684
17517B42364b7803A90413l6662N00663k71635j74N7501K86139P2127k7105K92789
$$ 242364 -27803 190413 153751 654414 382779 382605 440106 726245 798372 771267 1064056
17506A064056P009E21438k53436M42044j19567H7844J86879L95745l00107K18397
$$ 1064056 1071065 521438 268002 710046 590479 87844 274723 670468 370361 588758
17496E88758q3184r8000M87251m1743P4655k14902k36589J40678C01181J31112
$$ 588758 505574 407574 894825 853082 927737 712835 476246 616924 301181 432293
17486D32293J77694k23259J27112j88830K07998B27349J61916l9885j47420f7120
$$ 432293 609987 386728 513840 325010 533008 227349 389265 349380 201960 -67120
17475I3683J98171p8903K30831k5658J58712j57464j58935F0267q40L29192j11028
$$ 93683 291854 212951 443782 418124 576836 419372 260437 60267 59427 388619 277591
17464B77591J8503A01553a15977B16767K9871K71755B48095Q6642A52860m9709
$$ 277591 296094 101553 -115977 216767 246638 518393 248095 334737 152860 103151
17454A03151L64585A75789J53958k3208K78868A96879Q6233J83169M4742A92747
$$ 103151 467736 175789 329747 306539 585407 196879 283112 466281 511023 192747
17443A55660k6428J61295J08184n8912r1539L54089A56762K46756j22746j33093
$$ 155660 129232 290527 398711 339799 248260 602349 156762 403518 280772 147679
17433A47679K43485j03589J62261J06598j76193q5219K68318j69919M4367J8103
$$ 147679 391164 287575 449836 556434 380241 295022 563340 393421 437788 455891
17423D55891j48398J35000B14778J69852J15348k20813K02645B16336N13960B79795
$$ 455891 307493 442493 214778 384630 499978 279165 481810 216336 730296 279795
17412D86912J16464j19191j81188J18402j17454A42802K14836q3346L38971C02783
$$ 486912 603376 484185 302997 421399 303945 142802 357638 274292 613263 302783
17401F61747B12791L06236O1477K71099j62758C02478q462J51429J81047q0195
$$ 661747 212791 519027 580504 851603 688845 302478 294016 445445 626492 546297
17391E46297k06901a4395A8082Q657K91180J09648o2025A08376D5072K51641A19126
$$ 546297 339396 -14395 18082 26739 317919 427567 365542 108376 45072 296713 119126
17379C88249o7580K41684k57966O4238A40113L14787L4524r2470r9826g3306B09150
$$ 388249 320669 562353 304387 368625 140113 454900 489424 396954 297128 -73306 209150
17367A81085m8674J05928m3592J30370A3673L38628g2229C44034J7572A08160
$$ 181085 132411 238339 194747 325117 13673 352301 -72229 344034 361606 108160
17356F35356k23706A8851L72824J881j09439A06868K72474A85234b849C56571
$$ 635356 411650 18851 391675 393556 284117 106868 379342 185234 -2849 356571
17345C79189l9869A68015m3517L3116J28022n1467K79175d0914D02663A16658
$$ 379189 339320 168015 124498 157614 285636 234169 513344 -40914 402663 116658
17334C4964N14352k65224N9330E7157K13280L70687B98765R2014m3606A9798K74471
$$ 34964 549316 284092 343422 57157 270437 641124 298765 390779 347173 19798 294269
17323B94269A21810J1760K10764q0045n6665p9388K31735F3419J8179J02498j1286
$$ 294269 121810 133570 344334 264289 207624 128236 359971 63419 81598 184096 172810
17312A72810N2603k959G7176M12152E4576M6625L02347r8495L21273A96350A9844
$$ 172810 225413 222454 77176 489328 54576 101201 403548 305053 626326 196350 19844
17300C34267K12392k13472A51183L18908r3848r163J59563A64570a437C98324
$$ 334267 546659 333187 151183 470091 376243 367080 526643 164570 -1437 398324
17289C76465A23938O4391L88936B61499j09289J3359C744K89318J12060A43585
$$ 376465 123938 188329 577265 261499 152210 165569 3744 293062 405122 143585
17278D32493l7488J6231I6068J31963J33493j62946J11387j40536L88004j99008
$$ 432493 395005 411236 96068 228031 361524 198578 309965 169429 557433 358425
17268C58425D1126M39464A02872K08148j7397G0614K92984j80613J43650L1741
$$ 358425 41126 480590 102872 311020 293623 70614 363598 182985 326635 358376
17258C58376K11829j00211l9393k7642j09644j32628M0090E9744L42467A42507
$$ 358376 570205 469994 430601 402959 293315 160687 200777 59744 402211 142507
17247D90164A16381n4386k1561J73408L38670B49315J31796j12283A14770K56624
$$ 490164 116381 61995 40434 213842 552512 249315 381111 268828 114770 371394
17237C71394n7269K83633k63403j59301K3489M39140B66810K09034j27595H3249
$$ 371394 314125 597758 334355 175054 198543 637683 266810 475844 348249 83249
17226C06180O8207A40129J00578M39059k77492j66753J05416J20186r1419A70312
$$ 306180 374387 140129 240707 679766 402274 235521 340937 461123 369704 170312
17215H2579K30507q2586P5001A33943L78635j10175j56025P6036n4641J74961
$$ 82579 313086 230500 305501 133943 512578 402403 246378 322414 267773 442734
17205D42734j98203Q8733o4458L40415k10278Q7690k8494l010k7330A78035p0505
$$ 442734 244531 333264 268806 609221 398943 486633 458139 455129 427799 178035 107530
17194A07530J38889J66701L9746l447A65911N30925q2696k74599J32714j8480
$$ 107530 246419 413120 452866 449419 165911 696836 614140 339541 472255 453775
17184D53775k10470R2720J1138r1729n2886L23433o6417L8917j22164j18941n7316
$$ 453775 243305 336025 347163 255434 202548 525981 459564 498481 376317 257376 200060
17173B00060K11884n5527Q0611j01466m7491K77379j1425j82763O1686j47855
$$ 200060 411944 356417 437028 335562 288071 565450 554025 371262 432948 285093
17163B85093M21361l47105O3782N0769n989p2462K68553k67944J22022J907B09572
$$ 285093 706454 359349 423131 473900 467911 395449 664002 396058 518080 519987 209572
17151E12607j09029J68669n3419J29816B29279K14055N5138l8547J01259A84206
$$ 512607 403578 572247 518828 648644 229279 443334 498472 459925 561184 184206
17140B17988L96317n992q6322N7165K8110J00271R921k61683n4192N5961j12593
$$ 217988 614305 608313 521991 579156 607266 707537 717458 455775 401583 457544 344951
17129C44951K25147k26222L63636A58941Q31154j79962k08476k48160K79444J51660
$$ 344951 570098 343876 707512 158941 990095 810133 601657 353497 632941 784601
17119G84601l70900K81338k69496P3093K83319B95711M64040C65011K9999O83228
$$ 784601 413701 695039 425543 498636 781955 295711 759751 365011 395010 1078238
17109A078238D79888J71024r6563j69673M47647j30964C23577N40198l67323j38799
$$ 1078238 479888 650912 554349 384676 832323 701359 323577 863775 496452 357653
17099C57653r2697K78346K53432Q9400j24266l26417K64363k91097J95690k9755
$$ 357653 264956 543302 796734 886134 761868 435451 699814 408717 604407 574652
17089E74652J78028r0294J28433k02224L11950r6067M5476k67512j21856R1608
$$ 574652 752680 662386 790819 588595 900545 804478 849954 582442 460586 552194
17079E52194K28448k11119j70463L92357J10948k41464P6369q9901J08753Q7266
$$ 552194 780642 569523 399060 791417 902365 660901 737270 647369 756122 843388
17069H43388r0010p955R2723r6213j91655J51838k28970K37621k17418K21959
$$ 843388 753378 745423 838146 741933 550278 702116 473146 710767 493349 715308
17059G15308j92824N34548m13182K74241k59604K16918m9753j42320M06205l21405
$$ 715308 522484 1057032 643850 918091 658487 875405 825652 683332 1089537 768132
17049G68132l18622J13318K52341j6993K3650J30996k2445o6649J9505J4784J08128
$$ 768132 449510 562828 815169 798176 821826 952822 930377 863728 883233 898017 1006145
17038A006145M8507D14707K67590R6669L363N620N926L22296m44313O7858M03171
$$ 1006145 1054652 414707 682297 778966 782329 787949 793875 1116171 671858 739716 1142887
17027A142887k01217J8967m28559M74019j95704n6315j26835K96530J8801O3455
$$ 1142887 941670 960637 532078 1006097 810393 754078 627243 923773 942574 1006029
17017A006029r1956R0021m0238K92324o1994l46380K67847J13226j61555k45432
$$ 1006029 914073 1004094 963856 1256180 1194186 847806 1115653 1228879 1067324 821892
17007H21892L17155k87621L2188P5699L62945k8619j69775J31015q8893j54328
$$ 821892 1139047 851426 883614 959313 1322258 1293639 1123864 1254879 1165986 1011658
16997A011658L9076K42604k49174K64764P7138l47211N5540K09625m7584l46255
$$ 1011658 1050734 1293338 1044164 1308928 1386066 1038855 1094395 1304020 1256436 910181
16987I10181L34202j20352j27063K01218q876n3476r7366J28040J25007N6934
$$ 910181 1244383 1124031 996968 1198186 1189310 1135834 1038468 1166508 1291515 1348449
16977A348449k94072J73597o8377J51823k37124O09083p55384O08756n48252L87746
$$ 1348449 1054377 1227974 1159597 1311420 1074296 1683379 927995 1536751 988499 1376245
16967A376245j28663L61923J1987k88361J17086j18323j02592J48033l66810L42437
$$ 1376245 1247582 1609505 1621492 1333131 1450217 1331894 1229302 1377335 1010525 1352962
16957A352962j03996M09682j66202n0043J55909J35980j20727J37330k81680J99460
$$ 1352962 1248966 1658648 1492446 1442403 1598312 1734292 1613565 1750895 1469215 1668675
16947A668675j90328R9889J77536l8215k62920K78455m46908M48327j57092J74480
$$ 1668675 1478347 1578236 1755772 1717557 1454637 1733092 1286184 1734511 1577419 1751899
16937A751899j91920K90412l30270J60771L56122j37326M6314l25722M33605K49810
$$ 1751899 1559979 1850391 1520121 1680892 2037014 1899688 1946002 1620280 2053885 2303695
16927B303695J95479p88276L50730J43559k80460m7046K24828l1093K99998k36263
$$ 2303695 2499174 1710898 2061628 2205187 1924727 1877681 2102509 2071416 2371414 2135151
16917B135151N8527j33023L30148l22443J12974k7560K80965l95392N1777K89142
$$ 2135151 2193678 2060655 2390803 2068360 2181334 2153774 2434739 2039347 2091124 2380266
16907B380266k28958J66797N9782R0282j06193L88598k09116j77142K13215Q604
$$ 2380266 2151308 2318105 2377887 2468169 2361976 2750574 2541458 2364316 2577531 2586135
16897B586135j10123k88582L69286J66854m8986r9595J60580j33338M328j11850
$$ 2586135 2476012 2187430 2556716 2723570 2674584 2574989 2735569 2602231 2606559 2494709
16887B494709K84802J12306n9325Q6187K83916l8948j39847N06575j30106l12395
$$ 2494709 2779511 2891817 2832492 2918679 3202595 3163647 3023800 3530375 3400269 3087874
16877C087874l09943M38992R743k91783L96796k40323L88807J08284n09667L09126
$$ 3087874 2777931 3216923 3226666 2934883 3331679 3091356 3480163 3588447 3078780 3387906
16867C387906l9913J50195L68124J88882j31152j60712J23544J27753P657M3418
$$ 3387906 3347993 3498188 3866312 4055194 3924042 3763330 3886874 4014627 4022284 4065702
16857D065702j29135M592K28165o3290L00188l63458L06743m8833L29745q4178
$$ 4065702 3936567 3941159 4169324 4106034 4406222 4042764 4349507 4300674 4630419 4546241
16847D546241K11759k40822L62856k48161L61410J2565R2345k81316J42884K20424
$$ 4546241 4758000 4517178 4880034 4631873 4993283 5005848 5098193 4816877 4959761 5180185
16837E180185j28719K39023J98100l9487J5534K35231j25718K73459l67784O93019
$$ 5180185 5051466 5290489 5488589 5449102 5464636 5699867 5574149 5847608 5479824 6172843
16827F172843M6149j33691K01123P5381L37886L50398m32134K58356Q2195r8117
$$ 6172843 6218992 6085301 6286424 6361805 6699691 7050089 6617955 6876311 6958506 6860389
16817F860389J22192L22558R8020M61675j874J15097p6503L94657q1292K05025
$$ 6860389 6982581 7305139 7403159 7864834 7862960 7978057 7901554 8296211 8214919 8419944
16807H419944J22012J49039P15950m31020J39026N29701j16564J76314K118K67744
$$ 8419944 8541956 8690995 9406945 8975925 9114951 9644652 9528088 9704402 9706520 9974264
16797I974264M46012J74385M97303j13375L73283K4230M78627L69347P7580L28714
$$ 9974264 10420276 10594661 11091964 10978589 11351872 11376102 11854729 12224076 12301656 12630370
16787A2630370Q14832l83790P79552q7041O00309N56659N1492r1179M74260P05559
$$ 12630370 13445202 13061412 13840964 13753923 14354232 14910891 14962383 14871204 15345464 16051023
16777A6051023k5067L77584Q93959L03926M99037N33213M88485J59778P27871
$$ 16051023 16025956 16403540 17297499 17601425 18100462 18633675 19122160 19281938 20009809
16768B0009809M89636R10302L44013M53511R45875N96789O89994Q04265P34759
$$ 20009809 20499445 21409747 21753760 22207271 23153146 23749935 24439929 25244194 25978953
16759B5978953R53725O84954R51184P63685R25997J391182J022771R17008J046239
$$ 25978953 26932678 27617632 28568816 29332501 30258498 31649680 32672451 33589459 34635698
16750C4635698J487821R37996J392279J150968J599344J524053J531506J630983
$$ 34635698 36123519 37061515 38453794 39604762 41204106 42728159 44259665 45890648
16742D5890648J586273J887192J965386J933533J894685K275752K042138K488021
$$ 45890648 47476921 49364113 51329499 53263032 55157717 57433469 59475607 61963628
16734F1963628J867852L208878K017082L207174K547964K869703L354735K877701
$$ 61963628 63831480 67040358 69057440 72264614 74812578 77682281 81037016 83914717
16726H3914717K886852L174809L033377L492311L106074L385399L165839L640735
$$ 83914717 86801569 89976378 93009755 96502066 99608140 102993539 106159378 109800113
16718A09800113K806246L333114L115842K404550K390067K543259K565361J188332
$$ 109800113 112606359 115939473 119055315 121459865 123849932 126393191 128958552 130146884
16710A30146884J473273J146421P97692J37716M55382p92244q54658j033517j433589
$$ 130146884 131620157 132766578 133564270 133701986 134157368 133365124 132510466 131476949 130043360
16701A30043360j741578k206057k329254k795243k755546k916106l175033l039736
$$ 130043360 128301782 126095725 123766471 120971228 118215682 115299576 112124543 109084807
16693A09084807l035186l456859l557323l359718l001865l401871l472608k925030
$$ 109084807 106049621 102592762 99035439 95675721 92673856 89271985 85799377 82874347
16685H2874347l324467l252273k571533k935327k700394k845064k378483k456238
$$ 82874347 79549880 76297607 73726074 70790747 68090353 65245289 62866806 60410568
16677F0410568k231615k454076k094985k108878j938285j707892j755597j528042
$$ 60410568 58178953 55724877 53629892 51521014 49582729 47874837 46119240 44591198
16669D4591198j611260j725849j216598j755707j468388j173952r92354j463808
$$ 44591198 42979938 41254089 40037491 38281784 36813396 35639444 34647090 33183282
16661C3183282j170299r77858j171824j111854o08400j080022o19515j105296
$$ 33183282 32012983 31035125 29863301 28751447 28143047 27063025 26443510 25338214
16653B5338214n71765r10833r65838n01253q09641k80909n91259r96430k20339
$$ 25338214 24766449 23855616 22889778 22388525 21578884 21297975 20706716 19710286 19489947
16644A9489947p93422k42818p71102m17217o11224l02985o03807l11207o48717
$$ 19489947 18696525 18453707 17682605 17265388 16654164 16351179 15747372 15436165 14787448
16635A4787448k13558m09568M7923n96900k94699k9333m93589j98842n01796k1982
$$ 14787448 14573890 14164322 14212245 13615345 13320646 13291313 12797724 12598882 12097086 12075104
16625A2075104n61167m86628j58288L19841j93935p86639j58000r7764j19656
$$ 12075104 11513937 11027309 10869021 11188862 10994927 10208288 10050288 9952524 9832868
16616I832868q8568j87694l77756l14034l26041q4857m39073K58239l37339l02187
$$ 9832868 9744300 9556606 9178850 8864816 8538775 8453918 8014845 8273084 7935745 7633558
16606G633558J49626j14946K3390n67165Q3609k3276n48503L39024m72064o0340
$$ 7633558 7783184 7668238 7691628 7124463 7208072 7184796 6636293 6975317 6503253 6442913
16596F442913q4096J48998k67439k41043k50243P6905l1689k40051m3948r2061
$$ 6442913 6358817 6507815 6240376 5999333 5749090 5825995 5794306 5554255 5510307 5418246
16586E418246l45272K95976l35583J20637p7472j31599k48046M40382j67210l07174
$$ 5418246 5072974 5368950 5033367 5154004 5076532 4944933 4696887 5137269 4970059 4662885
16576D662885o9821j72047j12087J14988l66379L71728j0370l11218J99796j94688
$$ 4662885 4593064 4421017 4308930 4423918 4057539 4429267 4418897 4107679 4307475 4112787
16566D112787k20192l1579J83514j22113j22838j73606l17191M23989l04877L0304
$$ 4112787 3892595 3861016 4044530 3922417 3799579 3625973 3308782 3732771 3427894 3458198
16556C458198J86077l24359J38525j23821k59774o0750J16232k23067J63194l06469
$$ 3458198 3644275 3319916 3458441 3334620 3074846 3014096 3130328 2907261 3070455 2763986
16546B763986J58374Q2018N4673j9204j57594k51626J61412q5089m3798R6203
$$ 2763986 2922360 3004378 3059051 3039847 2882253 2630627 2792039 2706950 2663152 2759355
16536B759355l70143N7154j05415n1334j78864P65824m02730p4996J0673L8932
$$ 2759355 2389212 2446366 2340951 2289617 2110753 2876577 2473847 2398851 2409524 2448456
16526B448456p3744q8458K93333n31459P02576m11469o8972k35259K42321q6817
$$ 2448456 2374712 2286254 2579587 2048128 2750704 2339235 2270263 2035004 2277325 2190508
16516B190508j39208K2414l5291j70430N0618K61726J59272l75885R2011J21758
$$ 2190508 2051300 2073714 2038423 1867993 1918611 2180337 2339609 1963724 2055735 2177493
16506B177493n43063J45599N0697J62099k78456L12192n57471J64218L1572J13464
$$ 2177493 1634430 1780029 1830726 1992825 1714369 2026561 1469090 1633308 1664880 1778344
16496A778344j36404J17753k67030K02121K74951j46332k05747l2620L8069j00412
$$ 1778344 1641940 1759693 1492663 1694784 1969735 1823403 1617656 1585036 1623105 1522693
16486A522693K55132l46997K54959j99294k08601M07073k19136K79516l14845
$$ 1522693 1777825 1430828 1685787 1486493 1277892 1684965 1465829 1745345 1430500
16477A430500j61518q3284K17504J87047k20899k65030L68819k81796K13505L1389
$$ 1430500 1268982 1185698 1403202 1590249 1369350 1104320 1473139 1191343 1404848 1436237
16467A436237j76602R9478J97601l52115K01846k07312J44756j95407J21590j19596
$$ 1436237 1259635 1359113 1556714 1204599 1406445 1199133 1343889 1148482 1270072 1150476
16457A150476M0854k27991R4931J1475J38061o6229j75574L73552k07318P5837
$$ 1150476 1191330 963339 1058270 1069745 1207806 1141577 966003 1339555 1132237 1208074
16447A208074K121o7925L43155l56595j61176l2251j37337L71979l88767L63086
$$ 1208074 1210195 1142270 1485425 1128830 967654 935403 798066 1170045 781278 1144364
16437A144364L31824o41338K15081j57655j10488K20017k04318L28568K163n8299
$$ 1144364 1476188 834850 1049931 892276 781788 1001805 797487 1126055 1128218 1069919
16427A069919m18721K9681L71218R9326j26142o6892o2530J25413J66353l69568
$$ 1069919 651198 680879 1052097 1151423 1025281 958389 895859 1021272 1187625 818057
16417H18057J04557j87375K01377j18609R9411m31980M58759l64052M47288m42151
$$ 818057 922614 735239 936616 818007 917418 485438 944197 580145 1027433 585282
16407E85282K57205m09549J79672J90486C33047M43553M9425j21086m4629J60416
$$ 585282 842487 432938 612610 803096 333047 776600 826025 704939 660310 820726
16397H20726l47015N33031D54581J00613L05264j12841k27203N8166J86028j44331
$$ 820726 473711 1006742 454581 555194 860458 747617 520414 578580 764608 620277
16387F20277N1325N8242O4672K03109m83253J03526M8885m4566R7866k10504k40007
$$ 620277 671602 729844 794516 997625 514372 617898 666783 622217 720083 509579 269572
16376B69572M74310l51043l6533P5397L09111o6074J23857C24627N33224j99942
$$ 269572 743882 392839 356306 431703 740814 674740 798597 324627 857851 657909
16366F57909B17044Q8362K64533l027m8762O6948j9443r8773j935B17545K81465
$$ 657909 217044 305406 569939 566912 518150 585098 565655 466882 464947 217545 499010
16355D99010k0046J03344j32629J23041m2654k19981J94124j28795P2562k16185
$$ 499010 478964 582308 449679 572720 530066 310085 504209 375414 447976 231791
16345B31791J11714K44813Q217j57965O726K47351M2953A79150p0964K88168K13121
$$ 231791 343505 588318 596535 438570 445296 692647 735600 179150 108186 396354 609475
16334F09475k53830J77677k6950M9877B15397K88100J30359j40848k27553l7298
$$ 609475 355645 533322 506372 556249 215397 503497 633856 493008 265455 228157
16324B28157J22298K62493j73271J5093P6568O9562k06941j05223K36495F6547
$$ 228157 350455 612948 439677 454770 531338 600900 393959 288736 525231 66547
16313A69600K22577P9088j62207n1195K98852B20103J40451n8625k6976J13917
$$ 169600 392177 471265 309058 257863 556715 220103 360554 301929 274953 388870
16303C88870J5255A59374K46886K68237A55893O8608J90015L5303L9965k10119
$$ 388870 404125 159374 406260 674497 155893 224501 414516 449819 489784 279665
16293B79665K17795A34288L27950o9932A80377O4770N6427h043C25454K31549
$$ 279665 497460 134288 462238 392306 180377 245147 301574 -8043 325454 557003
16283E57003j11964K12555H9426K77652J33443B1372N37239j61964p3562A58967
$$ 557003 445039 657594 89426 367078 500521 21372 558611 396647 323085 158967
16272f3135C46392A3590J51078K41299j26324L33380k79884K56745k38972j9360
$$ -63135 346392 13590 164668 405967 279643 613023 333139 589884 350912 331552
16262C31552D0683a37509H5744K34373p1749J82277E0163J26651k2026O5536E4888
$$ 331552 40683 -137509 85744 320117 248368 430645 50163 176814 154788 220324 54888
16250B85408J40915K8568E8176L14960O3594D4802P9978J64964k5416E8006K84176
$$ 285408 426323 454891 58176 373136 436730 44802 124780 289744 264328 58006 342182
16239C42182p5022L38533C01745j367A37819L69833f5184A9351J59004q8538m1020
$$ 342182 267160 605693 301745 300378 137819 507652 -65184 19351 178355 89817 48797
16228D8797A3340L9659K34901n4894P9557E2140R0872J75231f1670B59001G7245
$$ 48797 13340 52999 287900 233006 312563 52140 143012 318243 -61670 259001 77245
16216A10290b02504I2275K74748A20953L5007L38947A55768a5745B82183J69361
$$ 110290 -202504 92275 367023 120953 155960 494907 155768 -15745 282183 451544
16206D51544B13650L2467K77594B36499n5341Q4659A04135e1986j00080O1584
$$ 451544 213650 246117 523711 236499 181158 265817 104135 -51986 -152066 -90482
16196i0482l26961A55855J21179A08094J45349j09112K09324K0358K05921G6079
$$ -90482 -417443 155855 277034 108094 253443 144331 353655 374013 579934 76079
16185a48177A36759J03128N8103L0821j04275d6346r9636A26458F0055K74838
$$ -148177 136759 239887 297990 328811 224536 -46346 -145982 126458 60055 334893
16175C34893e7963c853D84123A52077J10641d2578C6103J80363q7214P0497f2803
$$ 334893 -57963 -3853 484123 152077 262718 -42578 36103 216466 129252 199749 -62803
16163E6799J37284k6040p9086J0528b2639C18203B3417J27302i89q2199B86865
$$ 56799 194083 168043 88957 99485 -22639 318203 23417 150719 -989 -83188 286865
16151a31688B41916J63711A25504J04012d6201E59585f7238D8586c77293a85088
$$ -131688 241916 405627 125504 229516 -46201 559585 -67238 48586 -377293 -185088
16140B09927a03956G209J13446K44192j65958p7383K0278L6607C5129K11487p2736
$$ 209927 -103956 7209 120655 364847 198889 121506 141784 178391 35129 246616 173880
16129A73880J9686h8253E64048c4611A33159a41939b2555p7372C2514b3220D44919
$$ 173880 193566 -88253 564048 -34611 133159 -141939 -22555 -99927 32514 -23220 444919
16117A85034a73631B59567a88424P9077B20321D6429a15060D21422a67575q7224
$$ 185034 -173631 259567 -188424 -109347 220321 46429 -115060 421422 -167575 -254799
16107b54799C00639E3943L48198a34332f5816A33544a05725A95207K05833L8139
$$ -254799 300639 53943 402141 -134332 -65816 133544 -105725 195207 401040 439179
16097D39179j61886A5953L18131D4303a64737D7370e7895M618C92959j24901a7327
$$ 439179 277293 15953 334084 44303 -164737 47370 -57895 -53277 392959 268058 -17327
16085g7851j82481B86810a86958F9505L84491A61130B8177a44080j30660C33221
$$ -77851 -260332 286810 -186958 69505 453996 161130 28177 -144080 -274740 333221
16074f9511B50742j20695a31774F5319J02494b7791A4777c92537G9104G509N7759
$$ -69511 250742 130047 -131774 65319 167813 -27791 14777 -392537 79104 7509 65268
16063F5268J22830q2871a38127C67755A39588L0747K63584j92533m5922A6403
$$ 65268 188098 105227 -138127 367755 139588 170335 433919 241386 195464 16403
16052b16575D8364c19693J36753A48421h5052j8665A33171h5622r1276L54q60
$$ -216575 48364 -319693 -182940 148421 -85052 -103717 133171 -85622 -176898 -176544 -177404
16041a77404H0145L74494A98642P9557j9186G998b01031a640D02380c8230D3694
$$ -177404 80145 454639 198642 278199 259013 7998 -201031 -1640 402380 -38230 43694
16029b7203A90525c4959D0523J20509a84146q0295a16859b5169B19728b47980
$$ -27203 190525 -34959 40523 161032 -184146 -264441 -116859 -25169 219728 -247980
16018I65N2159f5107H0050a27671j54328e6758j11298A27500a35388B72184A00110
$$ 965 53124 -65107 80050 -127671 -281999 -56758 -168056 127500 -135388 272184 100110
16006A70744F2119J61620j06869a93339B34288M4918j37578J7990o6747b2329
$$ 170744 62119 223739 116870 -193339 234288 279206 141628 159618 92871 -22329
15995a49737D1439J14740a73130n389l3935K5233B09319E5830L7852N0610a22147
$$ -149737 41439 156179 -173130 -178519 -212454 -187221 209319 55830 93682 144292 -122147
15983A4661a13429b2153o6145A32415b71028D4535P0517e2172A11067e8409n384
$$ 14661 -113429 -22153 -88298 132415 -271028 44535 115052 -52172 111067 -58409 -63793
15972f3793E62862M8668j06215L72219k36992Q6621k72669J07372j73685H1583
$$ -63793 562862 611530 505315 877534 640542 727163 454494 561866 388181 81583
15961B24772O0165a92805B79571a01719B77579d4473B6458a56241C17744i4451
$$ 224772 284937 -192805 279571 -101719 277579 -44473 26458 -156241 317744 -94451
15950I5825J98144r6175a37197B22508n5226J2071m9160C6798a16105j79906c4449
$$ 95825 293969 197794 -137197 222508 167282 179353 130193 36798 -116105 -296011 -34449
15938a8307j41100B44072p2345l4740h2583B27955F1873c0144j23616B27050F329
$$ -18307 -159407 244072 171727 136987 -82583 227955 61873 -30144 -153760 227050 6329
15926b39142A40453A7858c8351l51646J93700A57162P2892a80907d6411l01765
$$ -239142 140453 17858 -38351 -389997 -196297 157162 230054 -180907 -46411 -348176
15916c48176J42900M532j00693B11429D5922c31649b4775m3829q5028f3521H3704
$$ -348176 -205276 -200744 -301437 211429 45922 -331649 -24775 -68604 -153632 -63521 83704
15904b17263P7576A3698d7092A37471a85332L6515E4330d12254B1244b1346l54507
$$ -217263 -139687 13698 -47092 137471 -185332 -148817 54330 -412254 21244 -21346 -375853
15893c75853a66216a970r1635m0376j9725A71363b25721A5315L83400G1323N7619
$$ -375853 -166216 -1970 -93605 -133981 -153706 171363 -225721 15315 398715 71323 128942
15882A28942K8378a84477A91378b5368A69963p9545A4268b47618B28706a54836
$$ 128942 157320 -184477 191378 -25368 169963 90418 14268 -247618 228706 -154836
15871c0479j24747p2160i8172C79036C0220a76560p882I1368d3407k1453n9364
$$ -30479 -155226 -227386 -98172 379036 30220 -176560 -184442 91368 -43407 -64860 -124224
15860a24224C77865B0881a85226A15545g7518n576a98j41425D4631M6026i725
$$ -124224 377865 20881 -185226 115545 -77518 -83094 -198 -141623 44631 90657 -9725
15848B15543c56982f7041A18072D1689d486C11376D2588b6463n9079j41568B54455
$$ 215543 -356982 -67041 118072 41689 -4486 311376 42588 -26463 -85542 -227110 254455
15836c4890k81813A93776I013h0667C0633a34505J3225A86147F354b39901l4664
$$ -34890 -316703 193776 9013 -80667 30633 -134505 -121280 186147 6354 -239901 -274565
15825b74565K2658f0364A12279C2025b21693g3912C94185j14199i5390L1917e906
$$ -274565 -251907 -60364 112279 32025 -221693 -73912 394185 279986 -95390 -63473 -5906
15813b09900B64876F7139b11374A35761i3679l5143m7013l4411F1128Q9785b98553
$$ -209900 264876 67139 -211374 135761 -93679 -128822 -175835 -210246 61128 150913 -298553
15801a53082j9195Q5839C7828K27780o0010a06866B66821d77603D7329h2155A17543
$$ -153082 -172277 -86438 37828 265608 205598 -106866 266821 -477603 47329 -82155 117543
15789A94483I3145b30194F0175a04682N2267a9165B12575G8039k2448g6836L4116
$$ 194483 93145 -230194 60175 -104682 -52415 -19165 212575 78039 55591 -76836 -42720
15778d2720m8632j88499h6938j20639D0891b60943F058b72970C34486a23703I7090
$$ -42720 -91352 -279851 -86938 -207577 40891 -260943 6058 -272970 334486 -123703 97090
15766b97224A79536B9553a32917A64897e9122q3186d8859J70I6946Q0197k6608
$$ -297224 179536 29553 -132917 164897 -59122 -142308 -48859 -48689 96946 177143 150535
15755A50535c4863A20303k673a542A89558f0584q9805l3923C861J2869K92018
$$ 150535 -34863 120303 117630 -1542 189558 -60584 -150389 -184312 3861 16730 308748
15744C08748p1194C6622L2061J27505R9521h6697H3996d1162a7479j11390B26917
$$ 308748 237554 36622 68683 196188 295709 -86697 83996 -41162 -17479 -128869 226917
15732a53789c4803A19746a27659p5707k5293A7923b04039H1266h59j28213f2352
$$ -153789 -34803 119746 -127659 -203366 -228659 17923 -204039 81266 -859 -129072 -62352
15720b04536p4081a16085j4350A15778f100n3866I9768k5401c2467k14878e025
$$ -204536 -278617 -116085 -130435 115778 -6100 -59966 99768 74367 -32467 -247345 -5025
15708b65679L9752A13829h2964b9523H2864a71559F6041e0017j47858a8266k601
$$ -265679 -225927 113829 -82964 -29523 82864 -171559 66041 -50017 -197875 -18266 -20867
15697b0867j20238j06300G9335b10346B12793m3985o0512A8225a77659I0731b53927
$$ -20867 -141105 -247405 79335 -210346 212793 168808 108296 18225 -177659 90731 -253927
15685D5446a48165o0389A1088f4328B2492a10703A39696a52382a9089p4361c3105
$$ 45446 -148165 -208554 11088 -64328 22492 -110703 139696 -152382 -19089 -93450 -33105
15673A18768C916K22251i7208F1291A2946b26322A5111a78172q2454P5858O0932
$$ 118768 3916 226167 -97208 61291 12946 -226322 15111 -178172 -260626 -184768 -123836
15662a23836N3507l09296a55332b8823n3079c0900r3320h26H4926J14881k5290
$$ -123836 -70329 -379625 -155332 -28823 -81902 -30900 -124220 -826 84926 199807 174517
15651A74517B7578r710L53135c29029h8089q5653a1815A27750c33789a35134N4296
$$ 174517 27578 17868 371003 -329029 -88089 -173742 -11815 127750 -333789 -135134 -80838
15640h0838A32491k8891b35144C42894a7111N928l73492I7210c87727B2739a43693
$$ -80838 132491 103600 -235144 342894 -17111 -11183 -384675 97210 -387727 22739 -143693
15628A7738R6926C584a84769F9465B4652b57918B3382b21860a08408q1898k9489
$$ 17738 114664 3584 -184769 69465 24652 -257918 23382 -221860 -108408 -190306 -219795
15617b19795d5674A04171a13256B39555m8239p0310n2258B3641a62695A53885
$$ -219795 -45674 104171 -113256 239555 191316 121006 68748 23641 -162695 153885
15606a20177B28700b73662i7393B09535p3995c47019C5014P009J69426f2092E103
$$ -120177 228700 -273662 -97393 209535 135540 -347019 35014 42023 211449 -62092 5103
15594A53557g5727o7375m39F2790J37112f1799j65901b1751j5758D1095P446r658
$$ 153557 -75727 -143102 -143541 62790 199902 -61799 -227700 -21751 -37509 41095 48541 38883
15582C8883P4779A6564a73641P4171K6226j02079A78229Q007h1721A55615E6166
$$ 38883 113662 16564 -173641 -99470 -73244 -175323 178229 186236 -81721 155615 56166
15570F9960N2242j014J61142H6483E305K0081a6471k91647i4424m3840k2384O1149
$$ 69960 122202 121188 282330 86483 5305 25386 -16471 -308118 -94424 -138264 -160648 -99499
15558i9499q6230l4770h586j82336Q211j16609A31342a19074G2743h1350k8212
$$ -99499 -185729 -220499 -8586 -190922 -182711 -299320 131342 -119074 72743 -81350 -109562
15547a09562l9762E119h2446A70716b1954A41088o9321J95611i7331j308G6672
$$ -109562 -149324 5119 -82446 170716 -21954 141088 71767 267378 -97331 -98639 76672
15535C81327A90595K41114A32395O1651r4423b25641l0450M5785B60267g4636
$$ 381327 190595 431709 132395 194046 99623 -225641 -256091 -210306 260267 -74636
15524a84281D8235P6202E1397J16164O2084a68524H93P5792d9323j70652K9421
$$ -184281 48235 124437 51397 167561 229645 -168524 893 76685 -49323 -219975 -190554
15513a90554A47333e4985A6471O976J05026a87287A51515P2896K07824B02346
$$ -190554 147333 -54985 16471 23447 128473 -187287 151515 224411 432235 202346
15502D3696J8169J3253P9542m9194R2420o3463P0950j143L0368k5361f2870K5673
$$ 43696 61865 75118 154660 105466 197886 134423 205373 204230 234598 209237 -62870 -37197
15490c7197E35501k45076L0245j04380j01815J46559j15386h8504B17667I5668
$$ -37197 535501 290425 320670 216290 114475 261034 145648 -88504 217667 95668
15479B83124A2480K99691m9361h9692G3336B2999J61781C3829R7083b6238m0139
$$ 283124 12480 312171 262810 -89692 73336 22999 184780 33829 130912 -26238 -66377
15468f6377q4123G7204r952R1426b5148C70734J83275a11725D55628j15968K97035
$$ -66377 -150500 77204 67252 158678 -25148 370734 554009 -111725 455628 339660 636695
15457F36695O8927k37008A87796J54170I1673a22274C25895E9436J09490a68470
$$ 636695 705622 468614 187796 341966 91673 -122274 325895 59436 168926 -168470
15446A63328N8128J68855A58638P5454h1486A99556m9132J46719m9372a04455
$$ 163328 221456 390311 158638 234092 -81486 199556 150424 297143 247771 -104455
15435D27135j61162a11553B4973Q9483b098D14044j28549P6218K78554K86479
$$ 427135 265973 -111553 24973 114456 -2098 414044 285495 361713 640267 926746
15425I26746J95081r6m95405j61873k11450P2256l4844k123E5778a29886A16934
$$ 926746 1121827 1121731 626326 464453 253003 325259 290415 288292 55778 -129886 116934
15413A07736J05039A03538j983e1638J240C09166a55288b7064C01161A5906J72670
$$ 107736 212775 103538 101555 -51638 -50398 309166 -155288 -27064 301161 15906 188576
15402A88576a80217A38277o4847b60807d2061B4511a95876o2872I1657j6983d4958
$$ 188576 -180217 138277 73430 -260807 -42061 24511 -195876 -258748 91657 74674 -44958
15390A44680d21525a20303L8473D2750a01524j9582N8094B44613b9372j11976
$$ 144680 -421525 -120303 -81830 42750 -101524 -121106 -63012 244613 -29372 -141348
15380a41348l4624C7018g7901C0551P3944I974b7222E696g7501H523J63408n8755
$$ -141348 -175972 37018 -77901 30551 104495 9974 -27222 5696 -77501 8523 171931 113176
15368A13176K6271j8733K11863c7788l6435k5148B22622f9174l23672I9547L3026
$$ 113176 139447 120714 332577 -37788 -74223 -99371 222622 -69174 -392846 99547 132573
15357A32573J20138G9822b4715B07495L7055a29975B67551P5571j52414p152J20113
$$ 132573 252711 79822 -24715 207495 244550 -129975 267551 343122 190708 183556 303669
15346C03669B7304Q8957k3785O11042C38543A39190a66689B23042J10526b06572
$$ 303669 27304 116261 92476 703518 338543 139190 -166689 223042 333568 -206572
15335B71286k5200N5245q0730n648k0222C8073R9308k4474K83000L7943j13699
$$ 271286 246086 301331 220601 214953 194731 38073 137381 112907 395907 433850 320151
15324C20151O9349m4428o4098A0653M27632a55113B35071c5450B3855b14433B08836
$$ 320151 389500 345072 280974 10653 438285 -155113 235071 -35450 23855 -214433 208836
15312C45353a254A11085P0696n3763h8245G6945K38332A23258K30184j59521C5563
$$ 345353 -1254 111085 181781 128018 -88245 76945 315277 123258 353442 193921 35563
15300h5119B67380j29863O5855K86131k21514K34015j75861a18015A17475D5624
$$ -85119 267380 137517 203372 489503 267989 502004 326143 -118015 117475 45624
15289c37828J29092n5306I7751K26249A05506b23651p1571A19830n221m4111Q4057
$$ -337828 -208736 -264042 97751 324000 105506 -223651 -295222 119830 114609 70498 154555
15278A54555a77566C33885j55949a55681A13347M6152a5126B58586c6894B25020
$$ 154555 -177566 333885 177936 -155681 113347 159499 -15126 258586 -36894 225020
15267e7581b1157l04214A3745J9701K0397b12498J03720A43437K25332c0657J2335
$$ -57581 -21157 -325371 13745 33446 53843 -212498 -108778 143437 368769 -30657 -18322
15256a8322F6487e9144k6462B14811q9260a08906k39461J09451A99678b5901B67700
$$ -18322 66487 -59144 -85606 214811 125551 -108906 -348367 -238916 199678 -25901 267700
15244a59107c9949B56054j10771K92960f1209B27690K0472b68185B57209C3665
$$ -159107 -39949 256054 145283 438243 -61209 227690 248162 -268185 257209 33665
15233A71970R2856p4656n2940L06803j10195M17572K72231O59164m59424J13218
$$ 171970 264826 190170 137230 444033 333838 751410 1023641 1682805 1223381 1336599
15223A336599l13306m84433p6103B07099J68708A39187J02387B1923a45686B17938
$$ 1336599 1023293 538860 462757 207099 375807 139187 241574 21923 -145686 217938
15212A07875e2766j23211f4583A28782j7140P9560h1968B98880j36230c552j56778
$$ 107875 -52766 -175977 -64583 128782 111642 191202 -81968 298880 162650 -3552 -160330
15201a60330A82405l2274l1999j850e1410C6449c36821i7315H0539a1893B40540
$$ -160330 182405 150131 118132 116282 -51410 36449 -336821 -97315 80539 -11893 240540
15189F1471e9258a7609k81557H3208J79544H0233f3544K7220B52951k3575r9526
$$ 61471 -59258 -17609 -299166 83208 262752 80233 -63544 -36324 252951 229376 129850
15178A29850h8605A89086C8472a0556l6036C53776q7149a04198A20471a8342k03582
$$ 129850 -88605 189086 38472 -10556 -46592 353776 266627 -104198 120471 -18342 -221924
15167b21924C54116i856k23792I5174M8311K35286A29997P6354c9260A26820g9903
$$ -221924 354116 -9856 -233648 95174 143485 378771 129997 206351 -39260 126820 -79903
15155C94423A58148l5217J54733b58740B43551c0200C44160j55465c09162B7605
$$ 394423 158148 122931 277664 -258740 243551 -30200 344160 188695 -309162 27605
15144a35563j08976J10049K5092A15761l2746N2391E9689L53915h8908B45296
$$ -135563 -244539 -134490 -109398 115761 83015 135406 59689 413604 -88908 245296
15133b05364A73450d9511A00506c0752j7925a8998A05850L6161f9921C77198A37715
$$ -205364 173450 -49511 100506 -30752 -48677 -18998 105850 142011 -69921 377198 137715
15121c71853i2110a0250A89073n4451a80388k9798D07060a41683I7014a12927
$$ -371853 -92110 -10250 189073 134622 -180388 -210186 407060 -141683 97014 -112927
15110A40906R0538q1031D0541K59464j05618M1238K9218R2325K42258k93306j33490
$$ 140906 231444 150413 40541 300005 194387 235625 264843 357168 599426 306120 172630
15099A72630d2316G6879L34198G344K44361r6687l5741L69642j88134a05606a3347
$$ 172630 -42316 76879 411077 7344 251705 155018 119277 488919 300785 -105606 -13347
15087a15588a6771A40764F5793J73378j9330m8354J93100A2721d5029B56388h5404
$$ -115588 -16771 140764 65793 239171 219841 171487 364587 12721 -45029 256388 -85404
15075A66238K23509a32036B94856b25154A32733N3164J97110A82521n8073K08267
$$ 166238 389747 -132036 294856 -225154 132733 185897 383007 182521 124448 332715
15065C32715h1699B92619d7091B59012A23179k9083L41859a4619D0659K38432
$$ 332715 -81699 292619 -47091 259012 123179 94096 435955 -14619 40659 279091
15055B79091K21010D8554J00459b09025A98542E9583J11476P3239A08457K23179
$$ 279091 500101 48554 149013 -209025 198542 59583 171059 244298 108457 331636
15045C31636p4414N1474K63057l649j78207Q4152A97349o9689m7313O4574c3319
$$ 331636 257222 308696 571753 568104 389897 474049 197349 127660 80347 144921 -33319
15033D09282j53780I8313K00369L1097b9310B85199M7546K846j40113J82578K8528
$$ 409282 255502 98313 298682 329779 -29310 285199 332745 335591 195478 378056 406584
15022D06584O1980J3043k04454J63066k19334K83400j80181M75209j09134j82548
$$ 406584 468564 481607 277153 440219 220885 504285 324104 799313 690179 507631
15012E07631j19602L50722o6788L5578k18215J8617j69009L22093j82123Q3753
$$ 507631 388029 738751 671963 707541 489326 507943 338934 661027 478904 562657
15002E62657j26298H6103J74979J29489j3090M875k0678K68369q9788K41921l39025
$$ 562657 436359 86103 261082 390571 377481 382356 361678 630047 540259 782180 443155
14991D43155K83159l61246p4509K39496k27715J12320J92408O5048M6926J6204
$$ 443155 726314 365068 290559 530055 302340 414660 607068 672116 719042 735246
14981G35246j92806K71361A46415M32920j89882j33769N20857C16753K77143B42167
$$ 735246 542440 813801 146415 579335 389453 255684 776541 316753 593896 242167
14970E78621k5595P3010J85014k46087L36957l2154K00310l11120j09054J71989
$$ 578621 553026 626036 811050 564963 901920 869766 1070076 758956 649902 821891
14960H21891j85354J25577l32208M1081L32448o7671l373l41832J06891k30214
$$ 821891 636537 762114 429906 470987 803435 735764 732391 390559 497450 267236
14950B67236K57002A86291K49903j68843L3953J0588J95147F1502K67085J3334
$$ 267236 524238 186291 436194 267351 301304 311892 507039 61502 328587 341921
14940C41921R5068A97927J40732F3007N78712j19368l7641j70126J19010J76161
$$ 341921 436989 197927 338659 63007 641719 522351 484710 314584 433594 609755
14930F09755B16139K21461p0203J79440N7500j240k927A05714K83358R993L25199
$$ 609755 216139 437600 367397 546837 604337 603097 600170 105714 389072 399065 724264
14919G24264j46551L23597l20740K7083M44563j7765L02899R7670M7372m8397
$$ 724264 577713 901310 580570 607653 1052216 1034451 1337350 1435020 1482392 1433995
14909A433995K32251o0129J13987l36864K73701n2769J18713N44974k16353K58291
$$ 1433995 1666246 1606117 1720104 1383240 1656941 1604172 1722885 2267859 2051506 2309797
14899B309797k46476m60184m88547j04221o4524L7757l50378J06846k08760k56693
$$ 2309797 2063321 1603137 1114590 1010369 945845 983602 633224 740070 531310 274617
14889B74617M17174l36225k329K19340O3327J44285A54896K53086M9172J01445
$$ 274617 691791 355566 353237 572577 635904 780189 154896 407982 457154 558599
14879E58599j60567J00161j12175Q2939K52910j94938K3847l3404K6740P9751
$$ 558599 398032 498193 386018 468957 721867 526929 550776 517372 544112 623863
14869F23863J78239J25753J17515m42679L37521j82656L22924m63639J34616m4780
$$ 623863 802102 927855 1045370 602691 940212 757556 1080480 616841 751457 706677
14859G06677m5725j72886K84999k48528l261M3375m8554q8432K05686L10904j59865
$$ 706677 660952 488066 773065 524537 521276 564651 516097 427665 633351 944255 784390
14848G84390j72612j05336q4620L75395r4191j88530Q6695c2517C39390K47791
$$ 784390 611778 506442 421822 797217 703026 514496 601191 -32517 339390 587181
14838E87181J54354k05465j84237k4739p04L77593j11826L74878j54819K02913
$$ 587181 741535 536070 351833 327094 326390 703983 592157 967035 812216 1015129
14828A015129K34468m73916K91474N28447n15619k02886K95913m94535K12519
$$ 1015129 1249597 775681 1067155 1595602 1079983 877097 1173010 678475 890994
14819H90994J94721j72925j77009m3854l18520N88002m74742Q8485M8214B30393
$$ 890994 1085715 912790 735781 691927 373407 961409 486667 575152 623366 230393
14808E34180K81415l42783K79248L09450l28075m2230J18433j29218L61385l1474
$$ 534180 815595 472812 752060 1061510 733435 691205 809638 680420 1041805 1010331
14798A010331l25525L54231l38733j21065J66385J0886l9615n4212J61163J78458
$$ 1010331 684806 1039037 700304 579239 745624 756510 716895 662683 823846 1002304
14788A002304p8851j76541K07753k79870L9781L5210k17264K6257K1315k27464
$$ 1002304 923453 746912 954665 674795 714576 749786 532522 558779 580094 352630
14778C52630j4485M48899k52952K52270k34768J86269m985k35540O865L51594
$$ 352630 338145 787044 534092 786362 551594 737863 732878 497338 504203 855797
14768H55797k87434K81282J16205m05503R3707q03K97154J07174O3137j57381
$$ 855797 568363 849645 965850 560347 654054 653251 950405 1057579 1120716 963335
14758I63335J10406j26404l5735j32032j82423K78671l65252K84084j81764j09408
$$ 963335 1073741 947337 911602 779570 597147 875818 510566 794650 612886 503478
14748E03478J54235j66410J72421L95463l99119J7417j80808J58392J60916j92120
$$ 503478 657713 491303 663724 1059187 660068 677485 496677 655069 815985 623865
14738F23865j6225j32958J08278K8653J49326q6588J45162o0689q2862n9455q4654
$$ 623865 607640 474682 582960 611613 760939 674351 819513 758824 675962 616507 531853
14727E31853M10907o1210D14667L46230K14343j42315Q194J90458j33246K73068
$$ 531853 942760 881550 414667 760897 975240 832925 841119 1031577 898331 1171399
14717A171399J14495j60008m7030L43413M9005j71523K29933M36410m17153L4679
$$ 1171399 1285894 1125886 1078856 1422269 1471274 1299751 1529684 1966094 1548941 1583620
14707A583620l20433j67740K30741j05450j58365K65158m82281R4045J4632j38769
$$ 1583620 1263187 1095447 1326188 1220738 1062373 1327531 845250 939295 953927 815158
14697H15158R1793p7669O1438J11387k81778M72755k94279J96905p3236L87344
$$ 815158 906951 829282 890720 1002107 720329 1193084 898805 1095710 1022474 1409818
14687A409818J27390L25386n9601J30067k90731O3208o81833M00292l17325j11237
$$ 1409818 1537208 1862594 1802993 1933060 1642329 1705537 1023704 1423996 1106671 995434
14677I95434N26848n05430J5308K59496j11437k11042k63115M48370l55192K10183
$$ 995434 1522282 1016852 1032160 1291656 1180219 969177 706062 1154432 799240 1009423
14667A009423K2812k16434K95021l52691J58614L12742k45983j01060p3510L20017
$$ 1009423 1032235 815801 1110822 758131 916745 1229487 983504 882444 808934 1128951
14657A128951k57353L67766j61707k70172P5264O8942P1533L1426k99119L78639
$$ 1128951 871598 1239364 1077657 807485 882749 951691 1023224 1054650 755531 1134170
14647A134170l09280J99065o6162L34385k12872j42514l8583L05622L79741l64679
$$ 1134170 824890 1023955 957793 1292178 1079306 936792 898209 1203831 1583572 1218893
14637A218893J71056J31477j58420J9347q1048K5498l69048M28989k23959l31623
$$ 1218893 1389949 1521426 1363006 1382353 1301305 1326803 957755 1386744 1162785 831162
14627H31162L10863L3365J09482Q5065j05091l20097k1071L09573K05062O7063
$$ 831162 1142025 1175390 1284872 1369937 1264846 944749 923678 1233251 1438313 1505376
14617A505376j18167l20896K47737J23274J19163p161o4504m54115K86546n7873
$$ 1505376 1387209 1066313 1314050 1437324 1556487 1549326 1484822 1030707 1317253 1259380
14607A259380l6672K03142o8620K78418k37222j79317M16532k65000R9400Q2047
$$ 1259380 1222708 1425850 1357230 1635648 1398426 1219109 1635641 1370641 1470041 1552088
14597A552088Q8776l07420K87815n3562l6931j2687L92232j89737k11991J47409
$$ 1552088 1640864 1333444 1621259 1567697 1530766 1518079 1910311 1720574 1508583 1655992
14587A655992K6352l913K0159L1265k16092J08493J8801L95503j8919k21939J625
$$ 1655992 1682344 1678431 1698590 1729855 1513763 1622256 1641057 2036560 2017641 1795702 1797327
14576A797327k7738k33169K29595K12543p4451o3284n5370J2642J15100r3689
$$ 1797327 1769589 1536420 1766015 1978558 1904107 1840823 1785453 1798095 1913195 1819506
14566A819506K6746K37559P5834J92063l18088P6892p1888k47590M20201j68365
$$ 1819506 1846252 2083811 2159645 2351708 2033620 2110512 2038624 1791034 2211235 2042870
14556B042870M71729j82356J56582j45924K51572q9397k98434M11676J40420P1970
$$ 2042870 2514599 2332243 2488825 2342901 2594473 2505076 2206642 2618318 2758738 2830708
14546B830708J3368k40262L18014O2555L58495J23650M02049K05892Q09842M22701
$$ 2830708 2844076 2603814 2921828 2984383 3342878 3466528 3868577 4074469 4884311 5307012
14536E307012O47034J289331K176622L683478O346299J0872179O149816j5842585
$$ 5307012 5954046 7243377 9419999 13103477 19449776 30321955 36471771 20629186
14528B0629186q735325n178108k128459l84687o49106P29454P47492q36385j167357
$$ 20629186 11893861 6715753 4587294 4202607 3553501 4282955 5030447 4194062 3026705
14519C026705j96867l16732l60716J4135K59980j63324L2679q8339K74611M38641
$$ 3026705 2829838 2513106 2152390 2166525 2426505 2263181 2295860 2207521 2482132 2920773
14509B920773l49761k01328j91390K45036j61526Q9640J56227j73201L05881m1155
$$ 2920773 2571012 2369684 2178294 2423330 2261804 2351444 2507671 2334470 2640351 2599196
14499B599196J31444m4184p4441J91077K56549k79801M27340l43321k26176L75449
$$ 2599196 2730640 2686456 2612015 2803092 3059641 2779840 3207180 2863859 2637683 3013132
14489C013132q5094M35816j96097K84949l90596J74549K5999p4204j52986M92505
$$ 3013132 2928038 3363854 3167757 3452706 3062110 3236659 3262658 3188454 3035468 3527973
14479C527973k79561N10420n13706M28667O7873l37990O21571j55692l13642q5767
$$ 3527973 3248412 3758832 3245126 3673793 3741666 3403676 4025247 3869555 3555913 3470146
14469C470146M16368J45637M2725j44259o2360j6176n3111N51730j90074j18378
$$ 3470146 3886514 4032151 4074876 3930617 3868257 3852081 3798970 4350700 4160626 4042248
14459D042248N53692k83239j51558k1235J57281l1907M46069L5988k59618R3412
$$ 4042248 4595940 4312701 4161143 4139908 4297189 4265282 4711351 4747339 4487721 4581133
14449D581133K47213K6904J2276R0009k67003K86250O1257n8762L36943k42619
$$ 4581133 4828346 4855250 4867526 4957535 4690532 4976782 5038039 4979277 5316220 5073601
14439E073601M23810l05706M24494l52841P8353L79312j54544L26179Q3520J94312
$$ 5073601 5497411 5191705 5616199 5263358 5341711 5721023 5566479 5892658 5976178 6170490
14429F170490l48995L23123l6008j70780M38655j26606K11567K50493j70349J7987
$$ 6170490 5821495 6144618 6108610 5937830 6376485 6249879 6461446 6711939 6541590 6559577
14419F559577O0038K86171p3404J19719M01208J21456n9701K93606J4500J58132
$$ 6559577 6619615 6905786 6832382 6952101 7353309 7474765 7415064 7708670 7723170 7881302
14409G881302j57898L19216P8092l9880L41855J36405J32683J58372M3281j31812
$$ 7881302 7723404 8042620 8120712 8080832 8422687 8559092 8691775 8850147 8893428 8761616
14399H761616N17762k48316M87119k36539J94673J86084L15615k90395M69462
$$ 8761616 9279378 9031062 9518181 9281642 9476315 9662399 9978014 9687619 10157081
14390A0157081L63495J08859J63997J12591Q0713J99832k00101M32628O075L00381
$$ 10157081 10520576 10629435 10793432 10906023 10986736 11186568 10986467 11419095 11425170 11725551
14380A1725551k7421J04186M42592j47571O29392N8813M39748K73246j81389M5795
$$ 11725551 11698130 11802316 12244908 12097337 12726729 12785542 13225290 13498536 13317147 13362942
14370A3362942R44684n9638J81943L86490N34486K01500K46492K445J64786L81658
$$ 13362942 14307626 14247988 14429931 14816421 15350907 15552407 15798899 15801344 15966130 16347788
14360A6347788O13279J82152L31087J40664L22635P44006L37573O49934K18890
$$ 16347788 16961067 17143219 17474306 17614970 17937605 18681611 19019184 19669118 19888008
14351A9888008N73192N01132J48042N85016J29784N17801K57918M86654N66211
$$ 19888008 20461200 20962332 21110374 21695390 21825174 22342975 22600893 23087547 23653758
14342B3653758N55019M93420P63863O11348M63113M18566P61713O44862Q36376
$$ 23653758 24208777 24702197 25466060 26077408 26540521 26959087 27720800 28365662 29202038
14333B9202038J004457N13799J185894K66602J126174J071336R13190R20684J119413
$$ 29202038 30206495 30720294 31906188 32172790 33298964 34370300 35283490 36204174 37323587
14324C7323587O02993J624967J048319J197030R33583J372720J257006J286400
$$ 37323587 37926580 39551547 40599866 41796896 42730479 44103199 45360205 46646605
14316D6646605J573411J784505J356797J842852J666489J881961J891056K292368
$$ 46646605 48220016 50004521 51361318 53204170 54870659 56752620 58643676 60936044
14308F0936044J904701K084148K608594K085592K638535K826336K749468K879930
$$ 60936044 62840745 64924893 67533487 69619079 72257614 75083950 77833418 80713348
14300H0713348L097533L388008L384817L563790L878599M048595M163795M652959
$$ 80713348 83810881 87198889 90583706 94147496 98026095 102074690 106238485 110891444
14292A10891444N142524M972345N412359N807136O179645O733947O856569P547911
$$ 110891444 116033968 121006313 126418672 132225808 138405453 145139400 151995969 159543880
14284A59543880P264005Q424837Q865779R225574J0102277J0441384J0603827
$$ 159543880 166807885 175232722 184098501 193324075 203426352 213867736 224471563
14277B24471563J1818110J1969693J2809270J3312643J3906233J4746259J4692029
$$ 224471563 236289673 248259366 261068636 274381279 288287512 303033771 317725800
14270C17725800J4031001J4525401J3907348J3905605J3735794J3162176J1998422
$$ 317725800 331756801 346282202 360189550 374095155 387830949 400993125 412991547
14263D12991547J1050199R733889Q567274Q598998P481919M543659K977599K260958
$$ 412991547 424041746 433775635 442342909 450941907 458423826 462967485 465945084 468206042
14255D68206042K483725j03980n519975l874784o191872j1505164j2064837j3522343
$$ 468206042 470689767 470585787 465065812 461191028 454999156 443493992 431429155 417906812
14247D17906812j2685564j3505668j4064776j4190504j4499591j3872849j3974313
$$ 417906812 405221248 391715580 377650804 363460300 348960709 335087860 321113547
14240C21113547j3884816j3864049j2710311j2773855j1745397j2079050j1441838
$$ 321113547 307228731 293364682 280654371 267880516 256135119 244056069 232614231
14233B32614231r790955j0646585j0547249j0003903r902354q841028q536654
$$ 232614231 222823276 212176691 201629442 191625539 181723185 172882157 164345503
14226A64345503p806647p703929o784601o383188n981019o161292n331215n202811
$$ 164345503 156538856 148834927 142050326 135667138 129686119 123524827 118193612 112990801
14218A12990801m690580m150420l870995m157116m070939l395483l610798l256967
$$ 112990801 108300221 104149801 100278806 96121690 92050751 88655268 85044470 81787503
14210H1787503k949816k987961k688956k498069k645536k171600k106016k089086
$$ 81787503 78837687 75849726 73160770 70662701 68017165 65845565 63739549 61650463
14202F1650463k143888k020273j932158j451818j784064j368076j436799j872586
$$ 61650463 59506575 57486302 55554144 54102326 52318262 50950186 49513387 47640801
14194D7640801j355624j087293j004529j119614j265749j302649j336525j093179
$$ 47640801 46285177 45197884 44193355 43073741 41807992 40505343 39168818 38075639
14186C8075639o17504j086235r30732j117453j130782n14956n46755j010060q13171
$$ 38075639 37458135 36371900 35441168 34323715 33192933 32677977 32131222 31121162 30307991
14177C0307991j017287m00395m17060n93995q01631j050786o43133J75028j037072
$$ 30307991 29290704 28890309 28473249 27879254 27077623 26026837 25383704 25558732 24521660
14168B4521660q48522O1731j081995k06684m63553n08169p5565p66395m60168
$$ 24521660 23673138 23734869 22652874 22446190 21982637 21474468 21398903 20632508 20172340
14159B0172340n79816j64557m48020m21984n0702n42425l85421Q903k39379n86216
$$ 20172340 19592524 19427967 18979947 18557963 18507261 17964836 17579415 17588318 17348939 16762723
14149A6762723j28459o56657L4134m35507k70731J2353l95888n16950j81865j7376
$$ 16762723 16634264 15977607 16011741 15576234 15305503 15317856 14921968 14405018 14223153 14205777
14139A4205777l86070m02228j23470k17728r8089l94661k12459j83134j16859
$$ 14205777 13819707 13417479 13294009 13076281 12978192 12583531 12371072 12187938 12071079
14130A2071079j68411k27948K74719p67704r2701m2977m34474J06552J56603o62847
$$ 12071079 11902668 11674720 11949439 11181735 11089034 11046057 10611583 10718135 10874738 10211891
14120A0211891J63674l87392j1553k13437L0616j79735k59495o7470l47403j7230
$$ 10211891 10375565 9988173 9976620 9763183 9793799 9614064 9354569 9287099 8939696 8922466
14110H922466j42853l10888K29194j26361j25221k4137j12398k10713K9501j78409
$$ 8922466 8779613 8468725 8697919 8571558 8446337 8422200 8309802 8099089 8128590 7950181
14100G950181k23841J44130k58080l41636L71327P584k59858j56385m85699L84033
$$ 7950181 7726340 7870470 7612390 7270754 7642081 7649665 7389807 7233422 6747723 7131756
14090G131756l75863m47994N38764J59737m90252m34082L03783j39571j84068
$$ 7131756 6755893 6307899 6846663 7006400 6516148 6082066 6385849 6246278 6062210
14081F062210o9466O2605l71917L12347l30203J14472O3781r5686q7890j82752
$$ 6062210 5992744 6055349 5683432 5995779 5665576 5780048 5843829 5748143 5660253 5477501
14071E477501O4451j04295K8117l71010K11011j18862J90671l25093M4127k89914
$$ 5477501 5541952 5437657 5465774 5094764 5305775 5186913 5377584 5052491 5096618 4806704
14061D806704J74540j50281K01603q1084l47659J869L23364l38221k74831Q0008
$$ 4806704 4981244 4830963 5032566 4951482 4603823 4605692 4929056 4590835 4316004 4396012
14051D396012j36591L12312m75595J76093K25329l69208K35477R5871r7565k29302
$$ 4396012 4259421 4571733 4096138 4272231 4497560 4128352 4363829 4459700 4362135 4132833
14041D132833K67692j82960m64301N26168l05763j83089j83430M44907l02890
$$ 4132833 4400525 4217565 3753264 4279432 3973669 3790580 3607150 4052057 3749167
14032C749167l29515K18744q2917k02145J13535N7132r5911j7555j66577K1247
$$ 3749167 3419652 3638396 3555479 3353334 3466869 3524001 3428090 3410535 3243958 3265205
14022C265205j43914L60032j23986L24780m24824M76099n90718N44675k49118
$$ 3265205 3121291 3481323 3357337 3682117 3257293 3733392 3142674 3687349 3438231
14013C438231j99431J62893k91879J0430R4930j34628J36029l14728N4317l8070
$$ 3438231 3238800 3401693 3109814 3120244 3215174 3080546 3216575 2901847 2956164 2918094
14003B918094j40138K11440J49596m20620p2137K70947k13420n9609k56105K89119
$$ 2918094 2777956 2989396 3138992 2718372 2646235 2917182 2703762 2644153 2388048 2677167
13993B677167k78291J40425M6204k5838J978R8981o4802j70671N7300J26240q5
$$ 2677167 2398876 2539301 2585505 2559667 2561645 2660626 2595824 2425153 2482453 2608693 2608608
13982B608608l8338N1910K57968K75964O9251Q1125M75618O05407J749844K305253
$$ 2608608 2570270 2622180 2880148 3156112 3225363 3306488 3782106 4387513 6137357 8442610
13972H442610O118073J0468603J2771350j2257705r046378o079662k989006j333903
$$ 8442610 14560683 25029286 37800636 25542931 16496553 10416891 7427885 6093982
13964F093982j246150m13373l17987p53176L40587k09144l62399J10836j81181
$$ 6093982 4847832 4434459 4116472 3363296 3703883 3494739 3132340 3243176 3061995
13955C061995j60096Q0016k01734l23383j8391P1388j18419K08558j29818o7183
$$ 3061995 2901899 2981915 2780181 2456798 2438407 2509795 2391376 2599934 2470116 2402933
13945B402933m13416L78949k14485J03048N8973q8317m66529K07348L0108J6706
$$ 2402933 1989517 2368466 2153981 2257029 2316002 2227685 1761156 1968504 1998612 2015318
13935B015318R5107j76118J81453j21252j12058K58123k24509M0760k41226M4695
$$ 2015318 2110425 1934307 2115760 1994508 1882450 2140573 1916064 1956824 1715598 1760293
13925A760293K78210j07119j04240L03773k54205k25394l6042J99842n501l5109
$$ 1760293 2038503 1931384 1827144 2130917 1876712 1651318 1615276 1815118 1809617 1774508
13915A774508J14380o1383K79899n15360j03344N47895k34395k45601K71107k60404
$$ 1774508 1888888 1827505 2107404 1592044 1488700 2036595 1802200 1556599 1827706 1567302
13905A567302L63891k94013j682J80098J97593n02564J45786K92973j93096j20655
$$ 1567302 1931193 1637180 1635498 1815596 2013189 1510625 1656411 1949384 1756288 1635633
13895A635633p7977m00360O26309r7385n5875j65077j0002j83142J41163k15918
$$ 1635633 1557656 1157296 1783605 1686220 1630345 1465268 1455266 1272124 1413287 1197369
13885A197369K39975K12747n46005L90727R4617q6252m51460M14745K5417R2852
$$ 1197369 1437344 1650091 1104086 1494813 1589430 1503178 1051718 1466463 1491880 1584732
13875A584732n2754k04987j98969L60118M1024j89134L35716l85602k10500k8748
$$ 1584732 1531978 1326991 1128022 1488140 1529164 1340030 1675746 1290144 1079644 1050896
13865A050896L60513k78557p2932L11201m56327L52087n1067K02676j58692K8142
$$ 1050896 1411409 1132852 1059920 1371121 914794 1266881 1215814 1418490 1259798 1287940
13855A287940n15132M15513J46066l94072K28203J24996j52635l19235J07779
$$ 1287940 772808 1188321 1334387 940315 1168518 1293514 1140879 821644 929423
13846I29423K62205r0317J10922l0788j64848R5132J42064l4934j15155j29081
$$ 929423 1191628 1101311 1212233 1181445 1016597 1111729 1253793 1218859 1103704 974623
13836I74623J33834K89424l20825k64190M82484k90336j63856M05570l36536J65692
$$ 974623 1108457 1397881 1077056 812866 1295350 1005014 841158 1246728 910192 1075884
13826A075884m5975R7863p0907m0614J88796k15857J40990m1841r8088o3932M5012
$$ 1075884 1029909 1127772 1056865 1016251 1205047 989190 1130180 1088339 990251 926319 971331
13815I71331q6477J1341p3579j11626M39171j55344j09900Q8373j38677J01444
$$ 971331 884854 896195 822616 710990 1150161 994817 884917 973290 834613 936057
13805I36057k64788K36531k2044K1256j357j37404K37772j95365J32073l30531
$$ 936057 671269 907800 885756 907012 905655 768251 1006023 810658 942731 612200
13795F12200K57192j4651n5171J73492l4735J55249l3641k58697K69365k85991
$$ 612200 869392 854741 799570 973062 938327 1093576 1059935 801238 1070603 784612
13785G84612p9158j55649K17280l2721P6442K34647k41603J25418j71062o0554
$$ 784612 705454 549805 767085 734364 810806 1045453 803850 929268 758206 697652
13775F97652J69879J0857k6289M3863M026m17181M51789j53828l89684M53065
$$ 697652 867531 878388 852099 895962 899988 482807 934596 780768 391084 844149
13765H44149P8249p200k60012M07087m40871J37678l9744K33844k96886L89981
$$ 844149 922398 915198 655186 1062273 621402 759080 719336 953180 656294 1046275
13755A046275j01936j25250j02129Q778J27161j26295M36062j62641k20162J14683
$$ 1046275 944339 819089 716960 725738 852899 726604 1162666 1000025 779863 894546
13745H94546l92632J60614p5898Q9082R4371K748J35610k53056m3115K67488k79908
$$ 894546 501914 662528 586630 675712 770083 772831 908441 655385 612270 879758 599850
13734E99850m3011K0492R203L25214k18830j930k35245N5314K58543k97473M02956
$$ 599850 556839 577331 586534 911748 692918 690988 455743 511057 769600 472127 875083
13723H75083L45836m35683l1224j91122l511J79569p5592J24438j23739m1569
$$ 875083 1220919 785236 754012 562890 559379 738948 663356 787794 664055 622486
13713F22486j43435K1704N0101J04670J22905j75165J48710j95197j20241O3656
$$ 622486 479051 500755 550856 655526 778431 603266 751976 556779 436538 500194
13703E00194J50391K82960m41127J17664L45692G3600N99136J60638l59265J1529
$$ 500194 650585 933545 492418 610082 955774 73600 672736 833374 474109 485638
13693D85638K05486j70819B35281K25248p7192L07851q7091k31405M41834q4719
$$ 485638 691124 520305 235281 460529 383337 691188 604097 372692 814526 729807
13683G29807q6168j85841J72587p8472K53455J7645l83530q4748M39256l62162
$$ 729807 643639 457798 630385 551913 805368 823013 439483 354735 793991 431829
13673D31829J87058n9053K57389C79477J83450B49774J54849J69346j66109K50251
$$ 431829 618887 559834 817223 379477 562927 249774 404623 573969 407860 658111
13663F58111l21445J14282O4176o2810A15149L50327L20840B44872J65847K52273
$$ 658111 336666 450948 515124 452314 115149 465476 786316 244872 410719 662992
13653F62992Q9413B67182N50524l22178M4929j0233K46425k04690O5118A75165
$$ 662992 752405 267182 817706 495528 540457 530224 776649 571959 637077 175165
13642D44029j47237J69404L48789A36187L01959J12533j16505A98452M48221C3518
$$ 444029 296792 466196 814985 136187 438146 550679 434174 198452 646673 33518
13631F74601K057k15237K18628k01896J15384A73789K26522j75912k7874m615
$$ 674601 676658 461421 680049 478153 593537 173789 400311 224399 196525 191910
13621A91910L45315j15615L0920K09113j0123A71062J96851N7922j58995J22457
$$ 191910 537225 421610 452530 661643 651520 171062 367913 425835 266840 389297
13611C89297j53796J19591q655j00975d438E17551M6604k17875K80564k92116
$$ 389297 235501 355092 346437 245462 -4438 517551 564155 346280 626844 334728
13601C34728j56116N88850k17544O2774J4630l129A05855K19166K01541q8775
$$ 334728 178612 767462 549918 612692 627322 624193 105855 325021 526562 437787
13591D37787l536j09920M63118A90020l8567N76233Q3539C08898A41905N56159
$$ 437787 434251 324331 787449 190020 151453 727686 811225 308898 141905 698064
13581F98064C44703K63599B68125n7669K23035B09596J27972J48691k14344j6550
$$ 698064 344703 608302 268125 210456 433491 209596 337568 486259 271915 255365
13571B55365j01397J41140N5485K34103n8297r6478J43083j54546j26905J88737
$$ 255365 153968 295108 350593 584696 526399 429921 573004 418458 291553 480290
13561D80290A68834l3939P4302N9184j15475Q0745K50949k37792l4347J82909
$$ 480290 168834 134895 209197 268381 152906 233651 484600 246808 212461 395370
13551C95370k5734p1263M92935l07889j98846g7147C48504o7097M83635B44641
$$ 395370 369636 298373 791308 483419 284573 -77147 348504 281407 765042 244641
13540A03539L93325A92775M28704j49867l2734J510n5502j76070K80817Q4639
$$ 103539 496864 192775 621479 471612 438878 440388 384886 208816 489633 574272
13530E74272A07453L70868k15997j18413N4509J27526C5978J18548J7254K28402
$$ 574272 107453 478321 262324 143911 198420 325946 35978 154526 171780 400182
13520D00182A22342J62728L269j3941a1298B04415j7858K45989j23230q3084M64973
$$ 400182 122342 285070 288339 274398 -11298 204415 186557 432546 309316 226232 691205
13509F91205j87806J2209f370D05634k5402B3718L66028j73733O3199j391E4722
$$ 691205 503399 515608 -6370 405634 380232 23718 389746 216013 279212 277821 54722
13497G55316B54220e8145A80284j3109J00281J38998A97192J6420J53559j08806
$$ 755316 254220 -58145 180284 167175 267456 406454 197192 213612 367171 258365
13487B58365N9039I0637N26337j50528p9054D1661J12089K07869A36173J36216
$$ 258365 317404 90637 616974 466446 387392 41661 153750 361619 136173 272389
13477B72389q6821L20944j92481j09084R0235l5830k0384J20735A06197L66844
$$ 272389 185568 506512 314031 204947 295182 259352 238968 359703 106197 473041
13467D73041A52242a24328B87021p7704K99885k06899p572j34438R5135j04302
$$ 473041 152242 -124328 287021 209317 509202 302303 294731 160293 255428 151126
13457A51126L58306k41001J03731k7052A31461K29285j59472E7494N44475A52135
$$ 151126 509432 268431 372162 345110 131461 360746 201274 57494 601969 152135
13446A79410K51257A18912L1455l2562I660L95894M4600l0764n5401j17q5129
$$ 179410 430667 118912 150367 117805 9660 405554 450154 419390 363989 363872 278743
13435B78743r0030G8692J59856L72196c8799E26638A62650a38346A85673J10663
$$ 278743 188713 78692 238548 610744 -38799 526638 162650 -138346 185673 296336
13425B96336A11385b0267q602A86025J91483A73716i9459A45860Q6389E0386L04103
$$ 296336 111385 -20267 -28869 186025 377508 173716 -99459 145860 232249 50386 354489
13414C54489L4093F5379P7266K39864j50030K8470Q026l213j20950K08071E3723
$$ 354489 388582 65379 142645 382509 232479 260949 268975 265762 144812 352883 53723
13402I4906L22574j16552j27880R4610J04182a11628E4174a53446C78804A43225
$$ 94906 417480 300928 173048 267658 371840 -111628 54174 -153446 378804 143225
13391B29606l992A7878J09128M7895m9882J05121F4862K62939j23728E4426P7700
$$ 229606 225614 17878 127006 174901 125019 230140 64862 327801 204073 54426 132126
13380A32126L88737F2080N4969E4454a8812B72960E9397J92468K18733k29832
$$ 132126 520863 62080 117049 54454 -18812 272960 59397 251865 470598 240766
13370B40766D3855M80652A97360j9631M3142R7442k4481J57164a601B84483J33779
$$ 240766 43855 524507 197360 177729 220871 318313 293832 450996 -1601 284483 418262
13359D18262f5613B62968j15116f7506D60726H1856J35842r3614N3598K22438
$$ 418262 -65613 262968 147852 -67506 460726 81856 217698 124084 177682 400120
13349D00120b55399C56017I8030c1674B39995M11421l12356A66487p2396M36510
$$ 400120 -255399 356017 98030 -31674 239995 651416 339060 166487 94091 530601
13339E30601F8011A2713K60793n0993B6064K8274J20302K44962j4553j65433J92330
$$ 530601 68011 12713 273506 222513 26064 54338 174640 419602 405049 239616 431946
13328D31946q346n2209j34280L20533A62895L55175j94622k1172p5729k1894M64954
$$ 431946 423600 371391 237111 557644 162895 518070 323448 302276 226547 204653 669607
13317F69607C22802A57258B4662N23572A05301J92866a9247F00286D0157K09844
$$ 669607 322802 157258 24662 548234 105301 298167 -19247 600286 40157 250001
13307B50001J39724a82425D85618B33342J49718C5126i7791C33542K06858a19097
$$ 250001 389725 -182425 485618 233342 383060 35126 -97791 333542 540400 -119097
13296C77631A58747J67881j48943Q18b8561F7632K0187E239J27395C9564a9187
$$ 377631 158747 326628 177685 178503 -28561 67632 87819 5239 132634 39564 -19187
13284C28967B5274O3673J85450f999E57317B16400K02192n0129A42471A2033J15868
$$ 328967 25274 88947 274397 -6999 557317 216400 418592 368463 142471 12033 127901
13273A27901J58471h3194A20850J37752A13200b14148B50507A16950A6820J78253
$$ 127901 286372 -83194 120850 258602 113200 -214148 250507 116950 16820 195073
13263A95073r0746J5361a24160B70405M2165a27288I1354A429d6104C25489m272
$$ 195073 104327 119688 -124160 270405 312570 -127288 91354 1429 -46104 325489 321217
13252C21217P994A6992L61649d551B55002d9240B25242j04969c3892C5790c2426
$$ 321217 329211 16992 378641 -4551 255002 -49240 225242 120273 -33892 35790 -32426
13240C44029d5666B94656f9364C54053j70043E8251L3099K59662q5134a0648D59846
$$ 344029 -45666 294656 -69364 354053 184010 58251 91350 351012 265878 -10648 459846
13228a03060C45292A60326j0808b18896C04338A42031f7283A7796L34394A34447
$$ -103060 345292 160326 149518 -218896 304338 142031 -67283 17796 352190 134447
13217a17516A91975m9479L4571a55546B03462R5639P4165J32266k12049D118a4734
$$ -117516 191975 142496 177067 -155546 203462 299101 373266 505532 293483 4118 -14734
13205C77811j15603A3040K28251m0170m4225j5428N133O7574Q935p2448g6112
$$ 377811 262208 13040 241291 201121 156896 141468 146601 214175 223110 150662 -76112
13193d6441q6341B05832n9491h8655A7552a6694E66416H8909Q7722H3659K15203
$$ -46441 -132782 205832 146341 -88655 17552 -16694 566416 88909 176631 83659 298862
13182B98862f7610D43988j17186D1455K4078R7835b89871C25924j24573E3598
$$ 298862 -67610 443988 326802 41455 65533 163368 -289871 325924 201351 53598
13171a98659B70474A7395J79546d2887A88592K9627H8047h8056B5503a9043G0747
$$ -198659 270474 17395 196941 -42887 188592 218219 88047 -88056 25503 -19043 70747
13159B27309A054c8480C6637f1678C27073I5675C1889b05138E27105a72294b9040
$$ 227309 1054 -38480 36637 -61678 327073 95675 31889 -205138 527105 -172294 -29040
13147C48269a36220A4865e9026B4416a76601B8063L02301j34808J59438j33042
$$ 348269 -136220 14865 -59026 24416 -176601 28063 330364 195556 354994 221952
13137B21952n690M6576a45799H4268P8807b23378B54733a4489j44133A12106b94958
$$ 221952 216262 262838 -145799 84268 163075 -223378 254733 -14489 -158622 112106 -294958
13125A37574o6894K69150C1957N29380H9319K7452B0791b77167J36225B7694f6837
$$ 137574 70680 339830 31957 561337 89319 116771 20791 -277167 -140942 27694 -66837
13113I59h2548F6480R0431p5320R5321a50748J2559m1517O0212q7135B05795d1173
$$ 959 -82548 66480 156911 81591 176912 -150748 -138189 -179706 -119494 -206629 205795 -41173
13100b44330d5558N785A63572p8890r49c6499D7688e4696A91612K12386a8034
$$ -244330 -45558 -39773 163572 84682 83733 -36499 47688 -54696 191612 403998 -18034
13088G809M8745C757a8986p0147p4051B22389D2669R6179E0412K98960i8818A00693
$$ 7809 56554 3757 -18986 -89133 -163184 222389 42669 138848 50412 349372 -98818 100693
13075e2049p7059H5796i0260D39306a21652C90946G3572c0605B08631k488B7098
$$ -52049 -129108 85796 -90260 439306 -121652 390946 73572 -30605 208631 206143 27098
13063C23864j32508K7387G8328Q1814M4773l3544J03657b22234i0773E8147L4264
$$ 323864 191356 218743 78328 160142 204915 171371 275028 -222234 -90773 58147 92411
13052I2411C5650e1268j03570A96506P231D0702J8675g9354L2691A85509i5539
$$ 92411 35650 -51268 -154838 196506 203737 40702 59377 -79354 -46663 185509 -95539
13040A84670m3089c5626m9014C7991J55307f2284C1989f87A19956N0482a25924
$$ 184670 141581 -35626 -84640 37991 193298 -62284 31989 -687 119956 170438 -125924
13028a0156A11292C5603M4609b4234A40074M7301p9831K22792B9667a48324C1212
$$ -10156 111292 35603 80212 -24234 140074 187375 107544 330336 29667 -148324 31212
13016A06093F21a21691D19392j75803a94719e5548B04947j01472K41502o4345
$$ 106093 621 -121691 419392 243589 -194719 -55548 204947 103475 344977 280632
13006B80632M0471k0785k1948a49064B6326J01559J21371a8280C40597h0706F738
$$ 280632 321103 300318 278370 -149064 26326 127885 249256 -18280 340597 -80706 6738
12994A15530L612J98851H7823L89485A70034F5387J81419a0652A90401n5577b11526
$$ 115530 119142 317993 87823 477308 170034 65387 246806 -10652 190401 134824 -211526
12982D6864K6483J93711A28010K21118b1219e786E8953j8386a07744j437B36372
$$ 46864 73347 267058 128010 349128 -21219 -5786 58953 40567 -107744 -109181 236372
12970i3236B22894A05530d718j44067E6667a54829A72002g6137l7906j53p2224
$$ -93236 222894 105530 -4718 -148785 56667 -154829 172002 -76137 -114043 -114196 -186420
12959a86420B30798o9717o7730M1239e5692G2805b0211B9243M3906g570A82188
$$ -186420 230798 161081 93351 134590 -55692 72805 -20211 29243 73149 -7570 182188
12947G4692J81927c56513g2043B16275H9204k9313b6547l63051A58938f5490n9385
$$ 74692 256619 -356513 -72043 216275 89204 59891 -26547 -389598 158938 -65490 -124875
12936a24875e6490o0465K8080l123A09268f237j15879j41357C3812K03668a37717
$$ -124875 -56490 -116955 -88875 -91998 109268 -6237 -122116 -263473 33812 237480 -137717
12924A29321e8779q4695e8233G814b8226G2508d3926H0770l13a09995j52185K7642
$$ 129321 -58779 -143474 -58233 7814 -28226 72508 -43926 80770 80457 -109995 -262180 -234538
12912b34538A72308E6569g3550H8739K4336i2309A83311J2234C9241a12328B58175
$$ -234538 172308 56569 -73550 88739 113075 -92309 183311 195545 39241 -112328 258175
12900A05691C2745b55117D2073a33908O4830A92993r505q486E4137g6434F2526
$$ 105691 32745 -255117 42073 -133908 -69078 192993 183488 175002 54137 -76434 62526
12888F3024a44849o1855l4498B94828H6769K83802a58854A69623e2334E9664K9639
$$ 63024 -144849 -206704 -241202 294828 86769 370571 -158854 169623 -52334 59664 89303
12877H9303c2382j07953B05134l2744a4725j27838L6328A48009F5181O0560c3132
$$ 89303 -32382 -140335 205134 172390 -14725 -142563 -106235 148009 65181 125741 -33132
12865H0662B9223c61924J47865Q2776j0140N6291A24546a30399A48604G4055E257
$$ 80662 29223 -361924 -214059 -131283 -141423 -85132 124546 -130399 148604 74055 5257
12853b6335N586A28603C1690a67488A21032k2038K48474e5086A61649l0117d7233
$$ -26335 -20749 128603 31690 -167488 121032 98994 347468 -55086 161649 131532 -47233
12841A34012J07081r0783E3656a6088a478B4094K3992J68946A07042J27227r3370
$$ 134012 241093 150310 53656 -16088 -1478 24094 48086 217032 107042 234269 140899
12830A40899A4376a6611B01948J23731D2061h6086B78428O9130e0170G0005a99685
$$ 140899 14376 -16611 201948 325679 42061 -86086 278428 347558 -50170 70005 -199685
12818H4165M2525a92738B23562a85902B30787A8249M3746K45130b5595j36577
$$ 84165 126690 -192738 223562 -185902 230787 18249 61995 307125 -25595 -162172
12808a62172k63172a4330j53895J3709A08014m0154D016J65201D5784i3527A47211
$$ -162172 -425344 -14330 -168225 -154516 108014 67860 4016 169217 45784 -93527 147211
12796a80019q4712H0805c26414A62414J5026H8474J95780E5800K5158A2440c27624
$$ -180019 -264731 80805 -326414 162414 177440 88474 284254 55800 80958 12440 -327624
12784b1571C17881d04589f3245k30616d1093A17438k2707C1288a44178C56135
$$ -21571 317881 -404589 -63245 -293861 -41093 117438 94731 31288 -144178 356135
12773a3630B4420f5183A02607c272l70255A55353a07266A92215O616d8374C7597
$$ -13630 24420 -65183 102607 -3272 -373527 155353 -107266 192215 198831 -48374 37597
12761a80233d661H8173J29289a42698I0624a97716C98866E2663J65814M5614l1037
$$ -180233 -4661 88173 217462 -142698 90624 -197716 398866 52663 218477 264091 233054
12750B33054i602j72955l5996A30967a09642c2511A58176d81532b15679Q1462
$$ 233054 -9602 -182557 -218553 130967 -109642 -32511 158176 -481532 -215679 -134217
12740a34217J5314A3211b05641a9087B34714e2115N796k87074e2545j01733A22292
$$ -134217 -118903 13211 -205641 -19087 234714 -52115 -46319 -333393 -52545 -154278 122292
12728B3588h010k9894A47351m2920J68619A34072j3697n8249e9442A35297j870
$$ 23588 -8010 -37904 147351 104431 273050 134072 120375 62126 -59442 135297 133427
12717A33427P2029O4455D1433g2455A84061a95264E4819c01703A31286R1067r7662
$$ 133427 205456 269911 41433 -72455 184061 -195264 54819 -301703 131286 222353 124691
12706A24691J32065a44127B26896b53065b8393B665c20311g8077H4101a04157
$$ 124691 256756 -144127 226896 -253065 -28393 2665 -320311 -78077 84101 -104157
12695B56758f5470j5678D03448B8013K26570n4511E7921Q7377J15257a01598C81186
$$ 256758 -65470 -81148 403448 28013 254583 200072 57921 145298 260555 -101598 381186
12683A62326j8319J55700b49416B41842o8265D6103K25151f159A22492a09368
$$ 162326 144007 299707 -249416 241842 173577 46103 271254 -6159 122492 -109368
12672A49706q325n9270j210a1772A59499a2505k13155F4659K43293E6132k7220
$$ 149706 141381 82111 80901 -11772 159499 -12505 -225660 64659 307952 56132 28912
12661B8912a80439A99359o4388b0871A69962a54617B38080g5369l2094A14079
$$ 28912 -180439 199359 134971 -20871 169962 -154617 238080 -75369 -107463 114079
12650b2659o0403B61518k1223B0439a4130A2323J04767E7677J15071K5821J38056
$$ -22659 -83062 261518 240295 20439 -14130 12323 117090 57677 172748 198569 336625
12639C36625A67662B8970J97445M9164b0717B08141j7303a2893B6374L09701a7435
$$ 336625 167662 28970 226415 275579 -20717 208141 190838 -12893 26374 336075 -17435
12627A96395m6860G2193i5896c4969A18117i6552E4588a19854A22074a4656A20038
$$ 196395 149535 72193 -95896 -34969 118117 -96552 54588 -119854 122074 -14656 120038
12615c4333D24152A52907J15618A04328K6020R2020Q7472r5374m1326A6754J18732
$$ -34333 424152 152907 268525 104328 130348 222368 309840 214466 173140 16754 135486
12604A35486K35054A06675M14337B47240c41702a2933j00084E6319B2866K07744
$$ 135486 370540 106675 521012 247240 -341702 -12933 -113017 56319 22866 230610
12594B30610q9615a92286I9051g4547j57564D2940J04703J61481C4308K37071
$$ 230610 140995 -192286 99051 -74547 -232111 42940 147643 309124 34308 271379
12584B71379a59597B22959n3079F0005L12776l3955A37705J6813J11859a68975
$$ 271379 -159597 222959 169880 60005 372781 338826 137705 154518 266377 -168975
12573A35726J30591n6494E1201a68072A6931J28531a59555C32965a80793D1499
$$ 135726 266317 209823 51201 -168072 16931 145462 -159555 332965 -180793 41499
12562b43616B520L52503j52046h662F3522a86968I0959c00758e4924B98337h9595
$$ -243616 2520 355023 202977 -8662 63522 -186968 90959 -300758 -54924 298337 -89595
12550A27639c06847c7240A13172b15601d7498E5862K17005b87339e3114B37660
$$ 127639 -306847 -37240 113172 -215601 -47498 55862 272867 -287339 -53114 237660
12539b10252B01021e298l95688h5183E8838J82161c72193C07732A20406b89821
$$ -210252 201021 -5298 -400986 -85183 58838 240999 -372193 307732 120406 -289821
12528a19107k6739B29697b57459E5514b13450i6476c327j71739c4537A6876J08806
$$ -119107 -145846 229697 -257459 55514 -213450 -96476 -3327 -175066 -34537 16876 125682
12517A25682a67654d2227J9227A03988a98235d059C05407A07370f0627e474I3271
$$ 125682 -167654 -42227 -23000 103988 -198235 -4059 305407 107370 -60627 -5474 93271
12505C8434b21102Q9343a7767A04771L7724A4509c0787B2338J82571J0608p6088
$$ 38434 -221102 -131759 -17767 104771 142495 14509 -30787 22338 204909 215517 139429
12494A39429a06279C11226j05134n0961b2850A4792K40354j08161b8759E0080
$$ 139429 -106279 311226 206092 155131 -22850 14792 255146 146985 -28759 50080
12483A07670c16806a7323B20903J145i6150B69785e0248A65819d3019A51851O9625
$$ 107670 -316806 -17323 220903 222048 -96150 269785 -50248 165819 -43019 151851 221476
12472B21476i1484G9781a60082c1688a036k4088A69347J4528c91963B61766j13947
$$ 221476 -91484 79781 -160082 -31688 -1036 -25124 169347 183875 -391963 261766 147819
12461A47819L2801G1938j5091B7241c47458k6189A45165i513C57750B6500b23914
$$ 147819 180620 71938 56847 27241 -347458 -373647 145165 -9513 357750 26500 -223914
12449B24836I136d39930a34431A57388d0417j26640A10550E478b2325A3332d2599
$$ 224836 9136 -439930 -134431 157388 -40417 -167057 110550 5478 -22325 13332 -42599
12437A16675a06733d7016B54683H9430d2357A32661g8248G9253K63527A16181
$$ 116675 -106733 -47016 254683 89430 -42357 132661 -78248 79253 342780 116181
12426D6093c12004a13569A19714c34743j68501A18069K39745p5533b2601b501
$$ 46093 -312004 -113569 119714 -334743 -503244 118069 357814 282281 -22601 -2501
12415b60242B52392J41053A9984a39748m4950g826G985a38935C30431d674I0521
$$ -260242 252392 393445 19984 -139748 -184698 -7826 7985 -138935 330431 -4674 90521
12403d2712A70844j2795J50458c99069D0980a80722j9472R5645C8224j6849b04419
$$ -42712 170844 158049 308507 -399069 40980 -180722 -200194 -104549 38224 21375 -204419
12391a67750d1523B40995k884L7339q5571b97047e5760k42389O0446a01406j3391
$$ -167750 -41523 240995 238111 275450 189879 -297047 -55760 -298149 -237703 -101406 -114797
12380a14797G1135K6373c01840a5811B25640a79681B6303O6001a37034A36782
$$ -114797 71135 97508 -301840 -15811 225640 -179681 26303 92304 -137034 136782
12369B57693q9869D1223N9680P566J47134j16330K29505b46965P5924A53351a99929
$$ 257693 167824 41223 100903 108469 255603 139273 368778 -246965 -171041 153351 -199929
12357A74307Q2382a35204M4791k1199M0680B24592a72047G1140J3418h6620a4443
$$ 174307 256689 -135204 -90413 -111612 -70932 224592 -172047 71140 84558 -86620 -14443
12345c75918C89709b47381a2710j04006J0760c6693F4566A2447c06720J47349
$$ -375918 389709 -247381 -12710 -116716 -105956 -36693 64566 12447 -306720 -159371
12335a59371A22015l1068a62375O2972I6999J08292f1946G7885L27180h0778j39924
$$ -159371 122015 90947 -162375 -99403 96999 205291 -61946 77885 405065 -80778 -220702
12324b20702e3147C83980j06471A07414f8848J8439I2833K8552K7381K12216l9115
$$ -220702 -53147 383980 277509 107414 -68848 -50409 92833 121385 148766 360982 321867
12313C21867p6700k3764K47987A91483N3027G4135a0678l6933A58221a71609B01576
$$ 321867 245167 221403 469390 191483 244510 74135 -10678 -47611 158221 -171609 201576
12301D1337L55316j1534j00383A02422J9102E9302N3701b1771B7321L3046K74978
$$ 41337 396653 385119 284736 102422 121524 59302 113003 -21771 27321 60367 335345
12290C35345c7102j30291a6582k22644C88704C7595J38974b4668j08316j45172
$$ 335345 -37102 -167393 -16582 -239226 388704 37595 176569 -24668 -132984 -278156
12280b78156A40415a18795A61924n3288a83049A15228M7972h8862B71514g6128
$$ -278156 140415 -118795 161924 108636 -183049 115228 163200 -88862 271514 -76128
12269A41956K43600A72646J51804A33196K5964J8526k5903J31503k3707q5548
$$ 141956 385556 172646 324450 133196 159160 177686 151783 283286 259579 174031
12259A74031P3233b89615B05700E983M3963J51168P9615I128J38379d2178G8304
$$ 174031 247264 -289615 205700 5983 49946 201114 280729 9128 147507 -42178 78304
12247B79382A2524K18680q2428J05881j25869O1198H8887J23140M14515E9187
$$ 279382 12524 231204 148776 254657 128788 189986 88887 212027 626542 59187
12236D31969j46800N5616A28743K06708c5895C37280D575M21555B0326K67592
$$ 431969 285169 340785 128743 335451 -35895 337280 4575 426130 20326 287918
12226B87918a81077B88370J63483B07167n7735J06030A07708J34377a99009B71103
$$ 287918 -181077 288370 451853 207167 149432 255462 107708 242085 -199009 271103
12215A86521M5599p3643K163J22251j00169J09443c017A55213J15797I1765N8102
$$ 186521 232120 158477 160640 282891 182722 292165 -3017 155213 271010 91765 149867
12204A49867J68616j12418I0471K8666J90098A43767p0839J66052J29839M6476
$$ 149867 318483 206065 90471 119137 309235 143767 72928 238980 368819 415295
12194D15295a30690A38596J19233b72B01347G6140J83675l4911m6132e1295A13181
$$ 415295 -130690 138596 257829 -272 201347 76140 259815 224904 178772 -51295 113181
12182C30492j30162f8065A70358m9007K07651J76127C0528P6679K82889q1076
$$ 330492 200330 -68065 170358 121351 329002 505129 30528 107207 390096 309020
12172C09020H5466K37040o2588J54372a29858A92191q9640K42164K64413C01873
$$ 309020 85466 322506 259918 414290 -129858 192191 102551 344715 609128 301873
12161C50459f1309A40993a4000A92019K44985k01671L9612P3243r3989H828J67248
$$ 350459 -61309 140993 -14000 192019 437004 235333 274945 348188 254199 8828 176076
12150A76076k5662J53633j12639q4732J23330J20815r9104K15961j92197a2741
$$ 176076 150414 304047 191408 106676 230006 350821 251717 467678 275481 -12741
12139h5278q8512E9896a71786e3706A04330J54056b62354A80533b7996J2801A87499
$$ -85278 -173790 59896 -171786 -53706 104330 258386 -262354 180533 -27996 -15195 187499
12127c4921B74925a5529A55453G3256a16926M8488H6208J10299F0384L1271J3057
$$ -34921 274925 -15529 155453 73256 -116926 -68438 86208 196507 60384 91655 104712
12116A04712K2572L07150A85933J08053j41746J09149g0120A99621K5290c26632
$$ 104712 127284 434434 185933 293986 152240 261389 -70120 199621 224911 -326632
12105G0234J91396m28f5353C90154K61027B16459p970a4176A70774c8227b828
$$ 70234 261630 261202 -65353 390154 651181 216459 208489 -14176 170774 -38227 -2828
12093C0577b9959H76J62813e5639r6632A22871k283k0523b1407j36923L8933j19698
$$ 30577 -29959 876 163689 -55639 -152271 122871 120588 100065 -21407 -158330 -119397 -239095
12081b39095B49421A263L53097H6981e0951B95235h0991B07826o098a27994A6863
$$ -239095 249421 1263 354360 86981 -50951 295235 -80991 207826 201728 -127994 16863
12069B05722G8514B8665M2710J14830F430J4571K65336a57942A78620P3009k2650
$$ 205722 78514 28665 71375 186205 6430 21001 286337 -157942 178620 251629 228979
12058B28979J54584m6825j61495b0740A80497n6691J89526c07798B10978I4201
$$ 228979 383563 336738 175243 -20740 180497 123806 313332 -307798 210978 94201
12047A70172J33268G9121K02393b211k8633A79893K556f1022k36885Q6804j24078
$$ 170172 303440 79121 281514 -2211 -30844 179893 182449 -61022 -297907 -211103 -335181
12036c35181A04272h3211I2208f1472A79412b7430B48502C2468c93682J59059
$$ -335181 104272 -83211 92208 -61472 179412 -27430 248502 32468 -393682 -234623
12026b34623B54962A17432E1049c7309A28971M08920F6390q664d3400m39087C17428
$$ -234623 254962 117432 51049 -37309 128971 537891 66390 57726 -43400 -482487 317428
12014A18945Q0341g3444B78272b6582A6713J29225c20674Q6238A30165j5848f4283
$$ 118945 199286 -73444 278272 -26582 16713 145938 -320674 -234436 130165 114317 -64283
12002B24430a31232c089C00267a86693j4635B79977a69886H60J92998m9579J70024
$$ 224430 -131232 -3089 300267 -186693 -201328 279977 -169886 860 193858 144279 314303
11991C14303a58220j4195G0784K25945h4678A9385a98335h9322E18413d15957
$$ 314303 -158220 -172415 70784 296729 -84678 19385 -198335 -89322 518413 -415957
11980c39260a04873j61006A499c45604A04164M940b35508B22378g9502q4979F0390
$$ -339260 -104873 -265879 1499 -345604 104164 109104 -235508 222378 -79502 -164481 60390
11968b04953B3700a30157C2050L1738O7901b82101a31604B0054g0467o5857F4892
$$ -204953 23700 -130157 32050 63788 131689 -282101 -131604 20054 -70467 -136324 64892
11956a61104O4829A64120b26935i459G9478J6131B7580N4128a62837k7051j39213
$$ -161104 -96275 164120 -226935 -9459 79478 95609 27580 81708 -162837 -189888 -329101
11945c29101C154c17706f4902p3005b0621A49419c0103B29750e7499k64930C0143
$$ -329101 3154 -317706 -64902 -137907 -20621 149419 -30103 229750 -57499 -322429 30143
11933i3475B0888a47060b4251D8454d0710j18354K0088r431d0319A32390b08486
$$ -93475 20888 -147060 -24251 48454 -40710 -159064 -138976 -148407 -40319 132390 -208486
11921f1535j79423P4739B75075c45818b5721A15456A7373C121J0175b79314A33760
$$ -61535 -240958 -166219 275075 -345818 -25721 115456 17373 3121 13296 -279314 133760
11909c0468r2766r3311A2217b21677A63917a71255B19564l2591E8721b42997A06246
$$ -30468 -123234 -216545 12217 -221677 163917 -171255 219564 186973 58721 -242997 106246
11897d9314j50768b6917B21170a28161a3921A20781c00226B96232c3898D8775
$$ -49314 -200082 -26917 221170 -128161 -13921 120781 -300226 296232 -33898 48775
11886B2645J81133C0658A2103K08232j09548J10157J01337G6327N67505f9930
$$ 22645 203778 30658 12103 220335 110787 220944 322281 76327 643832 -69930
11875b08917B10936Q2683b45314d0017j16786j09792B74670A22902K97050b6663
$$ -208917 210936 293619 -245314 -40017 -156803 -266595 274670 122902 419952 -26663
11864G984b21160g3886l412j03984B78370p353a47910C21970a5083H5308O3830
$$ 7984 -221160 -73886 -77298 -181282 278370 271017 -147910 321970 -15083 85308 149138
11853A49138b52949p609k40449a87404E3174a10133L7143A17196J47145G564c42325
$$ 149138 -252949 -260558 -501007 -187404 53174 -110133 -72990 117196 264341 7564 -342325
11841D3663h9279I0543A7068J70678F7353f5061l9785K126b9627A3614L13619
$$ 43663 -89279 90543 17068 187746 67353 -65061 -104846 -102720 -29627 13614 327233
11830C27233H281Q1767g5714j87728f515o6348a960H7702a16405o303A04308a18698
$$ 327233 8281 90048 -75714 -263442 -6515 -72863 -1960 87702 -116405 -122708 104308 -118698
11817B31517L2766c32458A72161b00902b4978k25028a00645B7361c55462G4749
$$ 231517 264283 -332458 172161 -200902 -24978 -250006 -100645 27361 -355462 74749
11806h4867a5799B88336a38144j58291J01543a0361o6824A25629f7988B26383
$$ -84867 -15799 288336 -138144 -296435 -194892 -10361 -77185 125629 -67988 226383
11795a71467A11212a66962A48571a08013E3281e5819k87258h0608g941m4528k38609
$$ -171467 111212 -166962 148571 -108013 53281 -55819 -343077 -80608 -7941 -52469 -291078
11784b91078B01300A8530J49167a87100e7508j31989K0117e0878b2959A56358
$$ -291078 201300 18530 167697 -187100 -57508 -189497 -169380 -50878 -22959 156358
11773A49472h7971A02954J34389A08997b20088i8492M6240o2524A2982L59617
$$ 149472 -87971 102954 237343 108997 -220088 -98492 -52252 -114776 12982 372599
11763C72599e6358k71259C6199c50077a03624A84621a33363L3170H8616A2392
$$ 372599 -56358 -327617 36199 -350077 -103624 184621 -133363 -100193 88616 12392
11752A02428a36201j41069g499A69502e2196j53743b0572m1401D26334b55225
$$ 102428 -136201 -277270 -7499 169502 -52196 -205939 -20572 -61973 426334 -255225
11741i337m0353l4243k0894A31223b32436A9517h3939L9524k43835a12520k9500
$$ -9337 -49690 -83933 -104827 131223 -232436 19517 -83939 -44415 -288250 -112520 -142020
11730a42020G9039J11704F6294K97986b3522A94661a01033K2002k6432I4795b54004
$$ -142020 79039 190743 66294 364280 -23522 194661 -101033 -79031 -105463 94795 -254004
11718C3289J837K17736h4289K4383O380j02539A19983j4671f0574B33479o2560
$$ 33289 35126 252862 -84289 -59906 -53526 -156065 119983 105312 -60574 233479 170919
11707A70919H1526a02253n4218H8666b9596l0592B04382c5385j24677b932q1196
$$ 170919 81526 -102253 -156471 88666 -29596 -60188 204382 -35385 -160062 -2932 -84128
11696h4128g741j90240F1755a81094a8359j89151a00726B59296E5867N5364D0913
$$ -84128 -7741 -197981 61755 -181094 -18359 -207510 -100726 259296 55867 111231 40913
11684A14699a63393f2482B68350A8463n759b3595j66477C7858c1887o1147q983
$$ 114699 -163393 -62482 268350 18463 12704 -23595 -190072 37858 -31887 -93034 -102017
11673a02017A23450K38944G4372K40267a66541g9095D2274h2377A74488l4514
$$ -102017 123450 362394 74372 314639 -166541 -79095 42274 -82377 174488 139974
11663A39974B4745K33645K25201d09393A48902a60945A73531b07447I2474g4665
$$ 139974 24745 258390 483591 -409393 148902 -160945 173531 -207447 92474 -74665
11652A96117j1513a47660H4831J53240i0885F0349K37278I0181a53012B33575
$$ 196117 184604 -147660 84831 238071 -90885 60349 297627 90181 -153012 233575
11641b10775A59156d7289A38675b0599j31057A55185J25890j01574G6786R5393
$$ -210775 159156 -47289 138675 -20599 -151656 155185 281075 179501 76786 172179
11631A72179p8979D1192h8019p191H1096d3274f064A2043J19861c8838q9443D95780
$$ 172179 93200 41192 -88019 -95210 81096 -43274 -6064 12043 131904 -38838 -128281 495780
11618D7130b71385q37A89967a24371A74470n6655b43714B24173G689N6265P414
$$ 47130 -271385 -272222 189967 -124371 174470 117815 -243714 224173 7689 63954 71368
11607G1368f1813A29444K08169f8316B28899o5013A3704c69335J6510A92682a17851
$$ 71368 -61813 129444 337613 -68316 228899 163886 13704 -369335 -352825 192682 -117851
11595A56386a26334j51485B39619I7613A9225a99816A2653d7512N584k18587a04627
$$ 156386 -126334 -277819 239619 97613 19225 -199816 12653 -47512 -41928 -260515 -104627
11583f8465H7968O5750g4891A92858K34907o8535A47769a63579d2740A24622a88656
$$ -68465 87968 153718 -74891 192858 427765 359230 147769 -163579 -42740 124622 -188656
11571a42682C7070J46467a32636e3016A75669p4723b548A96829g9236D8012O6144
$$ -142682 37070 183537 -132636 -53016 175669 100946 -2548 196829 -79236 48012 114156
11560A14156b44492B65594c5960q3224B1546M2818K00343i3741B09019d7413G9309
$$ 114156 -244492 265594 -35960 -119184 21546 64364 264707 -93741 209019 -47413 79309
11548B27717g0033D15462a26217B42610n9557k9307E0695b48932A24889g1434
$$ 227717 -70033 415462 -126217 242610 183053 153746 50695 -248932 124889 -71434
11537a24505B14285H7953L7197A3589J20234a02130D99120E8943M4353L4536b28124
$$ -124505 214285 87953 125150 13589 133823 -102130 499120 58943 103296 137832 -228124
11525A49322R5912C7851J05011K53425E8392b53972J22077A29059E0361F350M225
$$ 149322 245234 37851 142862 396287 58392 -253972 -131895 129059 50361 6350 10575
11514A0575L40119o7420a18599A0813a55641A18906n159a08245C6013K50071N6679
$$ 10575 350694 283274 -118599 10813 -155641 118906 113747 -108245 36013 286084 342763
11503C42763L4723A43421r166m7657L82606a7819k4269k4496P961m0663B19124
$$ 342763 377486 143421 134255 86598 469204 -17819 -42088 -66584 -58623 -99286 219124
11491B43878a60408G4438d1241A24516J41480P5188k6815o6141a97550C28899
$$ 243878 -160408 74438 -41241 124516 265996 341184 314369 248228 -197550 328899
11480E41N98935f6719j3522d465A03134K59086F1679a56134e1172C26099D0138
$$ 541 599476 -66719 -80241 -4465 103134 362220 61679 -156134 -51172 326099 40138
11468B10891a23166b5986A94495c28091A17693L02077I2167B8211J02986P4125
$$ 210891 -123166 -25986 194495 -328091 117693 419770 92167 28211 131197 205322
11458B05322J30542D4265K98930r8647A04921K72599E1447N13342A07386a86509
$$ 205322 335864 44265 343195 244548 104921 377520 51447 564789 107386 -186509
11447B26263A1269Q0500L53238N6863j80421j48116o3806M5300L13315A99095
$$ 226263 11269 91769 445007 501870 321449 173333 109527 154827 468142 199095
11436a33555A44620L1504a59489P3700a0905k36610C2263L5964L9869L851J17605
$$ -133555 144620 176124 -159489 -85789 -10905 -247515 32263 68227 108096 111947 229552
11425B29552B8301c21663J19001g8107D49710j31271A6675J03527n8739b76180
$$ 229552 28301 -321663 -202662 -78107 449710 318439 16675 120202 61463 -276180
11414A34584J62194g7286E53395a10866j38235c3262A58156F8904f27767A06516
$$ 134584 296778 -77286 553395 -110866 -249101 -33262 158156 68904 -627767 106516
11403b05608A48833i0024r7667h6655D0786h9601F003K08084H8129P4699e2987
$$ -205608 148833 -90024 -187691 -86655 40786 -89601 6003 214087 88129 162828 -52987
11391e12558A38441A8386L39802A31086m4301h9899I3264a26805j61453C92065
$$ -512558 138441 18386 358188 131086 86785 -89899 93264 -126805 -288258 392065
11380C46943a15098H8991h4853A06223j640K9114c5175D3814J30386n9424D8691
$$ 346943 -115098 88991 -84853 106223 104583 133697 -35175 43814 174200 114776 48691
11368b71934f4592C482J04615L4406a15416D3946b8528E261b12325A12754c63175
$$ -271934 -64592 3482 108097 142503 -115416 43946 -28528 5261 -212325 112754 -363175
11356C3176c24537e0468k24585a3892C4562d9842A09885O0037n8863d0213k6051
$$ 33176 -324537 -50468 -275053 -13892 34562 -49842 109885 169922 111059 -40213 -66264
11345f6264I782M3599B3600J82967n1460J69809a36595m9979h2465B16530b54180
$$ -66264 9782 53381 23600 206567 155107 324916 -136595 -186574 -82465 216530 -254180
11333C8168a31215M532A92696G0990K0453p434J15759b14332K2935l3082D8516
$$ 38168 -131215 -126683 192696 70990 91443 84009 199768 -214332 -191397 -224479 48516
11321E1326J13896a01156m7408A86587a88260P1629B38955C2367R3012E1562f9840
$$ 51326 165222 -101156 -148564 186587 -188260 -116631 238955 32367 125379 51562 -69840
11309a49208g2875J7274A76630h7336a2842j93841b9729a1458A03425J7233a0349
$$ -149208 -72875 -55601 176630 -87336 -12842 -206683 -29729 -11458 103425 120658 -10349
11297h8k1671m1790p2725F0148b1956A34194E6727K7168k4969c24425A11568a34681
$$ -88 -21759 -63549 -136274 60148 -21956 134194 56727 83895 58926 -324425 111568 -134681
11284a01381C87496b79786C3676L2765j0583L2306d68161E768d2922k40466f1668
$$ -101381 387496 -279786 33676 66441 55858 88164 -468161 5768 -42922 -283388 -61668
11272B85532o8061a92181N3262l7396j74054b3989A94610d34315f2336l53873
$$ 285532 217471 -192181 -138919 -176315 -350369 -23989 194610 -434315 -62336 -416209
11262d16209A21512a0765n5060D7432a80284H7104b9732G8642a78974A25787a2480
$$ -416209 121512 -10765 -65825 47432 -180284 87104 -29732 78642 -178974 125787 -12480
11250h1140e474C06124a18717B80247b13466E4320c0144I4771b04465O5995J6683
$$ -81140 -5474 306124 -118717 280247 -213466 54320 -30144 94771 -204465 -138470 -121787
11239a21787A33874l9650b8015C3181b56524A73392A00Q5715c9942k13978P0720
$$ -121787 133874 94224 -28015 33181 -256524 173392 100 85815 -39942 -253920 -183200
11228a83200A47476a6962l46413B11927B5894b35951Q7165m6420o9785a22865
$$ -183200 147476 -16962 -363375 211927 25894 -235951 -148786 -195206 -264991 -122865
11217a7877C2040b70366g3096c2219l68420e6799D11897d2286J4267p8847J41
$$ -17877 32040 -270366 -73096 -32219 -400639 -56799 411897 -42286 -28019 -106866 -106725
11206a06725p9717B61407c353j63049A28815a88711k37515A0352c07465i0370
$$ -106725 -186442 261407 -3353 -166402 128815 -188711 -426226 10352 -307465 -90370
11195D97411a05406j25582f1733j7929A73107b25712g2680j65898r8876J32202
$$ 497411 -105406 -230988 -61733 -79662 173107 -225712 -72680 -238578 -337454 -205252
11185b05252k11771D685J43199a71339o4840B2276P0784a65160I2180d4373K1401
$$ -205252 -417023 4685 147884 -171339 -236179 22276 93060 -165160 92180 -44373 -22972
11174b2972C9154d26153c3767g256l9985H8966a90577i0575k3733o8322j93492
$$ -22972 39154 -426153 -33767 -7256 -47241 88966 -190577 -90575 -114308 -182630 -376122
11163c76122a37641B13313n4278K77456C2707K4999h0338p2372F9320P7017b5693
$$ -376122 -137641 213313 159035 436491 32707 57706 -80338 -152710 69320 146337 -25693
11151d28900D4150c02369C49539j59700A9236J80809a90954O5828C01262b32560
$$ -428900 44150 -302369 349539 189839 19236 200045 -190954 -125126 301262 -232560
11140A51338h1662j59366A52975a35269j9117m4655R2210I5750h8206j14337B55907
$$ 151338 -81662 -241028 152975 -135269 -154386 -199041 -106831 95750 -88206 -202543 255907
11128a66515C2513g6430K1832j57844p8126C354J76630q785b19694F7302a1833
$$ -166515 32513 -76430 -54598 -212442 -290568 3354 179984 171199 -219694 67302 -11833
11116b37619A32849F0627M4195B2955g2235j2242E44300A53997m8814i9976A36740
$$ -237619 132849 60627 104822 22955 -72235 -84477 544300 153997 105183 -99976 136740
11104B00507C4551J89888J35795n1566a1075j48540A29102O7070a85022A36654
$$ 200507 34551 224439 360234 308668 -11075 -159615 129102 196172 -185022 136654
11093A80054f5770o2003C6219K25702a16005A48872b7719l4156A25416A4954K36655
$$ 180054 -65770 -127773 36219 261921 -116005 148872 -27719 -61875 125416 14954 251609
11082B51609J19023A14298J37708j0647K8544q287C9249K87096N1268J96798H6054
$$ 251609 370632 114298 252006 241359 269903 261616 39249 326345 377613 574411 86054
11070A36542J30118A06895K04238j0741J0343J46846J32588A33877a24812B05017
$$ 136542 266660 106895 311133 300392 310735 457581 590169 133877 -124812 205017
11059A45780K13520J05559j73814K36387k10570N2449j49674e8417B29232O02891
$$ 145780 359300 464859 291045 527432 316862 369311 219637 -58417 229232 832123
11049H32123C75609J9102J82841n6871P6944j43022M48626j46322j14411R880
$$ 832123 375609 394711 577552 520681 597625 454603 903229 756907 642496 652376
11039F52376j18922J01239N8025M21851M4226l69290L14212l39835N02938l25104
$$ 652376 533454 634693 692718 1114569 1158795 789505 1103717 763882 1266820 941716
11029I41716l0553J52691j40067J39597j13772k01048M25906j16976j69695r7848
$$ 941716 911163 1063854 923787 1063384 949612 748564 1174470 1057494 887799 789951
11019G89951J18624j7032J90032j79873l2802Q6841j21024l6253J76851k82038
$$ 789951 908575 891543 1081575 901702 868900 955741 834717 798464 975315 693277
11009F93277J78908K450K25600r5387Q8232j17539K34569E82163K52999j6955
$$ 693277 872185 874635 1100235 1004848 1093080 975541 1210110 582163 835162 818207
10999H18207k83564M84442J27137k35956l6241l17518L62175m9115k29499j7313
$$ 818207 534643 1019085 1146222 910266 874025 556507 918682 869567 640068 622755
10989F22755J71327J74335j01825K13191E18346K21379K6674K89022j62208K12593
$$ 622755 794082 968417 866592 1079783 518346 739725 766399 1055421 893213 1105806
10979A105806k16733q1176R3528j51810J21225K42789E30972J82856M11273k34590
$$ 1105806 889073 807897 901425 749615 870840 1113629 530972 713828 1125101 890511
10969H90511L71074j61441J02865J81998j70080j58837K81524J97609j2807J77839
$$ 890511 1261585 1100144 1203009 1385007 1214927 1056090 1337614 1535223 1522416 1700255
10959A700255J33436R0146N54499J86204J24904J77069K06615L21758k6135J35343
$$ 1700255 1833691 1923837 2478336 2664540 2789444 2966513 3173128 3494886 3468751 3604094
10949C604094J71451m23160j11201l89018n09694J745k52812m52855M1824k47640
$$ 3604094 3775545 3352385 3241184 2852166 2342472 2344217 2091405 1638550 1680374 1432734
10939A432734K68667J88460k47783P7182p1686k56998k62317L47965n27227j84513
$$ 1432734 1701401 1889861 1642078 1719260 1647574 1390576 1128259 1476224 948997 764484
10929G64484k57296M91885D87761l6416q8238j65921K68911B10448Q572l2970
$$ 764484 507188 999073 487761 451345 363107 197186 466097 210448 219020 186050
10919A86050b7891B40350H5256K79353a2652E8691a0113n8356C9051N7735J11558
$$ 186050 -27891 240350 85256 364609 -12652 58691 -10113 -68469 39051 96786 208344
10908B08344a30594E4978a30187h557E8500k3617a06242M0913a8251A40053j6960
$$ 208344 -130594 54978 -130187 -8557 58500 34883 -106242 -65329 -18251 140053 123093
10897A23093E0480L1240B1868M5250b62940E4876J59160b04005f8848j66015p6843
$$ 123093 50480 81720 21868 67118 -262940 54876 214036 -204005 -68848 -234863 -311706
10886c11706B13418b83430A95786f9906o5237B0960J34808N9853b10640H6306
$$ -311706 213418 -283430 195786 -69906 -135143 20960 155768 215621 -210640 86306
10875A14051a57193D4215K8875J50053n8198J3480b86510i6488m1822j53503A77278
$$ 114051 -157193 44215 73090 223143 164945 178425 -286510 -96488 -138310 -291813 177278
10863H0945e53518a76892g3030D22707A07431i2488k9245C24187B8255K84592
$$ 80945 -553518 -176892 -73030 422707 107431 -92488 -121733 324187 28255 312847
10853C12847g1980F7596l400k1593L9723b14275M1361m4395r2788A1171b07447
$$ 312847 -71980 67596 64196 42603 82326 -214275 -172914 -217309 -310097 11171 -207447
10841h8863B47540i9589A50326a13947M8169j37413o5088B12519p2026a8714r081
$$ -88863 247540 -99589 150326 -113947 -65778 -203191 -268279 212519 140493 -18714 -27795
10830b7795A26605l7145a20293e734j17995L6368j30103B23252B1539e975A50194
$$ -27795 126605 89460 -120293 -5734 -123729 -87361 -217464 223252 21539 -5975 150194
10818c61756a52890l8957C04669c93841D6664a08186k6024B38664g8150D7481
$$ -361756 -152890 -191847 304669 -393841 46664 -108186 -134210 238664 -78150 47481
10807C9954L82701A25276h1468k61299F5187a92860C04157c1846n693j94377A35888
$$ 39954 422655 125276 -81468 -342767 65187 -192860 304157 -31846 -37539 -231916 135888
10795c21176J48253N4155e3665k97095K1402J51110P9842j44572m5287J05264
$$ -321176 -172923 -118768 -53665 -350760 -329358 -178248 -98406 -242978 -288265 -183001
10785a83001G1265c61615C6075d8864A79716E1597c59220m1507E4998b08829j0192
$$ -183001 71265 -361615 36075 -48864 179716 51597 -359220 -400727 54998 -208829 -219021
10774b19021i1576K2257j96562A9175N0609b28229A3658a22439j200N578M1706
$$ -219021 -91576 -69319 -265881 19175 69784 -228229 13658 -122439 -123639 -118061 -76355
10763g6355B2474M7602a30869D6192R2663n5980a24853D5715M3855a56327a4579
$$ -76355 22474 70076 -130869 46192 138855 82875 -124853 45715 89570 -156327 -14579
10751d28470a51849k32188N3925a12172b1009B44754r1805D2343a22668B59841
$$ -428470 -151849 -384037 -330112 -112172 -21009 244754 152949 42343 -122668 259841
10740c147A35961O6469A2540P4474h7770e855j19141N2944O487B26248a5402A
$$ -3147 135961 202430 12540 87014 -87770 -5855 -124996 -72052 -65565 226248 -15402 1
10727c6016F11150e5580A73779f639A88341a8373A09861g5517B00321a9137n6313
$$ -36016 611150 -55580 173779 -6639 188341 -18373 109861 -75517 200321 -19137 -75450
10716g5450j02581I212K3033c48926P7330B71826d53921b03368p8524i6175c0369
$$ -75450 -178031 9212 32245 -348926 -271596 271826 -453921 -203368 -281892 -96175 -30369
10704I1979a08308B5350d5441k1357n1933A81811p1232i7681d4021G0938J08069
$$ 91979 -108308 25350 -45441 -66798 -118731 181811 110579 -97681 -44021 70938 179007
10693A79007g8078j73916j43724a00038I8353K2306a48025O1350B7936K04827
$$ 179007 -78078 -251994 -395718 -100038 98353 120659 -148025 -86675 27936 232763
10683B32763c17700a45788A58998C5676J37202a14658A47825c9926j536Q362B6611
$$ 232763 -317700 -145788 158998 35676 172878 -114658 147825 -39926 -41462 -33100 26611
10671f0376B54432b52361a14454J9369k8719n4719m0277o9470F8330l1878P0972
$$ -60376 254432 -252361 -114454 -95085 -123804 -178523 -218800 -288270 68330 36452 107424
10660A07424c4171A49996J39162A31177c44182J44416A6645J17893c00066L8278
$$ 107424 -34171 149996 289158 131177 -344182 -199766 16645 134538 -300066 -261788
10650b61788l13857h209q7061m1537N7817j0830c6391D9248a4883C24018a16883
$$ -261788 -575645 -8209 -95270 -136807 -78990 -89820 -36391 49248 -14883 324018 -116883
10638b95768h4225p2683E0196f4535A06022a50535I2062a91667A03706J34156
$$ -295768 -84225 -156908 50196 -64535 106022 -150535 92062 -191667 103706 237862
10628B37862E3020A6379a14799p9322A71898G2263K30646a89663e061j0050q8172
$$ 237862 53020 16379 -114799 -194121 171898 72263 302909 -189663 -5061 -15111 -103283
10617a03283H2133j2736J2420e2050A6300b57620C12397b54363H5093B3486K4848
$$ -103283 82133 69397 81817 -52050 16300 -257620 312397 -254363 85093 23486 48334
10606D8334O3312B6353c6014A14837i0875B28043J16373A04899D3983b44659f354
$$ 48334 111646 26353 -36014 114837 -90875 228043 344416 104899 43983 -244659 -6354
10594f7173J7460a1371m7327o1480j7613D3535A566a00062o9273H1591a35864
$$ -67173 -49713 -11371 -58698 -120178 -137791 43535 1566 -100062 -169335 81591 -135864
10582a67959r215n5692A40529B6500a06410b3430a0472q8981k21045n2517a32819
$$ -167959 -177174 -232866 140529 26500 -106410 -23430 -10472 -99453 -320498 -373015 -132819
10570b71666j13188C13025b73137e2268A94913n778H6945b57091R1358B24895
$$ -271666 -384854 313025 -273137 -52268 194913 189135 86945 -257091 -165733 224895
10559a21121k71389B9867R2304h0932j00673l6885A45148a07337p5321e7866o8903
$$ -121121 -392510 29867 122171 -80932 -181605 -218490 145148 -107337 -182658 -57866 -126769
10548a26769j01453R8097A00992b12016i9880j40394A65445c47839a28301C61518
$$ -126769 -228222 -130125 100992 -212016 -99880 -240274 165445 -347839 -128301 361518
10537b7734m5976F9592j318J20710a56381p7375J00936I2781a49975D2027R2788
$$ -27734 -73710 69592 68274 188984 -156381 -233756 -132820 92781 -149975 42027 134815
10526A34815d56372a46765k69807a60754B67416e094l4150A00025h462A81413
$$ 134815 -456372 -146765 -416572 -160754 267416 -5094 -39244 100025 -8462 181413
10515a38930J9692d6921F117a15745m1322C0353b88484A50926E9031a89064B5817
$$ -138930 -119238 -46921 6117 -115745 -157067 30353 -288484 150926 59031 -189064 25817
10503g5353j20993d8726A54405E9116i4885l0184K7386H5892a42844A775b08524
$$ -75353 -196346 -48726 154405 59116 -94885 -125069 -97683 85892 -142844 1775 -208524
10491C20185a15674k4770l56035A87462g7232r9848i090B0572J55683d7577m3218
$$ 320185 -115674 -140444 -496479 187462 -77232 -177080 -9090 20572 176255 -47577 -90795
10480i0795B29112a71253e0653k9150B47496m0536c61729H5310P5599F2571j2468
$$ -90795 229112 -171253 -50653 -79803 247496 206960 -361729 85310 160909 62571 50103
10469E0103k3298R1494f8759A21467d3479A32331o5046K06590j02822k6004K16575
$$ 50103 26805 118299 -68759 121467 -43479 132331 67285 273875 171053 145049 361624
10458C61624E7904L19740I5726O4668J03653j30617B9230e914A55984b05009a8960
$$ 361624 57904 377644 95726 160394 264047 133430 29230 -5914 155984 -205009 -18960
10446i5113G2853f8021A34187B3508b8079C5613i1330K5703B56865a38149K4662
$$ -95113 72853 -68021 134187 23508 -28079 35613 -91330 -65627 256865 -138149 -113487
10435a13487K3332B5378b20189M2495n4119Q0715N8008C711e3184j23021b8495
$$ -113487 -90155 25378 -220189 -177694 -231813 -151098 -93090 3711 -53184 -176205 -28495
10423a83989L7677A15585c45102d4324A66666p0571a48926M3884j31179e772H7780
$$ -183989 -146312 115585 -345102 -44324 166666 96095 -148926 -105042 -236221 -5772 87780
10411H5194a40522f7024B7192a84846F2378b93953a13132I2008a28680B28203
$$ 85194 -140522 -67024 27192 -184846 62378 -293953 -113132 92008 -128680 228203
10400A5430a0349F0372N0845q524L0101j8323a80601L8004A81496a18219j32759
$$ 15430 -10349 60372 111217 102693 132794 114471 -180601 -142597 181496 -118219 -250978
10389b50978D8697N0813c02982P1889A14761G055Q1754a08379C451e9531j77217
$$ -250978 48697 99510 -302982 -231093 114761 7055 88809 -108379 3451 -59531 -236748
10378b36748A75856d11457a18652C15633J64436a48901C72168j41592A04410g49
$$ -236748 175856 -411457 -118652 315633 480069 -148901 372168 230576 104410 -749
10367B81968A40319b3546A55832M6871p2125A2955J84608K6432K14155M4112k21143
$$ 281968 140319 -23546 155832 202703 130578 12955 197563 223995 438150 482262 261119
10356B61119R0977J35071k30034J74761j76838J00634j52993K13715J78855L479
$$ 261119 352096 487167 257133 431894 255056 355690 202697 416412 595267 598746
10346E98746j98605j06250L3475J58925j76300A15904J11337J94406j30232G0306
$$ 598746 400141 293891 327366 486291 309991 115904 227241 421647 291415 70306
10335A13419N22827A4282K89682K10598L66897j15344j63126k15360J13631J68695
$$ 113419 636246 14282 303964 514562 881459 766115 602989 387629 501260 669955
10325F69955j54897r8152A69223K21472A81073a16955B36312J87431J6971A25542
$$ 669955 515058 416906 169223 390695 181073 -116955 236312 423743 440714 125542
10314A12129K8877Q3260D156K45570K2220a9191j71904I043h0883E3833J4630
$$ 112129 141006 224266 4156 249726 271946 -19191 -191095 9043 -80883 53833 68463
10303F8463L49081B0688g4227k2671A02263Q9163B9378a39143L9579C70971I402
$$ 68463 417544 20688 -74227 -96898 102263 191426 29378 -139143 -99564 370971 9402
10291a37221K0556j26832N7006A08406Q2b86362a07033A24086b96178H3997J01686
$$ -137221 -116665 -243497 -186491 108406 108488 -286362 -107033 124086 -296178 83997 185683
10280A85683b30149g3626J3190k98691e0581J7273B93360d1517j11406n3997B39277
$$ 185683 -230149 -73626 -60436 -359127 -50581 -33308 293360 -41517 -152923 -206920 239277
10268F9742b99743a18834B04141G0269h3264J117L7251n0669B62742b46041Q8632
$$ 69742 -299743 -118834 204141 70269 -83264 -82147 -44896 -95565 262742 -246041 -157409
10257a57409C1465K07459f1535A35086K31976a54569a5501D9169E875K19566c8342
$$ -157409 31465 238924 -61535 135086 367062 -154569 -15501 49169 5875 225441 -38342
10245c7774A46850a47874E9853R0526c25531a26530A3553K72643f7081E5966d360
$$ -37774 146850 -147874 59853 150379 -325531 -126530 13553 286196 -67081 55966 -4360
10233a58880D2149K29924o9412k3846b5541G6540b9025o8771A01932a19652A12212
$$ -158880 42149 272073 202661 178815 -25541 76540 -29025 -97796 101932 -119652 112212
10221A49042a05901n2766A42679C6200f4501b4426B1248Q5529e3060l27944a21028
$$ 149042 -105901 -158667 142679 36200 -64501 -24426 21248 106777 -53060 -381004 -121028
10209a94528f6068l72406G9652b58658P0565b0079j82207A49401J33485a65851
$$ -194528 -66068 -438474 79652 -258658 -188093 -20079 -202286 149401 282886 -165851
10198a71678D9256b28143d50j6280j55849I4577a37556A0812a49604l7791J2042
$$ -171678 49256 -228143 -450 -16730 -172579 94577 -137556 10812 -149604 -187395 -175353
10187a75353p9091a19180k7616O4561k3056r5356M0312A37453K15998j65669I464
$$ -175353 -254444 -119180 -146796 -82235 -105291 -200647 -160335 137453 353451 187782 9464
10175A04326a40099H6139J41318K4379a72801j725e8288j51965A34261g0897j22995
$$ 104326 -140099 86139 227457 251836 -172801 -174526 -58288 -210253 134261 -70897 -193892
10164a93892B38277c3535k834H7891g9626L4919n209a3862q846E7720F017M2307
$$ -193892 238277 -33535 -36369 87891 -79626 -44707 -49916 -13862 -22708 57720 6017 48324
10152D8324b3896A11525B2817L5213a73242C5401c84657d2509B03152a04409q5563
$$ 48324 -23896 111525 22817 58030 -173242 35401 -384657 -42509 203152 -104409 -189972
10141a89972q5677C0943b01796g2985A48818b14149j2539A20279f2860J2904n6889
$$ -189972 -275649 30943 -201796 -72985 148818 -214149 -226688 120279 -62860 -49956 -106845
10130a06845A10416D833Q8770A4206a06404j00936j0072n7613E0092J19531b97386
$$ -106845 110416 4833 93603 14206 -106404 -207340 -217412 -275025 50092 169623 -297386
10118h848k0601j665l66867e8497C41708a03397H4656c7510F2974f0785A34201
$$ -8848 -29449 -31114 -397981 -58497 341708 -103397 84656 -37510 62974 -60785 134201
10106c2899j66706k77237a38099A16988c32107J57470N7074j1031G6594b79196
$$ -32899 -199605 -476842 -138099 116988 -332107 -174637 -117563 -128594 76594 -279196
10095a71276M7204b0872A4915b64424C0379J49184c93993A10972G442J8535I022
$$ -171276 -124072 -20872 14915 -264424 30379 179563 -393993 110972 7442 25977 9022
10083D78699k13058E4075R1886J06311J24890c8434B59643a61632A71954J04657
$$ 478699 265641 54075 145961 252272 377162 -38434 259643 -161632 171954 276611
10073B76611I2463b35569e5696l5500l1547j8947r2919B25513a05862d5980E5692
$$ 276611 92463 -235569 -55696 -91196 -122743 -141690 -234609 225513 -105862 -45980 55692
10061e2815k8816b1541k83945e7696j83482B85716a8164A10828h0356m4554q9873
$$ -52815 -81631 -21541 -305486 -57696 -241178 285716 -18164 110828 -80356 -124910 -214783
10050b14783c6708a5737j57958O5329I0338a02644q8773d9452A15084d70003b22311
$$ -214783 -36708 -15737 -173695 -108366 90338 -102644 -191417 -49452 115084 -470003 -222311
10038b54011h3038p0715c8517j77329B92924h0545E8981h8857j59799q1084M7481
$$ -254011 -83038 -153753 -38517 -215846 292924 -80545 58981 -88857 -248656 -329740 -282259
10027b82259H7838b69470c5783k67507R9402E9654Q1200K06666D3903d2317l88921
$$ -282259 87838 -269470 -35783 -303290 -203888 59654 140854 347520 43903 -42317 -431238
10016d31238a61921j91003A8510K18513A07049d16034l6355K03193O6863j87864
$$ -431238 -161921 -352924 18510 237023 107049 -416034 -452389 -249196 -182333 -370197
10006c70197b4200o2461j57573n5069C4508b38377A6608b27231o0087o963b2446
$$ -370197 -24200 -86661 -244234 -299303 34508 -238377 16608 -227231 -287318 -294281 -22446
9994A7748a62396N4587j92597K073A450M3753J71023J26303a24613I7149b30177
$$ 17748 -162396 -107809 -300406 -298333 1450 45203 216226 342529 -124613 97149 -230177
9982B04235o0702L4124a71984f5752m1644k898M823B29730a56929m5865a6534
$$ 204235 143533 177657 -171984 -65752 -107396 -110294 -105471 229730 -156929 -202794 -16534
9970b41350O3826r5844F2514a63764d8697A53542a93951G95K63994a36101k85838
$$ -241350 -177524 -273368 62514 -163764 -48697 153542 -193951 795 264789 -136101 -421939
9959d21939b4582j92299j30536b8893k06691C89775a3286A91327b79155j23622
$$ -421939 -24582 -216881 -347417 -28893 -235584 389775 -13286 191327 -279155 -402777
9949d02777g6410A63770a89119A7003E069c35425J57730j32468M7202J21773p9686
$$ -402777 -76410 163770 -189119 17003 5069 -335425 -177695 -310163 -262961 -141188 -220874
9938b20874N3269D2687b54018h3889j42896j04557c0066D8144J68723H2115b68585
$$ -220874 -167605 42687 -254018 -83889 -226785 -331342 -30066 48144 216867 82115 -268585
9926B49215r988a7887j41908G8390h279j78730b8805j38054F6543K8353c46713
$$ 249215 239227 -17887 -159795 78390 -8279 -187009 -28805 -166859 66543 94896 -346713
9914e6622K6707j86933j40022A14257a0663j77462E6998a59545A05538P596b07683
$$ -56622 -29915 -216848 -356870 114257 -10663 -188125 56998 -159545 105538 113134 -207683
9902A44866a04108L8507k20666a38861j8062e1977H7252a17606k8721C5932a73197
$$ 144866 -104108 -65601 -286267 -138861 -156923 -51977 87252 -117606 -146327 35932 -173197
9890a62104H625b73630G8225B2733f8415F7343b6855B01388D2139K0898h6955
$$ -162104 8625 -273630 78225 22733 -68415 67343 -26855 201388 42139 63037 -86955
9878g3791j26192e351j39104E764a94767j13200B46325c74492R3037h7737j62667
$$ -73791 -199983 -5351 -144455 5764 -194767 -307967 246325 -374492 -281455 -87737 -250404
9867b50404J05688P0038A67669e6430r5066M2472l03015A28589a7291k48218b1094
$$ -250404 -144716 -74678 167669 -56430 -151496 -109024 -412039 128589 -17291 -265509 -21094
9855A04973b51729F6702R162J88523a09435M8431r9b1515l05851p8837c2835Q293
$$ 104973 -251729 66702 75864 264387 -109435 -61004 -61103 -21515 -327366 -406203 -32835 -24542
9843b4542A38542a3870A19389c2440j75608c5270m5339B3092b69111J18134e4962
$$ -24542 138542 -13870 119389 -32440 -208048 -35270 -80609 23092 -269111 -150977 -54962
9831b4636n6571A29822a31371B8340J74897i6564M7735p8144f1495l0922c8568
$$ -24636 -81207 129822 -131371 28340 203237 -96564 -48829 -126973 -61495 -92417 -38568
9819B04992I8811a51367j04738A21919j0802J64392a78165J4224j08905C9592
$$ 204992 98811 -151367 -256105 121919 111117 275509 -178165 -163941 -272846 39592
9808A51156a8776A92368d07275a42072k11589A14278i1157A09906l0903c7780
$$ 151156 -18776 192368 -407275 -142072 -353661 114278 -91157 109906 79003 -37780
9797B3719G605a16705M4923l38915d5242G5206h8127F5742O0781A057a87161H8428
$$ 23719 7605 -116705 -71782 -410697 -45242 75206 -88127 65742 126523 1057 -187161 88428
9784f4880k82492A13411b85652a05874j00914h4231L5726r6734B58781f5363j04412
$$ -64880 -347372 113411 -285652 -105874 -206788 -84231 -48505 -145239 258781 -65363 -169775
9773a69775j36939F2042B2693a2004j34870J8183F193J20916n665a47942M8122
$$ -169775 -306714 62042 22693 -12004 -146874 -128691 6193 127109 121444 -147942 -99820
9762i9820j19692k56655a85636k37382B4336J8387Q5653g132m9301j20416e3536
$$ -99820 -219512 -476167 -185636 -423018 24336 42723 128376 -7132 -56433 -176849 -53536
9750a47358A3418g4312A49964J01084a3407C7046f6696G6569a79669g2737p7736
$$ -147358 13418 -74312 149964 251048 -13407 37046 -66696 76569 -179669 -72737 -150473
9739a50473a9885j27730K121A81199a02150n5900K0814H411d3463r910B8447c38963
$$ -150473 -19885 -147615 -145494 181199 -102150 -158050 -137236 8411 -43463 -53373 28447 -338963
9726a19041D3407b82687B3215a24876q1735D5785i559k31483A05203J2513K1307
$$ -119041 43407 -282687 23215 -124876 -206611 45785 -9559 -241042 105203 117716 139023
9715A39023D8575J3287a44845B82651F5337M0941L7072b27765A02405a78998a1235
$$ 139023 48575 61862 -144845 282651 65337 106278 143350 -227765 102405 -178998 -11235
9703G2630K8662j6226a44155q1368J11091A22129A26b8544m51609a50521q8803
$$ 72630 101292 85066 -144155 -225523 -114432 122129 126 -28544 -480153 -150521 -239324
9692b39324i1830k86152c1033C15625N5305d01714A85819a44357Q992j52531d1998
$$ -239324 -91830 -377982 -31033 315625 370930 -401714 185819 -144357 -135365 -287896 -41998
9680h8431b6531j97315A142N7384c00295l621h5322a7239n8049m6758b4296A14450
$$ -88431 -26531 -223846 1142 58526 -300295 -303916 -85322 -17239 -75288 -122046 -24296 114450
9667E4893J63778b58694a15964A12132i1312l01088J52189O3663m6512A7398b34407
$$ 54893 218671 -258694 -115964 112132 -91312 -392400 -240211 -176548 -223060 17398 -234407
9655C1635a29297k78190B72940d18524D1347a06303k73220G4120N9529d6650F2885
$$ 31635 -129297 -407487 272940 -418524 41347 -106303 -379523 74120 133649 -46650 62885
9643a3036m687O309E3537e1714A27429c19864A41181a66930E8026b46337E068
$$ -13036 -17723 -11414 53537 -51714 127429 -319864 141181 -166930 58026 -246337 5068
9631C07916c2257q3013H3447c0615B09781a40565c3426p0658b7869i354b133j51462
$$ 307916 -32257 -115270 83447 -30615 209781 -140565 -33426 -104084 -27869 -9354 -2133 -153595
9619a53595g5518l14170J53028I5421N8408b12863J03823k7335o3446m3566B30150
$$ -153595 -75518 -389688 -236660 95421 153829 -212863 -109040 -136375 -199821 -243387 230150
9607b42797P4168k0660b042k32152a10474A75022l8337h775l68298a57911N3139
$$ -242797 -168629 -189289 -2042 -234194 -110474 175022 136685 -8775 -377073 -157911 -104772
9596a04772R258L6042B5709c77577c9250A01068b5926o274k40321B25703B879
$$ -104772 -95514 -59472 25709 -377577 -39250 101068 -25926 -32200 -272521 225703 2879
9584D8833J64796b58156A43436c85554J32739e7811A71553a90299j35959a61579
$$ 48833 213629 -258156 143436 -385554 -252815 -57811 171553 -190299 -326258 -161579
9573a27488r4104L5134n1883a7903j49781c0835e022A52076a12406k9000A07611
$$ -127488 -221592 -186458 -238341 -17903 -167684 -30835 -5022 152076 -112406 -141406 107611
9561b06013K9995j9817E3430c14512f132j50056q7836I5206O5745c24184a7774
$$ -206013 -176018 -195835 53430 -314512 -6132 -156188 -244024 95206 160951 -324184 -17774
9549a709I8191J5951J1359N40b25089A7400J93832H1113P676e36240b32311A49163
$$ -1709 98191 114142 125501 126041 -225089 17400 211232 81113 88789 -536240 -232311 149163
9536b97406k04575I7775c36241J08833j7779B38165d0648k70798a38108m5178
$$ -297406 -501981 97775 -336241 -227408 -245187 238165 -40648 -311446 -138108 -183286
9526a83286d5250A6557g9474k7721J5498j00019c2473H8968a1440A57934a10236
$$ -183286 -45250 16557 -79474 -107195 -91697 -191716 -32473 88968 -11440 157934 -110236
9514A81388H341P5670a68110q5366f9733j87099J23513B40897a76573o0332f4841
$$ 181388 8341 84011 -168110 -253476 -69733 -256832 -133319 240897 -176573 -236905 -64841
9502G7200c51364A4166a78106I0101a22323F9251a79524j75091a43579j12694
$$ 77200 -351364 14166 -178106 90101 -122323 69251 -179524 -354615 -143579 -256273
9492b56273B13440d6794j55198G3390b34879P4540A24081C0149b98855g7520A41732
$$ -256273 213440 -46794 -201992 73390 -234879 -160339 124081 30149 -298855 -77520 141732
9480B7712h9441I9833K172d30188i8469C3838a6374j12271B76667a63059p3647
$$ 27712 -89441 99833 102005 -430188 -98469 33838 -16374 -128645 276667 -163059 -236706
9469b36706l2016b8243q49A16353j1112A689b18845F7125c6855k75985d2558j10059
$$ -236706 -268722 -28243 -29092 116353 105241 1689 -218845 67125 -36855 -312840 -42558 -152617
9457a52617I2540a50785M389l4350B58321n3523I9271g0684j05910a2972B64025
$$ -152617 92540 -150785 -146396 -180746 258321 204798 99271 -70684 -176594 -12972 264025
9445A5520j895i3101q3267k11902G2222a17899r247b4132m905o6036b2498l60424
$$ 15520 13625 -93101 -176368 -388270 72222 -117899 -127146 -24132 -29037 -95073 -22498 -382922
9433c82922J23974h0844r151A18771J02842r1233b69616h8850r5236N7195E2230
$$ -382922 -258948 -80844 -89995 118771 221613 130380 -269616 -88850 -184086 -126891 52230
9421A94518b06206A12742p58L6151a30722r6234a7432l4438k3849k58153d6438
$$ 194518 -206206 112742 111984 148135 -130722 -226956 -17432 -51870 -75719 -333872 -46438
9409a00378A76859N5205A9089b1086o5073I4584a77898k20899J32890H7271l2733
$$ -100378 176859 232064 19089 -21086 -86159 94584 -177898 -398797 -265907 87271 54538
9398E4538i9945o6795B2026M4730c1918l17432e6224d454j41586r3373j6825J21350
$$ 54538 -99945 -166740 22026 66756 -31918 -349350 -56224 -4454 -146040 -239413 -256238 -134888
9386a34888A3829f7334m097B58153F2792J55908a72919N7039A21386a24815m878
$$ -134888 13829 -67334 -71431 258153 62792 218700 -172919 -115880 121386 -124815 -129693
9375a29693m9254m6665A35828b45266C4298K74475a2222o6551L9050B91321b24626
$$ -129693 -178947 -225612 135828 -245266 34298 308773 -12222 -78773 -39723 291321 -224626
9363E8205a56592B3740Q4514n0352b7359C9584J56474a28727A3450J679a23548
$$ 58205 -156592 23740 108254 57902 -27359 39584 196058 -128727 13450 15129 -123548
9351B278K70325c14336B5170P3024J80f6094p6031j17524m5050E7828a46231G7697
$$ 2278 272603 -314336 25170 98194 98374 -66094 -142125 -259649 -304699 57828 -146231 77697
9338a68179d3612B119a30994k32561a4577k24681a3827E1851J99017g8105q8186
$$ -168179 -43612 2119 -130994 -363555 -14577 -239258 -13827 51851 250868 -78105 -166291
9327a66291d4297j59613k96233E5822J71716b81930A5116b67042h7944H176c57584
$$ -166291 -44297 -203910 -500143 55822 227538 -281930 15116 -267042 -87944 8176 -357584
9315c1399l25970C9337a36636f1261k16873i915q0960A3600e4044k05574J08432
$$ -31399 -357369 39337 -136636 -61261 -278134 -9915 -90875 13600 -54044 -259618 -151186
9304a51186B50274r5762a72095k40581B9287K24723G6570a79107J4262f856k26410
$$ -151186 250274 154512 -172095 -412676 29287 254010 76570 -179107 -164845 -6856 -233266
9293b33266j67700m5198J42327B21412D0286a29870k96920A49205a45060j68807
$$ -233266 -400966 -446164 -303837 221412 40286 -129870 -426790 149205 -145060 -313867
9283c13867J10231P7247j62701M6596n4669B2748b04497c166A83279a82558F6774
$$ -313867 -203636 -126389 -289090 -242494 -297163 22748 -204497 -3166 183279 -182558 66774
9271A24860b22146G3693a05538d3185J5174A43523d2592m11099A53095b04007
$$ 124860 -222146 73693 -105538 -43185 -28011 143523 -42592 -453691 153095 -204007
9260a1633m1577n1541a5820o1471C537a01793l31288A94771b43484Q3955l74417
$$ -11633 -53210 -104751 -15820 -77291 3537 -101793 -433081 194771 -243484 -159529 -533946
9249e33946A34463b31278A38965a71372L2151a6346A50770a48164j01343M5874
$$ -533946 134463 -231278 138965 -171372 -139221 -16346 150770 -148164 -249507 -203633
9239b03633j47991a16232d202A32900J49094e28515H6193a91809D1709J448c04060
$$ -203633 -351624 -116232 -4202 132900 281994 -528515 86193 -191809 41709 43157 -304060
9227D3232g2250D4558b3476j66641A8384a44901k9121B4051J36150d450q6446
$$ 43232 -72250 44558 -23476 -190117 18384 -144901 -174022 24051 160201 -4450 -90896
9216i0896l0886B24101a3375q5856k37940Q5565n8247D5664f4470F6296a45156
$$ -90896 -121782 224101 -13375 -99231 -337171 -251606 -309853 45664 -64470 66296 -145156
9204a02812k9770G6443J55006H8364J67423b4822r9496N2127A41917A4455c27737
$$ -102812 -132582 76443 231449 88364 255787 -24822 -124318 -72191 141917 14455 -327737
9192B71676e0709J6707G30R0177b07759e4079j16629A3033a13465k665c8837a0514
$$ 271676 -50709 -34002 730 90907 -207759 -54079 -170708 13033 -113465 -116130 -38837 -10514
9179E8604K984j001b22997G587c79858J31157A150L56182h4050m6424j57116e8206
$$ 58604 61588 60587 -222997 7587 -379858 -248701 1150 357332 -84050 -130474 -287590 -58206
9166A02212a76343j86708d4295I3064i0202A53076j0340a88341M2546k58b3999
$$ 102212 -176343 -363051 -44295 93064 -90202 153076 142736 -188341 -145795 -146053 -23999
9154c67351G3220a32706j43519K4969G2471c48106B82564B857N8192b10195A20136
$$ -367351 73220 -132706 -276225 -251256 72471 -348106 282564 2857 61049 -210195 120136
9142A68212a57884j11150B77114b15009J01709O867o793I503c2054k3569p5363
$$ 168212 -157884 -269034 277114 -215009 -113300 -106433 -113226 9503 -32054 -55623 -130986
9131a30986B4062P6887J94786c17059M2081A98505B1200c45654a57840L6939N8087
$$ -130986 24062 100949 295735 -317059 -274978 198505 21200 -345654 -157840 -120901 -62814
9120f2814A32279C6338c74096g4605K5644J1507j54250g6088r348E6069h4270
$$ -62814 132279 36338 -374096 -74605 -48961 -37454 -191704 -76088 -85436 56069 -84270
9108B0985a0655c974k2297l66575A58977a23604F5891q002c57202f5653A1941
$$ 20985 -10655 -3974 -26271 -392846 158977 -123604 65891 57889 -357202 -65653 11941
9096b09875A80603a9483F9128J42688d64867a44773A24881a90553L9413E7752
$$ -209875 180603 -19483 69128 211816 -464867 -144773 124881 -190553 -151140 57752
9085D4016j8588J61188a73785A25427a33686d1080J8295q9311A52159a92201e3473
$$ 44016 25428 186616 -173785 125427 -133686 -41080 -22785 -112096 152159 -192201 -53473
9073F6828b93699R4506G1678K35559a61803K1711j22754g2938F6643b57817f9046
$$ 66828 -293699 -199193 71678 307237 -161803 -140092 -262846 -72938 66643 -257817 -69046
9061I7347a04643d4285n01757a00106o6476c3691j19242B33433i3154j83314A41156
$$ 97347 -104643 -44285 -546042 -100106 -166582 -33691 -152933 233433 -93154 -276468 141156
9049a06544q3775c3863Q917k6435j98759E6052c0313r2197A00913b5345l4872
$$ -106544 -190319 -33863 -24946 -51381 -250140 56052 -30313 -122510 100913 -25345 -60217
9038f0217A79472b61086E2132c86548B2079J31494M51C156K90478h8792D64948
$$ -60217 179472 -261086 52132 -386548 22079 153573 154024 3156 293634 -88792 464948
9026b95706D8229O1287d36353a79132l3125B36349e7006l34013B01414e3748q7110
$$ -295706 48229 109516 -436353 -179132 -212257 236349 -57006 -391019 201414 -53748 -140858
9015a40858d2803A44732g3620j97623a26107A29368O2030o0230n6224f4171j23344
$$ -140858 -42803 144732 -73620 -271243 -126107 129368 191398 131168 74944 -64171 -187515
9004a87515o8310I9688d72119A17161e323k52121b8851m2620A81427a19232B49399
$$ -187515 -255825 99688 -472119 117161 -5323 -257444 -28851 -71471 181427 -119232 249399
8992B62019a72716d0947p6653f524A7479i1830k09855a9823j6303J1211k79832
$$ 262019 -172716 -40947 -117600 -6524 17479 -91830 -301685 -19823 -36126 -24915 -304747
8981c04747b3568l43375A89374a87058q053j65147a5019j11124b8476K550k26996
$$ -304747 -23568 -366943 189374 -187058 -195111 -360258 -15019 -126143 -28476 -25926 -252922
8970b52922q3791O2711M1981p9543J08440C32711b45012C8039J96660c1898B86806
$$ -252922 -336713 -274002 -232021 -311564 -203124 332711 -245012 38039 234699 -31898 286806
8958c24143A28630j4964a05680j08190I6829c22400P5401g3019B2197Q5926a27712
$$ -324143 128630 113666 -105680 -213870 96829 -322400 -246999 -73019 22197 108123 -127712
8946I6710h8041k0314j05871r3815i6589B25259i859A05163B8149g0879E1115
$$ 96710 -88041 -108355 -214226 -308041 -96589 225259 -9859 105163 28149 -70879 51115
8934a35567e9379b0766l49635g5333H635a09495K9780G7981h9519H4383a52284
$$ -135567 -59379 -20766 -370401 -75333 8635 -109495 -79715 77981 -89519 84383 -152284
8922f6514B58648b67792J09256f1082A96888a72137C63673A5558c1918A56056
$$ -66514 258648 -267792 -158536 -61082 196888 -172137 363673 15558 -31918 156056
8911H1838h853A95051K06316j45960P1150L00079N68751J367249L122483j70039
$$ 81838 -8853 195051 401367 255407 326557 626636 1195387 2562636 5685119 5515080
8901E515080B217943q03010E08609k25995K56944j69397P0001k18336M7182g5219
$$ 5515080 2217943 1414933 508609 282614 539558 370161 440162 221826 269008 -75219
8890I3681a28180B1069J03144L4193c73416c0420B72338A34606K9068g717B70861
$$ 93681 -128180 21069 124213 158406 -373416 -30420 272338 134606 163674 -7717 270861
8878B92692J6697a35151j57624R8257Q3113f21q1485j39440c8735n9271j20915
$$ 292692 309389 -135151 -292775 -194518 -111405 -621 -82106 -221546 -38735 -98006 -218921
$$ [...]
##END NTUPLES=NMR SPECTRUM
##END=
