
##TITLE=AC1076_TOSA01_5835558_o7BCo1VUUa
##JCAMPDX= 6.0         $$ Bruker NMR JCAMP-DX V2.0
##DATA TYPE= NMR SPECTRUM
##DATA CLASS= NTUPLES
##ORIGIN= BRUKER
##OWNER= Administrator
$$ 1.72 TOPSPIN		Version 2.1
$$ 2012-04-16 19:10:17.046 -0500  Administrator@TOPSPIN
$$ Compression mode = diff/dup
##.OBSERVE FREQUENCY= 400.13188235
##.OBSERVE NUCLEUS= ^1H
##.ACQUISITION MODE= SIMULTANEOUS (DQD)
##.ACQUISITION SCHEME= undefined
##.AVERAGES= 64
##.DIGITISER RES= 22
##SPECTROMETER/DATA SYSTEM= spect
##.PULSE SEQUENCE= noesygpps1d.comp
##.SOLVENT NAME= COFFEE_meoh
##.SHIFT REFERENCE= INTERNAL, COFFEE_meoh, 1, 14.96863
##AUDIT TRAIL= $$ (NUMBER, WHEN, WHO, WHERE, PROCESS, VERSION, WHAT)
$$ ##TITLE= Audit trail, TOPSPIN		Version 2.1
$$ ##JCAMPDX= 5.01
$$ ##ORIGIN= Bruker BioSpin GmbH
$$ ##OWNER= Administrator
$$ $$ C:\Bruker\TOPSPIN/data/COFFEE/nmr/AC1076_TOSA01_5835558_o7BCo1VUUa/22/pdata/1/auditp.txt
$$ ##AUDIT TRAIL=  $$ (NUMBER, WHEN, WHO, WHERE, PROCESS, VERSION, WHAT)
(   1,<2012-04-15 11:39:43.843 -0500>,<Administrator>,<TOPSPIN>,<go>,<TOPSPIN 2.1>,
      <created by zg
	started at 2012-04-15 11:28:12.375 -0500,
	POWCHK enabled, PULCHK disabled,
       configuration hash MD5:
       1A 1E CE 29 27 FD 77 03 67 4E F0 E3 C4 B2 CB 90
       data hash MD5: 64K
       ED 72 B0 27 CA B4 81 36 11 B7 11 A9 45 4E 40 62>)
(   2,<2012-04-15 11:39:46.625 -0500>,<Administrator>,<TOPSPIN>,<proc1d>,<TOPSPIN 2.1>,
      <Start of raw data processing
       efp LB = 0.3 FT_mod = 6 PKNL = 1 PHC0 = 0 PHC1 = 0 SI = 128K 
       data hash MD5: 128K
       F6 A4 1F 6C 93 D0 52 3D 8B DA 90 82 84 67 92 8D>)
(   3,<2012-04-15 11:39:47.828 -0500>,<Administrator>,<TOPSPIN>,<proc1d>,<TOPSPIN 2.1>,
      <pk PHC0 = 35.59021 PHC1 = 0 
       data hash MD5: 128K
       B2 A0 87 38 06 F1 F8 26 2E 38 E3 76 1C 94 17 56>)
(   4,<2012-04-15 11:39:48.062 -0500>,<Administrator>,<TOPSPIN>,<proc1d>,<TOPSPIN 2.1>,
      <abs ABSG = 1 
       data hash MD5: 128K
       CE C8 D3 52 8F 3B 87 C9 9E 66 4B 9C 33 07 BA 0A>)
(   5,<2012-04-15 11:39:48.140 -0500>,<Administrator>,<TOPSPIN>,<proc1d>,<TOPSPIN 2.1>,
      <abs ABSG = 2 
       data hash MD5: 128K
       9E 6C 12 F5 4E 08 F3 02 44 CC 0F 83 A2 CF 75 37>)
(   6,<2012-04-15 11:39:48.375 -0500>,<Administrator>,<TOPSPIN>,<proc1d>,<TOPSPIN 2.1>,
      <abs ABSG = 3 
       data hash MD5: 128K
       62 2D 43 DA DE 71 EB 6A F4 F2 C0 40 E7 47 A5 86>)
(   7,<2012-04-15 11:39:48.437 -0500>,<Administrator>,<TOPSPIN>,<proc1d>,<TOPSPIN 2.1>,
      <abs ABSG = 4 
       data hash MD5: 128K
       60 58 C9 C3 54 8B 55 D5 FA FF 40 FD 7A 3C 23 58>)
(   8,<2012-04-15 11:39:48.500 -0500>,<Administrator>,<TOPSPIN>,<proc1d>,<TOPSPIN 2.1>,
      <abs ABSG = 5 
       data hash MD5: 128K
       6C 33 04 67 D2 F2 8F B5 93 DE 29 64 FC B1 4A 1E>)
(   9,<2012-04-15 11:39:48.734 -0500>,<Administrator>,<TOPSPIN>,<audit>,<TOPSPIN 2.1>,
      <user comment:
       ICON-NMR User ID: COFFEE
       data hash MD5: 128K
$$ [...]
##$TP07= 0
##$TPNAME0= <>
##$TPNAME1= <>
##$TPNAME2= <>
##$TPNAME3= <>
##$TPNAME4= <>
##$TPNAME5= <>
##$TPNAME6= <>
##$TPNAME7= <>
##$TPOAL= (0..7)
0.5 0.5 0.5 0.5 0.5 0.5 0.5 0.5
##$TPOFFS= (0..7)
0 0 0 0 0 0 0 0
##$TUNHIN= 0
##$TUNHOUT= 0
##$TUNXOUT= 0
##$USERA1= <user>
##$USERA2= <user>
##$USERA3= <user>
##$USERA4= <user>
##$USERA5= <user>
##$V9= 5
##$VALIST= <valist>
##$VCLIST= <CCCCCCCCCCCCCCC>
##$VD= 0
##$VDLIST= <DDDDDDDDDDDDDDD>
##$VPLIST= <PPPPPPPPPPPPPPP>
##$VTLIST= <TTTTTTTTTTTTTTT>
##$WBST= 2048
##$WBSW= 25
##$XGAIN= (0..3)
0 0 0 0
##$XL= 0
##$YL= 0
##$YMAX_a= 15399538
##$YMIN_a= -7152016
##$ZGOPTNS= <>
##$ZL1= 120
##$ZL2= 120
##$ZL3= 120
##$ZL4= 120
##$ABSF1= 14.96863
##$ABSF2= -5.5839
##$ABSG= 5
##$ABSL= 3
##$ALPHA= 0
##$AQORDER= 0
##$ASSFAC= 0
##$ASSFACI= 0
##$ASSFACX= 0
##$ASSWID= 0
##$AUNMP= <proc_prof1d_extract.lims>
##$AXLEFT= 0
##$AXNAME= <>
##$AXNUC= <1H>
##$AXRIGHT= 0
##$AXTYPE= 0
##$AXUNIT= <>
##$AZFE= 0.1
##$AZFW= 0.1
##$BCFW= 0
##$BC_mod= 0
##$BYTORDP= 0
##$COROFFS= 0
##$CY= 15
##$DATMOD= 1
##$DC= 0
##$DFILT= <>
##$DTYPP= 0
##$F1P= 0
##$F2P= 0
##$FCOR= 0.5
##$FTSIZE= 131072
##$FT_mod= 6
##$GAMMA= 0
##$GB= 0
##$INTBC= 1
##$INTSCL= 1
##$ISEN= 128
##$LB= 0.3
##$LEV0= 0
##$LPBIN= 0
##$MAXI= 10000
##$MC2= 0
##$MEAN= 0
##$ME_mod= 0
##$MI= 0
##$NCOEF= 0
##$NC_proc= -2
##$NLEV= 6
##$NOISF1= 0
##$NOISF2= 0
##$NSP= 0
##$NTH_PI= 0
##$NZP= 0
##$OFFSET= 14.96863
##$PC= 1
##$PHC0= 35.59021
##$PHC1= 0
##$PH_mod= 1
##$PKNL= yes
##$PPARMOD= 0
##$PPDIAG= 0
##$PPIPTYP= 0
##$PPMPNUM= 2147483647
##$PPRESOL= 1
##$PSCAL= 4
##$PSIGN= 0
##$PYNMP= <proc.py>
##$REVERSE= no
##$SF= 400.130004793981
##$SI= 131072
##$SIGF1= 0
##$SIGF2= 0
##$SINO= 400
##$SIOLD= 131072
##$SPECTYP= <>
##$SREGLST= <1H.CDCl3>
##$SSB= 0
##$STSI= 131072
##$STSR= 0
##$SW_p= 8223.68421052632
##$SYMM= 0
##$S_DEV= 0
##$TDeff= 65536
##$TDoff= 0
##$TI= <>
##$TILT= no
##$TM1= 0
##$TM2= 0
##$TOPLEV= 0
##$USERP1= <user>
##$USERP2= <user>
##$USERP3= <user>
##$USERP4= <user>
##$USERP5= <user>
##$WDW= 1
##$XDIM= 131072
##$YMAX_p= 297922887
##$YMIN_p= -231451131
##$CURPLOT= <Network HP LaserJet P1505>
##$CURPRIN= <$Network HP LaserJet P1505>
##$DFORMAT= <normdp>
##$LAYOUT= <+/1D_H.xwp>
##$LFORMAT= <normlp>
##$PFORMAT= <normpl>
##$SURQMSG= 1
$$ End of Bruker specific parameters
$$ ---------------------------------
##NTUPLES= NMR SPECTRUM
##VAR_NAME=  FREQUENCY,     SPECTRUM/REAL,   SPECTRUM/IMAG
##SYMBOL=    X,             R,               I
##VAR_TYPE=  INDEPENDENT,   DEPENDENT,       DEPENDENT
##VAR_FORM=  AFFN,          ASDF,            ASDF
##VAR_DIM=   131072,        131072,          131072
##UNITS=     HZ,            ARBITRARY UNITS, ARBITRARY UNITS
##FACTOR=    0.0627417313425165, 1,          1
##FIRST=     8223.62146879498, 64,           -58094
##LAST=      0,             1409,            -58520
##MIN=       0,             -231451131,      0
##MAX=       8223.62146879498, 297922887,    0
$$ Real data points
##PAGE= N=1
##DATA TABLE= (X++(R..R)), XYDATA
$$ [...]
63226B89106j281k95Q02J162P57K90K06L21L64L93O36J229K103K871K913K047
63210C03624J017Q07J445J997J801J191Q37R13J188J552K030K530K903L122L163
63195C30120K936K572K534L085L837M236M476N349P050Q634R053Q494Q195Q968
63181D09539J0380J1527J2151J2663J3385J4260J5179J6190J7293J8361J9342
63170E70270K0190K0607K0325J9712J9633K0399K1166K0759J8959J6669J4971
63159G83660J4298J4287J4174J3361J1928J0570R822R441Q670O992M457J406j832
63146I01234n035q150j1278j4453j7494k0072k1865k2653k2523k1966k1411k0589
63134F93745j8823j6155j3557j1686j0041p900n515l579j965N2K475M505N769
$$ y = [289106, 287825, 287530, 288332, 289494, 290251, 290541, 290747, 291068, 291432, 291825, 292461, 293690, 295793, 298664, 301577, 303624, 304641, 305448, 306893, 308890, 310691, 311882, 312719, 313632, 314820, 316372, 318402, 320932, 323835, 326957, 330120, 333056, 335628, 338162, 341247, 345084, 349320, 353796, 359145, 366195, 374829, 383882, 392376, 400571, 409539, 419919, 431446, 443597, 456260, 469645, 483905, 499084, 515274, 532567, 550928, 570270, 590460, 611067, 631392, 651104, 670737, 691136, 712302, 733061, 752020, 768689, 783660, 797958, 812245, 826419, 839780, 851708, 862278, 872100, 881541, 890211, 897203, 901660, 903066, 901234, 896199, 888049, 876771, 862318, 844824, 824752, 802887, 780234, 757711, 735745, 714334, 693745, 674922, 658767, 645210, 633524, 623483, 615583, 610068, 606489, 604524, 604576, 607051, 611556, 617325]
63121F17325O700P558Q071Q308Q955J0180J1016J0590R389Q636Q814R467J0052
63108G35061J0239R560P668N052K872J762J181J61j565l452n060o678q830j1315
63094G36656j3137j3626j3323j3331j3903j4269j3843j3021j2445j2072j1400
63083E92286j0254q901p576o336n275m498l997l725l661l632l273k464j548q39
63069E26307j89O15J408K018K767L919M964N079M303L551L425L666L874M065M282
63054E74054M281M039M034M581N212N221M575L868L487L300L074K803K611K531
63040F27671K507K472K410K420K535K456J733M18o78p36J72J237J874K115K172
63025F50778K088J998K274L090M133M980N599O159O567O645O606O966P898R079
$$ y = [617325, 624025, 631583, 639654, 647962, 656917, 667097, 678113, 688703, 698092, 706728, 715542, 725009, 735061, 745300, 754860, 762528, 767580, 770452, 772214, 773395, 773556, 771991, 768539, 763479, 756801, 747971, 736656, 723519, 709893, 696570, 683239, 669336, 655067, 641224, 628203, 615758, 603686, 592286, 582032, 573131, 565555, 559219, 553944, 549446, 545449, 541724, 538063, 534431, 531158, 528694, 527146, 526307, 526118, 526733, 528141, 530159, 532926, 536845, 541809, 546888, 551191, 554742, 558167, 561833, 565707, 569772, 574054, 578335, 582374, 586408, 590989, 596201, 601422, 605997, 609865, 613352, 616652, 619726, 622529, 625140, 627671, 630178, 632650, 635060, 637480, 640015, 642471, 644204, 644622, 643944, 643208, 643380, 644617, 646491, 648606, 650778, 652866, 654864, 657138, 660228, 664361, 669341, 674940, 681099, 687666, 694311, 700917, 707883, 715781, 724860]
63011G24860J0284J1687J3369J4893J5790J6184J6598J7237J7940J8731J9894
63000H97467K1472K3087K4507K5974K7755K9678L1366L2773L4152L5702L7351
62989A221284L8860L9877M0136L9731L9112L8671L8475L8470L8581L8482L7692
62978A649371L6243L4872L4114L3579L2651L1525L0768L0038K8134K4554K0157
62967A986006J5914J1584O167p61q643j6594k4015l0634l6321m0958m4358m6449
62955A770938m7460m7683m7041m5238m2411l9140l5664l1634k7022k2624j9124
62944A365897j6074j2563q617n157k665o28J567L877N994P843R373J0321J0559
62931A369727J0381J0094R632Q891Q175P822P514O440M231J379j385l908o652
$$ y = [724860, 735144, 746831, 760200, 775093, 790883, 807067, 823665, 840902, 858842, 877573, 897467, 918939, 942026, 966533, 992507, 1020262, 1049940, 1081306, 1114079, 1148231, 1183933, 1221284, 1260144, 1300021, 1340157, 1379888, 1419000, 1457671, 1496146, 1534616, 1573197, 1611679, 1649371, 1685614, 1720486, 1754600, 1788179, 1820830, 1852355, 1883123, 1913161, 1941295, 1965849, 1986006, 2001920, 2013504, 2019671, 2018910, 2010267, 1993673, 1969658, 1939024, 1902703, 1861745, 1817387, 1770938, 1723478, 1675795, 1628754, 1583516, 1541105, 1501965, 1466301, 1434667, 1407645, 1385021, 1365897, 1349823, 1337260, 1328643, 1323486, 1320821, 1320193, 1321760, 1325637, 1331631, 1339474, 1348847, 1359168, 1369727, 1380108, 1390202, 1399834, 1408725, 1416900, 1424722, 1432236, 1438676, 1442907, 1444286, 1442901, 1438993, 1432341]
62918A432341j0061j4090j8293k2182k5437k7945k9824l1386l2930l4420l5504
62907A150269l5882l5560l4628l3032l0830k8547k6816k5573k3981k1485j8663
62896H35272j6667j5826j5220j3783j1589r748r087r246r152q189o702n508n163
62883F99392n675o568p173p056o431n987o177o786p329p652p848p786p163o056
62869F03705n038m566m547m648m809n123n382n131m215l089k387k324k590k790
62855E47066k803k724k659k725l022l425l479k878k007j652k016k417k156j363
62841E11740p02m98n20m72k82KK25R7n06j243j704j988k483l088l186k526j669
62824D91197j253j227j039m52K10M42K8p52j290j105k98N67J047J123J022R17
$$ y = [1432341, 1422280, 1408190, 1389897, 1367715, 1342278, 1314333, 1284509, 1253123, 1220193, 1185773, 1150269, 1114387, 1078827, 1044199, 1011167, 980337, 951790, 924974, 899401, 875420, 853935, 835272, 818605, 802779, 787559, 773776, 762187, 752439, 743352, 734106, 724954, 716765, 710063, 704555, 699392, 693717, 687149, 679976, 672920, 666489, 660502, 654325, 647539, 640210, 632558, 624710, 616924, 609761, 603705, 598667, 594101, 589554, 584906, 580097, 574974, 569592, 564461, 560246, 557157, 554770, 552446, 549856, 547066, 544263, 541539, 538880, 536155, 533133, 529708, 526229, 523351, 521344, 519692, 517676, 515259, 513103, 511740, 511038, 510540, 510020, 509548, 509266, 509268, 509493, 509590, 509084, 507841, 506137, 504149, 501666, 498578, 495392, 492866, 491197, 489944, 488717, 487678, 487226, 487436, 487878, 487906, 487154, 485864, 484759, 484461, 485028, 486075, 487198, 488220, 489137]
62808D89137R04R61R14O34L04J91J97Ol45m62k38pO6J90M05L96J57K51Q85J304
62788D95850P61l33q28k83P00J372J484J094M02k08l96k35o2J4J05J96K38L69
62770E00240N85L78o33j792j901p72L90L95o82j910k517k228j158J57R80J094
62754D90626J012J227J522J426J003P57R76J524K174K749L100L301L741M745O131
62739E26014P438Q477R385J0253J0957J1400J1693J2169J3299J5381J8072K0462
62727F75000K1986K3094K4667K6931K9350L1550L3744L6176L8712M1230M3978
62716A026418M7136N0346N3092N5352N7496N9587O1150O1569O0436N7546N2947
62705A643075M7092M0596L3648K5892J6991P128l182j3493k3371l2289l9903m6310
$$ y = [489137, 490041, 491002, 491916, 492550, 492854, 493045, 493242, 493248, 492903, 492441, 492203, 492196, 492262, 492452, 492857, 493253, 493410, 493661, 494546, 495850, 496611, 496278, 495450, 495167, 495867, 497239, 498723, 499817, 500219, 500011, 499615, 499380, 499318, 499332, 499437, 499633, 499871, 500240, 500825, 501203, 500570, 498778, 496877, 496105, 496495, 496890, 496208, 494298, 491781, 489553, 488395, 488552, 489532, 490626, 491638, 492865, 494387, 495813, 496816, 497573, 498549, 500073, 502247, 504996, 508096, 511397, 515138, 519883, 526014, 533452, 541929, 551314, 561567, 572524, 583924, 595617, 607786, 621085, 636466, 654538, 675000, 696986, 720080, 744747, 771678, 801028, 832578, 866322, 902498, 941210, 982440, 1026418, 1073554, 1123900, 1176992, 1232344, 1289840, 1349427, 1410577, 1472146, 1532582, 1590128, 1643075, 1690167, 1730763, 1764411, 1790303, 1807294, 1814422, 1811240, 1797747, 1774376, 1742087, 1702184, 1655874]
62693A655874n1716n5990n8941o0828o2079o2515o1482n8911n5715n2845n0440
62682A024412m8122m5671m2987l9929l6678l3880l1852k9982k7494k4525k1806
62671F41486j9579j7626j6055j5159j4488j3121j1024r214q250p518o425n360
62659D97667m797m303l277k055j321r00j59P44J085J018J699L714O267Q251R530
62644E13163J0768J2533J4867J7373J9343K0170K0029J9888K0642K2421K4785
62633G15982K7218K9217L0350L0619L0571L0649L0588K9752K7876K5191K1887
62622A029900J7882J3110P787K279l153q452j3683j8816k3555k7455l0307l2286
62610I13251l3656l4456l4618l4221l3391l2089l0275k8256k6519k5170k3774
$$ y = [1655874, 1604158, 1548168, 1489227, 1428399, 1366320, 1303805, 1242323, 1183412, 1127697, 1074852, 1024412, 976290, 930619, 887632, 847703, 811025, 777145, 745293, 715311, 687817, 663292, 641486, 621907, 604281, 588226, 573067, 558579, 545458, 534434, 525220, 516970, 509452, 503027, 497667, 492870, 488567, 485290, 483235, 481914, 481014, 480855, 481599, 482684, 483702, 485401, 489115, 495382, 503633, 513163, 523931, 536464, 551331, 568704, 588047, 608217, 628246, 648134, 668776, 691197, 715982, 743200, 772417, 802767, 833386, 863957, 894606, 925194, 954946, 982822, 1008013, 1029900, 1047782, 1060892, 1068679, 1070958, 1067805, 1059353, 1045670, 1026854, 1003299, 975844, 945537, 913251, 879595, 845139, 810521, 776300, 742909, 710820, 680545, 652289, 625770, 600600, 576826]
62599E76826k1958j9997j8573j7887j7238j5657j3040j0475r219r334r641r107
62587D04700p993p302p388p539p020o010n240n011m939m584m047l736l729l549
62573C26613k777j766j392j953k651k508j633r55q58p83l34O2J7rN19J211J461
62556C12264J742L073N203O524O144N044M659N112N624N931O444P338Q359R445
62542C92906J0741J2028J2784J2977J3294J4427J6425J8805K0995K2705K4156
62531E72243K5935K8295L0696L2296L2863L2796L2379L1394K9534K6778K3334
62520H98543J9492J5550J1525P034J794l853r259j4183j8725k2663k5482k7041
62508H32732k7713k7824k7526k7206k7217k7100k5912k3659k1655k0878k0661
$$ y = [576826, 554868, 534871, 516298, 498411, 481173, 465516, 452476, 442001, 432782, 423448, 413807, 404700, 396707, 389405, 382017, 374478, 367458, 361448, 356208, 351197, 346258, 341674, 337627, 333891, 330162, 326613, 323836, 322070, 320678, 318725, 316074, 313566, 311933, 310978, 310120, 309337, 309003, 309065, 309082, 309073, 309592, 310803, 312264, 314006, 317079, 322282, 328806, 334950, 339994, 344653, 349765, 355389, 361320, 367764, 375102, 383461, 392906, 403647, 415675, 428459, 441436, 454730, 469157, 485582, 504387, 525382, 548087, 572243, 598178, 626473, 657169, 689465, 722328, 755124, 787503, 818897, 848431, 875209, 898543, 918035, 933585, 945110, 952144, 953938, 950085, 940826, 926643, 907918, 885255, 859773, 832732, 805019, 777195, 749669, 722463, 695246, 668146, 642234, 618575, 596920, 576042, 555381]
62497E55381j9680j7725j5769j4579j3987j3433j2620j1604j0681j0235j0356
62486D04712j0640j0561r969r014p836o599n634n147m873m283l136j668l73K67
62472C25246P9n61q79l25R94K506L547L686L137K909L931N882P393P746P664Q123
62456C81078R118J0155J1227J2506J3637J4226J4691J5692J7003J7791J7834J7594
62444E52552J7262J6608J5713J4918J4060J2531J0208P506M543J105k528n700
62432F58778q385j1133j3843j5652j6300j6569j6868j6545j5256j3937j3493j3381
62420D87416j2550j1091r850q909p669o218n318n017m382k966j569j136j515j812
62406D07414j433m31P53J547J574J167J225K243L653M535M770N096O003P040P326
$$ y = [555381, 535701, 517976, 502207, 487628, 473641, 460208, 447588, 435984, 425303, 415068, 404712, 394072, 383511, 373542, 364528, 356692, 350093, 344459, 339312, 334439, 330156, 327020, 325352, 324979, 325246, 325325, 324764, 323885, 323560, 324554, 327060, 330607, 334293, 337430, 340339, 344270, 350152, 357545, 365291, 372955, 381078, 390196, 400351, 411578, 424084, 437721, 451947, 466638, 482330, 499333, 517124, 534958, 552552, 569814, 586422, 602135, 617053, 631113, 643644, 653852, 661358, 665901, 667006, 664478, 658778, 650393, 639260, 625417, 609765, 593465, 576896, 560028, 543483, 528227, 514290, 500797, 487416, 474866, 463775, 453925, 445016, 437347, 431129, 425811, 420794, 416412, 413446, 411877, 410741, 409226, 407414, 405981, 405550, 406303, 407850, 409424, 410591, 411816, 414059, 417712, 422247, 427017, 432113, 438116, 445156, 452482]
62391D52482O542N174M025L687M264N265N682M616K168m43j943k263k451l409
62377D83396m982o372p148p554p970q389q515q209p679p212o878o604o403o260
62363C83221n840m733l120j835j379j207m43R37K146K698K850L033L406M088N144
62348C88966O166O459N919N227M884M665M354M321M778N040M345L060K216J998
62334D52398J583M84q11j730k314k664k418j453n73p08j606j954r24R78K713L744
62318D44745M203M515N303P159R956J2582J3996J4480J5301J7186J9674K2054
62306E91154K4204K6251K8121K9903L1982L4249L5824L6179L6019L6131L5889
62295I45906L3989L0388K6273K2142J7234J1204N036k84m910r251j2935j5599
$$ y = [452482, 459024, 464198, 468223, 471910, 476174, 481439, 487121, 491737, 493905, 493462, 491519, 489256, 486805, 483396, 478414, 472042, 464894, 457340, 449370, 440981, 432466, 424257, 416578, 409366, 402488, 395884, 389481, 383221, 377381, 372648, 369528, 367693, 366314, 365107, 364664, 365601, 367747, 370445, 373295, 376328, 379734, 383822, 388966, 395132, 401591, 407510, 412737, 417621, 422286, 426640, 430961, 435739, 440779, 445124, 448184, 450400, 452398, 453981, 454465, 453654, 451924, 449610, 446946, 444528, 443075, 442502, 441794, 440188, 438234, 437310, 438288, 441001, 444745, 448948, 453463, 458766, 465925, 475881, 488463, 502459, 516939, 532240, 549426, 569100, 591154, 615358, 641609, 669730, 699633, 731615, 765864, 801688, 837867, 873886, 910017, 945906, 979895, 1010283, 1036556, 1058698, 1075932, 1087136, 1092172, 1091888, 1086978, 1077727, 1064792, 1049193]
62283A049193j7895k0605k3315k5065k5938k6865k7989k8366k7434k5783k4206
62272G75732k2758k1151j9475j8091j7119j6375j5630j4759j3741j2626j1392
62261E92615r934q330o961o144n836n796n811n441m099j926j51J32o41j182j247
62246E29248j849l444n029n459m848m050l445k964k734k853k842k118r42j98j96
62231D86277k90J61J034J848K514L281M140M696M661M264M051M344N056N965O968
62216E38970P959Q697R111R625J0817J2638J4359J5439J6195J7303J8970K0856
62204G00939K2715K4574K6461K8255K9932L1624L3397L5184L6898L8379L9071
62193A047429L8099L4932K9910K3963J7862J1857N868j65o177j2000j7416k2164
$$ y = [1049193, 1031298, 1010693, 987378, 962313, 936375, 909510, 881521, 853155, 825721, 799938, 775732, 752974, 731823, 712348, 694257, 677138, 660763, 645133, 630374, 616633, 604007, 592615, 582681, 574351, 567390, 561246, 555410, 549614, 543803, 538362, 534263, 532337, 532186, 532318, 531677, 530495, 529248, 527399, 523955, 518926, 513467, 508619, 504569, 501124, 498160, 495426, 492573, 489731, 487613, 486671, 486473, 486277, 485987, 486148, 487182, 489030, 491544, 494825, 498965, 503661, 508322, 512586, 516637, 520981, 526037, 532002, 538970, 546929, 555626, 564737, 574362, 585179, 597817, 612176, 627615, 643810, 661113, 680083, 700939, 723654, 748228, 774689, 802944, 832876, 864500, 897897, 933081, 969979, 1008358, 1047429, 1085528, 1120460, 1150370, 1174333, 1192195, 1204052, 1209920, 1209755, 1203578, 1191578, 1174162, 1151998]
62181A151998k5981k8697l0393l1399l1934l1800l0623k8510k6156k4088k2121
62170H40296j9840j7420j5379j3620j1429q701o540o077o896p307o142l845j720
62157G15380o01m34p62j150j229p49K38J368K284K960L638M466N272N816O192
62142G42689O806P971R616J1438J3149J4569J5658J6572J7532J8555J9510K0430
62130I14495K1517K2667K3395K3377K2816K1965K0725J9030J7302J5960J4740
62119A137989J3054J0896Q826P195N946N164N171N964P114Q439J0213J2542J4918
62106A253431J6659J7553J7930J8301J8846J9033J7868J4997J1378Q348O187M234
62094A424765K156K16j630l755n803o734o398o020o456o963o458n149l901k732
$$ y = [1151998, 1126017, 1097320, 1066927, 1035528, 1003594, 971794, 941171, 912661, 886505, 862417, 840296, 820456, 803036, 787657, 774037, 762608, 753907, 747367, 741290, 734394, 727087, 720945, 717100, 715380, 714779, 714345, 713583, 712433, 711204, 710455, 710693, 712061, 714345, 717305, 720943, 725409, 730681, 736497, 742689, 749495, 757466, 767082, 778520, 791669, 806238, 821896, 838468, 856000, 874555, 894065, 914495, 936012, 958679, 982074, 1005451, 1028267, 1050232, 1070957, 1089987, 1107289, 1123249, 1137989, 1151043, 1161939, 1170765, 1177960, 1183906, 1189070, 1194241, 1200205, 1207319, 1215758, 1225971, 1238513, 1253431, 1270090, 1287643, 1305573, 1323874, 1342720, 1361753, 1379621, 1394618, 1405996, 1414344, 1420531, 1424765, 1426921, 1427137, 1425507, 1421752, 1415949, 1409215, 1402817, 1396797, 1390341, 1383378, 1376920, 1371771, 1367870, 1365138]
62080A365138j067Q86K250K854L492M695O075P080P834Q898J0525J2311J3531
62067A444502J3954J4319J5573J7535J8920J9121J9175K0342K2390K4125K5086
62056A655042K5725K6289K6570K6656K6895K7123K6805K6019K5498K5627K6144
62045A944393K6877K7933K9128L0022L0696L1709L3081L4104L4474L4847L5972
62034B293236L7823L9893M1757M3028M3332M2743M1936M1558M1798M2636M4072
62023B753812M5877M7557M8752M9331M9049M7693M5692M3998M3095M2562M1936
62012C259354M1453M1571M2115M2340M1684M0230L8508L6980L5507L3376L0047
62001C683165K5875K1748J8092J4588J0875O988L124n88m018p095r955j2677j5075
$$ y = [1365138, 1364071, 1364957, 1367207, 1370061, 1373553, 1378248, 1384323, 1391403, 1399237, 1408135, 1418660, 1430971, 1444502, 1458456, 1472775, 1488348, 1505883, 1524803, 1543924, 1563099, 1583441, 1605831, 1629956, 1655042, 1680767, 1707056, 1733626, 1760282, 1787177, 1814300, 1841105, 1867124, 1892622, 1918249, 1944393, 1971270, 1999203, 2028331, 2058353, 2089049, 2120758, 2153839, 2187943, 2222417, 2257264, 2293236, 2331059, 2370952, 2412709, 2455737, 2499069, 2541812, 2583748, 2625306, 2667104, 2709740, 2753812, 2799689, 2847246, 2895998, 2945329, 2994378, 3042071, 3087763, 3131761, 3174856, 3217418, 3259354, 3300807, 3342378, 3384493, 3426833, 3468517, 3508747, 3547255, 3584235, 3619742, 3653118, 3683165, 3709040, 3730788, 3748880, 3763468, 3774343, 3781331, 3784455, 3783867, 3779849, 3772754, 3762799, 3750122, 3735047]
61988C735047j7110j9234k1769k4162k5602k6102k6163k5646k4006k1631j9703
61977C483919j8588j7478j5865j4201j2714j0878q623o976o619o823o618o029
61965C352507n365m292k762j960k886m618n322m682l921l651l138j946q47n81
61951C306536o52j55Q94J703J893J924K302K846K885K013M15j592m043p012j0143
61936C299814j3145j6606k1467k7505l3200l7526m0951m4134m6562m7428m7167
61925B924123m6888m6686m5680m3610m1271l9235l7182l4785l2441l0651k9288
61914B496406k7802k5885k3681k1608k0045j8984j7981j6708j5402j4433j3599
61903B280278j2377j0718r078p653o174m467k750j253L5J210K372L808N846Q439
$$ y = [3735047, 3717937, 3698703, 3676934, 3652772, 3627170, 3601068, 3574905, 3549259, 3525253, 3503622, 3483919, 3465331, 3447853, 3431988, 3417787, 3405073, 3394195, 3385572, 3378596, 3371977, 3365154, 3358536, 3352507, 3347142, 3342850, 3340088, 3338128, 3335242, 3330624, 3325302, 3320620, 3316699, 3313048, 3309910, 3307964, 3307117, 3306536, 3305884, 3305729, 3306623, 3308326, 3310219, 3312143, 3314445, 3317291, 3320176, 3322189, 3322604, 3321012, 3316969, 3309957, 3299814, 3286669, 3270063, 3248596, 3221091, 3187891, 3150365, 3109414, 3065280, 3018718, 2971290, 2924123, 2877235, 2830549, 2784869, 2741259, 2699988, 2660753, 2623571, 2588786, 2556345, 2525694, 2496406, 2468604, 2442719, 2419038, 2397430, 2377385, 2358401, 2340420, 2323712, 2308310, 2293877, 2280278, 2267901, 2257183, 2248105, 2240452, 2234278, 2229811, 2227061, 2225808, 2225843, 2227053, 2229425, 2233233, 2239079, 2247518]
61889B247518J1195J3867J6541J9373K2368K5419K8346L1000L3465L5959L8329
61878B523380M0036M0942M1743M3039M4422M5056M4961M4935M5413M6132M6876
61867C006935M7751M8755M9767N1186N3927N8586O5120P3412Q3598R5692J09406
61856C744135J24545J41081J58802J77335J96572K16591K37123K57706K78432
61847E532322K99865L22171L44947L68080L91894M15945M38215M55849M65993
61838I035281M65299M49184M12534L51733K66446J60381M1035q1790j98283l00645
61828A0601175l83939m46147m87797n11105n18823n13719m98767m76970m50577
61819F313331m20907l89235l57351l26771k97855k70303k44208k20093j98081
$$ y = [2247518, 2258713, 2272580, 2289121, 2308494, 2330862, 2356281, 2384627, 2415627, 2449092, 2485051, 2523380, 2563416, 2604358, 2646101, 2689140, 2733562, 2778618, 2823579, 2868514, 2913927, 2960059, 3006935, 3054686, 3103441, 3153208, 3204394, 3258321, 3316907, 3382027, 3455439, 3539037, 3634729, 3744135, 3868680, 4009761, 4168563, 4345898, 4542470, 4759061, 4996184, 5253890, 5532322, 5832187, 6154358, 6499305, 6867385, 7259279, 7675224, 8113439, 8569288, 9035281, 9500580, 9949764, 10362298, 10714031, 10980477, 11140858, 11181893, 11100103, 10901820, 10601175, 10217236, 9771089, 9283292, 8772187, 8253364, 7739645, 7240878, 6763908, 6313331, 5892424, 5503189, 5145838, 4819067, 4521212, 4250909, 4006701, 3786608, 3588527]
61810C588527j77765j58858j41508j25780j11277r7482q4281p1944o0685n0328
61800B508619m0471l0934k1928j3670o002J350Q188J3915J8232K1451K3907K5432
61788B508089K5689K4721K2874K0286J6745J2044O386N11m529p930r652j0199
61776B605035r854q415n776k415R76M059O751Q716R372Q340N642J524l602r192
61762B611161j4722j9928k4736k8955l2243l4306l5020l4341l2245k8796k4125
61751B301744j8397j1880n059J522P664J3719K0255K7475L5031M2440M9621N6871
61739B521006O4453P2396Q0683Q9365R8410J07738J17582J28507J40834J54283
61729C575257J68556J84010K01419K21109K42784K66212K91742L20071L51719
$$ y = [3588527, 3410762, 3251904, 3110396, 2984616, 2873339, 2775857, 2691576, 2619632, 2558947, 2508619, 2468148, 2437214, 2415286, 2401616, 2395614, 2396964, 2405152, 2419067, 2437299, 2458750, 2482657, 2508089, 2533778, 2558499, 2581373, 2601659, 2618404, 2630448, 2636834, 2637345, 2632816, 2624886, 2615234, 2605035, 2595181, 2586766, 2580990, 2578575, 2579551, 2583610, 2590361, 2599077, 2608449, 2616789, 2622431, 2623955, 2620353, 2611161, 2596439, 2576511, 2551775, 2522820, 2490577, 2456271, 2421251, 2386910, 2354665, 2325869, 2301744, 2283347, 2271467, 2266408, 2267930, 2275594, 2289313, 2309568, 2337043, 2372074, 2414514, 2464135, 2521006, 2585459, 2657855, 2738538, 2827903, 2926313, 3034051, 3151633, 3280140, 3420974, 3575257, 3743813, 3927823, 4129242, 4350351, 4593135, 4859347, 5151089, 5471160, 5822879]
61720E822879L86689M24439M64192N05521N48648N93985O41472O90475P39903
61711A0818203P87887Q31265Q65617Q85521Q84384Q54305P87304O77856N25367
61702A7917709L35575J20589j02807l16725n06084o60871p76520q53505q96289
61693A4261072r11132r03714q78512q39792p92044p39106o83651o27866n73942
61684G311313n23404m76483m32743l92022l54553l20590k90266k63420k39266
61675D018566k16754j95593j76510j60113j45954j33133j21348j10870j01738
61666B656553r3578q6101p9457p4107p0518o8644o7582o6120o3776o1028n8374
61655A867268n5776n3195n0906m8810m6135m2480l8621l5571l3256l0897k8449
$$ y = [5822879, 6209568, 6634007, 7098199, 7603720, 8152368, 8746353, 9387825, 10078300, 10818203, 11606090, 12437355, 13302972, 14188493, 15072877, 15927182, 16714486, 17392342, 17917709, 18253284, 18373873, 18271066, 17954341, 17448257, 16787386, 16010866, 15157361, 14261072, 13349940, 12446226, 11567714, 10727922, 9935878, 9196772, 8513121, 7885255, 7311313, 6787909, 6311426, 5878683, 5486661, 5132108, 4811518, 4521252, 4257832, 4018566, 3801812, 3606219, 3429709, 3269596, 3123642, 2990509, 2869161, 2758291, 2656553, 2562975, 2476874, 2397417, 2323310, 2252792, 2184148, 2116566, 2050446, 1986670, 1925642, 1867268, 1811492, 1758297, 1707391, 1658581, 1612446, 1569966, 1531345, 1495774, 1462518, 1431621, 1403172]
61644A403172k6716k6124k6107k5810k4863k3394k1703k0117j8817j7770j6950
61633A154801j6468j6334j6323j6256j6135j5758j4714j3077j1647j0964j0595
61622I96530r976r440r643j0326j0585j0184r729r539r218q446p488o724o267
61609H78965o127o208o154n703n189n090n113m496l236k226k000k064j757r96
61595H22606O2J397K674L193K843K562L220M514N497N830N859N749N304M554L889
61580H79753L526L300L065K950L129L564M078M542M988N567O375P119P192O233
61566I45381M566K891J556L00j391l807o747r582j1668j2877j3677j4512j5199
61553H65234j5154j4194j2868j1872j1343j0863j0131r330q783q417p864p050
$$ y = [1403172, 1376456, 1350332, 1324225, 1298415, 1273552, 1250158, 1228455, 1208338, 1189521, 1171751, 1154801, 1138333, 1121999, 1105676, 1089420, 1073285, 1057527, 1042813, 1029736, 1018089, 1007125, 996530, 986554, 977114, 967471, 957145, 946560, 936376, 926647, 917108, 907890, 899444, 891956, 885232, 878965, 872838, 866630, 860476, 854773, 849584, 844494, 839381, 834885, 831649, 829423, 827423, 825359, 823602, 822606, 822668, 824065, 826739, 829932, 832775, 835337, 838557, 843071, 848568, 854398, 860257, 866006, 871310, 875864, 879753, 883279, 886579, 889644, 892594, 895723, 899287, 903365, 907907, 912895, 918462, 924837, 931956, 939148, 945381, 949947, 952838, 954394, 954694, 953303, 949496, 942749, 933167, 921499, 908622, 894945, 880433, 865234, 850080, 835886, 823018, 811146, 799803, 788940, 778809, 769479, 760696, 752279, 744415, 737365]
61541G37365o336n925n442m431l057j980j573j550j314l66J407L501M933N102
61527G20334M567M515N378O453P040P367Q056R216J0549J1963J3458J4661J5141
61514H38698J5182J5644J6930J8570J9980K1136K2228K3136K3693K4148K4867
61503A064212K5621K5699K4879K3827K3318K3336K3270K2773K2008K1167K0159
61492A320269J8958J7856J7013J6011J4243J1745R309P600O355M703K159r10l783
61479A441528o087p826q999r551r691r787r792r087p225m554j752R49L615N991
61465A367732P734R244J1510J4971J9186K3778K8893L4435L9705M4476M9672N6139
61453A707475O3292O9977P6315Q3574R2288J01612J10719J19835J29520J39704
$$ y = [737365, 731029, 725104, 719662, 715231, 712174, 710194, 708621, 707071, 705757, 705391, 706798, 710299, 715232, 720334, 724901, 729416, 734794, 741247, 748287, 755654, 763710, 772926, 783475, 795438, 808896, 823557, 838698, 853880, 869524, 886454, 905024, 925004, 946140, 968368, 991504, 1015197, 1039345, 1064212, 1089833, 1115532, 1140411, 1164238, 1187556, 1210892, 1234162, 1256935, 1278943, 1300110, 1320269, 1339227, 1357083, 1374096, 1390107, 1404350, 1416095, 1425404, 1433004, 1439359, 1444062, 1446221, 1445311, 1441528, 1435441, 1427615, 1418616, 1409065, 1399374, 1389587, 1379795, 1370708, 1363483, 1358929, 1357177, 1358126, 1361741, 1367732, 1375466, 1384710, 1396220, 1411191, 1430377, 1454155, 1483048, 1517483, 1557188, 1601664, 1651336, 1707475, 1770767, 1840744, 1917059, 2000633, 2092921, 2194533, 2305252, 2425087, 2554607, 2694311]
61443B694311J49950J59973J69395J77442J83307J86349J85569J79533J67343
61434D253172J49295J26064R7827O5079L0074l704l3800n9914q2586j01501j15619
61423D324387j24558j29046j30126j28372j24080j17671j09662j00475r0539q0410
61413C189448p0460o0528n0249l9676k9291j9424j0165j775N322J1276J7001K3110
61401B964589K9145L4267L8395M1920M4650M5895M5649M4860M4289M3699M2606
61390C419964M1223M0260M0101M0577M1346M2116M2663M2871M2701M2070M0946
61379C876838L9534L8048L6214L3436K9601K5300K0996J6396J1013N025r32o563
61367D124906j2096j7711k3169k7982l1730l4242l5641l6105l5521l3639l0707
$$ y = [2694311, 2844261, 3004234, 3173629, 3351071, 3534378, 3720727, 3906296, 4085829, 4253172, 4402467, 4528531, 4626358, 4691437, 4721511, 4717807, 4684007, 4624093, 4541507, 4440006, 4324387, 4199829, 4070783, 3940657, 3812285, 3688205, 3570534, 3460872, 3360397, 3269858, 3189448, 3118988, 3058460, 3008211, 2968535, 2939244, 2919820, 2909655, 2907880, 2913202, 2924478, 2941479, 2964589, 2993734, 3028001, 3066396, 3108316, 3152966, 3198861, 3244510, 3289370, 3333659, 3377358, 3419964, 3461187, 3501447, 3541548, 3582125, 3623471, 3665587, 3708250, 3751121, 3793822, 3835892, 3876838, 3916372, 3954420, 3990634, 4024070, 4053671, 4078971, 4099967, 4116363, 4127376, 4132401, 4131469, 4124906, 4112810, 4095099, 4071930, 4043948, 4012218, 3977976, 3942335, 3906230, 3870709, 3837070, 3806363]
61356C806363k7536k4623k1564j7794j3614r891o965m495k348r23l48J6P65J480
61342C678523J093p64l109m464m159k731r84J152M654J0320J7944K6672L5935
61329C760082M5709N6038O6882P8458R1280J05480J20359J34873J48490J61279
61319D768930J73197J83650J91798J96985J98626J95829J87528J73064J52458
61310F422065J26149R4851O0023K4137j0199m1566p0023r6001j19356j39549j56323
61299F094208j69722j79757j86365j89720j90190j88114j83785j77593j69951
61290D459011j61245j52065j43219j35114j27188j18541j09057r9486r0339q1255
61280C241502p1703o1821n2217m3238l4846k6916j9262j1545l637L989J0590J5909
$$ y = [3806363, 3778827, 3754204, 3732640, 3714846, 3701232, 3691341, 3684376, 3679881, 3677533, 3676610, 3676262, 3676278, 3677043, 3678523, 3679616, 3678852, 3675743, 3671279, 3667120, 3664389, 3663405, 3664557, 3669211, 3679531, 3697475, 3724147, 3760082, 3805791, 3861829, 3928711, 4007169, 4098449, 4203929, 4324288, 4459161, 4607651, 4768930, 4942127, 5125777, 5317575, 5514560, 5713186, 5909015, 6096543, 6269607, 6422065, 6548214, 6643065, 6703088, 6727225, 6717026, 6675460, 6605437, 6509436, 6390080, 6250531, 6094208, 5924486, 5744729, 5558364, 5368644, 5178454, 4990340, 4806555, 4628962, 4459011, 4297766, 4145701, 4002482, 3867368, 3740180, 3621639, 3512582, 3413096, 3322757, 3241502, 3169799, 3107978, 3055761, 3012523, 2977677, 2950761, 2931499, 2919954, 2916317, 2920306, 2930896, 2946805]
61268B946805K0269K3925K6717K8517K9632L0452L0923L0636K9358K7257K4671
61257C249162K1953J9506J7647J6275J4874J3054J1023R306Q005O583M503J803
61245C393694j195m586q877j4157j9631k4256k7707l0481l3168l5844l8208l9987
61233C115597m1141m1846m2318m2504m1967m0306l7696l4810l2101k9469k6582
61222B704857k3228j9273j4746j0228o725m758l787k903j818q45j46M15Q41J015
61208B618671J140J678K802M277N873P382Q358Q407P938Q023R374J1870J5310
61195B711103J9879K5554L1624L7345M2842M8893N5931O3444P0134P4541P5900
61184C257190P4477P0706O3973N2901L7061J7643l841k6533m9365p0274q7429
$$ y = [2946805, 2967074, 2990999, 3017716, 3046233, 3075865, 3106317, 3137240, 3167876, 3197234, 3224491, 3249162, 3271115, 3290621, 3308268, 3324543, 3339417, 3352471, 3363494, 3372800, 3380805, 3387388, 3391891, 3393694, 3392499, 3387913, 3379036, 3364879, 3345248, 3320992, 3293285, 3262804, 3229636, 3193792, 3155584, 3115597, 3074456, 3032610, 2990292, 2947788, 2905821, 2865515, 2827819, 2793009, 2760908, 2731439, 2704857, 2681629, 2662356, 2647610, 2637382, 2630657, 2625899, 2622112, 2619209, 2617391, 2616546, 2616400, 2616815, 2617656, 2618671, 2619811, 2621489, 2624291, 2628568, 2634441, 2641823, 2650181, 2658588, 2666526, 2674549, 2683923, 2695793, 2711103, 2730982, 2756536, 2788160, 2825505, 2868347, 2917240, 2973171, 3036615, 3106749, 3181290, 3257190, 3331667, 3402373, 3466346, 3519247, 3556308, 3573951, 3570110, 3543577, 3494212, 3423938, 3336509]
61173C336509j00661j10679j17367j20100j19347j16635j12825j07660j01187
61164B330048r4329q7712q0949p3743o6659o0235n4120m7831m1783l6722l2602
61153A653363k8766k4980k1543j8533j5554j2351r184o457m157j795J113M417
61141A515573P238Q819R415J0001J1001J1698J1147R294O935M888L493K598J696
61128A613796K10k013m508o688q425j0101j2170j4743j7487j9862k1586k2865
61116A473558k4024k5063k5839k6464k7090k7507k7459k7267k7465k7894k7849
61105A179637k7203k6634k6473k6185k5264k3937k2539k0987j9369j8310j8079
61094I24657j7927j7050j5712j4731j4302j4137j4365j5308j6548j7057j6324
$$ y = [3336509, 3235848, 3125169, 3007802, 2887702, 2768355, 2651720, 2538895, 2431235, 2330048, 2235719, 2148007, 2067058, 1993315, 1926656, 1866421, 1812301, 1764470, 1722687, 1685965, 1653363, 1624597, 1599617, 1578074, 1559541, 1543987, 1531636, 1522452, 1515995, 1511838, 1510043, 1511156, 1515573, 1522811, 1531630, 1541045, 1551046, 1562047, 1573745, 1584892, 1594186, 1601121, 1606009, 1609502, 1612100, 1613796, 1614006, 1611993, 1607485, 1600797, 1592372, 1582271, 1570101, 1555358, 1537871, 1518009, 1496423, 1473558, 1449534, 1424471, 1398632, 1372168, 1345078, 1317571, 1290112, 1262845, 1235380, 1207486, 1179637, 1152434, 1125800, 1099327, 1073142, 1047878, 1023941, 1001402, 980415, 961046, 942736, 924657, 906730, 889680, 873968, 859237, 844935, 830798, 816433, 801125, 784577, 767520, 751196]
61083G51196j4764j3015j1352r778q221o623n176m285l933l387k024k03J275K264
61069F71974L176M104M832N616O909Q326Q775Q001P188P521Q714R494R119P992
61055G71741O988O618O778O958O770O280N817N445M804L555J803M0j269k092k892
61040H27344m164n760o911p161p013p281q032q681q929r017r101r032q860r008
61026G18394r714j0660j1341j1437j0791r493q081p234p021o849o322n726n415
61013F08310n133m345k950j327N2Q22P56J9o79o05K96J399K174K645L084L450
60997F07968L481L235L222L738M314M232L510K913K905L159L308L628M503N687
60983F59803O646P369Q223R231J0096J0796J1517J2109J2280J2310J2915J4280
$$ y = [751196, 736432, 723417, 712065, 702287, 694066, 687443, 682267, 677982, 674049, 670662, 668638, 668435, 669710, 671974, 675150, 679254, 684086, 689702, 696611, 704937, 713712, 721713, 728901, 736422, 745136, 754630, 763749, 771741, 778729, 785347, 792125, 799083, 805853, 812133, 817950, 823395, 828199, 831754, 833557, 833597, 832328, 830236, 827344, 823180, 817420, 810509, 803348, 796335, 789054, 781022, 772341, 763412, 754395, 745294, 736262, 727402, 718394, 708680, 698020, 686679, 675242, 664451, 654958, 646877, 639643, 632622, 625773, 619451, 613725, 608310, 603177, 598832, 595882, 594555, 594607, 595429, 596185, 596204, 595525, 594920, 595216, 596615, 598789, 601434, 604518, 607968, 611449, 614684, 617906, 621644, 625958, 630190, 633700, 636613, 639518, 642677, 645985, 649613, 654116, 659803, 666449, 673818, 682041, 691272, 701368, 712164, 723681, 735790, 748070, 760380, 773295, 787575]
60971G87575J5828J7013J7758J8087J8037J8037J8664J9724K0274J9882J9257
60960I90136J9275K0019K1161K2677K4611K6672K8644L0866L3687L6707L9240
60949A293695M1411M4181M8215N3144N8128O2863O7835P3582P9848Q5777R1129
60938A999808R7018J04862J14832J26070J38433J52988J70457J90192K11334K34177
60928C540171K59547K87633L18448L52928L92468M37685M88714N46434O12378
60919G236406O87824P74256Q74275R90368J122677J268494J419771J552607J616481
60910A7543159J545810J302325R18278M94695J46696n7953j16229o4383M6415
60901B1758813J48858J58198L839l20409p38744j134049j413950j548402j559932
$$ y = [787575, 803403, 820416, 838174, 856261, 874298, 892335, 910999, 930723, 950997, 970879, 990136, 1009411, 1029430, 1050591, 1073268, 1097879, 1124551, 1153195, 1184061, 1217748, 1254455, 1293695, 1335106, 1379287, 1427502, 1480646, 1538774, 1601637, 1669472, 1743054, 1822902, 1908679, 1999808, 2096826, 2201688, 2316520, 2442590, 2581023, 2734011, 2904468, 3094660, 3305994, 3540171, 3799718, 4087351, 4405799, 4758727, 5151195, 5588880, 6077594, 6624028, 7236406, 7924230, 8698486, 9572761, 10563129, 11685806, 12954300, 14374071, 15926678, 17543159, 19088969, 20391294, 21309572, 21804267, 21950963, 21893010, 21776781, 21712398, 21758813, 21907671, 22065869, 22069708, 21749299, 21010555, 19876506, 18462556, 16914154, 15354222]
60892A5354222j491096j380300j254355j129321j012622r05709q07216p15222
60884F658381o28523n47512m74168m10479l56847l12350k75944k46584k22457
60875C183517k01476j82834j67096j54273j42694j30635j18424j07898r9886r3321
60865A784980q6980q1040p6214p2092o7433o1996n7009n3496n0916m8022m4567
60854A085215m1339l8724l6096l2843k9289k6151k3573k1253j9228j7807j6771
60843G82141j5404j3539j1972j1363j1212j0504r067p602o516n459m131k910k257
60830F70205k077k029k066k198k114j627j235j624k652l495l842m375n740p494
60816F27637q511q299p469o907o817o707o229n670n463n460n115m305l512l006
$$ y = [15354222, 13863126, 12482826, 11228471, 10099150, 9086528, 8180819, 7373603, 6658381, 6029858, 5482346, 5008178, 4597699, 4240852, 3928502, 3652558, 3405974, 3183517, 2982041, 2799207, 2632111, 2477838, 2335144, 2204509, 2086085, 1978187, 1878301, 1784980, 1698000, 1616960, 1540746, 1468654, 1401221, 1339225, 1282216, 1228720, 1177804, 1129782, 1085215, 1043876, 1005152, 969056, 936213, 906924, 880773, 857200, 835947, 816719, 798912, 782141, 766737, 753198, 741226, 729863, 718651, 708147, 699080, 691478, 684962, 679503, 675372, 672462, 670205, 668128, 666099, 664033, 661835, 659721, 658094, 656859, 655235, 652583, 649088, 645246, 640871, 635131, 627637, 619126, 610827, 603358, 596451, 589634, 582927, 576698, 571028, 565565, 560105, 554990, 550685, 547173, 544167]
60802E44167k327r99O82J996K705L158L641M187M904N939P162Q311R415J0581
60788F03522J1520J1843J1841J2247J3171J3943J4133J4070J4008J3508J2091
60777G45897J0016P944O219M873L934L286K614J804J079M26o39k305l888m636
60763G76624m754n006n632o248o678p118p501p407o788o309o667p814q950r254
60749F80498q604p708p319p306o871n796m905m825m931m235k908j930j466p17
60735F10977N85J605J748J656K303L767N483P089Q412R106Q993Q491Q162Q045
60721F86422P965Q071Q463Q577P756O365N514N676O295O869P571Q469Q969Q570
60707G91552P614O695N802M752L957L917M134L559K138J006P73N96n16k126k964
$$ y = [544167, 541840, 540841, 541523, 543519, 546224, 549382, 553023, 557210, 562114, 568053, 575215, 583526, 592941, 603522, 615042, 626885, 638726, 650973, 664144, 678087, 692220, 706290, 720298, 733806, 745897, 755913, 763857, 770076, 774949, 778883, 782169, 784783, 786587, 787666, 788092, 787453, 785148, 781260, 776624, 771870, 766864, 761232, 754984, 748306, 741188, 733687, 726280, 719492, 713183, 706516, 698702, 689752, 680498, 671894, 664186, 656867, 649561, 642690, 636894, 631989, 627164, 622233, 617998, 615090, 613160, 611694, 610977, 611562, 613167, 614915, 616571, 618874, 622641, 628124, 635213, 643625, 652731, 661724, 670215, 678377, 686422, 694387, 702458, 710921, 719498, 727254, 733619, 739133, 744809, 751104, 757973, 765544, 774013, 782982, 791552, 799166, 805861, 811663, 816415, 820372, 824289, 828423, 831982, 834120, 835126, 835899, 836495, 835979, 833853, 830889]
60692H30889k666k098k005k172k069j743j690k161k903l473l724m025m873o201
60678G89086p192p109o184n323n019m975m782m512m417m487m483m225l603k648
60664G20127j660j077j095j557k207k732k658j728m23L37K72jN1J88J3l18m71
60647G05061n55q01j016r27q16j172j899k495k873l412m184m767m941n075n612
60632F64516o580p662q491q770q491q015p725p567p251o842o728p011p341p354
60618E58688o890n774l988k145j204j350j633j086J89J475K473L391M157M331
60604E50634L867L440L729M630N434N601N180M536L956L548L408L613M056M434
60590F10066M548M591M909N506N957N907N511N221N206N227N077M946N192N822
$$ y = [830889, 828223, 826125, 824120, 821948, 819879, 818136, 816446, 814285, 811382, 807909, 804185, 800160, 795287, 789086, 781894, 774785, 768601, 763278, 758259, 753284, 748502, 743990, 739573, 735086, 730603, 726378, 722775, 720127, 718467, 717390, 716295, 714738, 712531, 709799, 707141, 705413, 704990, 705327, 705599, 705598, 705649, 705837, 705850, 705532, 705061, 704506, 703705, 702689, 701762, 700946, 699774, 697875, 695380, 692507, 689095, 684911, 680144, 675203, 670128, 664516, 657936, 650274, 641783, 633013, 624522, 616507, 608782, 601215, 593964, 587122, 580394, 573383, 566042, 558688, 551798, 546024, 542036, 539891, 538687, 537337, 535704, 534618, 534807, 536282, 538755, 542146, 546303, 550634, 554501, 557941, 561670, 566300, 571734, 577335, 582515, 587051, 591007, 594555, 597963, 601576, 605632, 610066, 614614, 619205, 624114, 629620, 635577, 641484, 646995, 652216, 657422, 662649, 667726, 672672, 677864, 683686]
60576F83686O437O777P095P766Q591Q930Q572Q101Q070Q137P496O052M588L701
60562G83999L056J961K89j523l109m399n365n971o404o992p660p785o872n331
60548G27894m248m221m587m094k386n37J35m11j003p79j60l0n00r95j253j534
60532G01291j839j673q22J79Q31J361K205L172L752L924L944L619K651J602J536
60517G25733K456L071K486J257K97l51r33j045l38L92Nj328k388k651k698k935
60501G21030l046k958l223l969m466m150l302k277q84Q88K433L438M590O507Q650
60486G19261J0085J0896J1898J3345J4781J6024J7399J9073K0895K2937K5469
60475I02063K8327L0834L2365L2511L0802K6880K1154J4640Q039J379n260j1159
$$ y = [683686, 690123, 696900, 703995, 711761, 720352, 729282, 737854, 745955, 754025, 762162, 769658, 775710, 780298, 783999, 787055, 789016, 789305, 787782, 784673, 780274, 774909, 768938, 762534, 755542, 747882, 740097, 733225, 727894, 723646, 719425, 714838, 710744, 708358, 707821, 707956, 707545, 706542, 705763, 705603, 705573, 705073, 704078, 702825, 701291, 699452, 697779, 696957, 697136, 697967, 699328, 701533, 704705, 708457, 712381, 716325, 719944, 722595, 724197, 725733, 728189, 731260, 733746, 735003, 735300, 734949, 734016, 732971, 732633, 733025, 733030, 731702, 729314, 726663, 723965, 721030, 717984, 715026, 711803, 707834, 703368, 699218, 695916, 693639, 692755, 693643, 696076, 699514, 704104, 710611, 719261, 729346, 740242, 752140, 765485, 780266, 796290, 813689, 832762, 853657, 876594, 902063, 930390, 961224, 993589, 1026100, 1056902, 1083782, 1104936, 1119576, 1127615, 1128994, 1123734, 1112575]
60463A112575j5336j7296j7248j5808j3562j0759p404l692j98K599M819O905Q973
60450A034568J0779J2148J3194J4153J5360J7212J9825K2870K6016K9348L3063
60439A248536L7059M1348M6544N3255O1086O8952P6408Q3992R2139J00353J07783
60428B017455J14233J20351J27069J35100J44738J55995J68871J83160J97692
60419C364664K09861K16287K13836J99828J72117J30109P6039J4562m9019j09824
60409D438460j63142k04684k32078k45925k48923k44165k34143k20659k04976
60400B439765j88093j71073j54865j39805j25670j12322r9939q8584p8100o8652
60390A212662o0784n4614m9476m4653m0094l6079l2605k9489k6682k4150k1759
$$ y = [1112575, 1097239, 1079943, 1062695, 1046887, 1033325, 1022566, 1015162, 1011470, 1011272, 1013871, 1018690, 1025595, 1034568, 1045347, 1057495, 1070689, 1084842, 1100202, 1117414, 1137239, 1160109, 1186125, 1215473, 1248536, 1285595, 1326943, 1373487, 1426742, 1487828, 1556780, 1633188, 1717180, 1809319, 1909672, 2017455, 2131688, 2252039, 2379108, 2514208, 2658946, 2814941, 2983812, 3166972, 3364664, 3574525, 3790812, 4004648, 4204476, 4376593, 4506702, 4582741, 4597303, 4548284, 4438460, 4275318, 4070634, 3838556, 3592631, 3343708, 3099543, 2865400, 2644741, 2439765, 2251672, 2080599, 1925734, 1785929, 1660259, 1547937, 1447998, 1359414, 1281314, 1212662, 1151878, 1097264, 1047788, 1003135, 963041, 926962, 894357, 864868, 838186, 814036, 792277]
60379G92277j9621j8196j7632j7325j6544j5217j3733j2334j1083j0190r738r314
60367F21350q415p175o203n702n242m489l658l111k784k348j692j051o77n54m63
60352E67786k12K05O35Q88Q99Q29R90J503K042K145J825J598J755J945J781J436
60336E88050J282J264J218J479K434L590L896L114K106J659J641J611J463J161
60322F15968N05m16j103j395j731k296k495j913j153j041j401j425r02k96J64
60307E99070O95J258J457J252J134J397J805K110K514L252M073M443M112L409
60293F31981K964L224M051M850N208N303N563O027O313O170N739N268M803M266
60279G01730L679L236L115L267L385L193K724K175J569Q62M02P42J845K904L280
$$ y = [792277, 772656, 754460, 736828, 719503, 702959, 687742, 674009, 661675, 650592, 640402, 630664, 621350, 612935, 605760, 599557, 593855, 588613, 584124, 580466, 577355, 574571, 572223, 570531, 569480, 568803, 568249, 567786, 567574, 567779, 568414, 569302, 570201, 571030, 572020, 573523, 575565, 577710, 579535, 581133, 582888, 584833, 586614, 588050, 589332, 590596, 591814, 593293, 595727, 599317, 603213, 606327, 608433, 610092, 611733, 613344, 614807, 615968, 616473, 616057, 614954, 613559, 611828, 609532, 607037, 605124, 603971, 602930, 601529, 600104, 599202, 598906, 599070, 599765, 601023, 602480, 603732, 604866, 606263, 608068, 610178, 612692, 615944, 620017, 624460, 628572, 631981, 634945, 638169, 642220, 647070, 652278, 657581, 663144, 669171, 675484, 681654, 687393, 692661, 697464, 701730, 705409, 708645, 711760, 715027, 718412, 721605, 724329, 726504, 728073, 728935, 729337, 730079, 731924, 734828, 738108]
60264G38108L211L187L072K342J031k21r98j504k081k799l510m037m206m042l839
60249G23714l792l610k961k155j899k307k676k417j771j296j069p20l8Q43J729
60234F99575K512L088L368L406L318L104K786K695L298M525N541N584M968M782
60220G52550N476O226O109N487N589O827Q249Q812Q602Q419Q656R073R419R771
60206H59265J0374J1498J3376J5898J8450K0409K1816K3303K5338K7806L0281
60195A077814L2539L4767L7415M0809M4782M8772N2415N5897N9591O3572O7752
60184A616125P2312P7491Q2993Q8015R1939R4759R6752R8007R8403R7754R5727
60173B610277R1826Q5810P8133O9717O1211N2529M3217L3182K2896J2961L659
$$ y = [738108, 741319, 744506, 747578, 749920, 750951, 750730, 749732, 748228, 746147, 743348, 739838, 735801, 731595, 727553, 723714, 719922, 716312, 713351, 711196, 709297, 706990, 704314, 701897, 700126, 698830, 697761, 697041, 697003, 697846, 699575, 702087, 705175, 708543, 711949, 715267, 718371, 721157, 723852, 727150, 731675, 737216, 742800, 747768, 752550, 758026, 764252, 770361, 775848, 781437, 788264, 796513, 805325, 813927, 822346, 831002, 840075, 849494, 859265, 869639, 881137, 894513, 910411, 928861, 949270, 971086, 994389, 1019727, 1047533, 1077814, 1110353, 1145120, 1182535, 1223344, 1268126, 1316898, 1369313, 1425210, 1484801, 1548373, 1616125, 1688437, 1765928, 1848921, 1936936, 2028875, 2123634, 2220386, 2318393, 2416796, 2514550, 2610277, 2702103, 2787913, 2866046, 2935763, 2996974, 3049503, 3092720, 3125902, 3148798, 3161759, 3165418]
60162C165418m933j2642j9158k4179k7366k8319k6944k3854j9960j5561j0079
60151B952423k902N735J4893K3805L2417M1151N0254N9399O7932P5503Q2287Q8340
60139C491237R3011R5266R4642R1480Q6277P9202P0289N9673M7529L4181K0323
60128D263110O695o570j9763l2556m3759n2442n8848o3731o7116o8192o6210o1113
60116C729505n3545m4550l5123k5650j5879n565N113J5850K6517L6829M6125N3793
60104C733420N9598O3354O4651O3336N9847N4705M8012L9939L1283K2981J5346
60093D256472Q332K258k330n324o886o746m248Q62Q212J7327K7975L9997N3277
60080D389178O7803Q3423R9514J15452J31406J48224J66422J85559K04717K23294
$$ y = [3165418, 3160485, 3147843, 3128685, 3104506, 3077140, 3048821, 3021877, 2998023, 2978063, 2962502, 2952423, 2949521, 2955256, 2970149, 2993954, 3026371, 3067522, 3117776, 3177175, 3245107, 3320610, 3402897, 3491237, 3584248, 3679514, 3774156, 3865636, 3951913, 4031115, 4101404, 4161077, 4208606, 4242787, 4263110, 4269805, 4263235, 4243472, 4210916, 4167157, 4114715, 4055867, 3992136, 3925020, 3856828, 3790618, 3729505, 3675960, 3631410, 3596287, 3570637, 3554758, 3549193, 3554306, 3570156, 3596673, 3633502, 3679627, 3733420, 3793018, 3856372, 3921023, 3984359, 4044206, 4098911, 4146923, 4186862, 4218145, 4241126, 4256472, 4264804, 4267062, 4264732, 4259408, 4252522, 4245776, 4241528, 4242390, 4250602, 4267929, 4295904, 4335901, 4389178, 4456981, 4540404, 4639918, 4755370, 4886776, 5035000, 5201422, 5386981, 5591698, 5814992]
60070E814992K41177K58329K74234K87875K98307L05221L08560L07686L01538
60061H397919K89828K73321K52523K26900J96061J61094J23732Q4585M3279J71
60051A0049413m3145q5075j24854j61890j95136k23356k45481k60455k67439k66573
60041H176009k59204k47022k31126k11930j89621j64645j38034j11096q4563n8309
60031F480459l2383p993J3294L1050M5928N8150O6950P1460P1299O6234N6330
60020F920778M2695K7139J0608p216k6276m5015o1645p5894q8717j00749j11777
60009F483931j21407j29427j35605j39797j42147j42699j40940j36353j29408
60000E266148j21333j12715j02967r1429p8526o5252n1819l7581k2389p326O420
$$ y = [5814992, 6056169, 6314498, 6588732, 6876607, 7174914, 7480135, 7788695, 8096381, 8397919, 8687747, 8961068, 9213591, 9440491, 9636552, 9797646, 9921378, 10005963, 10049242, 10049413, 10006268, 9921193, 9796339, 9634449, 9439313, 9215957, 8970476, 8710021, 8442582, 8176009, 7916805, 7669783, 7438657, 7226727, 7037106, 6872461, 6734427, 6623331, 6538768, 6480459, 6448076, 6440083, 6453377, 6484427, 6530355, 6588505, 6655455, 6726915, 6798214, 6864448, 6920778, 6963473, 6990612, 7001220, 6994004, 6967728, 6922713, 6861068, 6785174, 6696457, 6595708, 6483931, 6362524, 6233097, 6097492, 5957695, 5815548, 5672849, 5531909, 5395556, 5266148, 5144815, 5032100, 4929133, 4837704, 4759178, 4693926, 4642107, 4604526, 4582137, 4574811, 4581231]
59989D581231J8973L1412M4141N6351O7101P6123Q3232Q7777Q9167Q7398Q2521
59978E305427P4222O2582M8746L3954J8363J609j5853l3024m9584o5742q0904
59967E299796r3612j02931j08892j11538j10722j07066j01926r5793q7785p7223
59957D302308o4928n2263l9694k6940j3863m48J3516K8021M2465N6326O9842Q3462
59945D397804R6957J09551J20639J29845J36679J40549J40947J37354J29397J17494
59935E657216J02839Q6349O8015M7758K6399N110j5711l6354n6647p5513r1545
59924E717916j03686j11461j15024j14939j11672j05345r6124q4546p1233n6630
59914D747256m1214k5609j0157N286K0720L5539M8963O0639P0529P8628Q5060
$$ y = [4581231, 4600204, 4631616, 4675757, 4732108, 4799209, 4875332, 4958564, 5046341, 5135508, 5222906, 5305427, 5379649, 5442231, 5490977, 5524931, 5543294, 5544903, 5529050, 5496026, 5446442, 5380700, 5299796, 5206184, 5103253, 4994361, 4882823, 4772101, 4665035, 4563109, 4467316, 4379531, 4302308, 4237380, 4185117, 4145423, 4118483, 4104620, 4104172, 4117688, 4145709, 4188174, 4244500, 4314342, 4397804, 4494761, 4604312, 4724951, 4854796, 4991475, 5132024, 5272971, 5410325, 5539722, 5657216, 5760055, 5846404, 5914419, 5962177, 5988576, 5993686, 5977975, 5941621, 5884974, 5809461, 5717916, 5614230, 5502769, 5387745, 5272806, 5161134, 5055789, 4959665, 4875119, 4803886, 4747256, 4706042, 4680433, 4670276, 4675562, 4696282, 4731821, 4780784, 4841423, 4911952, 4990580, 5075640]
59903E075640R0046R3439R4714R3765R1135Q7074Q1044P2864O3815N5662M8904
59892E948102M2872L7309L2969L0568L0145L1661L5545M2242N1725O3771P8427
59881F425336R5846J15821J37706J60741J84418K08546K32928K56903K79329K99000
59871H396574L14757L25072L27946L21653L05375K78886K41927J94481J37658
59862A0844329P3958O726o0402j23821j80416k28088k65840k93361l10676l18150
59852I144259l16704l07933k93769k75724k54378k29944k03227j75551j47699
59843F939330j19583r1190o3233l6489j1073J3163L5999N7059P6110R2634J05561
59832F998288J14002J17816J16848J10116R6470P5789M8855J6555j9900n8356
$$ y = [5075640, 5165686, 5259125, 5353839, 5447604, 5538739, 5625813, 5706857, 5779721, 5843536, 5899198, 5948102, 5990974, 6028283, 6061252, 6091820, 6121965, 6153626, 6189171, 6231413, 6283138, 6346909, 6425336, 6521182, 6637003, 6774709, 6935450, 7119868, 7328414, 7561342, 7818245, 8097574, 8396574, 8711331, 9036403, 9364349, 9686002, 9991377, 10270263, 10512190, 10706671, 10844329, 10918287, 10925013, 10864611, 10740790, 10560374, 10332286, 10066446, 9773085, 9462409, 9144259, 8827555, 8519622, 8225853, 7950129, 7695751, 7465807, 7262580, 7087029, 6939330, 6819747, 6728557, 6665324, 6628835, 6617762, 6630925, 6666924, 6723983, 6800093, 6892727, 6998288, 7112290, 7230106, 7346954, 7457070, 7553540, 7629329, 7678184, 7694739, 7674839, 7616483]
59822G616483r6349j32368j65649j94836k17953k33980k43628k48222k48500k44729
59812E590269k37336k26927k14115j99677j84504j69166j53783j38442j23494
59803C942825j09299r6150q4476p4708o6835o0470n5516n2273n0728n0097m9363
59792C192910m7961m5800m2983l9701l6137l2227k7801k3091j8855j5788j4094
59781B848472j3768j4983j7855k1948k6274k9891l2455l4229l5530l6155l5414
59770B549970l2911k9071k4704k0176j5318r993m358J469P458J3279J8251K1984
59758B475880K4904K7858L1352L5308L9463M3731M8039N1945N4581N5236N3902
59747B942199N1103M7232M2387L6885L1403K6412K1850J7733J4604J2984J2748
$$ y = [7616483, 7520134, 7387766, 7222117, 7027281, 6809328, 6575348, 6331720, 6083498, 5834998, 5590269, 5352933, 5126006, 4911891, 4712214, 4527710, 4358544, 4204761, 4066319, 3942825, 3833526, 3737376, 3652900, 3578192, 3511357, 3450887, 3395371, 3343098, 3292370, 3242273, 3192910, 3144949, 3099149, 3056166, 3016465, 2980328, 2948101, 2920300, 2897209, 2878354, 2862566, 2848472, 2834704, 2819721, 2801866, 2779918, 2753644, 2723753, 2691298, 2657069, 2621539, 2585384, 2549970, 2517059, 2487988, 2463284, 2443108, 2427790, 2417797, 2413439, 2414908, 2422366, 2435645, 2453896, 2475880, 2500784, 2528642, 2559994, 2595302, 2634765, 2678496, 2726535, 2778480, 2833061, 2888297, 2942199, 2993302, 3040534, 3082921, 3119806, 3151209, 3177621, 3199471, 3217204, 3231808, 3244792, 3257540]
59736C257540J3592J5813J9897K5647L2428M0250M9760O1113P3489Q6061R8843
59725C774433J12391J27128J43235J60766J79516J99070K19140K39509K59362
59716E414550K76895K89569K94370K87690K65757K26173J69631J00490K5994m5436
59706G305683j06482j52928j84204k02068k08821k06519j97177j82940j65704
59697E698840j46728j26664j05986q5330o5357m6297k7875r833P696K4561M1114
59686E158141N7908P4919R1579J07679J23848J40916J59133J78247J98007K18310
59676F508687K39038K60100K81651L04107L27868L53078L79546M06884M34783
59667I495742M63061M91259N18178N42097N61594N75910N84430N86064N79652
$$ y = [3257540, 3271132, 3286945, 3306842, 3332489, 3364917, 3405167, 3454927, 3516040, 3589529, 3675590, 3774433, 3886824, 4013952, 4157187, 4317953, 4497469, 4696539, 4915679, 5155188, 5414550, 5691445, 5981014, 6275384, 6563074, 6828831, 7055004, 7224635, 7325125, 7351119, 7305683, 7199201, 7046273, 6862069, 6660001, 6451180, 6244661, 6047484, 5864544, 5698840, 5552112, 5425448, 5319462, 5234132, 5168775, 5122478, 5094603, 5084770, 5092466, 5117027, 5158141, 5216049, 5290968, 5382547, 5490226, 5614074, 5754990, 5914123, 6092370, 6290377, 6508687, 6747725, 7007825, 7289476, 7593583, 7921451, 8274529, 8654075, 9060959, 9495742, 9958803, 10450062, 10968240, 11510337, 12071931, 12647841, 13232271, 13818335, 14397987]
59658A4397987N65068N43890N18926M93208M69378M49741M36335M30473M32198
59649A8737204M40370M53389M69593M86849N02179N12207N13970N05235M84385
59640B3105381M50486M03678L45334K77860K04554J29490N7158q199o3142j05332
59630B4797268j33535j47334j46737j32203j05049o7390k1283L1963R1338J55273
59620B4322311K21781K89497L58040M27096M95283N60028O18232O66733P02067
59611B8661068P19907P15011O82108O17276N18838L87616K27189M4505j50099
59602C2423419l44252n25717o84228q12582r07186r67937r97423r99872r80458
59593B5203764r44793q98452q46979p96507p53853p25155p13761p19089p36955
$$ y = [14397987, 14963055, 15506945, 16025871, 16519079, 16988457, 17438198, 17874533, 18305006, 18737204, 19177574, 19630963, 20100556, 20587405, 21089584, 21601791, 22115761, 22620996, 23105381, 23555867, 23959545, 24304879, 24582739, 24787293, 24916783, 24973941, 24965742, 24902600, 24797268, 24663733, 24516399, 24369662, 24237459, 24132410, 24065020, 24043737, 24075700, 24167038, 24322311, 24544092, 24833589, 25191629, 25618725, 26114008, 26674036, 27292268, 27959001, 28661068, 29380975, 30095986, 30778094, 31395370, 31914208, 32301824, 32529013, 32573518, 32423419, 32079167, 31553450, 30869222, 30056640, 29149454, 28181517, 27184094, 26184222, 25203764, 24258971, 23360519, 22513540, 21717033, 20963180, 20238025, 19524264, 18805175, 18068220]
59584A8068220p60761p83055p97319p99495p88508p65818p34449o97776o58355
59575A1282684o17434n75497n33090m91097m50526m12172l76376l42952l11655
59566G171885k82768k56865k33856k12765j92768j73968j56849j41385j27185
59557E393476j14174j02670r3006q5362p9682p5574p2677p1286p2000p4536p7624
59546D474885q0464q3407q6678q9390r0635r0717r0159q8311q4237p8473p2554
59535C539860o7117o1644n5798m9631m2737l4678k6318j9346j4167r465m117J596
59523C156438O939J1660J5627J8636K1002K3450K5992K7843K8769K9533L0704
59512C396593L2096L3767L6467M0462M4911M9177N3910O0140O7953P6679Q5751
$$ y = [18068220, 17307459, 16524404, 15727085, 14927590, 14139082, 13373264, 12638815, 11941039, 11282684, 10665250, 10089753, 9556663, 9065566, 8615040, 8202868, 7826492, 7483540, 7171885, 6889117, 6632252, 6398396, 6185631, 5992863, 5818895, 5662046, 5520661, 5393476, 5279302, 5176632, 5083626, 4998264, 4918582, 4843008, 4770331, 4699045, 4627045, 4552509, 4474885, 4394421, 4311014, 4224336, 4134946, 4044311, 3953594, 3863435, 3775124, 3690887, 3612414, 3539860, 3472743, 3411099, 3355301, 3305670, 3262933, 3228255, 3201937, 3182591, 3168424, 3158959, 3154842, 3156438, 3163377, 3175037, 3190664, 3209300, 3230302, 3253752, 3279744, 3307587, 3336356, 3365889, 3396593, 3428689, 3462456, 3498923, 3539385, 3584296, 3633473, 3687383, 3747523, 3815476, 3892155, 3977906]
59501C977906R4843J03846J13266J23977J36050J48467J60523J72699J85592J98768
59491E415937K11407K23284K34337K43872K51090K55951K58690K58854K55612
59482G609034K48741K38720K26121K11595J96152J80795J65843J50865J35109
59473I362975J17987R9777Q2192O7516N6850M9671M5439M4742M8244N5358O4594
59462A0095345P4442Q3169Q8523Q8686Q2968P0810N0869K2314j3532n4060r7522
59451A0492012j43064j88930k32084k69983l01681l26961l45347l56383l60149
59442G967430l57156l48208l34479l17134k96813k74029k50078k26708k04680
59433E358145j83354j62051j41127j21365j02865q5198o8236n2259l7283k2821
$$ y = [3977906, 4072749, 4176595, 4289861, 4413838, 4549888, 4698355, 4858878, 5031577, 5217169, 5415937, 5627344, 5850628, 6084965, 6328837, 6579927, 6835878, 7094568, 7353422, 7609034, 7857775, 8096495, 8322616, 8534211, 8730363, 8911158, 9077001, 9227866, 9362975, 9480962, 9580739, 9662931, 9730447, 9787297, 9836968, 9882407, 9927149, 9975393, 10030751, 10095345, 10169787, 10252956, 10341479, 10430165, 10513133, 10583943, 10634812, 10657126, 10643594, 10589534, 10492012, 10348948, 10160018, 9927934, 9657951, 9356270, 9029309, 8683962, 8327579, 7967430, 7610274, 7262066, 6927587, 6610453, 6313640, 6039611, 5789533, 5562825, 5358145, 5174791, 5012740, 4871613, 4750248, 4647383, 4562185, 4493949, 4441690, 4404407, 4381586]
59423D381586q295O520K1475L6297N0727O4636P8165R1709J05640J19920J34037
59412E082417J47379J59575J70390J79494J86454J90769J91577J87528J77490
59403F673073J61310J39595J12780Q1046M5102O374l3660p3726j12195j47013
59393F852686j76606k00376k18169k29969k36402k38816k38159k34341k27126
59384D852722k17164k05601j93182j80304j67407j54688j41824j28704j16097
59375C347751j04858r4809q5071p5376o6318n8366n1185m4129l6924k9870k3481
59364B677364j7977j2933p666k018L442Q120J1896J4953J7584K0380K3965K8288
59352B765398L2657L6636M0182M2763M3352M1911M0122M0001M2408M7290N4386
$$ y = [4381586, 4373291, 4379811, 4401286, 4437583, 4488310, 4552946, 4631111, 4722820, 4828460, 4948380, 5082417, 5229796, 5389371, 5559761, 5739255, 5925709, 6116478, 6308055, 6495583, 6673073, 6834383, 6973978, 7086758, 7167804, 7212906, 7219280, 7185620, 7111894, 6999699, 6852686, 6676080, 6475704, 6257535, 6027566, 5791164, 5552348, 5314189, 5079848, 4852722, 4635558, 4429957, 4236775, 4056471, 3889064, 3734376, 3592552, 3463848, 3347751, 3242893, 3148084, 3063013, 2987637, 2921319, 2862953, 2811768, 2767639, 2730715, 2700845, 2677364, 2659387, 2646454, 2638788, 2636770, 2640212, 2648332, 2660228, 2675181, 2692765, 2713145, 2737110, 2765398, 2798055, 2834691, 2874873, 2917636, 2960988, 3002899, 3043021, 3083022, 3125430, 3172720, 3227106]
59341C227106O2995P2054Q1381R1922J03734J14761J23070J29712J37769J48991
59331D293495J62893J78812J97081K17879K40448K64113K89003L15304L42610
59322F501638L70464L98646M26464M52368M74571M91514N01651N03472M96181
59313A0616969M80023M55897M25168L89765L51746L12545K73125K34704J98525
59304A3738467J64792J32550J00781O8888L6054J120l6448p5951j16226j56391
59294A3857636j95456k31700k63096k88250l06783l19174l26580l30646l33121
59285A1262830l35372l38059l41140l44212l46999l49246l50163l48406l42990
59276H166243l33998l22131l08003k92138k75095k57049k37733k17391j97310
$$ y = [3227106, 3290101, 3362155, 3443536, 3535458, 3639192, 3753953, 3877023, 4006735, 4144504, 4293495, 4456388, 4635200, 4832281, 5050160, 5290608, 5554721, 5843724, 6159028, 6501638, 6872102, 7270748, 7697212, 8149580, 8624151, 9115665, 9617316, 10120788, 10616969, 11096992, 11552889, 11978057, 12367822, 12719568, 13032113, 13305238, 13539942, 13738467, 13903259, 14035809, 14136590, 14205478, 14241532, 14242652, 14206204, 14130253, 14014027, 13857636, 13662180, 13430480, 13167384, 12879134, 12572351, 12253177, 11926597, 11595951, 11262830, 10927458, 10589399, 10248259, 9904047, 9557048, 9207802, 8857639, 8509233, 8166243, 7832245, 7510114, 7202111, 6909973, 6634878, 6377829, 6140096, 5922705, 5725395]
59267E725395j78622j61064j43671j26300j09584r3828p8947o5251n3135m2122
59257D672871l1221k0324j0293j700N591J1585J5933J8601J9861J9490J6974J2671
59245D730039P767K877k431q472j4699k0458k5564k9770l2495l3449l2849l0723
59233D509773k6749k1061j4424p246Q28J0080K0140L0601M1485N2687O3760P4517
59221D734391Q5242R5898J05880J14856J23033J30208J35350J37738J37642J35259
59211E935497J29638J19492J04584Q5734O3924M0250J6395n745k5051m1430n5125
59200F368163o6146p4377q0013q3782q6652q9111r0876r1580r1501r1132r0290
59189E432703q8393q5501q2196p8337p2907o5445n6716m7572l7818k6774j4212
$$ y = [5725395, 5546773, 5385709, 5242038, 5115738, 5006154, 4912326, 4833379, 4768128, 4714993, 4672871, 4641650, 4621326, 4611033, 4609333, 4614924, 4626509, 4642442, 4661043, 4680904, 4700394, 4717368, 4730039, 4737806, 4740683, 4738252, 4729780, 4715081, 4694623, 4669059, 4639289, 4606794, 4573345, 4540496, 4509773, 4483024, 4461963, 4447539, 4440293, 4441121, 4451201, 4471341, 4501942, 4543427, 4596114, 4659874, 4734391, 4819633, 4915531, 5021411, 5136267, 5259300, 5389508, 5524858, 5662596, 5800238, 5935497, 6065135, 6184627, 6289211, 6374945, 6438869, 6479119, 6495514, 6489769, 6464718, 6423288, 6368163, 6302017, 6227640, 6147627, 6063845, 5977193, 5888082, 5797206, 5705626, 5614125, 5522993, 5432703, 5344310, 5258809, 5176613, 5098276, 5025369, 4959924, 4903208, 4855636, 4817818, 4791044, 4776832]
59178D776832k42J5214L2209N0426O9496Q9318J09821J30839J52463J74984J98128
59167E799488K20918K42495K62533K80402K94555L03144L04669K97639K80325
59158H286168K51703K12366J64001J08275M6700j8696q5178j49755k09596k62218
59148H343770l05656l38528l60082l70514l71203l64144l51118l33663l13570
59139E235292k92544k71315k49821k28333k07621j87965j68997j50825j34312
59130C343559j19860j06838r4685q3705p4171o5596n7571n0497m4694l9438l3745
59119B572759k7631k1814j6639j1962p673l663M07M678Q812J2604J6467K0752
59107B547097K5120K9095L2861L6852M1001M4953M8660N2205N5440N8170O0390
$$ y = [4776832, 4776590, 4791804, 4824013, 4874439, 4943935, 5033253, 5143074, 5273913, 5426376, 5601360, 5799488, 6020406, 6262901, 6525434, 6805836, 7100391, 7403535, 7708204, 8005843, 8286168, 8537871, 8750237, 8914238, 9022513, 9069213, 9050517, 8965339, 8815584, 8605988, 8343770, 8038114, 7699586, 7339504, 6968990, 6597787, 6233643, 5882525, 5548862, 5235292, 4942748, 4671433, 4421612, 4193279, 3985658, 3797693, 3628696, 3477871, 3343559, 3223699, 3116861, 3022176, 2938471, 2864300, 2798704, 2741133, 2690636, 2645942, 2606504, 2572759, 2545128, 2523314, 2506675, 2494713, 2487040, 2483377, 2483784, 2488462, 2497274, 2509878, 2526345, 2547097, 2572217, 2601312, 2634173, 2671025, 2712026, 2756979, 2805639, 2857844, 2913284, 2971454, 3031844]
59096C031844O1883O2155O1161N9445N7140N3565M8380M2374L6313K9767K2025
59085C566052J3547N473j834q701j4921j9693k2684k4272k4860k4635k3764k2078
59073C397630j8808j3478o911m33N764J2668K0912L0052L9437M9063N9300P0299
59061C645495Q1754R3002J03451J13253J23279J33999J44816J55007J64834J74869
59051D933759J84630J92909J99300K04370K08164K09381K06295J97789J83357
59042F719954J62747J36017J03643O6444K5702j6776n9068r9612j37000j69710
59032F732341j96674k17917k34011k45065k50956k52367k50691k46782k40521
59023D597357k31869k21590k10599j99134j86983j74257j61585j49662j38804
$$ y = [3031844, 3093727, 3155882, 3217043, 3276488, 3333628, 3387193, 3435573, 3477947, 3514260, 3544027, 3566052, 3579599, 3585072, 3583238, 3574537, 3559616, 3539923, 3517239, 3492967, 3468107, 3443472, 3419708, 3397630, 3378822, 3365344, 3358433, 3358000, 3363764, 3376432, 3397344, 3427396, 3466833, 3515896, 3575196, 3645495, 3727249, 3820251, 3923702, 4036955, 4160234, 4294233, 4439049, 4594056, 4758890, 4933759, 5118389, 5311298, 5510598, 5714968, 5923132, 6132513, 6338808, 6536597, 6719954, 6882701, 7018718, 7122361, 7188805, 7214507, 7197731, 7138663, 7039051, 6902051, 6732341, 6535667, 6317750, 6083739, 5838674, 5587718, 5335351, 5084660, 4837878, 4597357, 4365488, 4143898, 3933299, 3734165, 3547182, 3372925, 3211340, 3061678, 2922874]
59014B922874j28886j19631j10957j02890r5215q7594q0177p3609o8086o2902
59004A992927n7429n2048m7415m3257l8788l4103l0186k7486k5349k3160k1216
58993A592490k0082j9649j9257j8516j7635j7076j7132j7653j8065j7689j6251
58982A393485j4083j1887j0214q973p520n500l533k608k695k583j341O80K708
58969A325936M638O683Q490R509R903J0285J0727J0744J0089Q835O856M069J170
58956A427934o24p86R0J089J761K121K416K978L914M946N843O817Q051Q973Q648
58941A484171O874M369J923k37k224m135n862o966o866n608m198l575l467k790
58927A451409j135Q67K567M030N602P284Q799R927J0667J1330J2438J4219J6261
$$ y = [2922874, 2793988, 2674357, 2563400, 2460510, 2365295, 2277701, 2197524, 2123915, 2055829, 1992927, 1935498, 1883450, 1836035, 1792778, 1753990, 1719887, 1689701, 1662215, 1636866, 1613706, 1592490, 1572408, 1552759, 1533502, 1514986, 1497351, 1480275, 1463143, 1445490, 1427425, 1409736, 1393485, 1379402, 1367515, 1357301, 1348328, 1340808, 1335308, 1331775, 1329167, 1326472, 1323889, 1322548, 1323228, 1325936, 1330574, 1337257, 1345747, 1355256, 1365159, 1375444, 1386171, 1396915, 1407004, 1415839, 1422695, 1426764, 1427934, 1427310, 1426524, 1426614, 1427703, 1429464, 1431585, 1434001, 1436979, 1440893, 1445839, 1451682, 1458499, 1466550, 1475523, 1484171, 1491045, 1495414, 1497337, 1497100, 1494876, 1490741, 1484879, 1477913, 1471047, 1465439, 1461241, 1457666, 1454199, 1451409, 1450274, 1451141, 1453708, 1457738, 1463340, 1470624, 1479423, 1489350, 1500017, 1511347, 1523785, 1538004, 1554265]
58914A554265J7955J9206K0416K1955K3949K6332K8731L0586L1786L2927L4547
58903A842655L6389L7879L8965L9886M0598M1097M1990M3833M6129M7842M8809
58892B306072M9905N1841N4597N8050O2241O6927P1631P6328Q1489Q7250R3237
58881C059568R9330J05999J13584J21840J30449J39547J49430J60109J71431J83399
58871D434686J96270K10474K26415K44094K63013K82729L03367L25346L48785
58862F835179L73479L99145M25387M51717M77955N04212N29984N53700N73690
58853A1124448N89144N99443O02958N97189N79774N48654N01906M38620L59971
58844A5942107K68565J67079N8429n2955j61456k62188l52009m28796m90987n38146
$$ y = [1554265, 1572220, 1591426, 1611842, 1633797, 1657746, 1684078, 1712809, 1743395, 1775181, 1808108, 1842655, 1879044, 1916923, 1955888, 1995774, 2036372, 2077469, 2119459, 2163292, 2209421, 2257263, 2306072, 2355977, 2407818, 2462415, 2520465, 2582706, 2649633, 2721264, 2797592, 2879081, 2966331, 3059568, 3158898, 3264897, 3378481, 3500321, 3630770, 3770317, 3919747, 4079856, 4251287, 4434686, 4630956, 4841430, 5067845, 5311939, 5574952, 5857681, 6161048, 6486394, 6835179, 7208658, 7607803, 8033190, 8484907, 8962862, 9467074, 9997058, 10550758, 11124448, 11713592, 12313035, 12915993, 13513182, 14092956, 14641610, 15143516, 15582136, 15942107, 16210672, 16377751, 16436180, 16383225, 16221769, 15959581, 15607572, 15178776, 14687789, 14149643]
58834A4149643n71077n90957n98938n96573n85764n68041n44614n17124m87571
58825I088984m57314m26935l97072l68548l41619l16112k92466k71635k53633
58816E963650k37198k21339k06370j92939j80816j69259j57877j46604j35452
58807D315796j24810j15385j07347r9909r2250q4453p7145p0612o4586n8537n1895
58796C368867m4410l6558k9281k3018j7304j1418n113J408P812J3863J9711K5986
58784C270545L3154M0834M8260N5338O2585P0077P7260Q4028R1165R9335J08268
58773D040849J17347J26577J36584J47955J60787J74620J88714K02740K17217
58764E513390K33079K50831K70404K91510L13731L36558L59986L84739M11228
$$ y = [14149643, 13578566, 12987609, 12388671, 11792098, 11206334, 10638293, 10093679, 9576555, 9088984, 8631670, 8204735, 7807663, 7439115, 7097496, 6781384, 6488918, 6217283, 5963650, 5726452, 5505113, 5298743, 5105804, 4924988, 4755729, 4597852, 4451248, 4315796, 4190986, 4075601, 3968254, 3868345, 3776095, 3691642, 3614497, 3543885, 3479299, 3420762, 3368867, 3324457, 3287899, 3258618, 3235600, 3218296, 3206878, 3201765, 3203173, 3210985, 3224848, 3244559, 3270545, 3303699, 3344533, 3392793, 3448131, 3510716, 3580793, 3658053, 3742081, 3833246, 3932581, 4040849, 4158196, 4284773, 4421357, 4569312, 4730099, 4904719, 5093433, 5296173, 5513390, 5746469, 5997300, 6267704, 6559214, 6872945, 7209503, 7569489, 7954228, 8365456]
58755H365456M38565M65377M91167N15893N38448N56718N69017N74354N71204
58746A3086199N57245N30479M89684M33777L62135K75993J78598P3677l5204j43678
58736A5808905k46458l39056m18972m84902n35937n72078n94564o04962o04593
58727A1407383n95195n79159n58468n34144n07218m79298m51608m24270l97096
58718F880927l70473l44890l20415k97217k75898k56767k39470k23694k09598
58709D342505j97036j85251j73785j62913j52681j42420j31879j21979j13691
58700B960870j06812j00421r3900q7002p9660p2320o5734n9905n4004m7816m2407
58689B150889l8659l5994l3285l0175k6865k3357j9878j7219j5837j5154j4584
$$ y = [8365456, 8804021, 9269398, 9760565, 10276458, 10814906, 11371624, 11940641, 12514995, 13086199, 13643444, 14173923, 14663607, 15097384, 15459519, 15735512, 15914110, 15987787, 15952583, 15808905, 15562447, 15223391, 14804419, 14319517, 13783580, 13211502, 12616938, 12011976, 11407383, 10812188, 10233029, 9674561, 9140417, 8633199, 8153901, 7702293, 7278023, 6880927, 6510454, 6165564, 5845149, 5547932, 5272034, 5015267, 4775797, 4552103, 4342505, 4145469, 3960218, 3786433, 3623520, 3470839, 3328419, 3196540, 3074561, 2960870, 2854058, 2753637, 2659737, 2572735, 2493075, 2420755, 2355021, 2295116, 2241112, 2193296, 2150889, 2112230, 2076236, 2042951, 2012776, 1985911, 1962554, 1942676, 1925457, 1909620, 1894466, 1879882]
58678A879882j4531j5589j7399j9202k0946k2946k4955k6477k7482k8087k8049
58667A634219k7379k6910k7324k8158k8621k8893k9645l0760l1541l1872l2120
58656A310996l2160l1461l0116k8853k8032k7297k6158k4385k1976j9363j7398
58645A023797j6547j6238j5593j4528j3582j2969j2439j1821j1098j0171r098
58634H79713q356q250q302p773o596n296m217l340k668k266k076k137k653l482
58620H12301l951l666l184l250l668l531k431q20P65K265L787N135N880N864N540
58605H17036N625O261O766O554N943N507M965L635J800N57J96q7o64p84J56J736
58589H65202L430N332P438R167J0333J1701J3881J6450J8769K0849K2810K4437
$$ y = [1879882, 1865351, 1849762, 1832363, 1813161, 1792215, 1769269, 1744314, 1717837, 1690355, 1662268, 1634219, 1606840, 1579930, 1552606, 1524448, 1495827, 1466934, 1437289, 1406529, 1374988, 1343116, 1310996, 1278836, 1247375, 1217259, 1188406, 1160374, 1133077, 1106919, 1082534, 1060558, 1041195, 1023797, 1007250, 991012, 975419, 960891, 947309, 934340, 921901, 910080, 898982, 888811, 879713, 871357, 863107, 854805, 847032, 840436, 835140, 830923, 827583, 824915, 822649, 820573, 818436, 815783, 812301, 808350, 804684, 801500, 798250, 794582, 791051, 788620, 787800, 788565, 790830, 794617, 799752, 805632, 811496, 817036, 822661, 828922, 835688, 842242, 848185, 853692, 858657, 862292, 864092, 864649, 864845, 864758, 864094, 863310, 863466, 865202, 868632, 873964, 881402, 890569, 900902, 912603, 926484, 942934, 961703, 982552, 1005362, 1029799]
58577A029799K5890K7986L0969L3972L6377L8845M2147M5969M9812N4207N9899
58566A475872O6583P3415Q0271Q7487R4983J02577J10578J19326J28605J38165
58556B477862J48110J58041J66629J72857J76883J78831J77514J71294J59387
58547C987408J41463J16951Q5964N0320J2659k4809o0113r1171j16852j37400
58537C964420j52865j62247j65461j64800j62681j58867j51808j41943j31576
58528B572172j21886j12149j01896r1936q2908p4439o6163n8340n1074m4042l7291
58517A730048l1460k6968k3706k1440j9888j8527j7123j6167j6062j6160j5455
58506A507092j3846j1988j0274q908q509r706j2377j6063k0559k5381k9300l1467
$$ y = [1029799, 1055689, 1083675, 1114644, 1148616, 1184993, 1223838, 1265985, 1311954, 1361766, 1415973, 1475872, 1542455, 1615870, 1696141, 1783628, 1878611, 1981188, 2091766, 2211092, 2339697, 2477862, 2625972, 2784013, 2950642, 3123499, 3300382, 3479213, 3656727, 3828021, 3987408, 4128871, 4245822, 4331786, 4382106, 4394765, 4369956, 4309843, 4218672, 4101820, 3964420, 3811555, 3649308, 3483847, 3319047, 3156366, 2997499, 2845691, 2703748, 2572172, 2450286, 2338137, 2236241, 2144305, 2061397, 1986958, 1920795, 1862455, 1811381, 1767339, 1730048, 1698588, 1671620, 1647914, 1626474, 1606586, 1588059, 1570936, 1554769, 1538707, 1522547, 1507092, 1493246, 1481258, 1470984, 1462076, 1453567, 1443861, 1431484, 1415421, 1394862, 1369481, 1340181, 1308714]
58494A308714l2360l2666l2058l0220k8231k7361k7140k6145k4298k2748k1820
58483A003667k0692j9088j7764j7184j6969j6716j6361j5713j4656j3633j3091
58472H21800j2654j1801j0886j0504j0322r694q888q567q511q162p864q232q806
58459F96909q679q059p722p372o139m384l341l130k685j590n35Q6O68J468K320
58444F47815L274M465N580O368P285Q561R375R161Q948R922J1458J2208J2313
58431G56733J2752J3229J2763J1784J1378J0914Q747N124K052J68j932n004q036
58418H30672j0218j2033j3804j4964j5332j5488j5507j4821j3602j2733j2252
58407F79918j1406j0344j0010j0266r913q744p755p021n371k625l25M20K01p2
$$ y = [1308714, 1276354, 1243688, 1211630, 1181410, 1153179, 1125818, 1098678, 1072533, 1048235, 1025487, 1003667, 982975, 963887, 946123, 928939, 911970, 895254, 878893, 863180, 848524, 834891, 821800, 809146, 797345, 786459, 775955, 765633, 755939, 747051, 738484, 729973, 721811, 713947, 705715, 696909, 688230, 680171, 672449, 665077, 658938, 654554, 651213, 648083, 645398, 643808, 643273, 643359, 644027, 645495, 647815, 651089, 655554, 661134, 667502, 674787, 683348, 692723, 701884, 710832, 720754, 732212, 744420, 756733, 769485, 782714, 795477, 807261, 818639, 829553, 838300, 843424, 845476, 845644, 843712, 838708, 830672, 820454, 808421, 794617, 779653, 764321, 748833, 733326, 718505, 704903, 692170, 679918, 668512, 658168, 648158, 637892, 627979, 619235, 611480, 604459, 599088, 596463, 596138, 596558, 596759, 596687]
58393E96687k88m07n2O81J234J701K693M074N141N959P140Q458R270J0040J1638
58378F63969J3445J4041J3641J3670J4063J3234J0750P840N176K343l49j956k977
58365G66890m989p755r236q734p715p014n834m052k910k602j683J91J435J441
58351G07433J861L790N974P067P597Q431R165R252Q910Q036N918K877K70j774
58337G84807m474p662r282q676p832q307r091q846p992p276o329n000m199m089
58323F85752l364j489J98P14Q59J403J840J985K730M130M821M436M458N625O692
58308G20790O840P032P882Q463Q418Q822R842J0036R215R292J0930J2091J1516
58295H41169J0843J1499J2188J1602J0967J1655J2486J1703R621P290M477J048
$$ y = [596687, 596399, 595992, 595940, 596621, 597855, 599556, 602249, 606323, 611464, 617423, 624563, 633021, 642291, 652331, 663969, 677414, 691455, 705096, 718766, 732829, 746063, 756813, 764653, 769829, 772172, 771823, 769867, 766890, 761901, 754146, 744910, 736176, 728461, 721447, 715613, 711561, 708651, 706049, 704366, 704557, 705992, 707433, 709294, 713084, 719058, 726125, 733722, 742153, 751318, 760570, 769480, 777516, 783434, 786311, 786581, 784807, 780333, 772671, 763389, 754713, 746881, 738574, 729483, 720637, 712645, 705369, 699040, 694040, 689841, 685752, 682388, 680899, 681097, 681811, 682670, 684073, 685913, 687898, 690628, 694758, 699579, 704015, 708473, 714098, 720790, 727630, 734662, 742544, 751007, 759425, 768247, 778089, 788125, 797340, 806632, 817562, 829653, 841169, 852012, 863511, 875699, 887301, 898268, 909923, 922409, 934112, 943733, 951023, 955500, 956548]
58283I56548j683k892l747n131n896n041l607k645j446N54K257K975L783N276
58269I39305O300O570P784J0466J2463J2548J2632J4199J5635J5471J5300J6766
58257A085439J8448J8619J8418J9369K0286J9653J8576J8329J7506J4727J1835
58246A281205J0998J0945R428P339O885P592P629P486Q795J0966J2267J2997J4544
58233A409076J6490J7531J8054J9267K0968K2468K4237K6525K8141K8674K9835
58222A661266L2601L5435L7367M0083M4502M8428N0165N1518N4226N6626N6952
58211B169169N6787N7775N8064N5621N2197N0382M9651M8844M9468N2828N6911
58200B757697N9854O3320O8894P4570P8680Q3613R1461R9761J05872J11724J19643
$$ y = [956548, 954865, 951973, 948226, 943095, 937199, 932158, 928551, 925906, 924460, 925014, 927271, 930246, 934029, 939305, 945605, 952175, 959959, 970425, 982888, 995436, 1008068, 1022267, 1037902, 1053373, 1068673, 1085439, 1103887, 1122506, 1140924, 1160293, 1180579, 1200232, 1218808, 1237137, 1254643, 1269370, 1281205, 1292203, 1303148, 1312576, 1319915, 1326800, 1334392, 1342021, 1349507, 1358302, 1369268, 1381535, 1394532, 1409076, 1425566, 1443097, 1461151, 1480418, 1501386, 1523854, 1548091, 1574616, 1602757, 1631431, 1661266, 1693867, 1729302, 1766669, 1806752, 1851254, 1899682, 1949847, 2001365, 2055591, 2112217, 2169169, 2225956, 2283731, 2341795, 2397416, 2449613, 2499995, 2549646, 2598490, 2647958, 2700786, 2757697, 2817551, 2880871, 2949765, 3024335, 3103015, 3186628, 3278089, 3377850, 3483722, 3595446, 3715089]
58189C715089J27570J33283J39228J47953J56882J63074J69008J77937J87782
58180E117806J95756K04708K18397K34542K49287K64411K83284L03837L22875
58171G394903L43172L68853L97726M25788M54966M88500N23258N55072N87262
58162A1539500O25120O66695P08143P53201Q07519Q68590R31743J000980J082741
58153A8984232J174012J268486J369775J486746J621395J774671J959216K192494
58145C1831027K481196K823716L219901L664479M141395M643445N189856N807610
58137F3802625O506831P293203Q187201R204490J0336380J1583644J2992324J4623911
58129A44530609J6522876J8741484K1261518K3648399K4731265K2920134J7249822
$$ y = [3715089, 3842659, 3975942, 4115170, 4263123, 4420005, 4583079, 4752087, 4930024, 5117806, 5313562, 5518270, 5736667, 5971209, 6220496, 6484907, 6768191, 7072028, 7394903, 7738075, 8106928, 8504654, 8930442, 9385408, 9873908, 10397166, 10952238, 11539500, 12164620, 12831315, 13539458, 14292659, 15100178, 15968768, 16900511, 17901491, 18984232, 20158244, 21426730, 22796505, 24283251, 25904646, 27679317, 29638533, 31831027, 34312223, 37135939, 40355840, 44020319, 48161714, 52805159, 57995015, 63802625, 70309456, 77602659, 85789860, 94994350, 105330730, 116914374, 129906698, 144530609, 161053485, 179794969, 201056487, 224704886, 249436151, 272356285, 289606107]
58122B89606107Q316780j839104j0868782j7278242k0787759k1939982k1537587
58115B03671431k0295740j8715998j7077029j5489697j3973089j2507057j1064066
58108I4548755r642558q283425p043091n951035n001136m175115l458234k834490
58100D8159671k282100j779842j312458q66260m24354J8544M14817O33544N07504
58091D3069066l6906q78191j749328k408242k764192k860025k779842k595877
58083B6996463k367590k140325j933353j745291j573098j416341j269759j127456
58075A3423250r93301q75850p75342o86192o08851n48064n01736m62208m27017
58066G544689l98788l76039l53482l30338l09821k91419k71611k51103k33643
$$ y = [289606107, 297922887, 296083783, 285215001, 267936759, 247149000, 225209018, 203671431, 183375691, 164659693, 147582664, 132092967, 118119878, 105612821, 94548755, 84906197, 76622772, 69579681, 63628646, 58627510, 54452395, 50994161, 48159671, 45877571, 44097729, 42785271, 41919011, 41494657, 41513201, 41928018, 42561562, 43069066, 43032160, 42153969, 40404641, 37996399, 35232207, 32372182, 29592340, 26996463, 24628873, 22488548, 20555195, 18809904, 17236806, 15820465, 14550706, 13423250, 12429949, 11554099, 10778757, 10092565, 9483714, 8935650, 8433914, 7971706, 7544689, 7145901, 6769862, 6416380, 6086042, 5776221, 5484802, 5213191, 4962088, 4728445]
58057D728445k18761k02997j87183j75311j67276j59639j52485j48549j46419
58048C169825j41514j33320j25288j18179j09700j00191r2477q6379p9205p1352
58038B112220o5823o2503n8500n3788n1097n0362m8696m5809m4251m4316m3700
58027A543375m2267m2195m3238m2663m0136l8213l7644l6527l4348l2736l1920
58016A121488l0411k8295k7063k6247k4008k0896j9123j8446j6683j4121j3217
58005H82978j3962j3745j1948j0620j0329r379p494o453o599o419o007p176r656
57992G63191j0823r878q821q695q287p149o561o748o348n300n171n985n834m303
57978F63288l260l522l684k976k469k714k824k526k585k744j900o46q87k513l273
$$ y = [4728445, 4509684, 4306687, 4119504, 3944193, 3776917, 3617278, 3464793, 3316244, 3169825, 3028311, 2894991, 2769703, 2651524, 2541824, 2441633, 2349156, 2262777, 2183572, 2112220, 2046397, 1983894, 1925394, 1871606, 1820509, 1770147, 1721451, 1675642, 1631391, 1587075, 1543375, 1501108, 1458913, 1415675, 1373012, 1332876, 1294663, 1257019, 1220492, 1186144, 1153408, 1121488, 1091077, 1062782, 1035719, 1009472, 985464, 964568, 945445, 926999, 910316, 896195, 882978, 869016, 855271, 843323, 832703, 822374, 812995, 805501, 799048, 792449, 786030, 780023, 772847, 763191, 752368, 742490, 733669, 724974, 716687, 709538, 702977, 696229, 689881, 684581, 679410, 673425, 667591, 663288, 660028, 656506, 652822, 649846, 647377, 644663, 641839, 639313, 636728, 633984, 632084, 631438, 630551, 628038, 624765]
57963F24765k379j393j111n03O27R14J64J5R85J504P76R3L81Q61R49J212J610
57946F29470J131j35p53l87k01m35l8Q28N24j148k449k833l925o456q877j0044
57930E94272j0844j1988j2615j2207j1656j1328j0259q297o796o210n243l432
57918D83397k232k271j894R6K419L459L500L395K944K007J436J482J003m67j638
57903D96636j658j543k093k327j510q47j462k403k378k054k738m065m746m538
57889D62274l964l023j638m93n0L21J112J603J144L71j4m43j281j648r58l88j316
57872D51609l177m471m997n581o222o197n546n059m960m734m136l445k965k883
57858C87236l202l352k492p47O54J089J444K580L884M331M099M103M512M792M723
$$ y = [624765, 622386, 620993, 619882, 619379, 620006, 620920, 621084, 621099, 622084, 623588, 624364, 624457, 624838, 625699, 626648, 627860, 629470, 630601, 630466, 629713, 629326, 629125, 628690, 628652, 629480, 630004, 628856, 626407, 623574, 619649, 613193, 604316, 594272, 583428, 571440, 558825, 546618, 534962, 523634, 513375, 505078, 498282, 492072, 486829, 483397, 481165, 478894, 477000, 477096, 479515, 482974, 486474, 489869, 492813, 494820, 496256, 497738, 498741, 498274, 496636, 494978, 493435, 491342, 489015, 487505, 486658, 485196, 482793, 480415, 478361, 475623, 471558, 466812, 462274, 458310, 455287, 453649, 453156, 453106, 453427, 454539, 456142, 457286, 457657, 457643, 457200, 455919, 454271, 453313, 452925, 451609, 448432, 443961, 438964, 433383, 427161, 420964, 415418, 410359, 405399, 400665, 396529, 393084, 390119, 387236, 384034, 380682, 378190, 377443, 378097, 379186, 380630, 383210, 387094, 391425, 395524, 399627, 404139, 408931, 413654]
57843D13654M480M079L488K903K395J759J117J007J463J796J682J617J770J436
57829D44646K82q82j375j696k506l406l727l710l927m131l732k919k425k510k817
57814D05165k930k577j677o14M4L53Q72J575J753J367J383K290L210L171K350
57799D15735J515J035R98J387J564O49j042j975j438n03k44k65R9L39k54j205
57783D16395j629j623j701j680j196p56j064j829k245k226k265k537k986l712
57769C88946m543m801m319l976m464n236n536n647o125o598o476o097o057o037
57755C13034n501m890m928n199m771l845l416l530l194j968m87O14J381K001K459
57740B77760K814L171L392L396L536M096M738M965M887M844M693M162L529L192
$$ y = [413654, 418134, 422213, 425701, 428604, 430999, 432758, 433875, 434882, 436345, 438141, 439823, 441440, 443210, 444646, 444928, 444046, 442671, 440975, 438469, 435063, 431336, 427626, 423699, 419568, 415836, 412917, 410492, 407982, 405165, 402235, 399658, 397981, 397367, 397411, 397764, 398636, 400211, 401964, 403331, 404714, 407004, 410214, 413385, 415735, 417250, 418285, 419283, 420670, 422234, 422883, 421841, 419866, 418428, 417925, 417681, 417416, 417515, 417854, 417600, 416395, 414766, 413143, 411442, 409762, 408566, 407810, 406746, 404917, 402672, 400446, 398181, 395644, 392658, 388946, 384403, 379602, 375283, 371307, 366843, 361607, 356071, 350424, 344299, 337701, 331225, 325128, 319071, 313034, 307533, 302643, 297715, 292516, 287745, 283900, 280484, 276954, 273760, 271792, 271305, 271919, 273300, 275301, 277760, 280574, 283745, 287137, 290533, 294069, 298165, 302903, 307868, 312755, 317599, 322292, 326454, 329983, 333175]
57726C33175K913K248J446J155J467J864J870J255l3j471k124j813j632k531l911
57711C33878m503m104l499l140k910k827k926k645j378M37J713K106K183K367
57697C14752K514K517K495K474K471K757L380L738L358K775K852L457L731L473
57683C56744L368L817M385M500M100L506L147L359M076M798N243N622N995N959
57669D18619N505N584O969R047J0547J1034J0979J0865J1106J2303J4433J6279
57657E43270J6718J6273J6370J7351J8450J9373K0603K2207K3647K4831K6269
57646G65362K8035K9691L1354L3740L6991M0500M4094M8305N3204N7987O2229
57635A231492O6580P1762P7666Q3980R1026R9334J08757J18457J27669J36273
$$ y = [333175, 336088, 338336, 339782, 340937, 342404, 344268, 346138, 347393, 347360, 345889, 343765, 341952, 340320, 337789, 333878, 329375, 325271, 321772, 318632, 315722, 312895, 309969, 307324, 305946, 306383, 308096, 310202, 312385, 314752, 317266, 319783, 322278, 324752, 327223, 329980, 333360, 337098, 340456, 343231, 346083, 349540, 353271, 356744, 360112, 363929, 368314, 372814, 376914, 380420, 383567, 386926, 391002, 395800, 401043, 406665, 412660, 418619, 424124, 429708, 436677, 445724, 456271, 467305, 478284, 489149, 500255, 512558, 526991, 543270, 559988, 576261, 592631, 609982, 628432, 647805, 668408, 690615, 714262, 739093, 765362, 793397, 823088, 854442, 888182, 925173, 965673, 1009767, 1058072, 1111276, 1169263, 1231492, 1298072, 1369834, 1447500, 1531480, 1622506, 1721840, 1830597, 1949054, 2076723, 2212996]
57625B212996J44748J53493J62029J68977J73044J73549J69695J60046J43581
57616C662158J20956R3907O4012L2999L637k1199m0388n4361o3482o8335p1699
57605C658205p8209r0784j08154j26413j41979j52573j56846j54587j47134j36610
57595B364916j24787j12771j01159q9973p8856o7855n7601m8468m0080l2014k4472
57584A586880j7808j1828o085n13M726R748J4972K0724K7070L3899M0958M8068
57572A750811N5322O2937P0875P8899Q6941R4991J02784J09944J16395J22148
57562B652047J26783J29625J30191J27764J20783J07605Q8086O3695L5995N865
57552C588439k5553n6114q3436j06035j23428j35688j43302j46959j47219j44588
$$ y = [2212996, 2357744, 2511237, 2673266, 2842243, 3015287, 3188836, 3358531, 3518577, 3662158, 3783114, 3877021, 3941033, 3974032, 3977669, 3956470, 3916082, 3861721, 3798239, 3729904, 3658205, 3579996, 3489212, 3381058, 3254645, 3112666, 2960093, 2803247, 2648660, 2501526, 2364916, 2240129, 2127358, 2026199, 1936226, 1857370, 1789515, 1731914, 1683446, 1643366, 1611352, 1586880, 1569072, 1557244, 1551159, 1550646, 1555372, 1565120, 1580092, 1600816, 1627886, 1661785, 1702743, 1750811, 1806133, 1869070, 1939945, 2018844, 2105785, 2200776, 2303560, 2413504, 2529899, 2652047, 2778830, 2908455, 3038646, 3166410, 3287193, 3394798, 3482884, 3546579, 3582574, 3588439, 3562886, 3506772, 3423336, 3317301, 3193873, 3058185, 2914883, 2767924, 2620705, 2476117]
57542B476117j39906j34115j27553j20013j11589j03002r4982q7775q1220p4847
57532A401115o8110o1160n5143n0896m7626m3941l9842l6427l3737l0587k6787
57521I06859k3835k2554k1652j9657j7032j5130j4051j2919j1555j0502r769q665
57509G19538o821m502k167l44M96O20J125K619M271N004N115N776P280Q855J0017
57494G56882J1088J2415J3915J5464J7112J8871K0826K3271K6167K8801L0711
57483I75523L2707L6058M0767M5585M9709N3583N7818O2308O6843P1829P7743
57472A570473Q4264R0473R5810J00453J04769J08596J11054J10945J07294R9469
57462B583600Q6990O9647M8061K3832j141k5418m7958o7707q3673r5305j02628
$$ y = [2476117, 2336211, 2202096, 2074543, 1954530, 1842941, 1739939, 1644957, 1557182, 1475962, 1401115, 1333005, 1271845, 1216702, 1165806, 1118180, 1074239, 1034397, 997970, 964233, 933646, 906859, 883024, 860470, 838818, 819161, 802129, 786999, 772948, 760029, 748474, 737972, 728203, 719538, 712717, 708215, 706048, 705704, 706200, 706820, 707945, 710564, 714835, 719839, 724954, 730730, 738010, 746865, 756882, 767970, 780385, 794300, 809764, 826876, 845747, 866573, 889844, 916011, 944812, 975523, 1008230, 1044288, 1085055, 1130640, 1180349, 1233932, 1291750, 1354058, 1420901, 1492730, 1570473, 1654737, 1745210, 1841020, 1941473, 2046242, 2154838, 2265892, 2376837, 2484131, 2583600, 2670590, 2740237, 2788298, 2812130, 2810989, 2785571, 2737613, 2669906, 2586233, 2490928, 2388300]
57451B388300j06200j07023j06112j03819r9860r4197q7575q0897p4542o8467
57441A459608o2493n6163m9003m1528l5241l0953k7618k3708j9173j4989j1335
57430A087404p458l284K77K850N248Q231J1573J4878J8437K2659K7320L2057L7082
57417A257274M2702M8454N3398N7357O1320O6448P2808P9259Q4619Q8850R2752
57406B005241R6363R8198R6522R0995Q2275P0309N4043L3075Q750j6718m1552
57395B577501o4509q4381j00109j11208j17761j20256j19635j17040j13138j08022
57385A521442j01923r5543q9303q2844p5819o8817o2853n8145n4019m9948m6084
57374G36144m2700l9549l6131l2320k8621k5783k4101k3041k1694j9749j7806
$$ y = [2388300, 2282100, 2175077, 2068965, 1965146, 1865286, 1771089, 1683514, 1602617, 1528075, 1459608, 1397115, 1340952, 1291949, 1250421, 1215180, 1184227, 1156609, 1132901, 1113728, 1098739, 1087404, 1079946, 1076662, 1076939, 1079789, 1085037, 1093268, 1104841, 1119719, 1138156, 1160815, 1188135, 1220192, 1257274, 1299976, 1348430, 1401828, 1459185, 1520505, 1586953, 1659761, 1739020, 1823639, 1912489, 2005241, 2101604, 2199802, 2296324, 2387319, 2469594, 2539903, 2593946, 2627021, 2635771, 2619053, 2577501, 2512992, 2428611, 2328502, 2217294, 2099533, 1979277, 1859642, 1742602, 1629464, 1521442, 1419519, 1323976, 1234673, 1151829, 1076010, 1007193, 944340, 886195, 832176, 782228, 736144, 693444, 653895, 617764, 585444, 556823, 531040, 506939, 483898, 462204, 442455, 424649]
57363D24649j6545j5820j4948j3776j2926j2851j3081j2748j1601j0141q841p717
57351B73654o722o107o011n985n419m494m053m445m933m589l398k095j290j165
57337B12948j639k277k296j390m21n88j926l252l604l025j969p44J99K46n97j521
57321A88144j919k052k339k580k495k386k605k756k256j391j011j274j448j027
57307A60605l72o9j70l22k48O2M42O50N12J17k71m37k95R7M64L99k36j068j618
57288A58242j813j876j911j880j841j886j915j752j456j216j008o41q5M41P51
57273A40154P81N42J40k10l79l83k35J86Q71J622K299K848L006K379J150R6l44
57256A54523m91n24K8J249K099J757J085J514K906L925M222M721N640N910N034
$$ y = [424649, 408104, 392284, 377336, 363560, 350634, 337783, 324702, 311954, 300353, 290212, 281371, 273654, 266932, 260825, 254814, 248829, 243410, 238916, 234863, 230418, 225485, 220896, 217498, 215403, 214113, 212948, 211309, 209032, 206736, 205346, 204925, 204337, 202411, 199159, 195555, 192530, 190561, 189817, 190016, 190262, 189665, 188144, 186225, 184173, 181834, 179254, 176759, 174373, 171768, 169012, 166756, 165365, 164354, 163080, 161632, 160605, 160233, 160164, 159994, 159672, 159424, 159486, 159928, 160578, 161090, 161207, 160936, 160499, 160204, 160301, 160765, 161164, 160928, 159860, 158242, 156429, 154553, 152642, 150762, 148921, 147035, 145120, 143368, 141912, 140696, 139688, 139047, 138962, 139403, 140154, 140935, 141477, 141617, 141407, 141028, 140645, 140410, 140596, 141467, 143089, 145388, 148236, 151242, 153621, 154771, 154867, 154523, 154032, 153508, 153536, 154785, 156884, 158641, 159726, 161240, 164146, 168071, 172293, 177014, 182654, 188564, 193598]
57241A93598M006L699L734L813M729O846Q753Q974Q265Q608J0308J1741J1899
57228B88973J1647J2142J3247J4136J4539J4711J4823J4951J5308J6001J6812
57217D47290J7549J8277J8999J9344J8929J7706J5720J2674Q286L013j974n782
57205E90031q539j0863j2793j3662j3158j2002j1152j0679r955q746p460o308
57193D64714m938l138j339j36K90Q6l70l57P74K707M264M782M766M859M966N010
57177D86940N701P601R907J1234J1389J1461J2301J3744J5329J6998J8904K1112
57165F42621K3539K5817K7325K7864K8133K9006L0506L2045L3434L4979L6657
57154I71926L7942L8463L8299L7634L6646L5726L5257L5177L5206L5345L5738
$$ y = [193598, 197604, 201303, 205037, 208850, 213579, 220425, 229178, 238152, 246417, 255025, 265333, 277074, 288973, 300620, 312762, 326009, 340145, 354684, 369395, 384218, 399169, 414477, 430478, 447290, 464839, 483116, 502115, 521459, 540388, 558094, 573814, 586488, 594774, 597787, 595813, 590031, 581492, 570629, 557836, 544174, 531016, 519014, 507862, 497183, 487228, 478482, 471022, 464714, 459776, 456638, 455299, 455163, 455453, 455539, 455169, 454812, 455586, 458293, 462557, 467339, 472105, 476964, 481930, 486940, 492641, 500242, 510149, 521383, 532772, 544233, 556534, 570278, 585607, 602605, 621509, 642621, 666160, 691977, 719302, 747166, 775299, 804305, 834811, 866856, 900290, 935269, 971926, 1009868, 1048331, 1086630, 1124264, 1160910, 1196636, 1231893, 1267070, 1302276, 1337621, 1373359]
57143A373359L6225L6634L7250L8447M0006M1389M2415M3185M3542M3379M3054
57132A818885M2845M2280M0916L9401L8792L8983L8875L8052L7312L7450L8436
57121B252227L9783M0964M1473M1296M1219M1850M2602M2524M1822M1418M1317
57110B708495M0827M0181M0415M1458M1960M1340M0574M0365L9996L8701L7030
57099C151342L5970L5566L5091L3965L2055K9680K7624K6517K6063K5434K4240
57088C483547K2245J8612J2659N250j932q415j4873k1440k7749l4388m2280n0576
57076C340660n7299o2383o7901p4848q1998q8476r5209j02819j10397j17415j24887
57065B357028j33587j43158j53975j67921j86044k07330k30633k56043k83610
$$ y = [1373359, 1409584, 1446218, 1483468, 1521915, 1561921, 1603310, 1645725, 1688910, 1732452, 1775831, 1818885, 1861730, 1904010, 1944926, 1984327, 2023119, 2062102, 2100977, 2139029, 2176341, 2213791, 2252227, 2292010, 2332974, 2374447, 2415743, 2456962, 2498812, 2541414, 2583938, 2625760, 2667178, 2708495, 2749322, 2789503, 2829918, 2871376, 2913336, 2954676, 2995250, 3035615, 3075611, 3114312, 3151342, 3187312, 3222878, 3257969, 3291934, 3323989, 3353669, 3381293, 3407810, 3433873, 3459307, 3483547, 3505792, 3524404, 3537063, 3542313, 3540381, 3531966, 3517093, 3495653, 3467904, 3433516, 3391236, 3340660, 3283361, 3220978, 3153077, 3078229, 2996231, 2907755, 2812546, 2709727, 2599330, 2481915, 2357028, 2223441, 2080283, 1926308, 1758387, 1572343, 1365013, 1134380, 878337, 594727]
57056E94727B81671f3819l82954m25315m70415n17953n70373o28864o92077p60210
57046d511980q36904r25515j027182j144278j281790j443996j635202j866567
57038a4673414k156888k522695k971883l509345m142135m875004n708617o647508
57030d7207489p699413q854705j0071492j1293173j2480846j3623288j4718131
57023a25948537j5736986j6571359j6973997j6572327j5019537j2211087q387086
57016b27420916m030215L38678M306771P613382J0150418J1950536J3140718J3865881
57008a70084747J4235215J4318927J4164684J3801852J3242544J2496327J1587570
57001g6237628J0558334R461320Q354026P291639O315005N443096M677545M011664
$$ y = [594727, 281671, -63819, -446773, -872088, -1342503, -1860456, -2430829, -3059693, -3751770, -4511980, -5348884, -6274399, -7301581, -8445859, -9727649, -11171645, -12806847, -14673414, -16830302, -19352997, -22324880, -25834225, -29976360, -34851364, -40559981, -47207489, -54906902, -63761607, -73833099, -85126272, -97607118, -111230406, -125948537, -141685523, -158256882, -175230879, -191803206, -206822743, -219033830, -227420916, -231451131, -231112453, -226805682, -219192300, -209041882, -197091346, -183950628, -170084747, -155849532, -141530605, -127365921, -113564069, -100321525, -87825198, -76237628, -65679294, -56217974, -47863948, -40572309, -34257304, -28814208, -24136663, -20124999]
56993b0124999L434803K935079K504400K139828J837682J588563J380362J203506
56985c100776J051279R18315c29191C73687O20822N51719M90287M34011L82664
56976B853190L36086K94523K59120K29658K03329J77803J54004J33930J17279
56967D758922J02155Q7646P3651N9589M5320L2228K1386J1547P08j1244k3162
56956E158746l4952m7418o0459p3206q5562r8181j11134j23850j36356j49947
56946D237681j66745j88275k13039k35204k47671k47937k39818k28528k15417
56937B255047j98702j77584j53875j30613j10805r6594q7810q1799p6007p0273
56927A070985o5707o2277n9033n5836n3264n1309m9605m8454m8293m8486m7875
$$ y = [-20124999, -16690196, -13755117, -11250717, -9110889, -7273207, -5684644, -4304282, -3100776, -2049497, -1131182, -329191, 373687, 994509, 1546228, 2036515, 2470526, 2853190, 3189276, 3483799, 3742919, 3972577, 4175906, 4353709, 4507713, 4641643, 4758922, 4861077, 4948723, 5022374, 5081963, 5127283, 5159511, 5180897, 5192444, 5193152, 5181908, 5158746, 5123794, 5076376, 5015917, 4942711, 4857149, 4758968, 4647834, 4523984, 4387628, 4237681, 4070936, 3882661, 3669622, 3434418, 3186747, 2938810, 2698992, 2470464, 2255047, 2056345, 1878761, 1724886, 1594273, 1483468, 1386874, 1299064, 1217265, 1141258, 1070985, 1005278, 943001, 883968, 828132, 774868, 723559, 673954, 625500, 577207, 528721, 480846]
56916D80846m6135m3486l9748l4961l0347k7190k5013k2224j8276j3982j0008
56905A69476o381l342j344j93P47J486J597J309J405K016K456K238J306o14l908
56890A68254q066j1686j3686j4075j3517j2622j1618j0273q237n757l666k336
56878E2715j217J69J458K314L395N360P605Q944R160Q811P813N400J422l198p362
56863A02789j0399j1929j1982j1254j0620j0370j0266j0086F280b166o651m926
56851a3743l795k956k085j684k232l129l396l033k653k277j493m35M48J289K440
56836c8734L535L973L999M282M727M842M932b757D053P442P694Q369R052Q061
56822D4671M649m7m566q360j1169j2373A063h835p622n219k935j037P60L090N917
$$ y = [480846, 434711, 391225, 351477, 316516, 286169, 258979, 233966, 211742, 193466, 179484, 169476, 163095, 159753, 158409, 158216, 158963, 160449, 162046, 163355, 164760, 166776, 169232, 171470, 172776, 172162, 168254, 160188, 148502, 134816, 120741, 107224, 94602, 82984, 72711, 64474, 58717, 55051, 52715, 51498, 51667, 53125, 55439, 58834, 64194, 71799, 80743, 89903, 98714, 106527, 111927, 113349, 110151, 102789, 92390, 80461, 68479, 57225, 46605, 36235, 25969, 15883, 6280, -2166, -8817, -13743, -17538, -20494, -22579, -24263, -26495, -29624, -33020, -36053, -38706, -40983, -42476, -42911, -42463, -41174, -38734, -35199, -31226, -27227, -22945, -18218, -13376, -8444, -2757, 4053, 11495, 19189, 27558, 36610, 44671, 49320, 49273, 44707, 36347, 25178, 12805, 1063, -8835, -16457, -21676, -24611, -25648, -24888, -21798, -15881]
56807a5881g356C447J3578J7254K1069K4062K6170K7896K9466L0567L0332K7521
56795B51362K1453J3072M445k857q255j1326j1728j0148q112o351m321j610J270
56782B26894M018P265J1422J5808J9662K3246K7133L1257L5473M0117M4792M7062
56770E34149M3732L3651J8735K432j2203k3309l0226l3320l3496l1666k8599k5020
56758D14860k1491j8200j4858j0901n934l07M966R251J3094J7542K2884K8441
56746D39347L3183L5629L3619K5646J2813j502j4264k4269l1145l4446l4355l2161
56734D08095k9064k5355k1303j7818j5316j2890r626n984k863n8L237O899J0134
56721B88088J2836J5438J7409J7118J3396O613j860j0452j7650k2388k4596k5068
$$ y = [-15881, -7356, 3447, 17025, 34279, 55348, 79410, 105580, 133476, 162942, 193509, 223841, 251362, 272815, 285887, 290332, 287475, 279220, 267894, 256166, 246018, 237906, 231555, 227234, 225624, 226894, 230912, 238177, 249599, 265407, 285069, 308315, 335448, 366705, 402178, 442295, 487087, 534149, 577881, 611532, 630267, 632699, 620496, 597187, 566961, 533641, 500145, 468479, 439880, 414860, 393369, 375169, 360311, 349410, 343476, 343169, 348135, 357386, 370480, 388022, 410906, 439347, 472530, 508159, 541778, 567424, 580237, 578735, 564471, 540202, 509057, 474611, 440256, 408095, 379031, 353676, 332373, 314555, 299239, 286349, 276723, 270739, 267876, 267818, 271055, 277954, 288088, 300924, 316362, 333771, 350889, 364285, 370898, 369038, 358586, 340936, 318548, 293952, 268884]
56709B68884k4654k3726k2313k0412j8199j6093j4455j3075j1343r156p162n840
56697H2456m884l970l408l459l544k959j985j464j585j897k176k475k560k130
56683D3960j526j390j672j737j381j020q85q02p33q80j199j475j817k433k921
56668B2089k612j673j063j216j505j295p74l56N3O29R92N82m82j425j600j096
56652I248n47n36j040j443j203m38K69N02K36l76j100j550E25f07p90m50J6L59
56634a472K96K34B2K442L566L529K873K759L563M622N126M867M103L167K325J807
56618D4771J715J851J773J209M08j17k58m04p79j041p90j53M35Q10R91Q32J95
56601E1448n74r19p31m19k96l34m73q32j427j951j924j069L25J368J252J96o97
$$ y = [268884, 244230, 220504, 198191, 177779, 159580, 143487, 129032, 115957, 104614, 95458, 88296, 82456, 77572, 73602, 70194, 66735, 63191, 60232, 58247, 56783, 55198, 53301, 51125, 48650, 46090, 43960, 42434, 41044, 39372, 37635, 36254, 35234, 34349, 33547, 32814, 31934, 30735, 29260, 27443, 25010, 22089, 19477, 17804, 16741, 15525, 14020, 12725, 11951, 11595, 11648, 12277, 13269, 13851, 13369, 11944, 10344, 9248, 8701, 8165, 7125, 5682, 4479, 4041, 4310, 4812, 5048, 4672, 3572, 2022, 525, -607, -1397, -1847, -1831, -1472, -1176, -942, 22, 2464, 6030, 9559, 12432, 15191, 18754, 23376, 28502, 33369, 37472, 40639, 42964, 44771, 46486, 48337, 50110, 51319, 51727, 51610, 51352, 50948, 50169, 49128, 48338, 48185, 48620, 49430, 50421, 51253, 51448, 50874, 49955, 49224, 48805, 48509, 48175, 47702, 46870, 45443, 43492, 41568, 40499, 40824, 42192, 43444, 43640, 42943]
56584D2943p56m48m31n37l60k64q10j543j422m37L04K12j01kK52K81L24O68J005
56565C8878R37O46M36J64l13n72j69N50Q54O56N55Q83J315J394J066N74J60%J36
56546D8150M14O00O30O16O58P75R94J320J603J530Q76k29j266j627j064P5J067
56529E5122J378J068P19Q46J337J481Q19j61m48K59J166J375R52O58R05J385J621
56512G0482J546J587K215L360M231M049L079K467K881L796M436M738M884M594
56498A18345L687K862K952L693M143M079M069M255M131L579L133K973K613J792
56484A66306Q66L0j004k208k876k583j821j288j133j304j976l075l918l930l394
56469A36692l015k984k947k648k240k047k229k548k419j509l59l8j000k606l799
$$ y = [42943, 42187, 41739, 41308, 40771, 40411, 40147, 39337, 37794, 36372, 35935, 36239, 36451, 36350, 36348, 36600, 36881, 37205, 37873, 38878, 39815, 40461, 40897, 41061, 40748, 40176, 40007, 40557, 41411, 42067, 42622, 43505, 44820, 46214, 47280, 47854, 48014, 48014, 48150, 48564, 49164, 49794, 50410, 51068, 51843, 52837, 54157, 55760, 57290, 58166, 57937, 56671, 55044, 53980, 54055, 55122, 56500, 57568, 58287, 59133, 60470, 61951, 62770, 62609, 62161, 62420, 63586, 64961, 65913, 66571, 67476, 68861, 70482, 72028, 73615, 75830, 79190, 83421, 87470, 90549, 93016, 95897, 99693, 104129, 108867, 113751, 118345, 122032, 124894, 127846, 131539, 135682, 139761, 143830, 148085, 152216, 155795, 158928, 161901, 164514, 166306, 167172, 167202, 166198, 163990, 161114, 158531, 156710, 155422, 154289, 152985, 151009, 147934, 144016, 140086, 136692, 133677, 130693, 127746, 125098, 122858, 120811, 118582, 116034, 113615, 112106, 111747, 111709, 110709, 108103, 104304]
56454A04304l975l174j958j086q96r13m81K74O63M83J90Kk71n22k99K78M65N8
56436I3142k64n2K82L92N76R34Q23p6r69r13q7P04J172J487J557J233Q56R07J291
56417A02995J521J422J228J169J361J736J991J927K037L066M699N508M677L025
56403A38362J794J209R26J035J669K274K208J683J278J005O06L09M00M84J19k24
56387A55137J59Q76Q01k66j290j308m04O75J271J226J035J420K308K657J791M24
56371A66512l03l56n13j022j431j542j576j548j372j385j958k691k791k165j460
56356A44399j139j233j701k299k372j667j015j228j709j220J51J062R65P30J038
56341A32762J324Q85N6l28j4O03J030J000N89J83K1j56o04r21n58J89M63M8m29
$$ y = [104304, 100329, 97155, 95197, 94111, 93215, 92302, 91821, 92095, 92758, 93241, 93431, 93433, 93162, 92640, 92341, 92619, 93084, 93142, 92878, 92826, 93108, 93500, 94076, 95010, 95833, 95757, 94788, 93875, 93788, 94492, 95664, 97151, 98708, 99941, 100797, 101704, 102995, 104516, 105938, 107166, 108335, 109696, 111432, 113423, 115350, 117387, 120453, 125152, 130660, 135337, 138362, 140156, 141365, 142291, 143326, 144995, 147269, 149477, 151160, 152438, 153443, 154049, 154358, 154758, 155242, 155361, 155137, 155296, 156172, 156973, 156707, 155417, 154109, 153705, 154380, 155651, 156877, 157912, 159332, 161640, 164297, 166088, 166512, 166209, 165853, 165340, 164318, 162887, 161345, 159769, 158221, 156849, 155464, 153506, 150815, 148024, 145859, 144399, 143260, 142027, 140326, 138027, 135655, 133988, 132973, 131745, 130036, 128816, 128967, 130029, 130994, 131724, 132762, 134086, 134971, 135027, 134699, 134685, 135288, 136318, 137318, 137907, 138090, 138111, 137955, 137351, 136430, 135872, 136061, 136524, 136572, 136143]
56322A36143m35j0O34J270J497J190R54J377J999J927J309J117J555J786J385
56307A53698R20Q42R56J182J834K681K806J955J082J006J331J365J296J691K377
56292A77022K599K057J270R98J609K737L493L224K238J447J317J587J941K336
56278B05875K652K626K342K285K759L636M631N434N701N452N295N687O213O171
56264B66759N676N431N634N922O171O453O470N984N587N961O537O123M761L701
56250C47170L464L289K703K253K300K295J811J258J097J256J650K388L151L382
56236C79467L290L676M527M973M892N309O702Q171Q904R302J0030J0958J1771
56223D71972J2668J3896J5317J6917J8892K0869K2106K2758K3951K6155K8659
$$ y = [136143, 135708, 135698, 136332, 137602, 139099, 140289, 141243, 142620, 144619, 146546, 147855, 148972, 150527, 152313, 153698, 154618, 155460, 156416, 157598, 159432, 162113, 164919, 166874, 167956, 168962, 170293, 171658, 172954, 174645, 177022, 179621, 181678, 182948, 183946, 185555, 188292, 191785, 195009, 197247, 198694, 200011, 201598, 203539, 205875, 208527, 211153, 213495, 215780, 218539, 222175, 226806, 232240, 237941, 243393, 248688, 254375, 260588, 266759, 272435, 277866, 283500, 289422, 295593, 302046, 308516, 314500, 320087, 326048, 332585, 338708, 343469, 347170, 350634, 353923, 356626, 358879, 361179, 363474, 365285, 366543, 367640, 368896, 370546, 372934, 376085, 379467, 382757, 386433, 390960, 395933, 400825, 406134, 412836, 421007, 429911, 439213, 449243, 460201, 471972, 484640, 498536, 513853, 530770, 549662, 570531, 592637, 615395, 639346, 665501, 694160]
56212F94160L0986L3542L6447L9080M1431M4588M9061N3939N8491O3371O9325
56201A214421P5842Q2027Q7790R3366R8681J03850J09222J14273J17756J19561
56191B216789J20941J22017J20821J15995J08737J00527R0522P7104O0851M4007
56181C178311K7795J2106k803j6155k7889l8463m7735n5250o1236o6034o9144
56170B833503p0200p0406p1455p3408p4998p5854p6944p8940q1324q3241q4222
56159A992511q4149q3228q1968q0540p8528p5818p3050p0533o7523o3497n9298
56148A174379n5946n3093m9698m5655m1584l7748l4171l1276k9219k7293k4990
56137G43706k2920k1575k0102j7640j5006j3531j2911j1786r958q387p409o467
$$ y = [694160, 725146, 758688, 795135, 834215, 875646, 920234, 969295, 1023234, 1081725, 1145096, 1214421, 1290263, 1372290, 1460080, 1553446, 1652127, 1755977, 1865199, 1979472, 2097228, 2216789, 2337730, 2459747, 2580568, 2696563, 2805300, 2905827, 2996349, 3073453, 3134304, 3178311, 3206106, 3218212, 3215409, 3199254, 3171365, 3132902, 3085167, 3029917, 2968681, 2902647, 2833503, 2763303, 2692897, 2621442, 2548034, 2473036, 2397182, 2320238, 2241298, 2159974, 2076733, 1992511, 1908362, 1825134, 1743166, 1662626, 1584098, 1508280, 1435230, 1364697, 1297174, 1233677, 1174379, 1118433, 1065340, 1015642, 969987, 928403, 890655, 856484, 825208, 795989, 768696, 743706, 720786, 699211, 679109, 661469, 646463, 632932, 620021, 608235, 598277, 589890, 582481, 576014]
56125E76014n426m680m114l174j861n60P76K261L361L698M041N331P154Q377Q732
56110E99930Q688Q356P757P479P781P734O564N094M431M131L258K452L026M674
56096F81355N957O626P546Q748R511J0114J1560J3693J5451J6868J8980K1793
56084H28202K4247K6246K8897L2557L6301L9615M3120M7492N2970N9882O8162
56073A287691P6352Q2496Q6043Q7532Q6759Q2859P6180O8499O1326N5273N0764
56062B101774M7639M4255L8514K9920J9424P749m506j5707k4108k9993l5215m0860
56050B138886m6942n3923o2353p1035p7519q0635q1045p9416p5800p0671o4881
56039A374666n8614n1938m5951m1710l8454l4751l0822k7807k5364k2333j9245
$$ y = [576014, 570588, 565908, 561794, 558620, 556759, 556199, 556975, 559236, 562597, 566295, 570336, 575667, 582821, 591198, 599930, 608618, 616974, 624731, 632210, 639991, 647725, 654289, 659383, 663814, 667945, 671203, 673655, 676681, 681355, 687312, 693938, 701484, 710232, 719743, 729857, 741417, 755110, 770561, 787429, 806409, 828202, 852449, 878695, 907592, 940149, 976450, 1016065, 1059185, 1106677, 1159647, 1219529, 1287691, 1364043, 1446539, 1532582, 1620114, 1706873, 1789732, 1865912, 1934411, 1995737, 2051010, 2101774, 2149413, 2193668, 2232182, 2262102, 2281526, 2289275, 2284769, 2269062, 2244954, 2214961, 2179746, 2138886, 2091944, 2038021, 1975668, 1904633, 1827114, 1746479, 1665434, 1586018, 1510218, 1439547, 1374666, 1316052, 1264114, 1218163, 1176453, 1137999, 1103248, 1072426, 1044619, 1019255, 996922, 977677]
56028I77677j7607j7007j5504j2757j0268q596o834m899l695k916j241J108K489
56015H79950K677L087M048M479M446N369P323Q730R177R921J1281J2078J2100
56002I74666J2575J3743J4478J4600J5040J5547J4910J3742J4080J5884J6904
55991A136169J6531J6675J8224J9623J9899K0200K1400K2724K3611K4458K5141
55980A364655K5156K5574K8032L1764L4456L6061L8436M1330M2501M2100M2954
55969A753019M5930M8845N0735N3271N7026O0278O2548O5565O9686P3138P5718
55958B415759P9438Q4597Q9064R2302R6142J00922J05027J08838J14632J21935
55948C408656J27782J32156J38127J45884J52188J56767J63351J73014J82525
$$ y = [977677, 960070, 943063, 927559, 914802, 904534, 895938, 889104, 884205, 880510, 877594, 876353, 877461, 879950, 882627, 885714, 889762, 894241, 898687, 904056, 911379, 920109, 929286, 939207, 950488, 962566, 974666, 987241, 1000984, 1015462, 1030062, 1045102, 1060649, 1075559, 1089301, 1103381, 1119265, 1136169, 1152700, 1169375, 1187599, 1207222, 1227121, 1247321, 1268721, 1291445, 1315056, 1339514, 1364655, 1389811, 1415385, 1443417, 1475181, 1509637, 1545698, 1584134, 1625464, 1667965, 1710065, 1753019, 1798949, 1847794, 1898529, 1951800, 2008826, 2069104, 2131652, 2197217, 2266903, 2340041, 2415759, 2495197, 2579794, 2668858, 2761160, 2857302, 2958224, 3063251, 3172089, 3286721, 3408656, 3536438, 3668594, 3806721, 3952605, 4104793, 4261560, 4424911, 4597925, 4780450]
55939D780450J90926K01603K15886K30701K44777K60943K80210K99766L19035
55930G024297L41283L67066L92783M17849M46047M77583N07544N34911N64971
55921A1074334O00133O36916O75147P20834P76136Q35981Q98685R70048J052561
55912A8240775J141082J234224J339456J461989J600471J759845J956704K205058
55904C0939604K507173K862022L268359L715415M188853M693726N254546N887512
55896F3317210O594978P393721Q321100R404050J0652527J2089068J3738628J5578706
55888A47089988J7560868J9672407K1788610K3278269K2860194J9223889J2104024
55881B83578249K789803o516754j3931840j8661448k0905524k1322821k0603913
$$ y = [4780450, 4971376, 5172979, 5388865, 5619566, 5864343, 6125286, 6405496, 6705262, 7024297, 7365580, 7732646, 8125429, 8543278, 8989325, 9466908, 9974452, 10509363, 11074334, 11674467, 12311383, 12986530, 13707364, 14483500, 15319481, 16218166, 17188214, 18240775, 19381857, 20616081, 21955537, 23417526, 25017997, 26777842, 28734546, 30939604, 33446777, 36308799, 39577158, 43292573, 47481426, 52175152, 57429698, 63317210, 69912188, 77305909, 85627009, 95031059, 105683586, 117772654, 131511282, 147089988, 164650856, 184323263, 206111873, 229390142, 252250336, 271474225, 283578249, 286368052, 279851298, 265919458, 247258010, 226352486, 205029665, 184425752]
55874A84425752j9293854j7749347j6157922j4599732j3103007j1665368j0274964
55867H1581558q946364p727048o658438n745899m974001m330040l799790l358449
55859C6041529k982592k661719k388498k149039j932409j739162j571132j421917
55851A9195061j285256j163350j058948r67599q84932q13262p53998p01302o50127
55842A0916287o03155n63407n27155m90520m56164m27027l99930l71632l45134
55833F732163l23826l04992k85074k66062k50831k37262k22682k09336j99846
55824D432252j91615j81173j70110j61481j54185j45858j37606j31172j24922
55815C034130j17258j10659j07868j07198j05743j03941j02860j00349r4215q6314
$$ y = [184425752, 165131898, 147382551, 131224629, 116624897, 103521890, 91856522, 81581558, 72635194, 64908146, 58249708, 52503809, 47529808, 43199768, 39399978, 36041529, 33058937, 30397218, 28008720, 25859681, 23927272, 22188110, 20616978, 19195061, 17909805, 16746455, 15687507, 14719908, 13834976, 13021714, 12267716, 11566414, 10916287, 10313132, 9749725, 9222570, 8732050, 8275886, 7848859, 7448929, 7077297, 6732163, 6408337, 6103345, 5818271, 5552209, 5301378, 5064116, 4841434, 4632098, 4432252, 4240637, 4059464, 3889354, 3727873, 3573688, 3427830, 3290224, 3159052, 3034130, 2916872, 2806213, 2698345, 2591147, 2485404, 2381463, 2278603, 2178254, 2084039, 1997725]
55805A997725p9464p3135o5988n9586n5627n2299m7383m2216l8774l5637l0929
55794A416687k6694k6087k8262k9963l0356l0643l0711k9716k8409k7708k6532
55783A101606k3871k1212k0092j9315j7446j5790j5931j6519j5705j4689j5524
55772I05512j7294j7876j7678j8310j9169j8693j7557j7334j7328j5934j3936
55761G14403j3361j4007j4149j3614j3433j3324j2323j0998j0493j0244r024p336
55749E72097o382n764m447k913k089j379l8P67k31j855k222j794k255l506m400
55734E33589n219o833q428q766q709r826j1380j1473j0297r548r332q476p311
55721D17991p244p888p325n210l187k288k141k639m218o412q049q864r357r321
$$ y = [1997725, 1918261, 1845126, 1779138, 1719552, 1663925, 1611626, 1564243, 1522027, 1483253, 1447616, 1416687, 1389993, 1363906, 1335644, 1305681, 1275325, 1244682, 1213971, 1184255, 1155846, 1128138, 1101606, 1077735, 1056523, 1036431, 1017116, 999670, 983880, 967949, 951430, 935725, 921036, 905512, 888218, 870342, 852664, 834354, 815185, 796492, 778935, 761601, 744273, 728339, 714403, 701042, 687035, 672886, 659272, 645839, 632515, 620192, 609194, 598701, 588457, 579433, 572097, 565715, 559951, 555504, 552591, 550502, 549123, 549085, 549852, 549621, 547766, 545544, 543750, 541495, 537989, 533589, 528370, 521537, 513109, 504343, 495634, 485808, 474428, 462955, 452658, 443110, 433778, 425302, 417991, 410747, 402859, 395534, 390324, 387137, 384849, 382708, 380069, 375851, 369439, 361390, 352526, 343169, 333848]
55707C33848q285o864o074n714n090m598m873n127m307l150l097l813l852l194
55693B65810k986l289l234k999l493m377m480l914l857m422m655m361m150l943
55679B11650l289k788l344m322m276l197k207j505n18M00L40l65p30j037k187
55664A82625l540l626k755k600l340l538k886k682l300l436k387j081l00L63J208
55649A48725J750J870K167K745L039L075L571M538N154N110M730L801J867k55
55635A91887r62q5R34J279J587K229K433J691P15L60N66P52M32o88k300l277k794
55618A94759j499o11l00p3j83j070j898j437j90J59p10j505j608j750k250k421
55602A77413k045j790j861j698j250j099j119o03J99K70l47n33j09l5m69m39J14
$$ y = [333848, 325563, 318699, 312625, 306911, 301821, 297223, 292350, 287223, 282916, 279766, 276669, 272856, 269004, 265810, 262824, 259535, 256301, 253302, 249809, 245432, 240952, 237038, 233181, 228759, 224104, 219743, 215593, 211650, 208361, 205573, 202229, 197907, 193631, 190434, 188227, 186722, 186204, 186604, 186944, 186579, 185849, 184812, 182625, 179085, 175459, 172704, 170104, 166764, 163226, 160340, 157658, 154358, 150922, 148535, 147454, 147154, 147517, 148725, 150475, 152345, 154512, 157257, 160296, 163371, 166942, 171480, 176634, 181744, 186474, 190275, 192142, 191887, 190925, 190840, 191774, 193053, 194640, 196869, 199302, 200993, 201708, 202068, 202634, 203386, 203818, 203130, 200830, 197553, 194759, 193260, 192649, 192349, 192276, 192093, 191023, 189125, 187688, 187498, 187657, 186947, 185442, 183834, 182084, 179834, 177413, 175368, 173578, 171717, 170019, 168769, 167670, 166551, 165948, 166147, 166417, 166070, 165537, 165428, 165393, 164924, 164485, 164599]
55585A64599j05j595l182l915m139m114l376k224k141l711n516o070n553m778
55571A14180l834k713k073k298k751k835k844l109l214k798k191j665r94k84j58
55556H0419n77n90J44P19M73j6j48l53j065j659j361m61K27M56L87N8m20p66j041
55537G4426j562j985j461j41O06J08n31p7J026J402O68l27p06l23L81P78O08L06
55519G3196M31P70O87L10M44J200J734J556J121Q72P25P57J332K225K698K753
55503I2811L132L802L696K490J238N87k86k059l845m496m315m306m537m323l508
55488G6081k551j763j170q43o82l05L66Q11O24O6m04o05m60L1M53L74J96O93J595
55469G2507J763R68K88L09K81l27q08n34j74n68j392j893k061k231k239j902j583
$$ y = [164599, 164494, 162899, 159717, 155802, 151663, 147549, 144173, 141949, 139808, 136097, 130581, 124511, 118958, 114180, 110346, 107633, 105560, 103262, 100511, 97676, 94832, 91723, 88509, 85711, 83520, 81855, 80861, 80577, 80419, 79842, 79252, 79396, 80115, 80588, 80572, 80424, 80071, 79006, 77347, 75986, 75525, 75752, 76208, 76595, 76653, 76233, 75467, 74426, 72864, 70879, 69418, 69277, 69883, 69991, 69460, 69383, 70409, 71811, 72479, 72152, 71446, 71123, 71504, 72282, 72890, 73196, 73627, 74397, 75084, 75394, 75838, 77038, 78772, 80328, 81449, 82321, 83046, 83803, 85135, 87360, 90058, 92811, 95943, 99745, 103441, 105931, 107169, 107756, 107470, 105411, 101566, 97070, 92755, 88449, 83912, 79589, 76081, 73530, 71767, 70597, 69754, 69072, 68767, 69133, 69944, 70568, 70634, 70230, 69625, 69165, 69196, 69649, 70023, 70219, 70912, 72507, 74270, 75238, 75526, 75835, 76116, 75789, 74981, 74447, 74273, 73705, 72313, 70420, 68359, 66128, 63889, 61987, 60404]
55452F0404j563j517j236j105j272j231q16o43r71j200j113j442k384k848k177
55437C8886j347j310j471j080r18j958l326l356k044p99k87j04j43o57j206j081
55421A7799o01o14q59k98R90J758J507J029Q81O51R5l13l61o51j546k427k482
55404A4558j700o00L63Q94Q59N21L71N16N77K67l06r51j576j957j761j034l23
55387H718o1L8P05K128L366L104J252o90j306r71j017j630j751j090o43q05m87
55370H860R38K199J903O46o4j05m44j106j143m25R0n0k04R5M19K53k25m88k16
55351A0933N75J397J486O83j10m7M54M53O6K73J252K048J940J181K40p58j584
55334B0482j776j292o75l10j05O0O8o8j59k04l11l76l05m17q88j020L3J777K636
$$ y = [60404, 58841, 57324, 56088, 54983, 53711, 52480, 51664, 51021, 50050, 48850, 47737, 46295, 43911, 41063, 38886, 37539, 36229, 34758, 33678, 32760, 30802, 27476, 24120, 22076, 21277, 20990, 20886, 20743, 20086, 18880, 17799, 17198, 16584, 15725, 15427, 16417, 18175, 19682, 20711, 21592, 22243, 22338, 22025, 21664, 21013, 19467, 17040, 14558, 12858, 12258, 12621, 13515, 14374, 14895, 15266, 15782, 16359, 16626, 16320, 15369, 13793, 11836, 10075, 9041, 8718, 8657, 8695, 9400, 11528, 14894, 17998, 19250, 18560, 17254, 16283, 15266, 13636, 11885, 10795, 10152, 9347, 8860, 9798, 11997, 13900, 14546, 14482, 14377, 13933, 12827, 11684, 11259, 11349, 11299, 11095, 11190, 11609, 11862, 11637, 11149, 10933, 11508, 12905, 14391, 15074, 14964, 14917, 15371, 15824, 15890, 16163, 17415, 19463, 21403, 22584, 22824, 22066, 20482, 18706, 17414, 16739, 16429, 16324, 16384, 16452, 16384, 16225, 16021, 15710, 15334, 15029, 14612, 13724, 12704, 12737, 14514, 17150]
55315A7150J919N87k08n24j040j774k164j963j488j081q21o92o64o15l52J39N14
55298F923K93n07j071n49P93J716J570J130J348J845J573N38j44M8L20j39r36
55281A4751j124n65q6l44r95j139m12N58R04M96q4m12n38n61m16k46l15m20m0
55262I012O38P50R9l85q8M23N57O82J021P43o25j812j406o0N42L14M73R98N54
55243A2430q95j545m95Q28R44L93M40R38Q37n8j030j572j593j000J6O93N32L7
55225I900n7J16k1k98J3R61J665J395L36p45j228r95m26m0KJ0K40M97M41M7m33
55204A1380q21j000q58m48n0J41K15K55J29k41o36p67n71l8Q59J868K338J797
55186A3552N01q39j696j901j408l60P40J305J187P32K62k59r31j506j451m97R46
$$ y = [17150, 19069, 19656, 19448, 18924, 17884, 16110, 13946, 11983, 10495, 9414, 8593, 7901, 7237, 6622, 6270, 6409, 6923, 7216, 6709, 5638, 5089, 5882, 7598, 9168, 10298, 11646, 13491, 15064, 15602, 15458, 15506, 15826, 15687, 14751, 13627, 13062, 12976, 12632, 11637, 10498, 10086, 10644, 11548, 12044, 11960, 11548, 11010, 10449, 10033, 9787, 9472, 9052, 9012, 9650, 10400, 10499, 10114, 10026, 10449, 11006, 11688, 12709, 13452, 12827, 11015, 9609, 9549, 10091, 10405, 10878, 11876, 12430, 11535, 9990, 9495, 10323, 11267, 11660, 12100, 13038, 13875, 13817, 12787, 11215, 9622, 8622, 8638, 9331, 9863, 9900, 9843, 9959, 9938, 9640, 9653, 10614, 12279, 13674, 14010, 13265, 12037, 11042, 10616, 10576, 10578, 10588, 10828, 11325, 11766, 11813, 11380, 10559, 9559, 8701, 8253, 8203, 8344, 8559, 8814, 8943, 8702, 8066, 7299, 6728, 6690, 7549, 9417, 11755, 13552, 14053, 13214, 11518, 9617, 8209, 7849, 8589, 9894, 11081, 11813, 12075, 11816, 10885, 9379, 7928, 7431, 8377]
55169H377K032K226J726J110O56K14k80n04j06P26J295J024O7p84q42j68N84Q59
55151A8212O52L04J09K19O00R69R67N88K10O3q7m91r18r31n49k27k98o30q60p51
55131A7151l86p0J7Q7L93O75L88m03q90n31K85Q93J120J075P11J41j83j51l97
55112A9925j308k159k008j053k56K7J18M9m38j003r46l86j35l35k14N31J136R98
55094A2543N58M61O14O61O57O53L12m56r47m96M80R92O75n0p83j430j799j640
55076A1005j106o33k53M01J286J614Q25m24p23N26K331L128K372R05j03k29J99
55059B1121P38J201J577J843J854J379M09n93j003o87r0L45M64J68n10r62m18
55042B6836Q22J349M82n90l90P43J187M08m41l41L53P59P01M71J54k52l96J78
$$ y = [8377, 10409, 12635, 14361, 15471, 16127, 16341, 16061, 15557, 15451, 16177, 17472, 18496, 18563, 17779, 16937, 16769, 17353, 18212, 18864, 19168, 19277, 19496, 20096, 21065, 22032, 22620, 22830, 22893, 22806, 22315, 21397, 20466, 19917, 19690, 19392, 18762, 17902, 17151, 16765, 16695, 16712, 16799, 17192, 17867, 18255, 17852, 16962, 16431, 16716, 17609, 18729, 19804, 20515, 20656, 20473, 20322, 19925, 18617, 16458, 14450, 13397, 13141, 13168, 13286, 13335, 12897, 11894, 10948, 10562, 10427, 10092, 9878, 10409, 11545, 12543, 13101, 13562, 14176, 14837, 15494, 16147, 16459, 16003, 15056, 14560, 15040, 16032, 16707, 16657, 15874, 14444, 12645, 11005, 9899, 9266, 9013, 9414, 10700, 12314, 13139, 12715, 11992, 12518, 14849, 17977, 20349, 21254, 21151, 20922, 21121, 21859, 23060, 24637, 26480, 28334, 29713, 30122, 29529, 28526, 27839, 27749, 28094, 28558, 28726, 28216, 27254, 26836, 27658, 29007, 29489, 28899, 28509, 29252, 30439, 30847, 30406, 30065, 30418, 31177, 31878, 32349, 32503, 32251, 31855, 32033]
55024C2033J349K320K287J223l3n69l45l3O2L49R87J258N49n70j034o45j6M84
55006C9656Q91J068Q37M94L34n8j062j877j374lN12m04j368j089n1N00K39l21
54988C6924p82r96q12l70k13n67q98o30J33Q65J182Q64q6j062j134j71Q49J034
54970C4130N33l1n15j025j284r51k98K1j98n15m03K71J208J922K100J861J527
54953C8353J206Q11L01l36j151j815j536j33J185J069m1m12M62J180N95n90j165
54936C7983j144j223j283o50O47J836K387K293J595M09p54j297j155p52m32l11
54920C8149l49l29M0O67J075J055R28R31Q80P21Q65J518K177K308K050J813J637
54903E6136J497J701K376K935K779K248K206K855L600L996M276M845N696O389
$$ y = [32033, 33382, 35702, 37989, 39212, 39179, 38610, 38265, 38232, 38294, 38643, 39630, 40888, 41437, 40867, 39833, 39188, 39172, 39656, 40547, 41615, 42452, 42946, 43280, 43222, 42160, 40283, 38909, 38906, 39418, 39014, 37646, 36557, 36506, 37006, 37245, 36924, 36142, 35146, 34334, 33964, 33751, 33184, 32286, 31656, 31789, 32654, 33836, 34700, 34614, 33552, 32418, 32247, 33096, 34130, 34663, 34632, 34117, 33092, 31808, 30857, 30559, 30580, 30382, 29867, 29464, 29735, 30943, 32865, 34965, 36826, 38353, 39559, 40370, 40671, 40335, 39184, 37369, 35833, 35700, 36885, 37954, 37913, 37501, 37963, 39143, 39738, 39148, 37983, 36839, 35616, 34333, 33683, 34330, 36166, 38553, 40846, 42441, 42850, 42096, 40799, 39644, 38892, 38460, 38149, 37800, 37471, 37511, 38178, 39253, 40308, 41236, 42167, 43047, 43768, 44633, 46151, 48328, 50636, 52686, 54499, 56136, 57633, 59334, 61710, 64645, 67424, 69672, 71878, 74733, 78333, 82329, 86605, 91450, 97146, 103535]
54889A03535O520O179N903O050O264N961N214M545L839K294k77k937m805o012
54875A42273o954p448p305p049p166p178o362n047m212l992l519k278q53r0j53
54860G2667n38p30o35n28o58q16n06L89J443K315L161M140M991N428N600N861
54844A01584O341P046P885Q352P707N842L514J349q10l152n183o389p031p591
54830A19464p910p586o879o388o162n788n165m509l821l050k537k559k654k097
54816E2359j048m25p05j410j878j916j620j019k04N30Q19N00k48r41j191j075
54800D0528q92o39j34L27J64m21m07N45J392J140K62j23Q7J25k11k98J44N82M45
54781D2616j64o99p03j63L87K70n58j343j400p96Q9J072J887J952J103P4l49k60
$$ y = [103535, 110055, 116234, 122137, 128187, 134451, 140412, 145626, 150171, 154010, 156304, 156027, 153090, 148285, 142273, 135319, 127871, 120566, 113517, 106351, 99173, 92811, 87764, 83552, 79560, 76041, 73763, 72910, 72820, 72667, 72129, 71399, 70764, 70236, 69578, 68762, 68256, 68645, 70088, 72403, 75564, 79704, 84695, 90123, 95723, 101584, 107925, 114971, 122856, 131208, 138915, 144757, 148271, 149620, 148810, 145658, 140475, 134086, 127055, 119464, 111554, 103968, 97089, 90701, 84539, 78751, 73586, 69077, 65256, 62206, 59669, 57110, 54456, 52359, 51311, 50886, 50181, 48771, 46893, 44977, 43357, 42338, 42134, 42664, 43483, 43983, 43735, 42794, 41603, 40528, 39636, 38997, 38863, 39190, 39354, 38933, 38526, 39071, 40463, 41603, 41865, 41742, 41829, 41954, 41743, 41445, 41589, 42171, 42616, 42452, 41753, 41050, 40887, 41274, 41544, 40986, 39643, 38243, 37447, 37536, 38608, 40495, 42447, 43550, 43624, 43275, 43015]
54763D3015j53p2J37K10k5lQ58K095K712K492K019J656J367J300J680K203K334
54746F3825K106J927J843J687J798K644L928M852N259N677O278O666O725O871
54732A22086P336P783P810P283O155M486K617R07o05j925k790l127l471m321n381
54717A44843o027o153n891n025l510k192k009k577k595j482J16J367J965J997
54703A12827J820J921K274K215J615J588L050N154O399O765P414Q594R442R689
54689A80767R938J0141R376P499N574M163K549J66k380m348n864p252q312q838
54675A93179r174r678j0219j0494j0204q932o760m928m772n825o139m826l027
54662I8201k040j806j806k089k555k387j241j16j25j003j641j475p21K22Q98Q67
$$ y = [43015, 42862, 42790, 42927, 43137, 43112, 43109, 43967, 46062, 48774, 51266, 53285, 54941, 56308, 57608, 59288, 61491, 63825, 65931, 67858, 69701, 71388, 73186, 75830, 79758, 84610, 89869, 95546, 101824, 108490, 115215, 122086, 129422, 137205, 145015, 152298, 158453, 162939, 165556, 166463, 165858, 163933, 161143, 158016, 154545, 150224, 144843, 138816, 132663, 126772, 121747, 118237, 116045, 114036, 111459, 108864, 107382, 107498, 108865, 110830, 112827, 114647, 116568, 118842, 121057, 122672, 124260, 127310, 132464, 138863, 145628, 153042, 161636, 171078, 180767, 190705, 200846, 210222, 217721, 223295, 227458, 230007, 230173, 227793, 223445, 217581, 210329, 202017, 193179, 184005, 174327, 164108, 153614, 143410, 134478, 127718, 122790, 118018, 112193, 106054, 101228, 98201, 96161, 94355, 92549, 90460, 87905, 85518, 84277, 84161, 84036, 83033, 81392, 79917, 79196, 79418, 80316, 81183]
54646H1183K60k28k93l55o29o59k51Ok27l38K59J069J280Q57K82k28n95n26j7
54627H0850L46J98l0J29L84K59p7k16j84r5L25J233K173K630K683K590K349K146
54609I7693K532L516M093L500K321J626J579J694J895K404K954L058K818K589
54595A34272K179J266M27O96K103L498M037M054M276M714M817M446M193M690N770
54580A85438O625O800O650O515N920M294K127M20q51k593m879o632p396q091r308
54565A85039j0079r347p707o548o172n822n098m271l516k768k130j715j253n63
54551A18050l6p1l61l89k34k48l67l10j07J42M95O34j55j773k856k483j598j709
54533A06624k741l445l406l296l370l139k582k344k504k244j164m8P0r12k220
$$ y = [81183, 81443, 81215, 80922, 80567, 79938, 79279, 79028, 79034, 78807, 78469, 78728, 79797, 81077, 81934, 82216, 81988, 81393, 80867, 80850, 81196, 81394, 81364, 81493, 81877, 82136, 82059, 81843, 81659, 81564, 81889, 83122, 85295, 87925, 90608, 93198, 95547, 97693, 100225, 103741, 107834, 111334, 113655, 115281, 116860, 118554, 120449, 122853, 125807, 128865, 131683, 134272, 136451, 137717, 138144, 138840, 140943, 144441, 148478, 152532, 156808, 161522, 166339, 170785, 174978, 179668, 185438, 192063, 198863, 205513, 212028, 217948, 222242, 224369, 224789, 223938, 221345, 216466, 209834, 202438, 194347, 185039, 174960, 165613, 157906, 151358, 145186, 139364, 134266, 129995, 126479, 123711, 121581, 119866, 118613, 118050, 118014, 117943, 117582, 117193, 116959, 116711, 116344, 116034, 115927, 116069, 116564, 117198, 117043, 115270, 112414, 109931, 108333, 106624, 103883, 100438, 97032, 93736, 90366, 87227, 84645, 82301, 79797, 77553, 76389, 76341, 76411, 75499, 73279]
54518G3279k958k743j993j598j862k053j428l91J16J2J9M09P48Q45J054J505J848
54501F4809J851J585R76o5j062j304q36m67n75o42j73O08J163J263R89O30O38
54484F9388J236J972K138J684J250J307J704K130K486K779L021L251L365L121
54470A00832K665K649L293L748L174K072J511J395O47r20k236k716l094l964m638
54455A04418m283l411l201l804m192l591k390j555j597k231k735k587j838r54
54441F6049l85k90n54q64q83n53r3L27P78J169J155O92L66O23J042R07K76j40
54423F9622J7N07J021J357J251O35K2m1K73M37M48O40Q54O76L23L84P39O70J33
54404G9968j57Mo5p14j329j318q97m50P6O24O50o6q82j071p58n41o33q84j246
$$ y = [73279, 70321, 67578, 65585, 63987, 62125, 60072, 58644, 58253, 58369, 58381, 58400, 58809, 59557, 60402, 61456, 62961, 64809, 66660, 68245, 69221, 69156, 68094, 66790, 65954, 65487, 64912, 64270, 64097, 64705, 65868, 67131, 68120, 68750, 69388, 70624, 72596, 74734, 76418, 77668, 78975, 80679, 82809, 85295, 88074, 91095, 94346, 97711, 100832, 103497, 106146, 109439, 113187, 116361, 118433, 119944, 121339, 121986, 121066, 118830, 116114, 113020, 109056, 104418, 100135, 96724, 93523, 89719, 85527, 81936, 79546, 77991, 76394, 74163, 71428, 68841, 67003, 66049, 65664, 65374, 64820, 63956, 63073, 62520, 62427, 62754, 63532, 64701, 65856, 66548, 66914, 67537, 68579, 69486, 69762, 69622, 69639, 70146, 71167, 72524, 73775, 74410, 74432, 74391, 74664, 75101, 75549, 76189, 77043, 77719, 78042, 78426, 79165, 79835, 79968, 79811, 79815, 79750, 79036, 77707, 76389, 75492, 75042, 75118, 75742, 76392, 76326, 75444, 74373, 73615, 73074, 72441, 71557, 70311]
54385G0311j664j786j285l28N28Q21M50k42o24l26K53M10R7n6K99P38P51L38k13
54366F8472o22n79rM93K03o02q26j01O59O71L74M91Q45Q91P92J081J659K010K183
54347G8085K597L049K748J571N09N90J762L101L850L959L818L702L504K960K069
54332A17874J176O09L95L19J58j65m92n57l74l94r78j796k166j970j762j885k051
54315A05941j977j919k168k432k135j245l71j24n26j064j198q49l71m6J83L63
54299I0062K61j93n58m89l62o63j014o55K11O65O03R55K048K895K710K113K084
54282A00673K519K783K936L359L639K943J417K07QL33L53j78r69j639j920j802
54266A14662j576j575j834k245k836l535l880l487k697k300k533k870k837k546
$$ y = [70311, 68647, 66861, 65576, 65248, 65776, 66597, 67047, 66805, 66181, 65855, 66108, 66518, 66615, 66559, 66858, 67596, 68347, 68685, 68472, 67850, 67271, 67262, 67755, 67958, 67356, 66530, 66429, 67088, 67759, 68133, 68624, 69469, 70360, 71152, 72233, 73892, 75902, 78085, 80682, 83731, 86479, 88050, 88559, 89149, 90911, 94012, 97862, 101821, 105639, 109341, 112845, 115805, 117874, 119050, 119659, 120054, 120373, 120531, 120366, 119874, 119317, 118943, 118549, 117571, 115775, 113609, 111639, 109877, 107992, 105941, 103964, 102045, 99877, 97445, 95310, 94065, 93694, 93570, 93044, 91980, 90782, 89933, 89562, 89516, 89699, 90062, 90323, 90130, 89572, 89083, 88721, 88058, 87044, 86389, 86600, 87265, 87868, 88823, 90871, 93766, 96476, 98589, 100673, 103192, 105975, 108911, 112270, 115909, 118852, 120269, 120476, 120484, 120817, 121170, 120992, 120023, 118384, 116464, 114662, 113086, 111511, 109677, 107432, 104596, 101061, 97181, 93694, 90997, 88697, 86164, 83294, 80457, 77911]
54252G7911k257j888j318q56r89j722k528k916k809k312j499o73n21j407k582
54237E1634k687j354K50Q06L26k92o42r66j158p43J42O50M18J1j40m27j123j565
54219D3140r86K89J261J534J465J261P21j24p43p08k27J05m0l62k00P06J737K029
54201E0858J576J269J592J886J345K32m99n24l40l11k20J32N25O89O29L65j92
54184E9012q80j140o41K03O70O07M25K69l11j503k499k135l98J351J802J001P
54167E5840l58m5N20Q10M73k10m09K58J063J072L99j09k29m89j041j323j023n23
54149E4676j46K54P04Q69P41P24Q16M51m03q76m73Q7%m14l97l7L1l04o41r01j247
54128E3514j461j151m76NJ21J82L69N21M50J08m49r52j056q46p88q92n53K94O29
$$ y = [77911, 75654, 73766, 72448, 71592, 70603, 68881, 66353, 63437, 60628, 58316, 56817, 56144, 55623, 54216, 51634, 48947, 47593, 47843, 48649, 48975, 48683, 48041, 47075, 45917, 45174, 45316, 45966, 46384, 46395, 46255, 45828, 44705, 43140, 42154, 42443, 43704, 45238, 46703, 47964, 48685, 48561, 47818, 47110, 46883, 46988, 46948, 46586, 46386, 47092, 48829, 50858, 52434, 53703, 55295, 57181, 58526, 58758, 58259, 57735, 57395, 57084, 56864, 56996, 57521, 58210, 58839, 59204, 59012, 58132, 56992, 56351, 56554, 57224, 57831, 58256, 58525, 58214, 56711, 54212, 52077, 51679, 53030, 54832, 55833, 55840, 55482, 55437, 55957, 56767, 57240, 57030, 56621, 56879, 57942, 59014, 59413, 59304, 59075, 58586, 57545, 56222, 55199, 54676, 54530, 54784, 55488, 56357, 57098, 57822, 58638, 59089, 58686, 57810, 57337, 57424, 57424, 57010, 56613, 56576, 56607, 56303, 55662, 54761, 53514, 52053, 50902, 50426, 50431, 50552, 50734, 51103, 51624, 52074, 52182, 51733, 50781, 49725, 48879, 48091, 47199, 46646, 46940, 47569]
54109D7569k20j268j090J23R21P12L09K90K19j76k87K48P00K84n77r06n95l48
54091D5908m60n14k45K0N2K10Q14J400J192K25n42m69o7k44r71j319p11L64J001
54072D5644Q01K8p28r46n55k2J85K12L78L99k72j298j594q90j87k50n19k24L20
54053D0482M03J69J87K82j06p31p91j84M31O96Q04P14J36o95j053p73m41m25m03
54034C8702o0M16O81N93R7o85j229j062m76k08l24j80M33R05Q37O95R78J403J418
54015D2934J090Q82Q91Q13N21K33J15N9j24l92m40LP73J287J184P73O03P12O79
53996E2596L90K44N16Q84Q80N46M15R22J884K577K380J491Q33J037J759K188K023
53979G3565J621J361J356J628K137K634K889L029L344L800M107M189M212M153
$$ y = [47569, 47349, 46081, 44991, 45114, 46035, 46747, 47056, 47346, 47565, 47389, 47102, 47350, 48050, 48334, 47757, 46851, 46256, 45908, 45448, 44934, 44689, 44709, 44761, 44971, 45785, 47185, 48377, 48602, 48060, 47591, 47524, 47280, 46309, 44990, 44279, 44643, 45644, 46445, 46473, 45745, 44799, 44244, 44222, 44407, 44619, 44997, 45396, 45124, 43826, 42232, 41342, 41155, 40905, 40386, 40162, 40482, 40885, 41054, 41241, 41523, 41417, 40686, 39895, 39711, 40142, 40838, 41642, 42356, 42492, 41797, 40744, 39971, 39530, 39105, 38702, 38642, 39058, 39739, 40332, 40429, 39744, 38515, 37453, 36977, 36769, 36445, 36265, 36698, 37603, 38440, 39135, 40113, 41516, 42934, 44024, 44906, 45797, 46610, 47131, 47364, 47479, 47538, 47414, 47022, 46582, 46585, 47358, 48645, 49829, 50602, 51205, 51917, 52596, 52986, 53230, 53746, 54630, 55510, 56056, 56471, 57393, 59277, 61854, 64234, 65725, 66558, 67595, 69354, 71542, 73565, 75186, 76547, 77903, 79531, 81668, 84302, 87191, 90220, 93564, 97364, 101471, 105660, 109872, 114025]
53965A14025L793L109K422K098K276K757L005K539J616J113J390J704J294N37
53951A43678K94M99L11m42j025r78p20p50j066j526k152k744k894k586k308k290
53935A23301k220j922j700j740j697j250o78n66j138k092k791k641j632n32j51
53920A00551m06n66l05O2L71Q38J396J559J202Q30P98Q24O20L62K04j08p12j200
53902A06320j180q51o30m93j37M28Q04O21p1p47p49J0P85Q57M94M92R16J067P48
53883A08684O87J361K233K610K616K782L182L524L673L643L366K842K210J459
53869A44872M74m99r49q97r99j491j685r45L47J384J937K297K581K745K919L201
53853A55292L304K887K154J714J976K878L991M741M759M175L373K481J555J067
$$ y = [114025, 117818, 120927, 123349, 125447, 127723, 130480, 133485, 136024, 137640, 138753, 140143, 141847, 143141, 143678, 143972, 144471, 144782, 144340, 143315, 142337, 141617, 140867, 139801, 138275, 136123, 133379, 130485, 127899, 125591, 123301, 121081, 119159, 117459, 115719, 114022, 112772, 112094, 111528, 110390, 108298, 105507, 102866, 101234, 100702, 100551, 100145, 99579, 99274, 99336, 99707, 100545, 101941, 103500, 104702, 105532, 106330, 107154, 107774, 108136, 108340, 108232, 107520, 106320, 105140, 104289, 103659, 103166, 103029, 103457, 104261, 104882, 104811, 104064, 103315, 103325, 104110, 104967, 105461, 105953, 106869, 107936, 108684, 109371, 110732, 112965, 115575, 118191, 120973, 124155, 127679, 131352, 134995, 138361, 141203, 143413, 144872, 145346, 144847, 143898, 143001, 142002, 140511, 138826, 137881, 138228, 139612, 141549, 143846, 146427, 149172, 152091, 155292, 158596, 161483, 163637, 165351, 167327, 170205, 174196, 178937, 183696, 187871, 191244, 193725, 195280, 196347]
53839A96347J450K096J784L62r52j375j589k328l007k759j989j750k168k540k622
53824A78960k685k675k417k369l040l842l740l008l050m273n329m981l677k650
53810A31224k283k178k205k620l301l620l181k298j596j374j443j500j473j429
53796A00723j300r99p46q90j334j563j418j350j586j621j052m18n09j143j438
53781H3356j088o01l71k84l16o74j155j062j07J075J596J201K97m68n66K2N97
53764H1452L88m67j031q64n82q07j115o35O10J688K012J960K072K167J684O67
53748H9199j20j27L23O06P28J214K200L136L513L409L167K930K807L015L504L798
53732A23302L642L437L509L398K557J481J227J840K156J474N69N41J219J456P40
$$ y = [196347, 197797, 199893, 201677, 202039, 201087, 199712, 198123, 195795, 192788, 190029, 188040, 186290, 184122, 181582, 178960, 176275, 173600, 171183, 168814, 165774, 161932, 158192, 155184, 152134, 147861, 142532, 137551, 133874, 131224, 128941, 126763, 124558, 121938, 118637, 115017, 111836, 109538, 107942, 106568, 105125, 103625, 102152, 100723, 99423, 98424, 97678, 96788, 95454, 93891, 92473, 91123, 89537, 87916, 86864, 86446, 85937, 84794, 83356, 82268, 81667, 81296, 81012, 80696, 80022, 78867, 77805, 77698, 78773, 80369, 81570, 81867, 81399, 80833, 80855, 81452, 81840, 81373, 80342, 79478, 78896, 78089, 76974, 76339, 76949, 78637, 80649, 82609, 84681, 86848, 88532, 89199, 89079, 88952, 89275, 89881, 90609, 91823, 94023, 97159, 100672, 104081, 107248, 110178, 112985, 116000, 119504, 123302, 126944, 130381, 133890, 137288, 139845, 141326, 142553, 144393, 146549, 148023, 148592, 149133, 150352, 151808, 152548]
53717A52548k04m48j5L23P0m95q53r11r62j188j539j973k497k855k640j884j195
53700A33282j013j086r05l97J71N84O70K88l21n29j93r9r49k146k449j583m94
53683A22831m5k37p25j266j484j037k96j81r85j920k176j802j244o41J2N30Q46
53666A10180J144J301P61m61j276p77M44J087R16Q09J189J478J262J007J180J479
53650A21723J497J567K210L139L541L184K616K291K165K213K742L796M745M873
53636A62302M205L404K952K788K663K556K600K801K950K805K429K194K355K637
53622B01641K533K088J907K182K223J461M66K68R37J596J816K040K442K384J420
53607B27404J64m86n17m77m78k20K13L10r8n76o54l77k01m80j072j345q54j8K35
$$ y = [152548, 152344, 151896, 151881, 152204, 152274, 151779, 150926, 150015, 149053, 147865, 146326, 144353, 141856, 139001, 136361, 134477, 133282, 132269, 131183, 130278, 129881, 130052, 130636, 131306, 131594, 131273, 130744, 130551, 130452, 129503, 127357, 124908, 123325, 122831, 122786, 122549, 121824, 120558, 119074, 118037, 117741, 117560, 116575, 114655, 112479, 110677, 109433, 108792, 108804, 109334, 110180, 111324, 112625, 113386, 112925, 111649, 110872, 111316, 112403, 113319, 114128, 115317, 116795, 118057, 119064, 120244, 121723, 123220, 124787, 126997, 130136, 133677, 136861, 139477, 141768, 143933, 146146, 148888, 152684, 157429, 162302, 166507, 169911, 172863, 175651, 178314, 180870, 183470, 186271, 189221, 192026, 194455, 196649, 199004, 201641, 204174, 206262, 208169, 210351, 212574, 214035, 214501, 214769, 215706, 217302, 219118, 221158, 223600, 225984, 227404, 227568, 227082, 226565, 226088, 225610, 225390, 225603, 225913, 225815, 225239, 224585, 224208, 224007, 223527, 222455, 221110, 220256, 220238, 220473]
53588B20473l07q06n71rR0k67n40n91o65o78l42J47K97R6j05l32q37j302j042
53569B12709r5P58J163J512J902J745R16L22P67J779K326K197J971J974K013J952
53553B35911J995K271K670L063L454L888M347M703M777M511M184M115M225M234
53539B88348M341N087O373P190O847N961N638O058O489O417N978N391M750M354
53525C69222M588N208N427M960M545M947N830O070N100L510K324J926J893J706
53511D27256J381J299J586J912K003J997K005J652N57p57j149k97O35L88p74j416
53495D38278p89L34P80L16m57j046j414j653j812j984k185k178j714r17k03K65
53479D23621P09J309J938K395K641K748K738K622K471K414K652L367M457N481
$$ y = [220473, 220166, 219360, 218789, 218780, 218870, 218603, 218063, 217472, 216807, 216129, 215787, 215934, 216231, 216327, 216222, 215890, 215053, 213751, 212709, 212614, 213372, 214535, 216047, 217949, 219694, 220610, 220932, 221699, 223478, 225804, 228001, 229972, 231946, 233959, 235911, 237906, 240177, 242847, 245910, 249364, 253252, 257599, 262302, 267079, 271590, 275774, 279889, 284114, 288348, 292689, 297776, 304149, 311339, 318186, 324147, 329785, 335843, 342332, 348749, 354727, 360118, 364868, 369222, 373810, 379018, 384445, 389405, 393950, 398897, 404727, 410797, 415897, 419407, 421731, 423657, 425550, 427256, 428637, 429936, 431522, 433434, 435437, 437434, 439439, 441091, 441648, 440891, 439742, 439445, 440080, 440468, 439694, 438278, 437489, 437823, 438603, 438919, 438462, 437416, 436002, 434349, 432537, 430553, 428368, 426190, 424476, 423559, 423356, 423621, 424330, 425639, 427577, 429972, 432613, 435361, 438099, 440721, 443192, 445606, 448258, 451625, 456082, 461563]
53465D61563O094O395O585O505O006N590O095P648R532J1153J2565J3832J4614
53452E74177J4798J4944J5522J6247J6703J7240J8511K0389K2020K2901K3355
53441G76807K3880K4548K5093K5269K5151K5262K6253K8130L0009L1021L1239
53430A072662L1348L1650L1919L2032L2216L2584L2964L3182L3161L2753L1877
53419A428348L0857L0229L0179L0503L0988L1456L1437L0403K8417K6237K4534
53408A753588K3358K2390K1422K0431J9336J7952J6184J4287J2819J2046J1501
53397A945314J0431Q767P116N683L855J241j565l885n987q546j1447j3982j5862
53384A921133j7300j8362j9133k0200k2095k4370k6154k7418k8732k9955l0312
$$ y = [461563, 467657, 474052, 480637, 487142, 493148, 498738, 504833, 512481, 522013, 533166, 545731, 559563, 574177, 588975, 603919, 619441, 635688, 652391, 669631, 688142, 708531, 730551, 753452, 776807, 800687, 825235, 850328, 875597, 900748, 926010, 952263, 980393, 1010402, 1041423, 1072662, 1104010, 1135660, 1167579, 1199611, 1231827, 1264411, 1297375, 1330557, 1363718, 1396471, 1428348, 1459205, 1489434, 1519613, 1550116, 1581104, 1612560, 1643997, 1674400, 1702817, 1729054, 1753588, 1776946, 1799336, 1820758, 1841189, 1860525, 1878477, 1894661, 1908948, 1921767, 1933813, 1945314, 1955745, 1964512, 1971628, 1977311, 1981166, 1982407, 1980842, 1976957, 1970970, 1962424, 1950977, 1936995, 1921133, 1903833, 1885471, 1866338, 1846138, 1824043, 1799673, 1773519, 1746101, 1717369, 1687414, 1657102]
53373A657102k9834k9484k9692k9807k9380k8801k8267k7222k5435k3656k2505
53362A353019k1478j9831j7747j5890j4368j2873j1328r754p827n280k499j38
53350A214006J657L289N267P958J1386J4904J7561J9173K0592K2542K4719K6476
53338A389530K7833K9239L0856L2651L4770L7145L9165M0405M1443M3293M6184
53327A792514M9358N1939N3530N4341N5184N7060O0161O3515O5983O7418O8380
53316B439383O9138O9565O9747O9965P0189P0084O9493O8465O6924O4792O2204
53305C189949N9252N5753N1668M7504M3735M0123L6199L2140K8542K5435K2152
53294C632452J8131J3266P643J506m560r990j4865j9746k5062l1087l8181m6272
$$ y = [1657102, 1627268, 1597784, 1568092, 1538285, 1508905, 1480104, 1451837, 1424615, 1399180, 1375524, 1353019, 1331541, 1311710, 1293963, 1278073, 1263705, 1250832, 1239504, 1229750, 1221923, 1216643, 1214144, 1214006, 1215663, 1218952, 1224219, 1232177, 1243563, 1258467, 1276028, 1295201, 1315793, 1338335, 1363054, 1389530, 1417363, 1446602, 1477458, 1510109, 1544879, 1582024, 1621189, 1661594, 1703037, 1746330, 1792514, 1841872, 1893811, 1947341, 2001682, 2056866, 2113926, 2174087, 2237602, 2303585, 2371003, 2439383, 2508521, 2578086, 2647833, 2717798, 2787987, 2858071, 2927564, 2996029, 3062953, 3127745, 3189949, 3249201, 3304954, 3356622, 3404126, 3447861, 3487984, 3524183, 3556323, 3584865, 3610300, 3632452, 3650583, 3663849, 3671492, 3672998, 3668438, 3658448, 3643583, 3623837, 3598775, 3567688, 3529507, 3483235]
53282C483235n4198o0439o4599o7533o9940p1647p2449p2837p3298p3596p3180
53271B729519p2014p0494o8924o7421o6136o5099o4040o2637o0851n8803n6512
53260B016588n3977n1373m8870m6344m3457m0058l6383l2917l0077k7929k6146
53249A579057k4327k2418k0604j8834j6701j3974j1082q732p139n862m441k929
53237A422014j623n60M48J357J907K217K946M541O610Q462R957J1388J2748J3822
53223A496234J4969J6975J9943K2989K5398K7322K8974K9891K9748K9291K9559
53212A771293L0423L0838L0318K9341K8317K7064K5533K4198K3308K2329K0615
53201B063577J8248J5827J3746J2093J0873R850Q322N606J854k034n400q420j1527
$$ y = [3483235, 3429037, 3368598, 3303999, 3236466, 3166526, 3094879, 3022430, 2949593, 2876295, 2802699, 2729519, 2657505, 2587011, 2518087, 2450666, 2384530, 2319431, 2255391, 2192754, 2131903, 2073100, 2016588, 1962611, 1911238, 1862368, 1816024, 1772567, 1732509, 1696126, 1663209, 1633132, 1605203, 1579057, 1554730, 1532312, 1511708, 1492874, 1476173, 1462199, 1451117, 1442385, 1435246, 1429384, 1424943, 1422014, 1420391, 1419831, 1420279, 1421636, 1423543, 1425760, 1428706, 1433247, 1439857, 1448319, 1458276, 1469664, 1482412, 1496234, 1511203, 1528178, 1548121, 1571110, 1596508, 1623830, 1652804, 1682695, 1712443, 1741734, 1771293, 1801716, 1832554, 1862872, 1892213, 1920530, 1947594, 1973127, 1997325, 2020633, 2042962, 2063577, 2081825, 2097652, 2111398, 2123491, 2134364, 2144214, 2152536, 2158142, 2159996, 2157962, 2152562, 2144142, 2132615]
53188B132615j4651j7391j9817k2504k5703k8902l1488l3549l5619l7855l9872
53177A825264m1282m1928m1672m0537l9093l8121l7672l7032l5838l4772l4645
53166A402672l5225l5410l4464l2727l1191l0592l0815l0995l0334k8887k7380
53155A054652k6263k5300k4122k2745k1331j9913j8584j7645j7240j7169j7215
53144H27125j7320j7325j7065j6808j7012j7398j7008j5624j4327j4099j4497
53133F48642j4402j3549j2540j1820j1544j2002j3290j4683j5208j4815j4274
53122E00515j4029j3816j3355j2746j2145j1641j1368j1241j0721r449p971p224
53110C64809p448q087q665q998q807p878o637n844n722n873o005o007n581m560
$$ y = [2132615, 2117964, 2100573, 2080756, 2058252, 2032549, 2003647, 1972159, 1938610, 1902991, 1865136, 1825264, 1783982, 1742054, 1700382, 1659845, 1620752, 1582631, 1544959, 1507927, 1472089, 1437317, 1402672, 1367447, 1332037, 1297573, 1264846, 1233655, 1203063, 1172248, 1141253, 1110919, 1082032, 1054652, 1028389, 1003089, 978967, 956222, 934891, 914978, 896394, 878749, 861509, 844340, 827125, 809805, 792480, 775415, 758607, 741595, 724197, 707189, 691565, 677238, 663139, 648642, 634240, 620691, 608151, 596331, 584787, 572785, 559495, 544812, 529604, 514789, 500515, 486486, 472670, 459315, 446569, 434424, 422783, 411415, 400174, 389453, 380004, 372033, 364809, 357361, 349274, 340609, 331611, 322804, 314926, 308289, 302445, 296723, 290850, 284845, 278838, 273257, 268697]
53096B68697l581l492m058m181l488k825k906l349l420l003k398j773j263j126
53082B27834j401j806k188k609k847k416j382n47m38o53n45j32J44N5l21q35j206
53065B08707j108o69n03q50j062l64J079K283K523J987J376J126J137J127J152
53050B17941J483J965J876Q44m55j098j155j405j977k162j730j431j846k477k619
53035B05754k491k873l926m955n251m709l787l106k995l256l471l536l609l532
53021A54257k841j553m21p9l06n70q14j300j844j892j280n20j48j30k9L24O28
53004A41482N79K89K0l38j094j969k133j298k71N6k07m40n78r16j172p77K8L29
52986A31590j55p45r78j178j564j630r41L3M11j07j050j687j598j046q62j529
$$ y = [268697, 265116, 261624, 257566, 253385, 249897, 247072, 244166, 240817, 237397, 234394, 231996, 230223, 228960, 227834, 226433, 224627, 222439, 219830, 216983, 214567, 213185, 212638, 212200, 211547, 211002, 210870, 211014, 211069, 210748, 209913, 208707, 207599, 206930, 206427, 205577, 204515, 204151, 205230, 207513, 210036, 212023, 213399, 214525, 215662, 216789, 217941, 219424, 221389, 223265, 224109, 223654, 222556, 221401, 219996, 218019, 215857, 214127, 212696, 210850, 208373, 205754, 203263, 200390, 196464, 191509, 186258, 181549, 177762, 174656, 171661, 168405, 164934, 161398, 157789, 154257, 151416, 149863, 149442, 149363, 149057, 148487, 147673, 146373, 144529, 142637, 141357, 140837, 140689, 140559, 140530, 140854, 141482, 142061, 142350, 142370, 142032, 140938, 138969, 136836, 135538, 135267, 135323, 135116, 134676, 134098, 133182, 132010, 131233, 131261, 131590, 131435, 130690, 129712, 128534, 126970, 125340, 124399, 124432, 124843, 124736, 123686, 121999, 120401, 119355, 118493, 116964]
52970A16964k442k548j649n83o4l3j29j28J21N33N59k15j250j597j220q60p22
52953A04737l53J20r1r80j466r97l05l8J56N61O63K21KM99R32N10k04k03M21Q90
52933A05075J046J187J216R36O89Q09R35O37K24J15M8k45k20O80J995K914L332
52916A21373L424K950K016J608K172K553J730P60J268K720L123K194J691K482
52902A52064L331L056K213J854J976J960J479M70r14j950j912j274j262k001k331
52887A56759j815j462j924k360j932j189r43r41o80o34j386k283k172j065J6N09
52871A36498N75K78m27j035q22R1Q01Q21M83J84r0l75m65k15K99R91J694J890
52853A41176J102l86j603j860j286l66N47J110R52J64n13m34K20Q31J217J618
$$ y = [116964, 114522, 111974, 110325, 109742, 109678, 109645, 109516, 109388, 109509, 110042, 110601, 110386, 109136, 107539, 106319, 105459, 104737, 104384, 104504, 104413, 103433, 101967, 100970, 100665, 100627, 100783, 101344, 102007, 102228, 102230, 102729, 103661, 104171, 103967, 103764, 104185, 105075, 106121, 107308, 108524, 109460, 110149, 110958, 111893, 112530, 112754, 112869, 112917, 112672, 112452, 113132, 115127, 118041, 121373, 124797, 127747, 129763, 131371, 133543, 136096, 137826, 138586, 139854, 142574, 145697, 147891, 149582, 152064, 155395, 158451, 160664, 162518, 164494, 166454, 167933, 168403, 167489, 165539, 163627, 162353, 161091, 159090, 156759, 154944, 153482, 151558, 149198, 147266, 146077, 145134, 144193, 143513, 142879, 141493, 139210, 137038, 135973, 135989, 136498, 137073, 137351, 136924, 135889, 135067, 135158, 135959, 136780, 137263, 137447, 137357, 136982, 136517, 136302, 136601, 137592, 139286, 141176, 142278, 141892, 140289, 138429, 137143, 136777, 137324, 138434, 139386, 139550, 139037, 138603, 138823, 139654, 140871, 142489]
52837A42489J916J562M82n17p29n01o08r62o96L98J385J440R47Q41J267J548J221
52820A51483N63Q7m4n0k52p26j144j125p49m62l04K08J196J982K037J769J731
52803A56200J592P74k39k55R32K151K312J547P60O61J390K486L050K548J533J098
52787A78540J540K178K530K828L259L470L197K750K446K146J690J268J017O77
52773B09536N5o20j145j683k275k511k133j592j541k011k570k982l296l479l396
52758A78357l118k908k892k963k912k626k201j905j820j637j078m95n22j153j651
52743A48476j578j342j440j714j714j373r25m44L7K67J6n34r59j058r68r42j145
52726A32660j549j862j856j743j919k244k111j376p14p14j111j304j221j148j072
$$ y = [142489, 144405, 145967, 146449, 145932, 145203, 144702, 144094, 143132, 142436, 142834, 144219, 145659, 146606, 147447, 148714, 150262, 151483, 152046, 152133, 152089, 152039, 151787, 151061, 149917, 148792, 148043, 147581, 147277, 147485, 148681, 150663, 152700, 154469, 156200, 157792, 158566, 158327, 158072, 159004, 161155, 163467, 165014, 165774, 166435, 167825, 170311, 173361, 175909, 177442, 178540, 180080, 182258, 184788, 187616, 190875, 194345, 197542, 200292, 202738, 204884, 206574, 207842, 208859, 209536, 209591, 208971, 207826, 206143, 203868, 201357, 199224, 197632, 196091, 194080, 191510, 188528, 185232, 181753, 178357, 175239, 172331, 169439, 166476, 163564, 160938, 158737, 156832, 155012, 153375, 152297, 151802, 151280, 150127, 148476, 146898, 145556, 144116, 142402, 140688, 139315, 138390, 137946, 137983, 138250, 138266, 137732, 136773, 135715, 134747, 133805, 132660, 131111, 129249, 127393, 125650, 123731, 121487, 119376, 118000, 117286, 116572, 115461, 114157, 112936, 111788, 110716]
52711A10716p53k33J83L79M13J87l93j017j165p82m20o30j377k091k140j353k33
52694I9291L65J4q52j361j068l39M4m30j549k589k974k696k034j095N2R76J139
52677H4894O12M2j77k75m74n81m30k34j54K9M13N86K22k76l28j23l87j261j974
52658H0124j830j045l63j24JL88Q74R62N71K39M47R54J118P85M43N85J273K195
52640H7597K798K431J018m15o21L24R94M72m61m93M91J445J606J155O85N10M79
52623A00015J82o55j713k211j711o39J77K36m83j667k777l283l067k416j596q14
52607G7578n12r97j668j441l28L23l51j462j679j039n66o54q23p60n54j89L93
52590F5271P80N51L5j37o5l02p79q92o68p58j281j548j142l80M12J264J904J799
$$ y = [110716, 109963, 109730, 109913, 110292, 110705, 110892, 110499, 109482, 108317, 107535, 107115, 106485, 105108, 103017, 100877, 99524, 99291, 99656, 99670, 98818, 97457, 96389, 96050, 96094, 95664, 94115, 91526, 88552, 85856, 83822, 82727, 82779, 83755, 84894, 85506, 85548, 85371, 85096, 84622, 84041, 83611, 83377, 83223, 83252, 83665, 84251, 84473, 84197, 83869, 83746, 83359, 82098, 80124, 78294, 77249, 76886, 76762, 76763, 77151, 78025, 78987, 79558, 79797, 80244, 81198, 82316, 83101, 83544, 84129, 85402, 87597, 90395, 92826, 93844, 93429, 92808, 93132, 94126, 94598, 94137, 93644, 94135, 95580, 97186, 98341, 99026, 99536, 100015, 100197, 99542, 97829, 95618, 93907, 93268, 93445, 93681, 93198, 91531, 88754, 85471, 82404, 79988, 78392, 77578, 77066, 76069, 74401, 72960, 72632, 72955, 72604, 71142, 69463, 68424, 67858, 67204, 66381, 65621, 65067, 64878, 65271, 66051, 66602, 66637, 66500, 66435, 66133, 65354, 64462, 63794, 63036, 61755, 60207, 59065, 58685, 59097, 60361, 62265, 64064]
52572F4064J114P84J106J204L99o36q93n08l54n96o18j68K34J77o2n9J32J61j09
52553F5372m54n52k58L25Q89J111Q94M88L15N59R22Q85L30k86m83l07j19k9J80
52534F9782O03J059J324J292R26L34j61k23J58P58J416J962K087J642R87O44O22
52517H5212N37L40M22Q96J304J233Q30M98L34J42k11n79n93K7J048J786J847J659
52499I6732J801K045J712Q74M11O88R86O37mk50j32j44l14k60Q6L82M84O07Q83
52480A07224J100R57L17o28j312j087Q0J347J809J445Q82M36j15q10j177q49j46
52463A09473K71J52k08m07l26q0J78L08J94j35l79j88K95L47n10j612j587L4K068
52444A07888K907K264J221P90R55J138J004O12J70o1P0L05J38m77r03o05P2M14
$$ y = [64064, 65178, 65962, 67068, 68272, 68671, 68035, 67142, 66634, 66280, 65684, 65066, 64898, 65132, 65309, 65247, 65188, 65320, 65481, 65372, 64918, 64366, 64108, 64433, 65322, 66433, 67327, 67815, 68130, 68689, 69611, 70496, 70826, 70540, 70057, 69750, 69631, 69602, 69782, 70385, 71444, 72768, 74060, 74986, 75320, 75159, 74936, 75094, 75852, 77268, 79230, 81317, 82959, 83946, 84590, 85212, 85749, 86089, 86511, 87407, 88711, 89944, 90774, 91272, 91606, 91748, 91537, 90958, 90365, 90392, 91440, 93226, 95073, 96732, 98533, 100578, 102290, 103164, 103575, 104263, 105249, 105886, 105882, 105632, 105500, 105356, 105042, 104782, 104868, 105250, 105734, 106341, 107224, 108324, 109281, 109598, 108970, 107658, 106571, 106651, 107998, 109807, 111252, 112134, 112570, 112455, 111645, 110468, 109619, 109473, 109744, 109896, 109688, 109281, 108955, 108875, 109053, 109361, 109555, 109420, 109041, 108853, 109148, 109495, 108985, 107373, 105786, 105820, 107888, 110795, 113059, 114280, 115070, 116025, 117163, 118167, 118779, 118949, 118888, 118958, 119263, 119401, 118924, 118021, 117416, 117488, 117902]
52426A17902L72N13R65J064L49o34r69m92K14O92R18Q61L80l43p34n14n3J99L22
52407A21012O85J342J993K345K233J626P63J89K76P68J090J032Q23P28Q51J258
52391A39014J835K065J470L94j95R8N26K11o57j178j059r60j383j901j825j283
52375A35172j004j177j179n68K02N13M85N80N77j74j487k182j595n05j9j03J8
52358A27554M84P37O50P78J297J575J211P60Q88J351J442J100R00J027J001N21
52342A43276k1j32J15M13P93J381J808J491N44k36m52n81r76j092l14Q78J455
52325A48350J318J298J681J789J267P85R65J457J729J975K441K559J758O43L47
52310A70362R38J500J636J772K041J948J439J326K116L195L614L186K389J695
$$ y = [117902, 118274, 118787, 119752, 120816, 121165, 120531, 119562, 119070, 119284, 119976, 120894, 121755, 122135, 121792, 121058, 120544, 120491, 120690, 121012, 121697, 123039, 125032, 127377, 129610, 131236, 131999, 132188, 132464, 133232, 134322, 135354, 136177, 136905, 137756, 139014, 140849, 142914, 144384, 144778, 144583, 144681, 145207, 145418, 144761, 143583, 142524, 141564, 140181, 138280, 136455, 135172, 134168, 132991, 131812, 131244, 131446, 131959, 132444, 133024, 133601, 133427, 131940, 129758, 128163, 127658, 127639, 127536, 127554, 128038, 128775, 129425, 130203, 131500, 133075, 134286, 135046, 135934, 137285, 138727, 139827, 140727, 141754, 142755, 143276, 143255, 143123, 143238, 143651, 144444, 145825, 147633, 149124, 149668, 149432, 148980, 148399, 147423, 146331, 146017, 146895, 148350, 149668, 150966, 152647, 154436, 155703, 156488, 157453, 158910, 160639, 162614, 165055, 167614, 169372, 170015, 170362, 171300, 172800, 174436, 176208, 178249, 180197, 181636, 182962, 185078, 188273, 191887, 195073, 197462, 199157]
52296A99157J320J300J405J331J139J122J195R82O48R57K111L157L105K145J254
52281B22328R59J117J619K562L732M479M307L307K016R45L36J51K50N24Q25R10
52265B50367P75Q60J548K468K847K609K522L007L505L410L107L369M195M865N019
52250B94473N002N155N429N776O438P543Q753R567R837R852R952J0234J0598J0945
52236D09554J1238J1381J1311J1243J1585J2389J3155J3423J3408J3551J3750
52225E45988J3580J3177J3155J3571J3771J3407J2881J2502J1945J0970J0043
52214F84990R584R220Q335O995N700M634L748L179K957K576J579K75o63j129j430
52199G40550j547j316j134j674k812l565l290k368j550j153j035r38o71k08L35
$$ y = [199157, 200477, 201777, 203182, 204513, 205652, 206774, 207969, 208951, 209599, 210556, 212667, 215824, 218929, 221074, 222328, 223287, 224404, 226023, 228585, 232317, 236796, 241103, 244410, 246426, 247371, 247707, 247858, 248108, 248632, 249457, 250367, 251142, 252002, 253550, 256018, 258865, 261474, 263996, 267003, 270508, 273918, 277025, 280394, 284589, 289454, 294473, 299475, 304630, 310059, 315835, 322273, 329816, 338569, 348136, 357973, 367825, 377777, 388011, 398609, 409554, 420792, 432173, 443484, 454727, 466312, 478701, 491856, 505279, 518687, 532238, 545988, 559568, 572745, 585900, 599471, 613242, 626649, 639530, 652032, 663977, 674947, 684990, 694574, 703794, 712129, 719124, 724824, 729458, 733206, 736385, 739342, 741918, 743497, 743772, 743109, 741980, 740550, 739003, 737687, 736553, 734879, 732067, 728502, 725212, 722844, 721294, 720141, 719106, 718168, 717497, 717289, 717624]
52184G17624J017K133L699N121N883O242O657O945O754O621P461R048J0052R890
52170H05147R444R504R502Q550O983N951N864O042N760M901L679K272Q10o14j952
52155H81843l079l838m368n121o236p267p828q194q809r509r791r702r773j0160
52141G78168j0447j0403j0313j0327j0031r065p791o923o681o687o567o245n730
52128F70958m952l939k852j790p74n3n7r09k116k983l164k670j628m04K81q0j084
52111F41784j784j776j515j459j520j541j704k022k066j686j552k248l270l695
52097F13946l551l618m071m259l903l514l374l075k425j957k006k005j446q58
52083E73884j097k066k912l167l007k656k259k154k489k711k195j273r18j375
$$ y = [717624, 718641, 720774, 724473, 729594, 735477, 741719, 748376, 755321, 762075, 768696, 776157, 785205, 795257, 805147, 814591, 824095, 833597, 842147, 849130, 855081, 860945, 866987, 872747, 877648, 881327, 883599, 884409, 883795, 881843, 878764, 874926, 870558, 865437, 859201, 851934, 844106, 835912, 827103, 817594, 807803, 798101, 788328, 778168, 767721, 757318, 747005, 736678, 726647, 717582, 709791, 702868, 696187, 689500, 682933, 676688, 670958, 666006, 662067, 659215, 657425, 656651, 656598, 656541, 655632, 653516, 650533, 647369, 644699, 643071, 642667, 642948, 642868, 641784, 640000, 638224, 636709, 635250, 633730, 632189, 630485, 628463, 626397, 624711, 623159, 620911, 617641, 613946, 610395, 606777, 602706, 598447, 594544, 591030, 587656, 584581, 582156, 580199, 578193, 576188, 574742, 573884, 572787, 570721, 567809, 564642, 561635, 558979, 556720, 554566, 552077, 549366, 547171, 545898, 544980, 543605]
52069E43605j916k061k132k352k235j461o07m05o53o14j76Q6j05l84l06J87R84
52052E29455K024L177M184M845N083M894M491M451N280O735Q019Q759R424J0530
52038F11351J1812J2603J2845J3233J4288J5607J6249J5826J5029J4918J5735
52027G69496J6602J6587J5880J5454J5660J5654J4524J2534J0799R913R345Q207
52015I30655O267M173K869K718L046K684J149r46k740m036m951n213m657m146
52001I26872m943o925q406q209p137o689o941o633n097l165k094k186k730k844
51987H52873k171j018K3P16J328K094K786L097L246L706M484N176N657O213O895
51972H95105P292P136O651O081N358M467L734L358L012K354J608J168Q17o3j538
$$ y = [543605, 541689, 539628, 537496, 535144, 532909, 531448, 530841, 530436, 529783, 529169, 528993, 529079, 528974, 528590, 528284, 528471, 529455, 531479, 534656, 538840, 543685, 548768, 553662, 558153, 562604, 567884, 574619, 582638, 591397, 600821, 611351, 623163, 635766, 648611, 661844, 676132, 691739, 707988, 723814, 738843, 753761, 769496, 786098, 802685, 818565, 834019, 849679, 865333, 879857, 892391, 903190, 913103, 922448, 930655, 936922, 941095, 943964, 946682, 949728, 952412, 953561, 952615, 949875, 945839, 940888, 935675, 931018, 926872, 921929, 915004, 906598, 898389, 891252, 884563, 877622, 870989, 865892, 862727, 860633, 858447, 855717, 852873, 850702, 849684, 849707, 850423, 851751, 853845, 856631, 859728, 862974, 866680, 871164, 876340, 881997, 888210, 895105, 902397, 909533, 916184, 922265, 927623, 932090, 935824, 939182, 942194, 944548, 946156, 947324, 948141, 948078, 946540]
51957I46540k990m058n162o747q469r628j0167j0749j1811j3059j4006j4595j5107
51944H19992j5718j6450j7296j8040j8173j7462j6509j6286j7023j7890j7984
$$ y = [946540, 943550, 939492, 934330, 927583, 919114, 909486, 899319, 888570, 876759, 863700, 849694, 835099, 819992, 804274, 787824, 770528, 752488, 734315, 716853, 700344, 684058, 667035, 649145, 631161]
$$ [...]
##END NTUPLES=NMR SPECTRUM
##END=
