
##TITLE=AC1076_TOSA01_5868082_CwQ18kB4vy
##JCAMPDX= 6.0         $$ Bruker NMR JCAMP-DX V2.0
##DATA TYPE= NMR SPECTRUM
##DATA CLASS= NTUPLES
##ORIGIN= BRUKER
##OWNER= Administrator
$$ 1.72 TOPSPIN		Version 2.1
$$ 2012-03-31 03:35:59.000 -0500  Administrator@TOPSPIN
$$ Compression mode = diff/dup
##.OBSERVE FREQUENCY= 400.13188235
##.OBSERVE NUCLEUS= ^1H
##.ACQUISITION MODE= SIMULTANEOUS (DQD)
##.ACQUISITION SCHEME= undefined
##.AVERAGES= 8
##.DIGITISER RES= 22
##SPECTROMETER/DATA SYSTEM= spect
##.PULSE SEQUENCE= zg30
##.SOLVENT NAME= COFFEE_meoh
##.SHIFT REFERENCE= INTERNAL, COFFEE_meoh, 1, 14.98061
##AUDIT TRAIL= $$ (NUMBER, WHEN, WHO, WHERE, PROCESS, VERSION, WHAT)
$$ ##TITLE= Audit trail, TOPSPIN		Version 2.1
$$ ##JCAMPDX= 5.01
$$ ##ORIGIN= Bruker BioSpin GmbH
$$ ##OWNER= Administrator
$$ $$ C:\Bruker\TOPSPIN/data/COFFEE/nmr/AC1076_TOSA01_5868082_CwQ18kB4vy/10/pdata/1/auditp.txt
$$ ##AUDIT TRAIL=  $$ (NUMBER, WHEN, WHO, WHERE, PROCESS, VERSION, WHAT)
(   1,<2012-03-31 03:35:52.375 -0500>,<Administrator>,<TOPSPIN>,<go>,<TOPSPIN 2.1>,
      <created by zg
	started at 2012-03-31 03:34:45.859 -0500,
	POWCHK enabled, PULCHK disabled,
       configuration hash MD5:
       1A 1E CE 29 27 FD 77 03 67 4E F0 E3 C4 B2 CB 90
       data hash MD5: 64K
       74 4D DE 08 0C D6 F5 D8 CC 43 05 D0 A5 4A A6 BB>)
(   2,<2012-03-31 03:35:54.953 -0500>,<Administrator>,<TOPSPIN>,<proc1d>,<TOPSPIN 2.1>,
      <Start of raw data processing
       efp LB = 0 FT_mod = 6 PKNL = 1 PHC0 = 0 PHC1 = 0 SI = 32K 
       data hash MD5: 32K
       D3 37 F9 0D 43 73 A6 C3 52 81 E1 CC BE 0E DD 3B>)
(   3,<2012-03-31 03:35:55.343 -0500>,<Administrator>,<TOPSPIN>,<proc1d>,<TOPSPIN 2.1>,
      <pk PHC0 = 212.0361 PHC1 = 0 
       data hash MD5: 32K
       41 93 31 51 AE 50 0A 8B 5F CC B9 DE C6 25 56 DD>)
(   4,<2012-03-31 03:35:55.406 -0500>,<Administrator>,<TOPSPIN>,<proc1d>,<TOPSPIN 2.1>,
      <abs ABSG = 1 
       data hash MD5: 32K
       24 20 84 54 48 DD CB 6F 79 C1 16 91 10 CE 6C 04>)
(   5,<2012-03-31 03:35:55.437 -0500>,<Administrator>,<TOPSPIN>,<proc1d>,<TOPSPIN 2.1>,
      <abs ABSG = 2 
       data hash MD5: 32K
       D2 56 21 BC 82 8F FD D0 96 2A 25 7A BD 7E 21 0E>)
(   6,<2012-03-31 03:35:55.468 -0500>,<Administrator>,<TOPSPIN>,<proc1d>,<TOPSPIN 2.1>,
      <abs ABSG = 3 
       data hash MD5: 32K
       55 74 99 CD F4 2E 5C 9A D0 CD 51 C4 02 64 1E 08>)
(   7,<2012-03-31 03:35:55.500 -0500>,<Administrator>,<TOPSPIN>,<proc1d>,<TOPSPIN 2.1>,
      <abs ABSG = 4 
       data hash MD5: 32K
       35 B3 6D CE 87 C1 8C 53 33 E1 19 08 94 F7 BA A7>)
(   8,<2012-03-31 03:35:55.531 -0500>,<Administrator>,<TOPSPIN>,<proc1d>,<TOPSPIN 2.1>,
      <abs ABSG = 5 
       data hash MD5: 32K
       22 49 41 E5 BE 8F AC F3 E7 53 C1 C9 75 EF 6B 3F>)
$$ ##END=
$$ 
$$ $$ hash MD5
$$ $$ 4D 94 EA 61 5B A3 C1 18 A1 BE AD 9A ED 2E F9 66
##$RELAX= 
##$RELAX= 
##$RELAX= 
##$RELAX= 
##$RELAX= 
##$RELAX= 
##$RELAX= 
$$ Bruker specific parameters
$$ --------------------------
$$ [...]
##$TP= (0..7)
150 150 150 150 150 150 150 150
##$TP07= 0
##$TPNAME0= <>
##$TPNAME1= <>
##$TPNAME2= <>
##$TPNAME3= <>
##$TPNAME4= <>
##$TPNAME5= <>
##$TPNAME6= <>
##$TPNAME7= <>
##$TPOAL= (0..7)
0.5 0.5 0.5 0.5 0.5 0.5 0.5 0.5
##$TPOFFS= (0..7)
0 0 0 0 0 0 0 0
##$TUNHIN= 0
##$TUNHOUT= 0
##$TUNXOUT= 0
##$USERA1= <user>
##$USERA2= <user>
##$USERA3= <user>
##$USERA4= <user>
##$USERA5= <user>
##$V9= 5
##$VALIST= <valist>
##$VCLIST= <CCCCCCCCCCCCCCC>
##$VD= 0
##$VDLIST= <DDDDDDDDDDDDDDD>
##$VPLIST= <PPPPPPPPPPPPPPP>
##$VTLIST= <TTTTTTTTTTTTTTT>
##$WBST= 2048
##$WBSW= 25
##$XGAIN= (0..3)
0 0 0 0
##$XL= 0
##$YL= 0
##$YMAX_a= 557312
##$YMIN_a= -668488
##$ZGOPTNS= <>
##$ZL1= 120
##$ZL2= 120
##$ZL3= 120
##$ZL4= 120
##$ABSF1= 14.98061
##$ABSF2= -5.57192
##$ABSG= 5
##$ABSL= 3
##$ALPHA= 0
##$AQORDER= 0
##$ASSFAC= 0
##$ASSFACI= 0
##$ASSFACX= 0
##$ASSWID= 0
##$AUNMP= <proc_prof1d_extract_pilot.lims>
##$AXLEFT= 0
##$AXNAME= <>
##$AXNUC= <1H>
##$AXRIGHT= 0
##$AXTYPE= 0
##$AXUNIT= <>
##$AZFE= 0.1
##$AZFW= 0.1
##$BCFW= 0
##$BC_mod= 0
##$BYTORDP= 0
##$COROFFS= 0
##$CY= 15
##$DATMOD= 1
##$DC= 0
##$DFILT= <>
##$DTYPP= 0
##$F1P= 0
##$F2P= 0
##$FCOR= 0.5
##$FTSIZE= 32768
##$FT_mod= 6
##$GAMMA= 0
##$GB= 0
##$INTBC= 1
##$INTSCL= 1
##$ISEN= 128
##$LB= 0
##$LEV0= 0
##$LPBIN= 0
##$MAXI= 10000
##$MC2= 0
##$MEAN= 0
##$ME_mod= 0
##$MI= 0
##$NCOEF= 0
##$NC_proc= -8
##$NLEV= 6
##$NOISF1= 0
##$NOISF2= 0
##$NSP= 0
##$NTH_PI= 0
##$NZP= 0
##$OFFSET= 14.98061
##$PC= 1
##$PHC0= 212.0361
##$PHC1= 0
##$PH_mod= 1
##$PKNL= yes
##$PPARMOD= 0
##$PPDIAG= 0
##$PPIPTYP= 0
##$PPMPNUM= 2147483647
##$PPRESOL= 1
##$PSCAL= 4
##$PSIGN= 0
##$PYNMP= <proc.py>
##$REVERSE= no
##$SF= 400.13
##$SI= 32768
##$SIGF1= 0
##$SIGF2= 0
##$SINO= 400
##$SIOLD= 32768
##$SPECTYP= <>
##$SREGLST= <1H.CDCl3>
##$SSB= 0
##$STSI= 32768
##$STSR= 0
##$SW_p= 8223.68421052632
##$SYMM= 0
##$S_DEV= 0
##$TDeff= 65536
##$TDoff= 0
##$TI= <>
##$TILT= no
##$TM1= 0
##$TM2= 0
##$TOPLEV= 0
##$USERP1= <user>
##$USERP2= <user>
##$USERP3= <user>
##$USERP4= <user>
##$USERP5= <user>
##$WDW= 1
##$XDIM= 32768
##$YMAX_p= 462406488
##$YMIN_p= -702020
##$CURPLOT= <Network HP LaserJet P1505>
##$CURPRIN= <$Network HP LaserJet P1505>
##$DFORMAT= <normdp>
##$LAYOUT= <+/1D_H.xwp>
##$LFORMAT= <normlp>
##$PFORMAT= <normpl>
##$SURQMSG= 1
$$ End of Bruker specific parameters
$$ ---------------------------------
##NTUPLES= NMR SPECTRUM
##VAR_NAME=  FREQUENCY,     SPECTRUM/REAL,   SPECTRUM/IMAG
##SYMBOL=    X,             R,               I
##VAR_TYPE=  INDEPENDENT,   DEPENDENT,       DEPENDENT
##VAR_FORM=  AFFN,          ASDF,            ASDF
##VAR_DIM=   32768,         32768,           32768
##UNITS=     HZ,            ARBITRARY UNITS, ARBITRARY UNITS
##FACTOR=    0.250966925370066, 1,           1
##FIRST=     8223.43324360095, -11695,       92703
##LAST=      0,             237245,          -11093
##MIN=       0,             -702020,         0
##MAX=       8223.43324360095, 462406488,    0
$$ Real data points
##PAGE= N=1
##DATA TABLE= (X++(R..R)), XYDATA
$$ [...]
23828 -146530 368399 150052 15807 -188983 -27311 -374684 138766 -335827 -213005 -43353
23817 -152775 -134556 -516848 -106959 -141439 -226749 -6225 194857 450988 -6933 122547 -155503
23805 128141 206161 -278870 277604 243745 44479 -59519 -57447 19130 -151092 237934 -193579
23793 -9431 -71235 -131947 169217 -320849 -64983 86674 -265440 289435 -152659 30809 -98032
23781 -205330 -81564 13716 164165 239399 280429 -104267 -176773 87873 223356 391878 94916
23769 -205245 155077 225680 -131694 202641 -105097 255921 36711 -51886 34718 397799
23759 397799 15651 -201137 15412 -189157 -290450 128745 114694 -233987 97152 -63419
23748 -121302 130520 -137541 -62438 125770 -124254 123316 24863 -18316 -257741 -97555
23737 -105044 -253489 -283704 202963 284241 -156680 -86344 -16955 116825 43823 -163442
23726 -9724 61135 152437 100234 -98881 248900 -78888 95368 15202 86131 27045 171522
23715 171522 -80160 285863 387466 -227396 86326 -75095 277664 117859 101417 73272
23705 73272 -38194 201074 -206623 86558 -8554 -280300 -152717 -38582 -40938 -34800 -252173
23694 -252173 14449 3455 -228329 -123627 -157579 104270 58807 -313051 133895 33136 357531
23683 357531 -62880 392098 -187577 -193053 -117363 30788 -253489 -53762 -203849 -287322 324687
23671 -199923 97577 -304559 -32107 -261320 180086 66650 -28384 72046 -48492 122950 -69820
23659 36456 -30488 26292 52030 -20843 76582 -41434 517186 241638 143522 124855 -762 60200
23646 -13215 -187429 -183017 335398 -122752 -267643 -196759 -13328 -126150 -12399 170773 -90098
23634 -90635 -190779 -1290 -369036 340539 115230 403609 -53284 -220221 -244016 -198668 170933
23622 215663 254573 221863 -116143 34002 -250309 -259850 -191182 12559 204120 85283 -133206
23610 -407799 91362 113306 128211 -18649 -194830 90039 226103 -245094 -401818 -80204 182072
23598 88516 -192913 -191886 -163849 108809 205140 211640 -41380 239287 77838 104559 -36982
23586 -48135 -121446 -167036 221822 -235831 -70588 59291 -256707 255509 -25654 90684 153967
23575 153967 -25143 -134367 -259407 -64841 278895 -43833 -103967 -43383 -38167 -88467 -195917
23564 -195917 4904 -131677 -343108 -117467 -64235 304383 -132010 206992 270171 298362
23554 298362 111220 99138 90760 244657 -83911 139948 -68693 -181794 33782 -90676 17415
23542 72370 302829 -57512 -62805 393998 -133525 112114 49648 13050 198143 -214164 10031
23530 -214331 -2143 -325018 34469 20253 -135250 4614 202674 367266 -145810 162797 274956
23519 274956 -19847 -91575 -136024 29022 143317 6434 -95729 134693 170631 364578 -126219
23507 194260 21651 118374 -155481 24993 -85075 -243015 114321 -38602 98149 -47559 -95500
23496 -95500 56095 227590 146049 63748 86296 72429 -162114 3721 94238 -100215 33388
23484 90046 98540 -108551 59074 -247364 115111 -68115 11552 83908 -416920 233614 -59423
23472 -327452 -134970 -46158 84350 45975 67094 7609 -293641 -12714 -4163 76771 -46713
23460 248265 28672 115882 -33927 42504 23084 -280091 230453 -103645 -367234 8350 57278
23449 57278 40738 -259815 -240944 218504 -225972 -12283 23527 -342084 33424 -334337 -159022
23437 334294 82624 -357929 -50933 175263 -289698 -40147 369633 -309689 -257522 43197
23426 -157437 210952 -90055 134606 -47611 20752 125858 -213368 273705 233926 -74234
23415 130651 24648 -256207 60231 103315 16932 -229070 22429 -158417 -183178 -255257 156209
23403 -117155 304283 -70093 -20001 104266 -213814 -178523 -256573 222566 -166160 81123
23392 6314 338071 -274120 -178762 187456 41833 -135946 149087 -91107 -110327 -531004 104538
23380 -192661 -170062 -140388 204073 -262282 -76689 -128869 -55586 270756 -27102 392641 -179426
23368 -199671 -329742 -305466 16770 -179743 -115562 -4424 -379952 -40775 224467 -125334 54209
23356 -115331 244092 52519 39730 -66142 40502 28571 -17092 -112382 991 -243505 -99619
23344 458747 56896 -76311 137245 -60810 -102661 25218 157202 475031 -4262 -142508 -92627
23333 -92627 203474 113070 -33555 -19433 42217 -86169 81057 -585866 -104503 -205886 -109272
23322 -109272 145047 -102582 -131686 279835 -41590 17547 -307491 22393 23267 247163 -200805
23310 277857 -310083 16360 135654 -8010 21717 -273414 -9235 296633 -218844 204752 12377
23298 -183932 72100 17913 -201066 -195988 -36107 82091 262607 90192 -1832 -142719 -4171
23286 101337 195557 86875 -49347 -35217 69348 203409 269238 359464 125543 100084 154412
23275 154412 -191034 141599 -322875 -163321 98971 83125 -124058 -117817 -128012 144524
23264 60732 151584 68884 210560 -285836 -20987 -60425 -204671 -329533 -63918 -81231 -282181
23253 -282181 -120167 -121010 107116 -60441 -1681 -520041 325606 -42138 -147816 -156642 -329402
23242 -329402 125190 408160 48499 -169518 -57670 169865 -241755 -368131 196683 -238226
23231 -10857 207820 151181 -100816 89108 -163540 10792 275897 -110059 -70220 -257233
23221 -257233 344833 -214852 206046 109695 -83192 -5223 185263 -118479 -528118 -139728
23210 -191251 -25279 38419 230336 -15114 96200 -127214 164717 -27901 12478 -30418 -70397
23199 -70397 -103874 204172 175149 -301409 -51552 117870 113437 -243507 82524 -112549 -133804
23188 -133804 -188905 4441 136990 -66437 -37041 -123705 -159065 -257248 -48356 -263600 -16519
23176 161563 -59101 -123701 -324647 -253576 88889 -125582 -119226 11203 -33661 417333 76881
23164 -267536 240740 318212 -272879 -109800 129935 -38462 -333857 -137032 -101300 -78665
23154 -78665 -119734 25151 -36766 91303 93106 -26798 -25904 -174373 125812 -331243 357650
23142 82530 299711 -121208 -37379 -237066 132243 222859 -27406 98955 139566 -135805 -378024
23131 -378024 -78194 -48916 -18868 -94268 -441165 -268841 -55653 64416 337629 41281 67758
23120 67758 -225444 -62281 -43170 43645 -259696 -269881 98738 -216657 193849 -292736 -96393
23108 -87679 154278 22276 -46004 -36702 -67322 243432 -55663 -299381 -203063 51026 -77232
23096 -34468 -57722 80326 -127018 -109317 -85756 -190102 61709 54931 -283125 190273 145424
23085 145424 -51671 -157229 -104788 -81577 90798 24007 23982 14864 -217115 41424 -213386 403330
23072 -87098 -260315 9242 46402 25311 -205860 199999 455799 154121 -81172 32010 -296667
23060 -16851 -246440 113443 66358 118851 109968 -74249 23949 18534 -94987 211379 -77735
23048 -56638 -6682 -149190 17232 84555 143073 -28129 54039 14981 -60970 216340 123001
23037 123001 -207960 36322 186385 -44201 -176964 -237376 -189557 101922 -106904 -327550
23027 -327550 59146 205309 -213488 248367 -128972 97290 -18957 74906 213948 307987
23017 307987 57549 107210 -246389 237947 129003 131588 6556 -270052 -294068 215741 -87982
23005 -200802 -211167 -27037 -354652 -195287 -106674 -121800 34146 -127685 -93205 -54834 -77103
22994 -77103 -95207 -52989 -265995 -138823 7257 -166800 -162642 -121610 9112 -67894 134329
22982 16970 71412 -107342 -17855 -18880 -79039 213951 -134859 -115631 -321986 100289 -47072
22970 108344 67847 42978 -339246 -42301 -191928 144365 30422 79004 -47819 -34012 -194631
22959 -194631 44474 6274 -572 -29004 -120301 -244318 -65626 154984 191906 -253855 -68662
22947 37590 200829 -119882 -152893 -139426 -35864 142093 319653 15863 36585 -4547 -383840
22936 -383840 -69556 -9338 29705 99824 -95246 140631 -86114 38213 266319 245510 -10528
22924 42107 -307858 -192693 240282 -137120 -34943 80821 -285311 -206072 -183399 -199104 44780
22912 -63450 -50425 214546 297074 -77711 171619 -29543 -5553 -258991 -315498 -85085 380519
22900 44226 156125 -273211 -130007 -218111 -128941 -31171 -302906 57493 -98282 -248278 -281550
22889 -281550 -103853 99962 -3459 -234831 -15638 -188948 59308 24027 -115548 -2876 -4544
22878 -4544 443236 -151997 195539 -6374 -147122 207124 407243 -214123 183700 46373
22867 -182327 -323563 278742 -57058 -20365 56817 63918 -81430 59166 227469 -338074 -127503
22855 203523 11283 -201158 -23923 103557 -67577 -157938 -39285 221318 -27042 11112 80359
22844 80359 -299933 114074 -63898 -187161 -37758 108994 236130 116153 -148671 -54154
22833 173997 -7106 -151083 -486974 57265 46683 48256 82298 -29442 -263983 163810 -443659
22821 -265524 194306 76338 -9103 -141081 -80669 -94041 -192492 -98674 73250 38299 244729
22810 244729 -59710 -14843 144357 -273956 83477 -65428 -47745 -151417 -74479 -274877 244213
22798 -260942 -149323 -387055 -132192 -142745 119641 93125 -88075 49799 158254 112155
22788 112155 169334 62875 83683 264534 -186871 124129 125476 103814 277055 -193292 274883
22776 20563 -123817 -266286 -14797 -90821 -82201 -38697 -5376 11584 59811 337353 -282824
22764 122279 34594 -147452 -190310 24718 -200894 -156489 -398898 164376 206992 96108 -272145
22752 -303354 13667 -214031 35326 -413754 -275822 284865 -159748 45101 -259875 -176397
22742 -176397 118117 110416 164519 -48984 233492 39522 71765 289666 97986 77031 45345
22731 45345 -155415 268429 33320 -213380 -111277 128302 2735 273778 -100750 -206237
22721 -206237 101599 31252 189757 -275071 -143408 -277920 -31224 4916 -219389 144443
22710 -324029 10479 -17688 -22347 247152 -75419 -97069 -126651 -71705 -152624 10181 241874
22699 241874 -137238 -221785 33525 101716 -255555 -246015 224803 -42033 -100465 -37238 -273161
22688 -273161 -229426 -267820 -16100 10681 29168 155288 -9704 -77162 -12786 170119 -5744
22676 -146246 -397513 -54773 46785 21473 162575 -123565 286844 -211795 -92789 -88449 -213080
22665 -213080 60428 40122 61851 266702 32488 -9613 -49468 -24681 72812 401079 -58755
22653 -128624 -142956 -338931 -154103 -283459 5140 28303 29077 -80691 -26952 -82126 -160413
22642 -160413 -42369 -171006 249281 285829 -162693 -2835 280468 -111229 -89355 -91493 -114107
22631 -114107 70319 -109621 -144757 62055 -107463 351646 102959 -326245 64280 321375
22621 321375 -10248 -57413 1285 -4152 47889 234368 146226 -358082 90932 -225265 -250126
22610 -250126 137365 -265083 41673 -140001 -255289 -76297 293 192163 -143765 -172728 -120713
22599 -120713 -180135 -45281 -175142 85576 257081 178151 45231 -137068 252613 96524 -146278
22587 86929 -53124 -107968 -68109 20068 84330 169617 194881 71232 91374 -52102 -362501
22576 -362501 216334 41495 -195708 -329 -98264 -194166 69968 131707 -20036 -141639 87276
22564 -79778 52632 -31931 286966 -38763 172236 58508 -27968 -249131 -48166 94576 -45011
22552 45876 -393475 -111862 -84068 -421876 -114270 32889 2772 377834 13863 -222826 79323
22540 12048 -278052 140106 -167424 101720 -163624 68674 -298280 85464 272847 56546
22529 -93888 -255434 38123 69537 -10772 35328 100892 -253282 20990 -107042 95481 -154925
22517 22111 -87974 209322 -425720 41482 -198952 153264 -86920 -34996 -17658 -126898 209257
22505 -80278 131665 -51446 222759 116475 128544 106836 65753 -102345 -23074 -303163 -240963
22494 -240963 -271784 -158502 -231594 -144911 -230940 -168274 8989 -134200 -309713 -296914 189919
22482 -293 -378084 -251839 -102533 208825 236834 -225350 374455 -188926 -292602 114330
22471 45009 -137465 34005 38109 169834 -124886 -152002 46933 -57261 281576 89573 -41978
22459 34010 -79247 231587 41038 -270157 -103372 62029 -146989 -176746 90322 36890 -96009
22447 -147988 270505 -174963 -92280 -60609 -47887 5182 39887 190049 -172088 146740 168501
22436 168501 -14348 79386 -55773 -94177 3023 -35235 -245218 292103 -27584 -60477 -72575
22425 -72575 -36068 83112 95179 -18092 230925 100712 -43058 21234 -227693 34108 -199715
22413 -180 -59912 -354445 -171834 17701 -164057 -32039 57005 28033 -28988 24281 -110995
22401 -91913 -150110 35675 91310 30883 56468 119610 -43253 -203021 -362390 96117 97619
22390 97619 -65049 142456 12480 39652 -123760 -261419 -74223 125648 -9668 -167145 -4852
22378 -80180 47655 66730 -187575 123510 74151 -37753 -21164 74139 101067 -87484 89755
22366 -128565 66696 -7884 -136683 190697 53215 -259024 -355387 75424 -196140 44625 -156772
22354 -216899 -153870 -302863 40542 -63056 -37139 -212934 -30222 316046 -205813 -296727 100692
22342 -178482 -181171 -254221 106365 255491 -87496 -102892 4960 89075 48688 37665 54856
22331 54856 -45261 -250377 -266794 -274268 -245535 386173 73153 354962 212944 478721 16547
22319 210064 88563 116611 -155640 -138016 246594 -76935 162387 -271355 -219847 -4489 88648
22307 124018 117140 -60770 -268255 -140224 -29750 -152212 246680 -242638 41145 -147739
22296 173092 65535 21775 467325 -141601 136142 244307 -127935 26689 18291 -157283
22285 -303936 -213060 129032 -469835 59033 -32308 -74961 -96999 -170075 -8588 171983 -55380
22273 277131 -41681 28723 -218931 -243232 118554 -274104 -8142 36403 -186182 -78616 163198
22261 42975 -90503 -47330 98021 -276995 -9232 -109905 -21971 216646 59953 -365098 -75732
22249 -37376 -7020 -10984 -135409 147628 281457 -41609 -82847 262383 141902 49218 -155664
22237 -11030 -230102 -142019 -187656 -74016 -191940 -175491 -10349 15461 393807 -84645 -109992
22226 -109992 11811 -191669 -62387 -199737 -83638 -70092 77267 -256166 -74193 288203 -2289
22214 -261741 200436 -115680 172584 281461 -77291 50330 -70550 -236943 -36522 -181174
22204 -181174 203036 -117568 213863 -87299 -406962 -263340 62851 119706 13488 -85960
22193 116373 289366 46511 16214 180707 -52934 353511 -110760 -107639 -140241 -55268 -201561
22182 -201561 194598 -246698 278536 -225042 -222238 -251403 144284 -62986 266130 -140446
22171 -146209 -225961 114826 -16650 206231 -28033 68144 -116518 -40678 -415497 -67659 20676
22159 -139415 -173346 53235 64596 -237410 -196587 -160877 -63609 -86661 -118207 -18168 -220283
22148 -220283 95432 -157526 -237317 -155185 79429 119629 -196560 -54942 273654 -113497 327715
22136 267174 -192438 158481 210891 111351 128174 -142097 -192548 149745 -47 106169 -7834
22124 -423384 117695 -42368 83932 -233827 190323 -362887 121419 81149 -171955 -262159
22114 -262159 65167 -199511 -136708 224898 60249 104164 -164611 -433243 -104876 -158084
22104 -158084 49413 -77507 -197264 -32456 -554726 60718 209218 -189634 -233286 -1795 51188
22092 130044 -43207 -140022 -135959 -53935 35091 74510 -284711 27611 14642 -34600 7027 -234740
22079 -70412 -362300 -183689 -47437 134353 165645 109096 -156224 -103996 -53418 61728 -164673
22067 88175 -215345 -43792 117549 344819 -58553 -171017 -65879 -115946 75686 -190862 110949
22055 -110944 200337 -271272 -31373 -65380 -130328 -250337 -161998 177078 -98141 201657
22044 22315 124840 -5710 -223309 52583 -465556 -316366 -50286 -338772 213419 -49743 -178210
22033 -178210 -86520 164906 33304 -87869 203188 69883 -96644 357503 -240680 -359182
22023 -359182 91053 3094 -109723 -123830 -110967 6805 106087 324186 124270 56211 65406
22012 65406 7736 -41171 -346061 -107333 71830 -904 214935 25954 238617 -263725 -242688
22001 -242688 -88916 446621 -308011 -175534 -175947 -150194 -315065 42836 45254 -26098 103865
21989 -140427 8613 -158221 -60782 -122174 -137193 -205132 47973 -309073 291214 139889 8094
21977 84296 -445276 -19955 -38025 -136502 108446 -143503 3890 -314568 183269 -126485 -138016
21966 -138016 -186019 -125486 -193093 58460 -119842 -59007 -136570 -116363 -4198 164818 -341286
21954 -369342 99413 119699 99170 -125011 132372 -218616 -145733 -108655 192898 146137 133232
21943 133232 -88957 -173820 -81289 -50182 -18229 116265 236703 -118169 -238554 54295 -76717
21931 -212145 -310148 84027 44666 -208369 -50189 -266578 148861 -278075 -170100 -338620
21921 -338620 34549 -15168 262383 103101 -258467 -476 -456460 -271855 -232351 17488 -64315
21909 341198 9686 -296570 410667 -260393 182427 -201167 316692 126191 -280830 -119003
21898 152333 -371299 104274 -191993 -185857 6254 12312 27105 -95371 329004 146900 -196667
21886 -165506 -155657 51478 -266063 -408781 297127 -8002 -10737 143476 23442 58637 65384
21875 65384 95857 81249 -79913 -140359 314382 -62057 -165352 -438152 -50665 2573 106310
21864 106310 98336 71167 -54898 65517 222185 90724 112731 21288 -293074 -34766 177221
21852 -26225 -62775 -143821 -211349 -111382 26522 -28674 121636 123148 3196 -145393 79423 -187838
21839 89318 -93782 -94023 168198 95523 -360930 -27041 -43783 6833 246133 -15702 -8304 -164176
21827 -164176 -47314 -6847 -330566 106463 17547 -344737 -171776 -5092 193157 -519180 -228451
21815 -75748 -284854 -125974 80438 -216139 153167 -266590 -209114 -152471 8308 291249 -162329
21803 -239756 9535 158146 265664 241413 -246921 167656 -36323 313144 3941 333621 8482
21791 -6673 -235222 103621 -6892 42385 -114689 -215039 15075 469267 178743 -44256 90264
21779 -233979 87902 -104815 104106 63935 -71609 -177194 -194717 -100266 48906 136807 -223975
21767 259828 -87504 -18913 125234 -261049 -46126 -73022 58343 242879 70049 -4819 -158222
21756 -158222 -90542 64778 -161626 -269461 -91444 -84154 19454 -259762 -45389 -493792 70133
21744 -210493 132362 -65195 -196444 -60951 -123825 93990 -85529 74615 114949 210204 -998
21732 -78665 -264161 62521 -72490 19366 -68798 -140679 66155 -233623 -100882 -134837 -251130
21721 -251130 17066 -42967 102972 16279 157853 -87775 -177179 -182425 -288377 -228408 52623
21709 -316029 -67879 -201579 -237189 124766 -194289 -137938 41225 99334 -259976 39180 106312
21698 106312 -257994 -142065 -164005 130384 -148034 28000 -320988 202007 30166 59353
21688 59353 228351 -57915 23090 -208598 296713 -27329 -54707 7236 -176427 22692 -9860
21676 100379 -26868 134836 112435 -45351 1242 154791 272462 -146739 77028 -166012 168966
21664 -313368 -167546 -62965 -246183 -130772 -68426 239894 384569 -172594 -387724 69596
21653 -223929 -59731 -9051 -494388 253854 152317 -261984 -209930 -297150 26353 -193124 -120134
21642 -120134 250037 43167 34370 163027 -236298 -173966 -250773 -79952 -75379 -178151 35705
21630 258358 51951 205621 -232859 -164594 3658 275191 147345 -68400 -215701 247478
21619 193454 -383374 -210651 -22425 35815 -140155 -406584 -19888 193819 180374 59448
21608 -165823 -218857 -168326 -127322 -106857 115291 -147254 -200125 -241981 -277524 -73582 -290878
21597 -290878 -157656 139507 -63849 -62730 -390740 30039 -32721 198678 -132847 138128
21586 -306349 -183578 137577 -20278 18197 -136253 -140834 -210147 148593 -215469 -198801 -102506
21575 -102506 -87005 82478 48404 -6750 -5259 64266 -100338 -56333 115106 -94290 -1151 -127642
21563 -127642 233838 -229258 -199302 -50306 -271927 -155703 49668 -83128 18878 318511
21553 318511 30576 -87011 -44933 -4953 21613 -58805 244855 -90870 -184962 67714 50969
21542 50969 149198 113406 166407 -182148 -50660 -53256 87328 28637 -114125 -71634 49015
21530 -167132 -74026 -290696 -225497 -251785 139563 23240 259042 -4737 36138 -119691 62809
21518 -266421 38290 -63772 68003 -218207 37916 79027 -217750 -36632 23885 -201845 -76736
21506 25123 -65262 -172693 50686 145964 -256474 199858 -123615 31447 -127335 -75925 208739
21494 149199 -61211 -262178 -133101 32521 -180804 -44311 16091 210983 97055 -157849
21483 -154565 68861 -320060 -32511 -154254 -83885 185917 -144868 -257146 186587 -189863
21472 -173793 147085 133142 48192 -130747 76835 3115 -171190 -112229 -56791 -305488 203431
21460 116608 -250910 366781 71333 65697 281717 163922 50550 38580 -131534 -111666 -172676
21449 -172676 48001 -66269 -13052 -160776 77185 -30185 55175 126750 -13282 5248 -261475
21437 -129379 -184981 -136732 -123234 260082 -277129 38443 -171224 -266291 27643 -77889 54123
21425 -33695 534039 220227 99154 9555 23046 -66421 176383 54756 -100129 220571 -48430
21413 -181633 -80769 -463453 39225 -101410 -48246 -50457 -261374 -73416 5502 84469 -33034
21401 -109222 -71945 -120654 -281686 -198771 148518 -58960 17919 -43459 504 -145580 30258
21389 -43394 68864 60175 -192669 -155119 246277 -193901 48678 120501 64476 -4889 57320
21377 -255964 180709 -56032 -14227 27946 -46506 -115133 364265 -103791 -112218 -238007 -212207
21366 -212207 347117 209955 153068 -30651 -277264 -220300 -225100 -113862 -60613 90930 -252927
21354 -39420 36531 -108454 -50088 -122274 238680 -167601 26299 -279512 -118822 87059 -336105
21342 -97653 -125872 6066 -172466 -76156 99682 -78155 -70701 158734 -12300 -218393 -4167 147356
21329 -256576 8060 134803 -187099 -121566 -178690 -181846 -277097 124575 -226732 -222629 171117
21317 166639 14818 -31890 -25267 177814 -191187 -109457 84793 -125149 21432 76164 125675
21306 125675 -271147 -128414 -273 45110 7293 -63130 280177 -142913 106041 158387 -146891
21294 23920 21978 -83782 -96762 -55976 175520 183876 -135427 381305 2807 -328826 -158990
21282 -281328 -603668 105469 194561 -79129 12347 -276192 -31783 57246 39221 -179813 -168061
21271 -168061 134250 35760 56716 -191518 52919 155023 164616 -254131 -173299 -43657 50171
21259 -213308 -35770 145010 -136587 -129000 -79959 -123367 -421324 -127926 164194 154905 -460967
21247 -394504 184510 14876 -18534 -286021 -344736 -31331 58975 10962 -318807 106665 -61678
21235 -1007 -375583 -99200 109127 -84432 -107186 -99732 -133120 -156967 -23625 -117990 54068 -21151
21222 16913 -87881 297219 85590 -116733 100232 59766 20595 181934 237659 59369 -185302
21210 13972 -171180 33779 -41898 124489 303211 125764 12803 -309072 24999 -164390
21199 -283377 300735 -127596 -229528 -192075 -144047 160163 -59583 -45275 -290484 -19044
21188 -451870 -210813 -32517 -445073 -125345 95540 387817 -74037 427533 99910 280616
21178 280616 -94585 28679 -144312 396164 57628 -107200 49781 48143 -84755 3043 203598
21167 203598 -10566 -227741 -176002 -23555 -10129 323523 22503 -66158 -216933 -6011 -115581
21156 -115581 -68683 -228049 -22968 -159908 299700 -196085 -24298 -21491 145271 -169058
21145 -258763 118422 -339555 251929 231339 65372 -93562 -400771 200815 -194596 41720
21134 -7515 -5776 20609 45698 149881 -440057 -4093 -189594 -422328 -192886 104527 -215545
21122 -403861 -118214 136292 456581 -135773 -275084 -169933 92527 29124 -102949 -117743
21112 -117743 -218259 46725 -250741 -40626 138322 -101383 -71834 16898 -22354 119677
21101 200683 -190989 211640 259757 7032 -96595 -326307 152788 -340628 284014 -422983
21090 -106908 8262 -281383 -221543 159982 3842 -89750 -67616 6311 58439 16339 -254107
21078 112954 176492 335225 -260193 38544 -219067 -242357 121027 -39026 8497 -267891 -23283
21066 -238090 109839 -164395 -84854 -57920 -383068 -120693 208060 -89828 -64295 -33005
21056 -33005 -250643 -119820 344962 -414134 169308 -288760 116884 176742 -23994 36456
21045 196325 -46006 97540 -101239 -49648 -310767 -84461 374204 7780 -152807 440632 -236976
21033 271086 -142388 234914 33933 -14022 -301092 -328515 38954 -220320 192400 -257636
21022 -61695 46707 -8608 8067 102935 -76411 -27735 -221362 143707 241598 319908 -174479
21010 114991 -624480 -72990 -21966 145132 -104791 -143002 -391703 -133652 266302 126976
20999 -21415 364666 181533 -347128 104764 142881 115397 95114 349093 -32997 99893 55167
20988 55167 59824 232862 -34393 -98539 -11900 -247678 -106608 60912 -4706 116576 -295974
20976 46398 299894 4104 -88651 113093 142592 -31621 -362402 -175599 52893 134520 45795
20964 123 -78488 -51143 124588 4004 -86452 -477868 -112455 8281 97648 -77847 277605 33762
20951 -103258 118510 -176599 -96019 -36086 -254791 -65297 -217669 -78628 19769 88796 92885
20940 92885 -122755 -83756 -312410 -13794 -14018 -64063 -204392 81144 -243811 99025 403722
20929 403722 140359 447177 246474 -41289 -148447 139185 -184369 297952 354917 -155554
20918 157191 -111176 322077 242868 55081 -107823 27215 126789 217479 -117807 -165144 165856
20906 -346735 -124217 297817 -387276 -88490 2113 47935 -52937 -312028 -35932 10150 -28466
20894 -227325 -99864 -399472 -103447 70873 -84017 -164847 103704 74706 -18789 -12102 96598
20882 212287 -155441 3677 -66313 -119257 -40904 -737 -59477 -162335 -442147 -190893 -287569
20871 -287569 -62787 25950 66130 84128 376989 151058 99498 -99834 -124633 -66199 -105319
20860 -105319 32924 -105362 30473 171508 -220537 -213902 -255502 -435611 -123732 248158
20849 76209 83992 -342182 -135740 -150725 -15132 -240131 -38455 -174427 61117 -209622 62748
20837 -260961 -82174 221252 -182789 130568 108745 36085 -175568 243284 51883 156717
20827 156717 -35872 143578 -286264 8366 132245 307308 163868 -49006 95245 39657 33614
20816 33614 -21935 75464 -288919 129218 -116920 -198802 104055 202339 -607019 43466 -124960
20804 -82251 22118 -265612 13847 -83004 31444 -297984 39266 172109 -224576 -214645 -22457
20792 55516 -262594 -505905 -93076 -586360 -358520 -573193 60299 222145 182343 157551
20782 157551 14616 -91059 68298 149037 -88759 188567 -101241 148110 8280 226562 153380
20771 153380 -65272 67322 -9421 39422 -102267 148345 -356205 -293221 -164085 -5199 28277
20759 -314698 307389 -60685 2857 -74957 167411 61351 234397 421138 289395 -79817 -190788
20748 -190788 88938 -103078 -224666 -68786 109469 -250057 -80707 -41999 119185 -273343
20737 -89662 15601 185896 -55403 -235966 96594 -164606 -198846 -50216 -129373 116283 -130735
20725 -22737 -140970 -143964 76505 150584 -139355 -243731 828 8225 -146734 -4820 -171111 -402601
20713 -402601 95801 -133405 -86537 308835 7756 78748 -370854 -31406 150332 -104619 38151
20701 -173549 -108062 -72190 28122 342763 -168007 -58116 91543 -119450 -123976 -227203 34545
20689 -168472 -494699 125849 -214490 11797 -229536 -65829 -78608 86784 193663 -318971
20678 7183 115908 -300896 -366142 -115815 155157 159652 -246048 -35209 101502 170012 -24154
20666 -22406 -219189 -227548 -366315 87125 4238 65963 109621 -165089 -132681 -232321 -174381
20655 -174381 174343 4674 329980 -101234 319116 149933 -99709 1062 -38324 -171235 122828
20643 -73464 -119115 231562 -201816 -474038 29279 -328668 -54743 35949 149757 -66056 -177095
20632 -177095 -457954 -214229 -7048 -267774 -320589 316760 -56348 -168733 -157404 87277 153021
20621 153021 -380018 -229057 -148287 -146400 -84734 -196787 91722 21002 -128717 185265 359250
20610 359250 -127840 -63192 -281989 104631 -321907 -8031 73857 132733 157945 149331 -43191
20598 22868 -5376 123465 75726 26762 -162828 -66122 -136575 -282086 -198156 249008 -28354
20586 -1370 79617 83320 202625 67868 -138495 107771 92369 -28581 -301572 -18168 -22006
20575 -22006 -38589 -97599 -96737 -383262 224792 74692 79475 -346992 162427 -71121 68909
20563 -28905 124310 -76485 8243 111643 -188902 8876 251729 216635 -253711 78073 -216108
20551 -152504 -52778 -86279 96355 74919 -72856 86955 -294759 44615 -165040 -177366 64855
20539 -174634 -108362 -199826 -419595 -385136 333720 -95964 71254 -126145 -434618 -182345
20528 -362713 -57933 234369 -383728 -185551 -186868 77347 -79555 -144149 -41339 18170 -50580
20516 237089 128151 101735 86522 -38483 138349 -133910 11801 -317712 -249425 -131978
20506 -131978 -89810 -185931 -1104 -42160 -108458 4438 -5220 57938 -195418 -142735 -28977 -243138
20494 -243138 -273354 -49896 101760 -210330 183727 270550 72825 166988 52618 225279 -44706
20482 28240 -244219 -289254 -160462 -28928 -177735 11347 -122357 -188873 435950 -65100 -139189
20471 -139189 -360137 -318911 -237452 13247 -192649 -259562 168693 -57000 53636 135792 -102324
20459 -55531 -244050 -31521 -153542 -41618 -65876 51219 -287082 -359907 -79082 75684 -145440
20447 236928 14904 111721 239444 -120780 -74846 363064 154653 69019 -169723 -245003
20437 -245003 175565 -295356 -117485 -416774 -112563 -150100 -7217 70560 -59962 29238 86115
20426 86115 -343514 129051 276924 200418 -18963 -133698 -233505 -131599 188272 -59325
20415 -248595 8296 -260571 88961 -28718 111288 -146663 -355383 -117845 -158360 32999 -276605
20403 -185206 -154526 -282195 107814 180436 17779 58898 414583 -291849 34528 -44755 -287958
20392 -287958 304087 -223852 -8037 -68774 -360799 -141688 -63236 56016 -211382 -201232 116132
20380 -106950 5467 85529 91433 -3146 -198917 168069 226433 -65995 291855 -311672 228654
20368 -103855 268456 73596 -93509 25881 206581 -45513 223353 -384355 -99383 28448 36658
20357 36658 -349746 -193165 -5246 73812 19551 -269657 -289237 -64347 2460 -238424 90125
20345 -250268 -30106 148904 -77010 172971 -67329 32562 389268 47752 -381463 58103 -220349
20333 46416 170584 124131 -117804 -31550 69279 374094 -356500 -452966 -88269 21312 -198693
20321 -56486 -54577 -366296 25114 -29152 -64728 -199889 -283445 257900 -132148 -190629 -24822
20309 -161185 -265620 387186 -169431 -270018 179378 -12879 153902 10777 37146 279520
20299 279520 350744 -77855 -202568 -78896 -149873 -22175 50738 177716 43649 -182217 136369
20287 -279604 126133 281000 -152031 -306121 116012 -186634 -240806 -122581 16975 -119986
20276 -47875 -490751 -476908 -261073 -61234 -504576 -31050 -125401 105926 -302118 -146596
20265 44396 -40218 -57683 28954 -242617 -231449 -129048 -80493 -302280 -254476 8248 154213
20254 154213 75551 -59378 -347018 -295418 -125613 120920 196114 -441498 -118223 -247102
20244 -247102 -38265 -168963 -364485 70181 129106 -124544 -169461 -374810 -334143 -6821 132286
20232 -78220 -369766 150683 -465962 -193126 135332 194923 150660 -455612 -57599 -146513
20222 -146513 3155 -127036 -68994 69935 264708 -103636 -16303 199162 17412 31758 -276792
20210 68014 -220945 69565 -164637 -139442 318972 208973 -369545 307156 -53009 -61190 139984
20198 109783 95702 -245699 -254875 77195 106630 32137 229654 -178294 240995 -9424 -231595
20187 -231595 -496590 -3059 56952 -142218 -29557 15340 135475 -196585 5475 -1719 -177028
20176 -177028 74286 -51853 21643 166121 301462 -100095 165895 -369269 36605 -133538
20165 371362 111097 -143055 -59512 -391626 -73164 126038 -56688 239954 -174763 -181147
20155 -181147 -111050 -13705 -105769 -226985 -20115 43441 -21183 -54020 -187090 32896 -289750
20143 -80383 51640 -303572 -15958 -31743 -192694 -104658 -180390 -11793 -107722 -171793 -34934
20131 124219 103710 41781 -190496 64104 174839 32200 -44236 -44666 7941 -99056 -319252
20120 -319252 -109150 171570 -160097 -290812 114501 -92948 -384467 -55575 -56441 253251
20109 -52054 -90210 -167070 7250 -131585 -328392 -261492 -46666 88267 174632 9230 -163609
20097 170608 -146856 56913 -225029 -300450 -93993 -73689 -75469 -225677 -89594 -380965 -47323
20085 -189849 -182286 -104987 -89464 237791 -137667 -41616 26025 -61467 -194149 -213895 -148271
20074 -148271 279857 -247069 -25810 223601 127040 316733 -33712 659070 -165814 -105942
20064 -105942 139702 146998 -199836 -48574 26376 89831 -11787 40382 147441 -93389 223521
20052 100829 -84078 227535 35348 164124 -224746 36858 -249227 106821 217840 -166492
20041 -194842 78754 -89420 -125501 -460788 -56358 -154488 70265 -238832 -460312 -57609 -294157
20030 -294157 257738 43052 127625 -227612 -54374 92685 98416 -89655 179341 164550 -166784
20018 -93443 59709 255643 -123188 -110745 -442857 -29041 95251 -76875 96680 384615 -14694
20006 -91580 48233 41804 -166367 -413142 -319060 239517 -98618 82997 -151220 -140734 -115733
19995 -115733 -216654 212459 -144765 -140167 64799 -194371 -119520 115237 118994 111600 296598
19984 296598 -64742 283011 -471425 -181544 65804 -236656 -119188 -100285 -114250 15744
19973 -209464 115856 164200 71624 33553 -311403 -125218 325196 -34383 -217839 -210626 -344166
19962 -344166 -212920 120782 -135269 22291 -7598 103201 188720 102311 -37814 85527 -21401
19950 16733 -1862 -115356 -25459 -108175 50544 -30985 -24550 -179916 -2177 -266724 -112747
19938 115945 -100130 -88398 -82685 102749 -131263 -78361 -86613 -293234 -28122 -26878 70703
19926 21118 -258457 151364 -175089 -105748 250141 -11242 -224489 -134897 214196 -269757
19915 -173475 60794 14368 -19296 306754 202645 -286030 -277196 -25542 -213659 -65990 74963
19903 13017 -44859 19879 -65457 165045 -51649 55526 -61145 -41275 -308549 -273045 -20348
19891 16557 200223 -21307 -101691 112877 -51669 -273354 -160901 -186529 112712 13770 46533
19880 46533 -396245 -262922 -234007 -191603 -98731 38190 27107 29027 -187832 -67695 6386
19868 -193308 -263552 -34991 118247 345588 117347 453074 -327868 -132476 -92685 -321180
19858 -321180 147776 -239402 -46169 -104849 33262 164808 246299 122678 -311165 -171638
19848 -171638 246039 -379393 67649 152778 8601 -292411 -108522 -35970 89657 -136351 -275551
19837 -275551 -318778 4293 -120988 273786 315942 -170241 -37901 -263175 197275 -306926
19826 -69803 8633 265641 -238576 -194798 -215379 70788 124671 93387 3667 -453047 -130510
19814 -209338 -175468 -69435 -121809 -278376 325659 -86697 -429470 -35823 8131 2264 -128681
19802 -381051 215782 128569 34533 -47953 74140 24430 136161 27020 -98655 -151271 -8503
19790 -148058 91958 -135680 -186195 -248106 -167694 -49237 123403 170165 -29736 -162513 -79284
19778 -67378 75338 -25819 -234891 105384 387667 -134138 -211569 134714 205078 -355991
19767 -562379 -95155 -134115 -420707 -223668 -105872 15613 -216891 185594 -299743 -183378
19757 -183378 18668 133278 -63588 19648 -11537 -162012 -135574 1140 -232391 321616 -34217
19745 50078 -216802 -102004 307232 -19026 -163510 187539 -286517 -16804 35621 -145834
19734 -44500 244673 173347 -35284 56882 -59489 -117536 -52239 84297 -203773 -48222 65745
19722 164668 80210 -182990 -117864 136043 19077 -172094 -313482 -65889 11407 -18135 80043
19710 -151269 -70628 -57646 140364 -23411 17284 -7712 140163 -72753 -235483 270192 -68565
19698 675 271840 -78524 -100584 -26508 -157217 -83608 -105473 138712 -131781 -124399 74648
19686 -141237 -97850 131097 156928 -126282 -279253 4381 152749 209909 -264099 181344
19675 -190881 -283773 -280907 -217498 117063 -102777 67642 -154584 74977 -122145 -234844 -76005
19663 -186849 145434 146483 -237784 -211586 -289037 63711 -4243 10678 7403 -61624 -69446 -49875
19651 -49875 137485 144074 -361806 147205 -293548 -60839 -228454 304262 -208721 -9110 -45979
19640 -45979 -346142 -58153 223655 240301 -298798 128053 -254979 -450347 -68799 -303022
19630 -303022 -440070 -112299 -154273 -190278 -64725 220 -132449 -257220 -109242 -18228 -314893
19619 -314893 116506 -214438 120949 -153609 132396 118783 41921 -229263 -263177 -297724
19609 -297724 -111795 -211145 -7390 -21254 212511 -102594 -189796 -206082 204313 232318 -24580
19597 30504 249426 -197026 -414403 -314674 -351448 59116 145884 206352 86939 -207969 -38412
19585 -56035 -282737 -74028 -135953 -186105 -36321 -199264 70537 244124 65096 -21825 -120138
19574 -120138 176523 -164443 120241 -231731 71513 149417 -58923 -51639 -228246 10364 -255280
19562 42108 -112858 -4558 -62482 98640 65170 161327 37168 -47547 238945 240203 -80477 -471791
19550 -471791 -81234 185938 203577 59336 233293 15651 -150676 -70990 -194080 -115553 -73538
19539 -73538 181976 -510725 -55563 -155059 -195483 -349293 -53024 -290670 6810 -60854 73659
19527 -203156 202180 -99844 26565 225278 -103673 -102175 63931 58045 97526 -232083 -204780
19516 -204780 131701 -170533 -97550 -157507 -310381 -87735 -119716 -159699 -167633 -119972 -281204
19505 -281204 -191969 -312582 -123749 -25216 -195758 14324 -33535 -207167 -87977 -377816
19495 -377816 -74841 -109272 -73731 -20552 -158941 -254572 -251869 -119950 -148046 159661 56366
19483 5965 24736 -33865 -291730 75246 224139 218133 16224 173925 -45093 -48330 -248831
19472 -248831 -197785 -171462 -301688 -158181 -137630 193990 -12085 140115 243236 -296556
19461 -83504 -94860 211253 -76233 -16783 69155 -91195 39637 -333491 -212345 82471 182390
19450 182390 103362 -61818 -40899 129170 45837 172804 -157698 -96756 -27119 -122567 46462
19438 -67575 69376 -181631 -188781 173815 -105179 217376 -333422 112774 120250 155978 -13716
19426 -163303 -87254 -127224 138151 -257943 -125054 -38337 -150975 -279550 -73325 -39670
19416 -39670 -287416 -53770 -2207 108029 11310 -285114 -89924 -151712 38808 -303986 -54254
19404 -342796 137344 -63586 -64557 100929 2505 24092 -274410 -309906 58179 -104041 -109679
19393 -109679 -192440 56598 -57734 -120324 -229916 -19376 -65657 -14002 101783 -283116 102604
19381 145817 -163583 -3099 229161 -107178 -12584 -25756 -105531 23411 -19057 146880 147585
19370 147585 -37978 93008 289248 40048 -116974 -301385 -130146 8864 -108558 -278094
19360 -278094 -256676 -247478 25783 52710 -27493 68582 -85178 -27441 -46543 96358 -150983
19348 -151346 -100491 291791 -55821 -222849 -41857 -159867 -251030 29556 -31684 40256 105349
19337 105349 -148033 48456 -28294 -157064 120605 220112 -48370 -180192 259579 -272622
19326 -198538 30491 -163642 213242 -131703 51885 -163479 -116522 20135 -122415 128583
19315 -197649 -233850 -217176 136813 -106509 231629 -266575 240372 -86114 -282863 -145068
19305 -145068 -96145 -98770 74436 153558 -267402 -100481 -50346 59030 163912 -44393 -217204
19294 -217204 89321 30880 -80983 296452 -111947 117257 -199564 134115 190237 289511
19284 289511 -162708 67099 128116 22040 -84654 -279647 -61859 91768 -122926 -193169 4978
19272 -202706 -166868 95818 10488 -107649 154420 336990 -66363 -81823 94414 81182 153564
19261 153564 -56785 -170180 129491 274315 -236179 94393 -55429 263918 -5403 -64019 19373
19249 -285837 -16613 -257581 1264 -64899 108550 -15103 -165457 -217709 42536 228088 146352
19238 146352 -179184 -40267 184910 -76385 -252595 188075 161135 -346930 -98411 24705
19227 20697 -389134 73420 -177640 165246 -105137 -468465 -68713 231002 -134753 -97298
19217 -97298 -271418 2763 17334 -107783 -88672 -344322 50591 237458 90815 -205276 -137553
19206 -137553 24549 -69073 -170662 146848 153743 -174945 14163 67249 42599 57972 12468
19194 -23219 92427 -120394 -184242 -71377 303711 -165524 223963 -114346 -77170 -74723 102270
19182 -424004 -30250 233565 -125572 -209980 331315 -467581 -119898 4611 85301 -26438 274505
19170 268730 -101170 1917 -219159 52156 61244 141435 183264 -235623 -75243 -203038 53322
19158 -174224 -18810 -199090 77202 85394 -19045 195956 -101154 -151639 -37851 -21663 -426748
19147 -426748 86428 63062 220404 -201910 80567 154219 -149422 73990 -306035 -309066 205036
19135 -388870 42595 -61725 43978 -302411 -21699 -113025 -176957 38554 217041 -195866 -72301
19123 -276609 -311932 -60109 -93556 -54372 -79463 -301612 -281363 -101399 151367 -112423 -83614
19112 -83614 27334 -30397 -168442 67389 -134534 -198067 130727 -78293 58675 -391705 108765
19100 181915 90397 -49829 60564 489229 -114086 174719 -480702 107590 -108567 -30764
19089 -142227 -17916 -15879 -52521 -8549 -172662 106153 1265 -173957 -112809 -387219 -7289
19077 -201149 -165179 126309 -385514 -226784 -23662 28815 -67600 84587 -4528 -11939 -287150
19066 -287150 169127 -206690 -132814 88609 -342468 305648 -243478 -171415 -35875 -438947
19056 -438947 -93777 266191 -129563 42805 208418 -156369 -49942 91932 -172662 35065
19045 -366136 -60298 32958 -11609 208820 226036 124831 -120662 136803 242157 -27998
19034 -161072 -185716 -219450 -76954 -95005 -31532 -163712 -273592 436695 -15366 -156838 -536002
19023 -536002 -263801 -24511 22038 -89004 40601 274310 304401 5836 143903 175886 113448
19012 113448 84181 -58094 262486 87563 81361 -35693 68051 -126968 292229 -410480 -61192
19000 42673 19211 -253811 -259778 257796 165540 -18074 111122 157259 389265 -43237 -360932
18989 -360932 -18948 126829 -133300 37032 -184438 25905 -315852 -21334 43292 80598 355614
18978 355614 -16608 -68161 -102275 -135206 -28147 199815 -24345 125293 183704 -45410 -58138
18967 -58138 30454 -310218 -151744 -275717 4659 -59377 167218 -31334 259113 -232669 -105886
18955 -77168 -106196 -60968 -26810 -121544 -67496 -36888 -215448 -26040 -56173 -142521 430681
18943 -135528 -161495 -165053 -157003 60414 -53510 734 51535 -144185 -95250 -79880 -65610 -148509
18931 -148509 -201896 111640 -4103 17130 -464351 -214668 -66042 159204 8598 -47873 -104868
18920 -104868 113849 52927 50996 -270947 -41884 141517 -57480 98786 -110138 -124880 -330799
18909 -330799 -13314 38341 24631 -60092 -19910 -150438 269361 63389 22269 22004 77255
18898 77255 13605 110896 223763 58828 131012 40059 -177585 26248 259171 -19201 74771
18886 55117 99907 125430 -31931 176707 207435 167331 -143515 -141319 -115222 104616 -35399
18874 -303369 73932 143067 -124360 -249136 -360472 11320 161803 57530 133594 14023 -71421
18862 -68214 -269794 266972 -74502 -267860 -27628 171449 -9999 393255 -15817 300192 -303307
18850 228118 -182789 -80525 -24156 33470 43008 114456 195276 -231321 -33166 259793 -80606
18838 -25392 47139 3211 -31903 234231 141440 124116 -123017 -209820 -272199 -124783 -80179
18827 -80179 -225577 -32302 219620 151663 11404 182892 -334757 -336831 -293329 234669 -379118
18815 300398 -166764 308243 -287227 -73631 -14330 405931 76119 -294056 89058 59557
18805 59557 -141974 95382 124760 18142 -52369 2153 -14148 378001 221746 41101 -61492
18793 -155777 -117598 -423359 -17270 49008 64137 -8989 -133685 -115687 124915 -106627 132638
18781 -339803 98445 -67151 -31164 -146122 62213 -77675 -59551 -118043 32018 299794 33718
18769 -231519 -18814 -33689 -287457 309386 138291 88363 -86191 138384 6263 -263349 -35776
18757 -65240 -222627 -237584 -33173 287022 -2659 -193916 -574 -146179 137357 -55060 -199387
18746 -199387 -87319 149519 -104805 -181584 -243048 153508 -55244 -97943 314010 296911 79967
18734 -242779 -10709 19980 -33159 -147255 10829 -289223 -115851 -24274 -236116 25954 -31972
18722 -93097 -81429 -122402 90619 221549 227633 31008 157402 -176874 -106342 -150429 -130032
18711 -130032 -17427 -61324 -121757 96644 -171530 -70488 -290726 252554 -7055 67092 -342749
18699 -228544 230728 91457 -121783 -158982 -332326 -14338 -125906 -158384 46270 -307907
18688 -114325 -315276 133060 63717 -400083 -114186 -64534 92734 123435 -543834 -304452
18678 -304452 -192857 -202131 -5194 -175627 -178384 -40595 118171 88625 123977 46775 -9724 -145492
18666 -145492 -49496 -21913 -204241 -184646 -168188 -320639 -206664 231937 54400 161734
18656 161734 -411746 -135425 -142110 -115269 -187132 -185484 -159302 164807 -165349 35069 -259101
18644 39906 -102938 -305189 60636 -146758 60712 29260 -113139 -156994 134490 156590 88280
18633 88280 -13873 -274440 -137646 88734 -134745 -86116 20443 -48447 65294 -64768 54789
18621 186622 134046 69153 131824 -98876 272889 -439350 126438 81884 -85239 229496 -96766
18609 -126751 54013 -240966 283169 39873 -179198 -105843 64566 -2664 -116890 197839 50891
18597 -107878 -201548 203114 198816 42572 126148 177850 -301463 184540 325310 -119818 -122875
18586 -122875 -98488 248440 -377752 -269132 -136101 -181711 98893 -59502 -68171 -172506 -54346
18574 110201 227729 -271049 -183353 -149767 -184204 12813 -30443 -132553 -28892 -220417 -232948
18563 -232948 -449877 137610 281254 -176622 9410 251479 46883 -102154 71062 -48901
18552 139628 -163366 120526 30236 -291171 232665 -43780 -73758 -137706 174174 -3794 -263144
18541 -263144 -154521 -122440 17257 119568 -87726 -208949 115932 84075 193263 -258365
18530 -117737 -262600 -71318 -114551 286058 61458 188890 96435 -395919 115889 -99139
18519 41805 -43134 -112879 61189 -31871 190351 -175652 235509 -199894 -285478 -156244 -3676
18507 -206478 331409 -140963 -249665 34448 -64745 -163313 -117849 -130453 -148954 45897 -73118
18495 130319 -166065 373916 -87209 -329217 -181068 -34562 45454 -92177 -106812 71010 -92793
18483 -430077 251845 -65568 -125230 160724 -64399 -438172 -122440 -162714 36069 50225 -16578
18471 158308 -181917 65361 -136769 191219 31352 -177048 -130742 56520 82621 107577 -65907
18459 -293175 149362 -257384 49296 -135512 -59918 -77532 -135907 -213495 -165833 -41294 43003
18447 11668 282796 -119766 6411 -221332 89025 71036 -131138 -182674 12300 103907 -326109
18435 -22031 11381 -134731 -208545 -268582 107481 -42882 184157 98861 -308771 5816 -80604
18423 -74128 -247942 -1548 68298 -59619 1305 -168959 250897 26183 -218960 244739 402208
18412 402208 76896 -78653 76468 -40353 -248754 -96460 -194517 -38401 -171613 82589 -61208
18400 -318648 280096 -148795 -86751 38361 268419 154832 75944 243103 -63910 -81467
18390 -81467 56312 268076 87614 -32513 -202846 47804 -217142 -345472 -202829 -99212 -103149
18379 -103149 90983 -40091 -130434 224455 53124 -187344 -21983 -95506 31912 119139 197051
18368 197051 -347161 58456 133514 17051 -267445 353613 -80164 -251442 -30164 21287 -129048
18356 162152 186250 113779 -20132 -176527 -291997 -88916 -64481 -124655 268350 62683 348572
18345 348572 -10647 86727 155804 -172512 55941 -84072 -48455 39190 -176059 43498 291399
18334 291399 -17257 101945 -8930 165587 201793 207441 100532 -158573 88795 69859 69233
18323 69233 -444915 4098 -121784 151818 -125880 19612 -229236 57377 107200 -11469 25611
18311 113178 -37497 54920 -164995 -229626 -56914 -55171 -111378 -68127 -33822 -86028 223375
18299 -313906 -115153 -1252 1938 -142666 353814 91010 -124347 156365 -117038 138771
18288 -1869 -326151 -469146 280869 101245 14437 11567 -236128 -31696 38762 -64304 -425193
18277 -425193 -202940 -80770 -202390 -135485 -56278 196194 141883 333319 -187740 240804
18266 238618 204358 -55824 -142896 -131214 93549 1129 -175050 -65319 26938 147146 -359397
18254 137037 -12092 -10025 -296777 49769 -54774 201679 -57281 5572 2909 -106550 -180000
18243 -180000 -32953 -75460 78716 -315846 -325575 -177993 -430399 -172548 65734 28405 -244767
18231 91322 110254 -83700 -288970 -147158 310111 -151601 86171 139560 -503509 69539 269884
18220 269884 -210616 -246300 91926 -80530 199687 -44168 5950 62493 -30042 -5505 497419
18208 -6501 108068 -50493 -79593 9500 28903 -33811 -182363 -131974 108821 21920 -178994
18196 136934 -342064 -139426 7015 -321184 30223 -56793 -62432 259109 228562 -16388 80481
18184 110352 -131972 24412 151448 252806 -113051 -254871 143736 17511 -177248 -297005
18174 -297005 -180876 -120960 -373803 71650 273246 -269760 -143588 -314175 78436 -226614
18163 -231507 -24332 12454 33388 -109596 31744 3912 203829 301660 -204306 111679 -16439
18151 -67662 27113 -223389 6878 69136 -946 -73181 -62079 164598 51440 148011 181374 187572
18139 187572 -170498 208269 -52938 -183771 21277 196763 -163972 171246 -45858 462309
18128 66471 -14692 320097 -204478 69329 -240771 172462 -166294 -36534 -279921 37967
18117 -75812 -65936 -361682 -340749 -53518 -51975 89966 152406 308726 106436 10030 -78305
18105 -428250 -65104 98109 257916 -62542 129677 167107 187402 -163933 -30478 143626 -6309
18093 -225825 -13350 256037 -424353 186992 -77078 -106337 -177081 571062 -78392 15966 4991
18081 -61874 295895 31647 -340903 124370 142099 -160296 -181031 56962 13526 28610 -57863
18069 315827 104820 -170525 -30350 -319672 -174595 -313290 11782 -90264 -35094 -230000
18059 -230000 -269811 62826 30842 9844 -68136 -39795 135362 124559 -42904 -17748 -228188
18048 -228188 -46683 201038 242489 221690 19046 237921 -38136 -38623 91081 59833 -223690
18036 -33157 -315128 -149819 149882 -83983 -60227 -122081 -163405 -57033 -134669 185894 -49519
18024 58471 -291242 -94842 -183208 -47271 222660 -178021 -3702 -100408 337259 -173710 -126914
18013 -126914 59325 21420 -44202 -112988 207139 17101 46910 92332 136750 190542 86973
18001 117476 -384567 -10340 -138630 -167025 -13113 -44869 -276994 42917 63909 232881 13854
17989 -83292 -198878 -118689 -119677 4032 89706 164393 230814 180527 338265 257039 -34582 -176013
17977 -176013 277608 97297 -254980 2624 148002 24418 -114306 -186894 -9683 45744 95343
17966 95343 -240586 5621 -140166 106190 75108 19135 105725 146518 -110270 92887 -238621
17954 -72753 -177096 -150815 -138662 -154645 108722 -172276 -227144 29363 117814 -170638 -197800
17943 -197800 176405 -140532 -170115 365001 -155436 266498 39648 -333347 -58099 -127840
17933 -127840 9856 194143 -33610 -99928 -169658 222210 -63558 14884 113750 -59274 123763
17921 321052 40640 -4801 202912 -226879 -153628 -71077 182289 136598 29347 25494 -50084
17909 -280025 127449 2987 -73206 227434 -31768 -19263 351136 196706 -254306 -141575
17899 -141575 3195 -434290 -409428 105212 -124562 212297 31397 225381 90079 -163024
17888 -98084 -117975 -204681 -34206 -90933 -49471 15917 -75123 -156394 447314 -122887 -70633
17877 -70633 232307 55813 -140680 130441 -46980 35976 176708 -29256 10142 -162123 -41476
17865 190225 -284574 -161127 24642 -148086 -110923 24391 -52384 -45702 -65782 -17855 389057
17853 249063 66967 168814 27903 44437 -239326 -266452 -191485 -84726 44694 -114832 -281363
17842 -281363 197389 -168659 -56581 -33934 131997 -421694 309763 -25882 1825 -237517
17831 41401 88260 64250 197248 -347120 18915 -106892 -85645 93392 -142266 -74229 94226
17819 102236 20181 71798 -92101 215903 194270 192539 -177585 129736 177843 126276 140586
17808 140586 90170 -74250 67555 67541 -20919 141635 -185397 -98927 5246 -188527 -119261 77476
17795 -156264 16003 194715 -443375 83838 -99026 -162498 97946 237510 250078 -82415 -249860
17784 -249860 -84390 330544 412842 81326 81140 84182 -118789 123673 -137484 46626 -76445
17772 40555 329136 -369152 77536 -642 -9286 -96486 -151272 183446 163152 -2067 -282618 186800
17759 152427 131853 -206899 212324 -92363 -133717 -38149 -37422 132792 -88005 -196309 157636
17747 206915 -153703 -278093 71498 64503 7271 -440273 -133972 105473 -199491 -43326 204615
17735 -204202 -367019 123099 -48199 131832 -66722 106987 -6261 133314 -73897 45325 97142
17724 97142 14361 -84346 -120536 -175751 218347 -256450 50235 -30746 48570 -38024 96666
17712 -184187 -313612 -38576 -138048 -84516 70644 -202180 448862 -187063 -102574 -16350 167936
17700 -178627 134913 74062 90194 -306223 142398 -4350 156624 -116685 265099 -240610
17689 54046 -251509 178579 29463 22407 109663 -62699 155328 -234786 78382 -43289 124400
17677 18340 140904 24607 31701 381534 123869 298006 -143859 59343 91248 11311 71399
17666 71399 -56197 413505 -185955 208715 12238 -141839 7170 259412 -18224 11431 113746
17655 113746 378156 -50100 -85603 244595 67554 50648 -201389 180486 48120 2701 -48959
17643 176995 89511 189572 -194203 -149082 129450 283953 111371 98105 -131137 29444
17632 325276 315279 -49615 225012 84528 -8215 78624 97408 -105496 -197904 -101282 155766
17620 135947 -132358 -378938 345947 -7261 304519 38414 -129298 173829 181109 384923
17610 384923 21676 -52454 -199493 -356338 -51813 -86750 67343 48129 24792 -250594 30440
17598 -999 -182228 69634 71153 -57971 82260 22095 -284579 279448 2850 -148767 57691 94038
17586 94038 236965 183485 -62183 115829 -255945 -82012 67387 226579 393096 17801 13836
17575 13836 178262 137462 252360 284781 263045 144629 134099 -61858 -24598 123522 55235
17563 152275 307513 115505 -165278 -10769 286567 -649 99743 280689 286152 -345547 -203293
17552 -203293 245619 82953 88536 -135100 -160735 192296 -131094 186235 58410 127211 389780
17541 389780 107391 -104856 -6622 267031 74004 23492 -181323 -66159 33675 -41886 29951
17529 166738 242038 205926 223385 304986 92352 -105558 37010 265394 -29460 285114 74011
17517 157103 226776 -166077 25970 50387 22336 123466 -67250 238039 65255 270941 253048
17506 253048 -374843 70771 -78574 264724 276842 -120512 446685 185981 -323588 -109571
17495 121955 -73818 47020 -93319 96740 -142392 192322 240261 -159045 -33503 49026 210482
17484 210482 288533 -13239 287987 -45035 3524 9984 258658 334639 197172 -119383 110692
17472 29768 31462 57834 -120954 331018 35454 7922 341973 154618 401018 55231 322185
17461 322185 79032 179285 339170 469458 -16235 302360 168265 28976 341452 298561
17451 298561 161335 34524 241627 80761 -60391 270793 -75797 459442 147431 312677
17441 312677 351399 21866 357025 367233 202266 47948 221900 586857 196949 576223
17431 576223 -16957 254802 177968 159457 -213265 169809 287827 255146 -114463 -19822
17420 441552 133583 126392 263897 154526 189698 169299 305459 -146218 -24302 220878
17409 378762 89932 71730 159969 286301 205312 256373 393178 400995 382891 303650 76277
17397 402483 60481 487115 136795 327488 99432 310775 41038 250148 123968 45545
17386 -53701 -144089 178842 154821 138834 384970 289636 -62631 60246 130540 109576 -197826
17374 -272170 32716 285293 357611 -1693 208372 368780 72512 605230 208318 -166897
17363 281248 172958 254131 -140996 147190 -113634 31521 174345 143292 352891 -32500
17352 116369 347027 114218 393600 -119960 -219410 331151 260944 -106341 210324 112304
17342 112304 114139 -2849 466037 170900 -29949 322943 429838 283133 5976 68730 67734
17331 67734 -93356 5180 169657 -9977 -44160 329901 -9609 146557 250795 -1633 -118590
17320 -118590 111098 379262 114666 247591 14438 -14449 237103 360987 201640 137482
17310 137482 116763 47488 95947 177861 143289 157310 29057 348838 48262 104537 90745
17299 90745 157220 40860 209638 157381 225395 17133 -187942 202282 503469 152104 248927
17288 248927 115225 629769 299396 38571 -76171 185400 36302 143098 415451 -23096
17277 256437 406795 180426 9874 282198 -40357 514964 141609 273162 153587 455605
17267 455605 29289 -125013 382433 101834 263523 239154 56691 -248254 19764 87445
17257 87445 342622 480150 382428 193756 248124 -84132 -66628 107069 185442 -208319 91131
17245 -239742 518740 303226 130975 32997 332176 211970 320019 434353 -123695 296896
17234 -236432 68609 -128781 25242 213537 374942 238856 -125416 359236 155499 503797
17224 503797 9813 -24045 6602 170489 440480 315087 149253 8302 223306 65334 23228
17212 439203 391573 143875 269070 388333 263802 128261 -60840 96474 401241 423161
17202 423161 358205 374339 78823 413985 464561 10459 101886 499352 472673 193031 220689
17191 220689 341505 -6280 340366 131801 364071 -9240 285049 362 444140 55194 415467
17180 415467 236062 171195 223145 183166 69302 306296 228873 92477 417194 -117703 320451
17168 440239 631106 482513 383466 239975 182961 297383 180101 239982 -104636 458326
17157 113333 346539 303579 220415 150142 231555 182438 379055 397049 339079 442690 110643
17145 117087 367040 480267 255193 663883 324893 306617 94109 285648 331145 333158
17135 333158 126316 595114 560153 179526 281414 316155 235730 377564 279671 402417
17125 402417 262383 421049 241794 218230 237947 331350 296161 362274 290826 -1256 499187
17113 452411 419924 446486 373725 377087 164465 343043 365299 310157 212636 405410 308422
17102 308422 186192 553554 278317 69571 406997 101354 422885 638998 313466 446787
17092 446787 589929 307841 340465 135082 779132 584472 562116 243078 405773 237631
17082 237631 45247 512501 383785 232616 2662 420369 569685 168461 389046 288994
17072 288994 425237 447305 360484 483802 422147 180652 227976 315293 212289 473344
17062 473344 456572 439375 211299 492861 297312 430608 770276 439469 744989 302865
17051 758616 353741 547943 263235 480352 379120 193018 416353 422062 463476 567640
17041 567640 437030 534259 388998 236775 709694 645887 701011 635870 599231 608758 199165
17029 509993 489079 498472 372707 396985 392407 269494 585871 625239 567802 311348 604558
17018 604558 502066 592570 734255 509709 677842 761078 395647 388178 325412 570164
17008 570164 500727 658408 190803 504624 851832 830479 442144 326626 494830 975480
16998 975480 412145 531846 954433 711197 802660 627927 629018 827908 732874 799129
16988 799129 1044269 747473 656633 880561 698129 785814 849127 1051159 395625 892412
16978 892412 419015 850297 796062 820508 628868 800915 539273 595866 823261 454094
16968 454094 920937 1094078 989720 939883 1216191 896847 1109741 1116961 927529 899629
16958 899629 789939 888655 1237806 662952 897111 758116 728067 1039172 1068625 846569
16948 846569 877866 818307 1124400 851358 1220628 822328 1334720 1054108 766038 853468
16938 853468 874560 1039665 828570 1057497 1200512 1118481 1147541 1038497 1130172 1258553
16928 1258553 1310968 1143985 973435 1457077 666199 1112632 1367614 1105511 1615009 1186788
16918 1186788 1248572 1112896 1424053 1093734 1258481 1598831 1281171 1213423 1192801 1524072
16908 1524072 1634014 1290144 1124708 1271030 1640389 1449185 1445286 1527973 1287855 1444664
16898 1444664 1636664 1623133 1682768 1721943 1609958 1394390 1658861 1709305 1249889 1766107
16888 1766107 1701138 1250893 1925000 1584175 1840434 1963008 1875636 2036590 1372423 1837886
16878 1837886 1911296 1689650 1732153 1546679 2050711 1713923 1880239 1906256 1825770 2251932
16868 2251932 1805571 1972825 2083528 2160164 2022221 1898863 2356804 2342146 2223151 2303985
16858 2303985 2196389 2281778 2129260 2639579 2651517 3138600 2997565 2459748 2548347 2875437
16848 2875437 2607209 2697560 2842899 2738138 2704060 2881212 2928958 2808799 3143051 3107496
16838 3107496 3297616 3372237 3085731 3702108 3514992 3366395 3361305 3436196 3489472 3564948
16828 3564948 3466480 3865203 3935722 3890850 3599587 3941008 4107754 4509284 4345344 4180578
16818 4180578 4375168 4529916 4373079 4371821 4805055 4790197 5173443 4790756 5250010 5342065
16808 5342065 5129934 5039074 5227004 5326686 5779773 5467489 5876693 6236281 6184548 6361915
16798 6361915 6326845 6609459 6531852 6736036 7050028 7216875 7220094 7786492 7242646 7657263
16788 7657263 8055359 8261829 8292846 8500949 8745381 8967850 9237937 9332148 9611318 9738277
16778 9738277 10264561 10670991 10966744 11188924 11339837 11526957 11874847 12301979 12654073
16769 12654073 13167925 13481065 13826141 14656167 14663007 15788982 15739421 16191238 16788122 17378321
16759 17378321 18010254 18700650 19504922 20150767 20688418 21388022 22320944 23338278 24133503
16750 24133503 24989194 25994522 26896027 28233456 29060782 30408053 31935669 33326709
16742 33326709 34883660 36308649 38143518 39788905 41864518 43899863 46393553 48126484
16734 48126484 50818832 53526595 56614304 59545965 62725272 66383446 70168640 73963083
16726 73963083 78549199 82895635 88088921 93476233 99218149 105023973 111582626 117762784
16718 117762784 125109099 132004000 139820839 147097690 154898557 162354944 170314750 177384168
16710 177384168 183930244 190474973 195751208 199862558 203432405 205519890 206740698 206156794
16702 206156794 204299717 201263078 197258620 191814540 185843616 179126935 172320928 164345995
16694 164345995 156937195 149278481 141233820 134028325 126541395 119735391 112787338 106136851
16686 106136851 100266165 94421665 88757576 83991908 78575307 74405811 69985533 66292564
16678 66292564 62600367 58890386 56114360 52933923 49707028 47594495 44886926 42988629
16670 42988629 40729747 38688589 36649630 35184467 33568819 31879002 30574415 29164931
16662 29164931 28071635 26535936 25878764 24659277 23504278 22876354 21601742 20722215
16654 20722215 20222654 19496232 19100979 17999617 17509162 17314658 16162351 15763928 15298042
16645 15298042 14861970 14296075 13791749 13207150 12979095 12418296 12330862 11902116 11268647
16636 11268647 11242675 10838529 10691581 10071828 10112531 9593396 9735527 9074908 9163630 8668302
16626 8668302 8526722 8209241 8143959 7872264 7683022 7426654 7568685 6959369 7123126 6557687
16616 6557687 6833116 6364254 6424468 6295175 6255999 5642845 5877332 5526737 5454848 5715245
16606 5715245 5501716 5380630 5340379 4933347 5105791 4839095 4515083 4733872 4723239 4000524
16596 4000524 4084332 3895980 4255516 4050193 3985327 3754325 3571785 3532029 3816746 3764151
16586 3764151 3540335 3439391 3666875 3400982 3338514 3416928 3508736 3079941 3344438 3165496
16576 3165496 2906459 3047324 2953766 2909223 2797800 2671489 2721365 2488855 2580543 2469545
16566 2469545 2589309 2678563 2282695 2472332 2135757 2401248 2249150 2161484 2610980 2214979
16556 2214979 2053513 1963404 1981699 1992296 1805368 2083502 1592317 2102451 2028140 1905004
16546 1905004 1853752 1840533 1699570 2175110 1654446 1976806 1689770 1457864 1744087 1444765
16536 1444765 1612121 1583326 1598998 1536979 1441175 1596457 1413200 1345685 1331948 1292379 1467481
16525 1467481 1589277 1327066 1440067 1362158 1404831 1038142 1267645 1512089 1500804 1450445
16515 1450445 1491134 1303017 1262369 1062708 1081149 1187788 1227319 1126174 1066448 1317275
16505 1317275 1049605 1438990 1305459 1009888 1471378 876220 1174190 944607 894453 1153028
16495 1153028 819141 1349882 1210833 667603 570862 926475 1537781 841999 934307 894578
16485 894578 655448 1055281 1016915 878389 943929 731734 935149 844802 834821 847737 1017512
16474 1017512 643622 933248 709223 667486 774696 706610 812392 653307 627484 873456
16464 873456 720281 1155846 1048627 599787 851426 841721 644231 520267 356419 965106
16454 965106 487392 609372 516348 605242 802528 565311 468327 483609 762232 824446
16444 824446 785235 922619 533135 647254 575869 417506 599299 470991 246551 440113
16434 440113 684980 651956 553239 326901 380408 596859 566385 499791 480147 354462 509695
16423 509695 853462 607445 369772 496728 213861 468468 444963 664527 551831 632228
16413 632228 177435 544130 212116 481091 388238 423734 268781 483502 459416 852261
16403 852261 495227 422036 452346 378277 535042 594312 103792 176328 348273 292552 376079
16392 376079 360959 180035 198064 225146 498671 124195 423362 70163 685349 380201
16382 380201 289297 524382 509771 324873 596627 429794 322699 104354 309003 259680
16372 259680 402397 484718 411987 73918 355249 73658 369693 -13780 308919 274608 386186
16361 386186 305836 502604 210512 341847 279016 374056 241659 500866 295751 432603
16351 432603 10423 346259 362064 415075 87461 292946 164129 -40216 469639 299798
16341 299798 277554 340282 387681 384726 618372 339786 164362 60458 392420 218739 208582
16330 208582 485598 391171 309964 90564 236680 47588 345110 309299 156033 84879 403851
16319 403851 183808 499515 -48822 314835 76077 183550 253603 289597 543283 289681
16309 289681 353619 409137 -70037 305619 251183 57364 221801 232236 11574 254261 301908
16298 301908 -122938 169529 57672 92858 138724 554276 288497 315229 116843 217915
16288 217915 127288 227178 246313 116752 78088 -57910 31115 112302 124802 -183144 210461
16276 54567 140222 316413 -6261 216718 427615 249742 117648 1119 14498 162239 -30595
16264 182752 165016 88604 129040 -226098 217270 453966 -287138 251215 74504 -237347
16253 287172 278774 144304 247912 174074 260859 20651 281609 315649 166116 488859 -153712
16241 470896 6700 300390 175901 437471 177094 -164115 680558 35895 49990 -30223
16230 46721 319331 -122651 237311 44733 288065 131954 -30037 92538 317341 308079 172530
16219 172530 332718 30254 38281 366683 272193 -133407 93593 7850 112456 148262 352157
16208 352157 553392 266525 182271 -29965 -8499 115346 96926 161911 180499 -102857 250418
16196 296693 -16215 -32807 -195083 -235779 63305 11077 113255 -320126 228073 58655 -30715
16184 155315 -51805 -50384 -222253 29524 64197 65722 303994 63642 -252292 -436074 42214
16172 320419 111527 86136 -112394 -123123 62366 199671 107659 122817 -98858 -174498 50081
16160 -124238 -159919 110678 -44173 7953 180311 6283 -184809 41774 47372 3683 56324 -216738
16147 -158871 89249 -93435 -109163 146660 -1625 -124994 179759 137349 314924 138440 159455
16136 159455 591911 219052 -25998 153707 243862 -19856 -4049 -65641 -346032 -37056 66143
16124 69842 378298 17669 130296 196030 125432 -318396 350672 -27202 -164362 -131923 -26597
16112 103715 -114664 413832 31808 67731 -23971 27923 265511 33601 -82179 -10719 -100240
16101 -100240 -18270 -12619 -137162 176718 220459 119553 53542 138232 150257 408609 196173
16089 -76735 -60941 -30644 -88225 182357 -190824 -27417 -71190 -176364 117005 97090 129893
16078 129893 22700 65000 247844 3661 175727 -75666 -65827 -88819 190502 -25052 101039
16066 249261 103943 -117536 23925 -228176 -95504 85847 -43473 50070 223820 142883 132662
16055 132662 223492 -29230 -241534 -18481 -83846 -309366 93241 -117932 -197831 -75612 296917
16043 61516 -49850 -380780 85665 -167913 -250476 -51950 -31561 -136080 134000 103312 44991
16031 -293468 -455925 -98600 -137665 112435 -328519 -225905 47650 50035 -296113 -311308 226972
16019 -36103 -265073 207961 20924 195915 231848 -258664 59739 -263618 116778 151232
16009 151232 -108077 3978 -46690 -91747 157200 139564 101122 -79087 170984 143685 111004
15998 111004 68201 -72354 41440 172939 98209 -121716 -96687 -31252 -34460 27059 -209178
15986 42708 39822 -27328 -40286 28970 3801 -66384 -272739 193283 -85279 -371500 -223277
15975 -223277 156060 39157 76864 -315867 -43140 10662 141739 206524 -281124 116869
15964 34166 -92308 -39398 244163 265216 -103422 92360 -137292 -48055 -170121 98283 171596
15953 171596 42536 -122761 -57294 98924 179586 -188260 186353 -145168 -134738 -215958 -89719
15941 86191 21923 -201266 73233 164999 -214834 -77297 23476 -106701 130973 1150 82631
15930 82631 69840 151708 36784 246908 -248904 187322 189299 161682 -129626 -260777 -198277
15919 -198277 -79035 127182 -219057 -103294 76859 145786 -86674 -216582 -1965 96351 -115102
15907 -36191 136171 -130005 137226 -133049 -67226 49783 -152374 -275829 -81867 -31059
15896 -139863 -159999 132520 100344 -71911 -340766 -96953 -263985 -238117 143753 -276468
15885 -185059 -210727 27262 192678 85781 -156085 302996 53946 -197497 -239414 192901
15874 159635 23924 -305549 85188 12343 45284 109595 7177 -125080 42362 -71278 -27274
15862 279243 -317426 171483 -167719 72500 -44748 -198951 -114301 -330937 -116671 114725
15851 200362 -332587 -27584 253331 17971 -192961 -41539 -161059 -252167 -219878 73154 26197
15839 109355 -122797 23645 300226 -16902 -405687 -236827 -299592 -78517 -280452 -47237
15828 -184603 -68538 -256250 -271947 -13182 -110603 -446015 15386 99480 -166273 -401090 -94033
15816 31812 340812 72999 -194109 -521192 -142529 -174310 60570 234765 415363 -232509
15805 -318436 -53144 388133 -134431 168541 -345246 143625 -41001 -240348 -91533 172081
15794 28757 -168524 213467 -145226 146751 -175237 397897 17457 53292 -167036 86897
15783 -4766 -38139 -193293 -62436 -125859 -144344 435782 -103370 -259731 37331 -348553 -132225
15771 335860 66180 7492 -204173 -277197 -242689 -215312 13989 42436 200856 -291446 -81576
15759 72630 -79590 110834 92405 171712 79965 -314422 -77493 -69399 161213 60149 143728
15748 143728 -242787 11046 -57529 -19471 189488 -30460 163948 -89953 19492 -138700 -44909
15736 42592 -3120 -154641 -38275 116369 255423 29517 -144649 48173 -67586 92204 -151239
15724 49518 -126357 -62429 -65499 -295113 -226544 -17322 347272 15320 -121454 187174 -11949
15712 -252437 -12549 -107786 -257699 140933 63429 -60803 -47396 -69459 80518 17756 104
15700 204120 32553 -5869 41714 -17450 176760 46892 -272952 9399 -268389 -147168 -111277
15689 -111277 -118925 -161608 26123 -441702 303213 -190151 16261 -33174 -188098 -59396 10072
15677 247890 -196055 -104187 18391 120210 -59433 93581 17613 157286 -133771 102880
15666 -74205 -298005 236985 -240386 -208150 -137619 -351352 414585 -28706 -186276 198120
15655 -32070 -369842 -249268 -136266 -31702 23197 18205 -38601 -96191 62009 -53707 309167
15643 -208645 -128445 -20062 25922 226296 6860 10725 107774 223682 62721 154223 -165921
15631 -229475 -282544 -99723 129112 -231784 141364 -299360 -64417 113364 -7070 18411 226846
15620 226846 -139449 355967 50185 -104029 -195867 116152 -294434 -61168 178310 78040
15609 -95290 186612 -364321 54829 103015 238558 234190 -206005 -10139 -35902 -34198 -177007
15598 -177007 2188 8294 -64345 -312896 30179 128911 -420928 -347611 -19609 -10131 -51069 163771
15585 -96892 -194000 -209529 -114508 27393 219751 -186037 -54812 326861 -197311 131006 -28098
15573 -64184 206683 32920 -84610 101143 245585 14534 -182870 -313276 -187048 11585
15562 -228425 -13776 -129624 -121912 -170832 114517 497290 218712 67810 -383446 -71246 56359
15550 219010 114253 98263 -48107 71329 338162 -25296 -145648 -298670 227806 -46074
15539 229376 29759 -73253 246634 142608 32736 -84924 -329568 -183075 -32597 -48028 111859
15527 -147082 -65820 229602 -86352 -5236 -274302 56806 14366 235404 37050 -93202 78120
15515 50611 331760 -167573 -1426 5776 12160 207594 17706 -265822 159741 -264312 233848
15503 62139 455203 -440270 30623 -105743 36976 -129069 29134 -100667 47001 -46453 372600
15491 -174098 265842 -241970 90531 -32405 -185060 -196107 -236195 165925 313759 -81574
15480 -179243 -291196 233684 -128027 -5603 -144648 48630 118518 -29858 196890 -129641
15469 -26149 67892 -266678 181939 -26333 132077 43915 -190313 143548 -69965 -69682 20382
15457 231533 133659 -105141 -84269 257293 46010 64884 396278 -155383 -202903 335509
15446 -218339 133974 193416 -103567 -130327 -22437 -142601 -231222 -91214 18892 -1915 75291
15434 -48983 -218129 -331095 -10879 -228217 -98020 92998 -4342 -21273 256627 299726 -291758
15422 139945 224524 243085 67927 428 -304074 116380 -170627 -323930 -82163 -12675 -36640
15411 -36640 -36240 26852 -94844 -234309 136949 136124 80368 -330329 248519 -71521 -226749
15400 -226749 34334 -185245 -81033 -164957 98741 150783 85103 -569634 -294957 -94552 22525
15388 -144848 -68194 71921 -25695 204193 119845 119243 -33377 24797 -334271 -443542 -4046
15376 -284941 325965 53614 -125423 302028 104058 200365 87058 -5022 94336 123344 101945
15365 101945 317532 -161475 -103823 -244169 309080 21027 159093 -230861 -415780 -58271
15354 283642 359265 -18314 -51395 -47878 -253551 51228 141067 26178 88772 236286 -184166
15342 229722 -87780 434878 -167487 -144669 -39100 -9174 385590 293695 6700 -70644 214222
15330 225073 13179 -211823 70452 192760 -162424 264108 -42334 82413 -421464 -227908
15320 -227908 103270 85862 99895 3484 381399 -302957 138066 377212 140702 291644
15310 291644 -110077 120062 19999 158381 -448220 -32106 -133709 50406 140751 75664
15300 75664 -47371 -39344 5475 -3467 -329515 241044 97410 269815 -257335 -306775 -310697 -134193
15287 40173 300304 -195187 -240351 377353 98955 -8671 -13421 -209555 -166817 67024 61291
15276 61291 203782 93528 -172701 59241 295205 8849 109175 254253 340899 217094 -160127
15264 89493 90126 374639 148869 101490 -63796 160333 242430 264854 56960 174306 49324
15252 -91305 -59794 235524 143134 35923 38593 314481 181819 -40819 577402 195711 289628
15241 289628 466274 135193 8332 256543 551607 536456 654127 939036 985402 558046
15231 558046 -57193 430620 202129 271123 83654 262584 -5642 -53417 303655 294539 -9894
15219 64369 167477 76253 244824 188122 43589 257283 365831 103824 74356 213373
15209 213373 142901 -300934 137716 374219 -54176 57544 -68346 152042 166251 356465
15199 356465 317890 104273 118682 88357 40744 30404 21303 47431 257032 10523 229897
15188 229897 72892 349515 174759 -11428 191971 158997 145259 51290 102102 9351 222913
15177 222913 467555 -203398 73526 -78611 78679 277547 262974 129610 41861 170874
15167 170874 356789 -26578 181487 -300901 155338 119820 -72604 17158 -70141 34623 168254
15156 168254 94144 -207735 164155 388685 11519 12555 238653 136439 383151 9311 87569
15145 87569 11040 377917 -115224 -100628 145107 -65872 -39460 -164325 149461 -300791
15134 -54092 -176674 -54233 426287 154168 284748 97681 226276 286805 164550 132944
15124 132944 110088 203028 151535 200566 367570 315663 -693 345311 259765 -123392 483987
15112 64736 -87934 169846 416516 262958 184850 1698 78003 62057 271677 455199 -26356
15100 23153 261322 103085 -142785 105102 57882 199959 70016 262178 148514 88211
15090 88211 276930 236385 -211677 387898 291581 211873 -176333 178473 -23530 282967
15079 195705 118767 110263 107034 -110865 -12458 201773 131386 -163637 94961 62828 185894
15068 185894 -153932 152208 174564 -47228 -19165 -53030 181874 -88862 -85543 242349 138640
15057 138640 13620 47276 364852 318463 205067 485897 49201 339853 -170014 306850
15046 -62433 354350 243170 105775 376997 165457 36656 22422 233072 -119928 451162
15035 588210 -40548 159306 399251 231363 319796 209987 -26155 85789 76866 -92363 23372
15023 259415 349681 51084 180776 -179317 23962 136292 -108398 216780 440214 333239
15013 333239 379031 634201 17493 6647 87496 298534 569776 149182 155182 188771 475795
15002 475795 329778 272692 189484 243357 261796 125567 294965 24052 486154 30827 -67005
14990 -17675 46649 381808 439553 502999 106781 604081 24229 319598 256088 171504 314002
14979 314002 202642 191612 392546 133018 193005 59821 247403 168988 225132 130505 8543
14967 273859 121702 406498 50126 330667 482475 330005 429015 260909 319094 169542
14957 169542 291447 459293 41866 189168 -98211 -82880 416719 273566 127606 -22543
14946 357887 409617 351345 53593 80424 442741 -19472 312149 385234 -194475 512946 288854
14935 288854 215796 362591 328602 498830 434386 343083 150119 388723 356378 302289 531468
14924 531468 489863 442887 170023 532369 357275 273739 765048 455607 796141 528719
14914 528719 399809 364257 319593 381391 290519 537108 544062 388725 67233 727321 351949
14902 383018 320617 180602 294056 149579 546742 584894 424508 342937 -108621 590764
14891 209594 367646 360902 267774 101210 418402 236166 365580 437360 664672 541716
14881 541716 533114 369202 340914 241291 490920 289707 752010 246523 450058 449661 518389
14870 518389 87050 35233 613708 379332 570843 244683 267948 867875 405219 307115
14860 307115 575742 642392 623549 630501 662103 331121 509710 308187 492072 493150 477585
14849 477585 332557 387586 247186 492876 197767 208930 447514 360130 734184 372873
14839 372873 258916 346256 437795 509869 345720 346207 473405 360877 662916 472730 545941
14828 545941 925265 650789 270996 435625 684527 526853 655634 592407 228349 318845
14818 318845 703495 904572 336248 474980 546190 664566 459255 610724 509522 583713
14808 583713 570180 257273 563111 256101 382547 393829 278431 580093 541772 531224
14798 531224 706016 612747 193966 397700 793357 397403 527813 534658 618940 658259
14788 658259 561837 822317 713769 718204 691253 473779 388013 591413 521971 615333 610226
14777 610226 442472 554963 469658 751237 619354 754255 731642 786046 308004 690111
14767 690111 745935 728988 527368 765012 804064 660001 755598 489213 810022 684564
14757 684564 478325 739127 730963 841066 743958 490855 728907 832715 767652 879046
14747 879046 749326 570104 751327 1033284 801972 755073 519218 821406 916187 608730
14737 608730 548729 768342 581725 738173 671814 611132 759597 476178 680976 637874
14727 637874 557367 781018 645062 965740 880934 643354 564358 1260803 765888 770892
14717 770892 786421 942234 738004 732936 726591 834901 531508 806099 1008144 676079
14707 676079 982116 1044166 1004661 898460 1102589 1221861 906576 997823 755511 1001981
14697 1001981 899386 948511 914651 1122499 997953 841925 844931 833245 1304125 862210
14687 862210 747369 936695 840117 1094636 783750 647219 1444209 785160 1012223 930945
14677 930945 1055577 1216363 873464 1282123 1182710 1267439 1104795 1106040 626782 1115810
14667 1115810 1061455 1242934 1111496 1266562 930884 1125947 1005663 1272529 1237353 1231165
14657 1231165 1402050 1173516 1004759 1051382 1031276 1244712 1051784 1044149 1388125 1426601
14647 1426601 1490072 1329898 1154031 947215 1318915 1290000 1190793 1248580 1390654 1318540
14637 1318540 1557577 1262707 1165776 1407117 1509058 1177195 1497304 1320246 1445777 1458049
14627 1458049 1369637 1616776 1165454 1256811 1486618 1637784 1747855 1377701 1417476 1414714
14617 1414714 1728795 1661212 2026032 1306538 1365336 1668107 1540774 1507250 1429979 1369016
14607 1369016 1560868 1343286 1551073 1372890 1597731 1534494 1346755 1629443 1403430 1596760
14597 1596760 1582608 1771816 1314183 1679560 1745174 1612918 1738971 1916691 1655333 1934963
14587 1934963 1969059 1882149 1844473 1920243 2136351 2003875 2042294 1874525 2004683 1932956
14577 1932956 1852661 1743369 1905111 2190397 1754639 1948294 2133107 2236506 2236322 1730028
14567 1730028 2263447 2538922 2077971 2259414 2592004 2229477 2509626 2277512 2413991
14558 2413991 2528688 2404106 2393353 2537781 2637313 3069565 2730301 2454148 2543767 2974651
14548 2974651 3003245 3002591 3146285 3762395 3315145 3913549 3798145 4314545 4540190 4868139
14538 4868139 5777926 6748063 7952616 9524154 12135469 15549097 21088460 26739323
14530 26739323 26134666 18524087 12163150 8370020 5721997 4976053 4412031 3569635 3297618
14521 3297618 3179795 3136725 3084855 2913339 2735088 2814430 2464998 2619919 2635906 2723322
14511 2723322 2555491 2673042 3046969 2521958 3000698 2987380 2954392 2892517 2904648 2538171
14501 2538171 3120882 2847073 3172050 3403175 3092396 2717601 3415167 3145461 3301477
14492 3301477 3220711 3368886 3017946 3295156 3673470 3335036 3217640 3503114 3750396 3469581
14482 3469581 3536454 3708884 3687300 3653902 3727456 4103240 3752972 3864493 4145726 4250313
14472 4250313 4203385 4288515 3919328 4156730 4192269 4537658 4496877 4590306 4445364 4877752
14462 4877752 4640324 4535582 4572363 4833451 4525111 4648563 5011212 4797962 4870145 4774943
14452 4774943 4981619 5061820 5403215 5558022 5279953 5320047 5366981 5265286 5320194 5452316
14442 5452316 5625966 5431847 5431828 6158134 5975433 5546643 6198208 5981977 6159835 6538310
14432 6538310 6612270 6462746 6260506 6614519 6614140 6791821 6816824 6385807 7116093 6991458
14422 6991458 7110223 7165923 7089869 7242875 7446410 7563594 7946077 7741879 7872470 8362492
14412 8362492 8307994 8136820 8673556 8434671 8448512 8776315 8682380 8793525 9180684 9391987
14402 9391987 9374598 9437642 9888873 9705666 9626049 9962872 10124778 10269835 10745316 10507045
14392 10507045 10883744 10914139 11052222 11267724 11440884 11754033 11795632 11959403 12326982 12240178
14382 12240178 12871248 12525637 13032634 13358484 13390783 13824944 13838907 14354119 14401499 14401399
14372 14401399 14836440 15285888 15481274 15646153 16078953 16299685 16155063 17111479 17099855
14363 17099855 17556600 17567395 18119027 18484503 19031380 19263145 19551656 20083644 20354235
14354 20354235 21035733 21101835 21744704 21840265 22952315 23182147 23482024 24418661 24852285
14345 24852285 25325404 25965243 26264566 27138580 27754842 28494669 29132670 29733515 30533668
14336 30533668 31479185 31921893 32646426 33529414 34507612 35504590 36441195 37111198 38281373
14327 38281373 39210206 40102134 41735067 42622004 44309467 44829121 46320066 47731103 49402756
14318 49402756 50657065 52495231 54252830 55978941 57535655 59280749 61179256 63521480
14310 63521480 65623980 67547793 70001590 72339352 75147094 77627388 80374657 83367546
14302 83367546 86612034 89901976 93245736 96740297 101248656 105067771 109143790 113459609
14294 113459609 118105948 123138344 128383673 134158412 140042792 146225710 152679291 159993433
14286 159993433 167570176 175079891 182965323 191653289 200605486 209939902 220128217 230747991
14278 230747991 241506700 253099592 265373898 277717989 291111986 304505202 318208295
14271 318208295 332068228 346321589 360365792 373614874 386982978 399049122 410119235
14264 410119235 420421740 429878693 437956657 445099786 451241123 455691633 457613321 459254321
14256 459254321 461319069 462406488 458354483 452335137 446502910 438679109 428090180 416324545
14248 416324545 403767888 391362587 379159208 366076052 353034847 340411750 327660901
14241 327660901 314342217 301865385 289476129 277213187 265002954 252623906 241299989
14234 241299989 229575765 218530438 207592647 197644153 188099325 179731781 171508005
14227 171508005 163205959 155943676 148977624 142604285 136419630 130607174 124978057 119668985
14219 119668985 114558922 109852991 105958802 101703376 97925318 94315556 90495340 86999152
14211 86999152 84163550 80637493 78136969 75242088 72059772 69894593 67758828 65474310
14203 65474310 63683389 61319865 59372228 57349463 55999637 54431672 52818941 51176310
14195 51176310 49517920 48230649 46931444 45747669 44472736 43133984 41859477 40434488
14187 40434488 39679635 38884976 37625258 36800050 35855881 34896859 33897179 33480833 32421845
14178 32421845 31826827 30937720 30099054 29419827 28830869 28090934 27425708 27056630 26149129
14169 26149129 25565258 25149112 24700838 24115953 23566737 23436070 22443703 22058981 21565494
14160 21565494 21321939 20680036 20551255 20073282 19485980 19371258 18951648 18506817 18069242
14151 18069242 17588369 17471182 16846463 16932711 16413791 16411585 15847708 15560889 15198966 14904485
14141 14904485 14858390 14806066 14291663 14123299 13974842 13738798 13737171 13257428 12709744 12727161
14131 12727161 12383886 12455814 12243046 12067205 11823319 11555345 11825941 11282109 11062108
14122 11062108 11143452 10984453 10792790 10504767 10472556 10142210 10123206 10161642 9561913 9801677
14112 9801677 9567095 9365970 9384850 9180617 8754173 8840379 8699026 8765633 8546222 8387067
14102 8387067 8337189 8393207 8335624 8216161 7769016 7917393 7679753 7791902 7562317 7634536
14092 7634536 7477497 7009705 7018039 6898476 6964871 6849838 6763524 6769651 6758585 6390386 6819849
14081 6819849 6119457 6229948 6159355 6119288 6378529 5991877 6224950 6579321 5619557 5915712
14071 5915712 5433944 5684070 5754678 5602539 5091265 5616735 5526869 5542610 5006105 4851311
14061 4851311 5426114 4967096 5306833 5016158 4883571 4867309 4854698 4755075 4865836 4359333
14051 4359333 4631588 4282807 4729420 4569131 4355452 4621441 4686087 4703039 4839515 4328135
14041 4328135 3867816 3932862 4197856 4371816 3960410 3756488 4076225 4137016 3950582 3740013
14031 3740013 3832024 3781924 3958165 3996715 3724492 4069560 3395411 3532792 3364551 3404581
14021 3404581 3595928 3322981 3246094 3660242 3449644 3359968 3355605 2840955 3249021 3044019
14011 3044019 3429740 3028098 2964226 2838822 2639654 3313963 2882716 2914266 2967222 2966993
14001 2966993 2913992 2648494 3027829 2463875 2667163 2750564 2768945 2451878 2625617 2435837
13991 2435837 2705790 2683354 2485891 2786988 2504525 2623060 2572948 2839427 2284220 2702791
13981 2702791 2836505 3257374 3563648 3950147 4214587 5156840 6399152 8211512 11487049
13972 11487049 15994669 23278370 26449308 20286498 14980738 11117602 8374479 6749091
13964 6749091 5827191 5341656 4600276 4276754 3649378 3699480 3581908 3132894 3207868 3301818
13954 3301818 3218573 2711484 2556510 2515312 2572824 2438486 2527129 2416789 2514566 2556453
13944 2556453 2560635 1957950 1970658 2498739 2585802 2230134 2222957 2094790 2183619 2233954 2148923
13933 2148923 2508318 2256889 2303739 1975581 1982719 1805516 2024767 1997683 2014885 1895223
13923 1895223 2163927 1936427 1835820 1699655 1595583 1880282 2070886 1733186 2084317
13914 2084317 1729129 1892385 1718683 2110690 1875008 1736092 1582792 1889219 1757175
13905 1757175 1461936 1738690 1494450 1805442 1274229 1575336 1545810 1480691 1338803 1598378
13895 1598378 1476647 1484423 1459308 1363463 1281239 1655983 1639891 1627477 1446670 1649241 1460988
13884 1460988 1308078 1123613 1207569 1505454 1555950 1548287 1546510 1487404 1707975 1352266 1214385
13873 1214385 981158 1260384 944741 1509985 1271315 1197750 1204748 1672282 942052 1635742
13863 1635742 1002838 1563720 1295661 1268643 1471587 1007089 1120187 1279130 1175340 1372074
13853 1372074 1353280 1583980 1352980 1313334 1189639 1075863 1131458 1328760 855131 1088694
13843 1088694 1206889 1060628 1327459 1400811 1098399 1258578 1371714 1176594 1416527 1076919
13833 1076919 1287026 1354788 1010752 735977 992127 1256521 1194548 1072771 1109001 1129311
13823 1129311 1041069 1076748 1039867 759044 1448606 1131059 1238208 1096620 929690 1108210
13813 1108210 1282153 1130879 997611 795009 801950 1011398 678714 856560 1046828 846218
13803 846218 936703 785600 758419 1235403 1078535 819147 1014105 963712 703254 1091113
13793 1091113 770727 862908 1148916 1147966 853876 1187400 1040573 987997 711871 982755
13783 982755 942248 787310 703101 990573 827030 1049531 862148 756862 1026349 616443
13773 616443 941334 895060 702287 764365 777254 670142 811817 763779 733790 830892 917775
13762 917775 580968 763227 633114 781793 708837 880218 930155 694320 633596 1001857
13752 1001857 799493 775968 745110 780778 518591 463122 689135 1142308 777671 401893
13742 401893 452868 592930 717520 846249 455088 981109 872884 561158 391434 725529
13732 725529 751483 517921 697313 719622 935705 668446 636265 525286 556969 490670
13722 490670 692797 453608 665794 893801 733329 761051 358513 726502 789830 786484
13712 786484 554840 270182 710882 540002 316238 463857 456536 509988 680669 482074
13702 482074 953133 646644 687364 699161 587836 927442 664274 651012 722476 615957
13692 615957 641897 619753 693074 732007 697852 449869 690229 790108 265767 487721 540635
13681 540635 557213 602304 494699 580222 1068395 461545 422967 799316 419856 408862
13671 408862 414925 630923 549951 504645 161657 438536 494777 569063 643832 470605 559166
13660 559166 334020 726830 577631 473299 316072 482049 428445 568517 95773 697252
13650 697252 381195 333769 905549 416243 566223 518643 265198 522128 355728 167664
13639 338367 433303 460304 516833 755961 227839 518189 537817 409493 149882 499331
13629 499331 486035 367508 670185 667914 332693 468596 574227 500088 483220 787704
13619 787704 404532 382870 371741 489837 198624 482910 322555 258350 429493 134535
13608 357380 371518 472966 397766 522873 483504 179847 423524 691229 814130 380725
13597 403570 314625 207809 651115 804228 510564 299188 237570 257902 326361 500103
13587 500103 595674 214588 308918 244496 407428 135012 453857 391341 309368 -41663 341188
13575 107669 267901 81480 609005 239226 382456 712171 491524 492842 466197 313297
13565 313297 480316 410543 370177 233465 547222 434919 472056 178983 639671 269188
13554 367892 410333 252435 433072 330812 415847 189887 326542 314593 290854 450354
13544 450354 280055 248229 580454 27623 189937 591373 418950 465465 494407 666120
13534 666120 324407 506065 627894 53014 325397 130440 398758 226901 93044 226931
13524 226931 340148 244284 118149 145255 156362 358348 473152 141981 247761 355226
13514 355226 604379 471074 236859 392058 345656 371521 354062 655994 449007 379999
13504 379999 243647 530927 284078 175071 290206 337651 350337 196810 349707 363201
13494 363201 401867 274425 485831 243752 -88555 420248 501185 729950 160537 -24314
13483 142749 485118 63527 265375 165679 120811 573548 87090 312340 200384 170213
13473 170213 275527 249679 472514 -25021 208148 363569 9466 -15525 159725 384046
13463 384046 144136 379701 368285 300001 656912 215606 153201 393707 329149 116412
13452 357765 243202 411008 -202935 61169 25319 419477 -64795 286888 140054 13826
13441 506777 -25158 432567 306104 63320 -78581 254896 256585 126172 181865 544122 317786
13430 317786 456823 697268 368795 177049 4413 431521 -26012 421222 248393 23340
13419 9298 438774 47632 238886 -51747 374599 -51550 305531 119608 438237 597687
13409 597687 487028 -20696 326420 289733 222809 155807 178797 -3946 293353 237775 14329
13397 253763 292027 354081 343883 360408 299580 290349 232884 461206 338129 262657 179996
13386 179996 422580 388101 222465 43425 481018 10627 14888 177324 95188 226028 314607
13375 314607 260337 286603 -106510 175494 88834 149994 -76331 152251 291227 219576 -19585
13363 35535 111455 205046 334564 -21697 453879 393424 3099 458971 -58018 154935 147382
13352 147382 272339 576461 44240 122804 7235 -86044 -48119 233230 211404 271016 34224
13340 208205 110905 86124 91746 154684 594470 221944 224919 448733 1106 -57476 264439
13328 432450 469618 390826 349045 307060 180170 299649 178814 223210 -1613 429326 92387
13316 -24908 -88704 38145 288192 343469 295838 280560 268369 -64846 197485 210832 205489
13305 205489 233975 421154 36583 633983 285162 297172 109566 161950 115060 238283
13295 238283 342095 381978 119138 61121 332479 353681 166500 160144 67806 -98500 177187
13283 -120974 174390 316058 283311 212018 258594 24386 297451 253605 497994 35834 48558
13272 48558 217997 348243 327155 10909 216860 82197 249003 -222770 167419 257430
13262 257430 8729 456570 434563 136589 306499 87355 609789 355008 16042 349664
13252 349664 308494 146173 27366 -294164 140973 16338 310091 79018 -318602 -70455
13241 32558 65692 73250 52846 109232 -6531 -17281 -122846 143654 95662 39774 -40939 292968
13228 12569 -126452 185351 101597 78321 190035 -172653 -143149 80617 93492 485434 498900
13217 498900 120734 315169 -48258 -4821 -71790 225780 272868 -5936 488611 189674 162220
13206 162220 -34312 189564 260582 177957 166096 -443970 -269966 206782 -188585 251262
13195 238898 189853 79184 46224 335460 -171615 186467 126425 180817 170108 189628 140579
13184 140579 57062 -127037 112968 301218 -23009 251730 -80444 63228 147913 207236 377995
13173 377995 206502 -19154 53518 -134740 -15072 250869 -1731 48101 102315 124009 216375
13162 216375 186648 148421 277083 191721 -366014 -126625 196920 75963 53983 129868 21790
13150 362919 223464 179404 89981 -152925 -66942 242523 70407 153253 -116901 38540 174080
13139 174080 342505 -374141 122052 98196 42561 6345 237341 151038 -28298 243691 150081
13128 150081 124376 211767 112931 310543 -137274 87895 170173 305650 -207163 -148992 -87795
13117 -87795 -208883 -127174 55038 46816 213873 -19811 252765 158756 203710 161292 441663
13106 441663 -302904 155861 149246 227605 -165074 95512 213671 211105 71543 -29091 -29904
13095 -29904 7158 38447 432933 202218 117749 -99594 -38062 110223 129361 186935 -174684
13083 57742 126275 -70339 -135061 -223914 13049 107796 -234421 266137 -82830 -100045 -24371
13071 96025 83830 310990 374018 154483 49944 95909 64589 -71181 -14378 177222 -75461
13059 -167512 167921 -97812 163047 -160294 208252 437340 275997 296807 124354 -30078
13048 -120972 19270 305870 -264609 294576 235039 -120879 36014 -93137 -66646 -200748
13038 -200748 -209892 138599 282246 -100037 381204 61780 276953 -207665 253739 116229
13027 282325 29318 -147617 185772 90513 -193514 111024 327389 2808 -44537 43403 119360
13016 119360 233220 83122 339196 243032 4249 192863 -125362 139146 -169464 189183
13005 -74913 -1042 525671 152150 161539 -36671 156121 97609 119823 40458 329586 353855
12994 353855 255946 240333 -81990 156221 -27083 171769 219143 109556 181313 194880 -8328
12982 268956 62701 340305 4922 12738 155771 -73275 71776 130913 117493 -80052 109152
12970 -105855 -79781 -231985 36329 38635 -111562 354061 263745 115535 273686 279231 -197260
12958 -49296 -151992 481918 300605 -191392 -287321 112723 117860 -38185 -127355 132984 31582
12946 108252 -160654 11723 75486 76091 8611 -137053 77445 -68109 214201 -105370 -195142
12935 -195142 128227 -10539 -101739 118028 106354 189069 -7458 283071 -17704 98739 203467
12924 203467 -229722 -16585 -37173 -109520 233720 277286 -7632 -148796 -232655 340397 -11786
12912 4910 -50069 334802 -134485 217827 40230 93687 -256481 305995 44506 -148910 -48566
12900 -242087 -266067 428355 -216028 65443 34501 327075 -31887 -120010 -153437 10478 35157
12889 35157 343345 -160261 -235813 51197 232193 169410 -136113 95689 -208804 -77838 71254
12877 -128515 -62786 68219 294525 -13063 132315 -72048 -225230 -118327 -24740 111150
12866 -114701 337746 121333 -99664 341956 -49640 -44450 202307 -19228 -274675 -139758
12856 -139758 -131188 -435809 -47207 -61044 -30112 -96631 -96891 339020 310133 -11275 5802 -51849
12843 -355226 221282 -298397 14721 126881 268304 -56062 -11627 83877 279769 306966
12833 306966 3034 -199726 -232195 -51850 207839 -78951 90719 299954 229709 151724 90736
12822 90736 -130651 -126441 -246210 137586 7225 313870 -136514 -136777 122802 54179 326714
12811 326714 -44085 -28286 -36570 -437179 -259848 94419 -49690 249064 18557 430286 428411
12800 428411 -187738 -86662 -8417 -195481 330824 24621 -12296 30302 142584 102786 12728
12788 -184761 217510 -93544 188350 -13666 -12660 68488 22308 188248 111753 -49190 -50032
12777 -50032 353278 -86381 71305 457559 -61997 104901 -44041 -130211 106079 39167 103960
12766 103960 43359 28533 -184240 -28969 101321 -14116 59909 -358485 -210382 -95266 62463
12754 -136162 157099 -160800 -169163 78111 -283391 -59993 32344 131243 -7996 -128998 88754
12742 66661 79414 -398261 168990 44019 8059 -22504 275064 5815 -35089 244415 -86617
12730 301118 -187575 57278 2638 -305946 -148039 174486 -9864 -102862 37819 -7363 135599
12718 127655 205127 -36831 -81045 150678 106376 -205345 97215 -95496 188723 272543 -40622
12706 -196497 -212451 92899 -60708 49084 -189103 -153574 -31489 -42483 50 232793 252760 51062
12693 220267 195245 97623 142534 203487 78586 277992 -78824 -94718 318391 244393 144023
12682 144023 93979 260275 -124441 -312965 -293495 -50069 177468 -124623 180958 -110584
12671 -104769 414420 258468 75513 -44487 58558 394869 -32703 100203 303170 238337
12661 238337 -125468 521844 143341 120922 149998 -161774 91266 366145 537426 268807
12651 268807 -32691 -137206 338072 165107 32656 99476 197338 -98464 367995 148901
12640 283836 228046 -125479 56809 234024 -226826 249369 -195650 -92528 246690 -151426
12629 62985 -66183 153133 -40869 346196 50288 -199420 6488 146444 166261 154592 301430
12618 301430 381933 279134 256044 66291 551454 67526 257477 125420 307446 275180
12608 275180 291200 -150284 236794 -51835 472255 47389 244911 317566 160675 221473
12598 221473 103966 121500 -21534 -85768 145079 -183337 129465 13500 129746 68132
12588 68132 12362 100900 -22101 -70466 -1504 211868 159617 208312 -188404 -71647 58439
12576 39607 174656 138081 -85206 47460 -161969 -153247 237064 291595 149389 -119750 6985
12564 -181139 -165364 210310 323937 169046 -168333 -204425 86368 -354939 -109323 -104080
12554 -104080 108364 22108 190654 80215 -131548 49115 -16505 -104175 -37733 -47318 -263679
12543 -263679 -62779 18077 22691 305927 -21272 -143908 -117852 -142079 -49527 5748 402228
12532 402228 148528 55545 11960 -48840 -120486 225265 -14035 90965 280117 156347 -377245
12520 143477 -254544 140449 -167594 245529 -209902 187801 -145172 -44781 168251 -5526
12509 -154749 -336710 -94367 107871 -102574 -177398 50813 -180760 223728 102314 12318
12498 77566 -213361 -56593 -137819 -160920 -167540 -236692 -147673 106929 121580 180073 -355982
12486 -63530 93066 44801 -36087 -324779 324053 -523160 -30161 159889 83642 -148621 -258872
12475 -258872 130933 91158 17327 -281740 96733 -175455 90566 -130119 -80401 162007
12464 -53969 -228723 -47465 74277 -236302 176630 -299351 -443294 -403438 -253982 -181427
12454 -181427 108393 154197 39408 -187887 -220591 -300088 -28451 -158570 -32942 150799 -251357
12442 97949 39797 -100497 -277957 127406 33790 -355171 71178 -135568 24726 -99385 9387
12430 1909 -122036 69240 108535 -139997 -71556 178097 191394 -88001 -12489 197884 230037
12419 230037 163105 108379 20994 5383 -566235 -207808 351552 164434 -42806 86232 279659
12408 279659 81287 95931 -26097 -127617 -263598 -166585 -224620 -55896 -278407 -149303 -100966
12397 -100966 92439 -393632 205118 120772 -66165 -30731 108828 67022 196942 -465623
12386 -293338 -403356 -112083 7581 126095 -299039 291806 111354 -322273 113626 131995
12376 131995 98504 -43578 45802 98005 -3929 453337 -88975 32325 -63107 66284 222436
12365 222436 149966 -307685 -120635 26 32524 60017 39314 -269891 61715 302250 -103307
12353 -303152 13461 -16114 315461 -114461 38877 -81680 -14610 -37923 105307 88969 128136
12342 128136 87203 -76329 -12759 -242731 -112548 225986 41995 -64566 249993 71848 -261952
12330 172025 218662 338728 182437 -157162 -313471 108438 15933 -154809 -352574 -111527
12319 413076 -108486 -69353 135655 238951 -186218 21479 -48378 -1715 19900 178527 293742
12308 293742 112229 52565 -75122 143502 -127262 -42317 2326 -53714 -6064 -190734 408858
12296 -8576 206123 2751 -35296 -77970 204125 251426 -44600 6866 -216677 170845 -508 -261578
12284 -261578 68082 330185 -78645 -49653 147739 15783 364972 290807 137502 -232086
12273 -119788 252854 -84442 -52352 112782 7823 234004 -309231 62930 35343 -50525 168813
12261 444292 162890 197579 105392 232021 6977 134771 150707 112602 146004 47381 1071
12249 -374790 11171 175761 -37823 24109 -129263 -214293 -133514 29023 273727 83113 -606
12237 108896 168700 270420 105543 -89689 -222570 101913 -55087 -35053 142933 45196
12226 71869 38886 88018 -120217 -111512 95534 -137980 64743 203086 -65031 8817 120132
12215 120132 103772 -136955 54915 62427 -376 -85950 -39776 115847 250197 118443 -43600
12203 220218 8310 219391 81772 160007 180032 539967 325712 98434 -82856 -137257 61280
12191 244638 335779 203304 -150547 433153 420069 397593 2334 21808 247691 -145572 142492
12179 401001 109100 205473 155277 312303 216930 -19544 -79722 243376 -206606 102521
12168 10462 95179 -78196 185347 -19346 124671 96609 169742 202593 -165022 -191348 -133021
12157 -133021 9801 13746 222926 36248 101384 -145081 95177 163178 47807 -93798 240055
12145 -25188 336017 90717 -94652 77460 51045 -182685 -47620 -17915 49875 -25103 174826
12133 -111100 -373670 -104844 100326 19235 36491 -31724 -19725 -187950 53851 -138111
12122 362076 162204 -7339 -34390 -181776 -375608 -165396 109547 -95042 10033 355596
12112 355596 -69371 15404 -412745 53270 43314 -277887 70528 -20026 208105 -133875 107968
12100 92403 185485 -306038 207500 -11125 -20524 51786 43357 433135 178727 85511 79492
12089 79492 -53218 170757 -333567 -184463 -104133 74088 141440 -47196 -105870 98109 -36282
12077 138482 -143364 -30687 83758 -148437 -262905 -189229 -584346 8809 76997 127978 107710
12066 107710 -61347 97409 174799 -183255 -22891 23842 22791 565573 418346 685745 385899
12055 385899 213353 140125 141023 24986 264000 253722 -118019 -193627 401738 139618 -218120
12043 35487 -48157 259015 245777 311072 -66063 -149305 142266 -416894 -165040 42550 10081
12031 -156972 97748 -131028 455542 -33045 -222555 141097 -419978 -15716 -73838 -117520
12021 -117520 -25634 140588 -320251 -138846 -52986 198051 145819 -156936 96185 -33736
12010 375207 -182638 17357 34781 9023 -44594 -111998 228668 16657 -408073 248652 -255567
11998 170840 331720 281426 106286 -151385 -123518 56180 87619 158484 -186369 -203647 -161943
11987 -161943 156607 -217811 -44006 -119354 -43618 -23823 27957 -16849 -86845 -37790 -8755
11975 -304048 101657 121316 420104 152891 -18533 28560 -152636 62510 25089 -192791
11964 69001 19629 99930 -293952 -47270 -267731 -8081 -128392 226215 -284061 -90167 272830
11952 -136566 -213870 10465 -16583 -58795 -59965 56457 42867 -58549 -79912 16587 295683
11941 295683 90919 377585 19074 -160575 -199032 -90511 -159488 -268329 74993 -63071 34160
11929 -350093 -29445 -204452 110646 -14138 -258255 -105138 31289 108590 296380 -206100
11918 -195782 -313862 -177627 154425 -64053 230064 2309 -80987 101602 128741 -116602
11907 23344 287603 256631 149563 427228 -167066 -24545 -201125 -264591 -83701 -247817
11897 -247817 38998 160867 -26623 -376030 -268483 76102 -319351 126003 -202633 -342863
11887 -342863 192650 -141165 -28674 -74446 -266789 18513 40693 -213080 188511 -216035
11876 160306 -6392 -219041 -50714 115362 5345 -303974 -441719 41584 183445 -29520 -211785
11865 -211785 -16210 53859 -232013 237096 215888 81653 -30865 -496 -150335 57775 1172
11853 -252075 -131818 -267457 -273012 2001 -418971 -164874 193202 148116 68983 366546 165453
11841 83317 -131202 -69048 -198182 145840 -177347 -70263 52238 -277819 57652 50270 -70773
11829 -250505 -171125 6461 22745 115789 -9537 -54723 -257192 -112388 -12878 80693 -14072
11817 -347259 73279 -160585 23983 -51891 211179 252857 -7791 -238267 -173108 209288 -142652
11805 -248111 22118 181133 -274168 -85511 -118890 -132732 20288 300482 -19062 -191421 -29710
11793 -1992 -73694 -204990 -195250 60312 165458 127253 -257058 -232854 26758 -2626 137099
11781 34439 288656 -9779 -15702 -183933 35370 -115132 63938 162875 -41388 158445 -119630
11769 -271314 -187588 -142646 -9310 -70324 -143582 187602 -220902 -16151 30501 143467 155770
11758 155770 240400 -14420 -401438 -28304 -68956 72991 -67312 264233 65782 132166 -119955
11746 -266104 119842 8640 -319688 -170094 -348276 -105327 165345 301890 -702020 -47586
11735 -71410 -210010 23522 -195714 123753 27789 373303 -26667 -176935 -32687 -63405 -11876
11723 -61613 62323 -86744 -25291 -133933 -140403 106325 -47468 -79692 99677 79637 60839
11712 60839 46037 129652 135815 69041 229518 36903 -9005 179116 98764 16144 -337268
11700 -120869 -265109 86336 200653 -93048 -116537 250259 78573 247129 -64917 196631
11689 68225 46458 62047 -64752 -191613 78531 -46509 257128 249061 -84530 190896 -52961
11677 -131413 -319161 475683 94334 -262498 -170664 -24210 -215273 132235 -228242 -85362
11666 111700 -211401 164288 195071 60456 100802 -9789 -399566 -47393 6785 185248 69892
11654 -64637 29836 218892 -255939 -267256 -292022 -35148 190987 190261 -26777 -25921 31153 82912
11642 82912 -51616 128667 -45576 -173416 -12590 -288934 58614 19080 169215 -314719 29394
11630 -125753 51766 132360 105232 -87116 144771 194102 14501 175333 175191 -72979 -168906
11619 -168906 -155184 -6322 -76549 76940 134182 245000 391320 69157 420618 12424 -284134
11607 -289918 30651 82934 121412 -169970 247722 315051 -202710 -273827 136750 105405 -198832
11595 -255140 -95318 -26202 29447 -187998 505715 149353 -14128 -534836 137870 198404
11585 198404 -11061 -235203 -68873 -71850 5909 -218053 18151 -225058 36591 185485 93239
11574 93239 34867 167954 231962 199391 54723 92529 -236484 136193 13966 315618 193406
11563 193406 341925 196080 -164512 -9412 138927 5589 37411 243973 206774 216234 108140
11552 108140 -55682 93599 103795 264476 197304 -261525 278421 -126941 -116077 184106
11541 507209 124969 -224771 -426838 -24490 -192377 81698 84563 -67839 61516 243952 334401
11530 334401 -396964 144934 129825 312821 -46450 -208986 10251 116023 311439 180048
11520 180048 108157 178760 -326589 86629 96838 -306861 123950 -61909 309253 76052 91604
11509 91604 -159287 181463 -129389 -173608 216804 124492 26645 -69455 93076 19051 230422
11498 230422 250976 99384 75843 324850 103197 227516 85856 151862 158260 89155 -11977
11486 42274 194131 -135027 349222 157935 71436 38709 -61224 -277363 128799 210664
11476 210664 -41670 204495 159234 -16798 317298 426017 53318 -326086 118730 -287076
11465 268496 169790 199451 -101870 222935 219701 337212 -127674 422468 165138 178367
11455 178367 -153597 122004 6731 -50453 287240 168491 45063 302786 49628 128868 40857
11443 -13255 150261 156391 133003 -122494 141522 -230839 46123 -202044 -47659 279611 -338313
11431 -180046 58044 260553 283173 163298 119521 8235 -139343 44687 -26662 358003 132173
11419 234631 -94166 2075 -31452 25165 -74655 43743 -25588 307469 -80162 89828 72434
11408 72434 103517 295023 -168035 -229866 -104359 -11418 291224 -21776 87715 -251116 -248719
11397 -248719 153775 -49119 233758 -110828 50391 125535 178649 57188 -175914 4196 140385
11386 140385 -51782 408787 30779 16500 -94860 48667 -260896 123791 -14237 -208531 -59500
11374 -97327 -163509 121836 140969 -59773 -59906 40766 270274 256012 91735 -40604 103600
11362 -244297 67662 72476 100246 75104 137324 267427 291488 -209637 108086 -7730 -161527
11351 -161527 -55528 134180 11582 -66404 78515 18167 2593 -4285 -181932 -586857 208046
11339 -346903 14965 110263 -139661 -180255 -34421 -71026 29086 -113882 291320 -215166 118690
11327 38391 20679 214879 -204222 -483587 -119456 -102385 113496 -109098 -215993 -37008
11316 -132406 64506 249598 -168255 -119731 -5440 -181604 -39389 154758 203663 88714 -84293
11304 68768 185599 -511438 216795 66177 39039 -5151 -286650 -431428 -84705 -209529 133065
11292 -67158 172103 -64110 -184349 -296379 234576 16390 95872 -124489 39730 -114851
11281 -156360 -5319 -282879 -271526 16016 26534 99062 -184151 -182098 -18738 -233850 -278465
11270 -278465 -378044 95252 -248815 146263 366650 -82843 252469 -135462 -338849 -593212
11260 -593212 12877 143018 -252751 67773 57135 -12728 -261413 -144141 260440 -176332
11249 -133637 448116 -451270 -151241 93058 122575 -89940 69171 -245283 -320235 -28495 58340
11237 21680 75702 -96752 -137303 -283262 82119 128477 -301261 -174392 294898 115756 72747
11226 72747 110600 154051 -156812 106112 -13015 78585 133718 -53542 -54209 180458 -32139
11214 421687 -268064 -119806 -427128 -144399 104646 -180498 245738 -144828 -48480 -235141
11204 -235141 -62752 10674 86467 -251520 -233190 244805 13418 -205499 -218641 -140534 -45921
11192 -96471 -2049 -294214 -132271 169573 -453127 76814 49353 -126607 199532 -261025
11181 -44496 -40921 -47257 -124505 67417 -147825 -246085 -79680 81011 -491079 -31150 37872 -344608
11168 -139613 -103848 -278763 98810 -156494 -192649 148258 235129 37663 -173398 118358
11157 -93697 218728 181297 -74323 -392768 -268279 -84940 167035 -152249 296961 -65850
11146 -233495 -206677 200506 100299 84619 -644885 77745 -172076 -315773 29517 -141456
11135 -153706 264563 -230182 -46548 263308 -264125 -81666 8243 52946 -90719 -82244 99544
11123 -153604 -106216 162508 15751 -19654 89454 -167687 -122736 -50946 -92547 248091 86315
11111 158361 116947 -11347 346525 256554 2861 223674 -41645 22960 115939 -227425 133386
11099 -23616 4786 145144 142901 -124046 -69210 -118332 -15234 -27122 -27520 254854 -120474 357674
11086 -2894 117683 110503 -76414 312987 280256 135520 60444 118595 -15927 -91922 96447
11074 -150410 -17708 213384 314497 429584 505841 396136 168283 179475 -28293 37269
11063 28604 -55299 127358 312654 305738 23469 175710 465554 143658 437598 423432 314300
11052 314300 431192 182636 300304 655483 371048 396589 391598 428893 614653 488742
11042 488742 552568 643730 127937 620383 797285 517832 558113 838555 688734 853318
11032 853318 498300 712944 595314 584456 583658 485835 288733 668110 652485 812302 590096
11021 590096 669284 454483 751653 446389 387153 494248 543230 735304 785237 416534
11011 416534 845329 569435 226041 672606 619427 415057 572684 622687 770700 250471
11000 452505 583564 539293 479258 637931 870213 433637 623590 541590 659674 466017
10990 466017 791060 649795 270617 677900 524099 500504 661728 503505 514453 586338
10980 586338 564107 689587 640209 705738 784303 767084 358587 741035 894279 781534
10970 781534 826252 1252805 969891 932655 1184178 1124912 1384803 1418781 1709277 1641600
10960 1641600 2049590 2131553 2078570 2181959 2169476 1780951 1988249 1818306 1698704 1595558
10950 1595558 1280694 1624257 1162918 1425169 1373547 1518317 1418760 1250485 1444078 1183190
10940 1183190 1503758 985526 934852 1156079 888961 974833 475417 160152 558209 256053
10929 231351 440702 -70707 13836 201250 -19433 246812 191603 678051 50605 421395
10919 421395 488387 169004 94911 -24239 190486 42892 -140126 62566 338321 -266291
10908 -214207 -107427 -141423 136799 74617 177452 -98400 -62663 -86780 -125730 -40608 -134731
10897 -134731 50549 70758 212059 -158409 -243039 -51116 74489 259075 -245881 -280687 -42902
10885 -101124 24065 23785 323856 -22191 22349 72754 -278938 293342 -124798 -73658 -114109
10874 -114109 21317 -153254 -96372 -6583 98337 -32121 -63166 -276397 -263820 177814 178248
10863 178248 -133479 -162254 -96358 135821 61051 -250982 54561 -10109 -116199 -40119 -41861
10852 -41861 86777 -154783 25847 -181092 67746 -91842 116853 -65782 211254 -195406 88030
10840 166677 -46653 88335 12194 -95508 -164116 -160815 -108210 115924 66792 -115214 137820
10828 -181211 10665 -260121 -376441 29262 -204489 -220190 -118690 73176 -175170 -77210
10817 22897 -128876 42303 -202687 91940 3469 24536 -164729 -197438 87590 62913 -147816
10805 20470 206823 -143621 366344 154814 319579 -56471 79581 -14115 -105828 -240723
10795 -240723 16072 -150065 -37024 -12620 -462565 84217 -320864 173255 -75970 -111885 325712
10783 -155822 111928 -143155 -171564 -132822 147822 -27806 -30275 -512186 -178839 -116327 -25137
10771 -423889 174725 23691 -114967 107829 -221321 165295 242714 -297956 -67982 448765
10760 -276646 140141 -215670 8578 33157 -244455 -110784 -10576 68058 145184 -142210 -413589
10749 -413589 135744 -36024 189554 -289324 -154659 186404 14938 -112380 223302 -350011
10738 -181915 -173898 -206994 -83635 35614 -36758 301187 -67729 139853 -145672 330738 -222968
10726 40250 96104 -119810 153641 -156016 -183815 -106658 -69369 106650 -49365 -93532 -138995
10715 -138995 152564 90019 43149 -108476 -110025 -83810 -170531 -174880 157417 166041 -163156
10703 -354407 94243 -14908 -339795 122305 -314539 144250 -136806 79258 -34720 -96340
10693 -96340 -218115 -126300 63748 379762 -183186 140253 -96177 130097 -215648 25919
10682 -217946 -183921 -84268 154691 251694 -92965 67370 -72952 -177068 -133677 -21477 40032
10670 -154027 16101 14160 156580 -54339 -481401 -158856 129468 202750 38127 -107828 34006
10658 -2125 -217963 61379 -23755 120163 -178223 -91588 -251583 -121779 -123345 147012 -298952
10646 -107951 -209653 -239238 164994 -33367 -168665 -76081 54431 80695 174608 -136451 124763
10634 -104935 -87069 47122 -13619 -4752 -104252 17786 275094 -39323 -205392 -148026 -139008
10623 -139008 -89581 10819 -62696 -147240 -150591 -61305 -71878 82627 -21679 202556 54962
10611 75837 -248991 -190512 209330 258865 -10111 -135579 -136440 -72204 -82489 -142104 -140486 -36294
10598 -132088 -146945 -345461 -110841 -134917 -226191 989 -85659 70807 -167749 -44531 57665
10586 -147557 -108035 -198563 12610 -302028 -159794 -28216 174885 44922 1729 -146640 -197246
10575 -197246 5497 -164369 -142856 -32520 160603 -45235 -153096 -200282 -122286 -17074 -129420
10564 -129420 -275580 13417 -185174 -303194 -13622 -98342 -205419 -273368 -93698 -404985
10554 -404985 -111671 -11760 -42193 -203817 -33041 22383 -192000 -385161 40688 -12499 158103
10542 -84689 20716 113837 96162 -315713 -224088 -26165 -166334 1100 -78661 -147549 34441
10530 -37297 155448 -67236 -158182 57848 136745 -167159 -204096 -44461 251012 262841 -124867
10518 -183147 -234711 -161233 -28217 -144310 -227821 204787 74334 86384 -114653 -240299 -2744
10506 -100125 -67726 584651 -88839 271057 -106649 -100877 269609 -231216 -26357 31353 -321088
10494 105105 276024 -338547 -212611 8560 -126074 193862 -198579 -217976 -260733 -420143
10484 -420143 183464 -284854 109850 -165943 55971 -189209 137579 -321782 5879 101612
10474 101612 -2278 -291643 162728 288364 264463 102347 237337 422952 275043 134446
10463 77816 167139 -124649 283889 93969 412458 -47991 34148 45641 71655 -77588 -86117
10452 -86117 320174 -137743 44707 -399180 -86463 130382 -227895 39245 119744 -249867
10441 131371 -37368 -9535 44678 -78299 268951 285786 -117632 -105727 75514 -33665 185139
10429 -90854 151537 144703 17144 55929 149029 147780 -76208 -77512 130286 -89985 -230618 900
10416 213134 5290 129852 249053 -315902 -81511 -168734 -100578 145368 150946 -400270 -149297
10404 -255827 -44010 -9366 -93016 -181022 -73312 140072 -97178 115471 -75285 -236699 153758
10392 4978 -73125 -135201 233222 -102727 120260 2552 239886 -154652 345555 -50043 23442
10380 137626 73750 65427 54135 157282 197203 250196 105277 -150734 27691 153240 -76248
10368 132169 348822 -106991 288424 61631 -10208 159213 256850 127799 50440 196158
10358 196158 -52613 348506 102713 51425 118472 299654 448140 380781 161107 375721
10348 375721 163281 260852 158348 83848 270837 40787 317938 -9565 219085 278202 288013
10337 288013 208057 222877 528943 504351 284277 277787 46162 213132 306449 101758 645437
10326 645437 276326 -70238 356881 97446 245068 -116391 137841 -57194 7227 -149670
10315 -101362 55333 208665 -256777 279067 529989 87784 -93255 252341 531210 309007
10305 309007 150394 682537 41514 119256 -177558 235138 28335 -64113 -6527 -283221 -227321
10294 -227321 -202159 -76818 -113397 -21766 56085 51859 139221 44965 -37725 163405 -182172
10282 31346 -384218 -28618 93164 -331339 122552 -66229 96978 -43395 1426 -325691 121760
10270 -191441 210884 -21601 -196182 85577 -177685 -141999 -134399 9694 -128145 -236828 455990
10258 -10766 -170301 -25484 105347 46690 136719 50017 -80176 135240 -25524 -11693 -56011
10247 -56011 257453 251600 253452 -43758 326790 172872 272872 16616 -233218 212390 318784
10236 318784 274344 95039 -63325 -444855 -7794 -277099 -133717 94879 -262171 111394 -1500
10224 -156770 178442 -154501 -113772 -97842 -154372 153465 84591 -70084 -32064 -96441 -48299
10213 -48299 62893 -271119 -124715 -241685 121929 -14391 168941 -158011 26733 -39855
10202 -38608 80038 -43326 -194744 -83722 147279 136736 230924 118466 -266176 -334456 -183469
10191 -183469 326242 -341694 -163027 10186 -92316 -460960 -107833 -17680 -306374 12766
10180 27908 -4133 74835 -33882 145878 -153649 183616 210366 44576 -91820 -305847 -18006
10168 207582 -363022 -44429 63402 -392996 -16213 -63402 -50746 -162928 50526 200191 64469
10156 -152253 -268139 -5884 -135200 277669 -358938 11246 142210 -133514 -181330 -159388
10146 -159388 -214461 -182440 -105670 39401 -28014 56157 55896 -48602 18036 -122875 -154413 -122398
10134 -122398 260677 -66679 -222747 -7589 124140 -282296 -77943 -327844 -37995 5830 86068
10123 86068 -438435 -52594 79233 37695 -74062 -154025 66618 95193 237876 -115078 26027
10111 -243096 47661 -40506 -194196 -130822 20759 -246319 -106737 91540 204389 -10288 81106
10099 -336493 169665 -89194 -50998 347536 97523 -213964 240437 79773 -1316 77301 49872
10088 49872 -330949 -156618 -235769 -199241 -60873 -43467 5779 -185956 105510 -312629 -73447
10076 65209 58499 89909 -238642 -464007 316807 -79240 -167785 -80577 201104 -300003 -142221
10064 -279260 -53983 -235449 -162456 -276896 -19562 -22356 6487 81015 -241986 20438 -143670
10052 -75388 151630 -79481 -124636 -77577 163335 -20321 -252404 -304851 44248 -13081 180428
10040 -44548 -127044 -278385 -125224 121965 -125562 -35538 -10666 -206106 -43143 -126410 -83459
10029 -83459 -92032 -140507 -137986 -83857 -78706 -68427 -71089 -71493 -6820 -60964 71169 -210199 -169596
10016 -169596 -70200 -137987 -197476 -128118 -2530 -215862 54964 -186299 -252494 -253468 -202137 151803
10003 131232 91721 158379 -110035 149472 -220074 -132381 -143362 -181064 171699 32341 -284177
9991 -242718 -154018 49869 -171306 32609 -224663 -384082 99040 10834 -170648 -19275 -209683
9980 -209683 239288 148039 -110826 -301734 -58237 105624 -172987 -138560 -291766 156419
9969 -145576 -160376 -10072 -73085 101749 -171797 -104491 -95044 199414 -328322 -216285 -245432
9958 -245432 -153558 -83044 79654 244885 -134548 -396751 -230016 79284 62725 139554 67175
9946 228172 -173842 -190047 -204388 -122172 -95073 4735 32870 -97882 85543 -63827 94178 -145674
9933 -171330 -261090 -381847 -157666 -212890 -165423 -165799 -88614 -47120 -195095 -205968 -108446
9922 -108446 57034 -112790 -146746 -238858 -65342 -260053 -44626 -306394 -7743 282681 125470
9910 -371186 -157597 -404522 -232439 70727 175726 132913 -84110 62819 -339513 142876
9899 258814 40762 157037 -74662 175791 -82313 -224147 109666 -330204 161241 271355
9889 271355 -235135 -201361 146324 -48256 -294137 16297 -86573 76107 212260 -6546 30960
9877 -50691 -165487 -173943 -162423 -207397 84178 -152623 -353809 247883 -17684 -227272 -601496
9866 -601496 -28228 137823 -242173 105412 -475127 115221 -96664 -103751 -7279 -36751 -32745
9855 -32745 -213340 -25379 -76099 96983 -108284 3891 -37507 -159974 14158 -7175 76173 268722
9843 268722 -104007 -81165 -46399 -51630 55037 -93344 -15685 34071 -329213 -181320 166305
9831 -23146 134306 106877 -163794 -371635 -82822 34296 -67684 175767 -279279 105278 108215
9820 108215 -210229 -296160 -106364 105138 -82958 -405244 256928 -2604 65230 -122672 -437392
9809 -437392 -436292 74527 -156152 -49428 -10718 -117461 -280241 -150106 -94310 -257192 55102
9797 -50839 -6501 -225152 21401 90316 374635 -263833 -242485 116163 179437 -38453 -77882
9786 -77882 208478 -96530 29246 -297066 3938 -47300 -144785 -72149 -156931 -69302 280475
9774 -77294 178102 -186166 165903 101716 13591 -85996 -105651 -13472 79018 -60326 -441668
9763 -441668 50355 -3616 39619 -56897 359994 -175601 123730 23567 47257 93819 -82911
9751 18843 41725 161061 52534 292906 20276 -203134 -225839 -97127 993 -93034 -209890
9740 -209890 251520 -188287 86001 -42164 136885 -49141 -59989 -57805 -72162 140883 84069
9729 84069 -33893 -72245 -198323 -192775 -347027 55787 -194911 -269236 31158 -348594 -108186
9717 29716 -318004 -4070 -345258 169386 305941 -128229 226572 -492437 -67647 -293617
9707 -293617 193902 6914 -24763 -398724 -233851 -126441 -249127 12852 89198 -342209 -16676
9695 -62477 -234869 -35028 3174 -124085 141865 -35890 583493 32728 -250109 -70805 39130
9683 -152230 -256948 -238763 44585 38799 -69419 -10799 -90418 -136874 -266509 -130271 -24408
9671 235979 -370816 -184548 -213225 -105568 -124885 5440 18832 11262 -356 170461 -201595
9659 -100907 -23927 196469 92550 -115505 77319 -81785 261254 36643 106062 263174 -249332
9647 -254592 12804 -155326 41347 -378801 18453 -129897 -143670 201089 -221894 -226496 -92886
9635 235473 -179054 -77343 26070 -129930 -11863 35726 321340 -308704 -67228 61768 -44163
9623 -40785 -255916 -323872 -96896 -110857 -54012 -347757 151258 -205266 193244 -123206 -88231
9612 -88231 112787 -197170 -3762 -257459 -55061 -213553 -111330 112464 -103753 4572 58455
9601 58455 59468 158974 134853 98590 -239947 -108923 -126012 121182 -36068 -58448 116065
9589 -113381 -180788 265154 -314428 -233002 13390 88908 76041 -283368 -96728 -126582 27196
9577 -53465 249051 -26140 64605 -175516 22341 -190697 110686 -150538 -37619 -132355 -157164
9566 -157164 143292 -83150 -39994 -146825 87298 -228271 -8211 -185949 -75369 -280603 90337
9554 73471 -85255 -125704 -443224 -266229 18871 -92096 -52262 -135396 109408 276488 -257644
9542 -84366 -58637 -394276 162325 -144513 259535 19953 -4766 -97363 -274435 70381 104557
9531 104557 -107817 -165667 -201415 -395944 -417649 -128014 139223 -258144 -51585 -494067
9521 -494067 -26002 112561 -203667 -163072 -229968 263439 104997 90589 -219144 92602 -211502
9509 -297855 -270575 -115940 -30797 -11448 -61476 -84062 -57859 -321974 1599 25491 -193077
9497 -172499 -92597 22070 -125406 -42407 100526 -175355 -80648 -58471 -268842 92407 50008
9486 50008 -62343 138531 135853 -29667 -207473 -149171 -182897 154945 -140678 -89669 -125107
9475 -125107 -106450 -39733 -268948 -279551 143411 -166227 -81102 -32868 -73011 12489 -72271
9463 -276135 210829 -92799 -154828 -83203 44993 -62658 -67518 -49870 -155623 -358084 54750
9451 105802 -18534 111867 -173354 67306 -46688 -71563 -208264 -8711 47508 112400 46256
9439 -13283 -111417 -34684 -347133 -296912 44942 -363664 -80248 -202475 -62623 36511 -124359
9427 -116407 160433 118703 -202354 37333 -41664 52812 13575 -161375 -342452 -180106 -199601
9416 -199601 -11484 -79832 208313 -363913 -141638 63115 -47551 -242429 -160278 -368154 217491
9404 -17923 -55870 58113 4375 -130968 95510 39790 -78320 -204736 98892 -33848 227463
9392 -249236 146914 -77393 -293840 6402 144809 -254616 -154040 20733 145144 -71561 -381618
9381 -381618 -338170 124544 -68436 114348 -65297 -182720 92333 44204 -477181 53024 398536
9370 398536 -210209 206271 -63578 -297534 32808 86432 122985 -33821 -46014 2024 89412
9359 89412 61548 -228447 -449737 -93458 92850 49334 85618 -239679 -270980 -135162 -311801
9348 -311801 -19908 -99082 93039 48551 -98959 -279768 78689 -63053 -127968 -19270 7528 136362
9336 136362 -81245 15478 171735 69448 -108046 -28424 -13041 -114880 293983 -40009 253069
9324 -282528 110540 -318030 -325000 54363 165904 -71458 344294 -138602 -211164 106984 63454
9313 63454 230093 -195138 -111914 -141482 -119830 -59973 -10016 -291031 147782 74041 67474
9302 67474 234500 75170 162302 -156623 -33051 -54770 -79027 -207694 182725 -59411 -170561
9291 -170561 -16785 -115761 -266349 -183757 -85487 -199506 -322832 48434 -287013 -71558 122042
9279 -27397 188849 16918 106101 -376822 -36100 128809 -333855 -175373 -281425 -137848
9268 -198221 -33900 85798 -35270 -247006 -9065 -111114 -289536 -94545 -207948 26850 -38416
9256 -196853 -271704 -223996 -56149 -200504 2182 -177868 283531 91558 160275 -118407 -84116
9245 -84116 -78848 -25721 -80428 -22397 -111221 150069 -444857 -371560 67051 -174673 -309545
9234 -309545 2783 -43358 -336292 -303271 -203764 -117322 -45194 -16215 -384812 -179753 -22898
9222 140616 16558 78839 -261865 168841 -154866 -180852 -68813 29594 -68494 -203849 -29180
9210 -55403 185588 -304288 20507 307133 -19419 59098 85394 355146 -190335 -144423 217745
9198 -18970 -228362 -623825 -111784 195191 -98029 17492 283367 -314533 -188128 151360
9187 -195357 -171736 69594 97099 -101727 -103422 -49111 -372583 -55219 -158366 -90903 -80162
9176 -80162 10292 35134 -88449 -150178 9400 35798 -110700 52174 -472905 -73438 -115171 93116
9163 11052 -56566 273853 -219896 -53525 -246586 -255314 -206578 73051 83491 -37274 12403
9151 -20285 -82927 133663 95060 376698 3178 -273989 124507 -98855 -55743 163675 -63398
9139 298112 -23683 74488 -20503 -10638 110151 195864 81928 45573 237834 -96384 -225749
9128 -225749 -223806 -148384 179902 -20656 -260882 69899 209021 -416551 -102700 -124607 -91446
9117 -91446 150424 -143431 -289124 -177481 127492 25158 -110028 -226090 133540 80220
9107 80220 -306354 120181 92172 127938 57903 -129417 1730 382796 -178037 -400933 -308738
9096 -308738 -314340 -26876 50397 -337359 255323 -156026 62916 -26346 -510897 -220560 -239745
9085 -239745 88786 -164058 352531 -40588 -28424 235960 258600 -116258 50047 -123323 -283627
9074 -283627 77980 -34880 -86368 -16581 10827 -325213 92914 -43879 -127736 181955 -234160
9062 -114669 -59662 166785 191294 -126835 -147692 -129290 68509 33235 194435 27853 214377
9051 214377 -300045 98101 -82803 31519 -89709 -96588 102129 85938 99892 -248935 -124551
9040 -124551 237977 143698 -236164 103962 164933 33487 -152760 -299666 -119542 263937
9029 -118080 84862 -200836 -114931 15141 -117818 216632 -118406 -32658 -431653 -102172
9018 -280847 -229106 -65793 73177 -140631 132665 257269 -283292 -32980 -76945 -59382 -91397
9007 -91397 -1683 11621 -69739 -2620 -196362 3509 -7938 -288194 -341367 -162913 171722 -313367
8994 -224645 -121556 -138092 -165216 245576 6850 -155052 186173 -265456 116555 -130653
8983 -180271 83131 -248384 -165982 114978 -331868 -134075 -558751 273666 -315935 -432367
8973 -432367 -110203 -110403 -90178 116500 192520 30423 -92356 -24457 -334615 -221405 44083
8961 -2507 -301856 -171657 113985 -237292 81011 117942 -123696 -84925 -147586 -95837 -69113
8950 -69113 -392377 -115944 30534 -131913 95442 -256475 -311775 -206536 -126668 -80823 174681
8938 -33926 113622 -105808 127050 -123852 84435 -203461 111601 -163221 -254504 37889
8927 6123 -232264 165350 267947 27812 -54114 167971 -53934 -56557 88389 166948 519058
8916 519058 124764 108633 415450 76035 167149 575186 718206 1179833 1683110 2152257
8906 2152257 3882829 4307614 2587827 1414623 622495 367960 468131 186372 418936
8897 418936 184551 -29330 783 164503 258501 47742 178939 416452 295793 -77168 187030
8885 63499 -253961 -106067 -59213 -97655 33988 -278886 -24803 242604 51961 -106700 -602197
8874 -602197 388032 -117338 -177179 -18227 -366083 -277289 19503 -5938 -182254 37416 2276
8862 -163328 -245549 -106257 -160838 -81897 -258868 -122273 198214 223651 -171353 30260 538037
8851 538037 -129057 -268132 41497 31955 -156743 -121046 59485 -11119 -9641 -210784 82394
8839 19381 -153330 -147431 11173 50954 75899 -149392 -126773 91513 -147725 -37111 -395178
8828 -395178 -149354 -190009 -153092 152648 -233885 42376 -141707 -89900 227513 112875
8817 66223 -288446 96075 89796 -156445 246821 834 85497 -190044 -156038 -168031 65722 -197073
8804 6677 -1864 169761 -274778 188399 -159508 -346241 161679 86686 -4813 -121327 37923
8792 -62614 -157212 -65710 -72317 -18288 -94096 -176845 -3501 -185617 118545 -105624 -22595 201268
8779 -108688 -176428 17348 261726 7637 -498244 185739 -37215 -208327 6190 -283428 -40081
8767 -167871 -94775 -415577 -50512 102782 75739 -138051 -229064 -84802 65023 188938 -287409
8755 -251864 123192 -61400 -164402 -34833 204681 -50841 -105617 -68434 -344752 -108611 97210
8743 -105469 -208260 -140177 131959 -120333 -4564 -26671 187901 -19269 52213 102433 58487
8732 58487 386844 -253163 95789 -242493 -523816 -24129 -166598 86352 -1600 171305 -153742
8720 -177915 29662 -308212 -49087 -88720 -211546 -68740 -31630 -38550 -439879 71715 190957
8709 190957 84148 -72389 -56065 -24480 -51980 39644 -183603 -381784 139266 -43271 134978
8697 -232174 -177536 74421 111294 305834 258371 -61683 91521 -62136 21997 -74068 -30264
8685 -233736 -116784 -237036 -273222 164725 -40708 58620 -178473 32335 -306010 115496
8674 -110822 -113919 210104 7446 33159 20931 -127335 -105045 184177 146092 -8345 156905
8662 -131289 -207866 -46445 -172907 1066 -270498 -84467 -93824 -90830 -204253 -351598 14542
8650 154517 -242732 117590 -106002 -119163 40126 -37260 -277585 190913 -301815 167922
8639 -255624 366002 -70691 -174324 -240165 -86245 -100364 30342 -200042 -128649 47040 181573
8628 181573 -86995 453330 -177873 146906 57321 -183309 -18090 -493255 -137109 1159 -56516
8616 117017 14916 68161 -166422 -226319 140989 -133279 191152 -217551 -129401 -64870 -29947
8604 51391 -15189 436043 74093 -310304 -64301 -34899 -54439 48346 -437609 164611 -66408
8592 33943 397448 126342 -224976 -379813 91563 96690 76500 -56958 -60153 -244613 -5467
8580 -59821 -33657 -101953 -37861 -98037 275166 -234735 -84284 220643 -24443 -272579 293235
8568 -72019 -222948 497450 -231270 -290303 87560 44875 -227935 -190518 -31060 -155317 79460
8556 263086 215634 -322854 -226396 156685 -3191 126770 -55627 -67933 -68231 180648 -273070
8544 38285 -381774 28507 62000 64866 -30321 -41644 -132879 -236821 -3184 206516 -56195 -20120
8531 115839 -182854 -56134 322497 81096 117909 -4126 9834 15011 -233122 171212 -136045
8519 -587822 18701 -256510 -119445 -159699 54410 11755 -197580 -162044 -69542 -213114 -1347
8507 -36023 -167824 -138728 48367 -20813 -271094 89942 -76006 -4447 316330 -5048 186802
8495 -3798 246327 -220137 -396730 -96458 18500 87553 46303 -243268 48181 -146132 218099
8483 50301 -103109 -110019 31677 -44770 -38074 -144747 -281858 17771 106178 -36348 -257906
8472 -257906 260330 68932 -56739 -129075 34861 141178 -165923 -141567 -317784 -25335 -150764
8461 -150764 112809 -123774 198598 -41481 -244212 -421372 -152604 -123865 203544 164350
8451 164350 -321073 40405 -19674 59438 -159707 304019 -107190 -93888 -183774 13280 31996
8440 31996 69965 -5871 -122681 -10814 353158 -337693 -202073 -159803 -255154 -202861 157918
8428 -148040 -304054 46802 -13270 -18871 164329 78513 117052 -368303 85875 191446 76661
8416 11087 -13154 69084 -365902 36899 -32030 -264829 -99732 109529 233343 -278283 -69782
8404 57491 131380 -96305 409673 -58159 199461 109655 -139598 82667 100310 116661 -159304
8392 -49622 -102097 144418 -14935 -125512 73708 117874 126965 375460 -251542 83495 5558
8380 -354135 -145714 -190352 14844 -287674 -207040 -10474 19248 -9756 202270 -247788 -297054
8369 -297054 -170064 -69655 163077 167904 -206449 -229155 60113 127786 -218734 80456 -81843
8357 -140268 -369077 -10972 -3213 -250364 -94854 -138685 -106815 -265294 132260 -227165 -129536
8346 -129536 -303314 -76704 -69416 -166806 -147175 -9916 73652 140952 76483 -223065 -159786 -58197
8333 40109 -69770 47298 144594 -154744 -166169 -44499 119500 118422 -109689 163410 -142369
8321 -145964 21799 -107486 -248542 61890 22771 13988 -196225 -230766 -348739 77091 -360544
8309 -422167 -64766 -166164 1743 -101411 -39042 252418 -44575 -245825 -190189 223606 -178563
8297 -74608 207037 194831 57817 193307 173316 -231162 1615 -133032 -76604 38823 -37551
8285 -56148 -245109 -200667 81464 -124917 223920 -105001 61523 -99718 -42601 -119991 -49114
8273 94515 35994 150660 -79708 57214 -97659 -129878 125592 224061 -110288 -270961 16100
8261 216967 -194940 -518730 -77200 -70384 -157768 143623 -116979 128252 -335712 -130491
8250 -67573 218826 161675 144274 26816 -31507 2394 66464 218456 45748 245016 -17217
8238 -120995 -157845 -282091 108657 -305250 72294 42829 -72743 43642 100489 -90043 -150936
8227 -150936 127511 -29550 165925 29093 68398 -106204 329562 -416728 56184 -229727
8216 -23532 92516 155671 186174 12236 259070 -276522 88858 -328746 -182397 435249 -87363
8204 -1633 54111 58643 239103 -28000 1819 84836 31931 141782 -28953 436248 -367920 1682
8191 104544 40421 -144342 58568 -43661 322766 -31303 -175999 -56730 181884 -125431 159436
8179 -123687 84317 266532 210692 4893 -85015 -250857 -185329 29052 82236 -196093 -18515
8167 3940 -46574 112842 -171775 -72075 -206943 -163515 -122170 -38049 -76566 -165594 -55863
8155 40943 25560 -180863 2862 44406 81935 80748 -62438 -126381 307402 353734 -101330 -37908
8142 -195412 138635 39990 250158 -71725 22186 -71395 -75075 113581 25230 160112 240615
8131 240615 -129359 146072 -210547 -166948 -35936 39430 73107 -28037 77784 57786 21941
8119 -88660 -12772 -253907 42903 9936 79588 -596448 118248 -241871 19667 9699 43980
8108 43980 -29205 -99130 -267993 67396 -1387 -203044 -348089 -592959 -13462 -124081 -275559
8097 -275559 -285906 31441 -211532 -409527 -256611 -12165 -192249 -63745 92950 181309 -135886
8085 31885 -40172 -56324 107479 -263759 -285125 -20087 -37421 420206 -99524 -120105 90861
8073 17869 42267 -171137 -101707 256709 -311691 107847 7776 -273016 4140 91148 -24518
8061 526955 341875 35129 -27042 73915 24091 -13922 -189100 64147 24416 -173325 -45197
8049 -156173 -311375 -149557 -2000 -87888 -269118 78019 86056 -81130 7815 315748 42064
8037 -92965 -151554 -101467 -487048 460169 15127 50814 -243142 -332943 228001 119507 -27881
8025 -21125 110643 -38142 -119645 -121199 185658 185742 -123231 48838 -77870 -93184 44109 5387
8012 275438 53785 -117075 106762 101089 -53065 -10200 113719 -282255 -41225 -55317 185376
8000 69929 47650 -115498 -169112 -311169 69455 6819 -99370 -14833 160921 -57596 -222983
7989 -222983 -96180 72036 201192 20606 -108669 -158713 -26102 -282646 -15752 -145301 112130
7977 477598 56286 319545 -46501 119510 180229 -193419 -142843 265327 164190 126230 -58168
7965 -162735 -45334 165371 -130536 94605 61111 -26032 177718 -132668 61021 83784 -12001
7953 138059 35062 -272211 352662 163632 156542 272968 -160370 -536204 -310004 -149462
7942 122969 31785 89537 340507 -61635 -38294 -52855 -109430 -196024 -356217 38295 -63112
7930 -207210 -180934 83657 263119 -307214 8676 -30858 -64360 -101623 -334204 -112188 153122
7918 -205571 -4354 -5326 42101 -326989 -64948 -43369 87760 -100615 207871 -15132 -139417
7907 -139417 5995 157196 156247 280613 599228 174110 29054 186653 31795 -16360 20598
7895 -99322 -61095 -89820 42671 149312 -91438 -104973 -123272 154240 -180385 -90234 14184
7883 -145329 119430 146019 -5878 199890 -209095 -30997 193126 -111678 -24563 -20351 -112902
7872 -112902 -88724 75657 -24484 41725 327587 -162200 15511 -40245 53098 -189150 4960
7860 302518 -198758 474135 -207311 -220853 -96734 179852 -88623 46805 -205375 66120 255247
7849 255247 447568 -102544 34173 -11672 13847 -157912 107839 -19122 207102 -175367
7838 -66293 65193 145355 -172855 -146057 24685 -71771 -138737 65501 -66326 -40202 -21937 -109249
7826 -109249 7247 -97139 -4142 -194854 -250274 -106010 82450 -182823 307200 -66253 365421
7814 -426734 -194084 204407 -497359 -159314 73854 -76314 71423 84621 -8922 58845 -114883
7802 -232070 -44335 11338 -64291 -400429 -6998 -272769 14595 -270058 111220 -190209 -55554
7790 -15348 -226820 187321 -255667 165808 209805 64248 -78320 -40392 68603 17449 -51597
7778 -189000 -128239 -62894 -152292 -101199 -225691 227494 171639 3910 -116892 -61734 275970
7766 117528 34860 -28708 91229 112791 -1833 -484557 116016 -64477 180195 -77325 -140710
7755 -140710 -19936 -126424 53491 49583 277767 -156809 363384 -197746 -220724 -103780 219712
7743 -239459 -106467 -9020 109425 -38591 -191666 76859 53473 34073 272951 275127 12061
7731 -26473 -46648 202303 196087 65369 104577 103226 -128187 -268459 300896 -17845 -237374
7720 -237374 -92571 -167338 -208814 -279843 -20662 135332 -25714 -84365 -6246 50889 -70805 146519
7707 -47451 177450 -189031 -29863 -251741 -102906 -139019 4297 6701 3826 47295 -236287
7695 171893 -10920 268858 -71351 14830 58108 24036 -28571 -36810 404277 -266016 -49077
7683 -334290 434471 121239 -167769 39537 51201 -114291 33642 83492 10750 -9708 -53752
7672 -53752 -63351 24422 298626 -174306 -228535 -12207 -104956 -249920 -72780 31485 -91937
7660 -71108 -191039 28847 -212903 -67180 84283 23566 -168797 130860 -85509 -278097 203022
7648 -228163 299302 48193 13789 -2961 -274740 107667 -21003 -117415 34744 -176135 3120
7636 54583 79274 -151953 -124981 33107 66572 259553 131187 -211910 -65080 -283046 -10257
7624 246187 283014 3986 -7581 -7598 -270660 1760 -118783 81650 -335446 -69399 73120 -98099
7611 -221690 -1262 -372193 58060 160887 -95167 136468 -200061 -84512 -55672 31705 -228207
7599 -71907 -35274 152365 -82563 -65419 -114277 93609 -155560 231500 -258213 -81409 -232238
7588 -232238 132968 -99805 155427 -28997 -180681 -126073 -309774 94811 -333728 -42022 118012
7576 90310 104524 -63610 -348228 -64922 6111 147391 -150693 241823 -107311 -26425 5778
7564 -286034 10132 -158466 59056 -153916 -173055 44007 12035 -200854 -144910 295981 71873
7552 330966 -7066 -224211 148792 2265 -15688 -195195 70128 167267 -307164 130588 -107526
7540 -26123 -62781 143440 37948 204975 -339263 493306 -60489 -127777 -1451 -174234 -214246
7529 -214246 -131778 -859 123567 -80394 33592 -6271 -263038 115596 7209 -86060 -150449 210929
7516 -19164 120053 -337903 3817 -58376 4031 -80862 90136 176295 75342 -37830 -58700 -213156
7504 -213156 -440809 -53964 143217 -139571 85137 -15796 28313 70525 150779 -175125 200025
7492 -105772 -95883 -2196 -11609 -150290 -282001 -56196 1750 80352 -20453 155500 -158923 301040
7479 98274 28390 141218 151803 -29931 -44817 -137526 -45656 -11184 -404240 60918 52329 161250
7467 161250 51657 167043 -121564 -103905 -151072 -97230 -258956 97434 409021 57182 -292020
7455 100328 -62934 107330 220850 331253 115123 1632 17856 -200943 -115170 -75247 13451
7443 281728 -49329 -108019 55744 7707 -128811 137462 167516 -214486 13119 4901 53966
7432 53966 -287151 -123224 -87824 -6763 257630 129705 101592 286062 -12461 -299224 -5983
7420 -90368 177937 -103635 231371 228104 319534 -193901 -258063 -4236 133691 264629 -223536
7408 235290 -175431 93646 -53249 -154472 -130400 -61204 101570 152587 -54506 130620 81048
7397 81048 -11360 -146291 -576853 287280 84381 -194714 233397 276152 -284429 -197677 -234166
7386 -234166 -149301 104231 -273486 212184 -85498 -36619 215060 -138980 252837 64966
7375 124415 -114446 75921 99223 -160423 58 -409400 -146291 -131590 54390 -81426 63436
7363 -483805 -243069 20018 188157 51291 388774 81758 39586 125054 -109941 -222378 42277
7351 -134617 152967 -174974 -50751 -108717 150577 -100275 -230836 218955 72959 -31194
7340 123240 -8530 -8771 -259982 163745 86616 101250 61704 127948 -414885 -71355 46052 -249652
7327 28969 -108122 244085 -186816 -273776 -98248 17853 136382 -217066 -31030 -19447 -74859
7316 -74859 317228 91836 13947 -81600 -403681 93325 -56048 -221600 -200544 -312117 -496487
7305 -496487 -225913 -102830 -60891 -212976 17619 -200602 -18534 -1551 10373 6671 -127205
7293 89136 154742 -104951 37984 -243886 210939 -130314 -58309 -93770 -23507 -458649 48837
7281 174985 53560 -58040 -163625 222145 133905 -26737 -157865 -149370 -127144 -35440 -270781
7270 -270781 -299721 89119 -200584 -86937 203975 104388 -45899 -182426 92682 -5607 88948
7258 -19980 167695 94152 371373 -236265 -225436 221605 -30673 352307 135464 57908 -67836
7246 111854 114478 134331 58509 90126 196991 93992 172378 122465 -222618 -208534 -205436 -149399
7234 -149399 -46025 36179 240456 72379 -2352 68322 -365034 -284984 -144114 123175 -156067
7222 -309093 -137380 -70276 18006 325166 -191523 -143943 181220 6112 120463 -147585 -164957
7211 -164957 -29337 -62483 136183 124346 -84703 171914 8567 -101563 -187492 -178878 -49171
7199 -37578 -208595 170355 -247473 -16452 233728 89824 81805 -335213 -353158 -150780 76299
7187 193781 -198886 -226880 189458 -244227 -334170 241983 -150527 132569 -149728 -114921
7177 -114921 11488 -276891 -76712 249946 -259420 281106 90356 156588 -213139 -287401 -66675
7165 -128282 86594 -104650 -113831 211133 132255 237148 59054 -61932 -82861 38889 -57769
7153 -106370 173039 -280901 -279935 -193128 4046 51340 97095 -107275 190968 5267 -276825
7141 119904 -84451 260621 -51332 121528 -246732 2233 132570 -37734 -24979 -119073 15501
7129 225657 -107180 64999 -144531 -234138 -191558 5917 -99882 -376896 -49426 -22568 -6526
7117 -169075 -66775 9947 -88299 -968 47178 -37390 -174311 230688 170436 -297148 35111 -13094
7104 -12925 -64770 -131403 -157296 369635 11510 149091 -49473 -94492 16763 376716 57372
7092 -195558 -3037 -33524 -391357 -243921 131320 6726 -159358 110143 114032 -146 -204886
7081 -204886 6217 -221261 -156288 110709 -206793 147306 99135 -186488 -258149 -344062 -125672
7069 -71724 -137547 75510 184809 -3508 50905 82809 -139565 -66459 253158 23150 -273872
7057 -197854 111360 87507 63020 -5527 -211185 -236418 39332 -4989 -304308 -324434 221146
7045 42255 -7410 -252283 -80495 -65416 -169844 35696 38184 -51696 118561 179302 -145991
7033 -188256 135056 363012 -302729 -144701 -272674 242907 198051 -125236 -425083 -137952
7022 -78806 115268 -174194 -141262 161546 -102098 -237733 103097 -10006 8654 106683 -174171
7010 12889 -6914 -84738 -267597 162576 -145015 82279 -19024 -3424 -264472 116054 -452304
6998 317844 27075 42867 253539 41015 -224483 155936 137045 62008 -23060 -250400 11593
6986 45960 -18760 -109339 179238 34017 243886 -10969 111813 10056 -15759 -5387 -191586
6975 -191586 206904 -95511 -159649 -194083 -156953 -106174 234752 11874 -32435 46310 -177062
6963 217983 39700 116086 -73052 19173 -262131 68413 334658 343576 -193927 239765 95394
6951 23371 -29733 -26459 -179826 299500 -137512 57315 170541 245282 -101174 -288701 -124232
6939 -53624 140943 -23218 -5969 -22622 103060 52589 -59294 74381 129350 43680 -255585
6927 5665 -405630 -229794 -30043 -193082 -14084 -157795 6425 -7007 127829 -111096 37453
6915 -157706 -253799 186596 -81828 -70224 -8576 4421 246726 -80654 -243940 40720 134583
6904 134583 25295 -124907 73917 235002 45172 -21959 26541 -329692 144484 111097 -343381
6892 102935 325034 -1996 107848 -189006 77520 -173274 -315935 -11653 26918 362782 -56489
6880 778 111536 175677 -237318 -331476 -252624 155413 252015 4641 52322 280089 -40506 -41136
6868 -41136 -137770 78180 174318 207196 -29591 63090 129247 -265061 426665 291856 -432036
6856 222772 421970 187292 -266647 -255018 -25624 -225216 123386 173396 -106690 150324
6845 27706 -79152 -172175 22557 -290424 204772 -58619 14078 108032 -147914 -42172 -464406
6834 -464406 71851 250582 -29682 -214505 -10441 -206306 30142 -65769 58035 -281119 95357
6822 421031 -85003 -21049 -132680 -33449 -56711 -166141 54407 68783 -68241 -12377 -78076
6811 -78076 49920 -99781 15081 106158 -40953 -162504 -115067 28959 91 59012 -48653 -117938
6799 -117938 -51867 44594 218050 -6088 137797 179002 30880 -64106 54336 345216 -89336
6787 -185072 -289060 124078 226711 -38970 2550 -87870 249809 -24896 -251328 112127 15303
6775 120264 -106333 -163682 -173649 -119569 -141020 219102 30173 -535782 60668 176259 83395
6763 -433719 -268252 -2779 -454387 -182065 110306 -136844 -119444 106709 129450 -6295 228124
6751 -305006 -248366 71567 94484 -176556 1647 -55806 -26624 -106969 -40305 -220511 -113269
6740 -113269 17453 311110 -144277 34047 9180 -13782 -37916 163277 -8789 -53231 38780
6728 -129313 -89779 -95000 -35031 49878 128798 -12502 -133020 -34071 86993 -106488 -317929
6717 -317929 -351486 -142205 -111410 -13944 -275879 109144 -93561 -41074 136616 103478 -227785
6705 250536 151352 -55183 161980 295828 -112326 -189065 79481 -110162 -59516 192701 6531
6693 195531 -85228 -232320 68309 7862 -115762 -96654 -59491 -219033 161622 260433 -261094
6681 80103 36265 -139713 -41114 -384042 32964 -4113 -188353 -21594 -218994 -9979 -19410 -207591
6669 -207591 88645 -117503 503091 -20709 264705 -320218 129753 115693 118458 95829 -66242
6657 59983 -101507 46171 -327968 -109203 -290923 225371 34520 -267004 23732 -118044
6646 -15243 -50937 447300 -173119 32985 79403 86846 146375 -114671 29945 -1296 -179129
6635 -179129 265587 118751 226115 272149 371846 -117374 -122416 137744 59666 345069 66433
6623 31980 -6018 -18829 168866 -95015 -161662 -101687 -318561 72031 138941 5455 -223038 109304
6610 30181 -26250 126971 -122494 -123366 234007 65018 -62311 26304 -114295 54922 329313
6599 329313 -49974 -67841 -252914 -2216 -333532 -399241 26851 122636 -53504 130023 52059
6587 44474 -102671 -115641 -78877 -224197 -101950 40840 -84213 -81191 -238684 149657 88223
6576 88223 123498 -97853 151037 205776 -237643 122315 -224994 206838 230218 -111216 -100006
6565 -100006 -116833 40648 91679 -154545 -51596 -208807 69966 197513 11106 -388179 52310
6553 133207 257727 -72441 125926 121415 -162231 275159 139281 84236 -9153 66482 -65736
6541 230029 179961 -205435 435641 -169471 -8345 180352 150267 288501 243052 -134474 -141698
6530 -141698 92082 56607 304798 254430 -59607 284178 12357 -18797 179244 -38129 -160616
6519 -160616 -122794 115681 -33786 -4741 -43195 -16076 248397 -65552 -430339 36168 -66065
6507 329698 111376 -49083 -153566 -37312 -97590 -132879 -30276 -63757 -4780 -83318 -32048
6495 236471 -91234 -81580 -198163 -137941 -162510 49876 -275731 6599 -55990 -122994 -170373 -199182
6483 -199182 22293 -87637 -312093 -303295 262223 17934 115977 -25905 64971 -180668 7544
6471 106006 278961 -981 -97949 -14695 -57314 -96318 -173467 -70403 -224174 -38907 -289375
6460 -289375 463432 47111 -97297 133735 -44121 -21062 -40952 15615 -17724 -159538 -39180
6448 -69831 128166 -198800 15030 355896 -424711 123170 -249477 82687 434197 -78229
6437 56496 -214228 14985 -115950 -100377 232876 -278530 -152812 -23811 -222271 -49715 -539730
6426 -539730 30854 -72338 1159 158735 166800 123855 -64204 -93799 82577 -148100 -235313 114753
6413 -79344 -83414 -195048 236508 48120 -105612 -654 -244742 153676 -57037 -38171 -274641
6402 -274641 -248526 356150 -141582 230515 -51351 -228304 -117677 -26454 17980 -4217 -37655
6391 -37655 -206717 53828 -126914 -69327 -196556 -143072 -300095 -184852 -167378 -184666 7780
6379 47144 -72824 -198833 -61298 -15885 186614 -34224 150529 -10865 -51834 86226 -77958
6367 -3247 21580 -118994 130911 209820 -289672 255993 -118346 -6295 -131301 -77342 65088
6355 290709 107583 -294670 -44044 95765 264781 103864 98657 -107828 -252013 -88451 184876
6343 -34598 -10579 85795 -122870 -34743 123077 -211247 -117797 -108073 -125124 408561 342863
6332 342863 -42161 316443 -26355 256514 -46668 -221051 -29489 -19982 -49510 -311936 -85105
6320 -42179 -257346 -24757 -180396 -21077 -173624 -63435 26769 110833 30234 41531 -216114
6308 218223 173757 -135374 1450 326509 203463 33429 62829 283830 208088 171645 -158029
6296 -261326 -238362 113230 -320510 167958 -108359 -810 4752 140823 128636 -91491 96460
6284 -242813 269290 -267483 19698 362615 65466 288605 -68166 65815 205364 29059 145796
6273 145796 16498 -303421 1514 15720 -195492 -314240 61661 -435260 -72592 -69978 -64705
6262 -64705 51455 -152678 -21909 103204 305836 30092 122974 -75230 77700 -91467 -88224
6251 -88224 390782 143973 -192763 -14834 -400024 -115069 -285534 31938 203286 -42719
6240 -177128 -58174 -50457 -27844 67253 128244 -93538 -139206 -21220 -94386 292711 64322 130693
6228 130693 109014 -83619 118454 -53865 116964 -149536 159279 -27022 35934 -231135 9191
6216 94365 -17108 73002 18642 141225 62955 173861 -141035 75769 34693 -154972 154051
6204 -267148 265116 -54401 81532 -79078 116325 -271106 9929 -84197 78224 180440 -124371
6192 -17547 46334 187443 -52215 15859 -46171 -3308 166178 104841 318098 238551 172483
6181 172483 -66359 -219658 -52004 56864 87673 262492 -4791 11047 -9872 149840 185947
6170 185947 -502775 -230970 -149169 -213542 -70981 -3784 99398 85039 73243 54940 243601
6159 243601 262197 292102 -153268 -182342 188326 141450 191116 -369634 -91185 -301821 -365645
6148 -365645 89739 -37441 204500 44593 -72076 213647 30307 -25557 -30658 -10226 -265786
6137 -265786 277464 40856 85069 100701 132752 385493 -123916 -96965 145089 -93023 -47440
6126 -47440 109224 48995 72569 -57203 -93802 363187 324843 -199958 -198227 -146767 200114
6114 -95463 -190343 -112989 -113462 -101130 -7260 -133299 -228257 164387 -77302 -19230 140853 -80464
6101 232365 -382934 -50345 -36595 -118776 -26724 -18710 178390 134345 -250174 167358 -95779
6089 -251597 115786 -67714 -212844 125818 -30135 -11040 -68409 58518 5489 72081 293380
6078 293380 147785 -89921 17455 -70709 -31929 181582 110220 -207105 -275432 -70800 9843
6066 -345264 212990 -257116 192290 75336 122526 -93264 7647 136126 -266769 30627 40261
6055 40261 42604 -50060 -253045 -33497 -94589 76043 -125359 18639 -20285 -155516 313843
6043 41729 274692 -187103 -241128 -14291 105365 4367 156451 -13866 -93334 -123067 76635
6031 -75984 113930 -125191 -5003 164608 187913 -46730 -139989 -23347 102407 51676 56623
6020 56623 -45206 41171 -240260 231153 22666 -65465 163022 -109828 -236072 29582 -99502
6008 26706 -69990 338693 6505 -185112 244122 -85444 119055 -270144 161429 -174705 -486654
5997 -486654 20380 22399 -11235 -161364 186165 -36814 16557 123918 -169590 -226015 358264
5985 -41968 -97802 -63517 96104 256544 254979 109393 -57495 -110200 -163636 -71011 398926
5973 119440 -123488 85439 -149131 -123065 140074 38207 62031 -156768 428279 174916
5962 63739 -57856 -112578 -148659 -95183 257373 -84473 -83294 244536 -69564 171475 81887
5950 -183289 -105734 -188081 -31073 -233533 120182 74928 7086 -1078 -88821 -172507 220632
5938 14478 -20205 -25896 -450947 -129590 78673 -245393 -16755 14835 -157572 -8602 9725 -125988
5925 52654 72735 23183 263542 -91779 50567 212914 -272675 16357 70249 3143 280001
5914 280001 -315418 -159370 437473 -124612 38118 -231498 -274539 23075 -78427 250586
5903 65268 216027 -123050 -81022 -285881 105423 277107 64369 -24226 -157685 153548
5892 -255567 167555 -39010 222 -47349 120629 -142936 136676 -28275 -58165 36976 -212949
5880 95628 46549 3154 -24075 -6433 141916 -33111 109429 169678 202801 -118141 -121472 108023
5867 -168861 -79010 -211707 150615 248532 273998 -3600 -386764 -213205 210105 -90111 8798
5855 -121804 138110 121781 -465302 -244323 -192186 77440 -15749 199688 142896 65451 -300666
5843 229024 -180430 -394039 95911 259387 -137207 283468 -91407 48471 -190181 125267
5832 229616 -101324 83500 55081 -38896 -324433 -280050 -81405 -111131 26984 78266 178388
5821 178388 292624 161178 -110962 -339258 -92008 -220639 -259190 201680 38430 129710
5811 129710 -138785 -74197 -19742 -10620 -469877 -17435 -225384 158189 111947 -189931 110436
5799 138053 104397 151399 46529 -63813 18988 -134729 -291087 431340 -201962 48720 322022
5788 322022 -79006 66349 -160673 79769 13356 -101872 -144184 238195 25531 -22349 -53477
5777 -53477 145057 -62520 -42540 48513 -252255 -35773 67397 124988 -309290 -33330 -122195
5766 -122195 -90650 125609 -101602 340215 86689 -155608 -208811 -88339 157860 472438
5756 472438 495274 142425 81398 -123075 -30940 83115 180853 -484082 -22075 -108293 31892
5744 -434516 -290349 55121 -180722 5118 -180345 -187822 181179 248932 91238 360434 -9295
5732 114128 55852 148130 454388 269144 -100822 49898 358877 -132940 59006 -51204 -169722
5721 -169722 -130845 -52502 -173873 -243820 -116411 -38769 -271306 -217423 -45252 110547 88971
5710 88971 84513 -220640 -226555 79384 -158531 -205433 279401 27108 -163941 177319 -241215
5698 -247068 -255608 147799 55182 6387 -100743 191576 -24240 -295842 -11335 51921 240086
5687 240086 17537 110199 -80139 207090 -167224 291392 -105981 -75534 -155447 -41990 -66699
5676 -66699 43328 94000 65775 210534 -166607 -20054 -122039 1997 -41669 -6105 -179044
5665 -179044 311743 20988 212874 -222749 199160 7318 27612 -69448 -28403 232998 69881
5653 87362 77301 332934 -114746 -181528 157933 -17856 297966 266694 -411879 -21571 13452
5641 109363 -52738 60740 75825 -294228 188462 25956 242812 36888 -132723 85761 52245
5630 52245 -39016 -55087 154161 -231906 223407 310528 -172739 322957 12813 130667 76460
5619 76460 167335 -122524 -210047 -9959 -253055 31714 310688 -463561 -52034 -27250 133074
5607 348847 -67444 -200926 112369 -56857 -205428 -193851 138193 -51658 44731 -204621 120811
5595 318716 -103021 -60429 -210226 -19576 100851 -201781 -55319 129782 448127 -206842
5584 -9105 219729 -22511 4301 -196347 -21058 76560 -26968 82277 277160 -109104 -111176 -68269
5572 -68269 387005 -217408 -203292 -210742 -1661 72114 52841 -252665 247925 -218387 135384
5560 -17083 208864 30222 -315085 -120493 -136511 -58887 -77761 203224 -95588 -494 -41650
5549 -41650 -90417 -119064 334845 -209395 238885 -268245 -312617 -67638 -357756 -296710 314492
5537 -198372 163696 40283 -215499 -138824 95627 75850 -86713 -65472 235626 -29553 140945
5525 -138575 261839 117176 -95678 2913 -522645 -57108 121801 -338875 -110895 193279
5514 -58041 185639 -77378 -196328 64830 -313539 240238 -6093 -66402 -48756 -31329 49 -95433
5501 -78631 -219942 -58652 106982 112541 28831 88730 360326 -351718 149972 -397175 19694
5489 -7097 -111211 -26410 -250330 -185090 274916 159553 -46425 159535 -91250 74604 190748
5478 190748 -86863 135808 -54415 -38655 -32939 -18964 -202358 -39640 -220819 92031 -152395
5466 -67502 -54732 15635 -201128 -144721 -94031 81929 -93131 130089 190745 -83364 6643 -29102
5453 -274217 -107058 342574 -194845 -84036 235186 -107395 -260707 -270249 -40644 -48562 -19202
5441 136953 361693 198048 86454 -52905 -86673 149039 -132897 416485 13424 -244734
5430 -170355 128434 216320 375183 93068 -172135 -305824 -100469 -998 68316 411521 -104194
5418 359399 -194573 -175526 -232884 -143632 21354 -62634 69744 6682 -160753 -56446 -127067
5407 -127067 142222 -175632 64795 -61152 207672 -76749 -225448 -336112 217469 -148016
5396 76703 156024 21988 -7551 -113639 -43879 47972 258244 -53792 -136487 -114730 119937
5384 30807 293376 184598 -195767 109474 -96083 64206 49500 -32040 -36707 -387801 150630
5372 117250 -6236 201052 -65077 -68152 -133705 149469 -93357 140026 141201 -13117 126526
5360 -60938 230954 -17349 192028 51160 8124 16457 -337721 62395 184973 -5649 181032
5348 131623 -55014 -299143 23488 -98828 -271925 -65410 -120933 4082 70136 -367681 311512
5336 49862 121989 337033 -4154 -144253 -46859 -203022 -163323 -309743 238412 178468 -13225
5324 370469 93081 170378 -135892 -352376 -116925 5373 -113807 138055 79113 48340 -31849
5312 27378 -90905 256767 -90917 191041 -100136 45806 54770 50464 81762 -123793 -10547
5300 -209390 97844 86560 -252238 122923 -43232 -146008 182862 -108689 -182150 194025
5289 172404 -81144 -116308 351145 90724 -134386 -12244 -68916 366678 -107985 28779 74888
5278 74888 -160276 70754 -232983 -122964 34672 261321 -177258 213592 42923 -169950
5267 -41560 193638 -114131 107655 134645 -69876 83356 -98202 -385421 -131090 45130 9328
5255 63819 136334 156576 214558 216311 35631 139490 -150449 121776 9083 -234455 -97216
5243 59487 -491091 -163512 -23579 -128426 -283556 -156917 -75789 -255164 -75677 -52236 -12042
5231 129366 -313801 48117 -6757 72002 -128581 18988 -32078 -122307 229216 132978 -279568
5219 -112952 80267 -102939 147775 84255 -2279 -31180 184920 -12964 271928 231066 78143
5207 -40267 -79942 181178 88754 -244864 290919 16635 7878 -10045 -156233 -11537 180315
5195 129380 90128 116435 -7575 -326365 -85757 141631 -32441 -151128 -245531 -166011 -82628
5183 140691 31399 -115783 76357 106851 -13329 195408 59747 78705 172774 36161 -212760
5171 -161132 12065 -9860 38629 224222 -100813 -144879 -216986 -252110 -79817 -363959 -79735
5159 267014 297498 -211300 121506 -211094 58212 -48740 -529120 219054 106534 275239
5149 275239 45263 17741 -254505 288906 108502 -46957 -106238 1668 95468 -192215 -124070
5138 -124070 263795 -110012 74811 91463 363835 76280 -74667 51329 -193217 59947 -260428
5126 83719 -64660 96975 -63000 -48741 86686 61392 -20244 121976 -355767 206608 225571
5115 225571 355064 -93119 138926 355169 424022 -23742 128738 -142047 163881 63095
5104 10231 113526 4284 -222482 117021 88643 -80941 -98153 -401834 -114607 140869 310958
5093 310958 -291341 43288 108879 62955 -149844 -13728 -266170 -187596 187896 -107139 207203
5081 -243128 65261 57850 176773 274499 -90587 -87939 -47530 -124879 61859 -258140 -150803
5070 -150803 -50217 81966 -287716 83931 41103 119198 108311 -216334 -78324 13177 183788
5059 183788 -60409 33279 -138000 3415 -52142 117495 -2430 -96260 152187 146137 59281 -228720
5046 -265253 233169 -106976 214884 101464 173251 -290165 -59274 -105462 98599 -223738
5035 -190596 96202 265994 159968 67834 38234 -116553 -405690 182781 126333 -65602 -127004
5024 -127004 361883 16503 102032 -129411 -9082 -10018 -28045 69439 109708 -207031 85578 29447
5011 -26353 -512149 20679 93518 -190500 -82455 -4648 -56053 -35469 90546 -359316 93076
4999 -63961 -19466 9245 -153443 223946 129991 -272567 124482 2975 75417 -6531 129239
4987 27458 120343 -169260 -260021 -74059 33422 119140 75652 -138539 -98352 -4358 -58044 -71634
4975 -71634 -239067 135285 -116168 143227 237855 357207 -106715 -42932 -77331 230744
4964 128406 -32646 394999 65280 -269750 -193358 92142 -205010 -12125 169261 102670 -67622
4952 348549 -33878 86855 62908 82566 232150 42615 25291 114688 -77026 265270 57624
4940 -117017 226203 148079 294233 -55542 -190235 22320 199775 -159947 -87670 420676
4929 143781 209612 -116889 -101725 178497 278209 102537 -54005 -16311 69608 48465 -5885
4917 12834 -196616 -142492 -53328 206139 -70223 -82472 74853 -241563 55798 -168563 -28167
4905 -133107 -245684 -120356 414785 216602 -141469 -62446 208193 -360394 -54333 -181879
4895 -181879 -344364 115854 353735 -225503 112090 146696 92004 -109610 300246 32982
4884 -104154 430622 -235942 -27889 78251 -46419 280199 100540 -24524 174356 217313 359549
4873 359549 175953 -168623 -180986 138012 -52329 195776 57673 -121631 74860 -94246 186569
4861 -173396 -43178 -112370 -69123 211470 -9126 142545 -63289 79090 57061 282159 -41203
4849 114632 134757 479285 -82280 94122 196160 -27840 273107 -65910 176079 -249347 -151546
4838 -151546 -342 -18806 29600 -321697 61384 141681 -158968 65236 -50581 3830 480375 -186410
4825 253502 109207 271509 -166684 368793 -124495 239121 20730 200992 -10903 334038
4814 -44752 -73489 -141912 -111872 -225236 -184548 278150 279985 115925 7292 -320702 28224
4802 -124195 223585 49025 -145580 146646 151282 106271 -59627 228175 -75108 -225289 56578
4790 -226668 -253530 -166284 321686 -6600 -39490 -169977 258339 76502 -25815 114637 390023
4779 390023 6921 131492 202382 -25248 63732 48090 -380488 -158325 153853 -112759 112275
4767 -176410 264049 3717 129908 347951 114711 -127765 6063 -154285 -49985 -288988 155627
4755 381490 367745 -159632 60718 -101336 27993 81426 -308590 -36358 -17434 -27118 81936
4743 36853 -121252 76889 -187647 -124437 71254 -158242 158116 164903 307123 -74766 -46246
4732 -46246 -89558 -206812 20518 159753 113239 -218191 -297968 81673 -153445 350567 -36038
4720 -80165 -24889 -194392 138138 87308 -18268 36141 -214213 -31503 -63733 20784 -41656
4708 -44112 -239097 115854 359489 230800 -7226 97246 -4422 9189 270102 37103 55668
4697 55668 -174448 53934 -102164 86266 -32515 -125182 62633 -64232 133975 -162734 -106116
4686 -106116 -189020 -130138 3899 -249676 95001 -149158 -171698 64517 -64889 60014 93523
4675 93523 30688 -81831 33897 -78864 417400 -218245 54553 611410 -83129 295585 248963
4664 248963 176526 51292 -35784 167320 90306 -198651 -75229 271020 36552 -203359 -764
4652 -268235 165316 -264909 87470 -286826 -88049 26931 58391 82105 -294156 72659 19763
4640 348077 81195 40836 48876 -139185 -71881 -153910 189900 -91791 145785 22586 181061
4629 181061 89053 -128548 -4752 -73119 230137 -47725 148315 -30794 -105007 117472 130707
4618 130707 125474 8668 187000 105816 53097 -46821 -114647 278544 96306 -111102 56398
4606 56521 -103496 -236886 236590 -115009 66127 46408 -11275 -109021 -144365 -476414 -199449
4594 -5129 -6292 154631 -242553 -107651 -139887 212958 321378 96305 -256519 38444 35793
4583 35793 399864 161232 -150789 -1195 81267 10255 96932 -89123 115410 21127 6997
4571 -107801 -100016 -244981 -71964 214766 266231 57780 -125446 -43638 160925 95391 19507
4559 82515 -173550 3118 243207 117304 177102 255515 230957 -101345 85978 193412 56534
4547 -18527 -4594 136626 219808 303669 183760 -282005 125598 -317005 176382 -155033 -182202
4536 -182202 39879 105194 -30650 201871 61387 -176238 184382 237991 93634 292146 -167793
4524 -212521 254758 30198 139225 32063 30635 137540 -176030 19437 13993 -188042 -97252
4513 -97252 -56957 -140262 143265 1702 -133623 149519 -7928 57171 -8399 -363207 -281598 186113
4500 381444 -58747 81621 -71969 -484382 -248557 34539 40014 -219830 170556 -60112 317318
4488 -193811 295628 77645 -124142 -182842 311654 -117767 127470 -14259 -50724 18603 -140476
4476 273696 16379 151221 -119998 14762 225186 124320 63708 -50150 -167993 321198
$$ [...]
##END NTUPLES=NMR SPECTRUM
##END=
