
##TITLE=AC1077_TOSA02_5803164_2MKO4a5k6d
##JCAMPDX= 6.0         $$ Bruker NMR JCAMP-DX V2.0
##DATA TYPE= NMR SPECTRUM
##DATA CLASS= NTUPLES
##ORIGIN= BRUKER
##OWNER= Administrator
$$ 1.72 TOPSPIN		Version 2.1
$$ 2012-03-22 18:37:03.921 -0500  Administrator@TOPSPIN
$$ Compression mode = diff/dup
##.OBSERVE FREQUENCY= 400.13188235
##.OBSERVE NUCLEUS= ^1H
##.ACQUISITION MODE= SIMULTANEOUS (DQD)
##.ACQUISITION SCHEME= undefined
##.AVERAGES= 64
##.DIGITISER RES= 22
##SPECTROMETER/DATA SYSTEM= spect
##.PULSE SEQUENCE= noesygpps1d.comp
##.SOLVENT NAME= COFFEE_meoh
##.SHIFT REFERENCE= INTERNAL, COFFEE_meoh, 1, 14.98061
##AUDIT TRAIL= $$ (NUMBER, WHEN, WHO, WHERE, PROCESS, VERSION, WHAT)
$$ ##TITLE= Audit trail, TOPSPIN		Version 2.1
$$ ##JCAMPDX= 5.01
$$ ##ORIGIN= Bruker BioSpin GmbH
$$ ##OWNER= Administrator
$$ $$ C:\Bruker\TOPSPIN/data/DARMN/nmr/AC1077_TOSA02_5803164_2MKO4a5k6d/12/pdata/1/auditp.txt
$$ ##AUDIT TRAIL=  $$ (NUMBER, WHEN, WHO, WHERE, PROCESS, VERSION, WHAT)
(   1,<2012-03-22 18:36:59.265 -0500>,<Administrator>,<TOPSPIN>,<go>,<TOPSPIN 2.1>,
      <created by zg
	started at 2012-03-22 18:25:27.640 -0500,
	POWCHK enabled, PULCHK disabled,
       configuration hash MD5:
       1A 1E CE 29 27 FD 77 03 67 4E F0 E3 C4 B2 CB 90
       data hash MD5: 64K
       A9 23 04 49 E5 F9 F5 59 5B 73 22 FD 1E 81 6C 42>)
(   2,<2012-03-22 18:37:02.000 -0500>,<Administrator>,<TOPSPIN>,<proc1d>,<TOPSPIN 2.1>,
      <Start of raw data processing
       efp LB = 0.3 FT_mod = 6 PKNL = 1 PHC0 = 0 PHC1 = 0 SI = 128K 
       data hash MD5: 128K
       EE D0 4B 48 CA EE F9 93 91 B1 F3 49 F4 39 B2 ED>)
(   3,<2012-03-22 18:37:03.156 -0500>,<Administrator>,<TOPSPIN>,<proc1d>,<TOPSPIN 2.1>,
      <pk PHC0 = 34.51355 PHC1 = 0 
       data hash MD5: 128K
       A2 74 F4 9A D3 9E BD 9F 0C 41 C3 77 1E BE 89 CC>)
(   4,<2012-03-22 18:37:03.406 -0500>,<Administrator>,<TOPSPIN>,<proc1d>,<TOPSPIN 2.1>,
      <abs ABSG = 1 
       data hash MD5: 128K
       07 9F BA 2B BF D2 40 80 EA 34 D8 48 AF C3 F3 55>)
(   5,<2012-03-22 18:37:03.531 -0500>,<Administrator>,<TOPSPIN>,<proc1d>,<TOPSPIN 2.1>,
      <abs ABSG = 2 
       data hash MD5: 128K
       B5 A3 69 E3 F6 D4 00 B7 74 64 1E 5D 93 87 B1 47>)
(   6,<2012-03-22 18:37:03.703 -0500>,<Administrator>,<TOPSPIN>,<proc1d>,<TOPSPIN 2.1>,
      <abs ABSG = 3 
       data hash MD5: 128K
       C3 F4 77 EA AF 35 6D A4 7B 2E B5 AA 34 41 95 A2>)
(   7,<2012-03-22 18:37:03.781 -0500>,<Administrator>,<TOPSPIN>,<proc1d>,<TOPSPIN 2.1>,
      <abs ABSG = 4 
       data hash MD5: 128K
       65 97 BA 18 0E A6 6C F9 26 0C 1C 44 53 8F D4 B8>)
(   8,<2012-03-22 18:37:03.828 -0500>,<Administrator>,<TOPSPIN>,<proc1d>,<TOPSPIN 2.1>,
      <abs ABSG = 5 
       data hash MD5: 128K
       DD B4 B4 88 E4 44 4B 0A D0 A4 C2 23 6D D0 74 EB>)
$$ ##END=
$$ 
$$ $$ hash MD5
$$ $$ 31 78 4E 49 2E C5 9F AD 7F 71 48 73 E2 E8 19 9C
##$RELAX= 
##$RELAX= 
##$RELAX= 
##$RELAX= 
##$RELAX= 
##$RELAX= 
##$RELAX= 
##$RELAX= 
$$ Bruker specific parameters
$$ [...]
150 150 150 150 150 150 150 150
##$TP07= 0
##$TPNAME0= <>
##$TPNAME1= <>
##$TPNAME2= <>
##$TPNAME3= <>
##$TPNAME4= <>
##$TPNAME5= <>
##$TPNAME6= <>
##$TPNAME7= <>
##$TPOAL= (0..7)
0.5 0.5 0.5 0.5 0.5 0.5 0.5 0.5
##$TPOFFS= (0..7)
0 0 0 0 0 0 0 0
##$TUNHIN= 0
##$TUNHOUT= 0
##$TUNXOUT= 0
##$USERA1= <user>
##$USERA2= <user>
##$USERA3= <user>
##$USERA4= <user>
##$USERA5= <user>
##$V9= 5
##$VALIST= <valist>
##$VCLIST= <CCCCCCCCCCCCCCC>
##$VD= 0
##$VDLIST= <DDDDDDDDDDDDDDD>
##$VPLIST= <PPPPPPPPPPPPPPP>
##$VTLIST= <TTTTTTTTTTTTTTT>
##$WBST= 2048
##$WBSW= 25
##$XGAIN= (0..3)
0 0 0 0
##$XL= 0
##$YL= 0
##$YMAX_a= 12605403
##$YMIN_a= -6039231
##$ZGOPTNS= <>
##$ZL1= 120
##$ZL2= 120
##$ZL3= 120
##$ZL4= 120
##$ABSF1= 14.98061
##$ABSF2= -5.57192
##$ABSG= 5
##$ABSL= 3
##$ALPHA= 0
##$AQORDER= 0
##$ASSFAC= 0
##$ASSFACI= 0
##$ASSFACX= 0
##$ASSWID= 0
##$AUNMP= <proc_prof1d_extract.lims>
##$AXLEFT= 0
##$AXNAME= <>
##$AXNUC= <1H>
##$AXRIGHT= 0
##$AXTYPE= 0
##$AXUNIT= <>
##$AZFE= 0.1
##$AZFW= 0.1
##$BCFW= 0
##$BC_mod= 0
##$BYTORDP= 0
##$COROFFS= 0
##$CY= 15
##$DATMOD= 1
##$DC= 0
##$DFILT= <>
##$DTYPP= 0
##$F1P= 0
##$F2P= 0
##$FCOR= 0.5
##$FTSIZE= 131072
##$FT_mod= 6
##$GAMMA= 0
##$GB= 0
##$INTBC= 1
##$INTSCL= 1
##$ISEN= 128
##$LB= 0.3
##$LEV0= 0
##$LPBIN= 0
##$MAXI= 10000
##$MC2= 0
##$MEAN= 0
##$ME_mod= 0
##$MI= 0
##$NCOEF= 0
##$NC_proc= -3
##$NLEV= 6
##$NOISF1= 0
##$NOISF2= 0
##$NSP= 0
##$NTH_PI= 0
##$NZP= 0
##$OFFSET= 14.98061
##$PC= 1
##$PHC0= 34.51355
##$PHC1= 0
##$PH_mod= 1
##$PKNL= yes
##$PPARMOD= 0
##$PPDIAG= 0
##$PPIPTYP= 0
##$PPMPNUM= 2147483647
##$PPRESOL= 1
##$PSCAL= 4
##$PSIGN= 0
##$PYNMP= <proc.py>
##$REVERSE= no
##$SF= 400.13
##$SI= 131072
##$SIGF1= 0
##$SIGF2= 0
##$SINO= 400
##$SIOLD= 131072
##$SPECTYP= <>
##$SREGLST= <1H.CDCl3>
##$SSB= 0
##$STSI= 131072
##$STSR= 0
##$SW_p= 8223.68421052632
##$SYMM= 0
##$S_DEV= 0
##$TDeff= 65536
##$TDoff= 0
##$TI= <>
##$TILT= no
##$TM1= 0
##$TM2= 0
##$TOPLEV= 0
##$USERP1= <user>
##$USERP2= <user>
##$USERP3= <user>
##$USERP4= <user>
##$USERP5= <user>
##$WDW= 1
##$XDIM= 131072
##$YMAX_p= 429112013
##$YMIN_p= -26584
##$CURPLOT= <Network HP LaserJet P1505>
##$CURPRIN= <$Network HP LaserJet P1505>
##$DFORMAT= <normdp>
##$LAYOUT= <+/1D_H.xwp>
##$LFORMAT= <normlp>
##$PFORMAT= <normpl>
##$SURQMSG= 1
$$ End of Bruker specific parameters
$$ ---------------------------------
##NTUPLES= NMR SPECTRUM
##VAR_NAME=  FREQUENCY,     SPECTRUM/REAL,   SPECTRUM/IMAG
##SYMBOL=    X,             R,               I
##VAR_TYPE=  INDEPENDENT,   DEPENDENT,       DEPENDENT
##VAR_FORM=  AFFN,          ASDF,            ASDF
##VAR_DIM=   131072,        131072,          131072
##UNITS=     HZ,            ARBITRARY UNITS, ARBITRARY UNITS
##FACTOR=    0.0627417313425165, 1,          1
##FIRST=     8223.62146879498, 3748,         -85039
##LAST=      0,             7178,            -85477
##MIN=       0,             -26584,          0
##MAX=       8223.62146879498, 429112013,    0
$$ Real data points
##PAGE= N=1
##DATA TABLE= (X++(R..R)), XYDATA
$$ [...]
67034 411316 415773 419499 422296 424982 428775 434091 440103 445340 448638 449893 450284 451606 454924 459830
67020 459830 465224 470588 476102 481748 487079 491971 496880 502043 506983 511166 514693 517973 521162 524342
67006 524342 527832 531856 536262 541032 546607 553157 559935 566029 571382 576306 580426 583266 585802 590087
66992 590087 596816 604269 610311 614751 618981 624027 629942 636804 645054 654563 664092 672206 678452 683451
66978 683451 688202 693568 700035 707523 715631 724435 734737 746799 758926 768385 774389 779521 787242
66965 787242 798254 810237 820946 830323 839263 847775 855539 863417 872989 884533 896634 907993 918812
66952 918812 930125 942492 955801 969723 983718 996918 1008657 1019251 1029940 1041886 1055236
66941 1055236 1069188 1082925 1096411 1110056 1123697 1136406 1147847 1159500 1173671 1191043 1209776
66930 1209776 1227438 1243403 1258906 1275156 1292183 1309469 1326818 1344123 1360824 1376411 1391457
66919 1391457 1407469 1425421 1444935 1465237 1486370 1508786 1532058 1554993 1577159 1599460 1622734
66908 1622734 1646518 1669877 1693024 1717260 1743302 1770307 1796687 1821607 1845625 1870086 1895871
66897 1895871 1922581 1949057 1974895 2001197 2029456 2059837 2090943 2121221 2150361 2179359 2209536
66886 2209536 2241455 2274531 2307724 2340654 2373836 2407670 2441563 2474487 2506247 2537802 2570381
66875 2570381 2604501 2639728 2675201 2710518 2746197 2783015 2820837 2858673 2896042 2933598 2972027
66864 2972027 3011127 3050609 3090966 3132519 3174129 3214077 3252033 3289132 3326247 3363293 3400188
66853 3400188 3437329 3474819 3512105 3548644 3584212 3618425 3650860 3681861 3712503 3743501 3774718
66842 3774718 3805671 3835740 3864013 3890022 3914754 3939778 3965156 3989293 4011091 4030984 4049376
66831 4049376 4065469 4078571 4089496 4099699 4109735 4119375 4128370 4136226 4142007 4145279 4146617 4146347 4143558
66818 4143558 4137377 4128513 4118445 4107616 4095551 4082274 4068307 4053496 4037031 4018569 3998357 3976298
66806 3976298 3951960 3925550 3897977 3869913 3841489 3812820 3783988 3754573 3724018 3692331 3659643
66795 3659643 3625356 3588881 3551040 3513486 3476611 3439284 3400932 3362566 3325171 3288296 3251044
66784 3251044 3213498 3176217 3138936 3100696 3060933 3019818 2977953 2936292 2895875 2856918 2818534
66773 2818534 2779894 2741194 2702855 2664400 2625202 2585991 2548355 2512680 2477701 2442379 2407126
66762 2407126 2372578 2338253 2303443 2268872 2236190 2205862 2176557 2146741 2115948 2084191 2051251
66751 2051251 2017491 1984721 1955028 1928680 1903988 1879337 1854584 1830189 1805787 1780253 1752933
66740 1752933 1724478 1696635 1671285 1649142 1628952 1608427 1586379 1563693 1541858 1521082 1500461
66729 1500461 1479516 1458583 1437753 1416434 1394337 1372244 1351269 1331852 1313907 1297558 1283016
66718 1283016 1269766 1256547 1242434 1227571 1212547 1197409 1181803 1165941 1150745 1136753 1123384
66707 1123384 1109616 1094954 1079356 1062784 1045476 1028352 1012422 998011 985153 974208 965041
66696 965041 956044 945429 933510 922199 912050 901493 889606 877831 867753 858713 849141 839052
66684 839052 829519 820658 811964 803885 797042 790297 781810 772032 763547 757450 751741 743963 733770 722186
66670 722186 710001 698065 687827 680213 674602 669851 665571 661544 656746 650183 642369 635034 629508
66657 629508 625874 623182 619803 614217 606380 598091 591240 585963 581160 576375 572188 568840 565499 561182
66643 561182 555793 549948 544134 538213 531568 523691 514928 506658 500519 497253 496191 495719 494231 490907
66629 490907 485835 479487 472373 465357 459769 456340 454099 451252 447344 443644 441091 438867 435785 432209
66615 432209 429522 428018 426371 423168 418244 412497 406985 402260 398152 394122 390039 386397 383489 380702
66601 380702 377144 372793 368599 365591 364262 364551 365751 366484 365334 361813 356570 350766 345418 341131 338031
66586 338031 335832 334113 332537 330913 329261 327746 326173 323681 319650 314934 311316 309477 308465 307519
66572 307519 307173 307789 308220 307230 305326 303753 302392 300316 297921 296586 296224 295119 292564 289928 288477
66557 288477 287678 286467 284763 282807 280394 278004 277403 279484 282219 282410 279259 274845 271247 268621 266282
66542 266282 264228 262855 261962 260754 258624 255709 252992 251900 253176 255890 257967 258021 256358 254094 251826
66527 251826 249533 247245 245169 243335 241749 240929 241598 243389 244342 242411 237608 232170 228485 227229 227707
66512 227707 229181 231050 232158 231204 228190 224565 221448 218498 215093 211810 209690 208566 207319 205695
66498 205695 204649 204767 205471 206263 207627 209870 211941 212508 211745 210871 210147 208573 205809 203206 202208 202495
66482 202495 202530 201528 200081 199044 198588 198345 197680 195678 191687 186372 181714 179282 178731 178517 177852 177251
66466 177251 177176 177082 176284 175123 174486 174408 174031 173048 172361 172755 173493 173092 171437 170265 171216 173914 176389 177007
66448 177007 175528 172738 169891 168436 169309 171854 173994 174084 172434 170561 169188 167629 165032 161410 157279
66433 157279 153070 149461 147654 148388 150785 152883 153475 152913 152120 151532 151219 151273 151518 151396 150810 150561 151136
66416 151136 151461 150024 147245 145496 146289 148377 149351 148370 146522 145046 144249 143966 144125 144623 145212 145648 145623
66399 145623 144687 142740 140512 138985 138288 137666 136576 135310 134473 134387 135108 136511 138109 139146 139126 138090
66383 138090 136484 135026 134515 135227 136485 137301 137408 137261 137218 137389 138068 139340 140212 139165 136002 132439 130463
66366 130463 130636 132112 133506 133535 131820 129571 128661 129537 130873 131660 132496 134125 135903 136806 137022 137305 137446
66349 137446 136706 135248 133880 132727 131392 130126 129523 129193 128028 125823 123550 121951 120879 120046 119393
66334 119393 118683 117698 116808 116384 115886 114802 114308 116336 120653 124458 125554 124610 123569 123071 122400 120981
66318 120981 118867 116377 114056 112431 111208 109442 107110 105641 106110 107683 108666 108410 107342 105936 104690
66303 104690 104446 105490 106737 106943 106424 106459 107270 107828 107607 107311 107686 108618 109682 110629 111013 110177 108116 105788
66285 105788 104203 103654 104044 105311 107149 108813 109679 109834 109836 110125 110821 111791 112642 112946 112693 112326 112065 111392
66267 111392 109526 106412 103031 100610 99606 99519 99662 99869 100277 100660 100491 99670 98655 97698 96585 95522
66251 95522 95562 97277 99445 100124 99049 97960 98224 99066 98775 97047 95226 94463 94450 94185 93375 92693 92849 93807
66233 93807 94914 95521 95413 94867 94471 94764 95811 97182 98465 99669 100876 101733 101735 101030 100459 100680 101621 102816
66215 102816 103738 103625 101655 97863 93624 90785 90335 91918 94153 95331 94479 92205 90096 89013 88646
66200 88646 88940 90756 94185 97223 97632 95599 93091 90944 88309 85065 82887 83146 85123 87188 88600
66185 88600 89208 88518 86389 84076 83201 83800 84372 83809 82470 81389 81179 81800 82747 83307 83004 81902 80329
66168 80329 78556 77031 76516 77502 79764 82943 86997 91307 93983 93412 90483 87967 87490 88309 89394 91202
66152 91202 94409 98093 100601 101547 101643 101040 99403 97460 96804 97765 98855 98923 98583 98737 98983 98659 98440 99315
66134 99315 100540 100350 98665 97424 97888 99069 99497 99257 99350 100113 101374 103320 105851 107536 106725 103781
66118 103781 101000 100016 100313 100726 101394 103376 106831 110463 112771 113381 113050 112643 112218 111100 108853 106047
66102 106047 103805 102635 102042 101374 100648 100272 100252 100037 99041 97129 94650 92207 90327 89150 88358 87472 86234
66085 86234 84782 83626 83447 84712 87299 90496 93421 95408 96102 95468 93852 91861 90012 88460 87110
66070 87110 85868 84747 83789 82896 81726 79909 77632 75986 76269 78670 81911 84545 86380 88070 89396
66055 89396 88813 85402 80797 78202 79230 82407 85139 86385 86718 86445 85042 82535 80162 79040 79053 79694
66039 79694 81106 83266 84750 83711 80208 76501 74685 74774 75396 75687 75988 77124 79388 81985 83292 82096
66023 82096 78870 75519 73650 73381 73955 74939 76373 78209 80219 82307 84400 86023 86442 85351 83300
66008 83300 81392 80635 81341 82948 84484 85410 85924 86331 86448 86037 85642 86356 88461 90832 92166 92610 93410
65991 93410 94807 95076 92509 87994 84563 84123 85628 87074 88302 90568 93844 96203 96283 95085 94508 94909
65975 94909 95074 94101 92340 90595 89245 88326 87880 88003 88880 90835 93897 97177 99165 99085 97774 96800 96782
65958 96782 96967 96509 95649 95329 95998 97302 98613 99244 98303 95350 91459 88698 87960 88097 87786 87291 87296 86901
65940 86901 84524 80635 77881 78064 80218 82147 82608 81565 79630 78129 78536 80744 82673 82601 81158 80089
65924 80089 79836 79585 79096 79116 80161 82063 84574 87301 89234 89514 88767 88499 89063 89342 88696 87934 87843 87853
65906 87853 87038 85722 85133 85810 87062 87841 87591 86391 84813 83684 83621 84623 86242 88114 90265 92813
65890 92813 95394 96926 96338 93778 90828 89115 88836 89053 89186 89565 90570 91956 93299 94568 96013 97775
65874 97775 99788 101741 103142 103855 104562 106019 107750 108200 106583 104011 102321 102247 103224 104470 105518 105872
65858 105872 104963 102688 99645 96697 94444 93064 92345 91847 91290 90925 91440 93330 96303 99282 101069 101186
65842 101186 100186 99177 99099 100339 102636 104985 105887 104307 100645 96550 93643 92495 92660 93290 93664 93591
65826 93591 93515 94072 95361 96766 97520 97340 96581 95802 95004 93297 89964 86180 84828 87601 92740 96781
65810 96781 98195 97934 96695 93749 89117 84917 83059 82964 83220 84465 88631 95670 102933 107928 110142
65795 110142 109979 107666 104017 100939 99910 100408 100524 98825 95240 90858 87522 87102 90202 95402 100196
65780 100196 102868 103528 103609 104433 105980 106953 106339 104788 103898 104184 104595 104312 104017 104639 105551 105077 102641 99602
65762 99602 97941 98590 100881 103025 103320 101614 99644 99422 101286 103928 106049 107216 107337 106379 104807 103382
65746 103382 102180 100715 99420 99896 102834 106565 108728 108892 108459 108444 108720 109413 111484 115264 119362 121912
65730 121912 122421 121796 120977 120162 119164 117899 116478 115117 113904 112549 110513 107580 104175 101061 98930
65715 98930 98332 99538 102179 105295 107968 109716 110282 109579 108143 107012 106669 106427 105328 103296 100943 98667
65699 98667 96537 94728 93442 92617 92238 92546 93246 93019 90938 88154 86985 88115 89825 90247 89196 87260
65683 87260 84379 80555 77228 76474 78783 82538 85837 88045 89398 89950 89561 88549 87674 87339 87204 86750
65667 86750 85919 84944 83787 82301 80906 80422 80920 81317 80620 79111 77662 76369 74828 73572 74042 76823
65651 76823 80710 83972 85905 86751 86763 86011 84878 84199 84697 86123 86919 85254 81076 76800 75063 75956
65635 75956 77463 78439 79689 81878 84092 85378 86268 87559 88722 89045 89468 91535 94815 97098 97279 96640
65619 96640 96845 97835 98371 97820 96632 95353 93853 91782 89608 88740 90117 92808 94848 95639 96526 98518
65603 98518 100579 101123 100197 98905 97478 95442 93178 91575 90288 88131 85357 83900 84830 86945 88428
65588 88428 88648 87813 86174 84358 83379 83355 83122 81925 80686 80702 81772 82570 82353 81484 80713 80798 82402 85427
65570 85427 88528 90045 89642 88727 89177 91657 94940 96924 96682 95480 95246 96238 97088 96965 96377 95705 94485
65553 94485 92873 92288 93463 95066 95584 95484 95999 96703 96151 94382 92781 91609 89611 86371 83228 81245
65537 81245 79858 78405 77579 78217 79631 80349 79968 79174 78335 77156 75687 74737 74953 75922 76457 75720 74092
65520 74092 72934 73277 74643 75511 75049 73991 73541 73939 74557 74996 75312 75354 74705 73486 72496 72152 71856 71042
65502 71042 70436 71377 73838 75980 76196 74959 74059 74472 75810 77533 79590 81690 82971 83016 82481 82174 82032
65485 82032 81644 81282 81644 82862 84379 85603 86052 85201 83107 81123 81045 83174 85790 86810 85612 83091
65469 83091 80443 78305 76852 76269 76827 78356 79846 80115 79171 78451 79289 81525 84026 86037 87303 87421
65453 87421 86250 84839 84811 86521 88714 90252 91245 92131 92610 92337 92037 93085 96045 100094 103757 105994
65437 105994 106849 107272 108063 108862 108600 107083 105552 105292 106226 107315 107898 108149 108612 109830 112095 114970 117280
65420 117280 118156 117952 117634 117456 116852 115607 114476 114395 115481 117060 118403 119208 119556 119703 119960 120584 121500
65403 121500 122010 121051 118130 114053 110392 108074 106731 105352 103179 99974 96112 92781 91567 93168 96583
65388 96583 99826 101275 100214 96756 91896 87410 84946 84931 86471 88099 88472 86960 84215 81918 81174
65373 81174 81298 80905 80088 80475 82904 86045 88044 88753 89389 90429 91039 90583 89599 88729 87609 85668 83530
65356 83530 82547 83066 84215 85569 87789 90935 93233 92852 90434 88493 88299 88582 87549 85122 82755 82065
65340 82065 83965 88107 92537 94949 95092 95043 96297 97730 97688 96944 97614 99646 100593 99212 97269 96870 97591
65323 97591 97521 96119 94674 94437 95605 97963 101448 105816 110382 114353 117193 118796 119629 120602 122356 124704
65307 124704 127051 129231 131638 134649 138295 142492 147242 152554 158350 164447 170479 175946 180557 184469
65293 184469 187901 190565 191844 191638 190762 190217 190087 189323 186727 182170 176817 172110 168497 165210 161190
65278 161190 156112 150466 144848 139399 133949 128576 123858 120499 118690 117893 117285 116357 115056 113480 111609
65263 111609 109351 106784 104229 101995 99995 97816 95380 93322 92243 91668 90460 88444 86857 86714 87452
65248 87452 87903 87935 88022 87658 85597 81775 77785 75073 73683 73160 73503 74482 74993 74209 72837 72294 72925 73869
65230 73869 74392 74500 74369 73970 73332 72630 71993 71592 71760 72544 73391 73844 74249 75074 75849 75694 74805 74357 74768
65211 74768 75108 74688 74291 75109 77042 78815 79405 78693 77008 74797 72769 71729 72045 73420 75217 76742
65195 76742 77385 76945 76003 75696 76869 79388 82293 84657 86415 88445 91725 96247 100766 103748 104576 103752
65179 103752 102128 100190 98191 96626 96112 96672 97411 97225 95816 93744 91523 89121 86488 84074 82317
65164 82317 80905 79195 77309 76121 76008 76201 75728 74623 73843 74286 76164 79028 81909 83571 83160 80767
65148 80767 77273 73668 70580 68197 66304 64486 62618 61116 60468 60609 61104 61888 63351 65525 67572
65133 67572 68422 67754 66130 64392 63289 63479 65215 67723 69403 69294 68241 67979 68937 69663 68873 67429
65117 67429 67314 68848 70149 69757 68802 69619 72674 75907 77147 76296 74836 73894 73369 72628 71459 70311
65101 70311 69926 70816 72944 75790 78752 81432 83542 84734 84762 83869 82844 82488 82958 83714 84156 84252 84416
65084 84416 84852 85343 85826 86857 89136 92552 96005 98241 98777 98078 96994 96004 94847 92948 90349 88018
65068 88018 86912 86880 86984 86843 87051 88102 89614 91009 92351 93830 94828 94398 92621 90748 89828 89863 90463
65051 90463 91611 93294 94948 95987 96681 97892 99932 102080 103277 102980 101473 99813 99487 101466 105215
65036 105215 108965 111421 113140 115950 121014 127651 134000 138682 141903 145155 149769 155606 161275 165769
65022 165769 169650 174134 179115 182808 183691 182359 180929 180814 181579 181837 180675 178101 174598 170673 166611
65007 166611 162413 157914 153055 147967 142893 138190 134312 131336 128531 124961 120835 117673 116512 116317
64993 116317 114937 111632 107860 105328 103956 102305 99590 96503 94081 92411 90863 89245 88081 87584
64979 87584 86930 85199 82862 81513 81857 82673 82451 81504 81520 83238 85546 86940 86882 85466 82777 79310 76325
64962 76325 75021 75680 78002 81617 85669 88578 89223 88042 86207 84180 82003 80473 80680 82382 84093
64947 84093 84955 85450 86113 86786 87424 88364 89189 88593 86150 83113 80616 78269 75616 73785 74102 75859 77253
64930 77253 78126 79838 82456 84031 83337 81748 81517 83327 86367 89712 92575 93929 93121 90678 87797
64915 87797 85257 83325 82259 82123 82384 82351 81851 80958 79413 77005 74348 72526 71971 72150 72226 71562 69903
64898 69903 67848 66984 68554 71747 74119 74078 72401 70932 70477 70556 70754 71424 72985 75113 76937 77865 78035
64881 78035 78059 78420 79098 79655 79600 78768 77499 76507 76373 77015 77823 78407 78962 79691 80147 79583 77883 75773 74175
64862 74175 73617 74084 74986 75355 74718 73828 73931 75150 76226 76150 75409 75106 75320 75077 73733 71768 70223 69848
64844 69848 70818 72807 75135 77110 78372 78872 78641 77860 77050 76792 77131 77468 77139 76043 74644 73518 72860
64827 72860 72299 71220 69452 67665 66883 67572 69237 70988 72421 73943 76154 78853 80745 80484 78139
64812 78139 75371 73978 74466 76121 77961 79188 79142 77677 75704 74764 75716 77994 80157 80897 79633 76664
64796 76664 73078 70179 68720 68623 69375 70460 71503 72346 73112 74012 75068 76225 77580 79170 80679 81833
64780 81833 82933 84321 85374 84894 82802 80661 79979 80537 80958 80394 79065 77648 76898 77490 79320 80978
64764 80978 80781 78664 76479 76137 77723 79586 79992 78534 76166 74196 73336 73639 75002 77245 79783 81884
64748 81884 83532 85418 87674 89222 88988 87235 85047 83068 81600 81326 82641 84432 84859 83551 81905
64733 81905 81013 80430 79434 78315 77649 77233 76571 75760 75188 74933 75166 76436 78687 80515 80388 78386 75924
64716 75924 74060 72884 72258 72174 72369 72451 72534 73081 74092 75123 76146 77663 79826 82156 84294 86351 88204
64699 88204 89083 88406 86644 84978 84263 84603 85678 87159 88899 90881 92933 94560 95230 94798 93426 91323
64683 91323 89006 87636 88166 89877 90538 88726 85641 83963 85088 88058 91042 92987 93639 92897 91071
64668 91071 89456 89515 91089 92232 91470 89674 88843 89338 89535 88326 86669 85922 85757 84965 83694 83446 84823
64651 84823 86468 86632 84907 82105 79273 77359 77193 79026 82175 85510 88215 90011 90969 91300 91142 90395
64635 90395 88966 87178 85681 84930 85001 85733 86634 86880 86133 85316 85711 87210 88375 88587 89078 91070 93722
64618 93722 95009 94335 93307 93857 96324 99540 102214 103876 104657 104575 103366 101159 98956 97821 97669 97514
64602 97514 96980 96776 97362 98043 97939 97161 96310 95481 94521 93693 93162 92332 90779 89512 90071 92305 94223 94372
64584 94372 93432 93048 93854 95163 95985 95850 95040 94479 95122 97043 99286 100767 101116 100471 98908 96538 94004
64567 94004 92439 92665 94443 96577 97814 97724 96785 95772 95228 95326 95769 95787 94835 93574 93430 94677 95596 94375
64549 94375 91392 88663 87304 86621 85690 84620 83892 83460 83195 83476 84640 86212 87363 87925 88485 89515
64533 89515 90837 91996 92932 94090 95774 97369 97578 95759 92876 90723 90317 91292 92537 92905 91730 89537
64517 89537 88095 88829 91088 92849 93175 92995 93337 93969 94303 94509 94917 95121 94582 93575 92770 92273 91746 91040
64499 91040 90122 88915 87847 87942 89556 91529 92480 92592 93168 94824 97083 99445 101635 102845 102074 99603
64483 99603 97180 96180 96257 96252 95750 95186 94936 94979 95301 96076 97380 98973 100433 101333 101292 99999 97504 94702
64465 94702 93254 94347 97247 99642 99816 98072 95671 93175 90641 88779 88517 89542 90597 91471 93401
64450 93401 96871 100184 101284 100325 99353 99659 100494 100475 99380 98098 97341 97014 96807 96943 97913 99534 100673
64433 100673 100198 97991 94714 90942 87194 84637 84647 87075 89713 90410 89533 89445 91453 94078 94771 92841
64417 92841 90053 88500 88575 89223 89620 90006 91015 92809 95042 97255 98943 99516 98614 96460 93697 90986
64401 90986 88837 87553 87072 87118 87846 90013 94017 98902 102870 104798 104952 104356 103984 104390 105496 106589
64385 106589 107047 107138 107672 108854 110053 110729 110878 110390 108758 105923 102874 100868 100402 101260 103078 105353
64369 105353 107302 108367 108732 108882 108883 108531 108070 108132 108839 109383 108717 106596 103843 101578 100245 99534 99309 100197
64351 100197 102719 106142 109042 110979 112610 113865 113266 109974 105637 102953 102701 103309 103133 102089 101035
64336 101035 100655 101211 102507 103718 103966 103415 103132 103556 103845 103213 102224 102035 102805 103651 103987 104161 104754 105872
64318 105872 107304 108836 110175 110895 110900 110725 110975 111468 111346 110209 108768 108020 107997 107841 107049 106101 105794 106554
64300 106554 108625 112109 116163 118796 118535 116238 114439 114761 116578 118216 118694 118088 116899 115548 114167
64285 114167 112658 111187 110500 111168 112537 113226 112851 112403 112665 113204 113521 114168 115765 117600 118415 118302 118686
64268 118686 120431 122851 124733 125532 125440 124992 124880 125589 126944 128261 128932 128604 127175 125281 124440 125713
64252 125713 128228 129999 130283 130140 130566 131343 132224 133875 136705 139755 141880 143367 145278 147798 150469
64237 150469 153594 158005 163397 168108 170758 171238 170049 167744 165284 163925 164280 166054 168888 172663 176874
64222 176874 180629 183633 186283 188531 189796 190508 192487 196717 201675 204967 206046 206219 206663 207746 209820
64207 209820 213028 216224 217465 215981 212689 208527 203427 197362 191309 186294 182211 178418 175055 172969
64193 172969 172474 172833 173018 172719 172539 173280 174947 176543 177115 176832 176607 176849 177360 178362 180544 183732 186542
64176 186542 188090 189287 191569 194971 198366 201217 204006 207173 210577 214075 217724 221254 224010 225641
64162 225641 226326 226280 225707 225351 226233 228331 229998 229312 225949 221478 217931 216201 215598 214722 212822 210450
64146 210450 208814 208603 209545 210910 212148 213110 213917 214638 214948 214391 213234 212596 213159 214057 213875 212603 211639
64129 211639 211820 212520 213044 213828 215605 218237 221187 224379 227636 229894 230192 229247 228915 230089 232101 234184
64113 234184 236339 238452 239760 239890 239570 239493 239190 237991 236719 237307 240749 246251 252407 258301 263220 266331
64097 266331 267515 268119 270077 274262 280115 286731 293780 301353 309583 318749 329377 341777 355594 370151
64083 370151 385160 400746 416739 432319 446622 459442 470994 481001 488460 492573 493654 492683
64071 492683 490076 485374 478365 469985 461589 453539 444999 435147 424131 412869 402346 393191 385391
64058 385391 378178 370634 362667 355094 348567 342907 337781 333392 329891 326625 322868 319186 317219 317937
64044 317937 320664 323875 326386 327736 328189 328782 330850 334997 340685 347012 353679 361165 370326 381832
64030 381832 395433 409553 422167 432450 441280 450043 459455 469625 480271 490238 497610 501316 502289
64017 502289 502209 501472 499288 495486 490921 485959 479754 471635 462345 453291 445151 437883 431554 426363 422041
64002 422041 417993 414048 410633 408253 407229 407735 409464 411327 412372 413309 416272 422297 429606 435406 439292
63987 439292 443744 450984 460450 470202 479971 491448 505670 521515 537249 552554 568287 584877
63975 584877 601843 618541 634606 649740 663784 677057 690143 703214 715861 727512 737810
63964 737810 746796 755197 764251 774651 785729 796244 805918 815584 825920 836854 848310 860649
63952 860649 873943 887490 900567 913088 925127 936358 946559 956185 965708 974745 982576 989352
63940 989352 996068 1003438 1011537 1020664 1031815 1045857 1062654 1081394 1101694 1124096 1149561 1178623
63928 1178623 1211200 1247165 1286873 1330764 1378472 1428843 1481210 1536396 1596105 1661558 1733069
63917 1733069 1810623 1894345 1984549 2081924 2187573 2302187 2425111 2554951 2691514 2836865
63907 2836865 2994296 3166729 3356278 3564767 3794067 4046198 4323774 4630571 4971482
63898 4971482 5351838 5776767 6250963 6778802 7364507 8011980 8724063 9501665 10343578
63889 10343578 11246876 12206925 13216727 14266818 15346367 16444049 17546947 18638268
63881 18638268 19696767 20699212 21623929 22452557 23169539 23761286 24216456 24526632 24685974
63872 24685974 24690234 24536930 24227197 23767529 23169591 22448584 21621840 20708069 19726472 18695694
63862 18695694 17633380 16556216 15479543 14416789 13379851 12380011 11427426 10529103
63854 10529103 9688043 8905043 8180901 7516361 6910689 6361460 5865546 5419299 5017926
63845 5017926 4656034 4329352 4035152 3770643 3531941 3315391 3119182 2942511 2783396
63836 2783396 2638311 2504214 2380115 2266185 2161815 2065063 1973771 1886624 1803094 1722877
63826 1722877 1645728 1571549 1500254 1431552 1365302 1302131 1243295 1189514 1140125 1093601 1048773
63815 1048773 1005312 963343 923159 885302 850360 818426 789101 762103 737480 715055 694139
63804 694139 674130 655025 636968 619739 603240 588107 575017 563436 551920 539968 528876
63793 528876 520231 514086 509250 505033 501877 500299 499989 500232 500638 501037 501157 500958 500909 501180 500632 497400 490802
63776 490802 482163 473388 465090 456543 447085 436881 426331 415434 404128 392923 382630 373379 364233
63763 364233 354093 343030 332475 323921 317496 311932 305803 298558 290526 282447 275205 269569 265651
63750 265651 262569 258873 253505 246602 239596 234358 231726 230743 229722 228024 226178 224292 221427 217184
63736 217184 212919 210392 209761 209933 210275 210677 210364 208359 205383 203647 204056 204880 204077 201900 200119 199459
63720 199459 199004 197723 195513 192856 190366 188652 187876 187426 186590 185527 185075 185637 186796 187984 188972 189599
63704 189599 189432 187919 184796 180433 175906 172549 171229 172052 174559 177659 179562 178921 176577 175173 176150
63689 176150 177960 178324 177491 177749 180053 182883 184704 185951 187847 190529 193313 195984 198740 201256 202800
63674 202800 203339 203982 206209 210796 217356 224704 231796 238424 244990 251840 259176 267317 276233 284805 291326
63659 291326 295190 297559 300142 303731 308076 312381 315504 316369 314858 311942 308484 304355 299204 293668
63645 293668 289103 286343 285163 284655 283619 280980 276641 271917 268564 267304 267579 268544 269650 270216 269066
63630 269066 265176 258764 251682 246462 244474 244735 244755 242895 239821 237592 237638 239776 242759 245389 247385
63615 247385 249528 252835 257509 263066 269375 276681 284258 290224 293757 296747 301891 309407 316881 322224
63601 322224 325448 327311 327644 325727 321496 315679 309259 303134 297618 291851 284467 275478 266880 260722
63587 260722 257065 254438 251707 248729 245595 242316 239213 236869 235620 235554 236830 239329 242128 244104 245199
63572 245199 246416 248390 250625 252406 253986 256566 261503 269602 280553 292798 304535 315260 325894
63559 325894 337198 348802 360348 372745 387324 404099 421932 440271 459754 480976 503543
63548 503543 526516 548961 569796 588022 603639 617643 630554 641558 649671 655092 658685 660663
63536 660663 660736 659319 657630 656487 655652 654362 651860 647390 640305 630482 618359 604646 590286 576431
63522 576431 563788 552042 540454 528913 517795 507008 496175 485805 477294 471394 467406 464190
63510 464190 461212 458197 454605 450129 445236 440745 437360 435933 437388 441670 447369 453125 459060 466182
63496 466182 474862 484798 496231 510209 527421 547267 568279 589245 609970 631101 653062 675113
63484 675113 695926 715170 733763 752127 768991 782725 793277 802006 810074 817966 826118 834834
63472 834834 843605 851404 857627 861933 863405 860956 854520 844787 831679 814274 792473 767608 740941
63459 740941 712654 682994 653440 625743 600313 576313 552962 530055 507619 485912 465737
63448 465737 448058 433029 419661 406556 392984 379482 367589 358799 353500 350891 349734 348909 347355
63435 347355 344273 339839 335401 332501 331763 332856 335321 339203 345018 353189 363322 373978 383413 390785
63421 390785 396536 401706 407219 413732 421522 430201 438886 446829 453523 458044 458974 455690 449560 443240
63407 443240 438540 435120 431280 425838 419076 411984 404961 397702 390284 383605 378291 373753 369125 364815
63393 364815 362184 361727 362499 363404 364114 364472 364058 362982 362351 363241 365635 368806 372154 375212 377573 379598
63377 379598 382752 388464 396917 407535 420127 434701 450417 465825 480358 495003 511418 530853
63365 530853 553807 579927 607983 636493 664827 693510 723280 754150 785519 816871 847949
63354 847949 878190 906289 930658 950513 966351 979038 988571 994166 995733 994682 992864 990936 988016
63341 988016 982675 973948 961736 946717 929878 911766 892168 870527 846511 820200 792236 763985
63329 763985 737005 711831 687703 664066 641972 623212 608224 595685 584270 573997 565414 558147
63317 558147 551102 544020 538125 534853 534284 535319 537288 540828 547031 556411 569116 585449 605158 626530
63303 626530 647487 667840 689409 713451 739002 764468 789884 816447 844255 871709 897079
63292 897079 919631 939018 954486 965322 971895 975728 978308 979802 979122 975478 969581 962811 955416
63279 955416 946401 935255 922639 908822 892557 872624 849814 826245 803069 779920 756396 732928
63267 732928 710154 688485 668524 650999 635775 621492 606597 590524 573766 557177 541448
63256 541448 527082 514506 503908 494763 485824 476237 466722 458936 453540 449691 446644 444684 443919 443437
63242 443437 442700 442656 444148 446194 447395 448224 450031 452282 452806 450739 447245 443266 438675 434111 431390
63227 431390 431029 431098 429872 428177 427733 428377 428577 427941 427644 428619 430637 433067 435509 437651 439345 440979
63211 440979 443195 446200 449666 453232 456849 460739 465164 469998 474539 478223 481631 486107 492281 499685
63197 499685 507912 517078 526741 535526 542724 549425 557141 565952 574904 583629 592628 602389 613171 625215
63183 625215 638341 651711 664885 678655 694002 710766 728492 747981 770467 795436 820884
63172 820884 846050 872398 901295 932015 962900 993407 1023913 1054248 1083656 1112007 1139972
63161 1139972 1167951 1195696 1223210 1251230 1280253 1309531 1337604 1363756 1388493 1412481 1435345
63150 1435345 1455573 1471356 1481496 1485924 1485665 1481865 1474418 1461737 1442422 1417013 1387713 1356693
63138 1356693 1325418 1295309 1267757 1242945 1219562 1196447 1174137 1154304 1138088 1125470 1115853
63127 1115853 1108731 1104083 1102598 1105237 1112183 1122462 1134926 1149259 1165714 1184348 1204934 1227185
63115 1227185 1250545 1274164 1297516 1320605 1343144 1364177 1383181 1400901 1418209 1434545 1448465
63104 1448465 1459455 1468208 1475091 1479240 1479232 1473978 1462984 1446586 1426021 1402623 1376803 1348307 1317461
63091 1317461 1285505 1253638 1222411 1192130 1163208 1135878 1110003 1085222 1061010 1036896 1013320
63080 1013320 992054 974747 960973 948593 936163 923997 912582 901284 889536 878439 869878
63069 869878 864147 859373 853464 846106 838755 833157 830144 829615 831113 833957 836819 837950 836672 834653
63055 834653 834738 838043 842754 846364 848687 851885 857641 865132 872143 877574 882204 887220 892854 898779 905069
63040 905069 911950 918891 924985 930374 936376 943740 951697 959379 967362 976679 986886 996400 1004622 1012542
63026 1012542 1021129 1030240 1039359 1048303 1056783 1064277 1070925 1077585 1084374 1090068 1093958 1097562 1103297 1111763
63012 1111763 1121529 1131556 1142513 1155289 1169358 1183658 1198611 1216172 1237680 1262370 1288381
63001 1288381 1314838 1342462 1372437 1405365 1441347 1480317 1521836 1565103 1609853 1656980 1707531
62990 1707531 1761186 1816504 1872779 1930902 1992003 2055939 2121631 2188321 2255664 2322819 2388443
62979 2388443 2451937 2514124 2576225 2638481 2700202 2760846 2820377 2878505 2934218 2986432 3034577
62968 3034577 3078108 3115796 3146089 3167879 3180331 3182355 3173206 3153546 3124938 3088282 3043799 2992610
62956 2992610 2936814 2877482 2814127 2747258 2680113 2616336 2556930 2501178 2449725 2404636 2366683
62945 2366683 2334828 2308786 2290101 2279844 2276877 2279444 2287258 2300789 2319441 2341706 2366729 2394640
62933 2394640 2425440 2458333 2492253 2526694 2561972 2598654 2636460 2673749 2708441 2739230 2765396
62922 2765396 2785876 2799610 2806722 2807993 2802869 2789267 2765942 2733834 2694354 2647516 2592726 2530512
62910 2530512 2462408 2389827 2314027 2236521 2158519 2080423 2002723 1926802 1853931 1784076 1716737
62899 1716737 1652455 1592354 1536626 1484691 1436552 1392721 1352818 1315464 1279747 1245864 1214244
62888 1214244 1184898 1157813 1133164 1110940 1091063 1073775 1059091 1045881 1032638 1019492 1008501
62877 1008501 1001290 997017 993220 988219 982120 975815 969614 963024 955619 947817 940520 933927 927196 919592
62863 919592 911562 904107 897509 891387 885708 880727 876029 870641 864410 858434 853770 850389 847731 845536
62849 845536 843608 841384 838415 835051 832130 830162 829195 829235 830326 832190 834144 835419 835513 834285 831978
62834 831978 829216 826951 826156 827292 829854 832579 834321 834746 834195 833164 832012 830761 828832 825301 819838
62819 819838 813181 806370 799884 793997 789445 786790 785249 783065 779295 774668 770450 767017 763671 759421
62805 759421 753808 747344 741226 736245 732008 727600 722827 718167 713711 708939 703644 698295 693351 688981
62791 688981 685513 683260 681636 679457 676665 674882 675521 677934 680130 680853 680345 679527 679199 679808 681227 682737
62775 682737 683579 683510 682745 681870 682015 684436 689320 695493 701835 708459 715842 723486 730480 736919 743595 750444
62759 750444 756586 761992 767728 773989 779200 782068 783755 786729 791745 797173 801449 805108 809875 816466
62745 816466 824135 832000 839923 847971 855922 863908 873036 884611 898707 914074 929488 944829 960860
62732 960860 978597 998997 1022609 1049078 1077509 1107779 1141057 1178499 1219837 1263948 1310536
62721 1310536 1360441 1414447 1472705 1535541 1603917 1678368 1757981 1841076 1926840 2015796 2108581
62710 2108581 2204502 2301390 2396819 2489361 2578499 2663118 2740359 2806511 2859146 2897821 2922582
62699 2922582 2932583 2926903 2906196 2872450 2827128 2770420 2702572 2625141 2540429 2450288 2356087
62688 2356087 2259352 2161709 2064444 1968833 1876709 1789741 1707969 1629843 1554207 1481716 1413882
62677 1413882 1351240 1293121 1239000 1189387 1145227 1106860 1073714 1044714 1018817 995251 973596
62666 973596 953883 936650 922551 911480 902138 893054 884208 877153 873193 871896 871817 872263 873676 876605
62652 876605 881141 887448 896100 907526 921538 937722 955986 976452 999073 1023723 1050688 1080795
62640 1080795 1114899 1153241 1195432 1241264 1291409 1346962 1408187 1474009 1542910 1613954 1686793
62629 1686793 1761141 1836610 1912564 1987611 2059582 2126544 2187498 2241554 2286846 2321001 2342434
62618 2342434 2350567 2345258 2327083 2297859 2259667 2213195 2157941 2094045 2022955 1946454 1866390 1785415
62606 1785415 1706251 1629448 1553262 1476754 1401879 1331496 1266440 1205782 1148946 1095977 1046403
62595 1046403 999549 955855 916336 880701 847404 815748 786602 760621 736993 714624 693507
62584 693507 674112 656118 638686 621637 605523 590678 576956 564476 553924 545619 538537 530914
62572 530914 522059 513235 506308 501736 498374 495125 491877 488693 485092 480914 477102 474676 473305 471848
62558 471848 470058 468839 469033 470865 474480 479981 486780 493765 500242 506035 510874 514755 518993 525609
62544 525609 535248 546772 559343 573719 590841 610319 631321 654022 679036 706248 735509 767887
62532 767887 804664 845207 887269 929662 973559 1020801 1071857 1125617 1180096 1232828 1281490
62521 1281490 1324966 1363424 1396874 1424141 1443792 1455537 1460007 1457466 1447538 1430200 1406380 1377360
62509 1377360 1343954 1306489 1265371 1221546 1176479 1131676 1088106 1046103 1005874 967895 932582
62498 932582 899730 868675 839080 811354 786173 763665 743140 723613 704677 686859 670917
62487 670917 656715 643126 629319 615867 604139 594735 586922 579403 571130 561535 550889 540746
62475 540746 533352 529994 530137 532296 535169 537667 538722 538098 537157 538064 542108 549124 558090 567770 577230
62460 577230 586738 598032 612775 630750 650431 671130 693417 717440 742389 768270 796800 829556
62448 829556 866203 905506 946975 990116 1032985 1073355 1111081 1147610 1183102 1215667 1243632
62437 1243632 1266692 1284059 1293308 1292745 1284023 1270738 1254732 1235108 1210771 1182466 1151899 1119973
62425 1119973 1086708 1052298 1017469 982945 949186 916731 886341 858517 832941 808623 784809
62414 784809 761766 740614 722353 707139 694444 683637 674197 665596 657381 649375 641615 634175 627394
62401 627394 622237 619865 620459 622675 624575 625028 624085 622438 621023 621056 623699 629343 637455 647243 658034
62386 658034 668914 678770 687439 696333 706939 718637 728950 736202 741104 745198 748586 750108 749320
62373 749320 747124 744264 740134 733583 724396 713441 701670 689463 676881 664015 650872 637227
62361 637227 622961 608586 595150 583441 573318 564057 555324 547633 541829 538390 537294 538228 540508
62348 540508 542986 544548 545007 545425 547338 551531 557506 564120 570760 577770 585690 594385 603271 612170 621361
62333 621361 630887 640552 650662 661775 673226 682879 689363 693869 698628 704065 708811 712262 715381
62320 715381 718530 720203 719033 715987 713258 711698 710759 710569 712505 717438 724720 733465 743800 756083
62306 756083 769734 784008 799746 819229 843989 873413 905918 940983 979423 1021939 1068102
62295 1068102 1116862 1167480 1219583 1272611 1325617 1377428 1426652 1471711 1511406 1545615 1575017
62284 1575017 1599835 1619049 1631048 1634880 1630736 1619471 1602043 1579343 1552122 1520855 1485846 1447640
62272 1447640 1407215 1365610 1323417 1280866 1238450 1197191 1158110 1121520 1087014 1054049 1022308
62261 1022308 991720 962502 935188 910129 886826 864285 842277 821724 803381 786692 770780
62250 770780 756265 745003 737804 733372 730089 728034 728220 730162 731464 730328 727758 726564 728358 732149
62236 732149 735785 738009 738772 738222 736302 733253 729706 726001 722040 718104 715230 714226 714705 715762 717368
62221 717368 720349 724997 730451 735732 740843 746471 753000 760261 768137 776974 787204 798764 811175
62208 811175 824378 839327 857416 879139 903497 928822 954016 979072 1005027 1033798 1067456
62197 1067456 1106807 1150647 1196874 1244351 1293316 1344160 1396271 1448089 1497856 1544335 1586971
62186 1586971 1625188 1657366 1681086 1694979 1699790 1696888 1686252 1667034 1639830 1607061 1570987 1532492
62174 1532492 1491898 1449645 1405743 1359884 1312881 1266982 1223951 1183710 1145580 1109886 1077350
62163 1077350 1047710 1020065 994141 970297 948831 930232 915556 905312 898269 892463 887219 883216
62151 883216 880850 879742 879760 881165 883454 885202 885562 885104 884850 885370 887209 891252 897891 906319 915294 924226
62135 924226 933129 942004 950917 960467 971579 984765 999777 1015944 1032794 1050610 1070408 1092970
62123 1092970 1117751 1143131 1167909 1192011 1215458 1237325 1256542 1273561 1290328 1308332 1327109
62112 1327109 1344913 1360562 1374399 1387808 1402308 1419171 1439427 1463726 1492052 1523715 1557573
62101 1557573 1592134 1625604 1656462 1684362 1710095 1734163 1755632 1773023 1786315 1797214 1807023
62090 1807023 1814821 1818417 1816841 1811150 1802820 1792224 1779141 1764110 1748399 1732860 1717615 1702880
62078 1702880 1689165 1676287 1663199 1649620 1637084 1627191 1619165 1610553 1600462 1590775 1583646 1578918
62066 1578918 1574711 1569611 1563422 1556651 1550404 1546316 1545426 1547171 1550246 1554235 1559700 1567045 1576252 1587516
62052 1587516 1601134 1616822 1634077 1653209 1674972 1699009 1723702 1747999 1772663 1799247 1828367
62041 1828367 1859265 1890622 1921473 1951729 1981953 2012498 2043085 2073721 2105538 2139752 2175946
62030 2175946 2212491 2248655 2285133 2322383 2359850 2397279 2435395 2474558 2514135 2554223 2596686
62019 2596686 2643051 2692298 2742387 2793389 2847322 2905055 2965146 3026134 3088443 3153187 3220091
62008 3220091 3287474 3353860 3418953 3483282 3547377 3611157 3673978 3735362 3795552 3854828 3912267
61997 3912267 3965834 4014163 4057909 4098961 4138485 4176077 4210662 4241784 4269912 4295759 4319610
61986 4319610 4341268 4360335 4376410 4389466 4400610 4412285 4426818 4444457 4463464 4482543 4502531
61975 4502531 4525188 4551037 4579274 4609274 4641187 4675223 4711395 4749892 4790650 4832528 4873964
61964 4873964 4914697 4955790 4997512 5038256 5076258 5111560 5145443 5178583 5210619 5240994 5269223
61953 5269223 5294573 5316493 5335408 5352444 5368351 5383269 5397315 5410640 5422972 5434043 5444608
61942 5444608 5456164 5469201 5482449 5494408 5505149 5516070 5528161 5540856 5552304 5560420 5564189 5564544
61930 5564544 5563746 5563311 5562602 5559738 5553514 5543915 5531371 5516658 5501452 5487654 5475621 5463983 5451846
61917 5451846 5440274 5430740 5422880 5415081 5407023 5400234 5395877 5393183 5390674 5387981 5385562 5383178 5379702 5374337
61903 5374337 5367170 5358448 5348087 5336319 5324278 5313174 5302853 5291626 5277827 5261402 5243774 5226209
61891 5226209 5208614 5189971 5169638 5148020 5126321 5106094 5088805 5075054 5063983 5053977 5044312
61880 5044312 5035814 5029690 5026221 5025048 5026255 5030292 5036946 5045198 5054432 5065187 5078296 5093686 5110533
61867 5110533 5128483 5148152 5170293 5194788 5220740 5247478 5275236 5304866 5337316 5373694 5415668
61856 5415668 5465123 5523191 5590026 5665912 5752273 5851080 5963511 6089959 6231414 6390116
61846 6390116 6568380 6767352 6987569 7230645 7499826 7798758 8129977 8494718 8893983
61837 8893983 9329600 9804072 10319075 10873800 11464505 12085205 12727654 13379525 14022265
61828 14022265 14631242 15178747 15637889 15985500 16204111 16283576 16221978 16025062 15704485 15275982
61818 15275982 14758099 14171329 13537113 12876182 12206219 11539945 10885378 10248315 9634617
61809 9634617 9050117 8498897 7982587 7501502 7055844 6645601 6269932 5927340 5616289
61800 5616289 5335293 5082419 4855085 4650504 4466504 4302116 4157265 4031462 3922653
61791 3922653 3827830 3745008 3674103 3615424 3567656 3527841 3492981 3461150 3431387 3403372 3377174
61780 3377174 3352537 3328209 3302614 3275331 3247330 3219659 3192625 3166530 3142325 3120772 3101567
61769 3101567 3084171 3069291 3058648 3053175 3052016 3053411 3055958 3058822 3061362 3063105 3063735 3062516 3057815
61756 3057815 3047906 3032607 3013816 2994017 2974385 2954695 2934890 2916050 2899584 2886104 2875636
61745 2875636 2868638 2866205 2869442 2879163 2896066 2920547 2952326 2990949 3036786 3090868 3153570 3224297
61733 3224297 3302889 3390555 3488663 3597173 3715173 3842683 3981085 4131775 4295230 4471584
61723 4471584 4661576 4866769 5089361 5331923 5596785 5885558 6199810 6542536 6918469
61714 6918469 7332586 7788761 8290326 8841510 9447735 10114733 10847935 11652252 12531234
61705 12531234 13485829 14514349 15613508 16777955 17996936 19250699 20510116 21739231
61697 21739231 22897494 23940660 24822981 25502413 25946663 26136887 26068739 25752271 25210589
61688 25210589 24476230 23586140 22577697 21486502 20344821 19180343 18016214 16871931
61680 16871931 15763312 14701393 13692377 12739485 11844732 11009136 10232571 9514550 8854750
61671 8854750 8251972 7702992 7203302 6749008 6337436 5966142 5631955 5330878 5058343
61662 5058343 4809699 4581228 4370912 4177950 4001579 3840565 3693315 3557784 3431557
61653 3431557 3312881 3201613 3098376 3002807 2913422 2829267 2750658 2677820 2609667 2544627 2482194
61642 2482194 2423075 2368145 2317738 2271458 2227939 2185063 2141363 2097484 2055741 2017904 1983574
61631 1983574 1950724 1917414 1882810 1847016 1810615 1774438 1739274 1705372 1672400 1640220 1609583
61620 1609583 1581615 1556556 1533496 1511610 1491170 1472891 1456651 1441427 1426458 1411919 1398452
61609 1398452 1386380 1375429 1364908 1354245 1343754 1334731 1328229 1323693 1319313 1313874 1307776 1302161 1297692
61596 1297692 1294428 1292204 1290579 1288813 1286547 1284268 1282650 1281653 1280825 1280330 1280869 1282436 1283849 1284103 1283826
61581 1283826 1284726 1287480 1290667 1292221 1291759 1291069 1292163 1295136 1298241 1299942 1300526 1301530 1303876 1307115 1310638
61566 1310638 1315176 1322293 1332213 1342903 1352030 1359458 1366916 1375265 1383155 1388682 1391291 1391458 1389427 1385273
61552 1385273 1379582 1372998 1365395 1356488 1346945 1337855 1329276 1320343 1310726 1300883 1291010 1281013 1271540 1263549
61538 1263549 1256545 1248803 1239998 1232033 1226137 1220543 1212628 1202514 1192860 1185536 1180089 1175408 1171343 1168282
61524 1168282 1166377 1165676 1166275 1167976 1170506 1174333 1180514 1189326 1199663 1210311 1221444 1234498 1250811
61511 1250811 1270620 1293097 1317168 1342508 1369848 1400087 1433116 1467858 1503553 1540575 1579853
61500 1579853 1621795 1665936 1711241 1756520 1800867 1844039 1886401 1928373 1970002 2010953 2050606
61489 2050606 2088145 2122785 2154087 2181944 2206364 2227500 2245736 2261382 2274287 2284072 2290638 2294103
61477 2294103 2294365 2291209 2284722 2275020 2261771 2244910 2225956 2207644 2191715 2177795 2164852 2152906
61465 2152906 2142613 2134062 2127243 2123341 2124302 2131007 2142702 2158401 2178128 2202707 2233122 2270257
61453 2270257 2314607 2365950 2423962 2489439 2564334 2650262 2747567 2856126 2976351 3108899 3254099
61442 3254099 3412445 3585261 3774032 3979197 4200108 4435814 4684983 4944982 5211599
61433 5211599 5479625 5743111 5995132 6228134 6434919 6609143 6745306 6839439 6890357 6899682
61423 6899682 6870315 6805393 6708863 6586086 6442944 6284600 6115531 5940211 5762977 5587441
61413 5587441 5416599 5253182 5099224 4955528 4822461 4701244 4593757 4501012 4422578 4357684
61403 4357684 4306232 4268511 4244618 4234548 4238282 4255205 4283759 4322195 4369517 4425288 4488567
61392 4488567 4557526 4630311 4706146 4785381 4868284 4953781 5039578 5123691 5205608 5285674 5363637
61381 5363637 5438342 5508770 5574741 5636478 5694015 5747187 5795638 5838624 5875475 5906610 5933566
61370 5933566 5957540 5978357 5995377 6008853 6019636 6027808 6032504 6033163 6030237 6024491 6016240 6005620 5993044
61357 5993044 5978821 5962525 5943243 5920647 5895651 5869969 5845117 5821693 5799254 5776609 5752495
61346 5752495 5726488 5699484 5673043 5647980 5623667 5598719 5572082 5543312 5512292 5479260 5444962
61335 5444962 5410319 5376138 5343649 5315112 5293112 5279221 5274039 5278608 5295023 5325502 5371662 5434938
61323 5434938 5516769 5617786 5737599 5875997 6033782 6211924 6410643 6629874 6869555 7128195
61313 7128195 7401655 7684516 7972158 8260174 8542028 8808957 9052547 9266280 9444502
61304 9444502 9581766 9674524 9722595 9727714 9690957 9612665 9494733 9341853 9159977 8953962
61294 8953962 8727083 8482401 8223893 7956017 7682749 7407672 7134766 6868007 6609737
61285 6609737 6360303 6120187 5891885 5678543 5481101 5298116 5128504 4973067 4832887
61276 4832887 4707566 4596053 4498334 4415197 4346751 4292067 4250081 4220014 4201081 4192505 4193812
61265 4193812 4204669 4224565 4253083 4290098 4334973 4385733 4439883 4496116 4554519 4614994 4676201
61254 4676201 4736264 4793762 4847529 4896103 4938205 4973827 5004324 5031094 5054072 5071403 5080786
61243 5080786 5081470 5075094 5064227 5049990 5031294 5006488 4975249 4938610 4897689 4853111 4805459 4755553
61231 4755553 4704032 4651127 4597084 4542435 4487644 4432841 4378190 4324249 4271639 4220551 4170973
61220 4170973 4123322 4078528 4037515 4000714 3967807 3937600 3908355 3878836 3849087 3819761 3790776
61209 3790776 3761235 3730770 3700332 3671372 3644877 3621485 3601879 3586467 3575247 3568621 3567681 3572660
61197 3572660 3581554 3591708 3603075 3618837 3642443 3675080 3716595 3767570 3829010 3900407 3979687
61186 3979687 4065397 4158020 4258682 4367217 4481866 4599986 4718143 4831783 4935688 5025005
61176 5025005 5095576 5143510 5165285 5158759 5123830 5061912 4974959 4865258 4735907 4591234 4436563
61165 4436563 4277262 4117375 3958892 3802621 3649860 3502760 3362936 3230549 3105386
61156 3105386 2988227 2880335 2782034 2692729 2611969 2539447 2474147 2414807 2361340 2314574 2274314
61145 2274314 2239019 2207940 2182191 2162770 2148605 2137634 2129037 2123312 2120962 2122247 2127569 2136810
61133 2136810 2148629 2161465 2174678 2187679 2198830 2206896 2213028 2219212 2224828 2226872 2224064 2218692 2213527
61120 2213527 2208641 2202432 2194214 2184314 2172706 2159124 2143940 2127646 2109927 2090421 2069888 2049395
61108 2049395 2028702 2006716 1983411 1960054 1937433 1914923 1891462 1866547 1840098 1812294 1783877
61097 1783877 1755742 1727800 1698976 1668821 1638448 1609226 1580988 1552301 1522285 1491444 1460713
61086 1460713 1430372 1400115 1369644 1338760 1307228 1275179 1243551 1213563 1185622 1159260 1134342
61075 1134342 1111658 1091812 1074078 1057183 1040998 1026588 1014642 1004763 996487 990046 985626 982680
61063 982680 980673 980000 981420 984814 989185 993821 998974 1005385 1013500 1023093 1033357 1043402 1052838 1061816
61049 1061816 1070455 1078574 1086279 1094429 1103994 1114897 1125810 1135204 1142497 1148234 1153265 1157741 1160959
61036 1160959 1162301 1162140 1161543 1161155 1160792 1160103 1159211 1158735 1159595 1162582 1167278 1171421 1172375 1169700 1165490 1161835
61020 1161835 1158844 1155743 1152795 1151001 1150393 1149836 1148426 1146393 1144778 1144791 1147048 1150633 1153265 1153283 1151256
61005 1151256 1148926 1147008 1145051 1143042 1141681 1140892 1139521 1137123 1134958 1134389 1135022 1135323 1134564 1133298 1132119
60990 1132119 1130857 1129254 1127832 1127626 1129206 1132359 1136783 1142692 1150420 1159756 1170234 1181973 1195407
60977 1195407 1210079 1224693 1239024 1254891 1274250 1296851 1320938 1345966 1373381 1404606 1439369
60966 1439369 1476363 1514719 1554501 1596575 1642511 1693992 1751737 1815157 1883167 1954943 2030006
60955 2030006 2108497 2191819 2282247 2381142 2487767 2600300 2717805 2840941 2971200 3109977
60945 3109977 3258268 3416820 3586684 3769932 3969678 4189013 4430152 4695328 4988825
60936 4988825 5317722 5690368 6114636 6598524 7152257 7788419 8519248 9355034 10306835
60927 10306835 11390385 12625936 14035102 15639297 17455598 19478570 21651175 23853106
60919 23853106 25932003 27762292 29283716 30492958 31414196 32089602 32588896 32998321 33371830
60910 33371830 33683904 33836169 33716859 33258075 32446183 31297256 29839867 28121768 26218885
60901 26218885 24224413 22224808 20284263 18445090 16733867 15164427 13739211 12452648
60893 12452648 11295253 10255928 9323225 8486777 7738060 7069818 6475422 5948972 5485141
60884 5485141 5078405 4722768 4412281 4141137 3903359 3693374 3507153 3341941 3194675
60875 3194675 3061628 2939853 2827795 2723987 2626204 2532665 2443211 2358448 2278287 2201939
60865 2201939 2128692 2058060 1989744 1923936 1861004 1800394 1740760 1681878 1625438 1572811 1522774
60854 1522774 1472778 1422209 1373242 1328443 1288342 1251332 1215191 1178742 1142656 1108658 1077600
60843 1077600 1048586 1020403 993284 968469 946403 926179 906631 887255 868253 850470 835105
60832 835105 822696 812346 802557 792772 783497 775187 767875 761769 757272 754238 752053 750613 750438 751455
60818 751455 752517 752716 752743 754347 758623 765214 773020 781139 789038 796271 802580 808335 814404 821181 828032
60803 828032 834258 840369 847598 856090 864500 871574 877148 881202 883176 883225 883198 885090 889052 894005 899635
60788 899635 906301 913232 918413 920578 920286 918877 917481 917167 918712 921540 923883 924714 924873 925740 927440
60773 927440 929047 930023 930787 932048 934178 937112 940436 943514 945694 946610 946571 946854 949249 954740 962698 971770
60757 971770 981326 991466 1001939 1011961 1021264 1030556 1040668 1051705 1063039 1073560 1082030 1088054
60745 1088054 1092858 1098307 1104868 1111188 1115924 1119197 1121829 1123811 1124081 1121457 1115494 1106826 1096907 1086934
60731 1086934 1076813 1065578 1052831 1039150 1025065 1010538 995802 981883 969746 959468 950623
60720 950623 942887 935876 929028 922125 915508 909505 904219 900083 897809 897431 898198 899896 903439 909583 917869
60705 917869 927481 938303 950347 962996 975815 989443 1004548 1020390 1035567 1049986 1064959 1081346
60693 1081346 1098462 1114884 1129632 1142593 1154455 1166307 1178862 1192015 1205287 1218324 1230761
60682 1230761 1242260 1253157 1264192 1274909 1283216 1287634 1289266 1290288 1291095 1290501 1288327 1285988 1284336
60669 1284336 1282508 1279409 1275119 1270357 1265633 1261348 1257763 1254370 1250110 1244492 1237614 1229072 1218111 1205279
60655 1205279 1192659 1181829 1172730 1164981 1158949 1154537 1150249 1144777 1138712 1133464 1129201 1125123 1121048
60642 1121048 1117332 1113618 1109200 1104589 1101334 1100086 1099852 1099365 1098316 1097095 1096184 1095988 1096479 1096829 1096155 1094734
60626 1094734 1093773 1093868 1094531 1095337 1096638 1098675 1100837 1102287 1102712 1102023 1099997 1096789 1093191 1089713 1085789 1080522
60610 1080522 1073800 1066071 1057312 1047007 1035098 1022390 1009934 998389 987893 978111 968447 958641
60598 958641 949252 941184 934729 929429 924902 921403 919371 918635 918258 917137 914897 912497 911858 914373 919393
60583 919393 924360 926761 926074 923733 921288 918833 915375 910541 905475 901760 899759 898510 897234 896198
60569 896198 895807 895531 894503 892923 892153 893465 897264 903345 911083 919280 926764 933690 941742 952580 966420
60554 966420 982371 999526 1017223 1034910 1052591 1071113 1091181 1112221 1132909 1152672 1171857
60543 1171857 1190485 1207831 1223478 1237823 1250983 1261967 1269748 1274633 1277724 1279219 1278124 1273765
60531 1273765 1266928 1259217 1251742 1244656 1237595 1230164 1222108 1213337 1203865 1193725 1183036 1172223 1161962
60518 1161962 1152715 1144398 1136691 1129640 1123658 1118810 1114362 1109386 1103823 1098636 1094802 1092322 1090411 1088452
60504 1088452 1086435 1084557 1082811 1081179 1080028 1080096 1082088 1086310 1092503 1099910 1107653 1115342 1123463 1133183
60490 1133183 1145719 1161770 1181403 1204336 1230314 1259190 1290712 1324417 1359898 1397020 1435702
60479 1435702 1475511 1515693 1555484 1593969 1629651 1660612 1685420 1703581 1714864 1718596 1714222 1702582
60467 1702582 1686168 1667817 1649215 1630745 1612474 1594925 1578861 1564702 1552612 1543220 1537772 1537211
60455 1537211 1541288 1549011 1559921 1574351 1592412 1613312 1636143 1661016 1689027 1721306 1758552 1801527
60443 1801527 1851644 1910829 1980741 2062134 2155303 2261519 2383699 2524732 2684967 2862292
60433 2862292 3055244 3265118 3494157 3742637 4009299 4293931 4597001 4915461 5239898
60424 5239898 5556632 5851600 6111402 6322312 6471084 6548018 6549070 6475556 6333216 6131797
60414 6131797 5883967 5602961 5300751 4987982 4674257 4367220 4071471 3789269 3522522
60405 3522522 3273616 3044399 2835069 2644462 2471058 2313430 2170250 2040547 1923972
60396 1923972 1820289 1728435 1646394 1572329 1505612 1446458 1394575 1348494 1306362 1267119 1230677
60385 1230677 1197075 1165871 1136511 1108947 1083493 1060172 1038590 1018521 1000170 983725 969043
60374 969043 956203 945927 938805 934093 929863 924487 917669 910069 902573 896078 891227 887726 884386 880489
60360 880489 876920 875388 876658 880082 884676 890006 896144 903517 912939 924945 938620 951574 961572
60347 961572 967930 971107 971524 969386 965363 960734 956702 953817 951943 950472 948764 946827 945511 945647 947082
60332 947082 949062 951453 954896 959585 964677 969375 974022 979363 985097 990075 993973 997818 1002430 1007095
60318 1007095 1010483 1012378 1013521 1013925 1012570 1009272 1005926 1004822 1006005 1007226 1006579 1004305 1001671 998977
60304 998977 995611 991782 989106 989030 991182 993836 995822 997508 999964 1003814 1009263 1016754 1026762 1038766
60290 1038766 1051026 1061905 1071311 1080472 1090434 1101046 1111292 1120215 1127562 1133937 1140394 1147458 1154371
60277 1154371 1159568 1162070 1162244 1161244 1160141 1159750 1160711 1163211 1166712 1170360 1173643 1176569 1179489 1182927 1187131
60262 1187131 1191231 1193158 1191142 1185552 1178789 1173144 1168966 1164991 1160080 1154330 1148609 1143316 1137867 1131538
60248 1131538 1124727 1118927 1115272 1113460 1112496 1112033 1112309 1113086 1113619 1113790 1114326 1115548 1116775 1117519 1118473 1120494
60232 1120494 1123090 1124773 1124708 1123192 1120748 1117678 1114460 1111596 1108750 1104919 1100078 1096084 1095330 1098706 1105331
60217 1105331 1113902 1123691 1134242 1144737 1154116 1161955 1169201 1177849 1189396 1203276 1217057 1228579
60205 1228579 1237982 1247451 1259045 1272857 1287225 1300588 1313177 1326914 1343496 1362559 1382150 1401196
60193 1401196 1421105 1444476 1472577 1504688 1539762 1577931 1620144 1666897 1717843 1772537 1831364
60182 1831364 1895694 1967000 2045587 2130335 2220176 2315718 2418837 2530582 2650249 2776775
60172 2776775 2910090 3050147 3195033 3341145 3485368 3626457 3764140 3897550 4024860
60163 4024860 4144012 4253420 4352132 4439488 4514497 4575592 4621346 4651512 4667012 4668974 4658499
60152 4658499 4637675 4610099 4579503 4547880 4515544 4483100 4452891 4428466 4413083 4408836 4416829 4437650
60140 4437650 4471569 4518502 4578041 4649822 4733995 4831161 4941514 5063924 5195757 5333362
60130 5333362 5472700 5610047 5742746 5869214 5987698 6095093 6187577 6262513 6319103 6357101
60120 6357101 6375800 6374763 6354849 6317609 6264143 6195521 6114264 6024416 5929912 5833582 5738004
60109 5738004 5646508 5562634 5488927 5426768 5377135 5341137 5319978 5314729 5325890 5352674 5392834
60098 5392834 5443722 5503632 5571719 5646599 5725530 5805168 5882705 5955879 6022323 6079861 6127782
60087 6127782 6167321 6200304 6227512 6248878 6265073 6278042 6289918 6302448 6318081 6340675 6373907
60076 6373907 6419464 6478053 6551970 6645092 6760049 6896909 7055452 7237299 7444707 7678321
60066 7678321 7937577 8222621 8534376 8873007 9237699 9627639 10041608 10476337 10926428
60057 10926428 11385993 11849127 12308666 12756073 13183275 13583566 13950233 14275674 14552871
60048 14552871 14776719 14943016 15047250 15085789 15057791 14964998 14810450 14598763 14337194 14034739
60038 14034739 13699881 13340208 12964193 12581979 12203704 11837473 11489030 11162638 10862026
60029 10862026 10591028 10353451 10151806 9986179 9855128 9757789 9694223 9663249 9660671 9680242
60019 9680242 9716068 9763658 9819028 9877387 9932851 9979462 10012814 10030892 10033172 10018833 9986100
60008 9986100 9933365 9860498 9768722 9659238 9532145 9386929 9224331 9047760 8862239 8671505
59998 8671505 8476719 8278565 8079948 7885370 7698090 7519367 7350619 7194673 7054292
59989 7054292 6930831 6825348 6739852 6676060 6633528 6610401 6605883 6620924 6656502 6712223 6786792
59978 6786792 6878974 6987466 7109960 7242633 7380696 7519610 7655621 7784862 7902364 8003101
59968 8003101 8084244 8145246 8185085 8200635 8188870 8149738 8085514 7998129 7888888 7760472 7617321
59957 7617321 7463707 7302987 7139075 6976951 6820797 6672871 6535064 6410450 6302148
59948 6302148 6211495 6138474 6083490 6047791 6032749 6039763 6070450 6125776 6205026 6306649 6430176
59937 6430176 6576314 6744830 6932895 7135591 7347429 7563144 7777675 7985984 8182970
59928 8182970 8363574 8523134 8657691 8763950 8839377 8882824 8894833 8876679 8829203 8753181
59918 8753181 8650931 8526925 8386542 8234672 8075767 7914638 7756566 7606488 7468199
59909 7468199 7344158 7235900 7144799 7072612 7021299 6992242 6985751 7001314 7038199 7095745 7173086
59898 7173086 7268510 7379081 7501163 7631592 7768157 7908730 8050369 8189944 8325479 8456133
59888 8456133 8580814 8697680 8805408 8904390 8996187 9082196 9163314 9240681 9316454 9394126 9478375
59877 9478375 9574268 9686270 9818112 9973428 10155712 10367275 10609043 10882085 11188545 11529886
59867 11529886 11904247 12306263 12729181 13166004 13608370 14045352 14463887 14849958 15189412
59858 15189412 15468922 15677519 15807680 15855313 15819487 15702673 15510807 15252502 14938012 14578682
59848 14578682 14186558 13773678 13351458 12930321 12519056 12123990 11749155 11397777 11073593
59839 11073593 10780686 10522642 10302232 10121449 9981257 9881468 9821215 9799313 9813866 9861974
59829 9861974 9940274 10045311 10172776 10316693 10469894 10624911 10773688 10907024 11015659 11092182
59819 11092182 11131167 11127721 11077413 10978284 10831919 10641745 10411118 10144017 9846890 9528354
59809 9528354 9196673 8858046 8517128 8178154 7845080 7521177 7209097 6911301 6630175
59800 6630175 6367729 6125206 5902860 5700146 5516401 5351524 5205888 5079479 4971234
59791 4971234 4879303 4801868 4737532 4685000 4642596 4608261 4579880 4555429 4532879 4510517 4487907
59780 4487907 4466364 4447740 4432278 4417935 4402132 4383772 4363034 4339603 4312114 4279487 4241874
59769 4241874 4199710 4152641 4100378 4044319 3987207 3931002 3875903 3821701 3769148 3719423 3673066
59758 3673066 3630296 3591896 3558796 3531029 3508140 3490597 3479747 3476021 3478235 3485280 3497845 3517777
59746 3517777 3546208 3582959 3627463 3679397 3738280 3802918 3871515 3942388 4014756 4088745 4164177
59735 4164177 4239292 4311247 4378000 4439007 4494029 4542558 4585225 4624575 4663034 4700766 4736953
59724 4736953 4772688 4810959 4854055 4902909 4959262 5026440 5107016 5201216 5308822 5431600 5572776
59713 5572776 5735134 5920859 6132313 6371445 6638783 6934232 7258366 7611340 7990385
59704 7990385 8389214 8799307 9209877 9606215 9969916 10282389 10528588 10698256 10785984 10792033
59694 10792033 10722871 10589696 10405890 10185439 9942327 9689569 9437974 9195689 8968445
59685 8968445 8759743 8571378 8404915 8262947 8148317 8062122 8003343 7970823 7965053 7987640
59675 7987640 8039686 8121237 8231731 8370186 8535290 8726279 8943904 9190018 9466313 9774102
59665 9774102 10115167 10491805 10905778 11358194 11850835 12386558 12967649 13594611 14267510
59656 14267510 14987618 15756252 16572043 17430534 18326303 19254146 20207810 21178691 22156514
59647 22156514 23131062 24093477 25037098 25957855 26853696 27723800 28569075 29392942 30199723
59638 30199723 30991118 31764750 32516162 33240479 33930837 34576443 35164090 35681822 36120492
59629 36120492 36472829 36733176 36899127 36973074 36962141 36877210 36731737 36540382 36318028 36079817
59619 36079817 35841386 35618079 35423854 35271373 35172843 35139945 35182983 35310531 35529571 35845095
59609 35845095 36259663 36773992 37387362 38095894 38889858 39753389 40666777 41607544 42548483
59600 42548483 43455674 44289946 45011040 45581478 45969070 46148992 46105772 45834506 45340962
59591 45340962 44640808 43757986 42722221 41566160 40322822 39023842 37698439 36372642
59583 36372642 35068194 33801323 32582470 31417096 30306115 29245055 28223608 27227587
59575 27227587 26242486 25256200 24260374 23251563 22232029 21208689 20190705 19187932
59567 19187932 18210565 17268140 16367675 15513335 14708199 13955242 13255697 12607323 12005811
59558 12005811 11448170 10934256 10464918 10039107 9652971 9301614 8981597 8691606 8430713
59549 8430713 8196490 7985361 7794359 7621465 7464254 7319405 7183941 7055988 6933754
59540 6933754 6814728 6696661 6578626 6460368 6341302 6221021 6100193 5979907 5860396
59531 5860396 5741339 5623261 5507879 5397151 5292591 5195214 5105408 5023045 4948316 4882103
59521 4882103 4824780 4775198 4732011 4695843 4668804 4651730 4643095 4641069 4645371 4656355 4673309 4694878
59509 4694878 4720771 4752011 4789461 4832834 4881287 4934337 4991834 5053406 5118523 5187265 5260822
59498 5260822 5340882 5428566 5524229 5628328 5741961 5866223 6001581 6148537 6308632 6483915
59488 6483915 6675436 6883113 7107158 7348636 7608042 7884217 8175446 8481080 8800995
59479 8800995 9133591 9475139 9821087 10167139 10508856 10841083 11158442 11456149 11730095
59470 11730095 11976696 12193359 12379030 12533861 12658399 12753405 12820188 12860630 12876984 12872310
59460 12872310 12851054 12818371 12778615 12735249 12692780 12658035 12638510 12639663 12664541 12715672 12795950
59449 12795950 12907104 13047984 13214701 13401568 13601021 13803068 13995875 14167492 14307125
59440 14307125 14405259 14453405 14444257 14372362 14235028 14033021 13770528 13454360 13093090 12696596
59430 12696596 12275665 11841109 11402725 10968686 10545570 10138731 9752638 9390865 9055758
59421 9055758 8748391 8469350 8219639 8000574 7812820 7655969 7529144 7431632 7362908 7322603
59411 7322603 7310626 7326822 7370371 7440151 7535931 7658275 7806749 7978951 8172025 8384345
59401 8384345 8614418 8858270 9108992 9359056 9602298 9833390 10046154 10232948 10385708
59392 10385708 10497643 10564325 10583414 10553553 10474118 10346341 10174165 9963285 9719597 9448943
59382 9448943 9157533 8851361 8535202 8213103 7889742 7570116 7257821 6954820 6663187
59373 6663187 6385843 6124863 5880086 5650280 5435036 5234802 5049756 4879614 4724022
59364 4724022 4582363 4453708 4337882 4236043 4148906 4074656 4010016 3953557 3906683 3870876
59354 3870876 3845212 3827471 3816748 3813749 3818843 3830874 3847776 3867405 3887677 3906928 3924734 3941960
59342 3941960 3959684 3978612 4000030 4026788 4062403 4108828 4165107 4227989 4293564 4358796 4422338
59331 4422338 4484245 4544891 4604597 4664900 4729741 4804068 4890801 4989994 5101382 5226748 5369000
59320 5369000 5529908 5710174 5911428 6136606 6387988 6665997 6970635 7303581 7668374
59311 7668374 8068945 8508245 8987737 9507554 10067156 10665898 11302554 11973973 12674380
59302 12674380 13396043 14130033 14866167 15593273 16300959 16981504 17629698 18241081 18811250
59293 18811250 19337194 19818478 20256113 20650087 20998280 21297668 21545870 21740988 21880004
59284 21880004 21957682 21967202 21901942 21757067 21530311 21221917 20834065 20370478 19836874 19241793
59274 19241793 18596330 17912302 17200467 16470483 15731985 14994763 14267626 13557439 12869325
59265 12869325 12207336 11574728 10974063 10407502 9876968 9383842 8928497 8510060 8126555
59256 8126555 7775537 7455033 7163949 6901318 6665266 6453155 6262745 6092765 5942389
59247 5942389 5810769 5697142 5600651 5519766 5452582 5398110 5356582 5327958 5310928 5304308 5308800
59236 5308800 5326170 5356884 5399700 5453591 5518807 5595727 5683843 5782628 5892494 6014036 6146889
59225 6146889 6290268 6444262 6609631 6786415 6973414 7168770 7370094 7573991 7776569
59216 7776569 7974976 8168048 8355299 8536017 8709603 8875869 9034221 9183034 9320487
59207 9320487 9445559 9557288 9653266 9729799 9783648 9813024 9816881 9794072 9743705 9666070 9563051
59196 9563051 9437869 9294345 9135887 8965032 8784305 8597442 8409322 8224616 8046938
59187 8046938 7879107 7723367 7581054 7452713 7338930 7240619 7158504 7093069 7045225 7016126
59177 7016126 7005741 7012412 7034449 7071540 7123937 7190915 7270879 7362508 7464946 7577222 7698326
59166 7698326 7827578 7964176 8106808 8254600 8408188 8568957 8737547 8914178 9100443
59157 9100443 9299717 9515563 9750409 10005645 10281902 10578805 10895036 11228660 11576587
59148 11576587 11933464 12291737 12642712 12976724 13282312 13546554 13757050 13903363 13976950
59139 13976950 13971410 13883950 13716102 13472386 13158757 12782716 12354036 11884333 11385868 10870788
59129 10870788 10350428 9834132 9328616 8838788 8368803 7921808 7499173 7100998 6727563
59120 6727563 6379843 6058478 5762616 5490100 5238843 5007967 4797480 4606863 4434287
59111 4434287 4277383 4134342 4003822 3884431 3775308 3676952 3590262 3514553 3447529 3387384
59101 3387384 3333847 3286812 3245239 3208225 3176258 3150506 3131432 3118737 3111974 3110504 3113539 3120929
59089 3120929 3133398 3151399 3174465 3202261 3235334 3273930 3317048 3363891 3415521 3473675 3538434
59078 3538434 3608500 3683409 3764033 3851002 3944112 4043292 4148672 4259491 4374464 4493830
59068 4493830 4619669 4753393 4893893 5038885 5187152 5338515 5492356 5647121 5800859
59059 5800859 5951366 6096254 6233989 6364940 6490590 6611477 6726448 6834141 6934672
59050 6934672 7029503 7120093 7207368 7292536 7377664 7464839 7555068 7648741 7747307 7853665 7970413
59039 7970413 8098076 8235523 8381461 8534621 8692545 8851142 9005657 9151572 9284247
59030 9284247 9398192 9487356 9546415 9571997 9562899 9519380 9442519 9334543 9199637 9043789 8873469
59019 8873469 8694544 8512133 8330451 8152214 7978933 7812413 7655213 7508814 7372065
59010 7372065 7242533 7118856 7000544 6885837 6771416 6654641 6535015 6413062 6288738
59001 6288738 6161223 6029360 5891853 5747909 5598179 5444528 5288631 5131435 4974005
58992 4974005 4817822 4663809 4512016 4362895 4218089 4079214 3946493 3819251 3697205
58983 3697205 3580545 3469227 3362911 3261450 3165040 3074160 2989540 2911564 2839302 2770867
58973 2770867 2705327 2643659 2587221 2536011 2489189 2446611 2408655 2374905 2344295 2316630 2292895
58962 2292895 2273727 2258312 2245120 2233236 2222669 2213710 2206154 2198991 2190919 2181512 2171759 2163089 2156014
58949 2156014 2150142 2145332 2142200 2141413 2142890 2145749 2148710 2150689 2151473 2151801 2152446 2153344 2154000 2154322 2154350 2153478
58933 2153478 2150975 2147294 2143835 2141117 2138088 2133643 2127955 2121831 2115800 2110717 2108487 2110822 2117356 2125935
58919 2125935 2134829 2143934 2153804 2164480 2175630 2187240 2199720 2213730 2230140 2249645 2271925 2295462
58907 2295462 2318743 2341591 2365050 2390125 2416996 2445305 2474595 2504351 2534154 2564291 2595992
58896 2595992 2630462 2667503 2705496 2743110 2780978 2821325 2865859 2914287 2965104 3017613 3072891
58885 3072891 3132782 3198275 3268963 3343814 3422233 3504549 3591760 3684910 3784443 3889911 4000287
58874 4000287 4114715 4233204 4356783 4487027 4625381 4772836 4930168 5098351 5278570
58865 5278570 5471843 5678778 5899914 6136310 6389807 6662762 6957584 7276495 7621448
58856 7621448 7993958 8394960 8825175 9286025 9780314 10311611 10882599 11493968 12144940
58847 12144940 12834634 13562693 14328670 15130712 15964077 16820037 17686318 18549220 19395360
58838 19395360 20210795 20978814 21679861 22294181 22804078 23194062 23451272 23568123 23544566
58829 23544566 23386645 23102885 22702878 22198709 21605821 20941496 20222795 19465681 18684645
58820 18684645 17892206 17099039 16314791 15548179 14806064 14093117 13412748 12767744 12159681
58811 12159681 11588366 11052466 10550424 10080603 9641243 9230926 8848873 8494341 8165813
58802 8165813 7860803 7576234 7309234 7058255 6823487 6605507 6403449 6215280 6039890
58793 6039890 5877768 5729228 5593131 5468062 5353817 5250852 5159015 5077652 5006367 4944843
58783 4944843 4892561 4849488 4816369 4793455 4779676 4774168 4778068 4793513 4821103 4859391 4906595 4961733
58771 4961733 5024424 5094952 5174646 5265125 5367015 5480258 5605509 5744065 5896279 6061263
58761 6061263 6238591 6429392 6635451 6858058 7098204 7357189 7636593 7938181 8264151
58752 8264151 8616999 8998827 9411243 9856079 10335629 10851957 11406414 11999994 12633564
58743 12633564 13307295 14019863 14768040 15546515 16347990 17163714 17983674 18795661 19584181
58734 19584181 20330885 21016325 21621304 22127539 22518886 22783202 22913375 22906903 22765118 22493068
58724 22493068 22099894 21599108 21007898 20344688 19625991 18865472 18076013 17271402 16464734
58715 16464734 15665839 14881634 14118463 13382397 12677367 12004744 11365058 10758809 10185550
58706 10185550 9643952 9133487 8654752 8207605 7790300 7401031 7038919 6702651 6389473
58697 6389473 6096702 5823353 5569301 5333638 5114780 4911452 4722653 4547266 4384640
58688 4384640 4235017 4098547 3974219 3860351 3755533 3658484 3567726 3482331 3402467 3328413
58678 3328413 3259530 3195021 3135222 3081037 3032191 2986876 2943147 2900137 2857936 2816879 2777087
58667 2777087 2738470 2701102 2665362 2631377 2598561 2566399 2535521 2506881 2479580 2450729 2418230
58656 2418230 2382747 2346236 2309426 2271698 2232621 2192323 2150758 2107749 2063682 2019328 1975083
58645 1975083 1931127 1888153 1847165 1808491 1771570 1735704 1700618 1666497 1634021 1604192 1577495
58634 1577495 1553201 1529932 1506956 1484563 1463161 1442445 1421728 1400943 1380925 1362353 1344601
58623 1344601 1326353 1307561 1289971 1274998 1261876 1248964 1236220 1224916 1215305 1206374 1198038 1191782
58611 1191782 1188555 1187535 1187653 1188853 1191063 1193302 1194925 1196677 1199595 1203829 1209390 1216936 1226749 1237706
58597 1237706 1248056 1256405 1261470 1262279 1259588 1255895 1252927 1250156 1246736 1243534 1241921 1241813 1242470 1244227
58583 1244227 1247856 1253080 1259249 1266728 1276082 1286711 1297991 1311119 1328086 1349222 1373295 1399557
58571 1399557 1428121 1458766 1491032 1525290 1562245 1601644 1642907 1686696 1734509 1787059 1844369
58560 1844369 1906917 1975098 2048191 2125697 2209329 2301832 2404090 2515362 2636137 2768568
58550 2768568 2913887 3071549 3241386 3424606 3621862 3831904 4052847 4283210 4520800
58541 4520800 4761734 5001308 5234783 5456668 5660274 5838713 5985886 6096499 6166371 6193402
58531 6193402 6177740 6120998 6026197 5898327 5743625 5567784 5375568 5172100 4963236 4754263
58521 4754263 4548934 4349707 4157873 3973483 3796474 3628244 3471247 3326928 3195017
58512 3195017 3074792 2965917 2867968 2780283 2702365 2633339 2570995 2512639 2457160 2405228 2357429
58501 2357429 2313309 2272200 2233617 2196739 2160800 2126260 2094379 2065276 2037337 2008666 1978373
58490 1978373 1946770 1915381 1886350 1860541 1836516 1812584 1789004 1766417 1743139 1716754 1688145
58479 1688145 1661006 1636950 1613711 1588898 1562855 1536812 1510765 1484597 1459099 1434349 1409008
58468 1409008 1382723 1357503 1335189 1315244 1296628 1280131 1266871 1255753 1244489 1232392 1220438
58457 1220438 1209069 1197587 1185469 1173078 1161159 1150321 1140630 1131232 1121053 1110277 1100284 1091804
58445 1091804 1084280 1077496 1072382 1069454 1067860 1066961 1067571 1070605 1075703 1082230 1090423 1100299 1110450 1119219
58431 1119219 1126403 1132914 1139563 1146850 1154888 1162620 1168186 1171051 1172720 1174572 1176003 1175523 1172396 1166351
58417 1166351 1157096 1145287 1132816 1121075 1110062 1099995 1092053 1086168 1079820 1070903 1060635 1051827
58405 1051827 1045300 1039757 1034229 1028644 1022609 1015617 1008338 1002143 997318 992927 988295 983664 979655 976825
58391 976825 975372 974612 973294 970929 968073 964999 961386 957883 956416 957946 961378 965701 971607 979701
58377 979701 988760 997412 1006177 1016226 1027572 1040157 1055255 1073668 1093756 1113325 1132451 1152291
58365 1152291 1172135 1189880 1204642 1216619 1225059 1228863 1228888 1227291 1224630 1219713 1212302 1203953 1196062
58352 1196062 1188903 1182799 1178513 1176167 1175033 1174501 1174263 1173915 1173705 1175226 1179807 1186538 1193428 1200184 1208186
58337 1208186 1217927 1228174 1237692 1246215 1253513 1258905 1262037 1263232 1263106 1262499 1262302 1262465 1261717 1259294 1256221
58322 1256221 1253835 1251953 1249821 1247924 1247322 1248050 1249800 1253300 1259187 1266312 1273194 1280585 1290538 1303260
58308 1303260 1316864 1330003 1342856 1355702 1368429 1381436 1395203 1408822 1420507 1429651 1437191 1444214
58296 1444214 1451490 1459946 1470044 1480928 1491424 1501475 1511422 1520864 1529763 1539684 1551897 1564978
58284 1564978 1576402 1586018 1595873 1606937 1618007 1627559 1634749 1638878 1639928 1639671 1640574 1643619 1648324 1654242
58270 1654242 1660954 1667487 1673443 1679871 1687406 1694790 1701274 1709139 1721258 1737101 1753730 1769895 1786514
58257 1786514 1804066 1822479 1843037 1867325 1894447 1921968 1949248 1977241 2005543 2032591 2058411
58246 2058411 2084352 2110417 2135769 2161364 2188874 2217192 2243217 2266031 2287381 2308358 2328928
58235 2328928 2350450 2374971 2401814 2428331 2454247 2481913 2512116 2543266 2575061 2609219 2645963
58224 2645963 2683437 2721364 2761713 2804961 2849358 2894957 2944768 3000572 3060743 3123492 3189184
58213 3189184 3258244 3329767 3403506 3480606 3561305 3644501 3730302 3820260 3914522 4011556 4111239
58202 4111239 4215197 4323631 4434997 4549317 4668672 4794030 4924883 5062410 5209371
58193 5209371 5366301 5531279 5703991 5886488 6079609 6282328 6494985 6719224 6954399
58184 6954399 7198107 7450753 7715667 7994649 8287771 8597482 8927916 9279815 9651172
58175 9651172 10043296 10460886 10905638 11375721 11872663 12403020 12971792 13579709 14228472
58166 14228472 14923259 15668653 16467059 17321981 18237674 19215568 20257111 21370077 22565573
58157 22565573 23849321 25223668 26697891 28287724 30004437 31853739 33846338 36000169
58149 36000169 38332087 40858845 43608220 46618602 49927209 53572539 57612511 62129142
58141 62129142 67214005 72962154 79481450 86894265 95334152 104967074 116023863 128786917
58133 128786917 143522631 160422782 179602006 201144559 225183696 251948453 281590655
58126 281590655 313665378 346547348 377396588 402948911 420619317 429112013 428314364
58119 428314364 418942331 402363278 380495844 355509951 329379032 303576526 279036347
58112 279036347 256250814 235385532 216404772 199199506 183666312 169724831 157306616
58105 157306616 146318687 136577713 127778833 119571131 111690733 104022658 96556468 89325801
58097 89325801 82395988 75860861 69805146 64263507 59219437 54629827 50441930 46602972
58089 46602972 43072401 39825313 36840848 34095024 31569105 29255168 27146634 25230240
58081 25230240 23491919 21922072 20508789 19232596 18073540 17017790 16053126 15164659
58073 15164659 14340197 13574332 12862703 12197479 11572495 10987320 10441792 9931196 9450609
58064 9450609 8999199 8576343 8177999 7800562 7443912 7106978 6784595 6472387 6170948
58055 6170948 5881771 5602854 5331785 5069650 4818578 4578581 4349885 4135165 3936501
58046 3936501 3752889 3583066 3427551 3285469 3152812 3026650 2908130 2798890 2697697
58037 2697697 2603113 2516232 2437856 2365817 2297798 2234161 2175483 2120043 2066413 2015892 1969684
58026 1969684 1926041 1882791 1840435 1800208 1761270 1722335 1683982 1646980 1610230 1572712 1535604
58015 1535604 1500320 1466326 1432923 1401156 1371736 1343003 1313340 1283975 1257139 1233005 1210611
58004 1210611 1190350 1173240 1158809 1145649 1133225 1121529 1109841 1097181 1083168 1067773 1051609
57993 1051609 1037011 1026703 1020308 1014201 1006026 997262 990011 983658 976652 969551 963983 959936 955978
57980 955978 951103 944826 936751 927482 918849 912037 906700 902681 900764 900537 899549 896206 891857 888524 886144
57965 886144 883517 880231 875978 869580 860563 850509 841256 832831 824423 816066 808061 800092 792195 785344
57951 785344 779955 775205 770774 767479 765101 761558 755697 749085 743549 738692 733262 727085 720239 712445
57937 712445 704984 700948 701485 703743 704694 704998 706751 709480 711293 712484 714960 719080 723749 728722 734169
57922 734169 738756 740825 740881 740472 739256 735713 730237 724974 720930 717640 715378 714978 715460 714359 710815
57907 710815 706277 701809 696838 691007 685283 680477 676186 671812 667377 662884 658084 653334 649535 646734
57893 646734 643613 638836 632428 625749 620496 617422 615475 612667 608424 604470 602638 602649 603090 603746 605518
57878 605518 608506 611639 614131 616132 618058 620185 622714 625343 627014 626820 624836 621518 616883 610890
57864 610890 603823 595638 585979 575662 566867 560700 555780 550664 546342 544506 544382 543422 540706 537686
57850 537686 535866 535455 536136 537491 538828 540084 542668 547949 555085 561761 566738 570322 572864 574599 576661
57835 576661 580290 584904 588550 590370 591031 590799 588992 585672 582080 578801 574886 569472 563177 557282 552409
57820 552409 548397 544748 540939 536928 533350 530647 528236 525368 522321 519691 517031 513686 510696 510165
57806 510165 512462 515595 517834 519746 522979 527942 533314 537383 539618 541210 543895 547843 551261 552739
57792 552739 553215 554446 556252 556861 555722 554252 553630 553305 552086 549521 545786 541142 535907 530387 524720
57777 524720 519286 514903 511869 509244 505916 501856 497429 492372 486833 482552 481046 481028 479608 475984 471897
57762 471897 468434 464615 459613 454194 448982 443111 435780 427844 420764 414961 410071 405892 402212 398460
57748 398460 394292 390106 386647 384630 384725 386950 390041 392427 393930 395411 396813 397066 396086 395147 394725 393656
57732 393656 391314 389133 388778 389993 391494 393094 395687 399559 403771 407016 408524 408526 408207 408787 410345 412083
57716 412083 413719 415679 417784 418948 418623 417402 415626 412626 408260 404048 401685 401109 401029 400674 399964 398540
57700 398540 395880 392319 389070 387076 386358 386488 387368 389458 393244 398298 403136 406528 408838 411376 414599
57685 414599 417909 421121 424846 429167 433318 437183 441710 447023 451417 453456 454165 455844 459275 463321
57671 463321 466807 469535 471655 473302 475079 477952 482276 487449 492775 498321 504695 512140 520012 527286
57657 527286 533714 540298 548189 557233 566215 574508 582751 591700 601300 611336 622234 634538 648104
57644 648104 662471 677683 694145 712011 731245 752008 774345 797603 820830 843971 868311
57633 868311 895441 925872 958867 993708 1030803 1071097 1114655 1160770 1209805 1263842 1324638
57622 1324638 1391846 1464476 1543404 1630894 1728121 1835085 1953071 2085170 2233555 2397772
57612 2397772 2576640 2770583 2981175 3209516 3455784 3718732 3993548 4270357 4536042
57603 4536042 4777792 4984920 5148913 5264007 5328332 5343711 5313938 5243353 5136743 4999703
57593 4999703 4838639 4660282 4470865 4275404 4077831 3881765 3690780 3507840 3334848
57584 3334848 3172785 3021799 2881168 2750036 2628540 2517734 2418174 2329226 2250040 2180595
57574 2180595 2121362 2072325 2032541 2000238 1973422 1951061 1933868 1923286 1919731 1922456 1930890 1945036
57562 1945036 1964604 1989036 2018652 2054594 2097478 2147395 2205487 2273853 2353226 2442251 2539974
57551 2539974 2647574 2766537 2896313 3034948 3180680 3331437 3483691 3633348 3777233
57542 3777233 3912357 4034261 4137303 4216295 4267160 4287042 4275303 4234002 4166258 4074509 3961246
57531 3961246 3830539 3687337 3535748 3379139 3221124 3064719 2910991 2760247 2614298
57522 2614298 2475809 2345597 2222533 2106285 1998291 1899505 1808986 1725559 1649328 1580391
57512 1580391 1517296 1458075 1402257 1350747 1304159 1262223 1224514 1190838 1160814 1133746 1109129
57501 1109129 1086991 1067633 1051206 1037521 1026066 1016173 1007302 999350 992744 988093 985468 984055 982873
57488 982873 981876 981957 983800 987273 992240 999243 1008735 1020034 1031761 1043272 1055206 1068783 1084942
57475 1084942 1103881 1124905 1146907 1169577 1194076 1221982 1253542 1287372 1322025 1357681 1396430
57464 1396430 1441043 1493266 1552967 1618971 1690775 1769266 1855734 1950630 2053438 2163384 2279914
57453 2279914 2402674 2531012 2663131 2795744 2925121 3048405 3163082 3265167 3349110 3410057
57443 3410057 3445465 3454345 3436571 3394102 3331661 3254409 3164999 3063875 2952169 2833286 2711820
57432 2711820 2591789 2475740 2364596 2258261 2156929 2061768 1973997 1893805 1820773 1754872
57422 1754872 1696290 1644674 1599330 1559888 1526086 1497384 1473513 1454845 1441312 1431531 1424137 1419567
57410 1419567 1419267 1423448 1431042 1441895 1457489 1479015 1505978 1537466 1573968 1617106 1667927 1726076
57398 1726076 1790550 1860884 1937558 2021373 2112501 2210194 2313238 2420259 2529548 2639025
57388 2639025 2746367 2848442 2940522 3017169 3074560 3111223 3126084 3117148 3083301 3026548 2951132
57377 2951132 2861041 2759591 2650620 2538107 2424294 2309502 2194056 2079364 1967066 1858338
57367 1858338 1754391 1656703 1566192 1482589 1404842 1331862 1263136 1199092 1140545 1087187 1037109
57356 1037109 988670 942391 900012 862001 827118 794232 763386 735039 709370 686452 666215
57345 666215 648085 631349 615816 601382 587247 572585 557841 544326 532578 522088 512459 503673
57333 503673 495264 486573 478135 471662 468172 466902 466284 465334 463974 462837 462862 464341 466340 467704 468335
57318 468335 468576 467843 465329 462084 460766 462754 466610 469775 470832 469812 467440 464810 463057 462743 463827
57303 463827 466179 469384 472191 473241 472618 471747 471601 471810 471665 471013 469993 468766 467663 466794 465542 463478
57287 463478 461698 461963 464320 466889 468337 469301 470923 473269 475811 478331 480591 482026 482562 483062 484418
57272 484418 486774 489993 494188 499432 505570 512431 519547 525825 530614 535175 541684 550471 559531 567259
57258 567259 574298 581957 590169 598025 605350 612667 620258 628160 636608 645808 655577 665587 675480 684692
57244 684692 693000 701468 711811 724384 737761 750739 763680 777309 791352 805360 820096 837050
57232 837050 856896 879025 902216 925354 947930 970262 993034 1016535 1040675 1065298 1089700
57221 1089700 1112246 1131698 1148734 1164955 1180710 1195469 1209945 1225513 1241222 1253862 1262048
57210 1262048 1268123 1274751 1281583 1286832 1290297 1292833 1294150 1293235 1290193 1285723 1279315 1269685 1256826 1242215
57196 1242215 1227282 1212865 1199824 1188825 1179502 1170868 1162464 1154338 1146180 1137404 1128040 1118923 1111157
57183 1111157 1105735 1103212 1103259 1104945 1107768 1111757 1116384 1120554 1124329 1129510 1137496 1147555 1158178 1169217
57169 1169217 1181421 1194676 1208170 1221986 1237231 1254679 1274219 1295539 1318526 1343079 1369230
57158 1369230 1397423 1428293 1462284 1499626 1540181 1583060 1627016 1671597 1717425 1765213 1815256
57147 1815256 1867987 1923990 1983121 2044588 2108174 2174219 2242104 2310072 2377136 2443909 2510923
57136 2510923 2577490 2642949 2707725 2772372 2836851 2901451 2966917 3032715 3096617 3157110 3214874
57125 3214874 3270809 3324066 3373319 3418829 3462053 3504412 3547363 3592086 3637731 3681494 3722006
57114 3722006 3761434 3802817 3846589 3891190 3935715 3980324 4025301 4071417 4120125 4171819 4224922
57103 4224922 4278086 4331994 4387617 4444376 4501877 4561805 4625877 4693110 4761272 4829935 4900074
57092 4900074 4971933 5045566 5122265 5202907 5285658 5367758 5449013 5531383 5615813 5701549 5787793
57081 5787793 5873792 5957956 6039121 6118195 6196663 6274206 6349683 6423495 6496817 6569301 6639670
57070 6639670 6707759 6773964 6837702 6898531 6957677 7016242 7072942 7125676 7173962 7217633 7254835
57059 7254835 7283908 7305550 7320268 7325445 7318024 7298354 7268126 7226446 7171828 7106592 7035490 6961562
57047 6961562 6887604 6820605 6771093 6750069 6771492 6857424 7038212 7351108 7843234 8570754
57037 8570754 9584025 10907948 12534137 14424498 16519003 18754209 21092384 23530065
57029 23530065 26064669 28663160 31298335 34032828 37041775 40506993 44446461 48606290
57021 48606290 52491711 55535574 57345670 57911753 57628208 57089196 56794478 56971963 57593059
57012 57593059 58488711 59449990 60285105 60854099 61078494 60911668 60290517 59112428 57259086
57003 57259086 54653768 51320652 47409938 43165359 38850158 34682038 30812468 27337587
56995 27337587 24308562 21733754 19586410 17821471 16390033 15245010 14342077 13639180
56987 13639180 13094885 12669206 12329605 12056000 11837285 11663090 11520684 11398389 11288478
56978 11288478 11186300 11088789 10994037 10900378 10805449 10707221 10605636 10501827 10395986 10287346
56968 10287346 10175997 10063344 9950747 9838785 9727727 9617772 9508893 9401256 9295569
56959 9295569 9192357 9091173 8991256 8892616 8795723 8700295 8605097 8508942 8411572 8313238 8212615
56948 8212615 8103750 7974844 7811614 7603671 7348625 7051189 6720076 6366050 6000930
56939 6000930 5635964 5280099 4939365 4617138 4314705 4032255 3769853 3527249 3303113
56930 3303113 3095619 2904076 2729087 2570908 2428484 2300185 2184245 2078245 1979566 1887012
56920 1887012 1800980 1721419 1646702 1574879 1504820 1435579 1366271 1297572 1231930 1170918 1113398
56909 1113398 1057687 1004520 956242 913644 875325 840055 808226 780744 757819 739444 726305
56898 726305 719584 719980 726948 738508 751573 762761 769340 769938 764819 755364 742754 727102 708246
56885 708246 687191 665894 645496 625581 605394 585021 565189 546935 531962 522143 517757 516866
56873 516866 517380 519162 523234 529359 535478 539385 540060 537223 530322 518337 500375 476399 447536 415669
56859 415669 382633 349823 318358 289133 262590 238833 218032 200209 184556 169653 154775
56848 154775 140494 127696 116540 106888 99215 94242 91665 89783 86805 82559 78764 77363 78459
56835 78459 80296 81616 83527 88406 97301 109356 123613 140245 159705 181676 205358 230110 255351
56822 255351 280325 304329 326786 347008 364436 379215 391781 401797 408342 411504 412894 414151
56810 414151 415587 416799 417978 420183 424833 433207 445802 461932 480712 502681 529465 561261 595503
56797 595503 628555 657837 681636 698007 705392 704066 695906 682818 666085 647069 627508 608957
56785 608957 592477 579024 569719 565520 566818 573454 585257 602694 626897 658794 698324 744819
56773 744819 797508 854560 911641 962737 1003038 1030412 1044155 1043772 1029784 1004455 970541 930102
56761 930102 885511 840666 799522 763540 731715 703044 678080 658279 645003 639184 640985 649474
56749 649474 663469 682878 708323 739004 771493 801140 824393 839548 845828 842535 829399 807469
56737 807469 779126 746860 711969 674810 636381 599224 566339 539258 517404 499214 483692
56726 483692 471022 462075 457660 458361 464806 477279 494422 512712 528129 538571 544184 545428 541659
56713 541659 531803 515676 494284 469415 443229 417537 392934 368973 345468 323109 302546 283520
56701 283520 265412 248230 232625 219294 208714 200961 195440 191079 187074 183159 179195 175139 171477
56688 171477 168857 166992 164795 162006 159785 159153 159699 160513 161663 163889 167306 171146 174419 176438 177238
56673 177238 177841 179344 181188 181341 179065 176528 176513 179187 182419 184720 186361 187737 188224 187105 184624
56658 184624 181514 178090 174250 170044 165917 162383 159386 156020 151308 145486 140021 136004 133166 130862
56644 130862 129306 129053 129904 131234 132882 134725 135686 134308 130276 124626 118537 112781 108191 105637 105108
56629 105108 105392 105007 103365 101186 100059 101269 104631 108709 112411 115911 119717 123592 127013 129844 131829
56614 131829 132226 131105 130338 131982 136040 140929 145683 150338 154656 158254 162042 167802 175875 184695 193083
56599 193083 201649 211318 221826 232563 243781 255792 267560 277180 283604 287405 290158 293551 298524
56586 298524 304453 309200 310496 307532 301253 293305 284663 275002 263410 249887 235898 222982 211131
56573 211131 199315 187451 176803 168210 160782 152832 143488 133049 122381 112347 103394 95355 88008
56560 88008 81943 78212 76956 77036 77278 77452 77825 78645 80541 84490 90523 97056 102317 106079 109338 112848
56544 112848 116872 121882 128249 135136 140762 144073 145447 145440 143751 140055 135217 130825 127673 125380 123431
56529 123431 121804 120383 118542 115947 113359 111897 111530 110974 109286 107080 105903 106700 109115 111965 114117
56514 114117 115182 115733 116814 119033 122118 125226 127525 128690 129342 130880 134151 138248 141417 143436 146122
56499 146122 150944 157087 162740 167501 172284 177392 182084 186101 190332 195628 201882 208562 215343 221770
56485 221770 227055 230819 233624 236197 238248 238515 236148 231958 228095 226161 225612 224500 221925 219041 217050
56470 217050 215018 210909 204678 199099 197017 198464 200821 201283 198826 194333 189406 185061 181331 177938
56456 177938 174937 172397 169804 166488 162703 159709 158599 159293 160733 161727 161602 160354 158362 156018 153735
56441 153735 152096 151299 150379 147903 144078 141276 141460 143582 144640 143005 139616 136077 132852 129583 126260
56426 126260 123602 122657 123972 126641 128596 128785 128785 131211 136657 143318 149506 155014 159761 162794 163587 163275
56410 163275 163582 165221 168043 172006 177084 182697 188134 193351 198743 204369 210025 215930 222756 230873
56396 230873 239856 248793 257063 264904 273173 282380 292028 301132 309153 316059 321748 326013 328983 331024
56382 331024 332322 333065 333702 334261 333720 331080 326980 323180 320364 317525 313677 309007 303978 298457 292284
56367 292284 285784 279074 271636 263135 254036 244941 236043 227620 220177 213723 207817 202878 200348 200729
56353 200729 202450 203662 204314 205297 206219 205554 202856 199538 197254 196461 196787 197941 199659 201246 201799 200980
56337 200980 199357 197872 197012 196623 196506 196781 197389 197697 197222 196502 196465 197050 197351 197120 197160 197995 199138 200049
56319 200049 200822 201420 201049 199043 195782 192313 189690 189092 191570 196828 202859 207681 211080 214158 217735
56304 217735 221885 226422 230990 235058 238548 242130 246255 250335 253576 256128 258539 260555 261550 262059 263836
56289 263836 268099 274310 280780 285936 289063 290382 290625 290282 289320 287929 287175 288279 291222 294690 297490
56274 297490 299612 301828 304699 308219 311978 315324 317485 317985 317212 316537 317627 321411 327588 335103 342864
56259 342864 350050 356177 361276 365793 369992 373646 376674 379789 384096 390306 398749 409594 422254 434931
56245 434931 445856 454959 463541 472463 481775 491937 503867 517180 529626 539241 546546 554005 563761
56232 563761 576179 590002 603457 615612 626980 638488 649980 660428 669619 678786 689431 702229
56220 702229 717044 733056 748820 763451 778041 794851 814818 836979 860726 887328 918482
56209 918482 954406 994089 1036583 1081456 1128797 1179330 1233863 1292424 1354952 1422933 1498934
56198 1498934 1584043 1677285 1778223 1888571 2010173 2142761 2284925 2436089 2596233 2764552
56188 2764552 2939630 3120154 3304442 3489955 3674123 3854750 4028761 4191642 4339167
56179 4339167 4468937 4579529 4669446 4737922 4785495 4812595 4818741 4804408 4772482 4726464 4668301
56168 4668301 4599188 4520943 4434825 4340326 4237261 4128136 4016390 3903011 3786838 3667483
56158 3667483 3545812 3422129 3296180 3168795 3041481 2914571 2787807 2662609 2541600
56149 2541600 2425634 2313198 2203045 2095718 1992375 1893878 1801331 1715722 1636636 1562898
56139 1562898 1494815 1433992 1380303 1330706 1282020 1233866 1188316 1147646 1112789 1082750 1054883
56128 1054883 1026740 998325 971965 949774 931983 917607 905561 894922 885302 877351 871842 867987
56116 867987 863761 858330 853104 849966 849482 851348 855483 861925 870376 880649 893116 908082 925089
56103 925089 943249 962003 981152 1000443 1019590 1038664 1058186 1078571 1099411 1119556 1138283
56092 1138283 1156205 1174505 1193443 1212482 1231726 1252000 1273333 1294869 1316983 1342023 1371972
56081 1371972 1406624 1445165 1488302 1537536 1593405 1655761 1724911 1801303 1885013 1976494 2076308
56070 2076308 2182640 2290586 2395721 2497063 2594791 2686925 2771041 2847951 2920302 2987803
56060 2987803 3046843 3094808 3131948 3158707 3174072 3177441 3169897 3152710 3126327 3091388 3048928 2998823
56048 2998823 2939558 2870120 2790952 2702975 2607331 2506424 2403657 2301737 2202389 2107672 2019906
56037 2019906 1939995 1867288 1801387 1742874 1692177 1648952 1612546 1581973 1555812 1533479 1516062
56026 1516062 1504358 1496682 1490370 1484951 1481891 1481771 1483809 1487655 1493360 1499862 1505763 1511322 1517425 1523055
56012 1523055 1526479 1528634 1532446 1538640 1545187 1551227 1558614 1568754 1580575 1592581 1604701 1617304 1630477
55999 1630477 1644953 1661806 1680743 1700558 1721453 1744847 1770804 1797988 1826189 1856406 1888227
55988 1888227 1919773 1950658 1982569 2016587 2052345 2089989 2130316 2172717 2215669 2259530 2306253
55977 2306253 2356212 2408164 2462364 2520621 2583047 2647881 2714729 2784700 2857130 2929821 3002991
55966 3002991 3079422 3160202 3243911 3330476 3421803 3517885 3616434 3717557 3824829 3940529 4063564
55955 4063564 4193277 4331350 4478648 4634036 4797649 4971516 5155791 5348287 5548814
55946 5548814 5759918 5982295 6213853 6454446 6707024 6972901 7250587 7540624 7846783
55937 7846783 8171131 8512856 8873154 9256069 9663283 10093789 10550099 11038680 11562738
55928 11562738 12121038 12715599 13353740 14040468 14775998 15562988 16408468 17315944 18283917
55919 18283917 19315681 20422477 21613501 22891504 24262307 25739579 27335691 29057188
55911 29057188 30914318 32925613 35108184 37474076 40042333 42844616 45914137 49282486
55903 49282486 52996328 57127165 61759476 66983806 72909330 79668296 87401564 96260893
55895 96260893 106439753 118186753 131782488 147527494 165753907 186789417 210848846
55888 210848846 237939678 267799168 299710512 332157965 362666580 388245381 406318146
55881 406318146 415486180 415642582 407616358 392814421 373009160 350095667 325758135
55874 325758135 301231204 277292285 254392360 232774701 212547631 193737471 176315908
55867 176315908 160203146 145289314 131487382 118766077 107128834 96576770 87097948
55860 87097948 78668058 71236988 64718300 59004238 53989137 49575943 45674161 42206135
55852 42206135 39112514 36344167 33852857 31595331 29540565 27666098 25951105 24377590
55844 24377590 22932903 21605127 20379394 19242581 18187305 17207709 16295877 15445728
55836 15445728 14655286 13921252 13235943 12593006 11991137 11428445 10898176 10394216 9916259
55827 9916259 9465273 9037983 8630160 8241625 7873716 7524971 7193116 6878290 6580656
55818 6580656 6297547 6026343 5767543 5521971 5287532 5061409 4842936 4632083 4428234
55809 4428234 4232933 4050659 3884237 3732240 3592824 3466306 3351447 3243195 3137567
55800 3137567 3035598 2939392 2847632 2758361 2672952 2593420 2518503 2446136 2377380 2314118 2254992
55789 2254992 2197350 2141369 2088596 2038019 1987223 1936357 1887635 1841727 1797490 1754474 1713216
55778 1713216 1673924 1636939 1603330 1573031 1543808 1514182 1485823 1460926 1438900 1418143 1399540
55767 1399540 1385479 1376472 1371152 1368513 1367836 1367331 1365110 1360888 1355111 1347432 1337632 1326698 1315256 1302216
55753 1302216 1286557 1268919 1249936 1228897 1205985 1183770 1164046 1144926 1123518 1099966 1076460
55742 1076460 1053897 1032211 1012492 995815 981029 966460 952732 941156 930435 918181 905155
55731 905155 894935 889424 887282 886588 886355 885434 882661 878761 876059 875723 876655 877250 876892 875772 874619 874432
55715 874432 875284 875763 874619 872245 869409 865780 861443 858661 859882 864736 871204 879034 889560 902320
55701 902320 914208 922091 924396 920239 909120 891877 870324 845663 818369 789280 759350 728771
55689 728771 697965 668879 643306 620277 597211 573588 551394 532013 514882 499528 486659
55678 486659 476461 467654 459156 451332 444842 439586 435483 433084 432486 432355 430721 426482 420130 413465
55664 413465 408335 404792 400725 394210 385886 378035 371704 366091 360570 355831 352752 351243 350487 349647 348429
55649 348429 347694 349109 353281 358631 363173 366896 371221 376652 382376 387607 391639 392947 390129 383905
55635 383905 376602 369514 362248 354565 347100 339976 332467 324624 317811 313134 310600 310119 311868 315105
55621 315105 318059 319822 321325 323875 327715 332483 337952 343697 349018 353814 358711 363844 368423 371890
55607 371890 374476 376110 375957 373904 371529 370470 370302 369072 365687 360945 356208 351804 347149 342187 338150
55592 338150 336510 337382 339634 342630 346845 352192 356841 358925 358866 358675 359278 359821 359503 358736 358309 358564 359651
55575 359651 361533 363494 364507 364294 363233 361200 357418 351519 343834 334635 324145 313348 303564 294811
55561 294811 285635 274950 263251 251682 240875 231067 222394 214481 206437 197857 189367 181854 175640
55548 175640 170668 166973 164670 163761 163948 164289 163365 160533 156887 154184 152827 151732 150048 148069 146395
55533 146395 145189 144531 144623 145266 145754 145538 144595 143203 141815 141012 140925 140929 140457 139627 138336 135405 129929 123146
55515 123146 117644 114823 114208 114835 115834 115882 113841 110249 106845 104463 102757 101864 102567 104491 105926 106055
55499 106055 105902 106614 108232 110566 113505 115846 115672 112913 109968 108618 107742 105312 101419 97958 96294
55484 96294 96365 97203 97316 95468 92214 89813 89692 90889 91864 92619 93812 95011 95511 96060 98030 101222 104042
55467 104042 105683 106779 107921 108736 108587 107269 105042 102758 101896 103651 107794 112858 117417 120949 123876
55452 123876 127137 131288 135625 138779 140571 142490 145747 149601 152365 153274 152517 150250 146734 142965 140006
55437 140006 137807 135465 132238 127628 121165 113250 105783 100698 97905 95559 92195 87728 82691 77607
55423 77607 73134 69870 67856 66837 66857 67885 69084 69382 68645 67448 65807 63128 59505 56089 53779
55408 53779 52202 50376 47937 45462 43841 43509 44117 44933 45624 46442 47636 49118 50850 52896 54814 55726
55392 55726 55548 55303 55490 55000 52761 49784 48213 48573 49259 48759 47258 45913 45593 46516 48224 49625 49799
55375 49799 49017 48450 48874 50320 52753 56102 59609 62184 63745 65319 67466 69433 70322 70313 70138 69956 69362
55358 69362 68105 66202 63603 60328 56960 54602 54179 55718 58275 60651 62259 63143 63068 61150 57043
55343 57043 52242 49280 49274 50763 51271 49708 47044 45010 44476 44958 45400 45382 45467 46394 48058 49466 49589 48174
55325 48174 45964 44359 44553 46556 49066 50568 50497 49289 47577 45669 43545 41062 38397 36511 36746
55310 36746 39394 42914 45041 44644 42341 39651 37846 37187 36718 35123 32169 28989 26525 24316 21435
55295 21435 18162 15827 15282 16278 18099 20045 21453 22037 22152 22239 22278 22324 22988 24556 26190 27088 27874 29464
55277 29464 30959 30428 28004 26484 28087 31800 34610 34448 31381 27021 23615 22837 24493 26697 27824
55262 27824 27789 27141 25805 23483 20690 18467 17368 17302 18108 19649 21545 23250 24319 24457 23678 22577
55246 22577 21913 21624 20807 18988 16833 15203 14197 13743 14351 16306 18421 18717 16622 13841 12777 14335
55230 14335 17383 20026 21212 21194 20731 20212 19721 19467 19508 19229 17905 15894 14516 14494 15267 16162 17390 19353
55212 19353 21709 23780 25264 25823 24763 22084 19398 18665 20182 22762 25705 29444 34019 38013 39603
55197 39603 38238 34879 31126 28493 27981 29603 32189 34060 34188 32813 30993 29663 29151 29468 30628
55182 30628 32280 33323 32644 30435 28168 26951 26463 25841 24869 23658 21886 19385 17147 16562 17670 19133
55166 19133 20027 20720 21758 22915 23817 24629 25448 25750 25193 24469 24477 24997 25025 24176 22912 21420 19398 17275
55148 17275 16677 18803 22691 25921 27002 26491 25750 25334 24989 24689 24919 25930 27303 28511 29505 30410 30914
55131 30914 30440 28913 26903 24992 23471 22870 24170 27699 31965 34386 33649 30978 28815 28593 30091
55116 30091 32318 34163 34388 32104 27731 22904 18972 16054 13854 12586 12255 11725 9844 7539 7495 11141
55100 11141 16750 21183 22976 23054 22902 22983 22886 22181 20826 19245 18370 19260 22228 26236 29350 30016 28101
55083 28101 24757 21294 18258 15791 14640 16019 20013 24633 27352 27573 26927 27068 27953 28592 28717 28882
55067 28882 29321 29495 28815 27205 24941 22518 20804 20640 21988 23911 25683 27385 29052 29938 29451 28382
55051 28382 28239 29342 30550 31053 31461 32576 33984 34732 34914 35659 37692 40734 44275 47974 51007 51938
55035 51938 50092 46826 44703 45251 47788 50446 52004 52569 52800 52909 52565 51545 50204 49217 48933 49058
55019 49058 48992 48518 48092 48354 49317 50262 50590 50557 50861 51645 52380 52767 53270 54457 56138 57452 57721 57008 55984
55000 55984 55398 55635 56617 58030 59517 60696 61383 62002 63310 65169 66067 64680 61687 58996 57281 55552
54984 55552 53298 51557 51188 51485 51572 51962 53327 54668 54318 52322 50247 49011 48451 48774 50550 52994
54968 52994 54049 52789 50400 48157 45991 43924 43390 45573 49291 52190 53680 55309 58226 61575 63707
54953 63707 63985 62910 61229 59643 58956 59663 61257 62563 63106 63719 65310 67246 67752 66034 63334 61541
54937 61541 61373 62338 63795 65377 66908 68681 71353 74794 77516 78181 77208 76004 75070 74084 73234 72885
54921 72885 72185 69869 66615 64831 65669 67914 70226 72614 74941 76041 75644 75415 76458 77243 75851 73151
54905 73151 71742 72551 74530 77111 80622 84205 85587 83749 80446 78352 78655 80910 84186 87700 90998
54890 90998 94116 97277 100301 102727 104484 106001 107759 110220 113884 118717 123896 129047 135501 145156
54876 145156 158036 172030 185221 197424 209281 221032 232678 244309 255347 264079 268751 269039
54864 269039 266100 261402 255627 248339 238603 226293 212824 200082 188680 177888 167224 157159
54852 157159 148033 139297 130493 122328 116050 112195 110422 110171 110866 111909 113177 115429 119537 125249 131140
54837 131140 135988 140053 144867 151703 160290 169174 177416 185599 194826 205057 215129 224248 232539 239861
54823 239861 244881 245960 242716 236411 228968 221729 214674 206615 196517 184838 173201 162705 153192
54810 153192 144367 136728 130670 125262 119002 111718 104962 100378 98115 96913 95307 92603 89155 85986
54796 85986 84004 83383 83640 84209 84755 84962 84406 82891 80903 79366 78753 78557 77912 76666 75449 74625 73713
54779 73713 72187 70361 68865 67507 65468 62615 59855 57905 56431 54884 53663 53716 55013 56035 55150
54764 55150 52396 49554 48343 48733 49367 49425 49404 49884 50401 50240 49702 49713 50483 51573 53028 55343 58235 60567
54746 60567 61784 62484 63205 63671 63736 64172 65792 68467 71597 74857 77840 79717 80190 80370 81866 85202
54730 85202 89807 95188 101320 108117 115288 122686 130275 137978 146079 155478 166800 179411 192040 204209
54716 204209 216265 228103 238762 247408 253872 258041 259560 258592 256204 253339 249715 244179 236011 225681
54702 225681 214687 204935 197854 193488 190440 187071 182931 178938 176205 174886 174151 173054 171331 169432
54688 169432 168042 167708 168758 171252 174938 179491 184951 191713 200000 209629 220450 232579 245844 259444
54674 259444 272822 286568 301573 317191 331058 341135 347245 350166 349885 345598 337119 325475 312151
54661 312151 298397 285234 273154 261431 248492 233744 218675 205478 194763 185231 175520 165688
54649 165688 156795 149634 144095 139263 133932 127569 121119 116411 114378 114125 113961 112874 110773 108054 105612
54634 105612 104642 105479 106941 107702 108031 109195 111310 113001 113433 113506 114490 116281 117681 117853 116949 115740 115012
54617 115012 114915 114605 113060 110566 108815 109047 110722 112548 114214 116294 118875 121250 122970 124504 126567
54602 126567 129181 131648 133440 135055 137722 141895 146287 149199 150828 153196 157387 161913 164686 165687
54588 165687 166503 167874 169090 169588 169739 169848 169566 168746 167935 167574 167422 167292 167686 169105 171311 173879 177077
54571 177077 181484 186952 192730 198738 206002 215391 226419 237895 249446 261589 274205 285892 295418
54558 295418 303072 309679 314840 317352 317148 315430 312682 307943 300561 291338 281292 270597 259756 250456
54544 250456 243730 238106 231223 222801 214465 207026 199716 192196 185589 180892 177563 174293 170380 165979
54530 165979 161653 157914 154614 150795 145866 140772 137018 134731 132825 130993 130079 130288 130511 129872 128569
54515 128569 126615 123246 118389 113415 109420 105967 102566 100172 99779 100447 100291 98963 97724 97336 97259 96812
54499 96812 95842 94133 91241 87255 83038 79499 77031 75551 74637 73928 73961 76146 81035 86895 90982 92099
54483 92099 91053 88917 86119 83279 81571 81635 83043 85349 88763 93047 96561 97419 95478 92515 90441
54468 90441 89780 89907 90313 91359 93768 97532 101651 105214 108517 112691 118258 124600 130936 137238 143857
54453 143857 150632 156873 162129 166615 170841 175018 178823 181619 182828 182136 179499 175134 169529 163285
54439 163285 156828 150398 144246 138518 132846 126591 119854 113838 109715 107416 105994 104842 103831 102573
54425 102573 100540 98018 95991 94760 93611 92299 91959 93604 96329 98185 98690 99293 101047 102853 102865
54410 102865 101021 99132 98494 98453 97755 96541 96263 97947 101219 104886 107770 109053 108678 107673 107353 107878
54394 107878 108231 107986 108322 110617 114658 118925 122134 123609 122741 119376 114809 111220 109747 109705 109831 109518
54378 109518 108673 107301 105669 104200 102604 99669 94514 87841 81572 77460 76289 77957 81732 86394
54364 86394 90524 93020 93727 93759 94774 97277 99766 100234 98460 96099 94475 93267 91668 89909 89010 89691
54348 89691 92062 95752 99735 102632 103931 104528 105515 106866 107833 108093 107894 107666 108231 110755 115453 120867
54332 120867 125420 129345 133892 139003 143212 145927 148339 151597 155322 158552 161140 163411 165272 166525
54318 166525 167542 168698 169385 168364 165095 160283 155265 151212 148677 147314 146001 143668 140171 136290
54304 136290 132934 130449 128541 126663 124577 122633 121454 121303 121879 122560 122584 121249 118609 115979 114930
54289 114930 115430 115676 114358 112517 112466 115216 119629 123833 126675 127878 127708 126980 126923 128508 131833 136125
54273 136125 140291 143550 145860 147747 149580 151001 151246 149994 147762 145431 143427 141261 137938 133131
54259 133131 128028 124585 123636 124056 124113 123196 121754 119937 117174 113169 108651 104857 102538 101540 100985 99780
54243 99780 97216 93329 88736 84249 80647 78379 77108 75949 74572 73726 74152 75469 76899 78583 80963
54228 80963 83067 82928 80208 77072 75678 75723 75428 74150 72895 72620 73163 73867 74432 74949 75621 76515 77331
54211 77331 77505 76799 75545 74084 72423 70936 70779 72750 76015 78909 80862 82591 84448 85681 85739 85244
54195 85244 84987 84764 84106 83696 84911 87886 90911 92191 91727 90912 90589 90247 89195 87779 86810 86241 85307
54178 85307 83953 83182 83644 84698 85454 85929 86353 86085 84511 82719 82908 85837 89898 93070 94835 95813
54162 95813 96534 97243 98128 98924 98825 97580 96194 95805 96203 96326 95883 95637 96131 97014 97766 98291 98454 97653 95364
54143 95364 91835 87896 84308 81541 79955 79818 81031 83095 85408 87544 89196 89954 89368 87343 84447
54128 84447 81691 79998 79823 80944 82374 82830 81891 80735 81098 83282 85698 86631 85959 84852 84358 84801
54112 84801 86027 87443 88025 87018 84751 82307 80428 79126 78130 77144 75750 73718 71454 69599 68112
54097 68112 66352 64168 62343 61754 62597 64598 67465 70802 74015 76555 77935 77416 74359 69372 64511
54082 64511 61604 60558 59891 58757 57852 58287 60138 62407 64109 65121 65989 67038 67824 67629 66465 65219
54066 65219 64663 64695 64843 65078 65501 65502 64177 61854 60378 61175 63423 64967 64979 64795 65774 67179 67122 65291
54048 65291 63605 63871 65719 67501 68541 69467 70610 71197 70374 68205 65292 62191 59723 59158 61192 64887
54032 64887 68340 70410 71285 71422 70725 69162 67691 67843 70222 73781 76847 78696 79724 80204 79610 77673
54016 77673 75482 74579 75104 75824 76057 76396 77098 77019 75222 72799 71914 73443 76717 81056 86066 90506 92564
53999 92564 91848 89985 88685 88233 88329 89091 90325 90906 90264 89770 91348 95038 99166 102756 106426 110797
53983 110797 115258 118778 121063 122462 123460 124713 127001 130675 135561 141559 148715 156458 163570 169534
53969 169534 175267 181867 189135 196089 202482 208835 215148 220620 224862 228554 232511 236586 239969 242264
53955 242264 243969 246097 249470 254130 259216 263483 265974 266083 263324 257813 251079 245539 242456 240702
53941 240702 238054 233440 227422 220879 214118 207368 201341 196791 193844 192038 190733 189260 186979 183587
53927 183587 179377 175055 171383 168892 167551 166509 164563 161249 157314 153959 151936 151525 152750 154970
53913 154970 156751 157083 156626 156925 158394 159986 160955 161744 162647 162798 161580 160245 160861 163865 167757 170990
53897 170990 172951 173201 171300 168045 165694 165980 168441 171349 173638 175178 175934 175983 176016 176717 177688 177970 177654
53880 177654 177986 179664 181920 183655 184612 185004 184869 184651 185836 190025 197372 206584 216242 225522 233831
53865 233831 240768 246805 253247 260835 268672 275042 279201 281946 284435 286983 289267 291411 294277 298535
53851 298535 303754 308832 313260 317639 322785 328595 334028 338059 340502 342111 344081 347282 351505 355398
53837 355398 357471 357276 355501 352943 349735 345563 340248 333959 327216 320955 316175 312981 310012 305256
53823 305256 297620 287696 277142 267459 259142 251634 244159 236808 230635 226330 223072 219322 214629 209937
53809 209937 206017 202446 198519 194290 190020 185285 179640 173811 169144 165884 162934 159450 155775 152498
53795 152498 149434 146020 142180 138340 135014 132716 131692 131330 130402 128410 126279 125183 125177 125526 125788 125857
53779 125857 125456 124535 123821 123876 123801 122030 118480 114843 112557 111566 111400 112127 113479 114204 113503 112587 113592
53762 113592 117103 121552 124875 125964 124746 121914 118806 116724 116027 116348 117768 121026 126190 131784 135934
53747 135934 138158 139559 141387 143819 146160 147908 149479 152010 156407 162478 168952 174462 178606 182176
53733 182176 186452 192191 199013 205637 210932 214966 218908 223599 228345 231482 232254 231751 231721 232737 233942
53718 233942 234467 234568 235183 236663 238118 237856 234462 227981 220316 214155 210951 209823 208557 205592 201060
53703 201060 196289 192561 190103 187967 185178 182130 180253 179952 179566 177250 173384 170102 168739 168955 170211
53688 170211 172608 175864 178742 180270 180651 180386 179544 178643 179203 182203 186532 190110 192236 193835 195673
53673 195673 197404 198433 198896 199557 201092 203322 204858 204040 200840 197361 195649 195542 195500 194986 194715 194862
53657 194862 194485 192854 190221 187106 184072 182354 183294 186457 189404 190131 189022 187820 187618 188600 190939
53642 190939 194838 199956 205597 211338 216987 222193 226670 230540 234018 237044 239695 242712 247066 253018
53628 253018 259840 266345 271583 275380 278487 281934 286044 290311 294266 297942 301363 304322 307005 310089
53614 310089 313578 316128 316361 314654 312895 312506 313128 313242 311736 308957 306454 305483 305679 305532 304227 302363
53598 302363 300592 298454 295290 291643 288807 287208 286074 284587 282718 281011 280094 280224 280830 280768 279592
53583 279592 278192 277505 277093 275968 274492 274152 275329 276551 276499 275832 276295 278583 281764 284551 286550 288249
53567 288249 290126 291891 292750 292505 292119 292787 294649 296989 299545 302820 306918 310916 313961 316523 319950
53552 319950 324949 330913 336689 341656 345980 350052 353958 357670 361683 366952 373854 381521 388706 395183
53538 395183 401715 408800 416116 423317 430632 438327 446065 453272 459874 466211 472308 477476 480811 482189
53524 482189 482834 484633 488553 493795 498723 502438 505090 506996 508157 508691 509103 509918 511355 513293 515167
53509 515167 516092 515783 515182 515385 516079 516052 515302 515386 517308 520285 523268 526368 529716 532082 532183 530735 529580
53492 529580 529136 528411 527610 528833 533397 539868 545883 550897 555942 561292 565884 569055 571676 575184 580220
53477 580220 586613 593988 601876 609629 616860 623787 630702 637290 643059 648460 654930 663532 673972 685266
53463 685266 697005 709514 723010 737206 751790 766803 782294 797945 813389 828916 845629
53452 845629 864728 886635 910809 936315 962308 987888 1012086 1034731 1057316 1082101 1109911
53441 1109911 1139401 1169003 1199022 1231112 1266143 1303469 1342064 1381352 1420826 1459798 1498001
53430 1498001 1535999 1574724 1614864 1656596 1699386 1742059 1783657 1824330 1864850 1905315 1945142
53419 1945142 1984431 2024343 2065647 2107588 2148746 2188490 2227035 2264648 2301407 2337484 2373067
53408 2373067 2408055 2442066 2474631 2505331 2533966 2560596 2584993 2606171 2623166 2636335 2647211
53397 2647211 2656950 2665606 2672808 2677973 2679690 2676364 2668271 2657738 2646429 2633471 2617229 2597684 2575784
53384 2575784 2551546 2524578 2495842 2467041 2438394 2408534 2376519 2342599 2307184 2270746 2234719
53373 2234719 2200759 2168691 2136693 2103991 2071916 2041778 2013251 1985641 1959199 1934073 1909226
53362 1909226 1883777 1858578 1835233 1814320 1795800 1780439 1769236 1761784 1756631 1753275 1752491 1754576
53350 1754576 1758613 1763961 1771423 1782207 1796360 1812927 1831350 1852119 1876059 1903313 1933185 1965017
53338 1965017 1999088 2036210 2076230 2117595 2159201 2202286 2249433 2301602 2357300 2415019 2475253
53327 2475253 2539226 2606617 2675960 2746793 2819895 2895318 2971740 3048297 3125848 3205502 3286816
53316 3286816 3368373 3449312 3529116 3606570 3680498 3751530 3821634 3891556 3959759 4024181 4083836
53305 4083836 4138287 4186939 4229758 4267635 4300979 4328701 4349716 4364786 4375673 4382854 4385096 4380924
53293 4380924 4369434 4350084 4323062 4289842 4252133 4210161 4163019 4110701 4054526 3995349 3932606
53282 3932606 3865690 3795275 3722766 3649225 3575284 3501357 3427526 3353888 3281172 3210076 3139753
53271 3139753 3068195 2994806 2921638 2851327 2784657 2720850 2659310 2600018 2542888 2487858 2435248
53260 2435248 2385131 2336755 2289503 2244089 2201830 2162868 2125947 2089903 2054726 2021314 1990754
53249 1990754 1963635 1939475 1916986 1895430 1875499 1858361 1844260 1832583 1822781 1814520 1807465 1801891
53237 1801891 1799074 1799992 1803890 1809179 1815607 1824366 1836104 1850045 1865259 1881699 1899730 1919736 1942565
53224 1942565 1969343 2000243 2034132 2069761 2106544 2143978 2181469 2219336 2258813 2300021 2340799
53213 2340799 2378769 2414083 2448883 2484253 2519003 2551537 2581560 2609262 2633781 2653607 2668327
53202 2668327 2679179 2687747 2694689 2699884 2703139 2704162 2702120 2696027 2685749 2672001 2655163 2634657 2610030
53189 2610030 2582188 2552825 2522736 2491260 2457336 2420711 2382219 2343299 2305126 2267648 2229518
53178 2229518 2189469 2147610 2104970 2062163 2019462 1977912 1939054 1903109 1868464 1833521 1798248
53167 1798248 1763353 1729010 1695473 1664193 1636836 1613137 1590833 1568073 1545104 1523197 1502636
53156 1502636 1482534 1462419 1443232 1426427 1412304 1399571 1386532 1372478 1357920 1343824 1330835
53145 1330835 1318934 1307443 1295420 1282432 1268885 1255438 1242385 1229936 1218646 1208839 1199894 1190950
53133 1190950 1182162 1174190 1166459 1157161 1145443 1132498 1119802 1107191 1093544 1078616 1063208 1048050
53121 1048050 1033412 1019465 1006118 992717 978681 964267 950047 935895 921174 905617 889334
53110 889334 872318 854816 837853 822393 808122 793974 779599 765278 750634 734822 718224
53099 718224 702559 688781 675970 662929 649775 637130 624667 611583 598039 585234 574256
53088 574256 565417 558232 551311 542670 531126 517487 503853 491847 481893 473779 467163 461634 456993
53075 456993 453392 450593 447284 442001 434764 427040 420001 413673 407947 403336 400001 396795 392271 386389
53061 386389 380515 375862 372611 370434 369005 367767 365800 362452 357882 352762 347670 342917 338664 334882
53047 334882 331270 327461 323246 318543 313375 308028 302961 298258 293450 288240 283200 279205 276239 273405
53033 273405 270238 267368 265484 264236 262806 261309 260815 261953 264123 266261 267781 268287 266988 263197 257494
53018 257494 251850 248305 247742 249903 254077 259442 265087 270301 274952 279296 283441 287251 290595 293227
53004 293227 294480 293762 291616 289686 289183 289825 290719 291629 292632 293003 291612 288447 284720 281346 278211 275195
52988 275195 272819 271252 269486 266375 261982 257304 253042 249343 246274 243735 241131 237956 234606 231982
52974 231982 230345 229126 227779 226178 224271 222039 219861 218326 217537 216970 215985 214130 211166 207387 203747
52959 203747 200962 198615 195872 192920 190809 189823 189144 188413 188538 190257 192767 194618 195401 195654 195431 193975
52943 193975 190996 187652 185863 186637 189109 191264 191798 191250 191102 191931 192912 193033 192091 190480 188845 188233
52927 188233 189636 192698 195454 196040 194305 191331 188068 185142 183352 183211 184117 184831 184885 184858 185361 186247 186808
52910 186808 186343 184763 183132 183211 185737 189353 192027 193271 194108 195155 195967 196359 197092 198669 200503 202015
52894 202015 203744 206584 210407 214214 217262 219353 220365 220276 219651 219477 220420 222563 225673 229194 232023
52879 232023 232870 231221 227934 224860 223854 225780 229995 234797 238685 241314 243244 245058 246969 249041
52865 249041 251333 253949 257238 261722 267284 272622 276346 278827 282163 287801 294766 300827 304936 307728
52851 307728 309961 311570 312438 313157 314358 315771 316483 315849 313767 310471 306636 303364 301300 299736 297217
52836 297217 293270 289078 286266 285308 285270 284789 283152 280662 278102 275778 273245 270178 267219 265378 264701
52821 264701 264248 263459 262821 262991 263935 265255 266681 267811 268083 267573 267246 267827 268846 269276 268596 266689 263579
52804 263579 260034 257677 257279 257453 256314 254101 252706 252800 253101 252746 252697 253921 255605 256322 256010 255679 255758
52787 255758 255883 255858 255715 255112 253732 252183 251472 251457 250816 248853 246555 245400 245791 247132 248921 251032 253180
52770 253180 254955 256480 258425 261012 263416 264601 264445 263576 262379 260897 259692 259840 261574 263584 264320
52755 264320 263505 261684 258853 254684 249981 246665 245847 246750 248050 249659 252501 256871 261546 264544 264656
52740 264656 262498 260165 259579 260940 262944 264320 264783 264611 264066 263509 263523 264553 266578 269158 271354 271781
52724 271781 269451 264711 258749 252193 245075 238058 232407 228305 224429 219887 215466 212073 209084 205386
52710 205386 201228 197744 195288 193478 192368 192181 192191 191207 189058 186462 183568 179906 175599 171309 167048
52695 167048 162476 158427 156512 156787 157246 156306 154473 152899 151625 150165 148615 147037 144763 141606 138956
52680 138956 138163 138296 136941 133193 128569 124881 122469 120854 119950 119915 120507 121351 122493 123999 125136 124567
52664 124567 121631 117237 113215 110707 109308 107916 106211 104875 104305 103743 102248 100164 98881 99069 99773
52649 99773 99554 98192 96880 96910 98451 100559 102075 102455 101935 101090 100329 99725 99198 98660 97967 96842 95111
52632 95111 93045 91306 90354 89959 89535 89015 89106 90475 92824 95080 96495 97284 98058 98877 99158 98516 97418
52615 97418 96690 96423 95846 94580 93674 94778 98331 103126 107705 111585 114934 117851 120462 123093 125630
52600 125630 127219 127357 126942 127323 128484 129105 128409 127144 126584 127365 129460 132474 135617 138082 139881 141884
52584 141884 144629 147541 149593 150316 149921 148861 147578 146310 144900 143097 141122 139518 138356 137187 135845
52569 135845 134630 133468 131811 129809 128709 129337 130770 131306 130331 128492 126436 124262 122029 120051 118619
52554 118619 117917 118095 118890 119300 118282 115804 112807 110171 108124 106571 105510 105085 105549 107098 109420 111531
52538 111531 112465 112107 111054 109883 108883 108336 108515 109422 110814 112438 114035 115489 117285 120337 124664
52523 124664 128531 129783 128063 125104 122870 122152 122953 125233 128599 131833 133447 132834 130768 128921 128856
52508 128856 130959 134092 136509 137367 137255 137260 137812 138618 139358 140089 140945 141744 142051 141688 141077 140940 141591 142759
52490 142759 144191 146131 148885 152066 154628 155695 155140 153449 151279 149223 147749 147121 147196 147351 147000 146501
52474 146501 147222 150034 153964 157230 159669 163012 168339 174356 178971 181634 183231 184499 185765 187569
52460 187569 190099 192271 192660 191346 189855 189489 190679 193558 197648 201164 202250 201264 200498 201348 203051
52445 203051 204384 205085 205103 204158 202822 202617 204017 205563 205887 205366 204809 203932 202490 201620 202269 203183 202331
52428 202331 199849 197797 197300 197686 198271 199145 199978 199846 198863 198526 199701 201401 202353 202723 203373 204154 204035
52411 204035 202715 201365 201626 203967 206952 208235 206740 203813 201771 201489 202143 203044 204484 206417 207650
52396 207650 207277 206108 205611 205880 205716 204659 204061 205826 210480 216643 222207 225997 228389 230278 231679
52381 231679 231820 230659 229460 229439 230443 231634 232877 234516 236086 236416 235221 233633 232756 232422 231960 231524
52365 231524 231837 232913 233904 234290 234492 234972 235299 234696 233311 232350 232760 234128 235156 235087 234373 233969 234269 234960
52347 234960 235720 236644 237829 238855 239131 238714 238382 238690 239283 239449 239074 238661 238518 238388 237830 236590 234608
52330 234608 232199 230327 230120 231736 234093 236013 237281 238215 238712 238375 237443 236950 237721 239495 241083 241307
52314 241307 239968 238197 237716 239475 243067 247585 252595 257913 262899 266855 270053 273600 278141 283310
52300 283310 288620 294184 300226 306403 312114 317153 321696 325882 329682 332958 335387 336669 337106 337693 339233
52285 339233 341498 343730 345888 348947 353869 360532 367838 374574 380019 384043 387085 390057 393647 397359
52271 397359 399756 400292 400696 403620 409864 417810 425850 434150 443287 452473 460619 468440 477659 488220
52257 488220 498126 506396 514602 524844 537685 552881 570602 590633 611530 632105 653080 675877
52245 675877 700303 724772 748324 771038 792916 814134 836301 861576 889949 918836 946040
52234 946040 971889 997766 1023838 1049285 1073772 1097384 1119585 1139501 1157206 1173803 1190097
52223 1190097 1205730 1219706 1231446 1241319 1250370 1259288 1267450 1273281 1275817 1275613 1273933 1271594 1269033
52210 1269033 1266843 1265472 1264719 1264193 1263974 1264141 1264005 1262829 1261180 1260629 1261912 1264325 1267171 1270930 1276444
52195 1276444 1283659 1291852 1300790 1311050 1323392 1338177 1355144 1373328 1391446 1408855 1426100 1444121
52183 1444121 1462974 1481665 1499198 1515368 1530510 1544958 1559036 1573221 1587692 1601548 1612917
52172 1612917 1620407 1624521 1627301 1630317 1633279 1634834 1634295 1631999 1628175 1622323 1614038 1603851 1592789 1581358
52158 1581358 1569294 1556106 1541679 1526631 1512202 1499366 1487679 1475402 1461226 1445652 1430419
52147 1430419 1417026 1406207 1398138 1392190 1386700 1380080 1372381 1365159 1359718 1356134 1353990 1353156 1353516 1354683
52133 1354683 1356341 1358208 1359367 1358520 1355607 1352511 1351274 1352010 1353262 1353895 1353686 1352415 1349655 1345647 1341481
52118 1341481 1338032 1335318 1332991 1330724 1327868 1323599 1317897 1311782 1306101 1300676 1295072 1289431 1283812 1277344
52104 1277344 1269207 1260148 1251921 1245149 1238844 1232288 1226219 1221442 1217212 1212039 1205681 1199276 1193581 1188064
52090 1188064 1182037 1175845 1170441 1166182 1162540 1158848 1154942 1151155 1147936 1145506 1143783 1142601 1141849 1141196
52076 1141196 1139843 1137067 1133211 1129701 1127764 1127382 1127779 1128518 1129707 1131444 1133520 1135491 1136580 1135940 1133755
52061 1133755 1131951 1132820 1136714 1141885 1146950 1152654 1160589 1170915 1182415 1194528 1208207 1224444 1242732
52048 1242732 1261708 1280970 1301545 1324403 1349070 1374153 1399019 1424296 1450519 1476974 1502517
52037 1502517 1527219 1552321 1578488 1604861 1630189 1654273 1677773 1700932 1723071 1743169 1760604
52026 1760604 1775407 1788076 1799082 1808456 1815973 1821676 1825781 1828017 1827622 1824253 1818407 1810624 1800908
52013 1800908 1789331 1776651 1763796 1751282 1739670 1729823 1721879 1714555 1706500 1698035 1690559 1684607 1679656
52000 1679656 1675609 1673143 1672483 1673114 1674918 1678336 1683037 1687710 1691852 1696642 1703295 1711541 1720544 1730341
51986 1730341 1741292 1752871 1764189 1775261 1786583 1797721 1807515 1815639 1822751 1828849 1832490 1832262 1828537
51973 1828537 1823195 1817805 1812306 1805327 1795572 1782927 1768312 1752646 1736116 1718466 1699660 1680068
51961 1680068 1660168 1640103 1619367 1597073 1573003 1548221 1523949 1499850 1474427 1447321 1420055
51950 1420055 1393981 1368627 1342991 1317253 1291890 1266106 1238963 1211550 1186193 1163464 1141608
51939 1141608 1119088 1096083 1073137 1050001 1026572 1003537 981188 958714 935494 912034 888749
51928 888749 864997 840420 816299 794266 774351 755555 737665 721106 705416 689391 672711
51917 672711 656040 639616 623051 606742 592049 579572 568263 556762 544747 532597 520760
51906 520760 509997 501209 494126 486836 477551 466489 455463 446088 439001 434005 429942 424870 417584
51893 417584 408961 400973 394527 389225 384898 381845 379188 374577 366768 357632 350429 346418 344166 341824
51879 341824 338849 335503 331986 328822 327198 327923 330198 332119 332525 331974 331815 332688 334042 334894 334756 333809
51863 333809 332418 330707 328680 326528 324592 323028 321749 320715 320097 320023 320292 320440 320081 319177 318011 316844
51847 316844 315433 313061 309333 304886 300941 298042 295592 292692 289029 284758 280030 275119 270679 267362
51833 267362 265244 263988 263315 262841 261652 258810 254450 249929 246642 244938 244291 244095 244031 243938 243727 243429 243263
51816 243263 243575 244530 245656 245939 244812 243050 242213 243105 245114 247096 248351 248676 248220 247780 248628 251266
51800 251266 254462 256221 255808 254447 253967 255121 257197 258851 259165 258319 257558 258483 262119 268405 276260 284004
51784 284004 290028 293637 295390 296424 297354 297920 297637 296478 294871 293303 292076 291291 290913 290934 291440 292344
51768 292344 293041 292609 290628 287739 285297 284428 285279 286892 287785 287033 285068 283243 282422 282223 281823 281120 280655
51751 280655 280692 281092 281992 283762 285923 286988 286112 284473 284172 285905 288433 290295 291162 291377 291083 290391 289734
51734 289734 289274 288298 286005 282843 280380 279667 280194 280704 280811 281530 284171 288649 293007 294966 294148 292374
51718 292374 291472 291341 290773 289697 289494 291061 293675 296280 299030 302796 307615 312397 316005 318023 318483
51703 318483 317507 315504 313454 312582 313504 315712 318065 319975 321847 324071 325959 326392 325516 325029 326538 330270
51687 330270 335473 341253 346624 350744 353875 357404 362070 366849 370508 373591 377566 382473 387016 390956
51673 390956 395724 402125 408962 414943 420765 428073 437021 446239 454948 463764 473241 482690 490979 497789
51659 497789 503426 507770 510139 510282 509033 507610 506406 504828 502396 499708 497957 497614 497845 497255 494975
51644 494975 491146 486781 483279 481607 481586 482101 482168 481722 481386 481743 482969 484861 486995 489049 491171 493896
51628 493896 497584 502105 507147 512529 518078 523510 528768 534287 540668 548127 556280 564280 571049 575614
51614 575614 577425 576322 572407 566360 559685 553848 548896 543638 537551 531781 527662 525017 522828 520989
51600 520989 520224 520438 520401 519320 517780 516754 516474 516625 516890 516773 515419 512230 507340 501122 493553 484528
51584 484528 474562 464714 455852 448125 441068 434121 427213 420916 415859 412109 409441 407855 407052 405552
51570 405552 401597 395372 389235 384932 381511 377023 371402 366251 362282 358627 354662 350818 347143 342686
51556 342686 337269 332726 331091 332131 333684 334004 332800 330408 327248 324178 322294 321952 322531 323227 323495
51541 323495 322771 320764 318344 317144 317549 317784 315883 312234 309252 308679 309990 311531 312415 313046 314339 316879
51525 316879 320501 324437 328004 331237 334634 338364 342285 346767 352730 360338 368180 374322 377997 379900
51511 379900 381237 382909 385195 387478 388580 388039 386815 385985 385093 382876 379468 376511 374776 373018 369908
51496 369908 365922 362323 359227 355968 352806 350923 350782 351542 352079 351696 350089 347778 346566 348332 352998
51481 352998 358569 363464 367853 372459 377222 381869 386740 392114 397382 401827 405648 409251 411940 412371
51467 412371 410191 406343 401828 397019 392277 388313 385576 383814 382615 382080 382787 385246 389361 394173 398276
51452 398276 400959 402864 405098 407816 410202 411880 413644 416501 420394 424170 426647 427706 428539 430669
51438 430669 434246 437492 438476 437488 436882 438286 440641 441389 439020 433994 427870 422219 418008 415185 412737
51423 412737 409649 405772 401545 397217 392964 389532 387944 388340 389672 390798 391511 392268 393423 395189 398052
51408 398052 402528 408291 413998 418372 421479 424695 429458 436169 444251 452795 460999 468369 475014 481579
51394 481579 488429 494973 500331 504657 509162 514641 520565 525846 529896 532509 533417 532737 531520 530956 531022
51379 531022 530568 528819 526224 523749 521987 521178 521523 522853 524209 524374 523045 521294 520605 521419 522842 523874
51363 523874 524713 526470 529689 533656 537308 540310 542813 544611 545120 544116 541994 539206 535622 530488 523136
51348 523136 514117 505663 500250 498048 496325 492149 485463 478826 474421 472072 470018 466652 461481 455309
51334 455309 449768 445974 443425 440784 437691 434919 432717 430174 426777 423482 421371 420022 418197 415790
51320 415790 414065 414074 415539 417401 418929 420120 421295 422556 423766 424995 426474 427571 426405 421619 414369
51305 414369 407195 400713 393087 383443 374011 367352 362719 357010 348592 338415 327896 317811 309208
51292 309208 303296 299718 296404 291800 286133 280148 274025 268140 263543 260658 258491 255928 253008 250120
51278 250120 246972 243343 240094 238280 237670 237043 235550 233039 229551 225499 221990 219960 219100 218331 217133
51263 217133 215761 214520 213654 213638 214674 216024 216723 216797 217001 217568 218254 219484 222230 226441 230672 233762
51247 233762 236021 238260 240575 242792 245404 249072 253444 257475 260969 265103 271059 278558 286174 292910
51233 292910 298924 304504 308934 311195 311693 312221 313543 313791 310410 303543 296412 292106 290710 289787 286946
51218 286946 281626 275029 268836 263716 258801 252871 246021 239647 234693 230725 227050 223987 222275 221666
51204 221666 220883 218869 215615 211842 208287 205249 202474 199546 196540 194108 192718 191992 191066 189384 186989
51189 186989 184384 182459 182203 183916 186669 188874 189458 188584 187332 186831 187413 188594 190069 192463 196382
51174 196382 200791 203462 203505 202443 202010 201923 201104 200240 201265 204283 206884 207264 206639 207471 210160 212747 213486
51157 213486 212511 210961 209602 208844 209250 211009 212975 213186 210855 207368 204768 203591 202965 202591 203359 205628
51141 205628 208081 209308 209742 210840 212737 213987 213691 212695 212422 213428 215391 217682 219505 220208 219939 219486
51125 219486 219150 218327 216509 214117 211950 210334 209150 208167 206990 205233 203162 201573 200629 199423 197270
51110 197270 194804 193097 192172 191200 189902 189011 189442 191457 194403 196793 197116 195326 193215 192552 193104 193342
51094 193342 192723 192130 192050 191686 190413 188951 188212 187738 186385 184233 182661 182301 181809 179342 174902 170534
51078 170534 168084 167251 166200 163799 160722 158430 157749 158665 160818 163491 165458 165702 164446 162998 162450
51063 162450 162938 164193 166195 168918 171867 174330 175963 176755 176561 175152 172928 171182 171220 173190 176174
51048 176174 179525 183614 188818 194174 197819 198918 198532 198463 199790 202585 206190 209317 210675 210216 209250
51033 209250 208683 207843 205871 203600 202773 203686 204911 205394 205537 205951 206347 206205 205665 205213 205199 206083 208245 211022
51015 211022 212730 212378 210818 209596 209304 209665 210525 211802 212905 213233 213078 213263 214057 215272 217125 219999
50999 219999 223251 225284 225186 223693 222229 221591 221831 222785 224136 225328 225991 226355 226880 227512 227661 226911 225542
50982 225542 224279 223705 223954 224792 225819 226736 227673 229192 231650 234386 236051 236170 236040 237431 240512 243897
50966 243897 246765 249921 254273 259143 263012 265491 267560 270033 272594 274396 274894 273995 271969 269484 267422
50951 267422 266473 267078 269411 272959 276291 278001 278058 277785 278500 280615 283914 287934 291857 294899 297369 300931
50935 300931 307222 316293 326693 336877 346316 355464 364927 374682 384226 393633 404083 416726 431127
50922 431127 445678 459634 473847 489271 505867 523639 543513 565933 589395 612009 634441
50911 634441 659892 690938 727561 768545 813435 862386 915076 970790 1029107 1089821 1152781
50900 1152781 1218491 1288239 1362592 1440215 1519243 1599546 1682217 1766656 1849571 1927645 2000176
50889 2000176 2068200 2131769 2189350 2239614 2282477 2318158 2346271 2366480 2379451 2386610 2389225 2388126
50877 2388126 2383921 2376966 2367337 2355387 2342251 2329279 2316771 2303526 2287618 2267474 2242381 2212547
50865 2212547 2178870 2142257 2102847 2060006 2013124 1962054 1906752 1847048 1783371 1717392 1651245
50854 1651245 1585944 1520923 1455322 1389508 1325228 1264505 1208443 1156865 1108826 1063515 1020730
50843 1020730 980599 943150 908418 876813 848781 823966 801260 780112 761411 746426 734994
50832 734994 725302 715652 706061 697950 692594 690221 690383 692723 697109 703034 709256 714406 718138 721469
50818 721469 725791 731710 739014 747386 756617 766295 776035 786255 798240 813039 830611 850254 871525
50805 871525 894440 919132 945741 974504 1005655 1039373 1076060 1116440 1161052 1209828 1262445
50794 1262445 1319102 1380822 1449134 1525427 1610202 1702828 1802550 1909965 2026733 2153395 2288328
50783 2288328 2429849 2578762 2737542 2906989 3084631 3266345 3448510 3628557 3804657
50774 3804657 3975295 4138225 4289607 4425325 4543740 4646047 4733154 4803329 4854083 4885537
50764 4885537 4900591 4902221 4892202 4872480 4846299 4817181 4787460 4758315 4730501 4704232 4678537
50753 4678537 4651377 4620697 4585170 4543840 4495274 4437466 4368824 4288961 4198052 4095589 3980621
50742 3980621 3853538 3717022 3574796 3429854 3284236 3139765 2998130 2860594 2728444
50733 2728444 2603561 2487750 2381540 2284372 2196102 2117666 2050107 1993427 1946529 1907847 1875966
50722 1875966 1850015 1829663 1814601 1804189 1797845 1795279 1795636 1796615 1795376 1790596 1783059 1774040 1763630
50709 1763630 1750824 1734668 1715047 1692820 1669462 1646152 1622866 1598551 1572301 1544121 1514557
50698 1514557 1484105 1453249 1422775 1393794 1367501 1344766 1325508 1308572 1292779 1278319 1266728
50687 1266728 1259436 1256823 1258695 1264991 1275653 1290239 1308116 1328925 1352762 1380205 1412227 1449736
50675 1449736 1493107 1542405 1597911 1659991 1728645 1803904 1886537 1977288 2075149 2177428 2282033
50664 2282033 2388807 2498005 2608389 2717800 2824957 2929441 3030055 3124327 3209886 3285582
50654 3285582 3350837 3404245 3443338 3466042 3472501 3465322 3447779 3421921 3388897 3350713 3310461 3270439
50642 3270439 3230996 3191909 3154102 3119311 3088612 3061922 3038153 3015096 2990026 2961511 2929986
50631 2929986 2895371 2854932 2805271 2746191 2680783 2611614 2538833 2462623 2385507 2310609 2238815
50620 2238815 2169303 2102275 2039627 1983086 1933188 1890338 1855631 1830021 1813521 1805950 1807958 1820491
50608 1820491 1843395 1875227 1914548 1960747 2013251 2070436 2129923 2189796 2248877 2305733 2358213
50597 2358213 2404593 2444895 2480525 2512562 2540662 2563501 2579941 2589914 2594584 2595656 2594232 2590280
50585 2590280 2583414 2574001 2563189 2552033 2541059 2530637 2521269 2513503 2508031 2505877 2507917 2513915 2522578
50572 2522578 2532978 2545668 2561896 2581748 2603301 2623662 2640834 2654781 2666862 2678319 2689266
50561 2689266 2699023 2707145 2713882 2719862 2725765 2732373 2740486 2750528 2762398 2775886 2791062 2808105 2826800
50548 2826800 2846386 2865911 2884645 2902055 2917334 2929167 2936252 2938116 2935044 2926945 2912603 2890352
50536 2890352 2859321 2819711 2772112 2717006 2654797 2585928 2511034 2431394 2349056 2266040 2183428
50525 2183428 2101676 2021704 1945033 1872683 1804556 1740222 1679953 1624658 1574964 1530540 1490279
50514 1490279 1453166 1419208 1389375 1364429 1344013 1327321 1314392 1306022 1302400 1302480 1304890 1308962 1314892
50501 1314892 1323653 1336865 1355911 1380648 1409454 1440885 1474824 1511871 1552402 1596716 1645248
50490 1645248 1697972 1754200 1813695 1877310 1945524 2016721 2088001 2157520 2225066 2290535 2353136
50479 2353136 2412508 2469466 2524846 2578227 2628504 2675405 2719828 2762993 2805909 2849543 2894811
50468 2894811 2942202 2991790 3043667 3098026 3154724 3213356 3274166 3338510 3407725 3481504 3557847
50457 3557847 3634718 3711225 3786918 3860415 3929292 3991165 4044522 4088756 4123897 4150296 4168007
50446 4168007 4176275 4173753 4159187 4131852 4091923 4041113 3982573 3919195 3852057 3781439 3709397 3639999
50434 3639999 3576474 3519264 3467780 3423093 3387526 3362052 3345506 3336363 3333954 3337399 3344114 3350020
50422 3350020 3350954 3343686 3326233 3297832 3258696 3209466 3150654 3082355 3004361 2916823 2821122 2719953
50410 2719953 2616224 2511946 2408408 2306966 2208933 2114795 2024294 1937478 1855205 1778564
50400 1778564 1708418 1645446 1589718 1539917 1493926 1450980 1412682 1381112 1356318 1336483 1320199
50389 1320199 1307641 1299565 1296159 1297081 1301756 1309238 1318500 1329350 1342431 1357912 1374948 1393133 1413710
50376 1413710 1438231 1466344 1496179 1526698 1558318 1591001 1623339 1654461 1685648 1718759 1753598
50365 1753598 1788121 1820982 1852740 1884545 1916550 1947756 1976778 2002792 2026449 2049786 2074495
50354 2074495 2100377 2126298 2152377 2180061 2210045 2241603 2274413 2309557 2347722 2387471 2426424
50343 2426424 2463515 2499109 2533473 2566139 2596379 2623342 2645985 2663730 2676913 2685702 2688820 2684275
50331 2684275 2671239 2650385 2622473 2587445 2544888 2494654 2437180 2374054 2308152 2242140 2176609
50320 2176609 2110634 2044347 1980015 1920222 1865892 1816686 1772571 1734227 1702328 1677143 1658658
50309 1658658 1646482 1639557 1636216 1634623 1633193 1630749 1626349 1618862 1606944 1589772 1567614 1541236 1510937
50296 1510937 1476786 1439647 1401116 1362378 1323891 1286329 1250783 1217471 1185135 1152582 1120384
50285 1120384 1090375 1063828 1040775 1020759 1003454 988654 976327 966687 959698 954489 949894 945676
50273 945676 942854 942541 944643 947811 950578 952619 955084 959622 966849 975903 985652 996245 1009136 1025537
50259 1025537 1045047 1065817 1085964 1104922 1123646 1143496 1164827 1186759 1208340 1229574 1250998
50248 1250998 1272592 1293752 1314311 1334896 1355969 1377020 1397165 1416154 1434233 1451192 1466183
50237 1466183 1478606 1488657 1496778 1503025 1507243 1509500 1509970 1508723 1506056 1502738 1499373 1495719 1491027 1484824
50223 1484824 1476793 1466356 1453348 1438982 1425005 1411750 1398087 1383534 1369070 1355290 1341165
50212 1341165 1325668 1309560 1294200 1279470 1264321 1248803 1234000 1220303 1207237 1194810 1183512
50201 1183512 1172999 1162331 1151775 1142884 1136413 1131325 1126145 1120007 1112174 1102126 1090778 1080226
50189 1080226 1071494 1063655 1055762 1048196 1041173 1033372 1023433 1011895 1000447 990082 981108 974062 969206
50176 969206 965598 961945 957960 954026 950177 946542 944043 943318 943483 943268 942982 943950 946460 949686 953377
50161 953377 957895 962621 965912 966978 966481 965031 962452 958923 955554 953122 951107 948428 944245 937737
50147 937737 928154 915886 902882 891372 882319 875106 868215 860290 851268 842465 834889 827676 819121
50134 819121 808932 798180 787261 775632 763875 754108 747411 742367 737292 732626 729768 728557 727470
50121 727470 725811 724201 723062 721839 719882 717144 713885 710267 706304 701770 696225 689619 682802 677022
50107 677022 672837 669716 666600 662761 658366 654192 650438 645956 639312 630619 621460 612851 604359 595612
50093 595612 587521 581136 576077 570967 564869 557668 549747 541997 535425 530092 525140 520486 517301 515837
50079 515837 514088 510263 505766 503828 505517 508867 511806 514093 516138 517607 517959 517249 515886 514437 513919
50064 513919 515304 518400 522082 525772 529877 534779 540480 547321 555803 565454 575115 584662 595182 607142
50050 607142 619815 633027 647842 664533 681326 696487 710564 725095 739943 753501 765201
50039 765201 776431 788951 803329 818777 833669 846349 856301 864532 872300 879767 886428 892311 897895
50026 897895 903195 907785 911492 914316 916087 917085 918608 921795 926099 929950 932838 935721 939587 944831
50012 944831 952038 961972 974439 988417 1003711 1021291 1041398 1062443 1082713 1102317 1122561 1143969
50000 1143969 1165851 1187359 1208176 1228394 1248384 1268460 1288063 1305572 1319587 1330246 1338797
49989 1338797 1346230 1352914 1359142 1364990 1369605 1371480 1369830 1365273 1359067 1352085 1344634 1336763 1328483 1319945
49975 1319945 1311498 1303398 1295458 1287263 1278749 1270253 1262038 1254068 1246310 1238965 1232425 1227151 1223394 1220639
49961 1220639 1217633 1213630 1209471 1206532 1204572 1201648 1196551 1190392 1185061 1180930 1176926 1172237 1166789 1160363
49947 1160363 1152427 1142951 1132508 1121559 1110548 1100654 1093201 1087863 1082390 1074758 1064876 1053813 1042367
49934 1042367 1031165 1021259 1013482 1007661 1003358 1000805 1000112 1000188 999939 1000332 1003723 1010951 1020537 1031116 1043233
49919 1043233 1057983 1075294 1094763 1117326 1144674 1177239 1213742 1252716 1293764 1337426 1384387
49908 1384387 1434696 1487216 1539837 1590461 1637543 1679626 1715207 1743741 1766270 1784366 1798939
49897 1798939 1810701 1821023 1831150 1840913 1849325 1856133 1861512 1864420 1862709 1855062 1841405 1821132 1792406
49884 1792406 1754151 1707718 1655677 1599643 1540087 1477601 1413464 1349316 1286898 1227785 1172762
49873 1172762 1121673 1074235 1030553 990552 953581 919155 887508 858855 832694 808591 787113
49862 787113 769052 754044 740776 728405 717097 707295 699198 692874 688288 685161 683153 682065 681578
49849 681578 681225 681004 681437 682419 682587 680720 677334 674039 671708 670253 669802 670824 673057 675366 676777 676898
49833 676898 675623 673490 672175 673209 676092 678986 681455 685048 690793 697745 704823 712528 721637 731450
49819 731450 740851 750344 761479 774692 789045 803960 819910 837310 855835 875118 895415 917289
49807 917289 941107 966975 994944 1025359 1059231 1097899 1142022 1191283 1245477 1305140 1370471
49796 1370471 1440397 1513787 1591109 1673623 1761075 1851395 1942647 2033959 2124239 2211137 2292086
49785 2292086 2365899 2433062 2495009 2553268 2608638 2660843 2709461 2755141 2799063 2840993 2878825
49774 2878825 2910351 2934523 2950324 2955530 2947768 2926496 2893088 2849233 2796065 2734594 2666017 2591429
49762 2591429 2511916 2429095 2344919 2260567 2175815 2089863 2002740 1915909 1831591 1751531 1676254
49751 1676254 1605322 1538151 1474494 1414365 1357909 1305447 1257305 1213415 1173248 1136159 1101574
49740 1101574 1068885 1037695 1008310 981467 957292 934981 913831 893973 875516 857477 838393
49729 838393 818010 797702 779297 763917 751799 742359 734139 725350 715121 704268 694614 687423
49717 687423 682400 678128 673519 668780 664672 660934 656199 649924 643612 639233 636851 634998 633178 632528
49703 632528 633668 635318 636058 636432 637959 640686 643188 644908 647059 650868 656271 663040 672005 683854
49689 683854 697339 710245 722271 735631 752117 770613 788605 805677 824315 847110 874235
49678 874235 904151 936098 971129 1010973 1056521 1107461 1162928 1222446 1286335 1355004 1427481
49667 1427481 1500876 1571833 1638535 1700855 1758628 1810571 1855236 1892486 1923464 1949507 1971681
49656 1971681 1991169 2009302 2026851 2043564 2058585 2071059 2080051 2084097 2081119 2068966 2046117 2012155
49644 2012155 1967913 1915245 1856331 1793022 1726864 1659630 1593354 1529348 1467419 1406674 1347252
49633 1347252 1290731 1238656 1191310 1148303 1109655 1075442 1044843 1016736 991254 969681 952498
49622 952498 938498 926245 915432 906101 897494 888802 880472 873607 868330 863875 860139 857831 856917 856187
49608 856187 854862 853507 852625 851313 848399 844387 841191 840014 840287 840527 839552 836955 833248 829694 827214
49593 827214 825216 822135 817471 812654 809346 807335 804857 800875 796289 792668 790387 788522 786230 783487
49579 783487 780441 776834 772575 768356 764921 761942 758403 754180 750379 747858 746217 744676 743093 741463
49565 741463 739176 735826 732317 729997 728861 727699 726032 724814 724986 726397 728588 731635 735596 739872
49551 739872 743899 748001 752918 758779 765137 771725 778669 786069 793729 801215 808137 814784 822500 832680
49537 832680 845128 858092 870411 882735 895911 908988 920011 928513 936338 946114 959554 976798
49525 976798 996466 1016572 1036336 1057021 1080280 1106045 1133030 1160918 1190622 1222400 1255253
49514 1255253 1288626 1323352 1360188 1398523 1437441 1477332 1519561 1565068 1614020 1666326 1721769
49503 1721769 1779924 1840537 1903832 1970086 2039240 2111150 2185729 2262457 2340295 2418468 2496932
49492 2496932 2575822 2655074 2734841 2815350 2895776 2974127 3048965 3120401 3188557 3252056 3309286
49481 3309286 3360297 3405722 3444071 3472017 3487860 3493340 3491426 3483431 3469075 3448462 3422865 3393731
49469 3393731 3361736 3326895 3289354 3249925 3210008 3171188 3135112 3103574 3077912 3057811 3041311
49458 3041311 3026882 3015271 3008609 3008114 3013655 3025189 3043041 3066410 3093059 3121428 3152260 3187270
49446 3187270 3226772 3269388 3313639 3359103 3406208 3455465 3506702 3558522 3608677 3655266 3697312
49435 3697312 3733918 3763501 3784516 3796632 3800391 3795730 3781543 3756775 3721485 3676646 3623273 3561900
49423 3561900 3492671 3415833 3332387 3244333 3154106 3063516 2973162 2882803 2792265 2701999 2612881
49412 2612881 2525573 2440185 2356582 2274799 2195057 2117647 2043129 1972452 1906385 1844777 1786785
49401 1786785 1731899 1680404 1632689 1588335 1546093 1504754 1464301 1426270 1392475 1362917 1335429
49390 1335429 1308096 1281448 1257170 1235179 1213665 1192120 1172369 1155739 1140856 1125603 1110083
49379 1110083 1096103 1084526 1074638 1065654 1057265 1048908 1040004 1031061 1023337 1017350 1012724 1009459 1008039
49366 1008039 1008181 1008785 1009424 1010752 1013135 1016133 1019846 1025399 1033313 1042557 1052199 1063035 1076323 1091525
49352 1091525 1106522 1119824 1131507 1142134 1151792 1160319 1167671 1173852 1179027 1183894 1189563 1196928 1206337
49339 1206337 1217663 1230295 1243215 1255663 1267742 1280154 1293403 1307544 1322460 1337887 1353301
49328 1353301 1368232 1382597 1396339 1408955 1419927 1429544 1438781 1448397 1458577 1469228 1479993 1490202
49316 1490202 1499635 1509262 1520227 1532012 1542757 1551925 1561563 1574044 1589392 1605894 1622755 1640871
49304 1640871 1661084 1682881 1705115 1727208 1749331 1772029 1795910 1821278 1847929 1875742 1905358
49293 1905358 1937453 1971376 2005510 2039407 2074628 2112874 2154179 2197771 2243902 2293701 2347678
49282 2347678 2405520 2467128 2532716 2601934 2674064 2749244 2828338 2911217 2996335 3082685 3171412
49271 3171412 3264794 3364217 3469689 3580513 3695585 3813470 3933128 4054556 4178249 4304362
49261 4304362 4432823 4563727 4696858 4831168 4965418 5098999 5231323 5360830 5485635
49252 5485635 5605001 5719041 5826925 5926427 6015425 6092874 6158071 6210120 6248780 6274961 6289746
49241 6289746 6293575 6287049 6271821 6249811 6221894 6188068 6148720 6105082 6058791 6011642 5965525 5921839
49229 5921839 5880926 5842732 5808074 5778738 5756154 5740358 5730481 5725954 5727110 5734724 5749174 5770084
49217 5770084 5796887 5829550 5868414 5913273 5963063 6016674 6073490 6132705 6192581 6251142 6307572
49206 6307572 6362387 6416103 6467858 6515170 6554901 6584811 6604572 6615018 6616125 6606303 6584165 6550265
49194 6550265 6506028 6451485 6385472 6308223 6222277 6130208 6032581 5929099 5820955 5710828 5600706
49183 5600706 5490724 5380253 5269491 5159703 5052354 4948361 4848065 4751746 4659889 4572757
49173 4572757 4489782 4409862 4332520 4258479 4188792 4123662 4062390 4004185 3948593 3895311 3844181
49162 3844181 3795603 3750645 3710439 3675264 3644104 3615134 3586991 3559856 3535245 3514617 3498287
49151 3498287 3485589 3475564 3467121 3458946 3449939 3439839 3429129 3418344 3407776 3397745 3388728 3381093
49139 3381093 3374870 3369694 3364747 3358937 3351637 3343347 3335357 3328592 3322955 3317702 3312106 3305809 3298953 3292141
49125 3292141 3286006 3280691 3275942 3271633 3267716 3263665 3258573 3252200 3245481 3239648 3235157 3231875 3229902 3229542
49111 3229542 3230594 3232346 3234446 3237385 3241933 3248401 3256624 3266380 3277542 3290012 3303782 3319132 3336645
49098 3336645 3356909 3380116 3405904 3433653 3462978 3493850 3526149 3559337 3592919 3627244 3663527
49087 3663527 3702844 3745149 3789325 3834013 3878383 3922289 3966068 4010280 4055492 4102058 4150033
49076 4150033 4199298 4249720 4301050 4352624 4403416 4452750 4500951 4548931 4597097 4644965 4692024
49065 4692024 4738509 4784933 4831129 4876285 4919876 4962162 5003783 5045176 5086342 5126741 5165456
49054 5165456 5201818 5235979 5268568 5299894 5329961 5359089 5387766 5415678 5441658 5465069 5486729
49043 5486729 5508067 5529813 5551899 5573973 5595353 5614997 5632470 5648822 5665684 5683439 5700954
49032 5700954 5717177 5732308 5747199 5762208 5777032 5791373 5805438 5819822 5834950 5850609 5866280
49021 5866280 5882090 5898987 5917466 5936605 5955248 5973961 5994678 6018186 6042938 6066838 6089362
49010 6089362 6111367 6133562 6155903 6177996 6199222 6218743 6236094 6251718 6266322 6279720 6290768
48999 6290768 6298464 6302919 6305389 6307457 6309747 6311145 6309759 6305019 6298352 6291279 6283460 6273462 6260957 6247032
48985 6247032 6232391 6216341 6197910 6177238 6155513 6134035 6113459 6093443 6072996 6051620 6030105
48974 6030105 6009594 5990050 5970604 5951419 5933974 5919038 5905462 5891808 5878228 5865745 5854405
48963 5854405 5843432 5832875 5823814 5816841 5811475 5807358 5805107 5805480 5808345 5812960 5818754 5825400 5832651 5840699
48949 5840699 5850329 5861957 5874539 5886078 5895416 5903242 5911229 5920655 5932073 5945705 5961431 5978232
48937 5978232 5994204 6007574 6017900 6026365 6034921 6044854 6055707 6065531 6072443 6076040 6077013 6075549 6070760
48924 6070760 6061898 6049410 6034181 6016270 5995148 5970911 5944489 5916647 5887359 5855988 5821537
48913 5821537 5783129 5741244 5698247 5656496 5615697 5573321 5527900 5480503 5432393 5382820 5330561
48902 5330561 5276560 5223359 5172266 5122685 5074117 5027359 4983421 4942467 4904236 4868620 4835379
48891 4835379 4804033 4774394 4746688 4721075 4697834 4678101 4663464 4654390 4649755 4648217 4649156 4651955
48879 4651955 4655585 4659793 4665880 4675270 4687909 4703010 4720695 4741562 4764987 4789377 4814360 4841335
48867 4841335 4871312 4903325 4935860 4969041 5004409 5042914 5084137 5127453 5173013 5221234 5271961
48856 5271961 5324794 5380059 5438877 5501977 5568642 5637222 5706889 5778717 5854713 5935680 6020258
48845 6020258 6106245 6192567 6279520 6367273 6454893 6541392 6627326 6714488 6803818 6894143 6983338
48834 6983338 7070252 7154993 7237664 7317613 7393998 7466365 7534318 7597202 7654619 7707104 7755859
48823 7755859 7801947 7845873 7887556 7926094 7959722 7986682 8006439 8019721 8027409 8029888 8027585 8021344
48811 8021344 8011619 7997595 7977788 7951509 7919263 7881884 7839882 7793716 7743929 7690608 7633220
48800 7633220 7571529 7506277 7438430 7368116 7294941 7219033 7140957 7060683 6977598 6891691 6803932
48789 6803932 6715288 6626324 6538209 6452915 6371459 6292693 6214922 6138151 6063625 5991754 5922064
48778 5922064 5855070 5792513 5735304 5682651 5633858 5589642 5550689 5516043 5484233 5455266 5430204
48767 5430204 5409218 5391483 5376872 5366381 5360544 5358670 5360216 5365970 5376995 5392742 5410982 5429617
48755 5429617 5448222 5467868 5489778 5514166 5540180 5566844 5594038 5622520 5653018 5685395 5718750
48744 5718750 5752186 5785358 5818326 5851147 5883994 5917605 5953099 5990826 6029670 6068100 6105831
48733 6105831 6143760 6182386 6221279 6260439 6301003 6343761 6387778 6431666 6475732 6521649 6570060
$$ [...]
##END NTUPLES=NMR SPECTRUM
##END=
