
##TITLE=AC1078_TOVI01_5819079_KiZ4hY4oMc
##JCAMPDX= 6.0         $$ Bruker NMR JCAMP-DX V2.0
##DATA TYPE= NMR SPECTRUM
##DATA CLASS= NTUPLES
##ORIGIN= BRUKER
##OWNER= Administrator
$$ 1.72 TOPSPIN		Version 2.1
$$ 2012-03-24 21:48:16.421 -0500  Administrator@TOPSPIN
$$ Compression mode = diff/dup
##.OBSERVE FREQUENCY= 400.13188235
##.OBSERVE NUCLEUS= ^1H
##.ACQUISITION MODE= SIMULTANEOUS (DQD)
##.ACQUISITION SCHEME= undefined
##.AVERAGES= 64
##.DIGITISER RES= 22
##SPECTROMETER/DATA SYSTEM= spect
##.PULSE SEQUENCE= noesygpps1d.comp
##.SOLVENT NAME= COFFEE_meoh
##.SHIFT REFERENCE= INTERNAL, COFFEE_meoh, 1, 14.96859
##AUDIT TRAIL= $$ (NUMBER, WHEN, WHO, WHERE, PROCESS, VERSION, WHAT)
$$ ##TITLE= Audit trail, TOPSPIN		Version 2.1
$$ ##JCAMPDX= 5.01
$$ ##ORIGIN= Bruker BioSpin GmbH
$$ ##OWNER= Administrator
$$ $$ C:\Bruker\TOPSPIN/data/COFFEE/nmr/AC1078_TOVI01_5819079_KiZ4hY4oMc/12/pdata/1/auditp.txt
$$ ##AUDIT TRAIL=  $$ (NUMBER, WHEN, WHO, WHERE, PROCESS, VERSION, WHAT)
(   1,<2012-03-24 21:48:11.109 -0500>,<Administrator>,<TOPSPIN>,<go>,<TOPSPIN 2.1>,
      <created by zg
	started at 2012-03-24 21:36:39.140 -0500,
	POWCHK enabled, PULCHK disabled,
       configuration hash MD5:
       1A 1E CE 29 27 FD 77 03 67 4E F0 E3 C4 B2 CB 90
       data hash MD5: 64K
       CD 4A E9 6B C6 48 36 24 DE E4 BC 63 AC 0A 93 2E>)
(   2,<2012-03-24 21:48:14.312 -0500>,<Administrator>,<TOPSPIN>,<proc1d>,<TOPSPIN 2.1>,
      <Start of raw data processing
       efp LB = 0.3 FT_mod = 6 PKNL = 1 PHC0 = 0 PHC1 = 0 SI = 128K 
       data hash MD5: 128K
       3E DD B0 66 45 62 04 BF 0B D9 13 91 E6 FC 51 5F>)
(   3,<2012-03-24 21:48:15.562 -0500>,<Administrator>,<TOPSPIN>,<proc1d>,<TOPSPIN 2.1>,
      <pk PHC0 = 38.17749 PHC1 = 0 
       data hash MD5: 128K
       FA D7 9D 4C E5 FE D1 DD D6 BA 18 A1 8F CB 5D CF>)
(   4,<2012-03-24 21:48:16.093 -0500>,<Administrator>,<TOPSPIN>,<proc1d>,<TOPSPIN 2.1>,
      <abs ABSG = 1 
       data hash MD5: 128K
       CF B3 9B B4 64 78 CE D0 F1 62 D6 D3 C0 61 CC AD>)
(   5,<2012-03-24 21:48:16.171 -0500>,<Administrator>,<TOPSPIN>,<proc1d>,<TOPSPIN 2.1>,
      <abs ABSG = 2 
       data hash MD5: 128K
       64 E3 D0 E9 07 04 46 DD 11 E3 08 FA 14 2E 4E 2B>)
(   6,<2012-03-24 21:48:16.234 -0500>,<Administrator>,<TOPSPIN>,<proc1d>,<TOPSPIN 2.1>,
      <abs ABSG = 3 
       data hash MD5: 128K
       8E A2 6B 77 E8 9E 0B 6A A4 14 9C E9 C5 3E 8E 69>)
(   7,<2012-03-24 21:48:16.296 -0500>,<Administrator>,<TOPSPIN>,<proc1d>,<TOPSPIN 2.1>,
      <abs ABSG = 4 
       data hash MD5: 128K
       A3 86 32 67 A3 39 8F B8 E5 C3 E2 30 98 98 4A A4>)
(   8,<2012-03-24 21:48:16.343 -0500>,<Administrator>,<TOPSPIN>,<proc1d>,<TOPSPIN 2.1>,
      <abs ABSG = 5 
       data hash MD5: 128K
       CF E4 E6 2A 3A FA 92 28 15 8E DA 97 39 13 FB 2D>)
$$ ##END=
$$ 
$$ $$ hash MD5
$$ $$ 7B 84 A2 59 D4 D3 7F F7 11 30 DC 58 66 2A 0B 65
##$RELAX= 
##$RELAX= 
##$RELAX= 
##$RELAX= 
##$RELAX= 
##$RELAX= 
##$RELAX= 
##$RELAX= 
$$ Bruker specific parameters
$$ [...]
##$TP07= 0
##$TPNAME0= <>
##$TPNAME1= <>
##$TPNAME2= <>
##$TPNAME3= <>
##$TPNAME4= <>
##$TPNAME5= <>
##$TPNAME6= <>
##$TPNAME7= <>
##$TPOAL= (0..7)
0.5 0.5 0.5 0.5 0.5 0.5 0.5 0.5
##$TPOFFS= (0..7)
0 0 0 0 0 0 0 0
##$TUNHIN= 0
##$TUNHOUT= 0
##$TUNXOUT= 0
##$USERA1= <user>
##$USERA2= <user>
##$USERA3= <user>
##$USERA4= <user>
##$USERA5= <user>
##$V9= 5
##$VALIST= <valist>
##$VCLIST= <CCCCCCCCCCCCCCC>
##$VD= 0
##$VDLIST= <DDDDDDDDDDDDDDD>
##$VPLIST= <PPPPPPPPPPPPPPP>
##$VTLIST= <TTTTTTTTTTTTTTT>
##$WBST= 2048
##$WBSW= 25
##$XGAIN= (0..3)
0 0 0 0
##$XL= 0
##$YL= 0
##$YMAX_a= 17309361
##$YMIN_a= -7718578
##$ZGOPTNS= <>
##$ZL1= 120
##$ZL2= 120
##$ZL3= 120
##$ZL4= 120
##$ABSF1= 14.96859
##$ABSF2= -5.583941
##$ABSG= 5
##$ABSL= 3
##$ALPHA= 0
##$AQORDER= 0
##$ASSFAC= 0
##$ASSFACI= 0
##$ASSFACX= 0
##$ASSWID= 0
##$AUNMP= <proc_prof1d_extract.lims>
##$AXLEFT= 0
##$AXNAME= <>
##$AXNUC= <1H>
##$AXRIGHT= 0
##$AXTYPE= 0
##$AXUNIT= <>
##$AZFE= 0.1
##$AZFW= 0.1
##$BCFW= 0
##$BC_mod= 0
##$BYTORDP= 0
##$COROFFS= 0
##$CY= 15
##$DATMOD= 1
##$DC= 0
##$DFILT= <>
##$DTYPP= 0
##$F1P= 0
##$F2P= 0
##$FCOR= 0.5
##$FTSIZE= 131072
##$FT_mod= 6
##$GAMMA= 0
##$GB= 0
##$INTBC= 1
##$INTSCL= 1
##$ISEN= 128
##$LB= 0.3
##$LEV0= 0
##$LPBIN= 0
##$MAXI= 10000
##$MC2= 0
##$MEAN= 0
##$ME_mod= 0
##$MI= 0
##$NCOEF= 0
##$NC_proc= -3
##$NLEV= 6
##$NOISF1= 0
##$NOISF2= 0
##$NSP= 0
##$NTH_PI= 0
##$NZP= 0
##$OFFSET= 14.96859
##$PC= 1
##$PHC0= 38.17749
##$PHC1= 0
##$PH_mod= 1
##$PKNL= yes
##$PPARMOD= 0
##$PPDIAG= 0
##$PPIPTYP= 0
##$PPMPNUM= 2147483647
##$PPRESOL= 1
##$PSCAL= 4
##$PSIGN= 0
##$PYNMP= <proc.py>
##$REVERSE= no
##$SF= 400.130004811627
##$SI= 131072
##$SIGF1= 0
##$SIGF2= 0
##$SINO= 400
##$SIOLD= 131072
##$SPECTYP= <>
##$SREGLST= <1H.CDCl3>
##$SSB= 0
##$STSI= 131072
##$STSR= 0
##$SW_p= 8223.68421052632
##$SYMM= 0
##$S_DEV= 0
##$TDeff= 65536
##$TDoff= 0
##$TI= <>
##$TILT= no
##$TM1= 0
##$TM2= 0
##$TOPLEV= 0
##$USERP1= <user>
##$USERP2= <user>
##$USERP3= <user>
##$USERP4= <user>
##$USERP5= <user>
##$WDW= 1
##$XDIM= 131072
##$YMAX_p= 454791503
##$YMIN_p= -28702888
##$CURPLOT= <Network HP LaserJet P1505>
##$CURPRIN= <$Network HP LaserJet P1505>
##$DFORMAT= <normdp>
##$LAYOUT= <+/1D_H.xwp>
##$LFORMAT= <normlp>
##$PFORMAT= <normpl>
##$SURQMSG= 1
$$ End of Bruker specific parameters
$$ ---------------------------------
##NTUPLES= NMR SPECTRUM
##VAR_NAME=  FREQUENCY,     SPECTRUM/REAL,   SPECTRUM/IMAG
##SYMBOL=    X,             R,               I
##VAR_TYPE=  INDEPENDENT,   DEPENDENT,       DEPENDENT
##VAR_FORM=  AFFN,          ASDF,            ASDF
##VAR_DIM=   131072,        131072,          131072
##UNITS=     HZ,            ARBITRARY UNITS, ARBITRARY UNITS
##FACTOR=    0.0627417313425165, 1,          1
##FIRST=     8223.62146879498, -2,           -131664
##LAST=      0,             4526,            -132988
##MIN=       0,             -28702888,       0
##MAX=       8223.62146879498, 454791503,    0
$$ Real data points
##PAGE= N=1
##DATA TABLE= (X++(R..R)), XYDATA
$$ [...]
$$ plain form
62906 2705736 2631629 2558514 2486628 2415849 2346015 2277569 2211753 2149541 2090603 2034097 1980385
62895 1980385 1930985 1886492 1845340 1805239 1765487 1727405 1692826 1662685 1636855 1614570 1594653
62884 1594653 1575779 1557014 1538204 1519758 1502163 1485814 1470987 1457479 1444287 1430169 1414828
62873 1414828 1399291 1384825 1371658 1358973 1345885 1332010 1317349 1302253 1287577 1274260 1262341
62862 1262341 1250741 1238441 1225745 1213947 1203739 1194347 1184560 1174444 1165627 1159639 1156116 1152950
62850 1152950 1148258 1141897 1135038 1128715 1123202 1118424 1114213 1110057 1105297 1100084 1095781 1093747 1093603 1093129
62836 1093129 1090271 1085244 1080381 1077770 1077205 1076700 1074909 1072456 1070630 1069330 1067137 1063340 1059040 1055774
62822 1055774 1053668 1051641 1049196 1047168 1046547 1047154 1047974 1048354 1048347 1048044 1047221 1045871 1044559 1043819 1043493 1043062 1042452
$$ packed form
62906B705736p4107p3115p1886p0779o9834o8446o5816o2212n8938n6506n3712
62895A980385m9400m4493m1152m0101l9752l8082l4579l0141k5830k2285j9917
62884A594653j8874j8765j8810j8446j7595j6349j4827j3508j3192j4118j5341
62873A414828j5537j4466j3167j2685j3088j3875j4661j5096j4676j3317j1919
62862A262341j1600j2300j2696j1798j0208r392r787j0116q817n988l523l166
62850A152950m692o361o859o323n513m778m211m156m760n213m303k034j44m74
62836A093129k858n027m863k611n65n05j791k453j826j300k193l797m300l266
62822A055774k106k027k445k028o21O07Q20L80pl03q23j350j312p40l26m31o10
$$ plain form
62805 1042452 1041955 1041488 1040596 1039461 1039266 1040943 1043772 1045829 1045904 1044636 1043683 1044051 1045441 1047012 1048442 1050088
62789 1050088 1052226 1054482 1056205 1057159 1057534 1057461 1057011 1056655 1057079 1058250 1059245 1059518 1059898 1061709 1065051 1068610
62773 1068610 1071183 1072854 1074492 1076509 1078437 1079572 1079816 1079835 1080412 1081694 1083165 1084352 1085283 1086155 1086827 1086890
62757 1086890 1086036 1084207 1081624 1078896 1076793 1075616 1074998 1074500 1074079 1073670 1072879 1071678 1071122 1072654 1076742 1082691
62741 1082691 1089665 1097345 1105716 1114790 1124726 1135862 1148590 1163285 1180053 1198295 1217180 1237122
62729 1237122 1260124 1287656 1318694 1351098 1384770 1422053 1464893 1513042 1565399 1621774 1682586
62718 1682586 1748047 1818602 1895186 1977987 2065681 2157017 2252617 2354007 2461143 2571918 2683897
62707 2683897 2795343 2904394 3008393 3104737 3191924 3269206 3335369 3388223 3425453 3445959 3450255
$$ packed form
62805A042452m97m67q92j135j95J677K829K057P5j268r53L68J390J571J430J646
62789A050088K138K256J723R54L75p3m50l56M24J171R95K73L80J811L342L559
62773A068610K573J671J638K017J928J135K44J9N77J282J471J187R31Q72O72O3
62757A086890q54j829k583k728k103j177o18m98m21m09p91j201n56J532M088N949
62741A082691O974P680Q371R074R936J1136J2728J4695J6768J8242J8885J9942
62729A237122K3002K7532L1038L2404L3672L7283M2840M8149N2357N6375O0812
62718A682586O5461P0555P6584Q2801Q7694R1336R5600J01390J07136J10775J11979
62707B683897J11446J09051J03999R6344Q7187P7282O6163N2854L7230K0506M296
$$ plain form
62696 3450255 3439415 3413887 3373794 3320315 3255885 3182632 3101303 3012301 2917209 2818595 2718752
62685 2718752 2619236 2521121 2424731 2329486 2235127 2143138 2055950 1974498 1897389 1822799 1750491
62674 1750491 1681587 1616984 1556605 1499913 1446599 1396734 1350462 1307677 1268185 1232317 1201022
62663 1201022 1174732 1152270 1131546 1111533 1093021 1077290 1064607 1054292 1045659 1038478 1033062 1030345
62651 1030345 1031438 1036441 1044047 1052990 1063723 1077886 1096118 1117161 1139356 1162337 1186893 1213880
62639 1213880 1244069 1278632 1318672 1364017 1413218 1465123 1519976 1578613 1641184 1707248 1776553
62628 1776553 1848689 1922045 1994101 2063089 2128652 2190483 2247009 2296019 2336120 2366989 2388548
62617 2388548 2400543 2402703 2394579 2375371 2344676 2303696 2255175 2201911 2145550 2086747 2025850 1963112
$$ packed form
62696C450255j0840k5528m0093n3479o4430p3253q1329q9002r5092r8614r9843
62685B718752r9516r8115r6390r5245r4359r1989q7188q1452p7109p4590p2308
62674A750491o8904o4603o0379n6692n3314m9865m6272m2785l9492l5868l1295
62663A201022k6290k2462k0724k0013j8512j5731j2683j0315q633p181n416k717
62651A030345J093N003P606Q943J0733J4163J8232K1043K2195K2981K4556K6987
62639A213880L0189L4563M0040M5345M9201N1905N4853N8637O2571O6064O9305
62628A776553P2136P3356P2056O8988O5563O1831N6526M9010M0101L0869K1559
62617B388548J1995K160q124j9208l0695m0980m8521n3264n6361n8803o0897o2738
$$ plain form
62605 1963112 1898736 1833260 1767802 1703570 1641167 1580577 1521804 1465309 1411766 1361466 1313993
62594 1313993 1268563 1224823 1183282 1144696 1108947 1074894 1041670 1009864 980902 955279 931973
62583 931973 909835 888947 870014 852814 836210 819805 804740 792310 782305 773317 764305 755274
62571 755274 746644 738685 731621 725682 720873 717002 713907 711300 708524 705047 701272 698355 697120 697545
62557 697545 699229 701805 704961 708707 713695 720582 729005 737964 747282 757720 769445 781542 793645
62544 793645 806947 822707 840594 859458 879186 900751 924834 951277 979586 1009307 1040398
62533 1040398 1073945 1111802 1154570 1200489 1247422 1295297 1345242 1396953 1448676 1499684 1550876
62522 1550876 1602502 1652955 1700470 1744522 1784601 1818793 1844777 1861649 1869912 1870260 1863158 1849072
$$ packed form
62605A963112o4376o5476o5458o4232o2403o0590n8773n6495n3543n0300m7473
62594A313993m5430m3740m1541l8586l5749l4053l3224l1806k8962k5623k3306
62583I31973k2138k0888j8933j7200j6604j6405j5065j2430j0005q988r012r031
62571G55274q630p959p064n939m809l871l095k607k776l477l775k917j235M25
62557F97545J684K576L156L746M988O887Q423Q959R318J0438J1725J2097J2103
62544G93645J3302J5760J7887J8864J9728K1565K4083K6443K8309K9721L1091
62533A040398L3547L7857M2768M5919M6933M7875M9945N1711N1723N1008N1192
62522A550876N1626N0453M7515M4052M0079L4192K5984J6872Q263L48p102j4086
$$ plain form
62510 1849072 1828357 1801242 1768545 1732035 1693485 1653581 1612136 1568985 1524391 1479072 1434172
62499 1434172 1390661 1348390 1306445 1264891 1225361 1189262 1156091 1124359 1093483 1063793 1035250
62488 1035250 1007319 979804 952769 925954 899513 875064 854531 837636 821856 805379 789002
62477 789002 774504 762257 751405 741572 733275 726947 722496 719764 718683 719092 720928 724375 729168 734024
62463 734024 737701 740729 745232 752755 762932 774500 786802 799873 813865 829250 847100 868300
62451 868300 892601 919173 947891 979319 1013502 1049695 1087494 1127291 1169072 1211338 1251836
62440 1251836 1289060 1322604 1352278 1377404 1397034 1410736 1419165 1423639 1424759 1421518 1412286 1396700
62428 1396700 1376009 1351752 1325125 1297679 1271118 1245513 1218908 1190011 1160451 1133075 1108609
$$ packed form
62510A849072k0715k7115l2697l6510l8550l9904m1445m3151m4594m5319m4900
62499A434172m3511m2271m1945m1554l9530l6099l3171l1732l0876k9690k8543
62488A035250k7931k7515k7035k6815k6441k4449k0533j6895j5780j6477j6377
62477G89002j4498j2247j0852r833q297o328m451k732j081M09J836L447M793M856
62463G34024L677L028M503P523J0177J1568J2302J3071J3992J5385J7850K1200
62451H68300K4301K6572K8718L1428L4183L6193L7799L9797M1781M2266M0498
62440A251836L7224L3544K9674K5126J9630J3702Q429M474J120l241r232j5586
62428A396700k0691k4257k6627k7446k6561k5605k6605k8897k9560k7376k4466
$$ plain form
62417 1108609 1085523 1062775 1040988 1020927 1002466 985477 970319 956828 944058 931670 920519
62406 920519 911197 903068 895608 889792 887047 887351 889372 892186 896025 901425 908336 916043 923612 930550
62392 930550 937342 945032 954077 963996 974406 985731 998304 1011283 1023161 1033174 1041641 1049148 1055762
62379 1055762 1060792 1062853 1060503 1053477 1043228 1031860 1020497 1008830 995861 980816 963820 946216
62367 946216 929893 915725 902839 889817 876349 863355 851858 842299 834576 828077 821848 815483
62355 815483 809920 806855 807245 810687 816087 822512 829370 836206 842593 848373 854088 860864 869225 878047
62341 878047 885580 891728 898202 905817 912822 917144 919426 922321 927105 932480 936608 938806 939042 937262
62327 937262 933941 930285 927168 924520 922161 920483 919853 920206 921816 925622 931997 939779 947498 955249 964660
$$ packed form
62417A108609k3086k2748k1787k0061j8461j6989j5158j3491j2770j2388j1151
62406I20519r322q129p460n816k745L04K021K814L839N400O911P707P569O938
62392I30550O792P690R045R919J0410J1325J2573J2979J1878J0013Q467P507O614
62379A055762N030K061k350p026j0249j1368j1363j1667j2969j5045j6996j7604
62367I46216j6323j4168j2886j3022j3468j2994j1497r559p723o499o229o365
62355H15483n563l065L90L442N400O425O858O836O387N780N715O776Q361Q822
62341H78047P533O148O474P615P005M322K282K895M784N375M128K198K36j780
62327I37262l321l656l117k648k359j678o30L53J610L806O375P782P719P751R411
$$ plain form
62312 964660 977280 993795 1014463 1039198 1067063 1096733 1128092 1162819 1202725 1247829 1296820
62301 1296820 1349227 1406149 1468396 1534717 1602698 1671018 1739852 1809057 1877065 1941852 2001899
62290 2001899 2055484 2100054 2133632 2156650 2171375 2179568 2181487 2176955 2166283 2149940 2128156 2101168
62278 2101168 2069150 2031820 1988979 1941874 1893213 1845311 1798741 1753219 1709022 1666696 1625868
62267 1625868 1585393 1544808 1504969 1466978 1430903 1395901 1361493 1328342 1297642 1269860 1244491
62256 1244491 1221131 1200323 1182874 1168583 1156276 1145036 1134824 1125796 1117571 1109392 1100662 1091249
62244 1091249 1081647 1072831 1065391 1058730 1051650 1043877 1036424 1030272 1025345 1021082 1017319 1014117 1011257 1008516
62230 1008516 1006170 1004759 1004615 1005964 1009155 1014364 1021409 1030189 1040895 1053266 1066049 1077873 1088610
$$ packed form
62312I64660J2620J6515K0668K4735K7865K9670L1359L4727L9906M5104M8991
62301A296820N2407N6922O2247O6321O7981O8320O8834O9205O8008O4787O0047
62290B001899N3585M4570L3578K3018J4725Q193J919m532j0672j6343k1784k6988
62278B101168l2018l7330m2841m7105m8661m7902m6570m5522m4197m2326m0828
62267A625868m0475m0585l9839l7991l6075l5002l4408l3151l0700k7782k5369
62256A244491k3360k0808j7449j4291j2307j1240j0212r028q225q179q730r413
62244A091249r602q816p440o661p080p773p453o152m927m263l763l202k860k741
62230A008516k346j411j44J349L191N209P045Q780J0706J2371J2783J1824J0737
$$ plain form
62217 1088610 1099401 1111428 1125096 1140260 1156765 1174746 1194758 1217517 1243145 1270778 1299437
62206 1299437 1329336 1362015 1399074 1440976 1487008 1536130 1587779 1642131 1699865 1761828 1828883
62195 1828883 1901612 1979374 2059482 2137978 2211850 2280147 2342554 2397431 2442156 2475241 2497236
62184 2497236 2509348 2511813 2503993 2485690 2458013 2423049 2382769 2338110 2289038 2235611 2178942 2121101
62172 2121101 2064290 2010251 1959935 1913210 1869111 1826974 1787245 1750745 1717521 1687272 1660658
62161 1660658 1638912 1621788 1607003 1592449 1578194 1565595 1555257 1546866 1540416 1536204 1533592 1530929
62149 1530929 1527062 1522218 1517271 1513045 1510584 1511015 1514461 1519842 1526570 1535818 1549173 1566454 1585952
62136 1585952 1606644 1628991 1653447 1679466 1706704 1736336 1770217 1809014 1851736 1896765 1942707
$$ packed form
62217A088610J0791J2027J3668J5164J6505J7981K0012K2759K5628K7633K8659
62206A299437K9899L2679L7059M1902M6032M9122N1649N4352N7734O1963O7055
62195A828883P2729P7762Q0108P8496P3872O8297O2407N4877M4725L3085K1995
62184B497236J2112K465p820j8303k7677l4964m0280m4659m9072n3427n6669n7841
62172B121101n6811n4039n0316m6725m4099m2137l9729l6500l3224l0249k6614
62161A660658k1746j7124j4785j4554j4255j2599j0338q391o450m212k612k663
62149A530929l867m844m947m226k461M31L446N381O728R248J3355J7281J9498
62136A585952K0692K2347K4456K6019K7238K9632L3881L8797M2722M5029M5942
$$ plain form
62125 1942707 1988538 2033767 2078545 2122964 2166007 2205656 2240278 2269635 2294475 2315629 2333860
62114 2333860 2350348 2366768 2384670 2404813 2427086 2450951 2475970 2502052 2529504 2558937 2590949
62103 2590949 2625547 2661758 2697884 2732117 2762922 2789282 2811127 2829437 2845233 2858265 2867150
62092 2867150 2870867 2869505 2863545 2853449 2840431 2826516 2812789 2798238 2781359 2762512 2743672 2726375
62080 2726375 2711138 2698556 2689361 2683081 2677907 2672422 2666719 2661673 2658134 2657099 2659486 2665113 2672718
62067 2672718 2681476 2691738 2703981 2718216 2734962 2755615 2780757 2809037 2838850 2870560 2905901
62056 2905901 2945471 2987766 3030531 3072488 3114181 3157774 3205396 3256776 3308988 3359532 3409239
62045 3409239 3461066 3516478 3574336 3633191 3693097 3754726 3818006 3882542 3948821 4018251 4092006
$$ packed form
62125A942707M5831M5229M4778M4419M3043L9649L4622K9357K4840K1154J8231
62114B333860J6488J6420J7902K0143K2273K3865K5019K6082K7452K9433L2012
62103B590949L4598L6211L6126L4233L0805K6360K1845J8310J5796J3032Q885
62092B867150L717j362n960j0096j3018j3915j3727j4551j6879j8847j8840j7297
62080B726375j5237j2582r195o280n174n485n703n046l539j035K387N627P605
62067B672718Q758J0262J2243J4235J6746K0653K5142K8280K9813L1710L5341
62056B905901L9570M2295M2765M1957M1693M3593M7622N1380N2212N0544M9707
62045C409239N1827N5412N7858N8855N9906O1629O3280O4536O6279O9430P3755
$$ plain form
62034 4092006 4169957 4250604 4332224 4414445 4498460 4585167 4673529 4761596 4848877 4936573 5025496
62023 5025496 5115138 5205291 5297237 5392116 5488772 5584401 5677337 5768337 5859019 5949830 6040062
62012 6040062 6129387 6218605 6308635 6399335 6489884 6580150 6670846 6762117 6852732 6941154 7026787
62001 7026787 7109438 7188176 7261730 7329844 7393253 7452306 7506541 7555800 7600910 7642801 7681417
61990 7681417 7715773 7744691 7767446 7784104 7795349 7801663 7802803 7798490 7789365 7776627 7761076 7743380
61978 7743380 7725007 7707573 7691032 7673618 7654036 7632940 7611962 7592166 7573651 7555634 7536480
61967 7536480 7514798 7491275 7468543 7448544 7430762 7413633 7396645 7380167 7364182 7348422 7333221
61956 7333221 7319233 7306844 7296787 7290627 7289284 7291512 7295241 7300267 7308302 7320440 7336027 7354288
$$ packed form
62034D092006P7951Q0647Q1620Q2221Q4015Q6707Q8362Q8067Q7281Q7696Q8923
62023E025496Q9642R0153R1946R4879R6656R5629R2936R1000R0682R0811R0232
62012F040062Q9325Q9218R0030R0700R0549R0266R0696R1271R0615Q8422Q5633
62001G026787Q2651P8738P3554O8114O3409N9053N4235M9259M5110M1891L8616
61990G681417L4356K8918K2755J6658J1245O314J140m313r125j2738j5551j7696
61978G743380j8373j7434j6541j7414j9582k1096k0978j9796j8515j8017j9154
61967G536480k1682k3523k2732j9999j7782j7129j6988j6478j5985j5760j5201
61956G333221j3988j2389j0057o160j343K228L729N026Q035J2138J5587J8261
$$ plain form
61944 7354288 7375652 7400754 7429048 7459113 7489765 7520287 7549968 7577809 7602286 7621140 7631823
61933 7631823 7632553 7622746 7602366 7571301 7529594 7478051 7418415 7353036 7284041 7212393 7137906 7060726
61921 7060726 6982474 6905129 6828845 6751935 6673203 6593403 6514114 6436272 6360447 6287476 6217692
61910 6217692 6150041 6083192 6017497 5954950 5897012 5843151 5791677 5741465 5692617 5645957 5602395
61899 5602395 5562672 5527260 5496221 5469188 5445651 5425467 5408946 5396344 5387445 5382050 5380809 5384971
61887 5384971 5395032 5410068 5428808 5451107 5478075 5510951 5550139 5595067 5644669 5698105 5755271
61876 5755271 5816448 5881277 5948404 6016455 6085068 6154630 6225353 6297133 6370045 6444186 6519072
61865 6519072 6594002 6669384 6747251 6830140 6919820 7017468 7124787 7244428 7379269 7531616
$$ packed form
61944G354288K1364K5102K8294L0065L0652L0522K9681K7841K4477J8854J0683
61933G631823P30r807k0380l1065m1707n1543n9636o5379o8995p1648p4487p7180
61921G060726p8252p7345p6284p6910p8732p9800p9289p7842p5825p2971o9784
61910F217692o7651o6849o5695o2547n7938n3861n1474n0212m8848m6660m3562
61899E602395l9723l5412l1039k7033k3537k0184j6521j2602q899n395j241M162
61887E384971J0061J5036J8740K2299K6968L2876L9188M4928M9602N3436N7166
61876E755271O1177O4829O7127O8051O8613O9562P0723P1780P2912P4141P4886
61865F519072P4930P5382P7867Q2889Q9680R7648J07319J19641J34841J52347
$$ plain form
61855 7531616 7703376 7896860 8115032 8360621 8635109 8939077 9273641 9641170 10044467
61846 10044467 10486043 10968819 11496844 12074117 12702680 13382667 14113738 14894550 15719634
61837 15719634 16577285 17450580 18318596 19154820 19925380 20591914 21118737 21478947 21656428
61828 21656428 21646007 21454227 21099300 20607906 20009927 19334141 18606026 17846685 17072464
61819 17072464 16295755 15526508 14772917 14040884 13333648 12652753 11999695 11376672 10785897
61810 10785897 10228442 9704020 9212028 8752752 8327301 7936292 7578863 7253261 6958225
61801 6958225 6693396 6458333 6251553 6070889 5914629 5781988 5672393 5584588 5516685 5466917
61791 5466917 5433801 5415310 5408265 5409187 5415731 5426744 5440731 5454859 5465917 5471958 5472632 5468292 5459402
$$ packed form
61855G531616J71760J93484K18172K45589K74488L03968L34564L67529M03297
61846A0044467M41576M82776N28025N77273O28563O79987P31071P80812Q25084
61837A5719634Q57651Q73295Q68016Q36224P70560O66534N26823L60210J77481
61828B1656428j0421j91780l54927m91394n97979o75786p28115p59341p74221
61819A7072464p76709p69247p53591p32033p07236o80895o53058o23023n90775
61810A0785897n57455n24422m91992m59276m25451l91009l57429l25602k95036
61801F958225k64829k35063k06780j80664j56260j32641j09595q7805o7903m9768
61791E466917l3116j8491p045R22O544J1013J3987J4128J1058O041O74m340q890
$$ plain form
61778 5459402 5446619 5430834 5413065 5394750 5377987 5364882 5356555 5353272 5355315 5362777 5374313 5387154
61766 5387154 5399078 5409651 5418668 5424002 5422122 5410620 5389326 5359094 5320724 5275445 5225349 5172366
61754 5172366 5117293 5060634 5004193 4951041 4903787 4863437 4830088 4804231 4787009 4779485 4782223 4795766
61742 4795766 4821188 4859837 4912521 4979214 5059681 5154168 5263284 5387392 5526563 5681183
61732 5681183 5852432 6042213 6252798 6486376 6744453 7027589 7336327 7672682 8040366
61723 8040366 8443288 8884470 9367007 9895604 10476164 11114000 11813515 12579951 13420534
61714 13420534 14343221 15354838 16461033 17667106 18977006 20390245 21899427 23490015
61706 23490015 25140725 26822204 28494253 30104402 31590104 32884599 33924780 34659504
$$ packed form
61778E459402j2783j5785j7769j8315j6763j3105q327l283K043P462J1536J2841
61766E387154J1924J0573R017N334j880j1502k1294l0232l8370m5279n0096n2983
61754E172366n5073n6659n6441n3152m7254m0350l3349k5857j7222p524K738J3543
61742D795766K5422L8649N2684O6693Q0467R4487J09116J24108J39171J54620
61732E681183J71249J89781K10585K33578K58077K83136L08738L36355L67684
61723H040366M02922M41182M82537N28597N80560O37836O99515P66436Q40583
61714A3420534R22687J011617J106195J206073J309900J413239J509182J590588
61706B3490015J650710J681479J672049J610149J485702J294495J040181P34724
$$ plain form
61698 34659504 35056954 35109249 34832367 34261085 33441549 32424846 31262528 30002631 28685557
61689 28685557 27341846 25993505 24657268 23346508 22070978 20836495 19646136 18502088
61681 18502088 17406735 16362742 15372676 14438361 13560328 12737899 11969820 11254681 10590930
61672 10590930 9977024 9411709 8893643 8420496 7988800 7594888 7235630 6908052 6608735
61663 6608735 6333964 6080130 5843772 5621808 5412291 5214570 5028224 4852152 4685149
61654 4685149 4526874 4377503 4236729 4103821 3978467 3860786 3750600 3647321 3550327 3458723
61644 3458723 3371087 3286549 3206033 3131188 3061887 2996040 2932316 2871737 2815730 2763704 2713685
61633 2713685 2664662 2617135 2571795 2528829 2488368 2450527 2414911 2380899 2348386 2317452 2287316
$$ packed form
61698C4659504L97450N2295k76882n71282q19536j016703j162318j259897j317074
61689B8685557j343711j348341j336237j310760j275530j234483j190359j144048
61681A8502088j095353j043993r90066r34315q78033q22429p68079p15139o63751
61672A0590930o13906n65315n18066m73147m31696l93912l59258l27578k99317
61663F608735k74771k53834k36358k21964k09517j97721j86346j76072j67003
61654D685149j58275j49371j40774j32908j25354j17681j10186j03279r6994r1604
61644C458723q7636q4538q0516p4845o9301o5847o3724o0579n6007n2026n0019
61633B713685m9023m7527m5340m2966m0461l7841l5616l4012l2513l0934l0136
$$ plain form
61622 2287316 2256637 2225257 2194914 2167651 2143872 2122300 2101580 2081553 2063085 2046886 2032642
61611 2032642 2019443 2007047 1996154 1986920 1977664 1966047 1951684 1936746 1923557 1912240 1901194 1889403
61599 1889403 1877590 1867245 1859072 1852547 1846745 1841405 1837153 1834682 1834022 1834864 1837343 1841938 1848601 1856624
61585 1856624 1865401 1874674 1883851 1891891 1898423 1904394 1911051 1918751 1927301 1936749 1946967 1957067 1966533
61572 1966533 1976834 1990542 2008429 2028518 2048525 2068264 2088762 2109663 2128583 2142906 2151523
61561 2151523 2154852 2153737 2148410 2138379 2123454 2104906 2084851 2064022 2040952 2014340 1985575 1957589
61549 1957589 1931485 1905939 1880004 1854692 1831025 1808210 1785111 1762295 1741043 1721162 1701640
61538 1701640 1682980 1666925 1653810 1642067 1630776 1620886 1613121 1606455 1599991 1595028 1593587 1595609 1599254
$$ packed form
61622B287316l0679l1380l0343k7263k3779k1572k0720k0027j8468j6199j4244
61611B032642j3199j2396j0893r234r256j1617j4363j4938j3189j1317j1046j1791
61599A889403j1813j0345q173o525n802n340m252k471o60Q42K479M595O663Q023
61585A856624Q777R273R177Q040O532N971O657P700Q550R448J0218J0100R466
61572A966533J0301J3708J7887K0089K0007J9739K0498K0901J8920J4323Q617
61561B151523L329j115n327j0031j4925j8548k0055k0829k3070k6612k8765k7986
61549A957589k6104k5546k5935k5312k3667k2815k3099k2816k1252j9881j9522
61538A701640j8660j6055j3115j1743j1291r890p765o666o464m963j441K022L645
$$ plain form
61525 1599254 1603642 1609665 1618058 1628218 1639554 1652954 1670104 1691728 1716924 1744040 1772032 1801239
61513 1801239 1832879 1867640 1905015 1944423 1986544 2032629 2082490 2134093 2185418 2236051 2286723
61502 2286723 2337992 2389752 2441338 2491635 2539628 2585327 2629760 2673691 2716790 2758364 2798288
61491 2798288 2836711 2873436 2908367 2942051 2974865 3005818 3032991 3055183 3072392 3084652 3091247
61480 3091247 3091540 3086111 3076612 3064722 3051454 3037223 3022213 3006721 2991421 2977386 2965751 2957174
61468 2957174 2951525 2948208 2947149 2949526 2957184 2971102 2990903 3016278 3048439 3089487 3140493 3200920
61456 3200920 3269966 3347768 3435186 3533252 3643275 3766874 3905229 4058679 4227632 4413603
61446 4413603 4618705 4844155 5089854 5355417 5640866 5945836 6268333 6604556 6949631
$$ packed form
61525A599254M388O023Q393J0160J1336J3400J7150K1624K5196K7116K7992K9207
61513A801239L1640L4761L7375L9408M2121M6085M9861N1603N1325N0633N0672
61502B286723N1269N1760N1586N0297M7993M5699M4433M3931M3099M1574L9924
61491B798288L8423L6725L4931L3684L2814L0953K7173K2192J7209J2260O595
61480C091247K93n429r499j1890j3268j4231j5010j5492j5300j4035j1635q577
61468B957174n649l317j059K377P658J3918J9801K5375L2161M1048N1006O0427
61456C200920O9046P7802Q7418R8066J10023J23599J38355J53450J68953J85971
61446D413603K05102K25450K45699K65563K85449L04970L22497L36223L45075
$$ plain form
61437 6949631 7297946 7642595 7974807 8284338 8560772 8794872 8979582 9110899 9188602 9215863
61427 9215863 9197388 9137649 9041186 8914337 8765371 8601886 8428340 8246873 8060246 7872974
61417 7872974 7689587 7512858 7344150 7184608 7035245 6896583 6769234 6654724 6555020 6471286
61407 6471286 6403699 6352288 6317086 6297377 6291634 6298612 6317996 6349667 6392843 6446174 6507995 6576114
61395 6576114 6648093 6722547 6799762 6880260 6963177 7047014 7131756 7219026 7309682 7402153 7493689
61384 7493689 7582728 7669580 7755315 7840500 7924575 8005793 8081997 8152012 8216233 8275412 8329101
61373 8329101 8375771 8414276 8444558 8466902 8481261 8487615 8486472 8478516 8464045 8443111 8416007 8383208
61361 8383208 8344980 8301613 8254232 8205099 8156764 8110831 8067592 8026748 7988302 7952760 7920733
$$ packed form
61437F949631L48315L44649L32212L09531K76434K34100J84710J31317P7703K7261
61427I215863j8475n9739r6463j26849j48966j63485j73546j81467j86627j87272
61417G872974j83387j76729j68708j59542j49363j38662j27349j14510r9704q3734
61407F471286o7587n1411l5202j9709n743O978J9384L1671M3176N3331O1821O8119
61395F576114P1979P4454P7215Q0498Q2917Q3837Q4742Q7270R0656R2471R1536
61384G493689Q9039Q6852Q5735Q5185Q4075Q1218P6204P0015O4221N9179N3689
61373H329101M6670L8505L0282K2344J4359O354j143p956j4471k0934k7104l2799
61361H383208l8228m3367m7381m9133m8335m5933m3239m0844l8446l5542l2027
$$ plain form
61350 7920733 7892626 7868590 7848357 7830951 7814856 7798824 7782413 7765557 7747799 7728359 7706975
61339 7706975 7684398 7662120 7641994 7626097 7616417 7614430 7621343 7638954 7669819 7716217 7779420 7860437
61327 7860437 7961156 8084067 8230968 8402608 8599575 8822802 9072893 9349286 9650162
61318 9650162 9972623 10312741 10665910 11027269 11391024 11748790 12089291 12400686 12673418
61309 12673418 12900821 13078013 13201612 13270675 13286895 13253319 13173223 13050206 12888437 12692146
61299 12692146 12465168 12211394 11935354 11641986 11336041 11021959 10703868 10385275 10068939
61290 10068939 9757466 9453769 9160472 8878973 8609503 8352127 8107412 7876187 7659024
61281 7659024 7456162 7267946 7095345 6939864 6802483 6682629 6578793 6490409 6418466 6363738
$$ packed form
61350G920733k8107k4036k0233j7406j6095j6032j6411j6856j7758j9440k1384
61339G706975k2577k2278k0126j5897r680j987O913J7611L0865M6398O3203Q1017
61327G860437J00719J22911J46901J71640J96967K23227K50091K76393L00876
61318I650162L22461L40118L53169L61359L63755L57766L40501L11395K72732
61309A2673418K27403J77192J23599O9063J6220l3576q0096j23017j61769j96291
61299A2692146k26978k53774k76040k93368l05945l14082l18091l18593l16336
61290A0068939l11473l03697k93297k81499k69470k57376k44715k31225k17163
61281G659024k02862j88216j72601j55481j37381j19854j03836q8384p1943n4728
$$ plain form
61271 6363738 6325063 6300170 6287648 6287004 6297086 6315876 6342158 6376099 6417436 6463962 6512684 6561912
61259 6561912 6611310 6660200 6706817 6749419 6787625 6822514 6855649 6887817 6918185 6944604 6965212
61248 6965212 6979969 6990470 6998056 7002289 7001366 6993791 6979356 6958487 6931073 6896342 6853873 6804184
61236 6804184 6748076 6685894 6618026 6545901 6471701 6396938 6321899 6246719 6172354 6100071 6030516
61225 6030516 5963932 5901073 5843271 5791488 5745665 5705060 5668921 5636678 5607681 5581072 5556200
61214 5556200 5533169 5512647 5494847 5478908 5463664 5448856 5435215 5423742 5415698 5412962 5417113 5427735
61202 5427735 5442640 5460349 5481504 5507318 5537691 5571757 5609369 5650943 5696714 5747780 5807520
61191 5807520 5880187 5967577 6068022 6178653 6297441 6422768 6552361 6683230 6811563 6931797
$$ packed form
61271F363738l8675k4893j2522o44J0082J8790K6282L3941M1337M6526M8722M9228
61259F561912M9398M8890M6617M2602L8206L4889L3135L2168L0368K6419K0608
61248F965212J4757J0501P586M233r23p575j4435k0869k7414l4731m2469m9689
61236F804184n6108o2182o7868p2125p4200p4763p5039p5180p4365p2283o9555
61225F030516o6584o2859n7802n1783m5823m0605l6139l2243k8997k6609k4872
61214E556200k3031k0522j7800j5939j5244j4808j3641j1473q044k736M151J0622
61202E427735J4905J7709K1155K5814L0373L4066L7612M1574M5771N1066N9740
61191E807520P2667Q7390J00445J10631J18788J25327J29593J30869J28333J20234
$$ plain form
61181 6931797 7036593 7118634 7172279 7193402 7178926 7127818 7042300 6927101 6787504 6628479
61171 6628479 6455091 6272460 6084898 5895598 5707242 5522257 5342143 5167148 4997241
61162 4997241 4833358 4677144 4529254 4388491 4253305 4124226 4004071 3895298 3797636 3708873
61152 3708873 3627455 3553360 3486709 3426892 3373602 3327669 3290035 3260319 3237099 3219281 3206665
61141 3206665 3199396 3197421 3200401 3207795 3219012 3233467 3250177 3267413 3283509 3298266 3312731 3327055
61129 3327055 3339379 3347557 3351201 3351075 3347191 3338921 3326714 3312118 3295836 3277022 3254989 3230475
61117 3230475 3204445 3176486 3145320 3110450 3072498 3032201 2989813 2945345 2898675 2849340 2796774
61106 2796774 2741086 2683361 2625037 2567149 2510199 2454489 2400294 2347688 2296403 2245995 2196140
$$ packed form
61181F931797J04796Q2041N3645K1123j4476n1108q5518j15199j39597j59025
61171F628479j73388j82631j87562j89300j88356j84985j80114j74995j69907
61162D997241j63883j56214j47890j40763j35186j29079j20155j08773r7662q8763
61152C708873q1418p4095o6651n9817n3290m5933l7634k9716k3220j7818j2616
61141C206665p269j975K980P394J1217J4455J6710J7236J6096J4757J4465J4324
61129C327055J2324Q178L644j26l884q270j2207j4596j6282j8814k2033k4514
61117C230475k6030k7959l1166l4870l7952m0297m2388m4468m6670m9335n2566
61106B796774n5688n7725n8324n7888n6950n5710n4195n2606n1285n0408m9855
$$ plain form
61095 2196140 2146743 2097922 2050175 2004526 1962040 1922846 1885806 1849442 1813020 1776575 1740249
61084 1740249 1704155 1668686 1634350 1601309 1569686 1540379 1514876 1493880 1476483 1460996 1446416
61073 1446416 1432939 1421401 1412440 1405951 1401274 1398196 1397720 1401170 1408332 1417097 1425470 1433462 1442585 1453948
61059 1453948 1467455 1482379 1497852 1513000 1527544 1542281 1558206 1575043 1591408 1606598 1621408
61048 1621408 1636775 1652396 1667210 1680621 1692520 1702587 1710473 1716459 1721115 1724330 1725437 1724375
61036 1724375 1722048 1719316 1716241 1712482 1707715 1701261 1692004 1679374 1664109 1647494 1630183 1612222 1593811
61023 1593811 1575246 1556316 1536584 1516303 1496388 1477449 1459549 1442990 1428496 1416251 1405375
61012 1405375 1394816 1384330 1374264 1364847 1356125 1348234 1341412 1336031 1332669 1331574 1331809 1331721 1330749 1330009
$$ packed form
61095B196140m9397m8821m7747m5649m2486l9194l7040l6364l6422l6445l6326
61084A740249l6094l5469l4336l3041l1623k9307k5503k0996j7397j5487j4580
61073A446416j3477j1538q961o489m677l078m76L450P162Q765Q373P992R123J1363
61059A453948J3507J4924J5473J5148J4544J4737J5925J6837J6365J5190J4810
61048A621408J5367J5621J4814J3411J1899J0067P886N986M656L215J107j062
61036A724375k327k732l075l759m767o454r257j2630j5265j6615j7311j7961j8411
61023A593811j8565j8930j9732k0281j9915j8939j7900j6559j4494j2245j0876
61012A405375j0559j0486j0066r417q722p891o822n381l362j095K35q8r72p40
$$ plain form
60998 1330009 1330529 1331730 1332580 1333436 1335479 1338800 1342466 1346356 1351413 1357818 1364332 1370074 1375921 1383414 1393062
60983 1393062 1404375 1416860 1430253 1444329 1459151 1475168 1492600 1511227 1531278 1553844 1579633
60972 1579633 1607706 1636348 1665011 1694651 1726199 1759482 1793797 1829085 1866225 1906327 1949650
60961 1949650 1995097 2040932 2086201 2131347 2177412 2225129 2275016 2327802 2384190 2444573 2509374
60950 2509374 2579220 2654255 2733964 2818605 2910396 3012188 3125024 3248029 3380615 3523499
60940 3523499 3677264 3841370 4015654 4202084 4403922 4623532 4862049 5121170 5404266
60931 5404266 5715231 6056755 6430228 6837283 7281219 7767060 8300769 8889105 9540991
60922 9540991 10269591 11093456 12035716 13121640 14375367 15816823 17460596 19318792 21406697
$$ packed form
60998A330009N20J201Q50Q56K043L321L666L890N057O405O514N742N847P493R648
60983A393062J1313J2485J3393J4076J4822J6017J7432J8627K0051K2566K5789
60972A579633K8073K8642K8663K9640L1548L3283L4315L5288L7140M0102M3323
60961A949650M5447M5835M5269M5146M6065M7717M9887N2786N6388O0383O4801
60950B509374O9846P5035P9709Q4641R1791J01792J12836J23005J32586J42884
60940C523499J53765J64106J74284J86430K01838K19610K38517K59121K83096
60931E404266L10965L41524L73473M07055M43936M85841N33709N88336O51886
60922I540991P28600Q23865R42260J085924J253727J441456J643773J858196K087905
$$ plain form
60913 21406697 23744329 26345072 29190204 32201571 35231700 38083904 40559468 42516089
60905 42516089 43916023 44842338 45469755 45996457 46566156 47215558 47864152 48340806 48435148
60896 48435148 47964447 46839053 45096270 42880674 40383316 37779747 35198064 32717012
60888 32717012 30376519 28189180 26151507 24253983 22486396 20838392 19299409 17860325
60880 17860325 16515025 15260323 14095028 13018799 12030279 11125090 10295815 9534452 8834950
60871 8834950 8193493 7607109 7072639 6586896 6147100 5750635 5394155 5072966 4781379
60862 4781379 4513815 4265873 4034840 3819626 3620028 3435559 3264769 3105918 2958115
60853 2958115 2821348 2695515 2580000 2474083 2376889 2286839 2202226 2122796 2049751 1983602
$$ packed form
60913B1406697K337632K600743K845132L011367L030129K852204K475564J956621
60905D2516089J399934R26315O27417N26702N69699O49402O48594M76654R4342
60896D8435148m70701j125394j742783k215596k497358k603569k581683k481052
60888C2717012k340493k187339k037673j897524j767587j648004j538983j439084
60880A7860325j345300j254702j165295j076229r88520r05189q29275p61363o99502
60871H834950o41457n86384n34470m85743m39796l96465l56480l21189k91587
60862D781379k67564k47942k31033k15214j99598j84469j70790j58851j47803
60853B958115j36767j25833j15515j05917r7194r0050q4613p9430p3045o6149
$$ plain form
60843 1983602 1922978 1866348 1813777 1765773 1721380 1679181 1639719 1605059 1575780 1550048 1526015
60832 1526015 1503583 1483295 1465053 1448928 1435984 1426938 1420700 1415382 1410244 1405588 1401198 1396073 1389641
60819 1389641 1382284 1374613 1366900 1359091 1350581 1340087 1326771 1311688 1297325 1285313 1275162 1265473
60807 1265473 1255703 1246232 1237231 1228166 1218360 1207683 1196768 1186885 1179448 1175230 1173863 1174203 1175289 1177073
60793 1177073 1180317 1185733 1193095 1201348 1209855 1219392 1231435 1246499 1263775 1282462 1302689 1324692
60781 1324692 1347852 1371297 1394933 1418903 1442279 1463469 1482113 1499668 1517706 1536334 1554649
60770 1554649 1571885 1587497 1600779 1611252 1619144 1624807 1627974 1628352 1626785 1624995 1624061 1623706 1623095 1621727
60756 1621727 1619471 1616265 1611967 1606102 1597761 1586274 1572016 1556061 1539062 1521107 1502663 1484769
$$ packed form
60843A983602o0624n6630n2571m8004m4393m2199l9462l4660k9279k5732k4033
60832A526015k2432k0288j8242j6125j2944r046o238n318n138m656m390n125o432
60819A389641p357p671p713p809q510j0494j3316j5083j4363j2012j0151r689
60807A265473r770r471r001r065r806j0677j0915r883p437m218j367L40J086J784
60793A177073L244N416P362Q253Q507R537J2043J5064J7276J8687K0227K2003
60781A324692K3160K3445K3636K3970K3376K1190J8644J7555J8038J8628J8315
60770A554649J7236J5612J3282J0473P892N663L167L78j567j790r34l55o11j368
60756A621727k256l206m298n865q341j1487j4258j5955j6999j7955j8444j7894
$$ plain form
60744 1484769 1467992 1452009 1436584 1422147 1408860 1395981 1383063 1371224 1362249 1356569 1352894 1349677
60732 1349677 1346287 1343082 1341178 1342120 1346762 1354172 1362312 1370081 1378265 1388290 1400606 1414566 1429415
60719 1429415 1444951 1461467 1479355 1498641 1518665 1538336 1556877 1574394 1591725 1609701 1628398
60708 1628398 1647059 1664889 1681912 1698583 1714468 1728068 1738564 1747170 1755889 1765335 1774768 1783912
60696 1783912 1793236 1802213 1808833 1811818 1812467 1813391 1815877 1819246 1822150 1823597 1823202 1821528 1820020 1819538 1818920
60681 1818920 1815967 1810043 1802784 1795829 1788809 1780267 1769821 1758471 1747146 1736027 1725290 1715478 1706653
60668 1706653 1697929 1688488 1678685 1669631 1661998 1655748 1650715 1646723 1643327 1640133 1637312 1635048 1632569 1628757
60654 1628757 1623873 1619532 1616552 1614001 1611095 1608706 1607603 1606182 1601788 1594127 1585714 1578857 1573665 1569262
$$ packed form
60744A484769j6777j5983j5425j4437j3287j2879j2918j1839q975n680l675l217
60732A349677l390l205j904R42M642P410Q140P769Q184J0025J2316J3960J4849
60719A429415J5536J6516J7888J9286K0024J9671J8541J7517J7331J7976J8697
60708A628398J8661J7830J7023J6671J5885J3600J0496Q606Q719R446R433R144
60696A783912R324Q977O620K985O49R24K486L369K904J447l95j674j508m82o18
60681A818920k953n924p259o955p020q542j0446j1350j1325j1119j0737r812q825
60668A706653q724r441r803r054p633o250n033l992l396l194k821k264k479l812
60654A628757m884m341k980k551k906k389j103j421m394p661q413o857n192m403
$$ plain form
60640 1569262 1565349 1561864 1558481 1555373 1553339 1552115 1549398 1542825 1532545 1520829 1509478 1498535 1487322
60627 1487322 1475552 1463139 1449660 1434570 1417788 1399942 1382006 1364621 1347684 1330797 1314046
60616 1314046 1297861 1282127 1266281 1250685 1237096 1226981 1219969 1214838 1211507 1210923 1213127 1216701 1220439
60603 1220439 1224524 1229490 1234805 1239422 1243396 1248019 1254133 1261020 1267517 1273768 1280961 1289238 1296959 1302802
60589 1302802 1307863 1314377 1322685 1330859 1337595 1343978 1351660 1360498 1369088 1376852 1384462 1392676 1401761 1411729
60575 1411729 1422267 1432723 1442958 1453852 1466258 1479988 1494718 1511211 1530352 1551283 1571905
60564 1571905 1591143 1609532 1627639 1645265 1662329 1679108 1695215 1709442 1721085 1730353 1737051 1739955
60552 1739955 1738098 1731993 1723195 1713508 1704792 1698299 1693485 1688372 1681738 1674219 1666880 1659808 1652701 1645601
$$ packed form
60640A569262l913l485l383l108k034j224k717o573j0280j1716j1351j0943j1213
60627A487322j1770j2413j3479j5090j6782j7846j7936j7385j6937j6887j6751
60616A314046j6185j5734j5846j5596j3589j0115p012n131l331n84K204L574L738
60603A220439M085M966N315M617L974M623O114O887O497O251P193Q277P721N843
60589A302802N061O514Q308Q174O736O383P682Q838Q590P764P610Q214R085R968
60575A411729J0538J0456J0235J0894J2406J3730J4730J6493J9141K0931K0622
60564A571905J9238J8389J8107J7626J7064J6779J6107J4227J1643R268O698K904
60552A739955j857o105q798r687q716o493m814n113o634p519p339p072p107p100
$$ plain form
60538 1645601 1638144 1629221 1618489 1607245 1596598 1585748 1573587 1561190 1550961 1543654 1538003 1533193
60526 1533193 1529857 1528288 1527463 1526713 1527042 1529705 1534244 1538879 1542304 1544364 1545480 1546276 1547535 1549636 1551971
60511 1551971 1553478 1553927 1554275 1555592 1557895 1560356 1562539 1565048 1568552 1572378 1574761 1574879 1574114 1574600 1576698
60496 1576698 1578540 1578054 1574854 1570158 1565647 1562725 1562252 1564402 1568853 1575301 1583615 1593574 1605090 1618957
60482 1618957 1636832 1659946 1688058 1720020 1755060 1793167 1834616 1879682 1928510 1980487 2033614
60471 2033614 2085055 2132426 2174105 2208243 2232335 2244600 2245631 2238157 2225170 2208695 2190387 2172514
60459 2172514 2157539 2146728 2139655 2135275 2133187 2133790 2137661 2145212 2156737 2172208 2190967 2212167 2235774
60446 2235774 2262828 2294314 2329913 2368337 2409108 2453782 2505180 2565408 2634846 2713199 2801324
$$ packed form
60538A645601p457q923j0732j1244j0647j0850j2161j2397j0229p307n651m810
60526A533193l336j569q25p50L29K663M539M635L425K060J116P96J259K101K335
60511A551971J507M49L48J317K303K461K183K509L504L826K383J18p65M86K098
60496A576698J842m86l200m696m511k922m73K150M451O448Q314R959J1516J3867
60482A618957J7875K3114K8112L1962L5040L8107M1449M5066M8828N1977N3127
60471B033614N1441M7371M1679L4138K4092J2265J031p474j2987j6475j8308j7873
60459B172514j4975j0811p073m380k088O03L871P551J1525J5471J8759K1200K3607
60446B235774K7054L1486L5599L8424M0771M4674N1398O0228O9438P8353Q8125
$$ plain form
60435 2801324 2901606 3016389 3146412 3291163 3450554 3625695 3818100 4028924 4259370
60426 4259370 4511286 4786707 5087129 5413781 5768135 6150631 6557847 6980684 7404969
60417 7404969 7812969 8184342 8497542 8732980 8876657 8921779 8868401 8723122 8499103 8214389
60407 8214389 7888083 7537008 7174879 6812660 6457975 6114412 5782769 5463554 5157928
60398 5157928 4866559 4588958 4324627 4074254 3839029 3619204 3414016 3222675 3044619
60389 3044619 2878989 2724912 2582716 2454026 2339833 2238737 2147751 2064720 1989224 1921039
60379 1921039 1858648 1799941 1743960 1691222 1642506 1598041 1557770 1521447 1488135 1456415 1425756
60368 1425756 1397177 1371889 1349744 1329675 1311237 1294777 1280246 1266902 1254343 1242904 1232793
$$ packed form
60435B801324J00282J14783J30023J44751J59391J75141J92405K10824K30446
60426D259370K51916K75421L00422L26652L54354L82496M07216M22837M24285
60417G404969M08000L71373L13200K35438J43677M5122n3378j45279k24019k84714
60407H214389l26306l51075l62129l62219l54685l43563l31643l19215l05626
60398E157928k91369k77601k64331k50373k35225k19825k05188j91341j78056
60389C044619j65630j54077j42196j28690j14193j01096r0986q3031p5496o8185
60379A921039o2391n8707n5981n2738m8716m4465m0271l6323l3312l1720l0659
60368A425756k8579k5288k2145k0069j8438j6460j4531j3344j2559j1439j0111
$$ plain form
60357 1232793 1223655 1215411 1208692 1203852 1200218 1196993 1194375 1193057 1193022 1193649 1194700 1196371 1198457 1200282 1201578
60342 1201578 1202760 1204283 1206391 1209599 1214675 1221704 1229706 1237540 1244803 1251537 1257546 1262608 1267046 1271542
60328 1271542 1276340 1281036 1285184 1288800 1292308 1296170 1300428 1304281 1306275 1305541 1302929 1300372 1298890 1297733
60314 1297733 1295851 1293533 1291762 1290277 1287497 1282748 1277656 1274609 1274288 1275348 1276167 1276163 1275619 1275185 1275768 1278235
60298 1278235 1282814 1289050 1296400 1304382 1312136 1318625 1323739 1328718 1335005 1343068 1352684 1363846 1376559
60285 1376559 1389935 1402328 1412727 1421793 1431396 1443199 1457321 1472026 1484832 1494403 1501414 1507458
60273 1507458 1513422 1519288 1525062 1530967 1536774 1541936 1546816 1552971 1561522 1571652 1581429 1589836 1597252 1603914
60259 1603914 1608736 1610072 1607362 1601680 1594892 1588476 1582959 1578005 1572894 1567131 1560798 1554416 1548524 1543445
$$ packed form
60357A232793r138q244o719m840l634l225k618j318l5O27J051J671K086J825J296
60342A201578J182J523K108L208N076P029Q002P834P263O734O009N062M438M496
60328A271542M798M696M148L616L508L862M258L853J994p34k612k557j482j157
60314A297733j882k318j771j485k780m749n092l047l21J060Q19mn44m34N83K467
60298A278235M579O236P350P982P754O489N114M979O287Q063R616J1162J2713
60285A376559J3376J2393J0399R066R603J1803J4122J4705J2806R571P011O044
60273A507458N964N866N774N905N807N162M880O155Q551J0130R777Q407P416O662
60259A603914M822J336k710n682o788o416n517m954n111n763o333o382n892n079
$$ plain form
60245 1543445 1539288 1536020 1533523 1531704 1530447 1529350 1527707 1525157 1522353 1520547 1520397 1521543 1523498 1526418
60231 1526418 1530570 1535522 1540538 1545690 1552017 1560464 1570926 1582192 1592630 1601301 1608992 1617873 1629427
60218 1629427 1642821 1656020 1668331 1680965 1695090 1710450 1726166 1741779 1756877 1770784 1783683
60207 1783683 1797476 1814474 1835437 1859679 1886746 1917101 1951209 1988852 2029594 2073354 2120206
60196 2120206 2170053 2222844 2279186 2340664 2409323 2486449 2571765 2664151 2763143 2869200 2982615
60185 2982615 3103183 3231400 3368993 3517304 3675714 3842406 4016103 4196131 4381291
60176 4381291 4569731 4759627 4948988 5134974 5314429 5484957 5644649 5791084 5921805
60167 5921805 6035709 6132796 6212608 6274257 6318230 6346853 6362582 6366938 6361522 6348789 6331019
$$ packed form
60245A543445m157l268k497j819j257j097j643k550k804j806j50J146J955K920
60231A526418M152M952N016N152O327Q447J0462J1266J0438Q671P691Q881J1554
60218A629427J3394J3199J2311J2634J4125J5360J5716J5613J5098J3907J2899
60207A783683J3793J6998K0963K4242K7067L0355L4108L7643M0742M3760M6852
60196B120206M9847N2791N6342O1478O8659P7126Q5316R2386R8992J06057J13415
60185B982615J20568J28217J37593J48311J58410J66692J73697J80028J85160
60176D381291J88440J89896J89361J85986J79455J70528J59692J46435J30721
60167E921805J13904R7087P9812O1649M3973K8623J5729M356n416j2733j7770
$$ plain form
60156 6331019 6309599 6286190 6263794 6245680 6233765 6228880 6232242 6245958 6272358 6313275 6369560 6440835
60144 6440835 6526168 6625442 6739537 6868651 7010905 7162966 7321375 7482762 7643633 7800987
60134 7800987 7952685 8096226 8227401 8341180 8434089 8505244 8555178 8584252 8592082 8577951 8541872
60123 8541872 8485763 8413560 8329793 8238149 8141523 8042884 7945512 7852817 7768474 7696188 7638388
60112 7638388 7595459 7567071 7554040 7557967 7579273 7616655 7668427 7733301 7809696 7895380 7988085
60101 7988085 8085416 8183673 8277899 8364240 8441841 8511623 8573469 8625503 8666102 8695962 8717858
60090 8717858 8734773 8748609 8760719 8773458 8790876 8817694 8857752 8913559 8986845 9079008 9191321
60079 9191321 9325652 9485008 9672481 9889322 10134963 10409583 10715996 11058214 11438603
$$ packed form
60156F331019k1420k3409k2396j8114j1915m885L362J3716K6400M0917N6285P1275
60144F440835Q5333R9274J14095J29114J42254J52061J58409J61387J60871J57354
60134G800987J51698J43541J31175J13779R2909P1155M9934K9074P830j4131l6079
60123H541872n6109p2203q3767r1644r6626r8639r7372r2695q4343p2286n7800
60112G638388m2929k8388j3031L927K1306L7382N1772O4874P6395Q5684R2705
60101G988085R7331R8257R4226Q6341P7601O9782O1846N2034M0599K9860K1896
60090H717858J6915J3836J2110J2739J7418K6818M0058N5807P3286R2163J12313
60079I191321J34331J59356J87473K16841K45641K74620L06413L42218L80389
$$ plain form
60070 11438603 11857015 12311896 12800783 13319691 13863380 14426762 15005169 15592508 16179879
60061 16179879 16756928 17314261 17843803 18337149 18784951 19178507 19511312 19778466 19975203
60052 19975203 20096992 20141177 20107923 19999572 19820028 19575357 19274469 18928219 18547475 18142223
60042 18142223 17722162 17297215 16876880 16469299 16081225 15718466 15385787 15086490 14822645
60033 14822645 14595888 14407627 14258507 14148098 14075225 14037873 14032268 14052461 14091478 14142648
60023 14142648 14199353 14254145 14299582 14330479 14344569 14340626 14316830 14271531 14204542 14116451 14007097
60012 14007097 13875910 13723616 13552436 13364514 13161223 12944186 12715877 12478784 12234976
60003 12234976 11987168 11739351 11495594 11258814 11031389 10816376 10617126 10435976 10274111
$$ packed form
60070A1438603M18412M54881M88887N18908N43689N63382N78407N87339N87371
60061A6179879N77049N57333N29542M93346M47802L93556L32805K67154J96737
60052A9975203J21789M4185l3254j08351j79544k44671l00888l46250l80744m05252
60042A8142223m20061m24947m20335m07581l88074l62759l32679k99297k63845
60033A4822645k26757j88261j49120j10409p2873l7352n605K0193L9017N1170
60023A4142648N6705N4792M5437L0897J4090l943k3796m5299o6989q8091j09354
60012A4007097j31187j52294j71180j87922k03291k17037k28309k37093k43808
60003A2234976k47808k47817k43757k36780k27425k15013j99250j81150j61865
$$ plain form
59994 10274111 10132592 10012807 9916094 9843619 9796541 9775562 9780205 9809056 9860661 9933697 10026384
59983 10026384 10136289 10260531 10395184 10534272 10670377 10797140 10911009 11010135 11091824 11151685
59973 11151685 11185361 11190762 11168374 11119586 11045183 10945854 10823899 10683640 10529712 10365463
59963 10365463 10193521 10017497 9842237 9672404 9511393 9361496 9224395 9101437 8994142
59954 8994142 8904611 8834884 8785966 8758394 8753863 8775101 8823566 8898306 8997980 9123096 9274983
59943 9274983 9452883 9653095 9870639 10100500 10337334 10575474 10809888 11036281 11249738
59934 11249738 11444064 11613179 11752726 11859969 11932973 11970765 11973951 11944269 11883720 11794750
59924 11794750 11681015 11547111 11397532 11236537 11069020 10900717 10737297 10583714 10444213
$$ packed form
59994A0274111j41519j19785r6713p2475m7078k0979M643K8851N1605P3036R2687
59983A0026384J09905J24242J34653J39088J36105J26763J13869R9126Q1689N9861
59973A1151685L3676N401k2388m8788p4403r9329j21955j40259j53928j64249
59963A0365463j71942j76024j75260j69833j61011j49897j37101j22958j07295
59954H994142q9531o9727m8918k7572m531K1238M8465P4740R9674J25116J51887
59943I274983J77900K00212K17544K29861K36834K38140K34414K26393K13457
59934A1249738J94326J69115J39547J07243P3004L7792L186k9682o0549q8970
59924A1794750j13735j33904j49579j60995j67517j68303j63420j53583j39501
$$ plain form
59915 10444213 10322014 10218653 10134493 10070406 10028375 10010155 10016171 10046302 10100723 10178827 10277811
59904 10277811 10393503 10522469 10662361 10810439 10963084 11117108 11270585 11421956 11569040
59895 11569040 11709352 11840863 11962289 12073545 12176388 12273910 12368729 12462274 12556504 12655736
59885 12655736 12765731 12891030 13034023 13196878 13383857 13601321 13855507 14150289 14486864
59876 14486864 14865231 15285583 15747939 16250555 16788928 17355883 17941633 18533309 19115079
59867 19115079 19669373 20178267 20624352 20991807 21267988 21444428 21516774 21484821 21353258 21131732
59857 21131732 20833231 20471995 20062358 19617982 19150848 18671088 18188210 17711878 17250690
59848 17250690 16810559 16395113 16007488 15651198 15329849 15046943 14805655 14607888 14453724
$$ packed form
59915A0444213j22199j03361q4160o4087m2031j8220O016L0131N4421P8104R8984
59904A0277811J15692J28966J39892J48078J52645J54024J53477J51371J47084
59895A1569040J40312J31511J21426J11256J02843R7522R4819R3545R4230R9232
59885A2655736J09995J25299J42993J62855J86979K17464K54186K94782L36575
59876A4486864L78367M20352M62356N02616N38373N66955N85750N91676N81770
59867A9115079N54294N08894M46085L67455K76181J76440P2346l1953j31563k21526
59857B1131732k98501l61236m09637m44376m67134m79760m82878m76332m61188
59848A7250690m40131m15446l87625l56290l21349k82906k41288j97767j54164
$$ plain form
59839 14453724 14342695 14275226 14251829 14271035 14329143 14421672 14543547 14687612 14844393 15003916
59829 15003916 15156607 15291845 15397157 15460529 15473655 15432532 15335596 15182424 14974224 14714650
59819 14714650 14409575 14066099 13691745 13294333 12882157 12463482 12045026 11630771 11222795
59810 11222795 10823403 10436121 10064592 9711170 9376926 9062529 8768655 8495808 8244130
59801 8244130 8013323 7802657 7611201 7437961 7281352 7138604 7006369 6882290 6765619
59792 6765619 6656129 6553002 6455272 6362968 6277278 6199561 6130293 6068828 6013945 5964753 5921013
59781 5921013 5882410 5847515 5813759 5778276 5738466 5692224 5638665 5578912 5515407 5450090 5383788
59770 5383788 5317495 5253304 5193479 5139306 5091517 5051227 5019448 4995901 4979275 4968927 4965860
$$ packed form
59839A4453724j11029o7469k3397J9206N8108R2529J21875J44065J56781J59523
59829A5003916J52691J35238J05312O3372J3126m1123r6936j53172k08200k59574
59819A4714650l05075l43476l74354l97412m12176m18675m18456m14255m07976
59810A1222795l99392l87282l71529l53422l34244l14397k93874k72847k51678
59801H244130k30807k10666j91456j73240j56609j42748j32235j24079j16671
59792F765619j09490j03127r7730r2304q5690p7717o9268o1465n4883m9192m3740
59781E921013l8603l4895l3756l5483l9810m6242n3559n9753o3505o5317o6302
59770E383788o6293o4191n9825n4173m7789m0290l1779k3547j6626j0348l067
$$ plain form
59759 4965860 4971729 4986988 5010135 5038953 5072782 5113574 5164258 5225859 5296499 5373224 5454270
59748 5454270 5539299 5628006 5719018 5809926 5898021 5981113 6057822 6127030 6187514 6238967 6283411
59737 6283411 6324541 6365089 6405485 6445629 6487104 6532864 6585362 6645915 6715617 6796048 6889256
59726 6889256 6997732 7124294 7271424 7440899 7634511 7854888 8105109 8387894 8705709
59717 8705709 9061095 9455788 9889375 10358977 10859313 11381420 11910794 12427522 12908910
59708 12908910 13332443 13677856 13929074 14076665 14119882 14067313 13935582 13745788 13518463 13269834
59698 13269834 13011736 12753740 12504039 12268456 12050003 11850263 11670832 11513271 11378519
59689 11378519 11267077 11179631 11117288 11081529 11074135 11096791 11150579 11236066 11353956 11505340 11691377
$$ packed form
59759D965860N869J5259K3147K8818L3829M0792N0684O1601P0640P6725Q1046
59748E454270Q5029Q8707R1012R0908Q8095Q3092P6709O9208O0484N1453M4444
59737F283411M1130M0548M0396M0144M1475M5760N2498O0553O9702Q0431R3208
59726F889256J08476J26562J47130J69475J93612K20377K50221K82785L17815
59717H705709L55386L94693M33587M69602N00336N22107N29374N16728M81388
59708A2908910M23533L45413K51218J47591M3217n2569j31731j89794k27325k48629
59698A3269834k58098k57996k49701k35583k18453j99740j79431j57561j34752
59689A1378519j11442q7446o2343l5759p394K2656N3788Q5487J17890J51384J86037
$$ plain form
59678 11691377 11913216 12172334 12470432 12808777 13188023 13608875 14072712 14581653 15138482
59669 15138482 15746398 16408144 17125216 17898345 18728470 19616079 20559108 21552355 22589481
59660 22589481 23664610 24770891 25897992 27032382 28160647 29272527 30361561 31424446
59652 31424446 32460962 33474436 34471710 35462054 36455215 37459365 38479916 39519585
59644 39519585 40578700 41654324 42738415 43817030 44871975 45883552 46832035 47697648
59636 47697648 48461402 49108184 49630060 50026688 50303072 50467913 50534260 50520176 50447077 50336801
59626 50336801 50210097 50086648 49984740 49920346 49907281 49958658 50087715 50306913 50626731 51055570
59616 51055570 51600216 52265541 53053310 53960900 54980280 56097291 57291020 58532999 59786386
$$ packed form
59678A1691377K21839K59118K98098L38345L79246M20852M63837N08941N56829
59669A5138482O07916O61746P17072P73129Q30125Q87609R43029R93247J037126
59660B2589481J075129J106281J127101J134390J128265J111880J089034J062885
59652C1424446J036516J013474R97274R90344R93161J004150J020551J039669
59644C9519585J059115J075624J084091J078615J054945J011577R48483Q65613
59636D7697648P63754O46782N21876L96628K76384J64841O6347j4084p3099j10276
59626E0336801j26704j23449j01908o4394j3065N1377J29057K19198L19818M28839
59616E1055570N44646O65325P87769R07590J019380J117011J193729J241979J253387
$$ plain form
59607 59786386 61006233 62141733 63139642 63947672 64518333 64814356 64814258 64514726 63928757 63082202
59597 63082202 62011024 60758560 59371298 57893857 56365160 54816584 53271672 51746852
59589 51746852 50252200 48791224 47360034 45947736 44538674 43115261 41660819 40163562
59581 40163562 38621287 37043149 35446224 33849777 32271867 30728834 29234868 27800694
59573 27800694 26433197 25136556 23913077 22762769 21683133 20670241 19720208 18829947
59565 18829947 17997401 17221524 16501528 15835669 15220920 14653836 14131398 13651016 13210377
59556 13210377 12807544 12440477 12105913 11799174 11515769 11252946 11009162 10782074 10567490
59547 10567490 10360214 10155731 9951502 9747393 9544915 9345425 9148760 8953836 8760679
$$ packed form
59607E9786386J219847J135500R97909Q08030N70661K96023r8k99532n85969q46555
59597F3082202j071178j252464j387262j477441j528697j548576j544912j524820
59589E1746852j494652j460976j431190j412298j409062j423413j454442j497257
59581D0163562j542275j578138j596925j596447j577910j543033j493966j434174
59573B7800694j367497j296641j223479j150308j079636j012892r50033q90261
59565A8829947q32546p75877p19996o65859o14749n67084n22438m80382m40639
59556A3210377m02833l67067l34564l06739k83405k62823k43784k27088k14584
59547A0567490k07276k04483k04229k04109k02478j99490j96665j94924j93157
$$ plain form
59538 8760679 8571505 8389512 8216663 8052794 7896831 7748712 7609906 7482009 7365107
59529 7365107 7258089 7160564 7073800 6999348 6937406 6887335 6849265 6823881 6810494 6806551 6809734
59518 6809734 6819661 6836781 6860421 6889084 6922271 6960705 7004620 7052918 7104500 7159756 7220241
59507 7220241 7287447 7362383 7445932 7539098 7643099 7759659 7890928 8038657 8203469 8385324
59497 8385324 8584593 8802376 9039921 9298223 9578289 9881438 10209059 10562027 10940204
59488 10940204 11342257 11765979 12208984 12669016 13143362 13628026 14117852 14607647 15092961
59479 15092961 15569733 16033580 16479918 16904914 17306107 17681911 18030561 18349788 18637826
59470 18637826 18894993 19124380 19330985 19520116 19696443 19864142 20027367 20190156 20355821
$$ packed form
59538H760679j89174j81993j72849j63869j55963j48119j38806j27897j16902
59529G365107j07018r7525q6764p4452o1942n0071l8070k5384j3387l943L183
59518F809734R927J7120K3640K8663L3187L8434M3915M8298N1582N5256O0485
59507G220241O7206P4936Q3549R3166J04001J16560J31269J47729J64812J81855
59497H385324J99269K17783K37545K58302K80066L03149L27621L52968L78177
59488A0940204M02053M23722M43005M60032M74346M84664M89826M89795M85314
59479A5092961M76772M63847M46338M24996M01193L75804L48650L19227K88038
59470A8637826K57167K29387K06605J89131J76327J67699J63225J62789J65665
$$ plain form
59461 20355821 20526544 20703351 20885755 21070604 21251065 21417143 21557584 21661365 21717805
59452 21717805 21716556 21648864 21509302 21296075 21009963 20653736 20232602 19754336 19228305 18664507
59442 18664507 18073461 17466123 16853023 16243293 15644503 15062809 14502770 13967323 13458487
59433 13458487 12978014 12527162 12106329 11715696 11356242 11029560 10736476 10476221 10247214
59424 10247214 10048521 9880388 9743389 9637392 9561816 9517007 9504647 9525968 9579725 9662964
59414 9662964 9773993 9913713 10083620 10283492 10511720 10766964 11048277 11353804 11680012
59405 11680012 12021579 12370975 12718540 13054237 13369549 13657029 13908239 14113243 14262444
59396 14262444 14348666 14368192 14321311 14212108 14046587 13830331 13568266 13266343 12932190 12573803
$$ packed form
59461B0355821J70723J76807J82404J84849J80461J66078J40441J03781N6440
59452B1717805j249o7692j39562k13227k86112l56227m21134m78266n26031n63798
59442A8664507n91046o07338o13100o09730n98790n81694n60039n35447n08836
59433A3458487m80473m50852m20833l90633l59454l26682k93084k60255k29007
59424A0247214j98693j68133j36999j05997p5576m4809j2360K1321N3757Q3239
59414I662964J11029J39720J69907J99872K28228K55244K81313L05527L26208
59405A1680012L41567L49396L47565L35697L15312K87480K51210K05004J49201
59396A4262444Q6222J9526m6881j09203j65521k16256k62065l01923l34153l58387
$$ plain form
59386 12573803 12198473 11813021 11423582 11034292 10647162 10264211 9889157 9526310 9178394
59377 9178394 8846258 8530253 8231027 7949180 7684930 7438267 7209115 6997449 6803419
59368 6803419 6627050 6467709 6324240 6195837 6082343 5983564 5898948 5828152 5771150 5727257
59358 5727257 5694785 5672205 5659015 5654935 5659219 5671750 5694056 5727876 5772802 5826252 5885456 5948423
59346 5948423 6013386 6079021 6145905 6216829 6295090 6383032 6482465 6595488 6724097 6869358 7031539
59335 7031539 7210644 7406300 7617532 7843555 8085136 8345198 8628316 8939820 9284909
59326 9284909 9667808 10091469 10558214 11070549 11630968 12240986 12900905 13610695 14370323
59317 14370323 15178243 16029345 16914646 17822883 18741846 19658391 20558611 21429426 22260410
$$ packed form
59386A2573803l75330l85452l89439l89290l87130l82951l75054l62847l47916
59377I178394l32136l16005k99226k81847k64250k46663k29152k11666j94030
59368F803419j76369j59341j43469j28403j13494r8779q4616p0796n7002m3893
59358E727257l2472k2580j3190m080M284J2531K2306L3820M4926N3450N9204O2967
59346E948423O4963O5635O6884P0924P8261Q7942R9433J13023J28609J45261J62181
59335G031539J79105J95656K11232K26023K41581K60062K83118L11504L45089
59326I284909L82899M23661M66745N12335N60419O10018O59919P09790P59628
59317A4370323Q07920Q51102Q85301R08237R18963R16545R00220Q70815Q30984
$$ plain form
59308 22260410 23044179 23775713 24452081 25072352 25636647 26145026 26597518 26994572 27335956
59299 27335956 27618823 27837937 27988448 28067861 28075044 28008441 27866446 27649510 27361659 27010548
59289 27010548 26606371 26159647 25678709 25168900 24633996 24077394 23501227 22905316 22288508
59280 22288508 21651140 20995589 20324960 19642666 18953491 18263994 17581194 16911075 16258242
59271 16258242 15626275 15018118 14436594 13884630 13364519 12876879 12420909 11995805 11601600
59262 11601600 11238663 10906982 10606018 10334706 10091434 9874564 9683236 9517264 9376070
59253 9376070 9258146 9161858 9086478 9032223 8999441 8987744 8995530 9020176 9058914 9109583 9170335
59242 9170335 9238803 9312051 9387379 9462706 9536091 9605392 9668689 9724831 9773457 9814683 9848730
$$ packed form
59308B2260410P83769P31534O76368O20271N64295N08379M52492L97054L41384
59299B7335956K82867K19114J50511P9413P183o6603j41995k16936k87851l51111
59289B7010548m04177m46724m80938n09809n34904n56602n76167n95911o16808
59280B2288508o37368o55551o70629o82294o89175o89497o82800o70119o52833
59271A6258242o31967o08157n81524n51964n20111m87640m55970m25104l94205
59262A1601600l62937l31681l00964k71312k43272k16870j91328j65972j41194
59253I376070j17924r6288p5380n4255l2782j1697P786K4646L8738N0669O0752
59242I170335O8468P3248P5328P5327P3385O9301O3297N6142M8626M1226L4047
$$ plain form
59231 9848730 9875662 9895634 9909893 9921405 9933891 9950127 9971666 10000234 10038660 10090094 10156703
59220 10156703 10239326 10337966 10452402 10582727 10729475 10892635 11070224 11258228 11452268 11648919
59210 11648919 11845061 12036315 12216496 12378441 12515369 12622197 12696333 12737383 12746240 12725017
59200 12725017 12677987 12611600 12532627 12446246 12355977 12264595 12174206 12085848 12000151 11918355 11841782
59189 11841782 11770270 11702073 11635620 11570618 11507175 11444865 11383456 11324011 11268383 11217927 11173549
59178 11173549 11136968 11111044 11098674 11102086 11123612 11166573 11234826 11331645 11459537 11621081 11819564
59167 11819564 12058681 12341457 12668824 13038700 13446608 13887525 14356625 14847404 15349161
59158 15349161 15846911 16323690 16762380 17146178 17459630 17690678 17831153 17874863 17816684 17655215
$$ packed form
59231I848730K6932J9972J4259J1512J2486J6236K1539K8568L8426N1434O6609
59220A0156703Q2623R8640J14436J30325J46748J63160J77589J88004J94040J96651
59210A1648919J96142J91254J80181J61945J36928J06828P4136M1050Q857k1223
59200A2725017m7030o6387p8973q6381r0269r1382r0389q8358q5697q1796p6573
59189A1841782p1512o8197o6453o5002o3443o2310o1409n9445n5628n0456m4378
59178A1173549l6581k5924j2370L412K1526M2961O8253R6819J27892J61544J98483
59167A1819564K39117K82776L27367L69876M07908M40917M69100M90779N01757
59158A5349161M97750M76779M38690L83798L13452K31048J40475M3710n8179j61469
$$ plain form
59148 17655215 17395934 17050308 16631796 16153534 15628998 15072342 14496676 13912631 13329009
59139 13329009 12753583 12192253 11648129 11122601 10617289 10134467 9675995 9242683 8834611
59130 8834611 8451446 8092429 7756602 7443281 7152016 6882135 6632672 6402815 6192174
59121 6192174 6000501 5827230 5671343 5531588 5406773 5295894 5198082 5112646 5039234 4977716
59111 4977716 4927647 4888094 4858351 4838536 4828848 4828414 4835725 4850298 4872867 4903597 4941308 4985517
59099 4985517 5038317 5102639 5178690 5263486 5354281 5451282 5556366 5670171 5791579 5919474
59089 5919474 6053556 6193146 6336325 6480987 6626052 6770605 6912042 7046254 7170178
59080 7170178 7283417 7386610 7478748 7557198 7620423 7669660 7707496 7735617 7754780 7766487 7773606
$$ packed form
59148A7655215k59281l45626m18512m78262n24536n56656n75666n84045n83622
59139A3329009n75426n61330n44124n25528n05312m82822m58472m33312m08072
59130H834611l83165l59017l35827l13321k91265k69881k49463k29857k10641
59121F192174j91673j73271j55887j39755j24815j10879r7812q5436p3412o1518
59111D977716n0069l9553k9743j9815r688m34P311J4573K2569L0730L7711M4209
59099D985517N2800O4322P6051Q4796R0795R7001J05084J13805J21408J27895
59089E919474J34082J39590J43179J44662J45065J44553J41437J34212J23924
59080G170178J13239J03193R2138P8450O3225M9237L7836K8121J9163J1707P119
$$ plain form
59069 7773606 7779150 7785141 7792992 7804504 7821971 7847565 7883160 7930864 7993244 8072668 8170603 8287875
59057 8287875 8425556 8585118 8767520 8972492 9199084 9446707 9715300 10004656 10314014
59048 10314014 10642109 10986841 11344440 11709190 12074092 12431556 12773367 13090605 13374344
59039 13374344 13616737 13811512 13953862 14040481 14070228 14044894 13969158 13849257 13691102 13499180
59029 13499180 13276810 13026789 12751497 12453090 12134442 11799703 11453058 11097079 10733348
59020 10733348 10364860 9996438 9632003 9272471 8917408 8568055 8227445 7897994 7580563
59011 7580563 7275966 6985860 6711270 6451203 6203770 5968260 5745329 5535441 5338065
59002 5338065 5152571 4979051 4817691 4667716 4527678 4396899 4275997 4165589 4064794
$$ packed form
59069G773606N544N991P851J1512J7467K5594L5595M7704O2380P9424R7935J17272
59057H287875J37681J59562J82402K04972K26592K47623K68593K89356L09358
59048A0314014L28095L44732L57599L64750L64902L57464L41811L17238K83739
59039A3374344K42393J94775J42350Q6619K9747k5334p5736j19901j58155j91922
59029A3499180k22370k50021k75292k98407l18648l34739l46645l55979l63731
59020A0733348l68488l68422l64435l59532l55063l49353l40610l29451l17431
59011G580563l04597k90106k74590k60067k47433k35510k22931k09888j97376
59002E338065j85494j73520j61360j49975j40038j30779j20902j10408j00795
$$ plain form
58993 4064794 3971554 3884305 3802618 3726123 3653683 3584222 3517777 3454828 3394898 3336813 3280462
58982 3280462 3227429 3179539 3137466 3101148 3070749 3046272 3026554 3009553 2993898 2979735 2967946
58971 2967946 2958949 2952419 2947846 2945165 2945005 2948323 2955533 2965954 2978395 2992241 3007428 3023164 3037373
58958 3037373 3048094 3055121 3059627 3062410 3063333 3062554 3061447 3061827 3064775 3070508 3078866 3089399 3101447 3114646
58944 3114646 3129114 3144705 3160396 3174789 3186844 3195667 3200239 3200226 3196688 3191076 3183730 3174304 3163418
58931 3163418 3152590 3142410 3132195 3121968 3113578 3109034 3108549 3110995 3115518 3121993 3130629 3141983 3156704
58918 3156704 3174364 3193274 3212456 3233168 3257372 3285353 3316265 3350420 3389169 3432484 3478470
58907 3478470 3525775 3574991 3627117 3682204 3740330 3802408 3868811 3938287 4009551 4083116 4160205
$$ packed form
58993D064794r3240q7249q1687p6495p2440o9461o6445o2949n9930n8085n6351
58982C280462n3033m7890m2073l6318l0399k4477j9718j7001j5655j4163j1789
58971B967946q997o530m573k681j60L318P210J0421J2441J3846J5187J5736J4209
58958C037373J0721P027M506K783R23p79j107L80K948N733Q358J0533J2048J3199
58944C114646J4468J5591J5691J4393J2055Q823M572j3l538n612p346r426j0886
58931C163418j0828j0180j0215j0227q390m544m85K446M523O475Q636J1354J4721
58918C156704J7660J8910J9182K0712K4204K7981L0912L4155L8749M3315M5986
58907C478470M7305M9216N2126N5087N8126O2078O6403O9476P1264P3565P7089
$$ plain form
58896 4160205 4240700 4323797 4410134 4501504 4598428 4699727 4804785 4914869 5031715 5156107
58886 5156107 5288373 5429040 5578291 5735938 5902833 6081328 6273327 6478689 6696746
58877 6696746 6928778 7177742 7445913 7734087 8042886 8373478 8726894 9103961 9506420
58868 9506420 9937176 10399058 10894145 11424691 11993735 12604133 13257766 13956583 14703891
58859 14703891 15503642 16358277 17267638 18229687 19241708 20300508 21401298 22535886 23691721
58850 23691721 24852782 26001053 27116238 28174177 29147345 30008723 30735551 31309599 31715867
58841 31715867 31943713 31990152 31861212 31569634 31131523 30564647 29888060 29121641 28285140
58832 28285140 27397021 26473341 25527414 24570652 23613495 22665098 21732483 20820953 19935349
$$ packed form
58896D160205Q0495Q3097Q6337R1370R6924J01299J05058J10084J16846J24392
58886E156107J32266J40667J49251J57647J66895J78495J91999K05362K18057
58877F696746K32032K48964K68171K88174L08799L30592L53416L77067M02459
58868I506420M30756M61882M95087N30546N69044O10398O53633O98817P47308
58859A4703891P99751Q54635R09361R62049J012021J058800J100790J134588J155835
58850B3691721J161061J148271J115185J057939R73168Q61378P26828N74048M06268
58841C1715867K27846M6439j28940k91578m38111n66876o76587p66419q36501
58832B8285140q88119r23680r45927r56762r57157r48397r32615r11530q85604
$$ plain form
58823 19935349 19080126 18258111 17470138 16716441 15997853 15315284 14668639 14056828 13478588
58814 13478588 12932987 12419358 11937030 11484904 11061351 10664885 10294895 9951174 9632661
58805 9632661 9337231 9062857 8808308 8572518 8354088 8151902 7965585 7794777 7638400
58796 7638400 7495304 7365424 7249785 7149457 7064750 6995095 6939294 6896051 6864646 6845157
58786 6845157 6838183 6844727 6866178 6903490 6955936 7021397 7098591 7188767 7294735 7418539 7560387
58775 7560387 7719324 7894273 8084858 8292095 8518297 8765770 9035460 9327266 9641562
58766 9641562 9979995 10344838 10737948 11160447 11613278 12098246 12618885 13180200 13787079
58757 13787079 14442558 15147495 15901754 16705743 17560917 18468666 19428204 20435217 21482371
$$ packed form
58823A9935349q55223q22015p87973p53697p18588o82569o46645o11811n78240
58814A3478588n45601n13629m82328m52126m23553l96466l69990l43721l18513
58805I632661k95430k74374k54549k35790k18430k02186j86317j70808j56377
58796G638400j43096j29880j15639j00328q4707o9655n5801m3243l1405j9489
58786F845157o974O544K1451L7312N2446O5461P7194R0176J05968J23804J41848
58775G560387J58937J74949J90585K07237K26202K47473K69690K91806L14296
58766I641562L38433L64843L93110M22499M52831M84968N20639N61315O06879
58757A3787079O55479P04937P54259Q03989Q55174R07749R59538J007013J047154
$$ plain form
58748 21482371 22560451 23657960 24759298 25844023 26888369 27867238 28755182 29527341
58740 29527341 30161455 30639832 30949915 31084334 31041817 30828141 30455475 29940477 29302677
58731 29302677 28563253 27743316 26862067 25936015 24979446 24005112 23024537 22047898 21083367
58722 21083367 20136522 19210920 18309849 17437327 16597200 15791722 15021471 14286220 13585447
58713 13585447 12918584 12285542 11686776 11122155 10589906 10087236 9611977 9163256 8740801
58704 8740801 8344069 7971947 7623021 7296320 6991872 6709937 6449358 6207306 5981100
58695 5981100 5769710 5573102 5391065 5223293 5069569 4928721 4798219 4676274 4563903
58686 4563903 4463557 4375838 4298672 4229284 4165596 4106044 4049809 3997539 3950244 3906829 3863780
$$ packed form
58748B1482371J078080J097509J101338J084725J044346R78869Q87944P72159
58740B9527341O34114M78377L10083J34419m2517k13676l72666n14998o37800
58731B9302677p39424q19937q81249r26052r56569r74334r80575r76639r64531
58722B1083367r46845r25602r01071q72522q40127q05478p70251p35251p00773
58713A3585447o66863o33042n98766n64621n32249n02670m75259m48721m22455
58704H740801l96732l72122l48926l26701l04448k81935k60579k42052k26206
58695E981100k11390j96608j82037j67772j53724j40848j30502j21945j12371
58686D563903j00346q7719p7166o9388o3688n9552n6235n2270m7295m3415m3049
$$ plain form
58675 3863780 3817798 3767867 3714597 3658905 3601958 3545130 3488905 3432481 3375173 3317589 3260767
58664 3260767 3204768 3148839 3092501 3035777 2978709 2921294 2863784 2806660 2750491 2695960 2643556
58653 2643556 2592998 2543394 2494166 2445377 2397045 2348980 2301803 2257343 2217076 2180357 2144916
58642 2144916 2109168 2073619 2040026 2009549 1981856 1955782 1930615 1906527 1883839 1862344 1841728
58631 1841728 1822210 1804122 1787210 1771255 1757317 1747238 1741442 1737997 1734318 1729320 1723598 1718107
58619 1718107 1713221 1708643 1703746 1698237 1692755 1688539 1686273 1685605 1685940 1687229 1689766 1693668 1698871 1705196
58605 1705196 1712089 1718785 1725049 1731421 1738330 1745245 1750980 1754698 1756565 1757737 1759694 1763027 1766714 1769145
58591 1769145 1770039 1770845 1773190 1777690 1784634 1794926 1809598 1828792 1851842 1878197 1907875 1941142 1978081
$$ packed form
58675C863780m5982m9931n3270n5692n6947n6828n6225n6424n7308n7584n6822
58664C260767n5999n5929n6338n6724n7068n7415n7510n7124n6169n4531n2404
58653B643556n0558m9604m9228m8789m8332m8065m7177m4460m0267l6719l5441
58642B144916l5748l5549l3593l0477k7693k6074k5167k4088k2688k1495k0616
58631A841728j9518j8088j6912j5955j3938j0079n796l445l679m998n722n491
58619A718107m886m578m897n509n482m216k266o68L35J289K537L902N203O325
58605A705196O893O696O264O372O909O915N735L718J867J172J957L333L687K431
58591A769145Q94Q06K345M500O944J0292J4672J9194K3050K6355K9678L3267L6939
$$ plain form
58578 1978081 2018301 2061113 2106435 2155500 2209933 2269963 2334458 2403134 2477681 2559904 2649582
58567 2649582 2745417 2847700 2958885 3081616 3217327 3366987 3532087 3714188 3913980 4131521
58557 4131521 4367407 4623145 4899937 5196976 5511008 5837658 6172943 6513031 6852421
58548 6852421 7182775 7493833 7775292 8017795 8212891 8353243 8433775 8453164 8414474 8324195
58538 8324195 8190165 8019862 7820204 7598177 7360794 7114270 6863620 6612940 6365426
58529 6365426 6122897 5885934 5654969 5431149 5216091 5011239 4817640 4635968 4466574
58520 4466574 4309801 4166284 4036515 3920068 3815772 3722694 3640371 3567853 3503304 3445092
58510 3445092 3392918 3347428 3308942 3276791 3249542 3225558 3203540 3182692 3162088 3139843 3113422
$$ packed form
58578A978081M0220M2812M5322M9065N4433O0030O4495O8676P4547Q2223Q9678
58567B649582R5835J02283J11185J22731J35711J49660J65100J82101J99792K17541
58557D131521K35886K55738K76792K97039L14032L26650L35285L40088L39390
58548F852421L30354L11058K81459K42503J95096J40352Q0532J9389l8690r0279
58538H324195j34030j70303j99658k22027k37383k46524k50650k50680k47514
58529F365426k42529k36963k30965k23820k15058k04852j93599j81672j69394
58520D466574j56773j43517j29769j16447j04296r3078q2323p2518o4549n8212
58510C445092n2174m5490l8486l2151k7249k3984k2018k0848k0604k2245k6421
$$ plain form
58499 3113422 3080972 3042041 2996952 2946056 2889871 2829457 2766298 2702029 2638380 2576931 2518629
58488 2518629 2463703 2412021 2363219 2316723 2272223 2230097 2190753 2153670 2117721 2082255 2047066
58477 2047066 2011547 1975099 1938530 1903837 1872194 1843090 1815599 1789208 1763032 1735790 1707575
58466 1707575 1680554 1656726 1635631 1615111 1593591 1570689 1546379 1520845 1494978 1470146 1447451
58455 1447451 1427449 1410106 1394619 1380027 1366561 1355641 1347946 1342319 1337374 1333348 1331345 1331454 1332818
58442 1332818 1335167 1339131 1345105 1352749 1361736 1372322 1385015 1399950 1416576 1433975 1451965 1471804
58430 1471804 1494949 1520953 1547530 1572968 1597283 1620522 1641399 1658574 1672074 1682341 1689042
58419 1689042 1692075 1692520 1691012 1686069 1675847 1661100 1644643 1628132 1610880 1591705 1570452 1547704
$$ packed form
58499C113422l2450l8931m5089n0896n6185o0414o3159o4269o3649o1449n8302
58488B518629n4926n1682m8802m6496m4500m2126l9344l7083l5949l5466l5189
58477B047066l5519l6448l6569l4693l1643k9104k7491k6391k6176k7242k8215
58466A707575k7021k3828k1095k0520k1520k2902k4310k5534k5867k4832k2695
58455A447451k0002j7343j5487j4592j3466j0920p695n627m945m026k003J09J364
58442A332818K349L964N974P644Q987J0586J2693J4935J6626J7399J7990J9839
58430A471804K3145K6004K6577K5438K4315K3239K0877J7175J3500J0267O701
58419A689042L033M45j508m943j0222j4747j6457j6511j7252j9175k1253k2748
$$ plain form
58407 1547704 1524330 1501397 1479379 1457466 1434720 1411809 1390530 1371779 1355222 1340772 1328924
58396 1328924 1319408 1310802 1302018 1293395 1286006 1280580 1277197 1275375 1274363 1273927 1274755 1277590 1282253 1288217
58382 1288217 1295718 1305443 1317492 1331529 1347616 1365950 1386238 1408280 1432501 1458526 1483656 1504367
58370 1504367 1519408 1530202 1538367 1544312 1548154 1550284 1550563 1548400 1544278 1540121 1537513 1536412 1536006 1535948
58356 1535948 1536171 1536256 1535644 1534309 1533103 1533682 1537733 1545521 1555318 1564987 1574139 1584239 1596966 1613027
58342 1613027 1631799 1651019 1667252 1677985 1683210 1684093 1680721 1672390 1659583 1643933 1626405 1607265
58330 1607265 1587916 1570879 1557315 1545863 1534533 1522773 1511341 1501327 1493755 1489201 1487263 1486930
58318 1486930 1487480 1488362 1488614 1487632 1486488 1487256 1490886 1496726 1503931 1512138 1520926 1529994 1539906 1551412 1564105
$$ packed form
58407A547704k3374k2933k2018k1913k2746k2911k1279j8751j6557j4450j1848
58396A328924r516q606q784q623p389n426l383j822j012m36Q28K835M663N964
58382A288217P501R725J2049J4037J6087J8334K0288K2042K4221K6025K5130K0711
58370A504367J5041J0794Q165N945L842K130K79k163m122m157k608j101m06n8
58356A535948K23Q5o12j335j206N79M051P788R797R669R152J0100J2727J6061
58342A613027J8772J9220J6233J0733N225Q83l372q331j2807j5650j7528j9140
58330A607265j9349j7037j3564j1452j1330j1760j1432j0014p572m554j938l33
58318A486930N50Q82K52r82j144P68L630N840P205Q207Q788R068R912J1506J2693
$$ plain form
58303 1564105 1577113 1590896 1606644 1623913 1640769 1656592 1673000 1691484 1711789 1733163 1755599
58292 1755599 1779118 1803269 1827903 1853064 1877478 1898630 1915151 1927893 1937975 1945082 1948495 1948631
58280 1948631 1946739 1944024 1941715 1940988 1942089 1944307 1947167 1950853 1955360 1960430 1966616 1975131 1986226 1998853
58266 1998853 2012372 2027472 2045098 2065598 2089169 2115878 2144886 2174855 2205443 2237383 2270984
58255 2270984 2305702 2341083 2376844 2412221 2446757 2481465 2517322 2552726 2584506 2611540 2635361
58244 2635361 2657267 2677256 2696076 2715591 2736266 2756679 2776448 2797378 2820719 2845534 2870938
58233 2870938 2897962 2927954 2960807 2995769 3032493 3070720 3110653 3153968 3202327 3254531 3307558
58222 3307558 3360840 3416848 3477001 3540306 3607012 3680077 3761168 3848180 3938695 4033125 4132352
$$ packed form
58303A564105J3008J3783J5748J7269J6856J5823J6408J8484K0305K1374K2436
58292A755599K3519K4151K4634K5161K4414K1152J6521J2742J0082P107L413J36
58280A948631j892k715k309p27J101K218K860L686M507N070O186Q515J1095J2627
58266A998853J3519J5100J7626K0500K3571K6709K9008K9969L0588L1940L3601
58255B270984L4718L5381L5761L5377L4536L4708L5857L5404L1780K7034K3821
58244B635361K1906J9989J8820J9515K0675K0413J9769K0930K3341K4815K5404
58233B870938K7024K9992L2853L4962L6724L8227L9933M3315M8359N2204N3027
58222C307558N3282N6008O0153O3305O6706P3065Q1091Q7012R0515R4430R9227
$$ plain form
58211 4132352 4234738 4337619 4439642 4539844 4636765 4730394 4822962 4916188 5010037 5105476
58201 5105476 5205507 5311581 5421984 5535952 5656637 5787669 5929517 6081564 6244984
58192 6244984 6420889 6608115 6805485 7014052 7234831 7466793 7709315 7964007 8232100
58183 8232100 8513142 8808667 9123858 9462820 9825235 10209982 10618079 11048875 11497483
58174 11497483 11960153 12439312 12940058 13465487 14019396 14609878 15245891 15933197 16677096
58165 16677096 17484931 18361546 19306373 20319846 21409058 22582901 23846292 25204085
58157 25204085 26665596 28239461 29928965 31738881 33682629 35777472 38039141 40488703
58149 40488703 43158859 46085445 49298642 52831237 56729428 61046470 65832308 71139270
$$ packed form
58211D132352J02386J02881J02023J00202R6921R3629R2568R3226R3849R5439
58201E105476J00031J06074J10403J13968J20685J31032J41848J52047J63420
58192F244984J75905J87226J97370K08567K20779K31962K42522K54692K68093
58183H232100K81042K95525L15191L38962L62415L84747M08097M30796M48608
58174A1497483M62670M79159N00746N25429N53909N90482O36013O87306P43899
58165A6677096Q07835Q76615R44827J013473J089212J173843J263391J357793
58157B5204085J461511J573865J689504J809916J943748K094843K261669K449562
58149D0488703K670156K926586L213197L532595L898191M317042M785838N306962
$$ plain form
58141 71139270 77031312 83580732 90873281 99041574 108296231 118918665 131235736 145603524
58133 145603524 162365523 181761479 203876473 228728840 256399085 286954066 320078602
58126 320078602 354627315 388401599 418314826 440968861 453557676 454791503 445333860
58119 445333860 427437865 404030863 377856547 351062117 325149155 301036065 279137362
58112 279137362 259487109 241882718 225988161 211403618 197747292 184738249 172232321
58105 172232321 160208501 148738986 137950545 127972476 118899162 110794777 103712147
58098 103712147 97681495 92685047 88668025 85581522 83397230 82067028 81465255 81355218
58090 81355218 81387516 81136181 80190438 78283133 75380215 71665851 67439305 63001322 58590492
$$ packed form
58141G1139270N892042O549420P292549Q168293R254657J0622434J2317071J4367788
58133A45603524J6761999J9395956K2114994K4852367K7670245L0554981L3124536
58126C20078602L4548713L3774284K9913227K2654035J2588815J233827r457643
58119D45333860j7895995k3407002k6174316k6794430k5912962k4113090k1898703
58112B79137362j9650253j7604391j5894557j4584543j3656326j3009043j2505928
58105A72232321j2023820j1469515j0788441r978069r073314q104385p082630
58098A03712147o030652m996448m017022l086503k184292j330202o01773j10037
58090H1355218L2298k51335r45743j907305k902918l714364m226546m437983m410830
$$ plain form
58081 58590492 54372351 50450860 46878973 43665331 40783598 38186272 35817872 33623775
58073 33623775 31557386 29587681 27702573 25903790 24197988 22591763 21090723 19698069
58065 19698069 18412783 17230382 16144926 15149117 14234205 13392348 12618540 11908549 11256288
58056 11256288 10655268 10101246 9590839 9118745 8679080 8268585 7885605 7526523 7186141
58047 7186141 6861441 6552237 6258136 5977473 5709453 5454853 5214085 4986547 4772280
58038 4772280 4572380 4387272 4216064 4057770 3911638 3776146 3649190 3529544 3416842
58029 3416842 3309998 3206886 3105769 3006229 2908932 2815350 2727080 2644227 2564938 2487636 2413007
58018 2413007 2342502 2275823 2211468 2148931 2088604 2030268 1973740 1920409 1871909 1827529 1785017
$$ packed form
58081E8590492m218141l921491l571887l213642k881733k597326k368400k194097
58073C3623775k066389j969705j885108j798783j705802j606225j501040j392654
58065A9698069j285286j182401j085456r95809r14912q41857p73808p09991o52261
58056A1256288o01020n54022n10407m72094m39665m10495l82980l59082l40382
58047G186141l24700l09204k94101k80663k68020k54600k40768k27538k14267
58038D772280j99900j85108j71208j58294j46132j35492j26956j19646j12702
58029C416842j06844j03112j01117r9540r7297r3582q8270q2853p9289p7302p4629
58018B413007p0505o6679o4355o2537o0327n8336n6528n3331m8500m4380m2512
$$ plain form
58007 1785017 1743891 1705938 1672447 1642911 1616420 1592274 1569109 1545552 1522196 1500978 1482085
57996 1482085 1463268 1442769 1421256 1400238 1380278 1361469 1344124 1328073 1312505 1297219 1282984
57985 1282984 1270249 1258645 1248146 1239248 1231487 1223286 1214124 1205551 1199184 1194737 1190779 1186379 1181203
57972 1181203 1175152 1168896 1163854 1160668 1158368 1155908 1153776 1153169 1154211 1155926 1157496 1158721 1159567 1160129 1160917
57957 1160917 1162634 1165614 1169603 1173763 1176791 1177636 1176318 1173601 1169869 1165188 1160501 1157476 1156470 1155809
57943 1155809 1154064 1152147 1151897 1153243 1154217 1153593 1152090 1150693 1148916 1145308 1138915 1129680 1118090 1105079
57929 1105079 1091976 1079850 1068961 1059321 1051581 1046680 1044578 1043993 1043654 1043069 1041649 1038055 1031678 1024428
57915 1024428 1019586 1018567 1019838 1021297 1022354 1023125 1023134 1022203 1021592 1022561 1024220 1024293 1021854 1017841 1013045 1007252
$$ packed form
58007A785017m1126l7953l3491k9536k6491k4146k3165k3557k3356k1218j8893
57996A482085j8817k0499k1513k1018j9960j8809j7345j6051j5568j5286j4235
57985A282984j2735j1604j0499q898p761q201r162q573o367m447l958m400n176
57972A181203o051o256n042l186k300k460k132o07J042J715J570J225Q46N62P88
57957A160917J717K980L989M160L028Q45j318k717l732m681m687l025j006o61
57943A155809j745j917k50J346R74o24j503j397j777l608o393r235j1590j3011
57929A105079j3103j2126j0889r640p740m901k102n85l39n85j420l594o377p250
57915A024428m842j019J271J459J057P71Rr31o11R69J659P3k439m013m796n793
$$ plain form
57899 1007252 1000703 994780 990357 986518 981747 975643 968806 961802 954982 948704 942853 936510 928947 920869
57885 920869 914042 909614 907107 905070 902438 899260 896255 893785 891483 889030 886874 885540 884345 881683
57871 881683 876820 870635 864127 856906 847936 837339 826517 816451 806675 796298 785591 776037 768889
57858 768889 764080 760638 757852 755732 754518 754209 754627 755567 756785 758215 760311 763670 768106 772634 776719
57843 776719 780929 785858 791094 796016 801039 807094 814194 821555 828916 836587 844110 850086 853787 856157
57829 856157 858665 861689 864323 865328 864167 861526 858766 856280 852654 846437 838569 831674 826609 821204
57815 821204 813244 803495 794697 788447 784252 780940 777640 773759 769383 765735 764189 764765 766475 768967
57801 768967 772648 777135 781032 783825 786845 791513 797546 803873 810387 817350 823461 826250 824886 821364
$$ packed form
57899A007252o549n923m423l839m771o104o837p004o820o278n851o343p563q078
57885I20869o827m428k507k037k632l178l005k470k302k453k156j334j195k662
57871H81683m863o185o508p221q970j0597j0822j0066r776j0377j0707r554p148
57858G68889m809l442k786k120j214l09M18R40J218J430K096L359M436M528M085
57843G76719M210M929N236M922N023O055P100P361P361P671P523N976L701K370
57829H56157K508L024K634J005j161k641k760k486l626o217p868o895n065n405
57815H21204p960r749q798o250m195l312l300l881m376l648j546N76J710K492
57801G68967L681M487L897K793L020M668O033O327O514O963O111K789j364l522
$$ plain form
57787 821364 818205 815839 813026 809030 804360 799860 796177 793871 792906 792065 790038 787239 785374 784855 783841
57772 783841 780528 775319 769880 764931 759988 754584 748587 741701 733680 724792 715229 704534 692559 680472
57758 680472 669595 659611 649238 638360 628024 618479 609012 599909 592646 587357 581854 574414 566313
57745 566313 560173 556601 553849 550282 545871 541552 538342 537209 538696 542233 546319 549706 552197 554374
57731 554374 556856 559845 563086 566238 569312 572574 576038 579444 582871 586907 591875 597253 602199 606341
57717 606341 609680 611977 612652 611320 608377 605111 603041 602639 602722 601626 598958 595717 592889 590912 590489
57702 590489 592603 596984 601667 604978 607344 610278 614227 618324 621816 624718 627373 630286 634227 639625
57688 639625 645948 652490 659658 668562 679166 689696 698376 705383 712632 721636 731764 740740 747062
$$ packed form
57787H21364l159k366k813l996m670m500l683k306r65q41k027k799j865n19j014
57772G83841l313n209n439m949m943n404n997o886q021q888r563j0695j1975j2087
57758F80472j0877r984j0373j0878j0336r545r467r103p263n289n503p440q101
57745E66313o140l572k752l567m411m319l210j133J487L537M086L387K491K177
57731E54374K482K989L241L152L074L262L464L406L427M036M968N378M946M142
57717F06341L339K297O75j332k943l266k070m02Q3j096k668l241k828j977m23
57702E90489K114M381M683L311K366K934L949M097L492K902K655K913L941N398
57688F39625O323O542P168Q904J0604J0530Q680P007P249R004J0128Q976O322
$$ plain form
57675 747062 751821 757753 766560 777732 789983 802845 816298 829699 842035 852956 862998 873151
57663 873151 884759 899288 917374 938355 961234 985715 1011749 1038719 1065932 1093504 1122002
57652 1122002 1151641 1182571 1215390 1250431 1287114 1325053 1365269 1409078 1456230 1505601 1557493
57641 1557493 1613827 1676127 1744611 1819155 1899568 1984943 2074446 2169077 2271013 2380842 2497163
57630 2497163 2619628 2750646 2893247 3048978 3219036 3405612 3610273 3832063 4069013
57621 4069013 4320588 4586661 4864413 5148054 5431397 5708866 5973878 6218143 6433671
57612 6433671 6614839 6758429 6862961 6928907 6958821 6956191 6923776 6862715 6772572 6652134 6500918
57601 6500918 6320768 6116455 5895220 5665877 5437354 5216348 5005664 4805183 4614591
$$ packed form
57675G47062M759N932Q807J1172J2251J2862J3453J3401J2336J0921J0042J0153
57663H73151J1608J4529J8086K0981K2879K4481K6034K6970K7213K7572K8498
57652A122002K9639L0930L2819L5041L6683L7939M0216M3809M7152M9371N1892
57641A557493N6334O2300O8484P4544Q0413Q5375Q9503R4631J01936J09829J16321
57630B497163J22465J31018J42601J55731J70058J86576K04661K21790K36950
57621D069013K51575K66073K77752K83641K83343K77469K65012K44265K15528
57612F433671J81168J43590J04532O5946K9914k630l2415o1061r0143j20438j51216
57601F500918j80150k04313k21235k29343k28523k21006k10684k00481j90592
$$ plain form
57592 4614591 4434583 4265625 4106938 3957692 3818626 3691553 3577459 3475816 3385703 3306818
57582 3306818 3239229 3182815 3137449 3103356 3080680 3068745 3066397 3073388 3090976 3120670 3162643 3216085
57570 3216085 3280952 3358372 3448954 3551711 3665653 3791964 3933458 4091812 4266060 4453762
57560 4453762 4652574 4860132 5073110 5286988 5496432 5695324 5876731 6033330 6158089
57551 6158089 6244810 6288931 6288707 6245765 6164254 6049418 5906903 5742761 5563166 5373646 5178476
57540 5178476 4980557 4781732 4583532 4387968 4197451 4013608 3836380 3664752 3498358
57531 3498358 3338079 3185278 3040957 2905533 2778759 2659732 2547499 2441854 2343085 2250909
57521 2250909 2164488 2083840 2010365 1944990 1886294 1831514 1779404 1731107 1688000 1649559 1613981
$$ packed form
57592D614591j80008j68958j58687j49246j39066j27073j14094j01643r0113p8885
57582C306818o7589n6414m5366l4093k2676j1935k348O991J7588K9694M1973N3442
57570C216085O4867P7420R0582J02757J13942J26311J41494J58354J74248J87702
57560D453762J98812K07558K12978K13878K09444J98892J81407J56599J24759
57551F158089Q6721M4121k24m2942q1511j14836j42515j64142j79595j89520j95170
57540E178476j97919j98825j98200j95564j90517j83843j77228j71628j66394
57531C498358j60279j52801j44321j35424j26774j19027j12233j05645r8769r2176
57521B250909q6421q0648p3475o5375n8696n4780n2110m8297m3107l8441l5578
$$ plain form
57510 1613981 1580353 1549435 1522421 1499469 1479616 1461889 1446318 1433766 1424732 1418532 1413930 1410512
57498 1410512 1409022 1410349 1414662 1421677 1431187 1442935 1456456 1471555 1488679 1508318 1530317 1554342
57486 1554342 1580810 1610677 1644358 1681543 1722156 1766890 1816562 1871460 1931664 1997529 2069538
57475 2069538 2148044 2233542 2326899 2428915 2539852 2659716 2788731 2927059 3074192 3229058
57465 3229058 3390606 3557598 3727647 3896805 4060086 4211828 4345430 4453913 4532146 4578819
57455 4578819 4595613 4584380 4545933 4481899 4396810 4297129 4188159 4072457 3951128 3825729
57445 3825729 3698530 3571594 3446273 3323493 3204154 3089285 2980001 2877201 2781196 2691812
57435 2691812 2608932 2532765 2463568 2401524 2347001 2300557 2262434 2232287 2209466 2193212 2182648
$$ packed form
57510A613981l3628l0918k7014k2952j9853j7727j5571j2552r034o200m602l418
57498A410512j490J327M313P015R510J1748J3521J5099J7124J9639K1999K4025
57486A554342K6468K9867L3681L7185M0613M4734M9672N4898O0204O5865P2009
57475B069538P8506Q5498R3357J02016J10937J19864J29015J38328J47133J54866
57465C229058J61548J66992J70049J69158J63281J51742J33602J08483P8233M6673
57455D578819J6794j1233l8447o4034q5089r9681j08970j15702j21329j25399
57445C825729j27199j26936j25321j22780j19339j14869j09284j02800r6005q9384
57435B691812q2880p6167o9197o2044n4523m6444l8123l0147k2821j6254j0564
$$ plain form
57424 2182648 2177303 2177874 2185653 2200727 2221454 2246328 2275630 2310573 2351662 2399042 2453852 2517895
57412 2517895 2592056 2676166 2770196 2874508 2989048 3113602 3248678 3394571 3549166 3707967
57402 3707967 3866751 4022760 4172634 4310600 4429815 4524650 4590833 4624698 4624073 4589767 4525237
57391 4525237 4434916 4323436 4195662 4056107 3908179 3754633 3598513 3442915 3290005 3140871
57381 3140871 2996013 2855428 2718639 2585595 2457344 2335105 2218881 2107634 2000633
57372 2000633 1898055 1800710 1709829 1626544 1550621 1480132 1413410 1350844 1293625 1241211 1191659
57361 1191659 1144409 1101034 1062791 1028816 997352 967607 939721 913968 890736 870480 852947
57350 852947 837138 822560 809694 798602 787930 776226 763662 751656 741318 733010 726820 722393
$$ packed form
57424B182648n345N71P779J5074K0727K4874K9302L4943M1089M7380N4810O4043
57412B517895P4161Q4110R4030J04312J14540J24554J35076J45893J54595J58801
57402C707967J58784J56009J49874J37966J19215R4835O6183L3865o25l4306o4530
57391D525237r0321j11480j27774j39555j47928j53546j56120j55598j52910j49134
57381C140871j44858j40585j36789j33044j28251j22239j16224j11247j07001
57372B000633j02578r7345r0881q3285p5923p0489o6722o2566n7219n2414m9552
57361A191659m7250m3375l8243l3975l1464k9745k7886k5753k3232k0256j7533
57350H52947j5809j4578j2866j1092j0672j1704j2564j2006j0338q308o190m427
$$ plain form
57338 722393 718511 713896 708566 703751 700364 698048 695717 692594 688643 684350 680180 676232 672617 670139
57324 670139 669997 672354 675615 677689 677862 677159 677133 678699 681752 685432 688798 691610 694429 697853 701979
57309 701979 706690 711918 717398 722784 728369 735089 743398 752865 763292 775118 787832 799163 807515
57296 807515 814578 823640 835313 846725 855292 861623 867976 875346 883283 891530 900476 910355 920943
57283 920943 931888 942684 952654 961590 970147 979139 988770 999011 1010218 1022737 1036331 1050665
57271 1050665 1065918 1082071 1097972 1112260 1125159 1138300 1152551 1167099 1181128 1195414 1211294
57260 1211294 1228537 1245339 1260606 1275535 1292432 1312187 1333327 1353588 1372082 1389680 1407584
57249 1407584 1426166 1445304 1465129 1485772 1506741 1527475 1548629 1571972 1598541 1627318 1656285
$$ packed form
57338G22393l882m615n330m815l387k316k331l123l951m293m170l948l615k478
57324F70139j42K357L261K074J73p03k6J566L053L680L366K812K819L424M126
57309G01979M711N228N480N386N585O720Q309R467J0427J1826J2714J1331Q352
57296H07515P063R062J1673J1412Q567O331O353P370P937Q247Q946R879J0588
57283I20943J0945J0796R970Q936Q557Q992R631J0241J1207J2519J3594J4334
57271A050665J5253J6153J5901J4288J2899J3141J4251J4548J4029J4286J5880
57260A211294J7243J6802J5267J4929J6897J9755K1140K0261J8494J7598J7904
57249A407584J8582J9138J9825K0643K0969K0734K1154K3343K6569K8777K8967
$$ plain form
57238 1656285 1684620 1713396 1744199 1777605 1813177 1850485 1889417 1929332 1968537 2005523 2040885
57227 2040885 2077400 2117627 2161692 2207919 2255162 2303775 2354507 2407536 2462833 2520481 2580146
57216 2580146 2640974 2702516 2764969 2827763 2888606 2944873 2995400 3039922 3077315 3105961 3125944
57205 3125944 3139354 3147884 3151337 3149285 3143139 3135408 3127420 3118856 3109340 3099561 3090779 3083887 3078917 3074927
57191 3074927 3070342 3064064 3056378 3048515 3041567 3036442 3034722 3038726 3050448 3070907 3100532 3139288 3186086
57178 3186086 3238782 3295425 3355093 3417055 3479726 3541248 3600823 3658588 3714309 3767022 3816062
57167 3816062 3861463 3902945 3939424 3970443 3997784 4024833 4054341 4087431 4124723 4167510 4217265
57156 4217265 4274465 4338313 4407327 4479721 4553650 4627904 4702552 4778477 4856155 4935274 5015567
$$ packed form
57238A656285K8335K8776L0803L3406L5572L7308L8932L9915L9205L6986L5362
57227B040885L6515M0227M4065M6227M7243M8613N0732N3029N5297N7648N9665
57216B580146O0828O1542O2453O2794O0843N6267N0527M4522L7393K8646J9983
57205C125944J3410Q530L453k052o146p731p988q564r516r779q782o892m970l990
57191C074927m585o278p686p863o948n125j720M004J1722K0459K9625L8756M6798
57178C186086N2696N6643N9668O1962O2671O1522N9575N7765N5721N2713M9040
57167C816062M5401M1482L6479L1019K7341K7049K9508L3090L7292M2787M9755
57156D217265N7200O3848O9014P2394P3929P4254P4648P5925P7678P9119Q0293
$$ plain form
57145 5015567 5097388 5181092 5266093 5351002 5434592 5516454 5596761 5675505 5751897 5824583 5892824
57134 5892824 5957559 6020948 6084761 6149511 6215148 6281641 6348310 6413317 6474966 6533488 6590775
57123 6590775 6648239 6705411 6760449 6811280 6856226 6894510 6926706 6954343 6978820 7001088 7022452
57112 7022452 7044839 7069597 7096384 7123759 7150707 7177170 7203238 7228214 7250578 7268861 7282791
57101 7282791 7293655 7303292 7312705 7322282 7333528 7349728 7374021 7407026 7447040 7492370 7542694 7598163
57089 7598163 7658055 7720662 7783780 7844713 7900392 7948523 7988860 8022707 8050674 8071146 8081341
57078 8081341 8079867 8068145 8049691 8028562 8008217 7990506 7974574 7956689 7931794 7895591 7845360
57067 7845360 7779710 7698737 7604622 7501184 7392247 7280483 7167655 7055015 6942819 6829631
$$ packed form
57145E015567Q1821Q3704Q5001Q4909Q3590Q1862Q0307P8744P6392P2686O8241
57134E892824O4735O3389O3813O4750O5637O6493O6669O5007O1649N8522N7287
57123F590775N7464N7172N5038N0831M4946L8284L2196K7637K4477K2268K1364
57112G022452K2387K4758K6787K7375K6948K6463K6068K4976K2364J8283J3930
57101G282791J0864R637R413R577J1246J6200K4293L3005M0014M5330N0324N5469
57089G598163N9892O2607O3118O0933N5679M8131M0337L3847K7967K0472J0195
57078H081341j474j1722j8454k1129k0345j7711j5932j7885k4895l6203n0231
57067G845360o5650q0973r4115j03438j08937j11764j12828j12640j12196j13188
$$ plain form
57057 6829631 6712317 6586318 6445838 6284515 6096813 5878818 5627545 5339774 5011712
57048 5011712 4639007 4216194 3735978 3189321 2565857 1853882 1040313 111202 -947869
57038 -2151648 -3512238 -5029589 -6676358 -8385206 -10049007 -11538401 -12727009 -13502285
57030 -13502285 -13748579 -13325487 -12094088 -10010008 -7208180 -3954150 -436447 3432196
57021 7966686 13367699 19339202 25003394 29202419 30946009 29694781 25393443 18396247
57013 18396247 9420312 -498822 -10150220 -18398068 -24426898 -27857850 -28702888 -27218766
57005 -27218766 -23760388 -18708118 -12475856 -5541416 1566209 8331243 14320801 19219905
56997 19219905 22836319 25099768 26061494 25882601 24805683 23115545 21095777 18988453
$$ packed form
57057F829631j17314j25999j40480j61323j87702k17995k51273k87771l28062
57048E011712l72705m22813m80216n46657o23464p11975q13569A11202i47869
57038b151648j360590j517351j646769j708848j663801j489394j188608p75276
57030a3502285k46294M23092J231399K084080K801828L254030d36447C432196
57021G966686N401013N971503N664192M199025J743590j251228m301338o997196
57013A8396247q975935d98822r651398q247848o028830l430952q45038J484122
57005b7218766L458378N052270O232262e541416A566209O765034N989558M899104
56997A9219905L616414K263449R61726j78893j076918j690138k019768k107324
$$ plain form
56989 18988453 16969442 15147979 13582633 12296765 11286522 10527250 9982470 9611444
56981 9611444 9372316 9224343 9132499 9071845 9028096 8995021 8971118 8956288 8948956 8945440 8941972
56970 8941972 8936771 8929847 8921311 8910228 8894656 8872340 8841707 8802619 8756245 8704304 8648569 8590661
56958 8590661 8531465 8470545 8406561 8338226 8264332 8183030 8091965 7989491 7875102 7748384 7608275
56947 7608275 7454051 7286910 7110146 6927622 6741989 6554060 6363801 6172230 5982368
56938 5982368 5798193 5622523 5455501 5293635 5128596 4947222 4735457 4485547 4201261
56929 4201261 3896691 3589715 3295041 3020584 2767974 2535784 2322694 2127937 1949267
56920 1949267 1781914 1620747 1463260 1309734 1160908 1016818 878029 746507 624231
$$ packed form
56989A8988453k019011j821463j565346j285868j010243p59272n44780l71026
56981I611444k39128j47973r1844o0654m3749l3075k3903j4830p332l516l468
56970H941972n201o924q536j1083j5572k2316l0633l9088m6374n1941n5735n7908
56958H590661n9196o0920o3984o8335p3894q1302r1065j02474j14389j26718j40109
56947G608275j54224j67141j76764j82524j85633j87929j90259j91571j89862
56938E982368j84175j75670j67022j61866j65039j81374k11765k49910k84286
56929D201261l04570l06976k94674k74457k52610k32190k13090j94757j78670
56920A949267j67353j61167j57487j53526j48826j44090j38789j31522j22276
$$ plain form
56911 624231 511526 407608 312415 226947 151925 87140 32508 -11065 -42706 -63189 -74736
56900 -74736 -78987 -75827 -64693 -46746 -25073 -2783 18378 37329 52558 62695 67925 69809 69680
56887 69680 68117 66228 66201 69656 76129 84117 93074 103318 114488 125666 137198 151030 168650
56874 168650 189715 213242 239063 267245 296832 325922 352153 372251 382155 379228 364445 341538
56862 341538 314282 285448 257566 232788 211596 192887 175742 160147 145954 132581 120339
56851 120339 110748 104616 100664 96951 92926 89162 85843 82693 80053 78837 79232 80212 80487 79568 77940
56836 77940 76647 76548 77521 78464 78539 78332 79267 81834 84864 86747 87072 86824 87016 87181 85316 79475 69568
56819 69568 57655 46589 38437 33884 32530 33529 36195 40214 45504 52229 61214 73753 90364 110100
$$ packed form
56911F24231j12705j03918r5193q5468p5022o4785C2508a1065l1641k0483j1547
56900g4736m251L160J1134J7947K1673b783A8378J8951J5229J0137N230J884j29
56887F9680j563j889k7L455O473P988Q957J0244J1170J1178J1532J3832J7620
56874A68650K1065K3527K5821K8182K9587K9090K6231K0098R904k927j4783k2907
56862C41538k7256k8834k7882k4778k1192j8709j7145j5595j4193j3373j2242
56851A20339r591o132l952l713m025l764l319l150k640j216L95R80K75r19j628
56836G7940j293r9R73R43P5k07R35K567L030J883L25k48J92J65j865n841r907
56819F9568j1913j1066q152m553j354R99K666M019N290O725Q985J2539J6611J9736
$$ plain form
56805 110100 131913 156327 184834 217946 255078 295994 340416 385752 427046 460380 485164
56794 485164 502369 512216 515080 513114 508922 503335 496361 489738 486366 487191 490675 495747 503646 516294
56780 516294 534287 557256 585073 617866 655630 698524 746883 800176 855986 910116 957341
56769 957341 992388 1011418 1013467 1000437 975801 943620 908138 872875 839440 807808 777909 750360
56757 750360 725685 703976 685810 672667 665769 664972 669342 678519 693170 714173 741330 772366
56745 772366 803110 829082 846966 854550 850176 833646 807541 776279 743452 710774 679307 650086
56733 650086 623210 597963 574693 555248 540617 529364 519548 511216 505843 504268 506513 512842 523270
56720 523270 536222 549039 559748 567160 569499 564589 551942 533555 512085 489019 465080 441471
$$ packed form
56805A10100K1813K4414K8507L3112L7132M0916M4422M5336M1294L3334K4784
56794D85164J7205R847K864j966m192n587o974o623l372Q25L484N072P899J2648
56780E16294J7993K2969K7817L2793L7764M2894M8359N3293N5810N4130M7225
56769I57341L5047J9030K049j3030k4636l2181l5482l5263l3435l1632k9899k7549
56757G50360k4675k1709j8166j3143o898p97M370R177J4651K1003K7157L1036
56745G72366L0744K5972J7884P584m374j6530k6105l1262l2827l2678l1467k9221
56733F50086k6876k5247k3270j9445j4631j1253r816q332n373j575K245O329J0428
56720E23270J2952J2817J0709P412K339m910j2647j8387k1470k3066k3939k3609
$$ plain form
56708 441471 419706 400357 382630 365431 348712 333568 320856 309760 298176 284799 270495
56697 270495 257269 246230 237112 229417 223155 218325 214265 209860 204272 197575 190907 185727 182397 179629
56683 179629 175824 170905 166299 163121 160955 158555 155285 151667 148852 147660 147837 148190 147669 146316 144884
56668 144884 143711 142457 140871 139091 137064 134407 131345 129238 129457 131831 134683 136384 136642 136385 136792
56653 136792 138398 140698 142456 142683 141529 140091 139237 138816 138199 137325 136688 136312 135346 133091 130078 127535
56637 127535 125867 124228 121724 118503 115331 112569 110111 108094 107014 106964 107175 106710 105516 104597 105040 106857
56621 106857 108778 109290 108056 106275 105484 105938 106414 105817 104712 104857 107163 110668 113807 116194 118461 120606
56605 120606 121465 120190 117541 115161 113953 113672 113730 113789 113802 114012 114830 116265 117742 118996 120849 124308 129013
$$ packed form
56708D41471k1765j9349j7727j7199j6719j5144j2712j1096j1584j3377j4304
56697B70495j3226j1039r118p695o262m830m060m405n588o697o668n180l330k768
56683A79629l805m919m606l178k166k400l270l618k815j192J77L53n21j353j432
56668A44884j173j254j586j780k027k657l062k107K19K374K852J701K58k57M07
56653A36792J606K300J758K27j154j438q54m21o17q74o37l76r66k255l013k543
56637A27535j668j639k504l221l172k762k458k017j080n0K11m65j194r19M43J817
56621A06857J921N12j234j781p91M54M76n97j105J45K306L505L139K387K267K145
56605A20606Q59j275k649k380j208k81N8N9J3K10Q18J435J477J254J853L459M705
$$ plain form
56588 129013 133363 136326 138482 141124 144824 148918 151784 151556 147201 139258 129218 118254 106966 96009
56574 96009 85956 76454 66635 56755 48499 43044 39672 37017 35053 34985 37532 42078 47344 52344 56738
56559 56738 60618 63965 66378 67706 68793 70732 73160 74309 73366 71868 71890 73562 75468 76907 78479
56544 78479 80546 82381 83334 83948 85323 87660 89914 90938 90816 90979 92838 96412 100525 104085 106658
56529 106658 108084 108633 109660 112692 117218 120643 121571 122001 124803 129813 134219 136405 137432 138596 139560
56514 139560 139849 140631 143474 148032 152218 154604 155862 157869 161970 168112 175174 181943 188006 193889 200428
56499 200428 208040 216527 225362 234087 242513 250538 257898 264344 270058 275513 280781 285443 289427 293391
56485 293391 297792 302121 305637 308376 310671 312134 312168 311290 310782 310817 309936 306880 302180 297407 293391 289771
$$ packed form
56588A29013M350K963K156K642L700M094K866k28m355p943j0040j0964j1288j0957
56574I6009j0053r502r819r880q256n455l372k655j964o8K547M546N266N000M394
56559E6738L880L347K413J328J087J939K428J149r43j498K2J672J906J439J572
56544G8479K067J835R53O14J375K337K254J024j22J63J859L574M113L560K573
56529A06658J426N49J027L032M526L425R28M30K802N010M406K186J027J164R64
56514A39560K89P82K843M558M186K386J258K007M101O142P062O769O063N883O539
56499B00428P612Q487Q835Q725Q426Q025P360O446N714N455N268M662L984L964
56485B93391M401M329L516K739K295J463L4q78n08L5q81l056m700m773m016l620
$$ plain form
56469 289771 286016 282253 278970 276098 272686 267833 262122 257552 255431 254525 252030 246426 238749 231108
56455 231108 224814 220127 216888 214704 212951 211253 209795 208784 207898 206694 205363 204448 203689 201662 197080
56440 197080 190461 184039 179625 176827 173934 170540 168375 169053 171760 174129 175047 175561 177004 179282 181424
56425 181424 183040 184564 186420 188513 190541 192584 195294 199368 204644 209850 213715 216358 219121 222887
56411 222887 226999 230192 232289 234480 237938 242555 247328 251757 256287 261193 265733 269158 272227 276608
56397 276608 282670 288957 294290 299206 304460 309211 312028 313066 313736 314458 314230 312598 310669 309635 309323
56382 309323 308879 308236 308231 309482 311447 312429 310750 306455 301778 299183 298943 299362 299312 299440 300545 301873 301852
56365 301852 299909 296782 293336 289801 286181 282842 280397 279022 278055 276566 274448 272625 271846 271691 271186
$$ packed form
56469B89771l755l763l283k872l412m853n711m570k121r06k495n604p677p641
56455B31108o294m687l239k184j753j698j458j011q86j204j331r15p59k027m582
56440A97080o619o422m414k798k893l394k165O78K707K369R18N14J443K278K142
56425A81424J616J524J856K093K028K043K710M074N276N206L865K643K763L766
56411B22887M112L193K097K191L458M617M773M429M530M906M540L425L069M381
56397B76608O062O287N333M916N254M751K817J038O70P22k28j632j929j034l12
56382C09323m44o43nJ251J965R82j679m295m677k595k40M19n0J28J105J328k1
56365C01852j943l127l446l535l620l339k445j375r67j489k118j823p79j55n05
$$ plain form
56350 271186 270021 268424 266246 263176 259802 257440 256680 256902 257376 257984 258640 258792 258021 256569 254972 253659
56334 253659 253051 253465 254692 256133 257403 258272 258236 257062 255740 255695 256743 257039 255627 253959 254090 256292
56318 256292 259343 262413 265542 268761 271886 275101 278767 282620 285933 288640 291679 295868 300836 305363
56304 305363 308715 311364 314370 318253 322670 327111 331449 335706 339812 343975 348704 353932 358658 362194
56290 362194 365262 368915 372940 376544 380231 385367 391769 397347 400731 402968 406012 410646 416503 422945
56276 422945 429119 434119 438042 442185 447576 453986 460868 468238 476060 483911 492162 502278 514653 527152
56262 527152 537374 545835 555270 567051 579837 591897 603284 615152 628051 641726 655962 670710
56250 670710 685317 698299 708461 716357 724084 733101 742467 749973 754917 758925 763960 770568 778378
$$ packed form
56350B71186j165j597k178l070l374k362p60K22M74O08O56J52p71j452j597j313
56334B53659o08M14J227J441J270Q69l6j174j322m5J048K96j412j668J31K202
56318B56292L051L070L129L219L125L215L666L853L313K707L039M189M968M527
56304C05363L352K649L006L883M417M441M338M257M106M163M729N228M726L536
56290C62194L068L653M025L604L687N136O402N578L384K237L044M634N857O442
56276D22945O174N000L923M143N391O410O882P370P822P851Q251J0116J2375J2499
56262E27152J0222Q461R435J1781J2786J2060J1387J1868J2899J3675J4236J4748
56250F70710J4607J2982J0162P896P727R017R366P506M944M008N035O608P810
$$ plain form
56237 778378 787075 796140 804492 811311 816683 820940 824283 827870 834188 845011 859469 875308 891600
56224 891600 909009 927816 947343 967564 990018 1016427 1047088 1081114 1117824 1157484 1200890
56213 1200890 1248403 1299501 1353467 1410495 1471696 1537874 1609054 1685690 1769548 1862423 1964407
56202 1964407 2074322 2191662 2317207 2451979 2596737 2752696 2921576 3104203 3299524
56193 3299524 3505551 3720948 3945066 4176442 4411891 4647523 4880327 5108028 5327178
56184 5327178 5532264 5717582 5879773 6017884 6131355 6219140 6280813 6317418 6330900 6323580
56174 6323580 6298371 6258343 6205437 6140358 6064021 5978059 5883526 5780406 5669202 5551810 5429730
56163 5429730 5302288 5167787 5025744 4877018 4722544 4563299 4401115 4238133 4075410
$$ packed form
56237G78378Q697R065Q352O819N372M257L343L587O318J0823J4458J5839J6292
56224H91600J7409J8807J9527K0221K2454K6409L0661L4026L6710L9660M3406
56213A200890M7513N1098N3966N7028O1201O6178P1180P6636Q3858R2875J01984
56202A964407J09915J17340J25545J34772J44758J55959J68880J82627J95321
56193C299524K06027K15397K24118K31376K35449K35632K32804K27701K19150
56184E327178K05086J85318J62191J38111J13471Q7785O1673L6605J3482p320
56174F323580k5209m0028n2906o5079p6337q5962r4533j03120j11204j17392j22080
56163E429730j27442j34501j42043j48726j54474j59245j62184j62982j62723
$$ plain form
56154 4075410 3912931 3751083 3591418 3435964 3286108 3141906 3002246 2866238 2734736
56145 2734736 2609819 2492452 2381599 2276075 2176058 2081987 1993237 1909206 1830754 1759107
56135 1759107 1693814 1633027 1575363 1520527 1468902 1421702 1380709 1346277 1316090 1287365 1259893
56124 1259893 1235525 1215237 1198444 1184793 1174453 1166416 1158528 1150081 1143038 1139925 1141441 1146638 1154386
56111 1154386 1163975 1174982 1187149 1199981 1212399 1223539 1234028 1245592 1259088 1273588 1287668
56100 1287668 1300801 1313154 1324811 1335782 1346260 1356328 1365697 1374253 1382678 1392147 1403353 1416187
56088 1416187 1430519 1447067 1467088 1491229 1519307 1551625 1589701 1634726 1685865 1741519 1802170
56077 1802170 1870500 1948486 2036080 2133170 2240900 2359711 2487473 2620920 2757933 2897138
$$ packed form
56154D075410j62479j61848j59665j55454j49856j44202j39660j36008j31502
56145B734736j24917j17367j10853j05524j00017r4071q8750q4031p8452p1647
56135A759107o5293o0787n7664n4836n1625m7200m0993l4432l0187k8725k7472
56124A259893k4368k0288j6793j3651j0340q037p888q447p043l113J516N197P748
56111A154386R589J1007J2167J2832J2418J1140J0489J1564J3496J4500J4080
56100A287668J3133J2353J1657J0971J0478J0068R369Q556Q425R469J1206J2834
56088A416187J4332J6548K0021K4141K8078L2318L8076M5025N1139N5654O0651
56077A802170O8330P7986Q7594R7090J07730J18811J27762J33447J37013J39205
$$ plain form
56067 2897138 3036346 3172867 3304820 3431020 3550394 3662735 3769229 3870735 3965689 4050417
56057 4050417 4120769 4172870 4203792 4213355 4204766 4182305 4148760 4105486 4053201 3991071 3916333 3827013
56045 3827013 3724671 3613204 3495967 3375513 3254864 3136808 3022598 2913165 2810782
56036 2810782 2717478 2632426 2553012 2477933 2407300 2340481 2276437 2215966 2161095 2112051 2067031
56025 2067031 2025169 1987660 1955483 1927846 1903395 1881522 1862157 1845531 1832324 1823062 1817424 1814978
56013 1814978 1815854 1819533 1823985 1827686 1831659 1837763 1845903 1855029 1865964 1880772 1899782 1921571 1945502
56000 1945502 1971828 1999521 2026485 2051957 2076732 2101277 2125780 2151607 2180215 2210775 2241279
55989 2241279 2271827 2304397 2339556 2375993 2413331 2452749 2494599 2537852 2582230 2628664 2677396
$$ packed form
56067B897138J39208J36521J31953J26200J19374J12341J06494J01506R4954Q4728
56057D050417P0352N2101L0922R563q589k2461l3545m3274n2285o2130p4738q9320
56045C827013j02342j11467j17237j20454j20649j18056j14210j09433j02383
56036B810782r3304q5052p9414p5079p0633o6819o4044o0471n4871m9044m5020
56025B067031m1862l7509l2177k7637k4451k1873j9365j6626j3207r262n638k446
56013A814978Q76L679M452L701L973O104Q140R126J0935J4808J9010K1789K3931
56000A945502K6326K7693K6964K5472K4775K4545K4503K5827K8608L0560L0504
55989B241279L0548L2570L5159L6437L7338L9418M1850M3253M4378M6434M8732
$$ plain form
55978 2677396 2727659 2779286 2832776 2888009 2944880 3004752 3069203 3137910 3209871 3285626 3365788
55967 3365788 3448660 3532489 3619116 3712093 3812136 3917866 4029895 4150093 4277627 4410132
55957 4410132 4548502 4695978 4852569 5014945 5182240 5357599 5543452 5739343 5944737
55948 5944737 6159735 6382772 6612051 6849608 7099594 7362491 7635908 7921367 8225041
55939 8225041 8551006 8898647 9267010 9656029 10062719 10482264 10914784 11366047 11840516
55930 11840516 12339321 12866113 13428923 14034615 14687000 15391409 16154755 16979791 17865789
55921 17865789 18816371 19840202 20943101 22127064 23398182 24766996 26239133 27814709
55913 27814709 29500061 31311860 33267751 35383259 37681511 40195880 42958880 45998531
$$ packed form
55978B677396N0263N1627N3490N5233N6871N9872O4451O8707P1961P5755Q0162
55967C365788Q2872Q3829Q6627R2977J00043J05730J12029J20198J27534J32505
55957D410132J38370J47476J56591J62376J67295J75359J85853J95891K05394
55948E944737K14998K23037K29279K37557K49986K62897K73417K85459L03674
55939H225041L25965L47641L68363L89019M06690M19545M32520M51263M74469
55930A1840516M98805N26792N62810O05692O52385P04409P63346Q25036Q85998
55921A7865789R50582J023831J102899J183963J271118J368814J472137J575576
55913B7814709J685352J811799J955891K115508K298252K514369K763000L039651
$$ plain form
55905 45998531 49349860 53059288 57173004 61731743 66781217 72377245 78582069 85479664
55897 85479664 93211766 101994460 112101100 123842498 137544389 153481290 171799197
55890 171799197 192548829 215842084 241909651 270820951 301933609 333441284 362380787
55883 362380787 385218615 398873507 401788483 394505415 379361599 359476647 337678157
55876 337678157 315931043 295320044 276278159 258820189 242740750 227776367 213689569
55869 213689569 200274533 187350741 174784981 162516048 150555486 138972566 127870009
55862 127870009 117345786 107459538 98233694 89679427 81807027 74613373 68077500 62174029
55854 62174029 56878964 52158056 47960548 44229532 40910812 37950154 35292975 32892715
$$ packed form
55905D5998531L351329L709428M113716M558739N049474N596028O204824O897595
55897H5479664P732102Q782694J0106640J1741398J3701891J5936901J8317907
55890A71799197K0749632K3293255K6067567K8911300L1112658L1507675K8939503
55883C62380787K2837828J3654892K914976p283068j5143816j9884952k1798490
55876C37678157k1747114k0610999j9041885j7457970j6079439j4964383j4086798
55869B13689569j3415036j2923792j2565760j2268933j1960562j1582920j1102557
55862A27870009j0524223r886248r225844q554267p872400p193654o535873n903471
55854F2174029n295065m720908m197508l731016l318720k960658k657179k400260
$$ plain form
55846 32892715 30713681 28723975 26893660 25202543 23641910 22204837 20880286 19657747
55838 19657747 18529897 17487782 16520068 15619755 14785316 14012734 13292680 12618053 11987938
55829 11987938 11401226 10852408 10336918 9854884 9405998 8985651 8589564 8217673 7869893
55820 7869893 7542018 7229175 6930034 6644929 6373022 6113548 5866642 5630878 5403272
55811 5403272 5183496 4974570 4777583 4589274 4406711 4230712 4062597 3901041 3744453
55802 3744453 3593430 3448897 3310677 3179650 3058327 2947615 2845919 2752743 2669816 2596943
55792 2596943 2530086 2465486 2402705 2341955 2281703 2220924 2160765 2102125 2044501 1988845 1938220
55781 1938220 1893505 1851591 1810117 1770963 1736642 1706073 1676512 1647256 1618841 1590804 1562591
$$ packed form
55846C2892715k179034j989706j830315j691117j560633j437073j324551j222539
55838A9657747j127850j042115r67714r00313q34439p72582p20054o74627o30115
55829A1987938n86712n48818n15490m82034m48886m20347l96087l71891l47780
55820G869893l27875l12843k99141k85105k71907k59474k46906k35764k27606
55811E403272k19776k08926j96987j88309j82563j75999j68115j61556j56588
55802C744453j51023j44533j38220j31027j21323j10712j01696r3176q2927p2873
55792B596943o6857o4600o2781o0750o0252o0779o0159n8640n7624n5656n0625
55781A938220m4715m1914m1474l9154l4321l0569k9561k9256k8415k8037k8213
$$ plain form
55770 1562591 1534753 1507285 1478937 1449979 1423052 1399047 1374703 1346888 1316977 1288308 1261372
55759 1261372 1234416 1207022 1179870 1152127 1122209 1090828 1060951 1034916 1013129 994980 979396
55748 979396 965060 951395 938883 927693 917090 907026 898955 893987 891425 890070 889512 889197 887776
55735 887776 884557 880114 874474 866327 855108 842186 828991 815770 803189 792911 784940 776421 764978
55722 764978 751611 738644 726542 714619 703223 693097 683760 674404 665157 655701 643863 627703
55710 627703 608336 589028 572075 557687 544889 532202 518496 504435 492102 482133 472582 461805
55698 461805 450907 441775 434093 426075 416995 407382 397650 388060 379134 370919 362988 356174 352738 353395
55684 353395 355720 356993 357043 356694 355266 351780 347089 342526 337765 332296 327676 325774 325727 325274 324453 325246
$$ packed form
55770A562591k7838k7468k8348k8958k6927k4005k4344k7815k9911k8669k6936
55759A261372k6956k7394k7152k7743k9918l1381k9877k6035k1787j8149j5584
55748I79396j4336j3665j2512j1190j0603j0064q071m968k562j355n58l15j421
55735H87776l219m443n640q147j1219j2922j3195j3221j2581j0278p971q519j1443
55722G64978j3367j2967j2102j1923j1396j0126r337r356r247r456j1838j6160
55710F27703j9367j9308j6953j4388j2798j2687j3706j4061j2333r969r551j0777
55698D61805j0898r132p682q018r080r613r732r590q926q215p931o814l436O57
55684C53395K325J273N0l49j428l486m691m563m761n469m620j902m7m53q21P93
$$ plain form
55668 325246 327836 329731 328723 324684 318499 311231 304419 299295 295418 291509 287588 284795 283282 281920
55654 281920 280176 278761 278171 277868 277151 275948 274651 273885 274238 275474 276517 276917 277704 279905 282932 285413
55638 285413 286913 287868 288665 289785 291921 294859 297318 299071 302018 307681 314760 320765 325009 328276 330780
55623 330780 332457 334254 336910 339196 339490 338466 338109 338795 339616 340834 343219 345252 343921 338723 332449
55608 332449 327544 323895 320693 318170 316528 315026 313104 311118 309356 307607 306043 305131 304460 303170 301770
55593 301770 301919 304014 306647 308782 310798 312901 314343 314898 315356 315622 313905 308954 301824 294322 286729
55578 286729 278227 268787 259617 252107 246854 243216 239470 234036 226905 219355 212290 205616 199077 192532
55564 192532 185457 177558 170110 165191 163066 161637 159014 155379 151730 148325 145290 143432 143239 143884 144281
$$ packed form
55668C25246K590J895j008m039o185p268o812n124l877l909l921k793j513j362
55654B81920j744j415n90l03p17j203j297p66L53J236J043M00P87K201L027K481
55638B85413J500R55P97J120K136K938K459J753K947N663P079O005M244L267K504
55623C30780J677J797K656K286K94j024l57O86Q21J218K385K033j331n198o274
55608C32449m905l649l202k523j642j502j922j986j762j749j564r12o71j290j400
55593C01770J49K095K633K135K016K103J442N55M58K66j717m951p130p502p593
55578B86729q502r440r170p510n253l638l746n434p131p550p065o674o539o545
55564A92532p075p899p448m919k125j429k623l635l649l405l035j858j93O45L97
$$ plain form
55549 144281 144351 144295 143435 141012 137664 134968 133584 132678 131105 128590 125902 124332 124811 127067 129748 131709
55533 131709 133056 134725 137222 140001 141881 141975 140488 138684 137944 138888 141492 145593 150671 155463 158728
55518 158728 160524 162099 164439 167502 170928 174838 179764 186306 194914 205467 217129 229147 241794
55505 241794 255972 271924 288841 305514 320768 333483 342965 349227 352330 351779 347340 340026 331275
55492 331275 321451 310234 298152 286433 275442 264581 253804 243845 234785 225664 215884 205916 196391
55479 196391 187613 180073 174149 169143 164082 159674 157728 157999 157465 153878 148654 144954 144037 144726 145507
55464 145507 145642 144771 142874 140482 138115 135740 133398 131771 131296 131144 129952 127272 123668 119831 116421
55449 116421 114405 114619 116974 120459 123640 124887 122884 117818 111673 106466 102307 97866 92539 87386
$$ packed form
55549A44281P0n6q60k423l348k696j384r06j573k515k688j570M79K256K681J961
55533A31709J347J669K497K779J880R4j487j804p40R44K604M101N078M792L265
55518A58728J796J575K340L063L426L910M926O542Q608J0553J1662J2018J2647
55505B41794J4178J5952J6917J6673J5254J2715R482O262L103n51m439p314q751
55492C31275r824j1217j2082j1719j0991j0861j0777r959r060r121r780r968r525
55479A96391q778p540n924n006n061m408j946K71n34l587n224l700r17O89P81
55464A45507J35q71j897k392k367k375k342j627m75j52j192k680l604l837l410
55449A16421k016K14K355L485L181J247k003n066o145n207m159m441n327n153
$$ plain form
55435 87386 83937 82700 82928 83348 83014 81757 79965 77926 75545 72695 69413 65593 60973 55747 50732
55420 50732 46479 42589 38414 34164 30832 29088 28667 28805 28942 28964 28948 28878 28719 28673 28995 29346 28862 27382
55402 27382 26187 26638 28262 29153 28337 26787 25887 25909 26437 27374 28788 30291 31261 31453 31100 30647 30463 30369
55384 30369 29438 27017 24103 22834 24172 26827 28898 29887 30571 31549 32637 33275 32920 31380 29243 27710
55368 27710 27579 28530 29543 29689 28524 26266 23806 22012 20954 20340 20506 21997 24121 25184 24615 23717
55352 23717 23787 24604 25514 26781 28820 31088 32943 34864 37527 40214 41462 41175 40905 42029 44562 47733
55336 47733 50836 53287 54455 53823 51278 47501 44064 42419 42290 41688 39203 35818 33808 34401 37198
55321 37198 41165 45115 47643 47869 46448 45058 44862 46029 48449 51914 55574 58124 58822 57803 55384
$$ packed form
55435H7386l449j237K28M20l34j257j792k039k381k850l282l820m620n226n015
55420E0732m253l890m175m250l332j744m21J38J37K2j6p0j59m6L22L51m84j480
55402B7382j195M51J624Q91q16j550r00K2N28R37J414J503R70J92l53m53j84r4
55384C0369r31k421k914j269J338K655K071R89O84R78J088O38l55j540k137j533
55368B7710j31R51J013J46j165k258k460j794j058o14J66J491K124J063n69q98
55352B3717P0Q17R10J267K039K268J855J921K663K687J248k87k70J124K533L171
55336D7733L103K451J168o32k545l777l437j645j29o02k485l385k010N93K797
55321C7198L967L950K528K26j421j390j96J167K420L465L660K550O98j019k419
$$ plain form
55306 55384 51725 47281 42937 39446 37075 35860 35762 36436 37195 37410 36943 36300 36344 37434 38662 38399 35985
55289 35985 32415 29061 26363 24288 23288 23784 25061 25730 25300 24445 23801 23208 22181 20481 18241 16100
55273 16100 15180 16299 19184 22864 26538 29512 30758 29698 27394 25926 26191 27091 27140 26097 24687 23474
55257 23474 22585 22031 21633 20834 19086 16496 13800 11759 10708 10627 11424 13002 15111 17311 19321 21166
55241 21166 22695 23199 22311 21275 22218 25459 28456 28429 25486 22133 20173 19333 18715 18101 17433 16331 14913
55224 14913 14302 15361 17226 17747 15453 10945 6613 4983 6864 10807 14586 17189 18917 19789 19018
55209 19018 16619 14519 14898 17693 20768 22516 23255 23753 23467 21231 17231 13261 10868 10015 9835 9948
55193 9948 10444 11145 11688 12218 13286 15079 17400 20290 23860 27286 28857 27611 24478 21277 18996 17517
$$ packed form
55306E5384l659m444m344l491k371j215r8O74P59K15m67o43M4J090J228k63k414
55289C5985l570l354k698k075j000M96J277O69m30q55o44n93j027j700k240k141
55273A6100r20J119K885L680L674K974J246j060k304j468K65R00M9j043j410j213
55257B3474q89n54l98p99j748k590k696k041j051q1P97J578K109K200K010J845
55241B1166J529N04q88j036R43L241K997k7k943l353j960q40o18o14o68j102j418
55224A4913o11J059J865N21k294m508m332j630J881L943L779K603J728Q72p71
55209A9018k399k100L79K795L075J748P39M98k86k236m000l970k393q53j80J13
55193I948M96P01N43N30J068J793K321K890L570L426J571j246l133l201k281j479
$$ plain form
55177 17517 16555 16105 16023 15784 14937 13660 12793 13218 15070 17534 19526 20508 20566 20045 19497 19464 19614 18634 16136
55158 16136 14366 16382 22281 28680 32487 33698 33843 33378 31987 30070 28283 26500 24803 24622 27047
55143 27047 30608 32675 32892 33315 35052 36665 36431 34525 32219 30193 28552 27534 27287 27469 27678 27899
55127 27899 28177 28404 28652 29156 29762 29972 29778 29808 30423 31184 31440 30914 29701 28356 28031 29676 32726 35260
55109 35260 35830 34713 33280 32771 33794 36153 38729 40182 40231 39813 39678 39445 38475 37100 36317 36503 36926
55092 36926 36592 35296 33739 32590 31555 29717 26897 24192 22752 22534 22787 23248 24099 25111 25776 26064
55076 26064 26262 26296 25990 25724 25946 26394 26726 27466 29079 30636 30934 30614 31367 33181 34414 34893 36652 40709
55058 40709 45113 47474 47805 47552 47286 46908 46927 47916 49427 50807 52302 54110 55252 54947 54369 55396 57988
$$ packed form
55177A7517r62m50q2k39q47j277q67M25J852K464J992R82N8n21n48l3J50r80k498
55158A6136j770K016N899O399L807J211J45m65j391j917j787j783j697j81K425
55143B7047L561K067K17M23J737J613k34j906k306k026j641j018k47J82K09K21
55127B7899K78K27K48N04O06K10j94L0O15P61K56n26j213j345l25J645L050K534
55109C5260N70j117j433n09J023K359K576J453M9m18j35k33r70j375p83J86M23
55092C6926l34j296j557j149j035j838k820k705j440k18K53M61Q51J012O65K88
55076B6064J98L4l06k66K22M48L32P40J613J557K98l20P53J814J233M79J759M057
55058D0709M404K361L31k53k66l78J9R89J511J380J495J808J142l05n78J027K592
$$ plain form
55041 57988 60411 61852 63259 65482 67866 69059 68418 66572 65171 65765 68149 70190 70127 68589 67415
55026 67415 67129 66930 66705 67369 69119 70820 71512 71420 71263 71661 73422 77175 82147 86233 87767 86764 84386
55009 84386 82153 81676 83765 87231 89651 90008 89626 89961 90624 90526 89869 89548 89186 87388 84069 81211 80783
54992 80783 82712 85399 87618 89302 90851 92317 93333 93471 92532 90733 88686 86966 85511 83618 80852
54977 80852 77849 75871 75517 76266 77298 78197 78642 78096 76505 74934 74640 75464 75789 74394 72028 70945
54961 70945 72948 77784 83223 86853 88015 87935 87957 88166 88046 87741 87823 88201 88226 87730 87040 86027 84240 82120
54943 82120 81016 81516 82677 83353 83395 82963 81628 79211 76908 76374 77715 79282 79537 78426 76847 75451
54927 75451 74306 73387 73002 73676 75466 77379 77865 76350 74057 72757 72812 73057 72686 72564 74273 78250 83316
$$ packed form
55041E7988K423J441J407K223K384J193o41j846j401N94K384K041o3j538j174
55026F7415k86j99k25O64J750J701O92r2j57L98J761L753M972M086J534j003k378
55009H4386k233m77K089L466K420L57l82L35O63r8o57l21l62j798l319k858m28
54992H0783J929K687K219J684J549J466J016J38r39j799k047j720j455j893k766
54977H0852l003j978l54P49J032Q99M45n46j591j571k94Q24L25j395k366j083
54961G0945K003M836N439L630J162q0K2K09j20l05Q2L78K5m96o90j013j787k120
54943H2120j104N00J161O76M2m32j335k417k303n34J341J567K55j111j579j396
54927G5451j145r19l85O74J790J913M86j515k293j300N5K45l71j22J709L977N066
$$ plain form
54910 83316 87908 91333 93819 95750 97184 98089 98729 99540 100704 102167 104094 106929 110775 115053 119139
54895 119139 123065 127233 131700 136388 141808 148775 157246 166172 174832 183667 193369 203773 214301 225016
54881 225016 236322 247743 257759 264955 268851 269742 268461 266246 263774 259982 252743 241482 228582
54868 228582 217391 209172 202696 196490 190425 185040 180272 175423 169915 163645 156906 150335 144720 140389
54854 140389 136830 133245 129588 126800 125848 126656 128321 130453 133880 139561 147046 154787 162131 170239 180501
54839 180501 192634 205071 216642 226925 235277 240785 243355 243738 242062 237355 229281 219535 210601
54826 210601 203446 197225 190936 184537 178363 172241 165582 158070 150111 142619 136227 130541 124451 117533
54812 117533 110849 105933 103158 101712 101047 101508 103249 105282 106299 106009 104945 103194 100241 96297 92880
$$ packed form
54910H3316M592L425K486J931J434R05O40Q11J164J463J927K835L846M278M086
54895A19139L926M168M467M688N420O967Q471Q926Q660Q835R702J0404J0528J0715
54881B25016J1306J1421J0016P196L896Q91j281k215k472l792p239j1261j2900
54868B28582j1191q219o476o206o065n385m768m849n508o270o739o571n615m331
54854A40389l559l585l657k788r52Q08J665K132L427N681P485P741P344Q108J0262
54839A80501J2133J2437J1571J0283Q352N508K570L83j676m707q074r746q934
54826B10601p155o221o289o399o174o122o659p512p959p492o392n686o090o918
54812A17533o684m916k775j446o65M61J741K033J017k90j064j751k953l944l417
$$ plain form
54797 92880 91352 91339 91372 90916 90922 92284 94564 96597 97694 97832 97290 96686 96830 97797 98453 97591 95373 93049
54779 93049 91506 90667 89942 88501 85462 80841 76238 73570 73111 73665 74489 75808 77397 78232 78098 78198
54763 78198 79415 81053 82156 82962 84023 84855 84671 83769 83089 82966 83404 84954 87965 91369 93582 94560
54747 94560 95758 98094 101150 104433 108130 112219 115885 118497 120593 123453 128123 135014 143908 154028
54733 154028 164452 174786 185243 196146 207570 219347 231052 242174 252639 262821 272566 280740
54721 280740 286487 290462 293782 295936 294941 289766 281783 273567 266901 261882 257141 250946 242958 234977
54707 234977 229092 225182 221367 216891 213178 211667 212059 213443 215852 219628 224178 228564 232852 237971
54693 237971 244620 253005 263071 274213 285272 295724 306520 318943 332909 347139 360517 372419
$$ packed form
54797I2880j528j3L3m56OJ362K280K033J097J38n42o04J44R67O56q62k218k324
54779I3049j543q39p25j441l039m621m603k668m59N54Q24J319J589Q35j34J00
54763G8198J217J638J103Q06J061Q32j84r02o80j23M38J550L011L404K213R78
54747I4560J198K336L056L283L697M089L666K612K096K860M670O891Q894J0120
54733A54028J0424J0334J0457J0903J1424J1777J1705J1122J0465J0182R745Q174
54721B80740N747L975L320K154r95n175p983q216o666n019m741o195p988p981
54707B34977n885l910l815m476l713j511L92J384K409L776M550M386M288N119
54693B37971O649Q385J0066J1142J1059J0452J0796J2423J3966J4230J3378J1902
$$ plain form
54681 372419 382051 388582 391850 392012 388549 380637 368706 354781 340861 327612 314887 302863 292030
54668 292030 282375 273166 263645 253808 244414 236192 229016 221973 214309 206143 198175 191037 185192 181019
54654 181019 178484 176820 174994 172491 169459 166294 163336 160723 158234 155603 153229 152009 151911 151369 149063
54639 149063 145836 143619 142614 141036 138013 135268 134975 136979 139275 140640 141565 142812 144336 145833 147438
54624 147438 149340 151290 152865 153969 154780 155430 155960 156433 156950 157723 159156 161621 164992 168726 172658 177489
54608 177489 184034 191959 199640 205596 209973 214325 219811 225952 231509 236285 241272 246839 251699 254471
54594 254471 255718 257292 259856 262439 264700 268080 273736 280547 286672 292376 299637 309214 319840 330522
54580 330522 341823 354078 365886 375664 383823 392153 401535 411188 419529 424773 425341 421103 414097 406765
$$ packed form
54681C72419R632O531L268J62l463p912j1931j3925j3920j3249j2725j2024j0833
54668B92030r655r209r521r837r394q222p176p043p664q166p968p138n845m173
54654A81019k535j664j826k503l032l165k958k613k489k631k374j220r8n42k306
54639A49063l227k217j005j578l023k745k93K004K296J365R25J247J524J497J605
54624A47438J902J950J575J104Q11O50N30M73N17P73J433K465L371L734L932M831
54608A77489O545P925P681N956M377M352N486O141N557M776M987N567M860K772
54594B54471J247J574K564K583K261L380N656O811O125N704P261R577J0626J0682
54580C30522J1301J2255J1808R778Q159Q330R382R653Q341N244N68m238p006p332
$$ plain form
54566 406765 399435 390548 379259 366553 353692 340911 328211 316352 306343 298613 293111 289416
54554 289416 286206 281590 274884 267644 262172 259273 257996 257002 255432 252834 249259 245545 242860 241762
54540 241762 241956 242845 243967 244971 245476 244944 242653 238270 232697 227685 224002 220403 215251 208851 203181
54525 203181 199318 196141 191909 186272 180178 174478 169391 164990 161360 158194 154870 151237 147896 145378
54511 145378 143362 141193 139030 137819 137840 137830 136121 132467 128221 124876 122965 122310 122500 122877 122760 122088
54495 122088 121457 121223 121092 120936 121341 122741 124468 125405 125274 124698 124338 124671 126278 129397 133220 136531 139190
54478 139190 142266 146586 151843 157317 162676 167753 172264 176219 180061 183944 187433 190438 193841 198457
54464 198457 203689 208000 210576 211740 211770 210235 206918 202767 199279 197173 196087 195434 194949 194308 192660
$$ packed form
54566D06765p330q887j1289j2706j2861j2781j2700j1859j0009p730n502l695
54554B89416l210m616o706p240n472k899j277r94j570k598l575l714k685j098
54540B41762J94Q89J122J004N05n32k291m383n573n012l683l599n152o400n670
54525B03181l863l177m232n637o094n700n087m401l630l166l324l633l341k518
54511A45378k016k169k163j211K1j0j709l654m246l345j911o55J90L77j17o72
54495A22088o31k34j31j56M05J400J727R37j31n76l60L33J607L119L823L311K659
54478A39190L076M320N257N474N359N077M511L955L842L883L489L005L403M616
54464A98457N232M311K576J164L0j535l317m151l488k106j086o53m85o41j648
$$ plain form
54449 192660 189005 183089 175776 168487 162269 157296 153146 149448 146194 143426 140817 137807 134189 130336
54435 130336 126806 124021 122353 122052 122718 123199 122553 120916 119038 117276 115680 114778 115291 117046 119220 121918
54419 121918 126301 132406 137894 140193 139447 138305 139003 141585 144776 147493 149338 150572 152026 154466 157803
54404 157803 161283 164368 166788 167863 166760 163888 161204 160461 161493 162679 162875 162472 162652 163804 164671
54389 164671 163185 158537 152354 147375 145084 145082 146443 148506 150167 149802 146946 143404 141650 142346 144151
54374 144151 145577 146127 145714 144039 141061 137642 135231 134750 135715 136477 135627 133320 131038 130031 130436 131873
54358 131873 134040 136280 137428 137028 136220 136501 137905 139314 140280 141413 143038 144636 145989 147977 151630
54343 151630 156924 162883 168459 173074 176804 180280 184112 188366 193039 198842 206589 215660 223975 229983
$$ packed form
54449A92660l655n916p313p289o218m973m150l698l254k768k609l010l618l853
54435A30336l530k785j668l01O66M81o46j637j878j762j596r02N13J755K174K698
54419A21918M383O105N488K299p46j142O98K582L191K717J845J234J454K440L337
54404A57803L480L085K420J075j103k872k684p43J032J186J96m03J80J152Q67
54389A64671j486m648o183m979k291kJ361K063J661l65k856l542j754O96J805
54374A44151J426N50m13j675k978l419k411m81R65P62q50k307k282j007M05J437
54358A31873K167K240J148m00q08K81J404J409R66J133J625J598J353J988L653
54343A51630N294N959N576M615L730L476L832M254M673N803P747R071Q315O008
$$ plain form
54329 229983 233965 236979 239389 241039 242083 242789 242935 242225 240998 239890 239065 238274 237215 235301 231674
54314 231674 226296 220556 215834 211810 207203 201842 196845 192920 189740 187069 185174 183759 181801 179093
54300 179093 176875 176149 176263 176022 175459 175552 176699 178506 180729 183431 186195 188022 188272 187361 186582 187498 191111
54283 191111 196929 202937 207175 209431 211108 213592 217283 221973 227227 232209 235844 237743 238679 239750
54269 239750 241140 241956 241228 238912 235898 233064 230416 227349 223681 220049 217075 214524 211638 207962 203410
54254 203410 197904 191600 185346 180096 175715 170972 165047 158661 153359 149906 147564 144853 140888 136105
54240 136105 131703 128359 125659 122855 119814 116864 114113 111530 109462 108324 107762 106784 104842 102299 99779
54225 99779 97605 95901 94588 93144 91094 88951 88038 89006 91079 93038 94368 95164 95542 95685 95977 96566
$$ packed form
54329B29983L982L014K410J650J044P06J46p10j227j108q25p91j059j914l627
54314B31674n378n740m722m024m607n361m997l925l180k671j895j415j958k708
54300A79093k218p26J14k41n63R3J147J807K223K702K764J827K50r11p79R16L613
54283A91111N818O008M238K256J677K484L691M690N254M982L635J899R36J071
54269B39750J390Q16p28k316l014k834k648l067l668l632k974k551k886l676m552
54254B03410n506o304o254n250m381m743n925o386n302l453k342k711l965m783
54240A36105m402l344k700k804l041k950k751k583k068j138n62r78j942k543k520
54225I9779k174j704j313j444k050k143r13R68K073J959J330P96L78J43K92N89
$$ plain form
54209 96566 97179 97704 98581 100166 102166 104072 105695 106912 107465 107563 108182 110071 112858 115720 118501 121387
54193 121387 123900 125152 125023 124342 123921 124059 124898 126461 128274 129616 130220 130176 129192 126754 123147 119575
54177 119575 116921 115036 113490 112451 112303 112790 113057 112452 111023 109354 108084 107429 107075 106638 106188 106034
54161 106034 106051 105706 104978 104770 105980 108232 109907 109627 107736 106259 107195 110667 114774 117363 117784 116940
54145 116940 116115 116088 116869 117573 116834 114242 111406 110742 112910 116104 118073 118187 117236 116029 114887 113957 113184
54128 113184 112074 110101 107383 104596 102341 100953 100716 101643 102909 102989 100779 96676 92484 90169 90444
54113 90444 92316 93961 94137 92858 90984 89536 89284 90415 92249 93716 94534 95556 97472 99446 99815
54098 99815 98149 95948 94965 95434 96369 97102 97737 98240 97985 96683 95126 94343 94275 94048 93549 93813 95395 97047
$$ packed form
54209I6566O13N25Q77J585K000J906J623J217N53R8O19J889K787K862K781K886
54193A21387K513J252j29o81m21J38Q39J563J813J342O04m4r84k438l607l572
54177A19575k654j885j546j039j48M87K67o05j429j669j270o55l54m37m50j54
54161A06034J7l45p28k08J210K252J675k80j891j477R36L472M107K589M21q44
54145A16940q25k7P81P04p39k592k836o64K168L194J969J14r51j207j142r30p73
54128A13184j110j973k718k787k255j388k37R27J266Q0k210m103m192k315K75
54113I0444J872J645J76j279j874j448k52J131J834J467Q18J022J916J974L69
54098I9815j666k201r83M69R35P33O35N03k55j302j557p83o8k27m99K64J582J652
$$ plain form
54080 97047 96890 94629 91753 89455 87265 84240 80922 79220 80406 83779 87577 90737 93294 95335 96341
54065 96341 95965 94893 94188 93915 93189 91568 89498 87129 83836 79793 76938 76858 78209 77884 74915 71598
54049 71598 70286 70625 71025 71527 73552 77322 81160 83530 84603 85459 86662 88163 89991 92378 95316
54034 95316 98385 100982 102588 102917 102057 100521 99075 98327 98272 98321 97937 97262 96892 97097 97663 98469 99716 101362
54016 101362 102881 103882 104499 104918 105010 104896 105193 105952 105914 103855 100454 97823 97148 97804 98930 100713 103534
53999 103534 106683 108856 109624 109744 110219 111556 113850 117005 120692 124318 127229 129069 130086 131110 132983
53984 132983 135903 139421 143044 146511 149549 151891 153785 156113 159623 164238 169176 173510 176635 178741
53970 178741 181127 185411 191949 199434 206516 213267 220411 227764 234451 240441 246687 253700 261132 269042
$$ packed form
54080I7047j57k261k876k298k190l025l318j702J186L373L798L160K557K041J006
54065I6341l76j072p05k73p26j621k070k369l293m043k855q0J351l25k969l317
54049G1598j312L39M00N02K025L770L838K370J073Q56J203J501J828K387K938
54034I5316L069K597J606L29q60j536j446p48n5M9l84o75l70K05N66Q06J247J646
54016A01362J519J001O17M19R2j14K97P59l8k059l401k631o75O56J126J783K821
53999A03534L149K173P68J20M75J337K294L155L687L626K911J840J017J024J873
53984A32983K920L518L623L467L038K342J894K328L510M615M938M334L125K106
53970A78741K386M284O538P485P082O751P144P353O687N990O246P013P432P910
$$ plain form
53956 269042 278271 288729 298265 304429 306977 307711 308151 308396 308106 307282 305624 302218 296773 290650 285774
53941 285774 282688 280378 277907 275449 273444 271431 268297 263551 257956 252863 249086 246386 243868 240864
53927 240864 237461 234127 230967 227707 224472 222031 220824 220205 219348 218576 218773 219444 218669 215593 211916 209804
53911 209804 209073 207779 205224 202920 202439 203709 205901 208676 211811 214674 217023 219473 222144 223570 222256
53896 222256 218961 216220 215695 216983 218894 220708 222048 222714 223075 223833 225085 226397 227947 230624 234514
53881 234514 238273 240698 242319 244706 248694 253881 259431 264732 269563 274122 278630 282607 285023 285616
53867 285616 285566 286191 287339 287745 286779 285334 285106 287349 292063 297936 303347 307831 312351 317928 324457 331157
53851 331157 337505 343255 348295 353275 359656 368157 377601 386280 393973 401497 408780 414868 419757 424564
$$ packed form
53956B69042R229J0458R536O164K548P34M40K45k90q24j658l406n445o123m876
53941B85774l086k310k471k458k005k013l134m746n595n093l777k700k518l004
53927B40864l403l334l160l260l235k441j207o19q57p72J97O71p75l076l677k112
53911B09804p31j294k555k304m81J270K192K775L135K863K349K450K671J426j314
53896B22256l295k741n25J288J911J814J340O66L61P58J252J312J550K677L890
53881B34514L759K425J621K387L988N187N550N301M831M559M508L977K416N93
53867B85616n0O25J148M06r66j445k28K243M714N873N411M484M520N577O529O700
53851C31157O348N750N040M980O381Q501R444Q679P693P524P283O088M889M807
$$ plain form
53837 424564 429550 433356 434860 434691 434207 433899 433519 432984 432270 430901 428307 424399 419306 413005 405749 398451
53821 398451 391972 386234 380486 374224 367382 359834 351319 341815 331640 321200 310885 301148 292357
53808 292357 284527 277387 270777 264858 259701 254582 248046 239425 230464 224501 223066 223672 222029 216407
53794 216407 208981 203044 199970 199035 198813 198009 195789 192269 188522 185689 184365 184710 186338 187873 187655
53779 187655 185492 182961 181420 180486 179084 177128 175257 173575 171642 169326 166899 164706 163389 163760 165468
53764 165468 166473 165175 162816 162433 165317 169637 172766 173849 173714 173387 173433 174125 175399 176837 178151 179570
53748 179570 181404 183480 185384 187239 189858 193953 199329 205110 210783 216708 223376 230379 236598 241339
53734 241339 244868 247946 251348 255782 261459 267619 273272 278555 284444 290850 296244 299829 302897 306894
$$ packed form
53837D24564M986L806J504j69m84l08l80n35p14j369k594l908n093o301p256p298
53821C98451o479n738n748o262o842p548q515r504j0175j0440j0315r737q791
53808B92357p830p140o610n919n157n119o536q621q961n963j435O06j643n622
53794B16407p426n937l074r35k22q04k220l520l747k833j324L45J628J535k18
53779A87655k163k531j541r34j402j956j871j682j933k316k427k193j317L71J708
53764A65468J005j298k359l83K884M320L129J083j35l27M6O92J274J438J314J419
53748A79570J834K076J904J855K619M095N376N781N673N925O668P003O219M741
53734B41339L529L078L402M434N677O160N653N283N889O406N394L585L068L997
$$ plain form
53720 306894 311171 314033 315315 316374 317900 319387 320695 322496 324819 326557 326950 326516 326044 325592 324993
53705 324993 324422 323881 322883 321206 319292 317333 314605 310403 305234 300480 297040 294685 292521 289836 286787
53690 286787 284422 283666 284032 283743 281403 277268 272835 269546 267979 267673 267373 265939 263393 260743 258663
53675 258663 256825 254713 252430 250302 248343 246699 246063 246856 248261 248868 248199 246997 246087 245647 245660 246358
53659 246358 247750 249154 249706 249266 248576 248608 250013 252988 257213 261910 266474 271236 277105 284052 290521
53644 290521 295094 298453 302702 308717 315179 320550 324931 329319 334028 338850 344083 350244 357020 363504
53630 363504 369397 375161 381153 387428 394261 402075 410934 420710 431336 442007 450730 456082 459343 463442
53616 463442 469570 476162 481452 485512 489135 492117 493696 493820 493032 491707 490173 489004 488469 488180 487728
$$ packed form
53720C06894M277K862J282J059J526J487J308J801K323J738L93m34m72m52n99
53705C24993n71n41r98j677j914j959k728m202n169m754l440k355k164k685l049
53690B86787k365p56L66k89k340m135m433l289j567l06l00j434k546k650k080
53675B58663j838k112k283k128j959j644o36P93J405O07o69j202r10m40J3O98
53659B46358J392J404N52m40o90L2J405K975M225M697M564M762N869O947O469
53644B90521M573L359M249O015O462N371M381M388M709M822N233O161O776O484
53630C63504N893N764N992O275O833P814Q859R776J0626J0671Q723N352L261M099
53616D63442O128O592N290M060L623K982J579J24p88j325j534j169n35k89m52
$$ plain form
53601 487728 487046 485735 483004 479030 475534 474032 474176 474661 475115 475913 476660 476264 474523 472550 471421 471146
53585 471146 471049 470464 468926 466460 463917 462533 462811 463943 464446 463330 460969 459037 459170 461221 463189 463365
53569 463365 462250 461757 462817 464549 465733 466316 467367 470104 475121 481971 489191 495145 499269 502472 506299
53554 506299 511753 518781 526553 534207 541608 549488 558652 568947 579138 587945 595207 602056 609919 619390
53540 619390 630085 641431 653135 664752 675509 685260 695278 707133 720755 734430 746815 758130
53528 758130 769256 780630 792490 805217 818610 831346 841918 850039 856917 864423 873897 884985
53516 884985 895541 903555 909386 915182 921980 928654 934088 938720 943051 946272 947750 948598 950130 951839
53502 951839 952456 952052 951364 950059 947770 946074 946932 949444 950661 949778 949058 950099 951602 951791 950864 949775
$$ packed form
53601D87728o82j311k731l974l496j502J44M85M54P98P47l96j741j973j129k75
53585D71146r7n85j538k466k543j384K78J132N03j116k361j932J33K051J968J76
53569D63365j115m93J060J732J184N83J051K737N017O850P220N954M124L203L827
53554E06299N454P028P772P654P401P880R164J0295J0191Q807P262O849P863R471
53540F19390J0695J1346J1704J1617J0757R751J0018J1855J3622J3675J2385J1315
53528G58130J1126J1374J1860J2727J3393J2736J0572Q121O878P506R474J1088
53516H84985J0556Q014N831N796O798O674N434M632M331L221J478Q48J532J709
53502I51839O17m04o88j305k289j696Q58K512J217q83p20J041J503J89r27j089
$$ plain form
53486 949775 948420 946473 944566 943228 941864 940112 939116 940085 942510 945106 947547 950013 952058 953592 956258
53471 956258 961943 970216 978924 987181 996137 1006677 1018045 1029292 1040746 1053269 1066967 1081463
53459 1081463 1096926 1114182 1133929 1156113 1179958 1204646 1230249 1257784 1287940 1320041 1353003
53448 1353003 1387083 1423637 1462985 1503650 1544266 1585513 1629370 1676975 1727939 1781344 1836473
53437 1836473 1892608 1949090 2006112 2064965 2126842 2191417 2256968 2321954 2386186 2450390 2515076
53426 2515076 2580178 2645632 2711719 2778790 2847054 2916751 2988027 3060353 3132492 3203582 3274079
53415 3274079 3345021 3416277 3485932 3551771 3613265 3671913 3729524 3786250 3840499 3890903 3938026
53404 3938026 3983635 4028423 4071198 4110569 4146625 4180283 4211610 4239789 4264499 4286186 4304717
$$ packed form
53486I49775j355j947j907j338j364j752r96R69K425K596K441K466K045J534K666
53471I56258N685Q273Q708Q257Q956J0540J1368J1247J1454J2523J3698J4496
53459A081463J5463J7256J9747K2184K3845K4688K5603K7535L0156L2101L2962
53448A353003L4080L6554L9348M0665M0616M1247M3857M7605N0964N3405N5129
53437A836473N6135N6482N7022N8853O1877O4575O5551O4986O4232O4204O4686
53426B515076O5102O5454O6087O7071O8264O9697P1276P2326P2139P1090P0497
53415C274079P0942P1256O9655O5839O1494N8648N7611N6726N4249N0404M7123
53404C938026M5609M4788M2775L9371L6056L3658L1327K8179K4710K1687J8531
$$ plain form
53393 4304717 4318769 4327126 4330010 4328538 4323276 4313923 4300098 4281741 4258793 4231053 4198510 4161413
53381 4161413 4119965 4074403 4025502 3974544 3922452 3869283 3814817 3759242 3702725 3644673 3584233
53370 3584233 3521765 3459116 3398034 3338805 3280914 3224571 3170756 3119790 3070755 3022787 2976441
53359 2976441 2933235 2894011 2858280 2825340 2795697 2771039 2752744 2740660 2733617 2731056 2733613 2741793
53347 2741793 2754624 2770466 2789106 2812198 2841272 2876078 2915401 2958768 3006317 3057388 3110672
53336 3110672 3166227 3226388 3293747 3368509 3448470 3531416 3616925 3705998 3799814 3899191 4004520
53325 4004520 4115490 4230996 4349893 4472001 4598068 4728716 4863716 5002342 5144150
53316 5144150 5289171 5437468 5588541 5741012 5892897 6042539 6189569 6334901 6479515
$$ packed form
53393D304717J4052Q357K884j472n262r353j3825j8357k2948k7740l2543l7097
53381D161413m1448m5562m8901n0958n2092n3169n4466n5575n6517n8052o0440
53370C584233o2468o2649o1082n9229n7891n6343n3815n0966m9035m7968m6346
53359B976441m3206l9224l5731l2940k9643k4658j8295j2084p043k561K557Q180
53347B741793J2831J5842J8640K3092K9074L4806L9323M3367M7549N1071N3284
53336C110672N5555O0161O7359P4762P9961Q2946Q5509Q9073R3816R9377J05329
53325D004520J10970J15506J18897J22108J26067J30648J35000J38626J41808
53316E144150J45021J48297J51073J52471J51885J49642J47030J45332J44614
$$ plain form
53307 6479515 6623125 6763988 6899946 7029689 7153048 7270080 7379996 7481392 7573855 7658834
53297 7658834 7738154 7811653 7876939 7931532 7974611 8006543 8027752 8038625 8039619 8030423 8009317 7974162
53285 7974162 7923879 7858510 7778408 7684302 7577761 7460638 7334244 7200071 7061031 6920511
53275 6920511 6779687 6636811 6489738 6338602 6185734 6033787 5884275 5737114 5590833
53266 5590833 5443752 5295626 5148075 5003394 4863450 4729618 4602571 4481470 4364376
53257 4364376 4250523 4141655 4040091 3945864 3856730 3770859 3688547 3611188 3539482 3473060 3411459
53246 3411459 3355009 3304695 3261054 3223212 3189413 3158811 3132344 3111417 3096066 3084839 3076231
53235 3076231 3069677 3065453 3064258 3066772 3073103 3082667 3095035 3110628 3130029 3152901 3178363 3206404
$$ packed form
53307F479515J43610J40863J35958J29743J23359J17032J09916J01396R2463Q4979
53297G658834P9320P3499O5286N4593M3079L1932K1209J0873R94r196k1106l5155
53285G974162n0283o5369q0102r4106j06541j17123j26394j34173j39040j40520
53275F920511j40824j42876j47073j51136j52868j51947j49512j47161j46281
53266E590833j47081j48126j47551j44681j39944j33832j27047j21101j17094
53257D364376j13853j08868j01564r4227q9134q5871q2312p7359p1706o6422o1601
53246C411459n6450n0314m3641l7842l3799l0602k6467k0927j5351j1227q608
53235C076231o554m224j195K514O331R564J2368J5593J9401K2872K5462K8041
$$ plain form
53223 3206404 3238221 3275021 3317077 3363931 3414879 3468989 3525251 3583064 3642328 3703007 3764862
53212 3764862 3827559 3890616 3953376 4015559 4077664 4140182 4202459 4263077 4321325 4377383 4430910
53201 4430910 4480591 4525633 4566748 4604871 4639548 4669381 4693544 4712007 4724613 4730835 4730281 4722762
53189 4722762 4708043 4686194 4657974 4624092 4584172 4537313 4483705 4424842 4361961 4295180 4224539
53178 4224539 4151035 4075858 3999114 3920124 3838834 3756249 3673365 3590233 3506274 3421337 3336263
53167 3336263 3252493 3171085 3091974 3014083 2936190 2857706 2778799 2700168 2622848 2547969 2476263
53156 2476263 2407760 2342066 2278865 2218019 2159314 2102479 2047550 1995043 1945595 1899292 1855336
53145 1855336 1812551 1770537 1730213 1692621 1657052 1621058 1582930 1543680 1505867 1470812 1437858
$$ packed form
53223C206404L1817L6800M2056M6854N0948N4110N6262N7813N9264O0679O1855
53212C764862O2697O3057O2760O2183O2105O2518O2277O0618N8248N6058N3527
53201D430910M9681M5042M1115L8123L4677K9833K4163J8463J2606O222n54p519
53189D722762j4719k1849k8220l3882l9920m6859n3608n8863o2881o6781p0641
53178D224539p3504p5177p6744p8990q1290q2585q2884q3132q3959q4937q5074
53167C336263q3770q1408p9111p7891p7893p8484p8907p8631p7320p4879p1706
53156B476263o8503o5694o3201o0846n8705n6835n4929n2507m9448m6303m3956
53145A855336m2785m2014m0324l7592l5569l5994l8128l9250l7813l5055l2954
$$ plain form
53134 1437858 1406106 1375583 1346318 1317422 1287902 1257789 1227763 1198137 1168870 1140172 1112249
53123 1112249 1084640 1056580 1028075 1000125 973757 949151 925630 902233 878460 854868 832792
53112 832792 813105 795355 778271 760781 742302 722691 702664 683868 667684 654055 642029
53101 642029 631046 620915 610923 600087 588265 576105 564008 552175 541489 532913 525810 518271
53089 518271 509607 501256 494620 489278 484073 478649 472876 466074 458278 451358 447211 445160 442622 438239
53075 438239 433034 428500 424955 422071 419827 418272 417065 415906 415085 415079 415617 415471 413498 410171 407802 408488
53059 408488 411694 414754 416027 416461 417455 418675 419283 420158 422856 426895 430112 431796 433588 436905 441145
53044 441145 444926 447576 448696 447757 445129 442388 440567 438985 436586 433453 430044 425859 420115 413179
$$ packed form
53134A437858l1752l0523k9265k8896k9520l0113l0026k9626k9267k8698k7923
53123A112249k7609k8060k8505k7950k6368k4606k3521k3397k3773k3592k2076
53112H32792j9687j7750j7084j7490j8479j9611k0027j8796j6184j3629j2026
53101F42029j0983j0131r992j0836j1822j2160j2097j1833j0686q576p103p539
53089E18271q664q351o636n342n205n424n773o802p796o920m147k051k538m383
53075D38239n205m534l545k884k244j555j207j159q21oN38j46j973l327k369O86
53059D08488L206L060J273M34R94J220O08Q75K698M039L217J684J792L317M240
53044D41145L781K650J120r39k628k741j821j582k399l133l409m185n744o936
$$ plain form
53030 413179 406239 399894 393919 388060 382097 375442 367671 359409 351942 345969 341284 337517 334536 332202
53016 332202 330168 327840 324332 318996 312445 306485 302376 299615 297070 294595 292505 290137 286441 281924
53002 281924 278506 277040 276124 273936 270372 266844 264699 264376 265449 266809 267199 266224 264694 263641 263274
52987 263274 263188 263229 263618 264345 264862 264456 262765 259968 256579 253050 249628 246658 244747 244212 244464 244473 243913 243340
52969 243340 243096 242667 241406 239367 236941 234137 230857 227653 225368 223978 222395 219863 217216 216197 217382
52954 217382 219062 218525 214543 208514 203124 200183 199751 200839 202304 203269 203389 203032 202835 203046 203603 204689
52938 204689 206480 208300 209028 208736 209051 211117 213895 215379 215062 214157 213700 213523 213122 212457 211672 211003 211353
52921 211353 213954 218754 223797 227030 228440 229777 232436 236232 240107 243348 246016 248641 251653 254875
$$ packed form
53030D13179o940o345n975n859n963o655p771q262p467n973m685l767k981k334
53016C32202k034k328l508n336o551n960m109k761k545k475k090k368l696m517
53002B81924l418j466r16k188l564l528k145l23J073J360L90r75j530j053l67
52987B63274q6M1L89P27N17m06j691k797l389l529l422k970j911n35K52Rn60n73
52969B43340k44m29j261k039k426k804l280l204k285j390j583k532k647j019J185
52954B17382J680n37l982o029n390k941m32J088J465R65J20l57j97K11N57J086
52938B04689J791J820P28k92L15K066K778J484l17r05m57j77m01o65p85o69L50
52921B11353K601M800N043L233J410J337K659L796L875L241K668K625L012L222
$$ plain form
52907 254875 257603 259485 261360 264873 271067 279414 288214 295852 301787 306564 311053 315668 320290 324709
52893 324709 328757 332012 333857 334211 333896 333922 334534 335199 335288 334375 332228 329101 325980 323907 322897 321882
52877 321882 319837 316587 312567 308308 304376 301338 299391 298140 296905 295194 292860 290032 286854 283192
52863 283192 278789 274095 270646 269896 271593 273948 275566 276542 277462 278210 278380 278271 278688 279900 281372 282404
52847 282404 282749 282846 283742 286342 290253 293703 295204 295008 294438 294166 293866 293307 292802 292559 292307 291745 290826 289522
52829 289522 287882 286401 285720 285905 286560 287739 290033 293581 297715 301894 306230 310621 314029 315392 314891
52814 314891 313697 312640 311754 311033 310940 311993 314039 316088 316829 315592 313149 311425 312003 314781 318235 320933
52798 320933 322618 323976 325747 328179 331040 333842 336100 337554 338360 339155 340896 344365 349564 355394 360086
$$ packed form
52907B54875K728J882J875L513O194Q347Q800P638N935M777M489M615M622M419
52893C24709M048L255J845L54l15K6O12O65Q9r13k147l127l121k073j010j015
52877C21882k045l250m020m259l932l038j947j251j235j711k334k828l178l662
52863B83192m403m694l449p50J697K355J618R76R20P48J70j09M17J212J472J032
52847B82404L45R7Q96K600L911L450J501j96n70k72l00n59n05k43k52n62r19j304
52829B89522j640j481o81J85O55J179K294L548M134M179M336M391L408J363n01
52814C14891j194j057q86p21r3J053K046K049P41j237k443j724N78K778L454K698
52798C20933J685J358J771K432K861K802K258J454Q06P95J741L469N199N830M692
$$ plain form
52783 360086 362353 362571 362837 365425 370952 378202 385779 393355 401024 408204 414072 418731 422879 426337 428024
52768 428024 427669 426520 425733 424934 423140 420425 417733 415361 412515 408333 402705 396166 389526 383489 378168
52753 378168 373096 368086 363658 360039 356240 351095 345047 339720 335657 331699 327033 322601 319571 317315
52739 317315 314162 309707 305142 301285 297467 292742 287313 282148 277741 273895 270404 267355 264840 262986
52725 262986 262180 262671 263748 263924 262388 259919 257903 256676 255378 253335 250930 248952 247586 246386 244867
52710 244867 242876 240724 239266 239327 240495 240846 238652 234401 230418 228337 227564 226524 224718 222915 221796
52695 221796 221259 221083 221391 222023 221914 219814 215654 210785 206685 203637 200785 197270 193106 189063 185795
52680 185795 183029 179579 174475 168296 163034 160105 158767 157150 154803 153246 153671 155038 155326 154045 152496
$$ packed form
52783C60086K267K18K66K588N527P250P577P576P669P180N868M659M148L458J687
52768D28024l55j149p87p99j794k715k692k372k846m182n628o539o640o037n321
52753C78168n072n010m428l619l799n145o048n327m063l958m666m432l030k256
52739C17315l153m455m565l857l818m725n429n165m407l846l491l049k515j854
52725B62986q06M91J077J76j536k469k016j227j298k043k405j978j366j200j519
52710B44867j991k152j458O1J168L51k194m251l983k081p73j040j806j803j119
52695B21796n37j76L08O32j09k100m160m869m100l048k852l515m164m043l268
52680A85795k766l450n104o179n262k929j338j617k347j557M25J367K88j281j549
$$ plain form
52665 152496 151843 152095 153032 154802 157028 158301 157597 155756 154695 155314 156850 158156 158786 158760 158048 156808
52649 156808 155619 154995 154811 154603 154283 154211 154580 155078 155325 155438 155945 157156 158764 160224 161456 163025 165496
52632 165496 168780 172360 176063 180239 185050 189899 193875 196617 198411 199524 199901 199596 199145 199137 199526 199644
52616 199644 198871 197164 194924 192561 190306 188257 186385 184411 181850 178405 174339 170342 166858 163656
52602 163656 160141 156015 151536 147241 143620 140992 139370 138372 137497 136510 135424 134134 132448 130523 128860
52587 128860 127670 126669 125722 125149 125012 124623 123478 122345 122491 123801 124570 123499 121199 119222 118207 117636
52571 117636 117077 116852 117327 118083 118201 117246 115753 114715 114721 115740 117681 120704 124535 127759 128630 126945 124568
52554 124568 123565 124097 124686 124293 123422 123072 123340 123560 123438 123387 123646 123661 122804 121496 121107 122465 124914 127249
$$ packed form
52665A52496o53K52R37J770K226J273p04j841j061O19J536J306O30k6p12j240
52649A56808j189o24j84k08l20p2L69M98K47J13N07J211J608J460J232J569K471
52632A65496L284L580L703M176M811M849L976K742J794J113L77l05m51qL89J18
52616A99644p73j707k240k363k255k049j872j974k561l445m066l997l484l202
52602A63656l515m126m479m295l621k628j622r98q75r87j086j290j686j925j663
52587A28860j190j001r47n73j37l89j145j133J46J310P69j071k300j977j015n71
52571A17636n59k25M75P56J18r55j493j038OJ019J941L023L831L224Q71j685k377
52554A24568j003N32N89l93q71l50K68K20j22n1K59J5q57j308l89J358K449K335
$$ plain form
52536 127249 129329 132113 135997 139871 142294 143202 143764 144686 145406 145115 143979 142895 142502 142904 144087 145958
52520 145958 148054 149885 151752 154492 157993 160639 161044 159969 159576 160932 163248 165703 168806 173339 178877
52505 178877 184229 188699 192022 193626 193117 191281 189663 189157 189723 191085 192691 193372 192462 191235 191742 193948
52489 193948 195650 195834 196412 199401 203723 206511 206775 206113 206107 206696 207234 207631 208030 208384 208852 209797 211042 211908
52471 211908 212402 213627 216414 220065 223044 224609 225243 225707 226233 226690 227054 227462 227899 228140 228128 228189 228543 228653
52453 228653 227597 225372 223309 222666 223111 223230 222408 221528 221661 222708 223733 224225 224521 224961 225063 223946 221602
52436 221602 219346 218503 218751 218442 216684 214478 213461 214219 216339 219348 222661 225148 225906 225499 225507 226830
52420 226830 229120 231766 234379 236227 236294 234471 232032 230483 230361 231301 232595 233470 233595 233740 235211 238142
$$ packed form
52536A27249K080K784L884L874K423R08N62R22P20k91j136j084l93M02J183J871
52520A45958K096J831J867K740L501K646M05j075l93J356K316K455L103M533N538
52505A78877N352M470L323J604n09j836j618n06N66J362J606O81r10j227N07K206
52489A93948J702J84N78K989M322K788K64o62oN89N38L97L99L54M68R45J245Q66
52471B11908M94J225K787L651K979J565O34M64N26M57L64M08M37K41j2O1L54J10
52453B28653j056k225k063o43M45J19q22q80J33J047J025M92K96M40J02j117k344
52436B21602k256q43K48l09j758k206j017P58K120L009L313K487P58m07QJ323
52420B26830K290K646K613J848O7j823k439j549j22R40J294Q75J25J45J471K931
$$ plain form
52404 238142 241082 242836 244015 245931 248639 251186 253478 256524 260466 263475 263514 260921 258469 258757 261894
52389 261894 265939 269197 271498 273282 274227 273603 271734 270226 270352 271713 272887 273129 273085 273995 276404 279550
52373 279550 281863 282236 280904 278974 277221 275658 274120 272602 270942 268815 266394 264420 263209 262176
52359 262176 260791 259433 258668 258261 257738 257419 257813 258182 257035 254320 251977 251647 252705 253440 253585 254584 257476
52342 257476 261452 264793 266533 266903 266646 266410 266553 267101 267831 268507 269005 269217 269202 269565 271199 274193 277316
52325 277316 279135 279567 279832 281025 283342 286560 290470 294617 298376 301588 304554 307201 309112 310668 313163
52310 313163 317055 321002 323578 325231 327429 330574 334118 338320 344129 351171 357426 361495 364090 366810
$$ packed form
52404B38142K940J754J179J916K708K547K292L046L942L009L9k593k452K88L137
52389B61894M045L258K301J784R45o24j869j508J26J361J174K42m4R10K409L146
52373B79550K313L73j332j930j753j563j538j518j660k127k421j974j211j033
52359B62176j385j358p65m07n23l19L94L69j147k715k343l30J058P35J45R99K892
52342B57476L976L341J740L70k57k36J43N48P30O76M98K12j5L63J634K994L123
52325B77316J819M32K65J193K317L218L910M147L759L212K966K647J911J556K495
52310C13163L892L947K576J653K198L145L544M202N809P042O255M069K595K720
$$ [...]
##END NTUPLES=NMR SPECTRUM
##END=
