
##TITLE=AC1079_MACI01_5835926_jtKjstPYi0
##JCAMPDX= 6.0         $$ Bruker NMR JCAMP-DX V2.0
##DATA TYPE= NMR SPECTRUM
##DATA CLASS= NTUPLES
##ORIGIN= BRUKER
##OWNER= Administrator
$$ 1.72 TOPSPIN		Version 2.1
$$ 2012-03-28 11:07:15.640 -0500  Administrator@TOPSPIN
$$ Compression mode = diff/dup
##.OBSERVE FREQUENCY= 400.13188235
##.OBSERVE NUCLEUS= ^1H
##.ACQUISITION MODE= SIMULTANEOUS (DQD)
##.ACQUISITION SCHEME= undefined
##.AVERAGES= 64
##.DIGITISER RES= 22
##SPECTROMETER/DATA SYSTEM= spect
##.PULSE SEQUENCE= noesygpps1d.comp
##.SOLVENT NAME= COFFEE_meoh
##.SHIFT REFERENCE= INTERNAL, COFFEE_meoh, 1, 14.96811
##AUDIT TRAIL= $$ (NUMBER, WHEN, WHO, WHERE, PROCESS, VERSION, WHAT)
$$ ##TITLE= Audit trail, TOPSPIN		Version 2.1
$$ ##JCAMPDX= 5.01
$$ ##ORIGIN= Bruker BioSpin GmbH
$$ ##OWNER= Administrator
$$ $$ C:\Bruker\TOPSPIN/data/COFFEE/nmr/AC1079_MACI01_5835926_jtKjstPYi0/12/pdata/1/auditp.txt
$$ ##AUDIT TRAIL=  $$ (NUMBER, WHEN, WHO, WHERE, PROCESS, VERSION, WHAT)
(   1,<2012-03-28 01:37:32.640 -0500>,<Administrator>,<TOPSPIN>,<go>,<TOPSPIN 2.1>,
      <created by zg
	started at 2012-03-28 01:26:00.953 -0500,
	POWCHK enabled, PULCHK disabled,
       configuration hash MD5:
       1A 1E CE 29 27 FD 77 03 67 4E F0 E3 C4 B2 CB 90
       data hash MD5: 64K
       C5 D7 41 BA 6A 45 5C 9C A3 B4 F0 AF 8E AA 0E E9>)
(   2,<2012-03-28 01:37:38.562 -0500>,<Administrator>,<TOPSPIN>,<proc1d>,<TOPSPIN 2.1>,
      <Start of raw data processing
       efp LB = 0.3 FT_mod = 6 PKNL = 1 PHC0 = 0 PHC1 = 0 SI = 128K 
       data hash MD5: 128K
       CA 31 74 73 53 87 F3 21 E5 F2 C7 FC D3 F2 4E 2B>)
(   3,<2012-03-28 01:37:39.781 -0500>,<Administrator>,<TOPSPIN>,<proc1d>,<TOPSPIN 2.1>,
      <pk PHC0 = 32.16797 PHC1 = 0 
       data hash MD5: 128K
       FB A2 32 00 86 D6 26 61 EE 10 12 6D D5 D2 49 31>)
(   4,<2012-03-28 01:37:40.234 -0500>,<Administrator>,<TOPSPIN>,<proc1d>,<TOPSPIN 2.1>,
      <abs ABSG = 1 
       data hash MD5: 128K
       27 AE 55 1C A3 7A 2E 75 DF 8C 75 13 90 31 A8 43>)
(   5,<2012-03-28 01:37:40.312 -0500>,<Administrator>,<TOPSPIN>,<proc1d>,<TOPSPIN 2.1>,
      <abs ABSG = 2 
       data hash MD5: 128K
       42 37 9F 2B 9F E5 BA 81 0A EC 4C B2 78 B9 32 2E>)
(   6,<2012-03-28 01:37:40.390 -0500>,<Administrator>,<TOPSPIN>,<proc1d>,<TOPSPIN 2.1>,
      <abs ABSG = 3 
       data hash MD5: 128K
       AE 32 A6 57 37 B8 B9 8A A0 89 48 D9 39 B5 E8 05>)
(   7,<2012-03-28 01:37:40.453 -0500>,<Administrator>,<TOPSPIN>,<proc1d>,<TOPSPIN 2.1>,
      <abs ABSG = 4 
       data hash MD5: 128K
       21 DA D1 7D 01 2C 5E 2E 20 88 20 78 13 1B 8E 5D>)
(   8,<2012-03-28 01:37:40.515 -0500>,<Administrator>,<TOPSPIN>,<proc1d>,<TOPSPIN 2.1>,
      <abs ABSG = 5 
       data hash MD5: 128K
       87 1D 95 8D A7 1B 04 DA BF F7 AE 8F 4E 82 B6 8B>)
(   9,<2012-03-28 01:37:41.343 -0500>,<Administrator>,<TOPSPIN>,<audit>,<TOPSPIN 2.1>,
      <user comment:
       ICON-NMR User ID: COFFEE
       data hash MD5: 128K
$$ [...]
##$TP07= 0
##$TPNAME0= <>
##$TPNAME1= <>
##$TPNAME2= <>
##$TPNAME3= <>
##$TPNAME4= <>
##$TPNAME5= <>
##$TPNAME6= <>
##$TPNAME7= <>
##$TPOAL= (0..7)
0.5 0.5 0.5 0.5 0.5 0.5 0.5 0.5
##$TPOFFS= (0..7)
0 0 0 0 0 0 0 0
##$TUNHIN= 0
##$TUNHOUT= 0
##$TUNXOUT= 0
##$USERA1= <user>
##$USERA2= <user>
##$USERA3= <user>
##$USERA4= <user>
##$USERA5= <user>
##$V9= 5
##$VALIST= <valist>
##$VCLIST= <CCCCCCCCCCCCCCC>
##$VD= 0
##$VDLIST= <DDDDDDDDDDDDDDD>
##$VPLIST= <PPPPPPPPPPPPPPP>
##$VTLIST= <TTTTTTTTTTTTTTT>
##$WBST= 2048
##$WBSW= 25
##$XGAIN= (0..3)
0 0 0 0
##$XL= 0
##$YL= 0
##$YMAX_a= 13257493
##$YMIN_a= -5623291
##$ZGOPTNS= <>
##$ZL1= 120
##$ZL2= 120
##$ZL3= 120
##$ZL4= 120
##$ABSF1= 14.96811
##$ABSF2= -5.58442
##$ABSG= 5
##$ABSL= 3
##$ALPHA= 0
##$AQORDER= 0
##$ASSFAC= 0
##$ASSFACI= 0
##$ASSFACX= 0
##$ASSWID= 0
##$AUNMP= <proc_prof1d_extract.lims>
##$AXLEFT= 0
##$AXNAME= <>
##$AXNUC= <1H>
##$AXRIGHT= 0
##$AXTYPE= 0
##$AXUNIT= <>
##$AZFE= 0.1
##$AZFW= 0.1
##$BCFW= 0
##$BC_mod= 0
##$BYTORDP= 0
##$COROFFS= 0
##$CY= 15
##$DATMOD= 1
##$DC= 0
##$DFILT= <>
##$DTYPP= 0
##$F1P= 0
##$F2P= 0
##$FCOR= 0.5
##$FTSIZE= 131072
##$FT_mod= 6
##$GAMMA= 0
##$GB= 0
##$INTBC= 1
##$INTSCL= 1
##$ISEN= 128
##$LB= 0.3
##$LEV0= 0
##$LPBIN= 0
##$MAXI= 10000
##$MC2= 0
##$MEAN= 0
##$ME_mod= 0
##$MI= 0
##$NCOEF= 0
##$NC_proc= -3
##$NLEV= 6
##$NOISF1= 0
##$NOISF2= 0
##$NSP= 0
##$NTH_PI= 0
##$NZP= 0
##$OFFSET= 14.96811
##$PC= 1
##$PHC0= 32.16797
##$PHC1= 0
##$PH_mod= 1
##$PKNL= yes
##$PPARMOD= 0
##$PPDIAG= 0
##$PPIPTYP= 0
##$PPMPNUM= 2147483647
##$PPRESOL= 1
##$PSCAL= 4
##$PSIGN= 0
##$PYNMP= <proc.py>
##$REVERSE= no
##$SF= 400.130005003283
##$SI= 131072
##$SIGF1= 0
##$SIGF2= 0
##$SINO= 400
##$SIOLD= 131072
##$SPECTYP= <>
##$SREGLST= <1H.CDCl3>
##$SSB= 0
##$STSI= 131072
##$STSR= 0
##$SW_p= 8223.68421052632
##$SYMM= 0
##$S_DEV= 0
##$TDeff= 65536
##$TDoff= 0
##$TI= <>
##$TILT= no
##$TM1= 0
##$TM2= 0
##$TOPLEV= 0
##$USERP1= <user>
##$USERP2= <user>
##$USERP3= <user>
##$USERP4= <user>
##$USERP5= <user>
##$WDW= 1
##$XDIM= 131072
##$YMAX_p= 474961408
##$YMIN_p= -344734064
##$CURPLOT= <Network HP LaserJet P1505>
##$CURPRIN= <$Network HP LaserJet P1505>
##$DFORMAT= <normdp>
##$LAYOUT= <+/1D_H.xwp>
##$LFORMAT= <normlp>
##$PFORMAT= <normpl>
##$SURQMSG= 1
$$ End of Bruker specific parameters
$$ ---------------------------------
##NTUPLES= NMR SPECTRUM
##VAR_NAME=  FREQUENCY,     SPECTRUM/REAL,   SPECTRUM/IMAG
##SYMBOL=    X,             R,               I
##VAR_TYPE=  INDEPENDENT,   DEPENDENT,       DEPENDENT
##VAR_FORM=  AFFN,          ASDF,            ASDF
##VAR_DIM=   131072,        131072,          131072
##UNITS=     HZ,            ARBITRARY UNITS, ARBITRARY UNITS
##FACTOR=    0.0627417313425165, 1,          1
##FIRST=     8223.62146879498, 6243,         -97151
##LAST=      0,             6453,            -97026
##MIN=       0,             -344734064,      0
##MAX=       8223.62146879498, 474961408,    0
$$ Real data points
##PAGE= N=1
##DATA TABLE= (X++(R..R)), XYDATA
$$ [...]
62971C752536O3041N9077N2830M4403L4767K4079J1389l450j8912l3621m7645
$$ 3752536 3815577 3874654 3927484 3971887 4006654 4030733 4042122 4038672 4019760 3986139 3938494
62960C938494o1082p2838q1994q9013r4161r6098r3832q9033q4373q0238p5029
$$ 3938494 3877412 3804574 3722580 3633567 3539406 3443308 3349476 3260443 3176070 3095832 3020803
62949C020803o8219o0900n3442m4862l4954k5108j6308q052N3P152J2609J7256
$$ 3020803 2952584 2891684 2838242 2793380 2758426 2733318 2717010 2708958 2709011 2716163 2728772 2746028
62937B746028K2043K6457K9538L1568L3524L5289L5805L4937L3890L3400L2497
$$ 2746028 2768071 2794528 2824066 2855634 2889158 2924447 2960252 2995189 3029079 3062479 3094976
62926C094976K9805K5549K1218J7232J1884L343p797j8954k8540l7421m7101n7533
$$ 3094976 3124781 3150330 3171548 3188780 3200664 3204007 3196210 3177256 3148716 3111295 3064194 3006661
62914C006661o7535p6478q4340r0583r4289r5499r5289r4427r2743q9983q6417
$$ 3006661 2939126 2862648 2778308 2687725 2593436 2497937 2402648 2308221 2215478 2125495 2039078
62903B039078q2372p7961p3524o9581o5984o1801n6519n0876m5979m2007l8281
$$ 2039078 1956706 1878745 1805221 1735640 1669656 1607855 1551336 1500460 1454481 1412474 1374193
62892A374193l4380l0729k7978k6159k4684k3147k1789k0877j9884j7955j5351
$$ 1374193 1339813 1309084 1281106 1254947 1230263 1207116 1185327 1164450 1144566 1126611 1111260
62881A111260j3645j3954j5460j6276j5426j3450j1461j0237r920j0061j0138
$$ 1111260 1097615 1083661 1068201 1051925 1036499 1023049 1011588 1001351 991431 981370 971232
62870I71232j0368j1463j3226j4209j3489j1919j0643r350p306n302m825n692
$$ 971232 960864 949401 936175 921966 908477 896558 885915 876565 869259 863957 859132 853440
62858H53440o346o284o288o189m600j515Q30P15q90j984k010j621j191q22q69
$$ 853440 847094 840810 834522 828333 823733 822218 823048 823763 822873 820889 818879 817258 816067 815245 814376
62843H14376j301j308n29J73J84L42J466K558K076M39m25J18P17K41p62j185p28
$$ 814376 813075 811767 811238 811411 811595 811937 813403 815961 818037 818476 818051 818169 818886 819127 818365 817180 816452
62826H16452L86J974L510L922K590K09j921l121l503l236k238o29R97J831J310
$$ 816452 816838 818812 822322 826244 828834 829043 827122 824001 820498 817262 815024 814395 815392 817223 818533
62811H18533n64l131n304o244n999n346m907m657m414m377m704m845m179l242
$$ 818533 817969 814838 809534 803290 797291 791945 787038 782381 777967 773590 768886 764041 759862 756620
62797G56620l350m590n352m533l246l187m044l965k236m0J304J399R1k580n339
$$ 756620 753270 748680 743328 738795 735549 732362 728318 724353 722117 722077 723381 724780 724871 722291 716952
62782G16952o080m143j161R48J752J741J361J397K850N346O808N977M196L455
$$ 716952 710872 706729 705568 706516 708268 710009 711370 712767 715617 720963 727771 733748 737944 741399
62768G41399L652L431K845L215M616N410M647L333K825L149L561L875M523N856
$$ 741399 745051 748482 751327 754542 759158 764568 769215 772548 775373 778522 782083 785958 790481 796337
62754G96337P841J0060J1710J2049J1256J0536J0970J2288J3001J2006J0087R557
$$ 796337 804178 814238 825948 837997 849253 859789 870759 883047 896048 908054 918141 927698
62742I27698J1867J5719J8432J9103J9413K0875K2754K3842K5050K8398L3738
$$ 927698 939565 955284 973716 992819 1012232 1033107 1055861 1079703 1104753 1133151 1166889
62731A166889L8372M0260M0347M1176M4177M8807N3680N7988O2118O7085P3209
$$ 1166889 1205261 1245521 1285868 1327044 1371221 1420028 1473708 1531696 1593814 1660899 1734108
62720A734108P9571Q5185R0346R6080J02594J09172J15484J21868J28118J32864
$$ 1734108 1813679 1898864 1989210 2085290 2187884 2297056 2412540 2534408 2662526 2795390
62710B795390J34572J32741J28005J21448J13595J03638Q9970P2195N2087L1692
$$ 2795390 2929962 3062703 3190708 3312156 3425751 3529389 3619359 3691554 3743641 3775333
62700C775333J1112j0554l2677n3289p1619q8437j03565j15200j22537j27263
$$ 3775333 3786445 3775891 3743214 3689925 3618306 3529869 3426304 3311104 3188567 3061304
62690C061304j31262j34289j34991j32944j28419j21615j13545j06449j01430
$$ 3061304 2930042 2795753 2660762 2527818 2399399 2277784 2164239 2057790 1956360
62681A956360r6712r0051q2186p5815p1630o7562o2033n5847n0252m5088l9853
$$ 1956360 1859648 1769597 1687411 1611596 1539966 1472404 1410371 1354524 1304272 1259184 1219331
62670A219331l5144l1793k9364k6630k3148j9566j6661j4520j2483r677n904k145
$$ 1219331 1184187 1152394 1123030 1096400 1073252 1053686 1037025 1022505 1010022 1000345 994441 992296
62658I92296K72J112J379K096L643O301J0387J5288J9259K0982K0937K0829K2106
$$ 992296 992568 993680 995059 997155 1000798 1007099 1017486 1032774 1052033 1073015 1093952 1114781 1136887
62645A136887K5382L0506L6382M1300M4521M7361N1817N8075O4215O8471P1070
$$ 1136887 1162269 1192775 1229157 1270457 1314978 1362339 1414156 1472231 1536446 1604917 1675987
62634A675987P3600P7181Q1737Q6560R1013R4526R6335R5372R0706Q2269P1222
$$ 1675987 1749587 1826768 1908505 1995065 2086078 2180604 2276939 2372311 2463017 2545286 2616508
62623B616508N9279M7324L4767K0490M454j2061k7869m2925n7400p0342q0343
$$ 2616508 2675787 2723111 2757878 2778368 2782822 2770761 2742892 2699967 2642567 2572225 2491882
62612B491882q7496r3322r8351j01118j00626r8397r6478r4338q9900q3294p7163
$$ 2491882 2404386 2311064 2212713 2111595 2010969 1912572 1816094 1721756 1631856 1548562 1471399
62601A471399p2955o9260o4748o0344n6950n3142m7346m0885l6351l3849l1302
$$ 1471399 1398444 1329184 1264436 1204092 1147142 1094000 1046654 1005769 969418 935569 904267
62590I04267k7976k5182k3376k1278j8442j6452j6445j7208j6986j5756j4612
$$ 904267 876291 851109 827733 806455 788013 771561 755116 737908 720922 705166 690554
62579F90554j4010j3732j3609j3248j1924r658p621o564n759m385l001k492k422
$$ 690554 676544 662812 649203 635955 624031 614373 606752 600188 594429 590044 587043 584551 582129
62566E82129j751o17n0l01o55o66m41P9J119K382L358M225N648P721R817J1241
$$ 582129 580378 579761 579711 579410 578755 578089 577648 577727 578846 581228 584586 588811 594459 602180 611997 623238
62550F23238J1556J0732R685J0047J2394J5346J7374J8882K1176K4125K6521K8347
$$ 623238 634794 645526 655211 665258 677652 692998 710372 729254 750430 774555 801076 829423
62538H29423L0747L3839L6567L9020M2815M8411N3898N7508N9859O2477O5400
$$ 829423 860170 894009 930576 969596 1012411 1060822 1114720 1172228 1232087 1294564 1359964
62527A359964O7519O8295O7829O6051O3029N9283N4607M7412L6735K4329J2967
$$ 1359964 1427483 1495778 1563607 1629658 1692687 1751970 1806577 1853989 1890724 1915053 1928020
62516A928020K900q143k1088l3449m2101m6958n0628n5112o0061o4058o6231o6282
$$ 1928020 1930920 1922777 1901689 1868240 1826139 1779181 1728553 1673441 1613380 1549322 1483091 1416809
62504A416809o4085o0274n6573n4345n2797m9717m4381l8698l4799l2427k9767
$$ 1416809 1352724 1292450 1235877 1181532 1128735 1079018 1034637 995939 961140 928713 898946
62493H98946k6212k2919k0819j9447j8105j6951j6307j5716j4396j2354j0515
$$ 898946 872734 849815 828996 809549 791444 774493 758186 742470 728074 715720 705205
62482G05205r884j0642j1815j1948j0442q086n921m114k542j760k092k307p91
$$ 705205 695321 684679 672864 660916 650474 642388 636467 632353 629811 628051 625959 623652 622861
62469F22861K051M255N312O848R792J2763J4300J4993J6028J7110J7439J7784
$$ 622861 624912 629167 634479 641327 651119 663882 678182 693175 709203 726313 743752 761536
62457G61536J9772K3606K7886L1384L3808L5192L5735L6253L7851M1028M5383
$$ 761536 781308 804914 832800 864184 897992 933184 968919 1005172 1043023 1084051 1129434
62446A129434M9740N2395N2212M9981M7652M5488M1301L3579K3960J5164P575
$$ 1129434 1179174 1231569 1283781 1333762 1381414 1426902 1468203 1501782 1525742 1540906 1548481
62435A548481l21r046j7595k5272l2066l7495m0907m2872m4614m6150m6454m5256
$$ 1548481 1548160 1539114 1521519 1496247 1464181 1426686 1385779 1342907 1298293 1252143 1205689 1160433
62423A160433m3098l9990l5914l2258l0538k9738k7292k3004j9522j8279j7488
$$ 1160433 1117335 1077345 1041431 1009173 978635 948897 921605 898601 879079 860800 843312
62412H43312j5355j2850j1626j1154j0017q538q005q180p656o221n038m573l961
$$ 843312 827957 815107 803481 792327 782310 773772 765767 757587 749931 743710 738672 734099 730138
62399G30138k562r67j36j61j36J059L579O143P276P220P763R773J1928J2564J1680
$$ 730138 727576 726609 726473 726312 726176 727235 730814 736957 744233 751453 759216 768989 780917 793481 805161
62384H05161J0263Q735P247O443O465N904L394k04k768l862n094p549j0436j2631
$$ 805161 815424 824159 831406 837849 844314 850218 853612 853408 850640 846778 841684 834135 823699 811068
62370H11068j4099j5232j5945j6147j6176j6112j5322j3356j0845q917p987p509
$$ 811068 796969 781737 765792 749645 733469 717357 702035 688679 677834 668917 660930 653421
62358F53421o739n429l949k858k224j467q1J659L082M035M844N531N761N587N695
$$ 653421 646682 641253 637304 634446 632222 630755 630674 632333 635415 639450 644294 649825 655586 661173 666868
62343F66868O602Q122R693J0861J1439J1586J1824J2548J3581J4562J5496J6230
$$ 666868 673470 681592 691285 702146 713585 725171 736995 749543 763124 777686 793182 809412
62331H09412J5730J3041R022O039N346N822N826N296N137N426N426M971M634M573
$$ 809412 825142 838183 847205 853244 858590 864412 870238 875534 880671 886097 891523 896494 901128 905701
62317I05701M360M060M619O753J0030J3359J6022J8069K0130K2976K6880L1280
$$ 905701 910061 914121 918740 925493 935523 948882 964904 982973 1003103 1026079 1052959 1084239
62305A084239L5431L9380M3811M8934N4137N8998O3862O9007P3838P7606Q0452
$$ 1084239 1119670 1159050 1202861 1251795 1305932 1364930 1428792 1497799 1571637 1649243 1729695
62294A729695Q2952Q4741Q4363Q0634P3587O4048N2924M1135K9654J9062R141
$$ 1729695 1812647 1897388 1981751 2062385 2135972 2200020 2252944 2294079 2323733 2342795 2351936
62283B351936p19j0831k1056l1115m0719m9577n7478o4293o9695p2896p3078p0388
$$ 2351936 2351217 2340386 2319330 2288215 2247496 2197919 2140441 2076148 2006453 1933557 1860479 1790091
62271A790091o6398o3208o1744o0918n8695n4195m8623m3960m0966l8773l6270
$$ 1790091 1723693 1660485 1598741 1537823 1479128 1424933 1376310 1332350 1291384 1252611 1216341
62260A216341l3364l0703k8628k6827k4858k2661k0400j8019j5186j1784q368
$$ 1216341 1182977 1152274 1123646 1096819 1071961 1049300 1028900 1010881 995695 983911 975543
62249I75543n788m182k635k42K628M568M630L290J893J419J784K057J396M8p47
$$ 975543 969755 965573 962938 962696 965324 969892 974522 977812 979705 981124 982908 984965 986361 986409 985662
62234I85662k20Q88J332J075J053J421J279M53K36J686M120O193P612Q845R847
$$ 985662 985442 986330 987662 988737 989790 991211 992490 992943 993179 994865 998985 1005178 1012790 1021635 1031482
62219A031482J0176R930R555R078Q544Q843J0890J4096J6778J8246J9518K1781
$$ 1031482 1041658 1051588 1061143 1070221 1078765 1087608 1098498 1112594 1129372 1147618 1167136 1188917
62207A188917K5026K8492L1663L4510L7336M0679M5036N0370N6245O2282O8163
$$ 1188917 1213943 1242435 1274098 1308608 1345944 1386623 1431659 1482029 1538274 1600556 1668719
62196A668719P3339P7346Q0243Q2110Q2261P9688P4210O6492N7020M5940L3854
$$ 1668719 1742058 1819404 1899647 1981757 2064018 2143706 2217916 2284408 2341428 2387368 2421222
62185B421222K1813J0216j479j3679k5864l7040m6348n3349n8490o3156o8189
$$ 2421222 2443035 2453251 2451772 2438093 2412229 2375189 2328841 2275492 2217002 2153846 2085657
62174B085657p2311p3296p0935o7397o4100n9923n3623m6630m1597l8838l5977
$$ 2085657 2013346 1940050 1869115 1801718 1737618 1677695 1624072 1577442 1535845 1497007 1461030
62163A461030l1169k5123j9625j5375j2007r381p785p021o057m042j378N73R65
$$ 1461030 1429861 1404738 1385113 1369738 1357731 1348350 1340565 1333544 1327487 1323445 1322067 1322640 1323605
62150A323605M44M57J795M097O567Q627R913J0212R725R091Q896R260R880J0299
$$ 1323605 1324049 1324506 1326301 1330398 1336965 1345592 1355505 1365717 1375442 1384533 1393429 1402689 1412569 1422868
62136A422868J0361J0666J2187J4914J7320J8111J8195J9691K3023K6336K8076
$$ 1422868 1433229 1443895 1456082 1470996 1488316 1506427 1524622 1544313 1567336 1593672 1621748
62125A621748K8801K9809L1224L2425L3292L3862L3504L1713K9319K7756K7345
$$ 1621748 1650549 1680358 1711582 1744007 1777299 1811161 1844665 1876378 1905697 1933453 1960798
62114A960798K7417K8028L0311L4835M0387M5063M8164N0667N3906N8100O2237
$$ 1960798 1988215 2016243 2046554 2081389 2121776 2166839 2215003 2265670 2319576 2377676 2439913
62103B439913O5194O6585O6246O3571N8101N0654M2927L5786K8792K1472J4052
$$ 2439913 2505107 2571692 2637938 2701509 2759610 2810264 2853191 2888977 2917769 2939241 2953293
62092B953293O698q26q179j4268j8800k2980k7642l1622l3141l2026k9406k5983
$$ 2953293 2959991 2959165 2950986 2936718 2917918 2894938 2867296 2835674 2802533 2770507 2741101 2715118
62080B715118k1901j7852j4623j1776q177l822J64L297O066Q407R510R713J0993
$$ 2715118 2693217 2675365 2660742 2648966 2640789 2636967 2637131 2640428 2646494 2654901 2664411 2674124 2685117
62067B685117J4431J8304K0090J9816K0021K2474K6103K8604K9244K9359L0531
$$ 2685117 2699548 2717852 2737942 2757758 2777779 2800253 2826356 2854960 2884204 2913563 2944094
62056B944094L3036L6126L9002M1075M1807M1205M0379M0879M3247M6659M9910
$$ 2944094 2977130 3013256 3052258 3093333 3135140 3176345 3216724 3257603 3300850 3347509 3397419
62045C397419N2159N2959N2538N2285N3762N6828N9708O1488O3214O5677O7425
$$ 3397419 3449578 3502537 3555075 3607360 3661122 3717950 3777658 3839146 3902360 3968037 4035462
62034D035462O6494O3252N9995N8209N7767N8417O0295O2774O4408O4481O3648
$$ 4035462 4101956 4165208 4225203 4283412 4341179 4399596 4459891 4522665 4587073 4651554 4715202
62023D715202O2591O1122N9000N6887N5996N7180O0393O4490O7756O9365P0182
$$ 4715202 4777793 4838915 4897915 4954802 5010798 5067978 5128371 5192861 5260617 5329982 5400164
62012E400164P1456P3110P4277P4987P5944P6937P7090P6829P7826Q0462Q2889
$$ 5400164 5471620 5544730 5619007 5693994 5769938 5846875 5923965 6000794 6078620 6159082 6241971
62001F241971Q3110Q0599P5398O7435N7756M8690M1305L3922K4646J4370N542
$$ 6241971 6325081 6405680 6481078 6548513 6606269 6654959 6696264 6730186 6754832 6769202 6774744
61990F774744j156p098j3257j9355k5286l1510l7742m2737m5799m7278m7498m6457
$$ 6774744 6773588 6766490 6753233 6733878 6708592 6677082 6639340 6596603 6550804 6503526 6456028 6409571
61978F409571m4878m3874m3078m0682l6275l2141l0341k9722k7569k3533k0009
$$ 6409571 6364693 6320819 6277741 6237059 6200784 6168643 6138302 6108580 6081011 6057478 6037469
61967F037469j8854j9507k0540k1306k1436k0246j7722j5095j3495j2853j2828
$$ 6037469 6018615 5999108 5978568 5957262 5935826 5915580 5897858 5882763 5869268 5856415 5843587
61956E843587j3708j5281j5868j4132j1280r796j0311j1446j2494j4165j6252
$$ 5843587 5829879 5814598 5798730 5784598 5773318 5763522 5753211 5741765 5729271 5715106 5698854
61945E698854j6891j5284j3427j3626j5551j7269j8171j9074k0215k0995k1678
$$ 5698854 5681963 5666679 5653252 5639626 5624075 5606806 5588635 5569561 5549346 5528351 5506673
61934E506673k3617k7452l2332l7101m1292m4773m7495m9873n2586n5612n8101
$$ 5506673 5483056 5455604 5423272 5386171 5344879 5300106 5252611 5202738 5150152 5094540 5036439
61923E036439n9345n9340n8432n7113n6090n5693n5215n3672n1317m9464m8684
$$ 5036439 4977094 4917754 4859322 4802209 4746119 4690426 4635211 4581539 4530222 4480758 4432074
61912D432074m8106m6821m5034m3411m2088m0789l9293l7372l4973l2851l2244
$$ 4432074 4383968 4337147 4292113 4248702 4206614 4165825 4126532 4089160 4054187 4021336 3989092
61901C989092l3251l4194l3296l0644k7847k6024k4813k3214k0860j8325j6554
$$ 3989092 3955841 3921647 3888351 3857707 3829860 3803836 3779023 3755809 3734949 3716624 3700070
61890C700070j6001j6078j5570j3899j1872j0769j0618r873p247l559q96J76J643
$$ 3700070 3684069 3667991 3652421 3638522 3626650 3615881 3605263 3595390 3588143 3584584 3583688 3583864 3585507
61877C585507N443J0631J4476J6112J7379J9817K2703K5070K7822L2047L6501
$$ 3585507 3590950 3601581 3616057 3632169 3649548 3669365 3692068 3717138 3744960 3777007 3813508
61866C813508L8997L9847M1762M6222N1844N6879O1705O8093P7001Q7904R9567
$$ 3813508 3852505 3892352 3934114 3980336 4032180 4089059 4150764 4218857 4295858 4383762 4483329
61855D483329J11057J22455J34783J48890J64611J81538K00067K20778K43404
$$ 4483329 4594386 4716841 4851624 5000514 5165125 5346663 5546730 5767508 6010912
61846F010912K67553K93827L22757L53310L84385M17268M54163M94371N34422
$$ 6010912 6278465 6572292 6895049 7248359 7632744 8050012 8504175 8998546 9532968
61837I532968N72367O08997O43552O70783O83921O78478O51457N99001N17562
$$ 9532968 10105335 10714332 11357884 12028667 12712588 13391066 14042523 14641524 15159086
61828A5159086M06814K70224J14387n0361k10529l54009m74440n70187o40549
$$ 15159086 15565900 15836124 15950511 15900150 15689621 15335612 14861172 14290985 13650436
61819A3650436o85426p07631p12235p03060o81845o50888o14063n74454n33003
$$ 13650436 12965010 12257379 11545144 10842084 10160239 9509351 8895288 8320834 7787831
61810G787831m90387m48487m08913l71582l36109l03574k75512k51654k29946
$$ 7787831 7297444 6848957 6440044 6068462 5732353 5428779 5153267 4901613 4671667
61801D671667k08817j88590j70464j54564j39600j24495j09921r7458q7286p7773
$$ 4671667 4462850 4274260 4103796 3949232 3809632 3685137 3575216 3477758 3390472 3312699
61791C312699o7845n8617n1651m6518m1545l6269l1576k7791k4428k1797k0998
$$ 3312699 3244854 3186237 3134586 3088068 3046523 3010254 2978678 2950887 2926459 2904662 2883664
61780B883664k1904k2779k2479k1531k0381j8250j4732j1092q647o850m337j015
$$ 2883664 2861760 2838981 2816502 2794971 2774590 2756340 2741608 2730516 2721869 2715019 2710682 2709667
61768B709667K332N758R825J3853J6145J6193J5322J4745J4190J2983J1455J0422
$$ 2709667 2711999 2717757 2727582 2741435 2757580 2773773 2789095 2803840 2818030 2831013 2842468 2852890
61756B852890R952R575R407J0181J2203J4992J8054K1512K5681L0388L5132L9915
$$ 2852890 2862842 2872417 2881824 2892005 2904208 2919200 2937254 2958766 2984447 3014835 3049967 3089882
61744C089882M5645N3374O2929P2480Q0009Q5424R0712R7564J05489J13134J20910
$$ 3089882 3135527 3188901 3251830 3324310 3404319 3489743 3580455 3678019 3783508 3896642 4017552
61733D017552J30726J42945J55293J65796J75532J87073K01181K16611K32628
$$ 4017552 4148278 4291223 4446516 4612312 4787844 4974917 5176098 5392709 5625337
61724E625337K49821K68592K88702L10754L36303L65863L98242M32762M70823
$$ 5625337 5875158 6143750 6432452 6743206 7079509 7445372 7843614 8276376 8747199
61715H747199N14222N62973O15841O72164P31987P95132Q61295R30513J002151
$$ 8747199 9261421 9824394 10440235 11112399 11844386 12639518 13500813 14431326 15433477
61706A5433477J073384J139423J194943J234500J251596J237976J184085J080835
$$ 15433477 16506861 17646284 18841227 20075727 21327323 22565299 23749384 24830219
61698B4830219R22936P12280M58530J76530j16206m00302o56520q70731j037492
$$ 24830219 25753155 26465435 26923965 27100495 26984289 26583987 25927467 25056736 24019244
61689B4019244j157878j234671j271053j272687j247809j204188j147280j081436
$$ 24019244 22861366 21626695 20355642 19082955 17835146 16630958 15483678 14402242
61681A4402242j010896r38746q66399p95204p27509o65138o07722n53709n02760
$$ 14402242 13391346 12452600 11586201 10790997 10063488 9398350 8790628 8236919 7734159
61672G734159m56251m15460l79895l47638l17249k89129k64686k44114k25653
$$ 7734159 7277908 6862448 6482553 6134915 5817666 5528537 5263851 5019737 4794084
61663D794084k07596j90294j75337j63224j52936j43475j34600j26156j17885
$$ 4794084 4586488 4396194 4220857 4057633 3904697 3761222 3626622 3500466 3382581
61654C382581j09977j02803r5993q8952q2249p7208p3846p0495o5891o0550n5616
$$ 3382581 3272604 3169801 3073808 2984856 2902607 2825399 2751553 2681058 2615167 2554617 2499001
61643B499001n1537m8426m6547m5605m4410m2024l8713l5272l2172k9841k8978
$$ 2499001 2447464 2399038 2352491 2306886 2262476 2220452 2181739 2146467 2114295 2084454 2055476
61632B055476k9775l1357l2478l2434l1199k9423k8393k8961l0133k9769k7164
$$ 2055476 2025701 1994344 1961866 1929432 1898233 1868810 1840417 1811456 1781323 1751554 1724390
61621A724390k3912k1717k0624j9980j9790k0004j9692j8256j6625j5902j5646
$$ 1724390 1700478 1678761 1658137 1638157 1618367 1598363 1578671 1560415 1543790 1527888 1512242
61610A512242j4774j3605j3426j4394j5273j5210j4577j3993j3570j3071j2059
$$ 1512242 1497468 1483863 1470437 1456043 1440770 1425560 1410983 1396990 1383420 1370349 1358290
61599A358290j0119p682o198o339o582n002k157n41j093j970j285N46K021K693
$$ 1358290 1348171 1340489 1334291 1327952 1321370 1316368 1314211 1313670 1312577 1310607 1309322 1309868 1311889 1314582
61585A314582K990K888K097J053O55J184K177L061L331K494O51j155j874j614
$$ 1314582 1317572 1320460 1322557 1323610 1324265 1325449 1327626 1330687 1334018 1336512 1337163 1336008 1334134 1332520
61571A332520j226j018p37n63j058j975k183j260k56k55r67j609k459m294o573
$$ 1332520 1331294 1330276 1329539 1328976 1327918 1325943 1323760 1322500 1322244 1321989 1321022 1319413 1316954 1312660 1306087
61556A306087p685p226o703p319q358q738q974j0075j1222j0522q106o457p020
$$ 1306087 1298402 1291176 1284473 1277154 1268796 1260058 1251084 1241009 1229787 1219265 1211159 1204702 1197682
61543A197682q206p847o174m901m371l487k031j135j241j300o07j9l96q51J43
$$ 1197682 1189476 1181629 1175455 1170554 1166183 1162696 1160665 1159530 1158289 1156989 1156382 1156363 1155967 1155116 1155259
61528A155259K507M592N394N677O685Q663J1065J3463J5526J6567J6124J5152
$$ 1155259 1157766 1162358 1167752 1173429 1180114 1188777 1199842 1213305 1228831 1245398 1261522 1276674
61516A276674J5783J9176K3845K6908K7136K6317K7216L0587L4649L7333L8366
$$ 1276674 1292457 1311633 1335478 1362386 1389522 1415839 1443055 1473642 1508291 1545624 1583990
61505A583990L8939L9878M0783M0909M0277L9524L9028L8588L7902L6929L5723
$$ 1583990 1622929 1662807 1703590 1744499 1784776 1824300 1863328 1901916 1939818 1976747 2012470
61494B012470L4284L2747L1321K9834K7724K4792K1619J8834J6271J3340R968
$$ 2012470 2046754 2079501 2110822 2140656 2168380 2193172 2214791 2233625 2249896 2263236 2273204
61483B273204O458K707j569n703q131q171p034o518p102p938q247p984p284o042
$$ 2273204 2279662 2282369 2280800 2275097 2266966 2258795 2251761 2245243 2238141 2230203 2221956 2213972 2206688 2200646
61469B200646m190j794J332N718J1504J7869K3557K8092L2265L7131M2611M7597
$$ 2200646 2196456 2194662 2195994 2201712 2213216 2231085 2254642 2282734 2314999 2352130 2394741 2442338
61457B442338N1672N6262O3259P2688Q2600R1590J00536J11170J23750J36980
$$ 2442338 2494010 2550272 2613531 2686219 2768819 2860409 2960945 3072115 3195865 3332845
61447C332845J49926J62900J76509J90784K05470K20418K35261K49168K61181
$$ 3332845 3482771 3645671 3822180 4012964 4218434 4438852 4674113 4923281 5184462
61438E184462K70316K75015K73098K62775K43620K16249J81487J40267R4180M5678
$$ 5184462 5454778 5729793 6002891 6265666 6509286 6725535 6907022 7047289 7141469 7187147
61428G187147k354m7120q6458j19369j45950j66418j80443j87832j89691j88069
$$ 7187147 7184793 7137673 7051215 6931846 6785896 6619478 6439035 6251203 6061512 5873443
61418E873443j84301j78130j68780j56380j42105j27203j12279r7277q1931o6361
$$ 5873443 5689142 5511012 5342232 5185852 5043747 4916544 4804265 4706988 4625057 4558696
61408D558696n1333l7585k4859j2165P37J2869K3524L3507M3902N4173O2627O8558
$$ 4558696 4507363 4469778 4444919 4432754 4433491 4446360 4469884 4503391 4547293 4601466 4664093 4732651
61396D732651P2777P5917P7584P7630P7034P6689P6137P4429P1705O9021O7016
$$ 4732651 4805428 4881345 4958929 5036559 5113593 5190282 5266419 5340848 5412553 5481574 5548590
61385E548590O5545O4384O3424O2169N9722N5511M9762M3393L7620L3331L0268
$$ 5548590 5614135 5678519 5741943 5804112 5863834 5919345 5969107 6012500 6050120 6083451 6113719
61374F113719K7119K2861J7894J3431R978O932L479n70m762q404j1155j3526j6497
$$ 6113719 6140838 6163699 6181593 6195024 6205002 6211934 6215413 6214843 6210081 6201677 6190522 6176996 6160499
61361F160499k0215k3486k5072k5214k5187k5656k6058k5465k3469k0417j7375
$$ 6160499 6140284 6116798 6091726 6066512 6041325 6015669 5989611 5964146 5940677 5920260 5902885
61350E902885j5655j5767j6958j8256j9579k1235k2981k4440k5928k7658k8474
$$ 5902885 5887230 5871463 5854505 5836249 5816670 5795435 5772454 5748014 5722086 5694428 5665954
61339E665954k6846k3101j9240j6183j2436o012L391J4636K6636L9073N2391O7583
$$ 5665954 5639108 5616007 5596767 5580584 5568148 5562136 5565527 5580163 5606799 5645872 5698263 5765846
61327E765846Q5231J04408J23381J41776J61082J82337K04316K24828K43021K59343
$$ 5765846 5851077 5955485 6078866 6220642 6381724 6564061 6768377 6993205 7236226 7495569
61317G495569K73639K84476K90243K90055K83389K69342K46661K14571J73801
$$ 7495569 7769208 8053684 8343927 8633982 8917371 9186713 9433374 9647945 9821746
61308I821746J26801P6665K5785k4160p1288j13675j50695j83313k12468k37657
$$ 9821746 9948547 10025212 10050997 10026837 9955549 9841874 9691179 9507866 9295398 9057741
61298I057741k57686k72199k81820k87131k88132k84612k76808k65921k54057
$$ 9057741 8800055 8527856 8246036 7958905 7670773 7386161 7109353 6843432 6589375
61289F589375k43015k32769k21610k08181j92935j77290j61978j46699j31013
$$ 6589375 6346360 6113591 5891981 5683800 5490865 5313575 5151597 5004898 4873885
61280D873885j14976r9163q4429p1339n9486m7720l5335k2809j1127p22Q750J7979
$$ 4873885 4758909 4659746 4575317 4503978 4444492 4396772 4361437 4338628 4327501 4326779 4335529 4353508
61268D353508K7431L6680M4286M9099N1837N4517N7908O0456O0359N7840N4582
$$ 4353508 4380939 4417619 4461905 4511004 4562841 4617358 4675266 4735722 4796081 4853921 4908503
61257D908503N1476M7990M3510L8417L3672K9733K6120K2060J7639J3870J1096
$$ 4908503 4959979 5007969 5051479 5089896 5123568 5153301 5179421 5201481 5219120 5232990 5244086
61246E244086P731J682o970j5939k3528l0140l6508m1992m5783m8607n1885n5779
$$ 5244086 5251817 5253499 5246529 5230590 5207062 5176922 5140414 5098422 5052639 5004032 4952147 4896368
61234D896368n9264o1652o3014o3448o2888o1501n9475n6713n3272m9706m6439
$$ 4896368 4837104 4775452 4712438 4648990 4586102 4524601 4465126 4408413 4355141 4305435 4258996
61223D258996m3312m0238l7574l5237l2292k8324k4390k1679k0049j8932j8776
$$ 4258996 4215684 4175446 4137872 4102635 4070343 4042019 4017629 3995950 3975901 3956969 3938193
61212C938193k0218k2376k3434k2654k0631j8008j5121j2498j0181o870j262N832
$$ 3938193 3917975 3895599 3872165 3849511 3828880 3810872 3795751 3783253 3773072 3766202 3764940 3770772
61200C770772J2229J7242K2343K8691L5585M1865M7622N3795O1003O9394P8904
$$ 3770772 3783001 3800243 3822586 3851277 3886862 3928727 3976349 4030144 4091147 4160541 4239445
61189D239445Q8973R8515J06524J12426J15782J16245J13730J07871R7284Q0242
$$ 4239445 4328418 4426933 4533457 4645883 4761665 4877910 4991640 5099511 5196795 5277037
61179E277037N6428K7456m480l7681p0529j00940j26860j47015j60983j68964
$$ 5277037 5333465 5360921 5356441 5318760 5248231 5147291 5020431 4873416 4712433 4543469
61169D543469j71778j70689j66914j61267j54243j46162j37359j28349j19550
$$ 4543469 4371691 4201002 4034088 3872821 3718578 3572416 3435057 3306708 3187158
61160C187158j10675j00973r0525q0746p2975o6892o1005n4321m6951l9600l3296
$$ 3187158 3076483 2975510 2884985 2804239 2731264 2664372 2603367 2549046 2502095 2462495 2429199
61149B429199k8993k6445k3704j8912j2385o102j228K774O776J0833J4598J7984
$$ 2429199 2400206 2373761 2350057 2331145 2318760 2312658 2311430 2314204 2320980 2331813 2346411 2364395
61137B364395K1098K3879K5733K5395K1864J6090J0782P550N030J123l833p766
$$ 2364395 2385493 2409372 2435105 2460500 2482364 2498454 2509236 2516786 2521816 2522939 2519106 2511340
61125B511340j0114j2274j5003j7422j8886k0074k1602k3079k4069k4704k4988
$$ 2511340 2501226 2488952 2473949 2456527 2437641 2417567 2395965 2372886 2348817 2324113 2299125
61114B299125k4796k4808k6065k8215k9696l0139l0968l3001l5098l6074l6479
$$ 2299125 2274329 2249521 2223456 2195241 2165545 2135406 2104438 2071437 2036339 2000265 1963786
61103A963786l7229l7791l7102l5505l4369l4120l3780l2354l0002k7716k6178
$$ 1963786 1926557 1888766 1851664 1816159 1781790 1747670 1713890 1681536 1651534 1623818 1597640
61092A597640k4881k2634j9322j6686j6542j8647k1428k4271k7443l0114l0645
$$ 1597640 1572759 1550125 1530803 1514117 1497575 1478928 1457500 1433229 1405786 1375672 1345027
61081A345027k9176k7753k7095k5398k1382j6580j3144j1039r090p344o521o221
$$ 1345027 1315851 1288098 1261003 1235605 1214223 1197643 1184499 1173460 1164370 1157026 1150505 1144284
61069A144284n498m425l354j404K444P156J0452J1650J2107J2869J3514J3551
$$ 1144284 1138786 1134361 1131007 1129603 1132047 1139203 1149655 1161305 1173412 1186281 1199795 1213346
61057A213346J3390J3410J3233J2647J2377J3187J4685J5617J5259J4135J3326
$$ 1213346 1226736 1240146 1253379 1266026 1278403 1291590 1306275 1321892 1337151 1351286 1364612
61046A364612J3289J3406J2697J0766P854M473J300r82k502m528p908j1342j2431
$$ 1364612 1377901 1391307 1404004 1414770 1422624 1427097 1428397 1427415 1424913 1420385 1412477 1401135 1388704
61033A388704j0665q111o848o941p382p664p570o678n140m050m104m579m515m019
$$ 1388704 1378039 1369928 1363080 1356139 1348757 1341093 1333523 1326845 1321705 1317655 1313551 1308972 1304457 1300438
61019A300438l607l003j752l17M43M93L80K80M3j44l9J11j17p16j443k126k420
$$ 1300438 1296831 1293828 1292076 1291759 1292202 1292695 1293075 1293355 1293398 1293254 1293215 1293326 1293209 1292493 1291050 1288924 1286504
61002A286504j823m07J056K034K709L296L702M005M278L869K228O66J530N005
$$ 1286504 1284681 1284274 1285330 1287364 1290073 1293369 1297071 1301076 1305354 1309223 1311451 1312117 1313647 1318652
60988A318652Q457R912J0411J1715J3420J4117J4001J4520J6349J9154K2498K5630
$$ 1318652 1327109 1337021 1347432 1359147 1372567 1386684 1400685 1415205 1431554 1450708 1473206 1498836
60976A498836K7419K7864K8668L0946L3631L5503L7306M0173M3411M5974M8755
$$ 1498836 1526255 1554119 1582787 1613733 1647364 1682867 1720173 1760346 1803757 1849731 1898486
60965A898486N3073N7952O1451O3815O6859P0952P5147P9650Q5424R1710R6752
$$ 1898486 1951559 2009511 2070962 2134777 2201636 2272588 2347735 2427385 2512809 2604519 2701271
60954B701271J00881J06248J13408J20848J28057J36350J46181J56121J65181
$$ 2701271 2802152 2908400 3021808 3142656 3270713 3407063 3553244 3709365 3874546
60945C874546J73858J82369J90190J98018K08147K22132K39876K61453K87668
$$ 3874546 4048404 4230773 4420963 4618981 4827128 5049260 5289136 5550589 5838257
60936E838257L18240L51504L86647M24710M67374N16792N76306O48629P33341
$$ 5838257 6156497 6508001 6894648 7319358 7786732 8303524 8879830 9528459 10261800
60927A0261800Q29012R37626J063603J208980J374212J563609J783896K036533
$$ 10261800 11090812 12028438 13092041 14301021 15675233 17238842 19022738 21059271
60919B1059271K318537K628798K952455L219614L292224L033071K421575J604208
$$ 21059271 23377808 26006606 28959061 32178675 35470899 38503970 40925545 42529753
60911D2529753Q15990K41989n5122j03603L2481K53592L99741K87617j79345r27718
$$ 42529753 43345743 43587732 43532610 43429007 43461488 43715080 44114821 44402438 44223093 43295375
60901D3295375j750790k437155k875784l066004l063888k934289k733426k503826
$$ 43295375 41544585 39107430 36231646 33165642 30101754 27167465 24434039 21930213
60893B1930213k269351k037477j810597j594106j394513j215141j056645r19332
$$ 21930213 19660862 17623385 15812788 14218682 12824169 11609028 10552383 9633051
60885I633051q02764p04542o21224n49852m88111m34153l86988l46342l11792
$$ 9633051 8830287 8125745 7504521 6954669 6466558 6032405 5645417 5299075 4987283
60876D987283k82521k57659k35952k15562j95424j76670j61425j50275j41930
$$ 4987283 4704762 4447103 4211151 3995589 3800165 3623495 3462070 3311795 3169865
60867C169865j35018j28868j22869j16610j10607j05516j00626r4626q7849q2167
$$ 3169865 3034847 2905979 2783110 2666500 2555893 2450377 2349751 2255125 2167276 2085109
60857B085109p8358p5077p0967o6465o2883o0633n8884n6305n2047m6635m1858
$$ 2085109 2006751 1931674 1860707 1794242 1731359 1670726 1611842 1555537 1503490 1456855 1414997
60846A414997l8937l6997l4316l0734k7544k5237k3011k0540j8577j7392j6185
$$ 1414997 1376060 1339063 1304747 1274013 1246469 1221232 1198221 1177681 1159104 1141712 1125527
60835A125527j4498j2783j1053q501n315l377m058o238p492o469l451M07L520
$$ 1125527 1111029 1098246 1087193 1078692 1073377 1070000 1065942 1059704 1052212 1045743 1042292 1042699 1046219
60822A046219M477L266J461M95K12l29j446k859m387n845o880p620q865j0923
$$ 1046219 1050696 1053962 1055423 1055918 1056130 1055801 1054355 1051496 1047109 1041264 1034384 1026764 1017899 1006976
60808A006976j2804j3260j2128j0182q267p188p493q549q484o105k514O3P23M54
$$ 1006976 994172 980912 968784 958602 950335 943147 935654 927105 918621 912516 910002 910065 910788 911242
60794I11242P38K379N311Q659J1196J2515J3536J5232J7233J8476J8947J9743
$$ 911242 911980 914359 919670 928329 939525 952040 965576 980808 998041 1016517 1035464 1055207
60782A055207K1384K2887K2784K0710J7834J5857J5410J5399J4238J1725Q987
$$ 1055207 1076591 1099478 1122262 1142972 1160806 1176663 1192073 1207472 1221710 1233435 1242422
60771A242422O630M104J314o29j211j685l001l797k328L92J604N93p87j363k152
$$ 1242422 1249052 1253156 1254470 1253841 1252630 1250945 1247944 1244147 1241819 1242211 1243815 1244408 1243621 1242258 1240106
60756A240106m001n939o859p132p419p491p383q244j0482j2387j2320j1327j1742
$$ 1240106 1236105 1230166 1223307 1216175 1208756 1201265 1193882 1185638 1175156 1162769 1150449 1139122 1127380
60743A127380j3751j5254j4987j3809j2768j1603r879q215p403p145o454m859
$$ 1127380 1113629 1098375 1083388 1069579 1056811 1045208 1035329 1027114 1019711 1012566 1006112 1001253
60731A001253k672n16R36J303J101J483K913M497N234N479O358Q062R775J1294
$$ 1001253 998581 998065 999001 1000304 1001405 1002888 1005801 1010298 1015532 1021011 1027369 1035431 1045206 1056500
60717A056500J3475J6517J8867J8990J7676J7217J8337J9431J9271J8926J9945
$$ 1056500 1069975 1086492 1105359 1124349 1142025 1159242 1177579 1197010 1216281 1235207 1255152
60706A255152K1655K1968K0366J8421J7340J6569J5258J3612J2029J0046P153
$$ 1255152 1276807 1298775 1319141 1337562 1354902 1371471 1386729 1400341 1412370 1422416 1429569
60695A429569L902J337j25o40l96J12l2j180k551l383l945m583m636l595k689
$$ 1429569 1433471 1434808 1434683 1434043 1433647 1433759 1433727 1432547 1429996 1426613 1422668 1418085 1413449 1409854 1407165
60680A407165l828p121j0761j3288j4622j4907j3934j2211j1230j1851j3212j3886
$$ 1407165 1403337 1396216 1385455 1372167 1357545 1342638 1328704 1316493 1305263 1293412 1280200 1266314
60668A266314j3508j2693j1887j0810q960o353l882k644k623k530j516l65qM24
$$ 1266314 1252806 1240113 1228226 1217416 1208456 1202103 1198221 1195577 1192954 1190424 1188908 1188543 1188535 1188959
60654A188959K492N661P569P297O448O375O197M783L097K958M349N506N227L838
$$ 1188959 1191451 1197112 1204681 1211978 1218426 1224801 1230998 1235781 1238878 1241836 1246185 1251691 1256918 1260756
60640A260756K210R02K51K63M64K28p45k504m955p558r515j0691j1803j3330j4861
$$ 1260756 1262966 1263868 1264119 1264382 1264846 1265074 1264329 1261825 1256870 1249312 1239797 1229106 1217303 1203973 1189112
60625A189112j5923j6731j7673j8738j9833k0857k1021j9216j5691j2372j0704
$$ 1189112 1173189 1156458 1138785 1120047 1100214 1079357 1058336 1039120 1023429 1011057 1000353
60614A000353j0132r453q640q277q212p946p504o921n644l493j320K95J873L524
$$ 1000353 990221 980768 972128 963851 955639 947693 940189 933268 927624 924131 922811 923106 924979 928503
60600I28503L988K775J929L605O803Q684Q456P820P996Q640R490J0830J2123J2287
$$ 928503 932491 935266 937195 940800 947603 956287 964743 972563 980559 989199 998689 1009519 1021642 1033929
60586A033929J1506J0964J0681R549P666O617P088Q083Q755R159Q918P342N282
$$ 1033929 1045435 1056399 1067080 1076629 1084295 1090912 1098000 1106083 1114838 1123997 1132915 1140257 1145539
60573A145539M697N749O565O560P538J0391J3170J4044J4062J5081J6817J7862
$$ 1145539 1150236 1155985 1162550 1169110 1176648 1187039 1200209 1214253 1228315 1243396 1260213 1278075
60561A278075J8230J8755J9036J7929J5465J2662J0184Q416P975Q560Q296N852
$$ 1278075 1296305 1315060 1334096 1352025 1367490 1380152 1390336 1398752 1406727 1415287 1423583 1429435
60549A429435K476L84j65o41j870l607n946r316j3204j6409j8522j9859k0389
$$ 1429435 1431911 1432295 1432130 1431489 1429619 1426012 1420066 1410750 1397546 1381137 1362615 1342756 1322367
60536A322367j9981j9335j9194j8858j6993j3747j0698q827p869p346o821n321
$$ 1322367 1302386 1283051 1263857 1244999 1228006 1214259 1203561 1194734 1186865 1179519 1172698 1167377
60524A167377k250J124K716K382K117L304N288O914P836P803O383M261L353M523
$$ 1167377 1165127 1166251 1168967 1171349 1173466 1176770 1182058 1188972 1196808 1204611 1210994 1215255 1218608 1223131
60510A223131O300O860O322N998O333O742O963P288P728P984Q149Q562R046R061
$$ 1223131 1229431 1236291 1242613 1248611 1254944 1261686 1268649 1275937 1283665 1291649 1299798 1308360 1317406 1326467
60496A326467Q533P875P169O130M950M419M888N780O473P157Q189R162R453R571
$$ 1326467 1335000 1342875 1350044 1356174 1361124 1365543 1370431 1376211 1382684 1389841 1398030 1407192 1416645 1426216
60482A426216J0930J4010J7659K0690K3400K6715L0572L4139L7147L9694M0968
$$ 1426216 1437146 1451156 1468815 1489505 1512905 1539620 1570192 1604331 1641478 1681172 1722140
60471A722140L9497L4789K7543J8242P094m324j3254j8569k1937k4990k6710k5278
$$ 1722140 1761637 1796426 1823969 1842211 1849305 1844981 1831727 1813158 1791221 1766231 1739521 1714243
60459A714243k1298j7224j3998j0245m927Q51N160P325Q320R756J2513J5812J7916
$$ 1714243 1692945 1675721 1661723 1651478 1646551 1647402 1652562 1659887 1668207 1677963 1690476 1706288 1724204
60446A724204J8439J9441K3239K9592L6274M1979M7212N2558N8004O4105P2067
$$ 1724204 1742643 1762084 1785323 1814915 1851189 1893168 1940380 1992938 2050942 2115047 2187114
60435B187114Q1884R1858J00766J09209J17957J26296J33281J39743J47628J57765
$$ 2187114 2268998 2360856 2461622 2570831 2688788 2815084 2948365 3088108 3235736 3393501
60425C393501J69526J82620J98223K18005K42511K70321K98195L21844L36901
$$ 3393501 3563027 3745647 3943870 4161875 4404386 4674707 4972902 5294746 5631647
60416E631647L39323L25270K91588K37328J64904P9489j2506j04282j88898k60119
$$ 5631647 5970970 6296240 6587828 6825156 6990060 7069549 7057043 6952761 6763863 6503744
60406F503744l13862l48918l66456l69176l60781l45284l25863l04121k80683
$$ 6503744 6189882 5840964 5474508 5105332 4744551 4399267 4073404 3769283 3488600
60397C488600k56352k32454k10025j89222j69762j51616j34900j19505j05366
$$ 3488600 3232248 2999794 2789769 2600547 2430785 2279169 2144269 2024764 1919398
60388A919398r2903q2575p4044o6393n9109n2310m6091m0436l5705l2249k9490
$$ 1919398 1826495 1743920 1669876 1603483 1544374 1492064 1445973 1405537 1369832 1337583 1308093
60377A308093k6488k3653k2556k3329k3658k1417j7287j3600j1502j0604j0580
$$ 1308093 1281605 1257952 1235396 1212067 1188409 1166992 1149705 1136105 1124603 1113999 1103419
60366A103419j1393j2226j1841j0242q713q033p712p082o120m977l620k221j192
$$ 1103419 1092026 1079800 1067959 1057717 1049004 1040971 1033259 1026177 1020057 1015080 1011460 1009239 1008047
60353A008047o30k11M06J556L468N531O202M805K946K805M288N332M945M213M069
$$ 1008047 1007417 1007206 1007612 1009168 1012636 1018167 1024369 1029174 1032120 1034925 1039213 1044545 1049490 1053703 1057772
60338A057772L906L203K887L915N568O403O235O089O617P514Q207Q397P989P143
$$ 1057772 1061678 1064881 1067768 1071683 1077251 1083654 1089889 1095978 1102595 1110109 1118316 1126713 1134702 1141845
60324A141845O309N794N367M533L191J805R36O13J69j052k679l433k648j138K0
$$ 1141845 1148154 1153948 1159315 1163848 1167039 1168844 1169780 1170393 1170562 1169510 1166831 1163398 1160750 1159612 1159632
60309A159632R23K267L747M270L609K715K364K545L159M241N329N717N634O149
$$ 1159632 1160555 1162822 1166569 1170839 1174448 1177163 1179527 1182072 1185231 1189472 1194801 1200518 1206152 1212301
60295A212301P658R302J0132J0028R366Q634Q522R398J0662J1528J2295J3632
$$ 1212301 1219959 1229261 1239393 1249421 1258787 1267421 1275943 1285341 1296003 1307531 1319826 1333458
60283A333458J4918J4869J3768J3126J2850J0952O883L035J593J742J568J130
$$ 1333458 1348376 1363245 1377013 1390139 1402989 1413941 1420824 1423859 1425452 1427194 1428762 1429892
60271A429892J677K992L631L297L120L682M307M295L655K604J268j68j786m092
$$ 1429892 1431569 1434561 1438192 1441489 1444609 1448291 1452598 1456893 1460548 1463152 1464420 1464252 1462466 1458374
60257A458374p181j0109j1901j2715j3113j2814j1244q882o931n801m959m053
$$ 1458374 1451193 1441084 1429183 1416468 1403355 1390541 1379297 1370415 1363484 1357683 1352724 1348671
60245A348671l289k822k599k684k969k866k075j205q24l33J126L009L854L233
$$ 1348671 1345382 1342560 1339961 1337277 1334308 1331442 1329367 1328162 1327338 1327005 1328131 1331140 1334994 1338227
60231A338227K020P94p37k551l846m166m004l759k975j202J022K654L335L662
$$ 1338227 1340247 1341041 1340304 1337753 1333907 1329741 1325737 1321978 1319003 1317801 1318823 1321477 1324812 1328474
60217A328474M595O782J0074J3396J5349J5350J4201J3477J4199J5933J7159J6728
$$ 1328474 1333069 1339851 1349925 1363321 1378670 1394020 1408221 1421698 1435897 1451830 1468989 1485717
60205A485717J5134J4065J4661J6531J8509J9760J9979J9377J9011K0435K4221
$$ 1485717 1500851 1514916 1529577 1546108 1564617 1584377 1604356 1623733 1642744 1663179 1687400
60194A687400K9149L3459L6460L8601M0688M3723M8564N4710O0151O3788O7331
$$ 1687400 1716549 1750008 1786468 1825069 1865757 1909480 1958044 2012754 2072905 2136693 2204024
60183B204024P3311Q1660R0030R7385J05126J14103J22518J28191J31595J35121
$$ 2204024 2277335 2358995 2449025 2546410 2651536 2765639 2888157 3016348 3147943 3283064
60173C283064J39965J45013J48494J49507J47979J44165J38372J30629J20547
$$ 3283064 3423029 3568042 3716536 3866043 4014022 4158187 4296559 4427188 4547735
60164D547735J07972R3699P8861O3661M7488L0512J4238j0j2479k4003l4096m1049
$$ 4547735 4655707 4749406 4828267 4891928 4939416 4969928 4984166 4984156 4971677 4947674 4913578 4872529
60152D872529m3871m3168l9883l4306k6783j8251r094J725J5188L0314M5019N8604
$$ 4872529 4828658 4785490 4745607 4711301 4684518 4666267 4657173 4658898 4674086 4704400 4749419 4808023
60140D808023P2063Q5958R9391J11347J21823J31105J38955J44893J48278J47787
$$ 4808023 4880086 4966044 5065435 5176782 5298605 5429710 5568665 5713558 5861836 6009623
60130F009623J41972J30966J16640J00576Q2779O2944M1767K0152j730k3721m4767
$$ 6009623 6151595 6282561 6399201 6499777 6582556 6645500 6687267 6707419 6705689 6681968 6637201
60119F637201o3596p9478r1758r9780j03955j05591j04747r9619q9356p6046o2340
$$ 6637201 6573605 6494127 6402369 6302589 6198634 6093043 5988296 5888677 5799321 5723275 5660935
60108E660935m8362l2745j5600J730J9072L7158N5181P0866Q3079R2524R9546
$$ 5660935 5612573 5579828 5564228 5565958 5585030 5622188 5677369 5748235 5831314 5923838 6023384
60097F023384J03022J01880R6470Q8094P8149O7661N6567M3863K9739J6876P914
$$ 6023384 6126406 6228286 6324756 6412850 6490999 6558660 6615227 6659090 6688829 6705705 6713619
60086F713619K273k416o192o595k451N014J5223K9404M7577O7253Q6786J07747
$$ 6713619 6715892 6713476 6707284 6700689 6698238 6703252 6718475 6747879 6795456 6862709 6949495 7057242
60074G057242J32089J58872J85865K12647K40004K67484K93994L19980L46864
$$ 7057242 7189331 7348203 7534068 7746715 7986719 8254203 8548197 8868177 9215041
60065I215041L74490M00889M24302M43929M58944M68238M71075M66912M55000
$$ 9215041 9589531 9990420 10414722 10858651 11317595 11785833 12256908 12723820 13178820
60056A3178820M35237M08832L76692L37695K90128K34576J73761J09684M2736
$$ 13178820 13614057 14022889 14399581 14737276 15027404 15261980 15435741 15545425 15588161
60047A5588161k6191r4532j59726k20651k76495l25325l64723l93364m11024m17632
$$ 15588161 15561970 15467438 15307712 15087061 14810566 14485241 14120518 13727154 13316130 12898498
60037A2898498m13215l98936l77468l51746l23162k91101k54628k14640j73866
$$ 12898498 12485283 12086347 11708879 11357133 11033971 10742870 10488242 10273602 10099736
60028A0099736j34661r7410o1588k7483L864L1692N5317P3176Q3508Q6009Q1873
$$ 10099736 9965075 9867665 9806077 9778594 9782458 9814150 9869467 9942643 10026151 10112160 10194033
60017A0194033P2164N7241L8008J6492n368k6839m7891o8316q7858j06559j24527
$$ 10194033 10266197 10323438 10361446 10377938 10372570 10345731 10297840 10229524 10141666 10035107 9910580
60006I910580j41748j58258j73823j87241j96875k02356k04920k05509k03468
$$ 9910580 9768832 9610574 9436751 9249510 9052635 8850279 8645359 8439850 8236382
59997H236382j97919j89396j78982j66467j50899j32608j13240r3634p3162n1509
$$ 8236382 8038463 7849067 7670085 7503618 7352719 7220111 7106871 7013237 6940075 6888566
59987F888566k9731q752J2046L3746N6115P7863R7930J15546J29677J39762J46654
$$ 6888566 6858835 6850083 6862129 6895875 6951990 7029853 7127783 7243329 7373006 7512768 7659422
59976G659422J51361J52715J47803J35195J16638R4937P1301M5568J8014j0370
$$ 7659422 7810783 7963498 8111301 8246496 8363134 8458071 8529372 8574940 8592954 8582584
59966H582584l8924o7387r4960j20160j41652j58534j70017j75728j76368j73223
$$ 8582584 8543660 8476273 8381313 8261153 8119501 7960967 7790950 7615222 7438854 7265631
59956G265631j66847j56934j43541j27609j10009r0906p0556m9901k9725r616
$$ 7265631 7098784 6941850 6798309 6670700 6560691 6469785 6399229 6349328 6319603 6309987
59946F309987J1489L3897N6937P9950J02980J26231J49198J70464J88406K02269
$$ 6309987 6321476 6355373 6412310 6492260 6595240 6721471 6870669 7041133 7229539 7431808
59936G431808K12530K19868K23693K22096K13615J98650J78724J54729J26579
$$ 7431808 7644338 7864206 8087899 8309995 8523610 8722260 8900984 9055713 9182292
59927I182292R4560O0090K4804j0632m6126q0778j12495j39240j60357j76215
$$ 9182292 9276852 9336942 9361746 9351114 9304988 9224210 9111715 8972475 8812118 8635903
59917H635903j86744j90796j87325j76900j61551j43109j22139r8805p4220n0067
$$ 8635903 8449159 8258363 8071038 7894138 7732587 7589478 7467339 7368534 7294314 7244247
59907G244247k6836l297K1671M7086P0478R0291J07002J21807J35158J46771J56059
$$ 7244247 7217411 7214114 7235785 7282871 7353349 7443640 7550642 7672449 7807607 7954378 8110437
59896H110437J61876J62702J58217J50267J41306J32140J22246J11759J01664
$$ 8110437 8272313 8435015 8593232 8743499 8884805 9016945 9139191 9250950 9352614
59887I352614R2150Q2578P3534O7290O5341O6973P1235P9040R1898J09740J31520
$$ 9352614 9444764 9527342 9600876 9668166 9733507 9800480 9871715 9950755 10042653 10152393 10283913
59876A0283913J57189J87251K20767K55504K90113L24641L58762L90837M18905
$$ 10283913 10441102 10628353 10849120 11104624 11394737 11719378 12078140 12468977 12887882
59867A2887882M41236M55581M59168M50039M27448L90478L37542K68287J85429
$$ 12887882 13329118 13784699 14243867 14693906 15121354 15511832 15849374 16117661 16303090
59858A6303090R3970j052r5453j85226k66196l34898l89624m30291m57277m70623
$$ 16303090 16397060 16396008 16300555 16115329 15849133 15514235 15124611 14694320 14237043 13766420
59848A3766420m70733m59590m40342m15275l84828l49172l09924k69407k28850
$$ 13766420 13295687 12836097 12395755 11980480 11595652 11246480 10936556 10667149 10438299
59839A0438299j88277j47669j07162o6623k6439J1593M5571P5579J03049J28048
$$ 10438299 10250022 10102353 9995191 9928568 9902129 9913722 9959293 10034872 10137921 10265969
59829A0265969J48655J62975J69990J68151J55286J31034R7940N8965J4936l4426
$$ 10265969 10414624 10577599 10747589 10915740 11071026 11202060 11300000 11358965 11373901 11339475
59819A1339475q7897j42319j94122k40415k79345l10498l34549l51858l61850
$$ 11339475 11251578 11109259 10915137 10674722 10395377 10084879 9750330 9398472 9036622
59810I036622l64282l60342l51733l39334l23551l05352k85976k65934k45095
$$ 9036622 8672340 8311998 7960265 7620931 7297380 6992028 6706052 6440118 6195023
59801F195023k23496k01567j79815j58756j38779j19780j01559q4760p0471n8473
$$ 6195023 5971527 5769960 5590145 5431389 5292610 5172830 5071271 4986511 4916040 4857567
59791D857567m7081l5601k5849k0062j8141j8273j9448k1726k4424k5852k5273
$$ 4857567 4810486 4774885 4749036 4728974 4710833 4692560 4673112 4651386 4626962 4601110 4575837
59780D575837k3835k2966k2779k2574k2342k3044k5587k9739l4207l7816m0535
$$ 4575837 4552002 4529036 4506257 4483683 4461341 4438297 4412710 4382971 4348764 4310948 4270413
59769D270413m2987m5064m5653m4112m1322l8802l7315l6647l6057l4387l0443
$$ 4270413 4227426 4182362 4136709 4092597 4051275 4012473 3975158 3938511 3902454 3868067 3837624
59758C837624k4092j6517q848j286N829J1177J4006J5860J9264K4933L1623L8462
$$ 3837624 3813532 3797015 3788167 3786881 3792710 3803887 3817893 3833753 3853017 3877950 3909573 3948035
59746C948035M5838N3754O0880O6091O9940P3715P7571Q0348Q0949P9327P6108
$$ 3948035 3993873 4047627 4108507 4174598 4244538 4318253 4395824 4476172 4557121 4636448 4712556
59735D712556P1657O5812N8544N0794M4190L9706L6935L5010L4064L5332L9890
$$ 4712556 4784213 4850025 4908569 4959363 5003553 5043259 5080194 5115204 5149268 5184600 5224490
59724E224490M7524N6868O6637P6968Q9472J05438J24069J43301J62446J82959
$$ 5224490 5272014 5328882 5395519 5472487 5561959 5667397 5791466 5934767 6097213 6280172
59714F280172K06246K31909K58841K86814L15921L45424L74292M01889M26480
$$ 6280172 6486418 6718327 6977168 7263982 7579903 7925327 8299619 8701508 9127988
59705I127988M43525M46814M30891L91584L26005K35269J27598J6354q6255j72935
$$ 9127988 9571513 10018327 10449218 10840802 11166807 11402076 11529674 11546028 11459773 11286838
59695A1286838k39761k84169l06220l09916l00990k83510k59377k30094j97545
$$ 11286838 11047077 10762908 10456688 10146772 9845782 9562272 9302895 9072801 8875256
59686H875256j63344j28642r4539o1965l1152j805K6325N3502Q0246J06951J33416
$$ 8875256 8711912 8583270 8488731 8426766 8395614 8393809 8420134 8473636 8553882 8660833 8794249
59675H794249J59286J84884K11205K39124K68769K99538L30480L61058L91830
$$ 8794249 8953535 9138419 9349624 9588748 9857517 10157055 10487535 10848593 11240423
59666A1240423M24222M59330M97163N37216N79356O23636O69580P16209P62808
$$ 11240423 11664645 12123975 12621138 13158354 13737710 14361346 15030926 15747135 16509943
59657A6509943Q09120Q54527Q97231R34523R63753R82944R90691R86081R69289
$$ 16509943 17319063 18173590 19070821 20005344 20969097 21952041 22942732 23928813 24898102
59648B4898102R42255R08314Q70909Q32928P97278P67234P45125P30556P20470
$$ 24898102 25840357 26748671 27619580 28452508 29249786 30017020 30762145 31492701 32213171
59639C2213171P11175O99926O84636O62720O30884N86124N26925M53727L68677
$$ 32213171 32924346 33624272 34308908 34971628 35602512 36188636 36715561 37169288 37537965
59630C7537965K75150J77572Q1222q601q7812j53986k05469k40344k56623k53381
$$ 37537965 37813115 37990687 38071909 38063308 37975496 37821510 37616041 37375697 37119074 36865693
59620C6865693k31541j93570j42407q0297q396P2370J60232K52897L48908M47757
$$ 36865693 36634152 36440582 36298175 36217878 36209482 36281852 36442084 36694981 37043889 37491646
59610C7491646N48058O46373P38446Q20902Q90661R43031R71508R69574R32154
$$ 37491646 38039704 38686077 39424523 40245425 41136086 42079117 43050625 44020199 44952353
59601D4952353Q55583P37346N76777L76348J42754j12781l75728o30890q64802
$$ 44952353 45807936 46545282 47122059 47498407 47641161 47528380 47152652 46521762 45656960
59592D5656960j066686j228846j347458j422849j458318j458689j430016j379298
$$ 45656960 44590274 43361428 42013970 40591121 39132803 37674114 36244098 34864800
59584C4864800j313105j236740j155733j077545j010477r60938r32643r27402
$$ 34864800 33551695 32314955 31159222 30081677 29071200 28110262 27177619 26250217
59576B6250217r44343r77556j016265j048717j066295j064891j044486j008464
$$ 26250217 25305874 24328318 23312053 22263336 21197041 20132150 19087664 18079200
59568A8079200r62034r09764q54193p96587p38113o80122o23986n71008n21753
$$ 18079200 17117166 16207402 15353209 14556622 13818509 13138387 12514401 11943393 11421640
59559A1421640m75453m31085l89184l51450l18282k88071k59574k33568k11131
$$ 11421640 10946187 10515102 10125918 9774468 9456186 9168115 8908541 8674973 8463842
59550H463842j91537j73336j56787j43548j34242j27710j22744j19222j17306
$$ 8463842 8272305 8098969 7942182 7798634 7664392 7536682 7413938 7294716 7177410
59541G177410j16662j17123j19163j22839j26616j28245j26950j24142j21613
$$ 7177410 7060748 6943625 6824462 6701623 6575007 6446762 6319812 6195670 6074057
59532F074057j19478j16381j11386j04824r7207q8378p8295o7933n8375m9433
$$ 6074057 5954579 5838198 5726812 5621988 5524781 5436403 5358108 5290175 5231800 5182367
59522E182367m0101l0221k0823j2845o363r74M003R681J6788K4490L1037L5911
$$ 5182367 5142266 5112045 5091222 5078377 5072014 5071040 5075043 5084724 5101512 5126002 5157039 5192950
59510E192950M0252M4817M8831N1641N4287N8140O2751O6569O9476P3278P9460
$$ 5192950 5233202 5278019 5326850 5378491 5432778 5490918 5553669 5620238 5689714 5762992 5842452
59499E842452Q7593R6479J05861J16261J27694J39513J51567J64631J79325J95256
$$ 5842452 5930045 6026524 6132385 6248646 6376340 6515853 6667420 6832051 7011376 7206632
59489G206632K11772K29087K47690K66856K84739L00244L13822L26114L36801
$$ 7206632 7418404 7647491 7895181 8162037 8446776 8747020 9060842 9386956 9723757
59480I723757L45199L50873L52895L49783L41198L28420L11787K89028K58357
$$ 9723757 10068956 10419829 10772724 11122507 11463705 11792125 12103912 12392940 12651297
59471A2651297K22259J85730J51094J17291Q4211N4481K9744Q034j3073l2571
$$ 12651297 12873556 13059286 13210380 13327671 13411882 13466363 13496107 13504141 13491068 13458497
59461A3458497m7362n5984n8865n5886m6173l0089r341J5148M3986P7366J13409
$$ 13458497 13411135 13355151 13296286 13240400 13194227 13164138 13154797 13169945 13213931 13291297 13404706
59450A3404706J48793J80307K05411K21881K27380K19593J96990J59667J09236
$$ 13404706 13553499 13733806 13939217 14161098 14388478 14608071 14805061 14964728 15073964
59441A5073964M7965k1552r6044j71774k45433l14159l74744m23902m59819m82494
$$ 15073964 15121929 15100377 15004333 14832559 14587126 14272967 13898223 13474321 13014502 12532008
59431A2532008m92274m89402m75440m53663m26921l96348l63056l29362k96671
$$ 12532008 12039734 11550332 11074892 10621229 10194308 9797960 9434904 9105542 8808871
59422H808871k63591k28426j92680j59691j30193j01717p2604m4098j7615P856
$$ 8808871 8545280 8316854 8124174 7964483 7834290 7732573 7659969 7615871 7598256 7606112
59412G606112L4087O0773Q6120J09514J32074J54627J76369J95841K12510K26881
$$ 7606112 7640199 7700972 7787092 7896606 8028680 8183307 8359676 8555517 8768027 8994908
59402H994908K39204K48323K51849K47481K34258K12696J83969J49006J08066
$$ 8994908 9234112 9482435 9734284 9981765 10216023 10428719 10612688 10761694 10869760
59393A0869760O1153R059m6006j01164j54189k03430k46636k81288l06770l24993
$$ 10869760 10930913 10939972 10893966 10792802 10638613 10435183 10188547 9907259 9600489 9275496
59383I275496l37824l44875l45108l39607l30922l20096l06426k90232k73629
$$ 9275496 8937672 8592797 8247689 7908082 7577160 7257064 6950638 6660406 6386777
59374F386777k57755k41161k22337k02494j84225j68173j52799j37101j21901
$$ 6386777 6129022 5887861 5665524 5463030 5278805 5110632 4957833 4820732 4698831
59365D698831j08228r5875q4312p3832o4697n5771m5399l3774k3298j5918j0745
$$ 4698831 4590603 4494728 4410416 4336584 4271887 4216116 4170717 4136943 4113645 4097727 4086982
59354D086982n048K776J2018K1131K9296L6163M0933M2445M0054L4238K6832K0817
$$ 4086982 4081934 4084710 4096728 4117859 4147155 4183318 4224251 4266696 4306750 4340988 4367820 4388637
59342D388637J9047K2327K9012L7067M6121N6781O8324P8151Q3856Q5282Q4366
$$ 4388637 4407684 4430011 4459023 4496090 4542211 4598992 4667316 4745467 4829323 4914605 4998971
59331D998971Q3638Q5151R0200R9149J11320J25439J40557J56552J73696J91976
$$ 4998971 5082609 5167760 5257960 5357109 5468429 5593868 5734425 5890977 6064673 6256649
59321F256649K11229K31914K55093K81153L09007L37293L66175L97150M31155
$$ 6256649 6467878 6699792 6954885 7236038 7545045 7882338 8248513 8645663 9076818
59312I076818M67731N06185N46491N88482O30819O71313P07704P37685P58866
$$ 9076818 9544549 10050734 10597225 11185707 11816526 12487839 13195543 13933228 14692094
59303A4692094P69521P68990P56953P32931O97333O52695O02915N51206M99011
$$ 14692094 15461615 16230605 16987558 17720489 18417822 19070517 19673432 20224638 20723649
59294B0723649M46724L94825L44327K96253K50467K04939J56509J02680M2311
$$ 20723649 21170373 21565198 21909525 22205778 22456245 22661184 22817693 22920373 22962684
59285B2962684k5108r9730j80341k64120l48180m30665n09555n81293o41973o89630
$$ 22962684 22937576 22837846 22657505 22393385 22045205 21614540 21104985 20523692 19881719 19192089
59275A9192089p24398p46728p56607p54515p42101p21529o94621o62544o26033
$$ 19192089 18467691 17720963 16964356 16209841 15467740 14746211 14051590 13389046 12763013
59266A2763013n85955n43959n02140m61604m21965l82805l44950l09419k75908
$$ 12763013 12177058 11633099 11130959 10669355 10247390 9864585 9519635 9210216 8934308
59257H934308k43414k11936j82359j55023j29668j06512q5921o7174m8938l1190
$$ 8934308 8690894 8478958 8296599 8141576 8011908 7905396 7819475 7752301 7703363 7672173
59247G672173j5217j526J0852K2433L2139L8816M2769M4938M5562M4665M2882
$$ 7672173 7656956 7655430 7666282 7688715 7720854 7759670 7802439 7847377 7892939 7937604 7980486
59236G980486M0653L7082L0843K2026J2260L187m283r548j2327j3363j3969j4279
$$ 7980486 8021139 8058221 8089064 8111090 8123350 8126537 8122254 8112706 8100379 8087016 8073047 8058768
59224H058768j2656p570N15R932K0185L2510M7814O5010Q1896R7054J10046J20383
$$ 8058768 8046112 8038542 8039057 8048989 8069174 8101684 8149498 8214508 8296404 8393458 8503504 8623887
59212H623887J27439J31427J33499J34403J33635J30256J23999J15190J03877
$$ 8623887 8751326 8882753 9016252 9150655 9284290 9414546 9538545 9653735 9757612
59203I757612Q9500P1315M9166K4087j762k6109m7489o5116p8525q8076r5198
$$ 9757612 9847112 9918427 9967593 9991680 9989918 9963809 9916320 9851204 9772679 9684603 9589405
59192I589405j00958j04611j04890j02443r9429r6799r3943r1237r0504r2028
$$ 9589405 9488447 9383836 9278946 9176503 9077074 8980275 8886332 8795095 8704591 8612563
59182H612563r3413r2954r2104r2695r3732r3222r1516q9922q7202q0745p0917
$$ 8612563 8519150 8426196 8334092 8241397 8147665 8054443 7962927 7873005 7785803 7705058 7634141
59171G634141o0929n2006m1733k8038j2011M654K2660M3637O7288R1980J17272
$$ 7634141 7573212 7521206 7479473 7451435 7439424 7444078 7466738 7510375 7577663 7669643 7786915
59160G786915J44120J73121K03941K36278K70077L04686L38620L70298L98560
$$ 7786915 7931035 8104156 8308097 8544375 8814452 9119138 9457758 9828056 10226616
59151A0226616M22409M40323M49741M47232M29781L96364L48120K86852K13755
$$ 10226616 10649025 11089348 11539089 11986321 12416102 12812466 13160586 13447438 13661193
59142A3661193J29849L7366n9657j56210k47713l30672m02095m58990m99367n23730
$$ 13661193 13791042 13828408 13768751 13612541 13364828 13034156 12632061 12173071 11673704 11149974
59132A1149974n34535n33826n22503n02306m76898m49478m20394l88738l55502
$$ 11149974 10615439 10081613 9559110 9056804 8579906 8130428 7710034 7321296 6965794
59123F965794l23309k93481k65271k38024k12379j89089j68195j49609j33140
$$ 6965794 6642485 6349004 6083733 5845709 5633330 5444241 5276046 5126437 4993297
59114D993297j17712j01961q5931p1097n8488m7945l9029l1205k3124j3582l379
$$ 4993297 4875585 4773624 4687693 4616596 4558108 4510163 4471134 4439929 4416805 4403223 4399844
59103D399844N408J2420J9377K6941L3332L7291M0556M5724N2798N9614O4986
$$ 4399844 4405252 4417672 4437049 4463990 4497322 4534613 4575169 4620893 4673691 4733305 4798291
59092D798291O9858P5470Q1647Q7092R0775R2824R4165R5200R5122R2941Q8767
$$ 4798291 4868149 4943619 5025266 5112358 5203133 5295957 5390122 5485322 5580444 5673385 5762152
59081E762152Q3218P6102O6967N6679M6882L7777K8070J7306O640l011j1745j9180
$$ 5762152 5845370 5921472 5988439 6045118 6092000 6129777 6157847 6175153 6181793 6178782 6167037 6147857
59069F147857k4186k6903k9021l0931l0522k6254j9600j2770n521L701J4697K5748
$$ 6147857 6123671 6096768 6067747 6036816 6006294 5980040 5960440 5947670 5942149 5945850 5960547 5986295
59057E986295L6282M7241N9111P1217Q2859R3835J04043J13800J24152J35695
$$ 5986295 6022577 6069818 6128929 6200146 6283005 6376840 6480883 6594683 6718835 6854530
59047F854530J47488J58378J68901J80473J93082K05289K16387K26985K37282
$$ 6854530 7002018 7160396 7329297 7509770 7702852 7908141 8124528 8351513 8588795
59038H588795K46179K52467K55633K55023K49159K36556K16632J89361J54570
$$ 8588795 8834974 9087441 9343074 9598097 9847256 10083812 10300444 10489805 10644375
59029A0644375J12152O2766Q035m9706j07661j62719k11959k53611k87555l14431
$$ 10644375 10756527 10819293 10827328 10777622 10669961 10507242 10295283 10041672 9754117 9439686
59019I439686l34111l45822l50215l50142l47998l43136l33699l20554l07000
$$ 9439686 9105575 8759753 8409538 8059396 7711398 7368262 7034563 6714009 6407009
59010F407009k94349k80502k63918k46464k30623k16060k01300j87203j75872
$$ 6407009 6112660 5832158 5568240 5321776 5091153 4875093 4673793 4486590 4310718
59001D310718j66787j56867j44601j31977j21737j14386j08549j02963r7367r2019
$$ 4310718 4143931 3987064 3842463 3710486 3588749 3474363 3365814 3262851 3165484 3073465
58991C073465q7003q1890p6277p0689o6335o3402o0468n6400n2044m8945m7087
$$ 3073465 2986462 2904572 2828295 2757606 2691271 2627869 2567401 2511001 2458957 2410012 2362925
58980B362925m5104m2208l8650l4753l0796k7448k5023k2601j9301j6052j4527
$$ 2362925 2317821 2275613 2236963 2202210 2171414 2143966 2118943 2096342 2077041 2060989 2046462
58969B046462j4406j3389j0184o047k792n59J721M469O791P416O089M128L294
$$ 2046462 2032056 2018667 2008483 2002436 1999644 1999085 2000806 2005275 2012066 2019482 2025571 2029699 2032993
58956B032993L715L659K100N61J073L028L950L179K697L932N701O273N803N462
$$ 2032993 2036708 2040367 2042467 2043028 2044101 2047129 2051079 2054258 2056955 2060887 2066588 2072861 2078664 2084126
58942B084126N368M841L967L484L321K578J080k7L35J761K763K404J126P8m0P07
$$ 2084126 2089494 2094335 2098302 2101786 2105107 2107685 2108765 2108738 2109073 2110834 2113597 2116001 2117127 2117205 2117165 2117872
58926B117872K000L608N237O491P272P940Q963J0558J2580J4503J5618J5913J6470
$$ 2117872 2119872 2123480 2128717 2135208 2142480 2150420 2159383 2169941 2182521 2197024 2212642 2228555 2245025
58913B245025J8215K0408K1542K1690K2514K4622K6679K7943K9808L3288L6640
$$ 2245025 2263240 2283648 2305190 2326880 2349394 2374016 2400695 2428638 2458446 2491734 2528374
58902B528374L7519L6511L6152L7026L7254L5980L5080L6613M0284M4258M7286
$$ 2528374 2565893 2602404 2638556 2675582 2712836 2748816 2783896 2820509 2860793 2905051 2952337
58891B952337M9208N0511N2226N5537O0617O6239P1075P5069P9173Q4104Q9700
$$ 2952337 3001545 3052056 3104282 3159819 3220436 3286675 3357750 3432819 3511992 3596096 3685796
58880C685796R5291J00547J05904J12105J19348J27181J35277J43588J51662J58775
$$ 3685796 3781087 3881634 3987538 4099643 4218991 4346172 4481449 4625037 4776699 4935474
58870D935474J65423J73627J84804J98149K12158K26829K42954K60106K77116
$$ 4935474 5100897 5274524 5459328 5657477 5869635 6096464 6339418 6599524 6876640
58861F876640K94362L13704L36004L60068L84335M08448M33165M59821M89853
$$ 6876640 7171002 7484706 7820710 8180778 8565113 8973561 9406726 9866547 10356400
58852A0356400N23479N58827N93671O28044O63682P00707P36527P68340P95154
$$ 10356400 10879879 11438706 12032377 12660421 13324103 14024810 14761337 15529677 16324831
58843A6324831Q16531Q30846Q35697Q28891Q07982P69774P11606O32868N34715
$$ 16324831 17141362 17972208 18807905 19636796 20444778 21214552 21926158 22559026 23093741
58834B3093741M18981K88287J46906O28j44564k83579m12295n27002o24152p01114
$$ 23093741 23512722 23801009 23947915 23948543 23803979 23520400 23108105 22581103 21956951 21255837
58824B1255837p57360p94529q14864q20161q12530p95209p71321p42308p08666
$$ 21255837 20498477 19703948 18889084 18068923 17256393 16461184 15689863 14947555 14238889
58815A4238889o71868o34131n96599n59293n22857m88758m57419m27786l99258
$$ 14238889 13567021 12932890 12336291 11776998 11254141 10765383 10307964 9880178 9480920
58806I480920l72809l49506l28944l09781k90850k71386k51202k31388k13804
$$ 9480920 9108111 8758605 8429661 8119880 7829030 7557644 7306442 7075054 6861250
58797F861250j99116j85960j72565j58498j44388j30702j17572j05204r3728q2858
$$ 6861250 6662134 6476174 6303609 6145111 6000723 5870021 5752449 5647245 5553517 5470659
58787E470659p2087o1059m9737l8598k8545j9961j1867k757P737J8673K9144L8978
$$ 5470659 5398572 5337513 5287776 5249178 5220633 5200672 5188805 5186048 5193785 5212458 5241602 5280580
58775E280580M8233N7076O6204P6339Q7157R7688J07834J18412J29690J41157
$$ 5280580 5328813 5385889 5452093 5528432 5615589 5713277 5821111 5939523 6069213 6210370
58765F210370J52920J65932J80428J95396K10141K25245K41436K58725K77232
$$ 6210370 6363290 6529222 6709650 6905046 7115187 7340432 7581868 7840593 8117825
58756H117825K97684L20371L44654L70170L97447M26667M57036M88241N21412
$$ 8117825 8415509 8735880 9080534 9450704 9848151 10274818 10731854 11220095 11741507
58747A1741507N57437N95105O32153O67469P01085P32330P59273P79879P92602
$$ 11741507 12298944 12894049 13526202 14193671 14894756 15627086 16386359 17166238 17958840
58738A7958840P95518P85567P59300P14326O49917N66328M64011L44109K09820
$$ 17958840 18754358 19539925 20299225 21013551 21663468 22229796 22693807 23037916 23247736
58729B3247736O6558p9635k23270l58872m80898n85663o72637p42344p93762q25621
$$ 23247736 23314294 23234659 23011389 22652517 22171619 21585956 20913319 20170975 19377213 18551592
58719A8551592q39649q40171q30411q11310p84234p52413p18735o83959o48141
$$ 18551592 17711943 16871772 16041361 15230051 14445817 13693404 12974669 12290710 11642569
58710A1642569o12131n76783n42219n08756m77068m46755m16550l86836l59912
$$ 11642569 11030438 10453655 9911436 9402680 8925612 8478857 8062307 7675471 7315559
58701G315559l36628l14820k92604k71136k52179k34969k18021k02384j89992
$$ 7315559 6978931 6664111 6371507 6100371 5848192 5613223 5395202 5192818 5002826
58692E002826j79641j67812j53609j40053j29807j21988j14133j05523r7146q9732
$$ 5002826 4823185 4655373 4501764 4361711 4231904 4109916 3995783 3890260 3793114 3703382
58682C703382q3068p6752p0661o4901n9725n5369n1785m8701m5949m3406m0672
$$ 3703382 3620314 3543562 3472901 3408000 3348275 3292906 3241121 3192420 3146471 3103065 3062393
58671C062393l7307l3415k9734k7103k6043k6592k8088k9246k9036k7789k7172
$$ 3062393 3025086 2991671 2961937 2934834 2908791 2882199 2854111 2824865 2795829 2768040 2740868
58660B740868k8796l2685l7197m0633m2884m5110m7842n0328n2037n3648n5555
$$ 2740868 2712072 2679387 2642190 2601557 2558673 2513563 2465721 2415393 2363356 2309708 2254153
58649B254153n6496n5275n3049n1875n1308m8809m3906l9528l8172l8674l8055
$$ 2254153 2197657 2142382 2089333 2037458 1986150 1937341 1893435 1853907 1815735 1777061 1739006
58638A739006l5174l1213k7832k6035k5870k6086k5028k2851k1865k3554k6265
$$ 1739006 1703832 1672619 1644787 1618752 1592882 1566796 1541768 1518917 1497052 1473498 1447233
58627A447233k7039k4937k1418j8240j6173j5167j4584j3493j1574r432p606n917
$$ 1447233 1420194 1395257 1373839 1355599 1339426 1324259 1309675 1296182 1284608 1275176 1267570 1261653
58615A261653m143k385l15K677O001P828P518O767P368R001J0310J0906J1022
$$ 1261653 1257510 1255125 1254810 1257487 1263488 1271316 1278834 1285601 1292969 1301970 1312280 1323186 1334208
58602A334208J0392Q883P075N012J539l565q007r423q592q224r200r829q673o258
$$ 1334208 1344600 1353483 1360558 1365570 1367109 1363544 1355537 1346114 1337522 1329298 1320098 1310269 1301596 1295338
58588A295338l902k263j193J8K232N593R208J2316J5169J8108K0558K1906K2609
$$ 1295338 1291436 1289173 1287980 1287998 1290230 1295823 1305031 1317347 1332516 1350624 1371182 1393088 1415697
58575A415697K3510K4813K6617K9394L2892L5621L6817L7967M0990M5710N0493
$$ 1415697 1439207 1464020 1490637 1520031 1552923 1588544 1625361 1663328 1704318 1750028 1800521
58564A800521N4606N8469O2385O6484P1335P7300Q3809R0385R7589J05924J15026
$$ 1800521 1855127 1913596 1975981 2042465 2113800 2191100 2274909 2365294 2462883 2568807 2683833
58553B683833J24868J36313J49047J60821J70571J80458J92476K04889K14783
$$ 2683833 2808701 2945014 3094061 3254882 3425453 3605911 3798387 4003276 4218059
58544D218059K22606K30665K38094K40906K36689K25776K07922J81570J47054
$$ 4218059 4440665 4671330 4909424 5150330 5387019 5612795 5820717 6002287 6149341
58535F149341J07179O3833J7181l0854p5572j13595j45356j71968j92211k04618
$$ 6149341 6256520 6320353 6337534 6306680 6231108 6117513 5972157 5800189 5607978 5403360
58525E403360k10408k12131k10767k05936j97806j87095j74265j60194j46694
$$ 5403360 5192952 4980821 4770054 4564118 4366312 4179217 4004952 3844758 3698064
58516C698064j34939j24122j12936j01635r1440q2708p5046o8676o4383o2193
$$ 3698064 3563125 3439003 3326067 3224432 3132992 3050284 2975238 2906562 2842179 2779986
58506B779986o1118o0185n9104n7937n6588n4675n1849m8320m4931m2261l9936
$$ 2779986 2718868 2658683 2599579 2541642 2485054 2430379 2378530 2330210 2285279 2243018 2203082
58495B203082l7452l5353l4634l5054l5119l3942l2218l1141l1164l2039l3217
$$ 2203082 2165630 2130277 2095643 2060589 2025470 1991528 1959310 1928169 1897005 1864966 1831749
58484A831749l4002l3880l3054l2197l1653l1238l0533k8970k6099k2380j9194
$$ 1831749 1797747 1763867 1730813 1698616 1666963 1635725 1605192 1576222 1550123 1527743 1508549
58473A508549j7306j6053j4705j3670j3295j2646j1020r674j0106j1408j1379
$$ 1508549 1491243 1475190 1460485 1446815 1433520 1420874 1409854 1400180 1390074 1378666 1367287
58462A367287r831q548q396q596q795r503j0518j1167j2155j4738j7884j8853
$$ 1367287 1357456 1348908 1340512 1331916 1323121 1313618 1303100 1291933 1279778 1265040 1247156 1228303
58450A228303j7129j5150j4400j3538j1519r799r720r998q923p120o121n654m495
$$ 1228303 1211174 1196024 1181624 1168086 1156567 1146768 1137048 1127050 1118127 1111007 1104886 1099232 1094737
58437A094737k756j296R9J851K697R65k466m585l868j829n53j23P73K569M124
$$ 1094737 1091981 1090685 1090784 1092635 1095332 1096297 1093831 1089246 1085378 1083549 1082996 1082873 1083646 1086215 1090339
58422A090339M062K298J6j603k449l144l994m671m802m391l703k981k232j156
$$ 1090339 1094401 1096699 1096715 1095112 1092663 1089519 1085525 1080854 1076052 1071661 1067958 1064977 1062745 1061589
58408A061589L93J655J449j63j468j110K55J148J250J126Q30K53K9O06J002J14
$$ 1061589 1061982 1063637 1065086 1064923 1063455 1062345 1062600 1063748 1064998 1066124 1066954 1067207 1067236 1067842 1068844 1068958
58392A068958j345j984k187l420n442o409n793n051n151n419n132m428l284j338
$$ 1068958 1067613 1065629 1063442 1060022 1054580 1048171 1042378 1037327 1032176 1026757 1021625 1017197 1013913 1012575
58378A012575R99K777M010N244N816M628K634K287M086N904O116N234L982K205
$$ 1012575 1013574 1016351 1020361 1025605 1031421 1036049 1038683 1040970 1045056 1050960 1057076 1062310 1066292 1068497
58364A068497M59K54J552K138O85j404k278j872p89J115L667N537N867N485N539
$$ 1068497 1068956 1069210 1070762 1072900 1073585 1072181 1069903 1068031 1067242 1068357 1072024 1077561 1083428 1088913 1094452
58349A094452O137P145Q776J0646J1733J2114J3011J4423J4677J3330J2480J3690
$$ 1094452 1100589 1107734 1116510 1127156 1138889 1151003 1164014 1178437 1193114 1206444 1218924 1232614
58337A232614J5429J5199J2865J0202Q247O619M745K519L05j063r86l02p30k589
$$ 1232614 1248043 1263242 1276107 1286309 1294556 1301175 1305920 1308439 1308744 1307681 1306695 1306393 1305663 1303074
58323A303074m185l908j927N61K521L302K923K338K292K226J669K016M588P608
$$ 1303074 1298889 1294981 1293054 1293615 1296136 1299438 1302361 1304699 1306991 1309217 1310886 1312902 1317490 1325098
58309A325098P975N890M597N277N781N197N882R213J2715J3672J2943J2939J4067
$$ 1325098 1333073 1338963 1343560 1348837 1354618 1359815 1365697 1374910 1387625 1401297 1414240 1427179 1441246
58296A441246J5331J6510J7598J7794J6908J6255J6440J5967J3685J1080J0419
$$ 1441246 1456577 1473087 1490685 1508479 1525387 1541642 1558082 1574049 1587734 1598814 1609233
58285A609233J1857J3722J4504J3591J1399R442Q874Q714P316N516N661P542Q450
$$ 1609233 1621090 1634812 1649316 1662907 1674306 1683748 1692622 1701336 1708652 1714168 1719829 1727371 1735821
58272A735821P812Q090J0125J1518J1140J1384J3880J6571J7535J8261K0600K3427
$$ 1735821 1743633 1751723 1761848 1773366 1784506 1795890 1809770 1826341 1843876 1862137 1882737 1906164
58260A906164K5021K5819K6408K5758K3989K3824K6511K9291K9621K8966K9493
$$ 1906164 1931185 1957004 1983412 2009170 2033159 2056983 2083494 2112785 2142406 2171372 2200865
58249B200865L0218K9704K9518L1238L2761L1415K8623K7698K8939L0367L1501
$$ 2200865 2231083 2260787 2290305 2321543 2354304 2385719 2414342 2442040 2470979 2501346 2532847
58238B532847L3003L4274L4688L5594L8298M1781M4953M8776N3432N6184N5380
$$ 2532847 2565850 2600124 2634812 2670406 2708704 2750485 2795438 2844214 2897646 2953830 3009210
58227C009210N3921N5117N7552N7993N6982N7425N9513O1342O3076O6334P0554
$$ 3009210 3063131 3118248 3175800 3233793 3290775 3348200 3407713 3469055 3532131 3598465 3669019
58216C669019P3727P6010P9305Q4010Q8980R3886R9173J04826J11074J18640J26718
$$ 3669019 3742746 3818756 3898061 3982071 4071051 4164937 4264110 4368936 4480010 4598650 4725368
58205D725368J33009J37384J42600J49771J56773J63101J71862J84147J96044
$$ 4725368 4858377 4995761 5138361 5288132 5444905 5608006 5779868 5964015 6160059
58196F160059K04852K13646K25600K38193K47735K55652K65374K76625K87491
$$ 6160059 6364911 6578557 6804157 7042350 7290085 7545737 7811111 8087736 8375227
58187H375227K98750L11682L25094L38717L55615L77056L99387M20381M43726
$$ 8375227 8673977 8985659 9310753 9649470 10005085 10382141 10781528 11201909 11645635
58178A1645635M72475N03196N31900N60452N91712O23927O56028O92955P39397
$$ 11645635 12118110 12621306 13153206 13713658 14305370 14929297 15585325 16278280 17017677
58169A7017677P93528Q52557R17983R89021J058062J120181J180434J244883J312430
$$ 17017677 17811205 18663762 19581745 20570766 21628828 22749009 23929443 25174326 26486756
58160B6486756J383293J466414J568889J686432J813451J952768K105202K260995
$$ 26486756 27870049 29336463 30905352 32591784 34405235 36358003 38463205 40724200
58152D0724200K414540K577243K762714K970532L199154L462354L776129M141562
$$ 40724200 43138740 45715983 48478697 51449229 54648383 58110737 61886866 66028428
58144F6028428M559045N047047N627257O304117P079828P975409R015399J0209596
$$ 66028428 70587473 75634520 81261777 87565894 94645722 102621131 111636530 121846126
58136A21846126J1574091J3147170J4951230J6957593J9117352K1401786K3801562
$$ 121846126 133420217 146567387 161518617 178476210 197593562 218995348 242796910
58129B42796910K6365040K9261924L2576342L5691613L6854608L3790352K5278522
$$ 242796910 269161950 298423874 331000216 366691829 403546437 437336789 462615311
58122D62615311J2346097k131205j5071718k4606782l0346192l2827967l2934418
$$ 462615311 474961408 472830203 457758485 433151703 402805511 369977544 337043126
58115C37043126l1567935k9458741k7053426k4552843k2045942j9595971j7251003
$$ 337043126 305475191 276016450 248963024 224410181 202364239 182768268 165517265
58108A65517265j5047834j3019770j1175624r480185p884833o373873m965158
$$ 165517265 150469431 137449661 126274037 116793852 108909019 102535146 97569988
58101I7569988l686109k581309j734642j249454j193657j560878k259926l120627
$$ 97569988 93883879 91302570 89567928 88318474 87124817 85563939 83304013 80183386
58093H0183386l934475m537559m874202m978463m906992m704587m414002m079068
$$ 80183386 76248911 71711352 66837150 61858687 56951695 52247108 47833106 43754038
58085D3754038l728008l371605l021549k695775k404536k146254j919044j723647
$$ 43754038 40026030 36654425 33632876 30937101 28532565 26386311 24467267 22743620
58077B2743620j554502j401234j260947j138458j034001r41644q59933p92919
$$ 22743620 21189118 19787884 18526937 17388479 16354478 15412834 14552901 13759982
58069A3759982p39495o91849o45756o03325n64859n26971m89670m56753m28109
$$ 13759982 13020487 12328638 11682882 11079557 10514698 9987727 9498057 9041304 8613195
58060H613195l99205l68982l41272l18215k98954k84311k75699k69785k61387
$$ 8613195 8213990 7845008 7503736 7185521 6886567 6602256 6326557 6056772 5795385
58051E795385k51109k43298k37336k28381k16152k05314j97187j88349j77707
$$ 5795385 5544276 5300978 5063642 4835261 4619109 4413795 4216608 4028259 3850552
58042C850552j67946j59701j50882j42003j35686j30881j23948j15328j08666
$$ 3850552 3682606 3522905 3372023 3230020 3094334 2963453 2839505 2724177 2615511
58033B615511j03737r7083q9421q5129q4012q0952p4599o9302o7272o5794o3564
$$ 2615511 2511774 2414691 2325270 2240141 2156129 2075177 2000578 1931276 1864004 1798210 1734646
58022A734646o2855o3556o1706n6251n1205m8779m6210m1726l7883l6340l4616
$$ 1734646 1671791 1608235 1546529 1490278 1439073 1390294 1344084 1302358 1264475 1228135 1193519
58011A193519l0961k7641k6538k5907k4212k3095k3798k4456k3435k1970k1270
$$ 1193519 1162558 1134917 1108379 1082472 1058260 1035165 1011367 986911 963476 941506 920236
58000I20236k0301j8432j7025j6584j5619j3930j3584j4968j5385j3388j1105
$$ 920236 899935 881503 864478 847894 832275 818345 804761 789793 774408 761020 749915
57989G49915j0477j0481r990j0068j1264j1699r998p559o049n174m486m821o194
$$ 749915 739438 728957 718967 708899 697635 685936 675938 668379 662330 657156 652670 647849 641655
57976F41655o854n967m902m471l538j739r19k246m207n013m758l972k453p05k05
$$ 641655 634801 628834 623932 619461 615923 614184 613265 611019 606812 601799 597041 593069 590616 589911 589706
57961E89706j009j427r95j133j938j346J038K390Q28j575k008r14o87k224m625
$$ 589706 588697 587270 586275 585142 583204 581858 582896 585286 586114 584539 582531 581617 580930 578706 574081
57946E74081o851q157q310q278r229j0313r544p375o639q150r266q103o252n622
$$ 574081 567230 559073 550763 542485 533256 522943 513399 506024 499385 491235 481969 473866 467614 461992
57932D61992n289l639j299J30M15j1j243k794l173k112j291j431r19J023K292
$$ 461992 456703 453064 451765 451895 452310 452299 451056 448262 445089 442977 441686 440255 439336 440359 442651
57917D42651J120q61j266p19j254k400j814Q78L426M003K951J532M67j82o66j197
$$ 442651 443771 442910 441644 440925 439671 437271 435457 436335 439761 443764 446715 448247 448714 448532 447866 446669
57901D46669j620j775k052k641k549r05Q39J51k908n488n895n179m183j991J290
$$ 446669 445049 443274 441222 438581 436032 435127 435966 436117 433209 427721 421826 416647 412464 410473 411763
57886D11763L077J843k19j88J792L733M917N617N517M636M288M945M734K296n03
$$ 411763 414840 416683 416464 416276 418068 421801 426718 432335 437852 442488 446776 451721 456455 458751 458248
57871D58248j349j462l801q245j1661j2474j2258j2692j3487j3825j3687j3104
$$ 458248 456899 455437 451636 443391 431730 419256 406998 394306 380819 366994 353307 340203
57859C40203j1725r687p771o301m989l945l732m244m444l411j001K296N421O944
$$ 340203 328478 318791 311020 304719 299730 295785 292053 287809 283365 279954 278953 281249 286670 293614
57845B93614O196M282L249M170O333Q151Q550P813P271P797Q631Q424P315O726
$$ 293614 299810 304092 307341 311511 317844 325995 334545 342358 349629 357426 366057 374481 381796 388522
57831C88522O941O472M395J747k72j985l942n424n629n381o033p423q210p758
$$ 388522 395463 401935 406330 408077 407805 405820 401878 396454 390825 385444 379411 371988 363778 356020
57817C56020o516n217m619n366p031p935o868m369j566J274M049N778N641M449
$$ 356020 349504 344287 339668 334302 327271 319336 312468 308099 306533 307807 311856 317634 323275 327724
57803C27724L720L847M251M785N744O859P406P150O350N108L412J597J44n94l62
$$ 327724 331444 335291 339542 344327 350071 356930 364336 371486 377836 382944 386356 387953 388097 387503 387141
57788C87141O00R53p84m130o647o701n166l798l222l289m002n026n478n251n443
$$ 387141 387741 388694 387910 383780 377133 370432 365266 361468 358246 354957 350955 345929 340451 335200 329757
57773C29757o530p403p119o256n367l730j071R26N15j824m540p262j0180j2393
$$ 329757 323227 315824 308705 302449 297082 293352 292281 293207 293722 291898 287358 280096 269916 257523
57759B57523j2776j1791j0817j0314j0010r954r881q763o680n803p456r366q318
$$ 257523 244747 232956 222139 211825 201815 191861 181980 173217 166537 160734 153278 143912 135594
57746A35594m697j730p25J69K393M818N820N389M413L465K964L235L844L872L189
$$ 135594 130897 129167 128442 128611 131004 135822 141642 147031 151444 154909 157873 161108 164952 168824 172013
57731A72013K589K644L242M060M699M683M260M590O072P312O993N871N303M649
$$ 172013 174602 177246 180488 184548 189247 193930 198190 202780 208852 216164 223157 229028 234331 238980
57717B38980K252j496m189m541l571k762k820m177o739q899q754o692n170n541
$$ 238980 241232 239736 235547 231006 227435 224673 221853 217676 210937 202038 193284 186592 181422 175881
57703A75881o571o420m698k228p2R70R28Q53J515K357K775L498N048N915M710
$$ 175881 169310 162890 158192 155964 155892 156862 157790 158643 160158 162515 165290 168788 173836 179751 184461
57688A84461L225M369P220P675M479J206R46K282K401J411J081J500J595J575
$$ 184461 187686 192055 199275 206950 211429 212635 213581 215863 218264 219675 220756 222256 223851 225426
57674B25426K321L269L151K235J900K336K572K391K641L728N226O793Q244Q844
$$ 225426 227747 231016 234167 236402 238302 240638 243210 245601 248242 251970 257196 263989 272233 281077
57660B81077P934O197N191N538O557P642Q960J0558J1768J1975J1506J1360J2216
$$ 281077 289011 295208 300399 305937 312494 320136 329096 339654 351422 363397 374903 386263 398479
57647C98479J3787J5050J5381J5542J7090K0462K4082K6007K6084K5977K7221
$$ 398479 412266 427316 442697 458239 475329 495791 519873 545880 571964 597941 625162
57636F25162K9907L3096L5873L7982L9877M2329M5643M9171N1903N3609N5234
$$ 625162 655069 688165 724038 762020 801897 844226 889869 939040 990943 1044552 1099786
57625A099786N8186O3298P0324P8174Q5826R3462J02672J14945J29697J44362
$$ 1099786 1157972 1221270 1291594 1369768 1455594 1549056 1651728 1766673 1896370 2040732
57615B040732J57058J68852J82585J99522K18171K36555K54283K71224K84907
$$ 2040732 2197790 2366642 2549227 2748749 2966920 3203475 3457758 3728982 4013889
57606D013889K90556K83314K59513K17182J58108Q9729K2241l7761q9667j34468
$$ 4013889 4304445 4587759 4847272 5064454 5222562 5312291 5334532 5296771 5207104 5072636
57596E072636j70584j95805k11282k20617k25620k25372k19309k08981j96459
$$ 5072636 4902052 4706247 4494965 4274348 4048728 3823356 3604047 3395066 3198607
57587C198607j82810j68563j54322j40440j27047j14553j03164r2099q0481o9006
$$ 3198607 3015797 2847234 2692912 2552472 2425425 2310872 2207708 2115609 2035128 1966122
57577A966122n9447n2363m6447m0303l3646k6548j8703j0217k251L799P678J0551
$$ 1966122 1906675 1854312 1807865 1767562 1733916 1707368 1688665 1678448 1676197 1679996 1687674 1698225
57565A698225J4084J8987K4491K9618L4997M2347N1764O0955O8153P4557Q2514
$$ 1698225 1712309 1731296 1755787 1785405 1820402 1862749 1914513 1975468 2043621 2118178 2200692
57554B200692R2434J03017J13404J23285J31835J38484J44077J49292J52505J51180
$$ 2200692 2293126 2396143 2509547 2632832 2764667 2903151 3047228 3196520 3349025 3500205
57544C500205J44662J33552J17019R3385O3123K8896p064m3190p6736j04804j27369
$$ 3500205 3644867 3778419 3895438 3988823 4051946 4080842 4073778 4030588 3953852 3849048 3721679
57533C721679j46363j61614j70690j73250j72199j69668j64992j57838j50147
$$ 3721679 3575316 3413702 3243012 3069762 2897563 2727895 2562903 2405065 2254918
57524B254918j43214j35714j26475j16795j08117r9880r1484q4079p8292p2445
$$ 2254918 2111704 1975990 1849515 1732720 1624603 1524723 1433239 1349160 1270868 1198423
57514A198423o5278n8392n3681n0157m5802m0917l7174l4624l2077k9314k6760
$$ 1198423 1133145 1074753 1021072 970915 925113 884196 847022 812398 780321 751007 724247
57503G24247k4065k1153j9412j9656k0025j8174j4520j1129q579o290m739m611
$$ 724247 700182 679029 659617 639961 619936 601762 587242 576113 567534 561244 556505 551894
57491E51894m624k976m34Q17Q33J680L805N530O262P401R679J2161J4387J7128
$$ 551894 547270 544294 543860 544677 545510 547190 550995 556525 562787 570188 579867 592028 606415 623543
57477F23543K0391K2910K4467K6671L0534L5004L8739M1777M4737M7873N1600
$$ 623543 643934 666844 691311 717982 748516 783520 822259 864036 908773 956646 1008246
57466A008246N6511O2136O7126P1337P6314Q3037R0527R7507J04068J10706J16892
$$ 1008246 1064757 1126893 1194019 1265356 1341670 1424707 1515234 1612741 1716809 1827515 1944407
57455A944407J21769J25369J28038J29167J27374J21599J11436R6902P8449N6908
$$ 1944407 2066176 2191545 2319583 2448750 2576124 2697723 2809159 2906061 2984510 3041418
57445C041418L3024P321j9345m5512o9469q9726j05301j16295j23994j29630j32938
$$ 3041418 3074442 3081763 3062418 3016906 2947437 2857711 2752410 2636115 2512121 2382491 2249553
57434B249553j32588j28077j20503j11579j02649r4574q7515q0619p2731o3717
$$ 2249553 2116965 1988888 1868385 1756806 1654157 1559583 1472068 1391449 1318718 1255001
57424A255001n4555m6192l8988l3061k8279k3869j9011j3854r193n188j318K590
$$ 1255001 1200446 1154254 1115266 1082205 1053926 1030057 1011046 997192 987999 982811 981493 984083
57412I84083O354J0340J5121K0094K4006K7123L1465L8044M5183N0642N4475N8586
$$ 984083 990437 1000777 1015898 1035992 1059998 1087121 1118586 1156630 1201813 1252455 1306930 1365516
57400A365516O3986O9742P4651P8887Q3567Q9185R5011R9969J03586J05693J05521
$$ 1365516 1429502 1499244 1573895 1652782 1736349 1825534 1920545 2020514 2124100 2229793 2335314
57389B335314J01819R4019Q2412O6784M6066K0258q046l5370o0131q2447j01812
$$ 2335314 2437133 2531152 2613564 2680348 2726414 2746672 2738626 2703256 2643125 2560678 2458866
57378B458866j16756j26952j33909j38814j40905j38885j33102j25546j18114
$$ 2458866 2342110 2215158 2081249 1942435 1801530 1662645 1529543 1403997 1285883
57369A285883j11457j05143r8469r1241q3999p7438p1707o6502o1534n6468n0914
$$ 1285883 1174426 1069283 970814 879573 795574 718136 646429 579927 518393 461925 411011
57358D11011m5166m0534l7966l6688l5145l2993l0949k8925k5952k2156j9268
$$ 411011 365845 325311 287345 250657 215512 182519 151570 122645 96693 74537 55269
57347E5269j8462A8006e66j7245j5471j4015j3411j3860j4744j4851j3872j3063
$$ 55269 36807 18006 -566 -17811 -33282 -47297 -60708 -74568 -89312 -104163 -118035 -131098
57335a31098j3583j4579j3932j0965p544o040o683p563p222o514p191r189j0423
$$ -131098 -144681 -159260 -173192 -184157 -191701 -197741 -204424 -211987 -219209 -225723 -232914 -242103 -252526
57322b52526r503p453o069n652n422n292n821o826p345o946o032n063m437m723
$$ -252526 -262029 -269482 -275551 -281203 -286625 -291917 -297738 -304564 -311909 -318855 -324887 -329950 -334387 -339110
57308c39110n874o610n899m670m532n082m332k002l58j128l244m537m352l518
$$ -339110 -344984 -351594 -357493 -362163 -366695 -371777 -376109 -378111 -378469 -379597 -382841 -387378 -391730 -395248
57294c95248k736k060j260l1J615K800K455R37j3N58J696K140K027K169K450K025
$$ -395248 -397984 -400044 -401304 -401335 -399720 -396920 -394465 -393528 -393541 -392983 -391287 -389147 -387120 -384951 -382501 -380476
57278c80476P13o27j012k76P90J083L56l80k19J87n11k156l026k210p34J94P48
$$ -380476 -379763 -380390 -381402 -381678 -380888 -379805 -379449 -379829 -380048 -379861 -380372 -382528 -385554 -387764 -388498 -388304 -387556
57261c87556J510K111J927J339J270J929K829L594M074M032L462K940K980L220
$$ -387556 -386046 -383935 -382008 -380669 -379399 -377470 -374641 -371047 -366973 -362941 -359479 -356539 -353559 -350339
57247c50339K817J673Q85J793M533P605R240R321R417J0564J1883J2297J2556
$$ -350339 -347522 -345849 -344964 -343171 -338638 -331033 -321793 -312472 -303055 -292491 -280608 -268311 -255755
57234b55755J4071J6355J7607J7724J8723K1688K5191K7528K8838K9963g355B3260
$$ -255755 -241684 -225329 -207722 -189998 -171275 -149587 -124396 -96868 -68030 -38067 -7355 23260
57221E3625L0993L2233L2858L2504L2147L2747L3907L4199L2661K9889K7225K4687
$$ 53625 84618 116851 149709 182213 214360 247107 281014 315213 347874 377763 404988 429675
57209D29675K0671J4417P757K924p17n727j2726j9491k4108k6964k9119l0729
$$ 429675 450346 464763 472520 475444 474727 469000 456274 436783 412675 385711 356592 325863
57197C25863l1789l2671l3025l1837k9385k7591k7470k7770k7040k5511G836a4315
$$ 325863 294074 261403 228378 196541 167156 139565 112095 84325 57285 31774 7836 -14315
57184c4259j8024j6966j6251j5282j4081j2259q958m857k569l668o639q906r481
$$ -34259 -52283 -69249 -85500 -100782 -114863 -127122 -136080 -140937 -143506 -147174 -153813 -162719 -172200
57171a72200q437n532j103L028N361O536P953R634J0913J2098J3804J5494J6254
$$ -172200 -180637 -186169 -187272 -184244 -178883 -172347 -164394 -154760 -143847 -131749 -117945 -102451 -86197
57158h6197J6361J6721J7371J7700d95A6756J7256J8291K0733K3380K4491K4516
$$ -86197 -69836 -53115 -35744 -18044 -495 16756 34012 52303 73036 96416 120907 145423
57146A45423K5817K8867L1171L1225L0981L2510L4785L6084L7147L9155M0728
$$ 145423 171240 200107 231278 262503 293484 325994 360779 396863 434010 473165 513893
57135E13893M0144L8884L9589M1723M2737M2614M3825M7164N0864N3693N5955
$$ 513893 554037 592921 632510 674233 716970 759584 803409 850573 901437 955130 1011085
57124A011085N7397N7169N6066N6139N7576N8321N7162N5157N3661N2880N2661
$$ 1011085 1068482 1125651 1181717 1237856 1295432 1353753 1410915 1466072 1519733 1572613 1625274
57113A625274N2909N3092N2810N2690N3202N3146N1170M8262M6843M7820N0397
$$ 1625274 1678183 1731275 1784085 1836775 1889977 1943123 1994293 2042555 2089398 2137218 2187615
57102B187615N4053N8520O2428O4386O5083O6317O8337O9984P0722P0465O8463
$$ 2187615 2241668 2300188 2362616 2427002 2492085 2558402 2626739 2696723 2767445 2837910 2906373
57091B906373O4649O0992N8862N6170M9964M0690L0756J9943N945j1237k9165
$$ 2906373 2971022 3032014 3090876 3147046 3197010 3237700 3268456 3288399 3294344 3283107 3253942
57080C253942m6812o4895q2729r8458j12279j25761j38123j47157j53831j61982
$$ 3253942 3207130 3142235 3059506 2961048 2848769 2723008 2584885 2437728 2283897 2121915
57070B121915j73245j86092k00054k16755k36479k57892k81744B58776h7590l87765
$$ 2121915 1948670 1762578 1562524 1345769 1109290 851398 569654 258776 -87590 -475355
57060d75355m36997m97180n67082o41870p20147q05181q98860j000341j111846
$$ -475355 -912352 -1409532 -1976614 -2618484 -3338631 -4143812 -5042672 -6043013 -7154859
57051g154859j239416j385604j547049j721505j911896k121417k350697k602713
$$ -7154859 -8394275 -9779879 -11326928 -13048433 -14960329 -17081746 -19432443 -22035156
57043b2035156k885150l205489l569480l987367m476499n055993n743830o558138
$$ -22035156 -24920306 -28125795 -31695275 -35682642 -40159141 -45215134 -50958964 -57517102
57035e7517102p510559q593877r783718j1056002j2396451j3790964j5206709
$$ -57517102 -65027661 -73621538 -83405256 -94461258 -106857709 -120648673 -135855382
57028a35855382j6563231j7699479j8403306j8570972j8398623j8347245j8764497
$$ -135855382 -152418613 -170118092 -188521398 -207092370 -225490993 -243838238 -262602735
57021b62602735j9436665j9522318j8007131j4335004q738332k091879M524566
$$ -262602735 -282039400 -301561718 -319568849 -333903853 -342642185 -344734064 -340209498
57014c40209498J0255188J4687408J7815220J9841020K0986487K1427186K1320276
$$ -340209498 -329954310 -315266902 -297451682 -277610662 -256624175 -235196989 -213876713
57007b13876713K0821554K0055959J9093184J7966131J6703965J5343333J3923761
$$ -213876713 -193055159 -172999200 -153906016 -135939885 -119235920 -103892587 -89968826
57000h9968826J2487362J1079592R741450Q500839P373534O367877N484577M716186
$$ -89968826 -77481464 -66401872 -56660422 -48159583 -40786049 -34418172 -28933595 -24217409
56992b4217409M051851L481633K994890K578615K221199J915963J658413J441899
$$ -24217409 -20165558 -16683925 -13689035 -11110420 -8889221 -6973258 -5314845 -3872946
56984c872946J258272J100816e49396B95405P39137O47069N68416N01417M44078
$$ -3872946 -2614674 -1513858 -549396 295405 1034542 1681611 2250027 2751444 3195522
56975C195522L95578L54899L19601K87478K58329K32839K10772J91401J74437
$$ 3195522 3591100 3945999 4265600 4553078 4811407 5044246 5255018 5446419 5620856
56966E620856J59382J45031J30801J17588J06121R5469Q4341P3038O2860N4165
$$ 5620856 5780238 5925269 6056070 6173658 6279779 6375248 6459589 6532627 6595487 6649652
56956F649652M6211L8520L1183K4029J6736J0175O631P593J1255J3413J2250J1837
$$ 6649652 6695863 6734383 6765566 6789595 6806331 6816506 6823137 6830730 6841985 6855398 6867648 6879485
56944F879485J8372L1291L9508K9115m762n4421j06658j51168j83210k02403k11499
$$ 6879485 6897857 6929148 6968656 6997771 6993009 6938588 6831930 6680762 6497552 6295149 6083650
56933F083650k14689k14846k12351k07143k00694j95107j91193j88294j85205
$$ 6083650 5868961 5654115 5441764 5234621 5033927 4838820 4647627 4459333 4274128
56924D274128j80522j73126j63408j53379j44819j38015j32813j29634j28313
$$ 4274128 4093606 3920480 3757072 3603693 3458874 3320859 3188046 3058412 2930099
56915B930099j27115j24431j20773j17597j14784j10959j05980j01239r7172r2295
$$ 2930099 2802984 2678553 2557780 2440183 2325399 2214440 2108460 2007221 1910049 1817754
56905A817754q5465p7682p0526o3649n5198m4509l3352k4135j7582j2652q467
$$ 1817754 1732289 1654607 1584081 1520432 1465234 1420725 1387373 1363238 1345656 1333004 1324537
56894A324537n671n604q517j3110j7715k1364k3646k4385k3973k3418k3243k2644
$$ 1324537 1318866 1313262 1304745 1291635 1273920 1252556 1228910 1204525 1180552 1157134 1133891 1111247
56882A111247k0502j7073j3889j1987j0934r807q283o544m742k955j214O93K881
$$ 1111247 1090745 1073672 1059783 1047796 1036862 1027055 1018772 1012228 1007486 1004531 1003317 1004010 1006891
56869A006891M465L650n30o951j3484j8970k3407k6572k7748k7039k5850k5357
$$ 1006891 1011356 1015006 1014476 1007525 994041 975071 951664 925092 897344 870305 844455 819098
56857H19098k5139k4080k2149k0423j9459j8451j6337j3161j0131q519q597r385
$$ 819098 793959 769879 747730 727307 707848 689397 673060 659899 649768 641249 632652 623267
56845F23267r308p478m510j926p12o20q11o44L22K418N394Q169R733J0356J1386
$$ 623267 613959 606481 601971 600045 599333 598713 597902 597258 597580 599998 605392 613561 623294 633650 645036
56830F45036J3773J7209K0608K3036K4072K3835K2952K2059K0916J8424J3953
$$ 645036 658809 676018 696626 719662 743734 767569 790521 812580 833496 851920 865873
56819H65873Q425L570K47j927l407m024l651k856k304j862p64J498M792Q589J2100
$$ 865873 874298 877868 878115 876188 872781 868757 865106 862250 859946 858084 857320 858818 863610 872199 884299
56804H84299J4617J6302J8488K2407K7628L2265L4611L3839K9222K0180P886m203
$$ 884299 898916 915218 933706 956113 983741 1016006 1050617 1084456 1113678 1133858 1141744 1137541
56792A137541j2709j7079j9279k0970k1906k1027j8033j3555q418l176J902O843
$$ 1137541 1124832 1107753 1088474 1067504 1045598 1024571 1006538 992983 984565 981389 983291 990134
56780I90134J1811J6962K2520K8835L5962M3200M9467N3987N6029N4025M5989
$$ 990134 1001945 1018907 1041427 1070262 1106224 1149424 1198891 1252878 1308907 1362932 1408921
56769A408921L1523J3086n307k0610l1848l9254m3128m3718m1671l8153l4334
$$ 1408921 1440444 1453530 1448223 1427613 1395765 1356511 1313383 1269665 1227994 1189841 1155507
56758A155507l0764k7156k2777j7120j0335l122L683R587J4658J9296K3768K7829
$$ 1155507 1124743 1097587 1074810 1057690 1047355 1044233 1047916 1057503 1072161 1091457 1115225 1143054
56746A143054L0676L1100K7810K0223R262k895j4226k3820l1356l6273l8146l7519
$$ 1143054 1173730 1204830 1232640 1252863 1262125 1259230 1245004 1221184 1189828 1153555 1115409 1077890
56734A077890l5555l2903k9605k5988k2667j9487j5442j0164m714l12L099O328
$$ 1077890 1042335 1009432 979827 953839 931172 911685 896243 886079 881365 881053 884152 890480
56722H90480R509J1971J3225J3212J1690Q211K953l065q895j4246j8959k2320
$$ 890480 899989 911960 925185 938397 950087 958298 961251 958186 949291 935045 916086 893766
56710H93766k3505k2612k0797j9271j8361j7569j6283j4283j1838r669q577q653
$$ 893766 870261 847649 826852 807581 789220 771651 755368 741085 729247 719578 711001 702348
56698G02348q815p739n492l701l675m775n269m486l389k979k929k190n33R64R51
$$ 702348 693533 685794 680302 676601 672926 668151 662882 658396 655007 652028 649099 646909 646376 647340 648291
56683F48291q12l083m363m363l938l537k638j194n32j632l147k874r61J45q02
$$ 648291 647479 644396 640033 635670 631732 628195 625557 624363 623831 622199 619052 616178 615217 615362 614560
56668F14560k277k598k240k368k689k462k409l553m937m578k505q02m94m06M35
$$ 614560 612283 609685 607445 605077 602388 599926 597517 593964 589027 584449 581944 581142 580648 580242 580677
56653E80677J132O36m93j172j441j724j438J21K060K533J085q84k030k377k499
$$ 580677 581809 582445 581952 580780 579339 577615 576177 576298 578358 580891 581976 581092 579062 576685 574186
56638E74186k461k103j683j636j963k290k420k590l263m634o218p070o754n898
$$ 574186 571725 569622 567939 566303 564340 562050 559630 557040 553777 549143 542925 535855 529101 523203
56624E23203n331m823l433j198M07J69j368k627k744j896m07J502L209L841L240
$$ 523203 517872 513049 509616 508418 508825 508994 507626 504999 502255 500359 499952 501454 504663 508504 511744
56609E11744K215J660J803K368K942L031K285J015J04K02J158K396L496M334N044
$$ 511744 513959 515619 517422 519790 522732 525763 528048 529063 529167 529369 530527 532923 536419 540753 545797
56594E45797O039P615R403J0545J0633J0088R497R006Q465P679O367M394K300
$$ 545797 551836 559451 568854 579399 590032 600120 609617 618623 627088 634767 641134 645528 647828
56581F47828Q80P7r58k372l145k792k573l990o685q881r469q684p218n836n545
$$ 647828 648708 648785 647827 645455 642310 639518 636945 632955 626270 617389 607920 599236 592018 586182 580637
56566E80637o752q242q218o475m518l477l074k832k973l510l568k439o19Q05J289
$$ 580637 573885 565643 557425 550950 546432 542955 539881 537049 534076 530566 526998 524559 523940 524745 526034
56551E26034R25J37l20J84J191J233l94k539l476k781j308J12J211J717J264l6
$$ 526034 526959 527096 526776 526960 528151 529384 528990 526451 522975 520194 518886 518998 520209 521926 523190 523154
56535E23154j372j797r62N87J812K003J395P25L96L42N59J110J698J960K139K663
$$ 523154 521782 519985 519023 519610 521422 523425 524820 525545 525941 526283 526842 527952 529650 531610 533749 536412
56519E36412L120K704J771J679K692L384K845K128K581M035N782P962J0435J1454
$$ 536412 539532 542236 544007 545686 548378 551762 554607 556735 559316 563351 569133 577095 587530 598984
56505E98984R643O734O030Q163J0544J1273J1373J2293J3392J3432J2884J2885
$$ 598984 608627 615361 621391 629554 640098 651371 662744 675037 688429 701861 714745 727630
56493G27630J2914J1566R271Q152Q883R516Q188N677M122M020L788J998j005l872
$$ 727630 740544 752110 761381 769533 778416 787932 796120 801797 805919 809939 813727 815725 814720 810848
56479H10848n741o648p122p722q680r723j0501j1199j2305j3595j4063j3259j2027
$$ 810848 805107 798459 791337 783615 774935 765212 754711 743512 731207 717612 703549 690290 678263
56466F78263j1373j1126j0530r589q959q754q539q302q352q294p267n486m324
$$ 678263 666890 655764 645234 635645 626686 617932 609393 601091 592739 584445 577178 571692 567368
56453E67368m469m986m764l939l231k722k130j651j659j959j972j448n83J50N8
$$ 567368 562899 557913 553149 549210 545979 543257 541127 539476 537817 535858 533886 532438 531855 532005 532063
56438E32063j164k586k742j594p95j265j696n52J512K626K267J360M68m38p29
$$ 532063 530899 528313 525571 523977 523182 521917 520221 519669 521181 523807 526074 527434 527902 527464 526735
56423E26735M19K212K703J389j44n95l61%R97K731L694K529K30r05o5J704L556
$$ 526735 527154 529366 532069 533458 533314 532719 532358 532358 533355 536086 539780 542309 542539 541634 541569 543273 546829
56406E46829N686P958R199Q596P042O225O699P554P831P696Q042R116R893R030
$$ 546829 552515 560473 569672 578268 585310 591535 598234 605788 613619 621315 629357 638473 648366 657396
56392F57396O585M335L934M807M684K522j6p51L5J79j128k359k359k243l398m884
$$ 657396 663981 668316 672250 677057 681741 684263 684247 683496 683531 683710 682582 680223 677864 675621 672223 667339
56376F67339m743l204k483l404m290l866l315m264o102o857o053n219n719p144
$$ 667339 662596 659392 656909 653505 649215 645349 642034 637770 631668 624811 618758 613539 607820 600676
56362F00676p931o941m510k418k402m206n527m430j414J465K825K634J401j52
$$ 600676 592745 585804 581294 578876 576474 572268 566741 562311 560897 562362 565187 567821 569222 569070
56348E69070j033p38L1L52L48M67n5k397n662o969m741p61J936K256J170m15k441
$$ 569070 568037 567299 567330 567682 568030 568497 568442 566045 560383 553414 548673 547912 549848 552104 553274 552859 550418
56331E50418m630n965n771m537l232k327j845j945k808m050m864m746l691j711
$$ 550418 545788 539823 534052 529515 526283 523956 522111 520166 517358 513308 508444 503698 500007 498296
56317D98296J198M329O312O472N756N509N723N308L839K107R74N89P97J477K242
$$ 498296 499494 503823 510135 516607 522363 527872 533595 538903 542742 544849 545823 546412 547209 548686 550928
56302E50928K704L124M079N455O629P525Q263P941N437J828R8J588M260N588N559
$$ 550928 553632 556756 560835 566290 572919 580444 588707 596648 602085 603913 604011 605599 609859 615447 621006
56287F21006N502N461M676L573L278L674L681L073K389J526J69o88M37L109N126
$$ 621006 626508 631969 636645 640218 643496 647170 650851 653924 656313 657839 658008 657320 657757 660866 665992
56272F65992N301M540L923L331K547K167K622L318L669M205N802Q122R514Q549
$$ 665992 671293 675833 679756 683087 685634 687801 690423 693741 697410 701615 707417 715539 725053 733602
56258G33602N639L121L297O010Q633R058Q074P979R506J1321J2180J2126J1620
$$ 733602 739241 742362 745659 751669 760302 769360 777434 785413 794919 806240 818420 830546 842166
56245H42166J0861J0270J0496J1523J2606J3268J3652J3833J3651J3306J3170
$$ 842166 853027 863297 873793 885316 897922 911190 924842 938675 952326 965632 978802
56234I78802J2925J1852J0166R130R484J0519J1097J0986J0884J1481J2674J3540
$$ 978802 991727 1003579 1013745 1022875 1032359 1042878 1053975 1064961 1075845 1087326 1100000 1113540
56222A113540J3372J2923J3959J7071K0635K2855K4058K5789K8241L0187L1260
$$ 1113540 1126912 1139835 1153794 1170865 1191500 1214355 1238413 1264202 1292443 1322630 1353890
56211A353890L2743L5876M0547M5897N1209N6089O0615O5449P1091P7222Q3440
$$ 1353890 1386633 1422509 1463056 1508953 1560162 1616251 1676866 1742315 1813406 1890628 1974068
56200A974068R0249R8365J07447J16518J25171J33297J40249J45683J50693J56607
$$ 1974068 2064317 2162682 2270129 2386647 2511818 2645115 2785364 2931047 3081740 3238347
56190C238347J62938J67894J70464J70478J67242J59902J48804J34724J17226
$$ 3238347 3401285 3569179 3739643 3910121 4077363 4237265 4386069 4520793 4638019
56181D638019R5852P2517N0270K9758R309j1460l0683m7156o1507p3897q3210
$$ 4638019 4733871 4806388 4856658 4886416 4895725 4884265 4853582 4806426 4744919 4671022 4587812
56170D587812q9493r4624r9435j02623j03782j04971j07635j10213j10855j10509
$$ 4587812 4498319 4403695 4304260 4201637 4097855 3992884 3885249 3775036 3664181 3553672
56160C553672j11173j12604j13115j12461j11869j11721j11141j09501j06840
$$ 3553672 3442499 3329895 3216780 3104319 2992450 2880729 2769588 2660087 2553247
56151B553247j03221r8846r4418r0268q5717q0156p4152o8642o3672n8786n3946
$$ 2553247 2450026 2351180 2256762 2166494 2080777 2000621 1926469 1857827 1794155 1735369 1681423
56140A681423m9214m4288l9210l4790l1566k8983k6310k3627k1317j9466j8205
$$ 1681423 1632209 1587921 1548711 1513921 1482355 1453372 1427062 1403435 1382118 1362652 1344447
56129A344447j7661j7061j5003j1384p881n867m946m194l544l077k199n55J269
$$ 1344447 1326786 1309725 1294722 1283338 1275457 1269590 1264644 1260450 1256906 1253829 1251630 1251075 1252344
56116A252344K851M583O504P779Q342R764J3225J7671K1003K2260K1801K0500
$$ 1252344 1255195 1259778 1266282 1274061 1282403 1292167 1305392 1323063 1344066 1366326 1388127 1408627
56104A408627J9691K0712K3294K5432K5883K5791K6872K9141L1516L3584L5505
$$ 1408627 1428318 1449030 1472324 1497756 1523639 1549430 1576302 1605443 1636959 1670543 1706048
56093A706048L7034L7898L8503L9407M0630M2189M4332M6784M8774N0560N3764
$$ 1706048 1743082 1780980 1819483 1858890 1899520 1941709 1986041 2032825 2081599 2132159 2185923
56082B185923N9510O7222P5861Q5198R5371J06396J18554J31911J45066J55856
$$ 2185923 2245433 2312655 2388516 2473714 2569085 2675481 2794035 2925946 3071012 3226868
56072C226868J63401J67684J67289J60295J48012J34852J23498J12886J01906
$$ 3226868 3390269 3557953 3725242 3885537 4033549 4168401 4291899 4404785 4506691
56063D506691R1482Q1060O6721M6055K2373P76j7818l5371n1422o3279p0922p8115
$$ 4506691 4598173 4679233 4745954 4792009 4814382 4815158 4797340 4761969 4710547 4647268 4576346 4498231
56051D498231q8343j02174j18532j35935j51986j63675j69129j68348j62489j53116
$$ 4498231 4409888 4307714 4189182 4053247 3901261 3737586 3568457 3400109 3237620 3084504
56041C084504j41632j28621j14294r9926q7524p7516o8367n9222n0928m3680l6070
$$ 3084504 2942872 2814251 2699957 2600031 2512507 2434991 2366624 2307402 2256474 2212794 2176724
56030B176724k7832k1024j6756j3132q494m169j720J70L220O055O238M357L116
$$ 2176724 2148892 2127868 2111112 2097980 2089486 2085317 2083597 2083767 2086987 2093042 2099280 2103637 2106753
56017B106753L469M209M464M284L688L052L364M587N387N821Q008J2350J5791
$$ 2106753 2110222 2114431 2118895 2123179 2126867 2129919 2133283 2137870 2143257 2149078 2157086 2169436 2185227
56004B185227J6165J5498J6465J8372J9696K1739K6158L1275L4530L6543L9096
$$ 2185227 2201392 2216890 2233355 2251727 2271423 2293162 2319320 2350595 2385125 2421668 2460764
55993B460764M1368M1974M2531M5141M8230M9018M8290M8546M9251M8395M7142
$$ 2460764 2502132 2544106 2586637 2631778 2680008 2729026 2777316 2825862 2875113 2923508 2970650
55982B970650M8251N1131N3018N4034N6594O0699O4165O6766P0055P3823P6805
$$ 2970650 3018901 3070032 3123050 3177084 3233678 3294377 3358542 3425308 3495363 3569186 3645991
55971C645991P9913Q4854R0625R5265R9789J06379J14162J20920J27335J35277
$$ 3645991 3725904 3810758 3901383 3996648 4096437 4202816 4316978 4437898 4565233 4700510
55961D700510J43710J50892J58736J70001J82931J93763K02793K12832K23538
$$ 4700510 4844220 4995112 5153848 5323849 5506780 5700543 5903336 6116168 6339706
55952F339706K32662K41092K51047K61229K69484K78018K89997L03393L14817
$$ 6339706 6572368 6813460 7064507 7325736 7595220 7873238 8163235 8466628 8781445
55943H781445L26898L44569L66320L86901M06738M30422M57479M83203N07442
$$ 8781445 9108343 9452912 9819232 10206133 10612871 11043293 11500772 11983975 12491417
55934A2491417N34107N63164N91870O22865O61954P08853P59062Q13387Q75531
$$ 12491417 13025524 13588688 14180558 14803423 15465377 16174230 16933292 17746679 18622210
55925A8622210R41640J003191J059900J119147J183602J251078J325760J416616
$$ 18622210 19563850 20567041 21626941 22746088 23929690 25180768 26506528 27923144
55917B7923144J524064J640615J764736J901017K046885K194337K346290K516295
$$ 27923144 29447208 31087823 32852559 34753576 36800461 38994798 41341088 43857383
55909D3857383K710560K925940L167480L451235L787140M176374M629014N166630
$$ 43857383 46567943 49493883 52661363 56112598 59899738 64076112 68705126 73871756
55901G3871756N803831O544567P398562Q382751R506911J0781167J2238626J3927087
$$ 73871756 79675587 86220154 93618716 102001467 111508378 122289545 134528171 148455258
55893A48455258J5881937J8134863K0735790K3718190K7043137L0599350L4148299
$$ 148455258 164337195 182472058 203207848 226926038 253969175 284568525 318716824
55886C18716824L7034516L7882568L4898934K6973518J4767469O81511j2395827
$$ 318716824 355751340 393633908 428532842 455506360 470273829 470955340 458559513
55879D58559513k2483174k8998982l2347018l3296080l2622155l0970525k8789782
$$ 458559513 436076339 407077357 374730339 341434259 308812104 277841579 249051797
55872B49051797k6339016k3773459k1219030j8780367j6528505j4507526j2736631
$$ 249051797 222712781 198939322 177720292 158939925 142411420 127903894 115167263
55865A15167263j1198983r852058q661779p615889o704981n911180n220778m630164
$$ 115167263 103968280 94116222 85454443 77838554 71133573 65222393 60001615 55371451
55857E5371451m132183l709728l347114l035409k763678k517856k292254k091212
$$ 55371451 51239268 47529540 44182426 41147017 38383339 35865483 33573229 31482017
55849C1482017j916323j761976j624737j506004j403006j307516j215940j131494
$$ 31482017 29565694 27803718 26178981 24672977 23269971 21962455 20746515 19615021
55841A9615021j055015r83135r16705q60763q14151p68750p21247o76453o36853
$$ 19615021 18560006 17576871 16660166 15799403 14985252 14216502 13495255 12818802 12181949
55832A2181949n98165n58024n20131m86640m54470m22306l93691l70157l48430
$$ 12181949 11583784 11025760 10505629 10018989 9564519 9142213 8748522 8378365 8029935
55823H029935l27107l09066k94633k79573k62559k47656k36513k25024k10965
$$ 8029935 7702828 7393762 7099129 6819556 6556997 6309341 6072828 5847804 5636839
55814E636839j98145j89416j81881j72752j64095j57822j51552j43315j35537
$$ 5636839 5438694 5249278 5067397 4894645 4730550 4572728 4421176 4277861 4142324
55805D142324j30435j26011j20181j14543j10672j06812j01755r8130r8429j01233
$$ 4142324 4011889 3885878 3765697 3651154 3540482 3433670 3331915 3233785 3135356 3034123
55795C034123j04053j06376j07381j04736r8533r2560q8773q4405p7579p1586
$$ 3034123 2930070 2823694 2716313 2611577 2513044 2420484 2331711 2247306 2169727 2098141
55785B098141o9710o9435o6047n9323n2666m7728m3550l9417l5256l0495k5117
$$ 2098141 2028431 1958996 1892949 1833626 1780960 1733232 1689682 1650265 1615009 1584514 1559397
55774A559397k0523j7270j3799r315n883n433o616o844n597l775j761k51r82m297
$$ 1559397 1538874 1521604 1507805 1498490 1492607 1487174 1480558 1473714 1468117 1464342 1462581 1462330 1461348 1457051
55760A457051p778r458j0658j3644j8162k2437k5994k9269l1794l2853l2839l2397
$$ 1457051 1449273 1439815 1429157 1415513 1397351 1374914 1348920 1319651 1287857 1255004 1222165 1189768
55748A189768l1413l0138k9577k9301k6904k1514j6075j3976j4882j5834j5003
$$ 1189768 1158355 1128217 1098640 1069339 1042435 1020921 1004846 990870 975988 960154 945151
55737I45151j2486q882n242l361l935n225n180l966k941k272j318l20P1J96O83
$$ 945151 932665 923783 918541 915180 911245 906020 900840 896874 893933 891661 890343 890023 890094 890290 890973
55722H90973J026K51j477l051l636k942j341m51k304o871j1628j4543j5998j6859
$$ 890973 891999 892250 890773 887722 884086 881144 879803 879352 877048 870177 858549 844006 828008 811149
55708H11149j6479j4242j1482r833q787o787l965k152k783n987j1011j6209j9564
$$ 811149 794670 780428 768946 759113 750326 743539 739574 737422 734639 728652 717641 701432 681868
55695F81868k0525k0574k1018k1381k0909k0141j9379j7270j2951q397o381o855
$$ 681868 661343 640769 619751 598370 577461 557320 537941 520671 507720 499323 492942 486087
55683D86087p542p462p504p834p129m833k281r61r44j450j789j520o60l7n42j891
$$ 486087 478545 471083 463579 455745 448616 443783 441502 440541 439597 438147 436358 434838 434178 434141 433599 431708
55667D31708k947l295l721m914o504p550p456o386n182m846n544o205n565l612
$$ 431708 428761 425466 421745 416831 410327 402777 395321 388935 383753 378907 373363 367158 361593 357981
55653C57981j690j112j947l020k974j498M89J963K832L454L591K821J757J564
$$ 357981 356291 355179 353232 350212 347238 345740 346229 348192 351024 354478 358069 360890 362647 364211
55639C64211K088J751k50k780m383m842m486l153r28J030J610J178R70J395J827
$$ 364211 366299 368050 367800 365020 360637 355795 351309 348156 347228 348258 349868 351046 352016 353411 355238
55624C55238J780J562J837L020M994P266R482J1707J3763J4668J3533J0844P897
$$ 355238 357018 358580 360417 363437 368431 375697 385179 396886 410649 425317 438850 449694 457591
55611D57591N098K092o53j920j638j207j548k243k913l753m274l404j631j125
$$ 457591 462689 464781 464128 462208 460570 459363 457815 455572 452659 448906 444632 441228 439597 438472
55597D38472k617m031l527k067j316p43J045L413M552M343M086L733J871j512
$$ 438472 435855 431824 428297 426230 424914 424171 425216 428629 433181 437524 441610 445343 447214 445702
55583D45702m343n154m737m526m638m341l504k715k428k627l283m666o974r646
$$ 445702 441359 436205 431468 426942 422304 417963 414459 411744 409316 406689 403406 398740 391766 382120
55569C82120j1415j1510j0634j0110j0204j0100r489q916q441p429o149o059p615
$$ 382120 370705 359195 348561 338451 328247 318147 308658 299742 291301 283872 277723 271664 264049
55556B64049r125q987p799p016o606n667m500m264m955n288m578l361k224j176
$$ 264049 254924 245937 238138 231122 224516 218849 214349 210085 205130 199842 195264 191903 189679 188503
55542A88503k70K20L44M41N00L13J51N59J358J524L00j785l146k478j73J684J323
$$ 188503 188233 188453 188797 189238 189738 190051 190202 190761 192119 193643 193943 192158 189012 186534 186361 188045 189368
55525A89368p32k436k837k840l337m019m408m580m237k622k44R41K02p40m66k15
$$ 189368 188636 186200 183363 180523 177186 173167 168759 164179 159942 157320 157076 158017 158219 157479 157013 156798
55509A56798j691l904m412k741m93J310K702L231K262Q41R13K385K967J454o84
$$ 156798 155107 151203 146791 144050 143557 144867 147569 150800 153062 153903 154816 157201 160168 161622 160938
55494A60938j592j309r59r90j237j646k108k146j448k97R06J983K702K633J572
$$ 160938 159346 158037 157078 156088 154851 153205 151097 148951 147503 147206 148112 150095 152797 155430 157002
55479A57002k87k498m244m406k530L50K607L616L761L221J954P36Q29K266L621
$$ 157002 156715 154217 149973 145567 143037 143387 145994 149610 153371 156592 158546 159282 160111 162377 165998
55464A65998L971L993M484M867M293L540M318O634Q124O806L848K438L965O336
$$ 165998 169969 173962 178446 183313 187606 191146 195464 202098 210222 217028 220876 223314 227279 233615
55450B33615O594M287J357o65k072l766n856p760q791q513p314o540p010p665
$$ 233615 240209 244496 245853 245188 243116 239350 233494 225734 216943 208430 201116 194576 187566 179901
55436A79901o984n527n275o406o906n903n082n645o148m909k676j163o07n48j377
$$ 179901 172917 167390 162115 155709 148803 142900 137818 132173 126025 121116 118440 117277 116670 116122 114745
55421A14745l039l803k567j104j500k670k181n62o43k937m743m080j922OJ167
$$ 114745 111706 107903 105336 104232 102732 100062 97881 97319 96676 93739 88996 84916 82994 83000 84167
55406H4167J443O03o30q14K36J174J131M92l99j512j999q34J074J425j92j491
$$ 84167 85610 86213 85583 84769 85005 86179 87310 87802 87403 85891 83892 83058 84132 85557 85365 83874
55390H3874o74J315K578K590J807M95j000j945k087j866j490p79j61l82r62m96
$$ 83874 83200 84515 87093 89683 91490 91985 90985 89040 86953 85087 83597 82818 82657 82275 81313 80817
55374H0817J098K287K220J779J796J926J841J811J550L03j309j485m0J033O17
$$ 80817 81915 84202 86422 88201 89997 91923 93764 95575 97125 97428 96119 94634 94594 95627 96244
55359I6244j15l87j219k685k404Q02L996L692P23j360j492j490k005j561K07J418
$$ 96244 96129 95742 94523 91838 89434 90236 94232 97924 98647 97287 95795 94305 92300 90739 90946 92364
55343I2364R12j38n03p51j614k299j793n64K91P19J244J590J105K51K31J062J168
$$ 92364 93276 93138 92635 91884 90270 87971 86178 85614 85905 86624 87868 89458 90563 90814 91045 92107 93275
55326I3275m11k309k367n94O34l34k305k980j995q69n22m49l32p60j747k100j119
$$ 93275 92864 90555 88188 87594 88228 87894 85589 82609 80614 79745 79223 78774 78442 77682 75935 73835 72716
55309G2716J86N86L69N74J215J405O93n27j611j928j159P8N79K58O11K457M161
$$ 72716 72902 73488 73857 74431 75646 77051 77744 77217 75606 73678 72519 72597 73176 73434 74045 76502 80663
55292H0663L489O63j922k718k265j513n15Q43K030K509K269J340m13k513l697
$$ 80663 84152 84815 82893 80175 77910 76397 75882 76725 78755 81264 83533 84873 84460 81947 78250
55277G8250l253k037j348j119r4K115M022L798J447j160k325k022j293q87q60
$$ 78250 74997 72960 71612 70493 70399 72514 76536 80334 81781 80621 78296 76274 74981 74094 73234
55262G3234r78q42j4J281J903J021o34j465q62M07J334J383L90j172j996j295
$$ 73234 72256 71414 71400 72681 74584 75605 74971 73506 72644 73051 74385 75768 76158 74986 72990 71695
55246G1695j78l66j528j561K96K410L300L342L133K065j29k027k269j360l10J176
$$ 71695 71517 71151 69623 68062 68358 70768 74068 77410 80543 82608 82479 80452 78183 76823 76513 77689
55230G7689L338M490K876k53j739o52Q01O67n11j369j775k159k151j214K4J90
$$ 77689 81027 85517 88393 88140 86401 85749 86550 87217 86706 85337 83562 81403 79252 78038 78062 78252
55214G8252j115k727l114j933l11L65j21p22m13Q47K386L491L583K471Q64j8J34
$$ 78252 77137 74410 71296 69363 69052 69417 69296 68574 68161 69008 71394 74885 78468 80939 81803 81785 81919
55197H1919K86m39j572k185k190j893j063M57J785J871J008L95L91K57m00r29
$$ 81919 82205 81766 80194 78009 75819 73926 72863 73320 75105 76976 77984 78379 78770 79027 78627 77698
55181G7698o06L64R47J97j639k852j841O83K060Q97j176j883j200m59J54J299
$$ 77698 77092 77456 78403 78600 76961 74109 72268 72951 75011 75908 74732 72849 71649 71190 71344 72643
55165G2643K450K342J151K01l81j582k912k316N47L043K808P80l57M12J843K452
$$ 72643 75093 77435 78586 78787 78406 76824 73912 71596 72143 75186 77994 78774 78417 78829 80672 83124
55149H3124J847N31p02j309j484j784j999j075J296L665M119K342j06j357p60
$$ 83124 84971 85502 84800 83491 82007 80223 78224 77149 78445 82110 86229 88571 88465 87108 86348
55134H6348Q71K086K004Q87l86j190j247m32Q07J248J54j424j616j61J228J090
$$ 86348 87219 89305 91309 92196 91810 90620 89373 88941 89748 90996 91150 89726 88110 87949 89177 90267
55118I0267j95j370j849j755j313q39p97j197j369o85P00J962K139P63j433k589
$$ 90267 90072 88702 86853 85098 83785 82946 82149 80952 79583 78898 79598 81560 83699 84462 83029 80440
55102H0440j457R21K256J767P51L80K26m61j348j633j210m34L80O40l61k195l160
$$ 80440 78983 79904 82160 83927 84678 85058 85284 84823 83475 81842 80632 80198 80578 81218 80857 78662 75502
55085G5502k361j055r40j806k081j198j20L03M04R73K192L440L753K619P00m53
$$ 75502 73141 72086 71146 69340 67259 66061 65941 66244 66648 67621 69813 73253 77006 79625 80325 79872
55069G9872N0J384J958J155k07r34m61R13K331L049L017K651K082J195M34N89
$$ 79872 79922 81306 83264 84419 84212 83278 82817 83730 86061 89110 92127 94778 96860 98055 98489 99078
55053I9078J433J599N34m03K02J707K322J542M01l49q44r99k66J102J814J235
$$ 99078 100511 102110 102644 102241 102443 104150 106472 108014 108415 108066 107222 106223 105957 107059 108873 110108
55037A10108L44L81J157J520J020J69p06j905l317l717k042P16J977M90j941k550
$$ 110108 110452 110833 111990 113510 114530 114699 113993 112088 108771 105054 103012 103728 105705 106195 104254 101704
55021A01704r55P95J274J138J276J234N48J25P13J164J8j713j465J132L338K733
$$ 101704 100749 101544 102818 103956 105232 106466 107014 107139 107852 109016 109034 107321 105856 106988 110326 113059
55005A13059M3k221k677j769m73N27R14Q43Q25J077J237J034P43N84K77l11o19
$$ 113059 113102 110881 108204 106435 105962 106489 107403 108246 109071 110148 111385 112419 113162 113746 114023 113712 113093
54988A13093k10L50K55k23p7R13J876K179K082J849J015p44k627l332k486q88
$$ 113093 112883 113233 113488 113265 113188 114101 115977 118156 120238 122087 123102 122358 119731 116399 113913 113025
54972A13025M78J119R21R6p51j083j122j412j624p60J095K203J295m50p76O94
$$ 113025 113503 114622 115543 115639 114888 113805 112683 111271 109647 108887 109982 112185 113480 113030 112254 112948
54956A12948K107K002Q70j46q07j325j423p54L57J392K319L111L243K417J349
$$ 112948 115055 117057 117927 117781 116974 115649 114226 113472 113829 115221 117540 120651 123894 126311 127660
54941A27660R14R72Q96P80J067J307N66q94j575p08P40J427J184O59J64m38j191
$$ 127660 128574 129546 130442 131222 132289 133596 134162 133268 131693 130985 131725 133152 134336 134995 135159 134721 133530
54924A33530j880k262k154j588r95q62j010p33K17J364K379L431M211L648J474
$$ 133530 131650 129388 127234 125646 124651 123789 122779 122046 122263 123627 126006 129437 133648 137296 138770
54909A38770n99n74J203K373J636K56lP49J157Q42P08J166J329M20q11q74N94
$$ 138770 138171 137597 138800 141173 142809 143065 143062 143811 144968 145810 146518 147684 149013 149433 148622 147748 148342
54892A48342K387L101K574J831J950L081M460N275N507N769O398P030P371P881
$$ 148342 150729 153830 156404 158235 160185 163266 167726 173001 178508 184277 190675 197705 205076 212957
54878B12957R147J0716J1337J0568R607R999J1814J3398J2827R541M686O0l456
$$ 212957 222104 232820 244157 254725 264332 274331 286145 299543 312370 321911 326597 326657 323201
54865C23201o293q965j0814j0805r409q602r515j1025j1396j0500r543r151q806
$$ 323201 316908 307943 297129 286324 276915 268313 258798 247773 236377 225877 216334 207183 198377
54852A98377p916o399m432k537j700k292l030k305o24j90j587k438l97L745P244
$$ 198377 190461 184062 179630 177093 175393 173101 170071 167766 167142 166952 165365 162927 162530 166275 173519
54837A73519Q824R386R802R779R231R230J0763J3292J5188J5286J3516J0464O770
$$ 173519 182343 191729 201531 211310 220541 229771 240534 253826 269014 284300 297816 308280 315050
54824C15050K840j232n351q978j1295j2001j1669j1153j0979j1383j2339j3191
$$ 315050 317890 316658 311307 302329 291034 279033 267364 256211 245232 233849 221510 208319
54812B08319j2867j1110r127q163p757o403l914j964j795k496k367j275m95n66
$$ 208319 195452 184342 175215 167052 159295 152892 148978 147014 145219 142723 140356 139081 138586 138020
54798A38020o23K9P78O78j32o60m01J59K64k49q52q85k38N09P01K78l91j183k264
$$ 138020 137397 137426 138204 138882 138750 138090 137689 137848 138112 137863 137011 136126 135888 136397 137098 137376 136985 135802 133538
54779A33538l449m056l708k864k302k294k478k255j168O63K284K681J996J527
$$ 133538 130089 126033 122325 119461 117159 114865 112387 110132 108964 109627 111911 114592 116588 118115
54765A18115J989K438J455r32l184l831k646n37J127J427P78O73J979L799M638
$$ 118115 120104 122542 123997 123065 119881 116050 113404 112867 113994 115421 116199 116872 118851 122650 127288
54750A27288M264L575K996K116P78n08j316j505p72R43K633L052K610K985M451
$$ 127288 131552 135127 138123 140239 141017 140509 139193 137688 136916 137859 140492 143544 146154 149139 153590
54735A53590N225M267L146L739N331N767M805M450N989Q398R941J0098R506R004
$$ 153590 158815 163082 166228 169967 175298 181065 185870 190320 196309 204707 214648 224746 234252 243256
54721B43256R201J0218J1504J2472J3275J4149J4101J1586O854K273m45k225m706
$$ 243256 252457 262675 274179 286651 299926 314075 328176 339762 346616 348889 348444 346219 341513
54708C41513p418q422p386o299o809q300r170q949q202p144n479l392j601l70
$$ 341513 334095 325673 318287 311988 305179 296879 287709 278760 270558 263414 257935 254543 252942 252572
54694B52572O89J635J834J080L76R39K745M792O576Q468J0599J2217J2507J1564
$$ 252572 253261 254896 256730 257810 258186 259125 261870 266662 273238 281706 292305 304522 317029 328593
54680C28593J0137Q826P947P830Q639J0032J1327J1867J0932P721K167m311r497
$$ 328593 338730 347556 355503 363333 371972 382004 393331 405198 416130 423851 426018 421707 412210
54667D12210j2270j3483j4700j6287j7092j6084j3999j2908j3914j5624j5548
$$ 412210 399940 386457 371757 355470 338378 322294 308295 295387 281473 265849 250301
54656B50301j3077j0166q763q423p372n219l375k896l196l211k752k232j910j947
$$ 250301 237224 227058 218295 209872 202500 197281 193906 191010 187814 184603 181851 179619 177709 175762
54642A75762k511l153k794j072Q30J423O36m30r71r67n40J83O60M02j03J86J363
$$ 175762 173251 170098 167304 166232 167062 168485 169121 168691 167720 166753 166213 166396 167056 167458 167355 167541 168904
54625A68904K272K118J464J204J248R56L12j76m11o96p19M48K873M962M963L080
$$ 168904 171176 173294 174758 175962 177210 178166 178478 178302 177891 177195 176476 176924 179797 184759 189722 192802
54609A92802J315R98J346R90K65P14K465L491K290J53m37R30K372K542K141K284
$$ 192802 194117 195115 196461 197451 197716 198430 200895 204386 206676 206829 206392 207322 209694 212236 214377 216661
54593B16661K729K683K326K505L335M199M723M951M636L472K112K105M246P460
$$ 216661 219390 222073 224399 226904 230239 234438 239161 244112 248748 252220 254332 256437 260683 268143
54579B68143R769J0238R621R213R473R961J0367J1085J2490J4026J4600J3694
$$ 268143 277912 288150 297771 306984 316457 326418 336785 347870 360360 374386 388986 402680
54567D02680J1504Q043L184k210o269q133r157j1104j3703j5168j4710j3189j1498
$$ 402680 414184 422227 425411 423201 416932 408799 399642 388538 374835 359667 344957 331768 320270
54554C20270r713q141p592q031q145p195o262o579p519p404n810l852k477j747
$$ 320270 310557 302416 294824 286793 278648 271453 265191 258612 251093 243689 237879 234027 231550 229803
54540B29803j736k800m558n700n444m496l944l829l466k727k205k178k188j825
$$ 229803 228067 225267 220709 215009 209565 205069 201125 197296 193830 191103 188898 186720 184532 182707
54526A82707j322j112j118r77q00j308k902m854n722m732k567o68N9k01p58j160
$$ 182707 181385 180273 179155 178178 177378 176070 173168 168314 162592 157860 155293 154625 154684 154483 153725 152565
54510A52565j374j558j835k142k182j697r40n47o80n76N18J979K098J38k424l283
$$ 152565 151191 149633 147798 145656 143474 141777 140837 140290 139610 139034 139552 141531 143629 143767 141343 138060
54494A38060j765O58K164K157J078m31j687j951j118j29km92m21O53J862K378
$$ 138060 136295 136953 139117 141274 142352 141921 140234 138283 137165 137036 137034 136542 136121 136774 138636 141014
54478A41014K634L567N058N827N042L403K360K530L302L949M529N441O475O997
$$ 141014 143648 147215 152273 158100 163142 166545 168905 171435 174737 178686 183215 188656 195131 202128
54464B02128P007P263Q049Q527P889O579N654N160M072J822q18k639l300l584
$$ 202128 209135 216398 224447 232974 240863 247442 253096 258256 262328 264150 263332 260693 257393 253809
54450B53809m621o803r171j0028q742o683n705n969o170n669n136m891m114k363
$$ 253809 249188 242385 233214 223186 214444 207761 202056 196087 189917 184248 179112 174221 170107 167744
54436A67744p69o21j601k276j932j031l78m79j206j480p1K459L612J909p62j345
$$ 167744 166975 166354 164753 162477 160545 159514 159136 158657 157451 155971 155900 158359 161971 163880 163118 161773
54420A61773M43K093K016J290J326J787J706J219Q88M79l94j088p55J64M96K12
$$ 161773 162216 164309 166325 167615 168941 170728 172434 173653 174541 175020 174626 173538 172783 172947 173443 173655
54404A73655N03J819K910K367N01r69q84J87P21k7j254j435J06K489L958L282
$$ 173655 174158 175977 178887 181254 181755 180786 179902 180089 180810 180783 179529 178094 178200 180689 184647 187929
54388A87929P57j937l057k321j151j075k042k620j860m89k9j081k631k990j421
$$ 187929 188686 186749 183692 181371 180220 179145 177103 174483 172623 172134 172105 171024 168393 165403 163982
54373A63982R91K275J589R4n21p4J84n68j789k543k598k279j852j365o09Q45K973
$$ 163982 164973 167248 168837 168931 168410 168336 168520 167952 166163 163620 161022 158743 156891 155526 154917 155762 158735
54356A58735M593M299K414J042J519K698K621J180N6L75J509K207K118J909K366
$$ 158735 163328 167627 170041 171083 172602 175300 177921 179101 179157 179532 181041 183248 185366 187275 189641
54341A89641L464M225L737K461J970K968M185L956K438J221J124J469J480J292
$$ 189641 193105 197330 201067 203528 205498 208466 212651 216607 219045 220266 221390 222859 224339 225631
54327B25631J185P94l16j804k803k906k493k306k706l355l612l362l161l381l509
$$ 225631 226816 227610 227294 225490 222687 219781 217288 214982 212276 208921 205309 201947 198786 195405 191896
54312A91896k832j508m39k70r31j903k382j616J54J410R38n40j322r89n64n67
$$ 191896 189064 187556 187117 186847 185916 184013 181631 180015 180169 181579 182517 181977 180655 179666 179102 178535
54296A78535m57j40l29q87n10R60J563K0j855j340J368L437L125J382j96j183
$$ 178535 178078 177938 177609 176722 176212 177172 178735 178755 176900 175560 176928 180365 183490 184872 184676 183493
54280A83493j572q58J117L257M093L278J743O60M25L38p77l225n768o728n770
$$ 183493 181921 181063 182180 185437 189530 192808 194551 195211 195636 195974 195197 191972 186204 179476 173706
54265A73706m012k627k045k300l046l205j804N13J877J509M90k13j101k584l390
$$ 173706 169694 167067 165022 162722 159676 156471 154667 155180 157057 158566 159056 158843 157742 155158 151768
54250A51768k102L66J481K36j756k469j726q93j166k484l773l969l037j920j320
$$ 151768 149666 150032 151513 151749 149993 147524 145798 144905 143739 141255 137482 133513 130476 128556 127236
54235A27236r42l16J85j4n01l22N82J358J525J287O80m19j432j489q60p23j132
$$ 127236 126294 125978 126163 126149 125648 125326 125908 127266 128791 130078 130758 130339 128907 127418 126558 125835 124703
54218A24703p14R41K153J548K82L60J626K167J247Q1k52o4J72P18J589J758M75
$$ 124703 123989 124930 127083 128631 128913 129273 130899 133066 134313 134394 134142 134078 134250 134968 136557 138315 138790
54201A38790j314j758l18J553K036Q84m14l28J017K044J603J89r78j517j843j923
$$ 138790 137476 135718 135400 136953 138989 139873 139459 139131 140148 142192 143795 143984 143006 141489 139646 137723
54185A37723j119N57J986K221J575R64O71L67p9m76q75j513k220k358j601m35
$$ 137723 136604 137161 139147 141368 142943 143907 144578 144945 144866 144390 143515 142002 139782 137424 135823 135388
54169A35388M25Q60J363K192K835K491J093l03l55J303L658N200N138L823K121
$$ 135388 135813 136673 138036 140228 143063 145554 146647 146344 145989 147292 150950 156150 161288 165111 167232
54154A67232N35q20j593j108N83J994J423r87l204l652k796j882r85N54K322K838
$$ 167232 167767 166947 165354 164246 164829 166823 168246 167259 164055 160403 157607 155725 154740 155294 157616 160454
54138A60454J539k28o46P17K682L592K482l07l346n222n514m621l117j745j441
$$ 160454 161993 161765 161119 161836 164518 168110 170592 170285 166939 161717 156203 151582 148465 146720 145279
54123A45279k304k898j846m1K38j396k653j793M8Q59O52Q20J519J558N14o13r28
$$ 145279 142975 140077 138231 138190 138428 137032 134379 132586 132634 133493 134145 134965 136484 138042 138556 137943 137015
54106A37015m74N71K241L983M591L382R06j708l497l821k592o08R57J517J081
$$ 137015 136541 137112 139353 143336 147927 151309 152215 150507 147010 143189 140597 139989 140946 142463 143544
54091A43544l50k462l938l400j321J90m4r79j192q76j097j962k654k737k343j491
$$ 143544 143194 140732 136794 133394 132073 132263 132219 131240 130048 129172 128075 126113 123459 120722 118379 116888
54075A16888j73R83J136L95k26j53R3k15r89j439r68J96J195J430J253J469K086
$$ 116888 116715 117698 118834 119229 119003 118850 118943 118728 117739 116300 115332 115528 116723 118153 119406 120875 122961
54058A22961K149J192Q2k30j40n98j380j383m38N17J020J466J679P95r04j662
$$ 122961 125110 126302 126384 126154 126014 125416 124036 122653 122215 122732 123752 125218 126897 127692 126788 125126
54042A25126q69m15j805l301k134J167L141K127J80m17j11k93n54K28J309R26
$$ 125126 124257 123842 122037 118736 116602 117769 120910 123037 123217 122800 122689 122396 121842 122070 123379 124305
54026A24305o67j214L71K526L228K242O47o47j153n17J051K579L234L037K314
$$ 124305 123638 122424 122795 125321 128549 130791 131438 130791 129638 129121 130172 132751 135985 139022 141336
54011A41336J078m38j325q96K97J188J598K178K974L116K116P57J99O40J298J510
$$ 141336 142414 141976 140651 139755 140052 141240 142838 145016 147990 151106 153222 153979 154178 154818 156116 157626
53995A57626J329J105J016J253K236M065N864O405N621M909N300N985N462L764
$$ 157626 158955 160060 161076 162329 164565 168630 174494 180899 186520 191429 196729 202714 208176 211940
53981B11940K463K504L163L395L114K731K417K419L219M745O268P540R048J0452
$$ 211940 214403 216907 220070 223465 226579 229310 231727 234146 237365 242110 248378 255918 264966 275418
53967B75418J0182P697N076M661N933O473N440M268M071M390M637M899M777L243
$$ 275418 285600 293297 298373 303034 308967 315440 320880 325148 329219 333609 338246 343145 347922 351165
53953C51165M76j688j972j184p39r17j377k136l046l420l171l331m382n163m659
$$ 351165 351641 349953 347981 346797 346058 345141 343764 341628 338582 335162 331991 328660 324278 319115 314456
53938C14456l747l777m431m558m280m433m631l915k877k966l738l164j010L94
$$ 314456 310709 306932 302501 297943 293663 289230 284599 280684 277807 274841 271103 267939 266929 267323
53924B67323l87j832k109j807k270k865k012j51O00m41j690j753j082p61r80j404
$$ 267323 266936 265104 262995 261188 258918 256053 254041 253890 254490 254049 252359 250606 249524 248763 247783 246379
53908B46379j874k072j417j00N86j50j321j413n19k1l31k93Q16J928J743P68N43
$$ 246379 244505 242433 241016 240916 241502 241352 240031 238618 238099 238078 237747 237454 238270 240198 241941 242709 243252
53891B43252J252J541P92J50N68J122N02n55N5K712N147N260L722L014M402O788
$$ 243252 244504 246045 246837 246987 247555 248677 249179 248624 248679 251391 256538 261798 265520 268534 272936 279724
53875B79724Q340Q476Q082Q209Q787Q666O978M244J826M67j41l29J62J421K740
$$ 279724 288064 296540 304622 312831 321618 330284 337262 341506 343332 343799 343658 343329 343491 344912 347652
53860C47652L341L281L055K877K909L676N331O901P217O521O162O779P731Q322
$$ 347652 350993 354274 357329 360206 363115 366791 372122 379023 386240 392761 398923 405702 413433 421755
53846D21755Q576Q500P684O133M662L822L077J707p2j533k519l273l633l217k290
$$ 421755 430331 438831 446515 452648 457310 461132 464209 465916 465844 464311 461792 458519 454886 451669 449379
53831D49379j700j914k712l777n032o300p241p772q101q266q084p695p649q141
$$ 449379 447679 445765 443053 439276 434244 427944 420703 412931 404830 396564 388480 380785 373136 364995
53817C64995q536q109p152o807p677q942r212q187o927o296n779m541l277l712
$$ 364995 356459 348350 341198 334391 326714 317772 308560 300373 293446 287150 281371 276830 273553 269841
53803B69841n932p497o194l017j207k433m996o019m592k341j476k637m475n094
$$ 269841 263909 256412 250218 247201 245994 243561 238565 232546 227954 225613 224137 221500 217025 211931
53789B11931l946k277j583k060k798l083k803j933m33J306K628L167K695Q14k240
$$ 211931 207985 205708 204125 202065 199267 196184 193381 191448 191015 192321 194949 198116 200811 201625 199385
53774A99385m714m611k122M10J315J237J399J630J113O2n67m10J95R79J648J568
$$ 199385 194671 190060 187938 188348 189663 190900 192299 193929 195042 195104 194537 194127 194322 195301 196949 198517
53758A98517O35l1O98K323L395L476L267L064K432J432Q84J145J747K468L576
$$ 198517 199152 199121 199819 202142 205537 209013 212280 215344 217776 219208 220092 221237 222984 225452 229028
53743B29028M710M818L839L304M364O096O786O268N940O821Q576J0250J1117J0793
$$ 229028 233738 238556 242395 245699 250063 256159 262945 269213 275153 281974 290550 300800 311917 322710
53729C22710R308P197N106L257J683Q23J279K888M543N122M380K847J220oo57
$$ 322710 332018 339215 344321 347578 349261 350084 351363 354251 358794 363916 368296 371143 372363 372357 371700
53714C71700r08j148j640k347l083l712m124m168l723k955k382k523l409m505
$$ 371700 370792 369644 368004 365657 362574 358862 354738 350570 346847 343892 341510 338987 335578 331073
53700C31073n249n567n672n610n278m864m728m758m371l453k879l590n224o187
$$ 331073 325824 320257 314585 308975 303697 298833 294105 289347 284976 281523 278644 275054 269830 263643
53686B63643n138k232J039K906K408m8k888m476m301l141k080j621j724k152k426
$$ 263643 258505 256273 257312 260218 262626 262578 259690 255214 250913 247772 245692 244071 242347 240195 237769
53671B37769j907n55N99M89m23m59J130L086L749L025J985J124J91n23r1J571
$$ 237769 235862 235307 235906 236395 235972 235513 236643 239729 243478 246503 248488 249612 249803 249280 249189 250760
53655B50760L202L712L364L000K836K630K346K042J628J329J699K651L254L128
$$ 250760 253962 257674 261038 264038 266874 269504 271850 273892 275520 276849 278548 281199 284453 287581
53641B87581L235M303N328M825K953J040l92j639k189r34J822M164M783M142L146
$$ 287581 290816 295119 300447 305272 308225 309265 308873 307234 305045 304111 305933 310097 314880 319022 322168
53626C22168K115J486K012L374L880K456L6j830k623k379q47J704L757M019K973
$$ 322168 324283 325769 327781 331155 335035 337491 337527 335697 333074 330695 329848 331552 335309 339328 342301
53611C42301J879Q93m77j691j487J60J779K160J349l4j408k075j500j15R10Q90
$$ 342301 344180 345073 344596 342905 341418 341578 343357 345517 346866 346832 345424 343349 341849 341734 342644 343534
53595C43534Q3r60j774j785p05P86J530J204M43l32j264k102j984p03O87J164
$$ 343534 343617 342657 340883 339098 338393 339179 340709 341913 342356 342024 340760 338658 336674 335971 336658 337822
53579C37822R19O95N77K69J04Q00K265L472L664L125K468J773Q63J91O70K497
$$ 337822 338741 339436 340013 340282 340386 341186 343451 346923 350587 353712 356180 357953 358816 359007 359677 362174
53563C62174M657N972O297O195N872N208M618M766N277M921L530K534K817L258
$$ 362174 366831 372803 379100 385295 391167 396375 400993 405759 411036 415957 419487 422021 424838 428096
53549D28096K697K243L821O938Q967Q716P817Q021Q835Q808P709O269M846L651
$$ 428096 430793 433036 436857 443795 452762 461478 469295 477316 486151 494959 502668 508937 513783 517434
53535E17434L502M908O798P484O757N961N891N714M313J905j08n35P10K728M367
$$ 517434 520936 525844 532642 540126 546883 552844 558735 564449 568762 570667 570559 570024 570734 573462 577829
53520E77829N000M807M292L658K791J746Q22J56m31j033j344r86n4Q22J062P27
$$ 577829 582829 587636 591928 595586 598377 600123 600945 601101 600670 599637 598293 597307 597253 598075 599137 599864
53504E99864M13N24P99P82O18R95K207L647M483M516M113L628L321L647M941O675
$$ 599864 600277 600801 601600 602382 603000 603995 606202 609849 614332 618848 622961 626589 629910 633557 638498 645173
53488F45173P541O775N125M023L866L722K911K230K893M589N650N227M415M642
$$ 645173 652714 659489 664614 668637 672503 676225 679136 681366 684259 688848 694498 699725 704140 708782
53474G08782N767O632P005P785R423J1250J2623J3685J4547J4680J3860J3170
$$ 708782 714549 721181 728186 735971 745394 756644 769267 782952 797499 812179 826039 839209
53462H39209J4061J6621J9456K1283K1999K2206K2351K2576K3030K3863K5113
$$ 839209 853270 869891 889347 910630 932629 954835 977186 999762 1022792 1046655 1071768
53451A071768K6727K8629L0547L2028L2931L3856L5721L8774M2133M4512M5153
$$ 1071768 1098495 1127124 1157671 1189699 1222630 1256486 1292207 1330981 1373114 1417626 1462779
53440A462779M4086M2001M0290M0579M3241M6400M7553M6425M5099M4902M4593
$$ 1462779 1506865 1548866 1589156 1629735 1672976 1719376 1766929 1813354 1858453 1903355 1947948
53429A947948M2750M0556M0279M1663M2104M0596L9250L9943M1480M1577M0324
$$ 1947948 1990698 2031254 2071533 2113196 2155300 2195896 2235146 2275089 2316569 2358146 2398470
53418B398470L9765M0553M0956L9340L6217L3359L1814L1310L0901K9658K7123
$$ 2398470 2438235 2478788 2519744 2559084 2595301 2628660 2660474 2691784 2722685 2752343 2779466
53407B779466K3512J9553J5961J3188J1467J0608R669P361L214j796o131r229
$$ 2779466 2802978 2822531 2838492 2851680 2863147 2873755 2883424 2890785 2893999 2892203 2886072 2876843
53395B876843j1868j4980j8395k1198k3122k4915k7082k8848k9098k8100k7587
$$ 2876843 2864975 2849995 2831600 2810402 2787280 2762365 2735283 2706435 2677337 2649237 2621650
53384B621650k8989l2105l5491l7660l7960l6855l5546l4787l4119l2782l1197
$$ 2621650 2592661 2560556 2525065 2487405 2449445 2412590 2377044 2342257 2308138 2275356 2244159
53373B244159l0504l0632l0004k7665k4569k1950j9450j5961j1704q211o418n683
$$ 2244159 2213655 2183023 2153019 2125354 2100785 2078835 2059385 2043424 2031720 2023509 2017091 2011408
53361B011408m692k734l6K640M801O804R275J1958J3992J5639J8411K2618K6145
$$ 2011408 2006716 2003982 2003946 2006586 2011387 2018191 2027466 2039424 2053416 2069055 2087466 2110084 2136229
53348B136229K7213K7317K9416L3677L7368L8992M0193M2804M6134M8692N0937
$$ 2136229 2163442 2190759 2220175 2253852 2291220 2330212 2370405 2413209 2459343 2508035 2558972
53337B558972N4506N9413O3795O6283O7412O8559P0583P3580P7168Q0627Q3278
$$ 2558972 2613478 2672891 2736686 2802969 2870381 2938940 3009523 3083103 3160271 3240898 3324176
53326C324176Q5068Q6559Q8158Q9547Q9952Q9015Q7394Q6326Q6376Q6674Q5760
$$ 3324176 3409244 3495803 3583961 3673508 3763460 3852475 3939869 4026195 4112571 4199245 4285005
53315D285005Q3140P9611P5967P2086O7468O2197N6809N1509M5907L9468L1990
$$ 4285005 4368145 4447756 4523723 4595809 4663277 4725474 4782283 4833792 4879699 4919167 4951157
53304D951157K3886J6084R406L741j965q696j6473k4551l2198l9128m5362n0959
$$ 4951157 4975043 4991127 5000533 5004274 5002309 4993613 4977140 4952589 4920391 4881263 4835901 4784942
53292D784942n5889o0155o3995o7675p1062p3837p6383p9674q3510q5705q4333
$$ 4784942 4729053 4668898 4604903 4537228 4466166 4392329 4315946 4236272 4152762 4067057 3982724
53281C982724q0522p7422p6391p5862p4297p2380p1312p0641o9335o7773o6950
$$ 3982724 3902202 3824780 3748389 3672527 3598230 3525850 3454538 3383897 3314562 3246789 3179839
53270C179839o6398o4674o1517n8024n4811n1519m8023m4823m2050l9402l7054
$$ 3179839 3113441 3048767 2987250 2929226 2874415 2822896 2774873 2730050 2688000 2648598 2611544
53259B611544l5429l3924l1262k7485k4365k3286k3695k4135k3766k2479k0458
$$ 2611544 2576115 2542191 2510929 2483444 2459079 2435793 2412098 2387963 2364197 2341718 2321260
53248B321260j8301j6708j5548j3989j1915j0125q678o348k546J426M190O207
$$ 2321260 2302959 2286251 2270703 2256714 2244799 2234674 2225996 2219648 2217102 2218528 2222718 2228925
53236B228925Q516J0613J1342J1399J2906J6392J9967K2055K3442K5856K9584
$$ 2228925 2237441 2248054 2259396 2270795 2283701 2300093 2320060 2342115 2365557 2391413 2420997
53225B420997L3462L6488L8563L9880M0401L9983L8694L7013L5580L4558L3292
$$ 2420997 2454459 2490947 2529510 2569390 2609791 2649774 2688468 2725481 2761061 2795619 2828911
53214B828911L1070K8063K4976K1926J8457J4649J1257Q456N549K284n48k609
$$ 2828911 2859981 2888044 2913020 2934946 2953403 2968052 2979309 2987765 2993314 2995598 2995050 2992441
53202B992441n062r071j3935j7975k0783k3247k5571k6913k7304k8355l1239l5016
$$ 2992441 2987379 2978308 2964373 2946398 2925615 2902368 2876797 2849884 2822580 2794225 2762986 2727970
53190B727970l7983l9899m1739m3769m5124m5264m4763m4359m4185m4201m4562
$$ 2727970 2689987 2650088 2608349 2564580 2519456 2474192 2429429 2385070 2340885 2296684 2252122
53179B252122m4916m4127m1581l8366l6243l5638l5464l4861l4013l3053l1362
$$ 2252122 2207206 2163079 2121498 2083132 2046889 2011251 1975787 1940926 1906913 1873860 1842498
53168A842498k8766k6460k5625k5701k5174k3863k3014k3133k3065k1750j9617
$$ 1842498 1813732 1787272 1761647 1735946 1710772 1686909 1663895 1640762 1617697 1595947 1576330
53157A576330j7547j5608j3920j3623j5544j8380j9849j9515j9059j9582k0198
$$ 1576330 1558783 1543175 1529255 1515632 1500088 1481708 1461859 1442344 1423285 1403703 1383505
53146A383505j9896j9330j9688k0764k1371k1204k0973k0887k0191j8495j6743
$$ 1383505 1363609 1344279 1324591 1303827 1282456 1261252 1240279 1219392 1199201 1180706 1163963
53135A163963j6336j7675j9868k1615k2203k1832k1174k0665k0231j9718j9341
$$ 1163963 1147627 1129952 1110084 1088469 1066266 1044434 1023260 1002595 982364 962646 943305
53124I43305j9453k0059k0873k1685k2318k2319k1243j9272j7160j5403j3918
$$ 943305 923852 903793 882920 861235 838917 816598 795355 776083 758923 743520 729602
53113G29602j2609j1811j1818j2288j2528j2227j1676j1293j1212j1314j1504
$$ 729602 716993 705182 693364 681076 668548 656321 644645 633352 622140 610826 599322
53102E99322j1876j2526j3097j2700j0739p915n947n898p029p762p463o813o473
$$ 599322 587446 574920 561823 549123 538384 530469 524522 518624 511595 503833 496370 489557 483084
53089D83084o239n760n510o279p774q340o628l476j586k872o167q142o753l305
$$ 483084 476845 471085 465575 459296 451522 443182 436554 433078 431492 428620 422453 414311 407558 404253
53075D04253p11k51q29j043p76n49m64n24j117k337l394l614l522l986m641m333
$$ 404253 403542 403291 402462 401419 400643 400094 399630 399106 397989 395652 392258 388644 385122 381136 376495 372162
53059C72162l002j878j709k006k262k771l615m009l481k720k393j998r35om88
$$ 372162 369160 367282 365573 363567 361305 358534 354919 350910 347429 344709 342316 340318 339383 339377 338889
53044C38889k123l333l266k516j813j256r63j239j791j769j082p31j360k312k619
$$ 338889 336766 333433 330167 327651 325838 324582 323619 322380 320589 318820 317738 317007 315647 313335 310716
53029C10716k220j589q90k26l1m86r39o68OJ19o21j495j666r65J62J087J449J459
$$ 310716 308496 306907 306017 305791 305760 305274 304335 303667 303673 303792 303171 301676 300010 299045 299207 300294 301743 303202
53011C03202J601J874J686Q67K55O88J718K020J019m59j291j289j280k128l779
$$ 303202 304803 306677 308363 309230 309485 310173 311891 313911 314930 314471 313180 311891 310611 308483 304704
52996C04704n119m942l224j238k11k10n86j093k006l314m395m604l930l059k894
$$ 304704 299585 294643 291419 290181 289970 289760 289174 288081 286075 282761 278366 273762 269832 266773 263879
52981B63879l732m725m600l165j614r33o74j5O22J47j336k457k466k040j940j945
$$ 263879 260147 255422 250822 247657 246043 245110 244436 244421 245043 245190 243854 241397 238931 236891 234951 233006
52965B33006j651j335j310j140l66M17J42j170k256k194j418r51j082j313j292
$$ 233006 231355 230020 228710 227570 227204 227621 227763 226593 224337 222143 220725 219774 218692 217379 216087
52950B16087j103o02P64K901M388L794J628L4K05J044Q93l41j577k340k882k946
$$ 216087 214984 214382 215146 218047 222435 226229 227857 227891 228096 229140 230033 229692 228115 225775 222893 219947
52934B19947j711P30K891L323K067M01m58k78K40M09M71J198K394K686J490Q6
$$ 219947 218236 218966 221857 225180 227247 227648 227190 226912 227152 227561 228032 229230 231624 234310 235800 235886
52918B35886l22n69j858k975j622J603L306J996J33J42Q58J5j713j879l64N32
$$ 235886 235564 234995 233137 230162 228540 230143 233449 235445 235578 235720 236578 236593 234880 233001 232637 233169
52902B33169q2l97R66K737K868J211o64j350m59J650M088N613N305L219M60j412
$$ 233169 233087 232690 233656 236393 239261 240472 239808 238458 237999 239649 243737 249350 254655 257874 258334 256922
52886B56922j389M2J247J183M75K78O61J078J823L565N596O138M680K737J733
$$ 256922 255533 255575 256822 258005 258480 258758 259419 260497 262320 265885 271481 277619 282299 285036 286769
52871B86769J464J295J586K840M390N095M767L985L021K025J679K458L499L426
$$ 286769 288233 289528 291114 293954 298344 303439 308206 312191 315212 317237 318916 321374 324873 328299
52857C28299K331J688K235L040L121K767K552K009M12j657k719k324j492j068
$$ 328299 330630 332318 334553 337593 340714 343481 346033 348042 348454 346797 344078 341754 340262 339194
52843C39194o79J02N71j60j458j695n62K72n93k351l112k367j126M4J636L514
$$ 339194 338515 338617 339188 339028 337570 335875 335313 335585 334992 332641 329529 327162 326036 326080 327716 331230
52827C31230L942J609k039l862k642m44Q9j055j690n25J318K064J386K28p32j464
$$ 331230 335172 336781 334742 330880 328238 327794 327883 326828 325138 324613 325931 327995 329381 329609 328877 327413
52811C27413j848j537o23L32J001J361J112j7j334j578o95p2l67m01P62J864J232
$$ 327413 325565 324028 323405 323737 324738 326099 327211 327194 325860 324282 323587 323515 323148 322747 323509 325373 326605
52794C26605k88l06J406K386J197l52J33K338M051M261L736L190K519J729J214
$$ 326605 326317 326011 327417 329803 331000 330648 330781 333119 337170 341431 345167 348357 350876 352605 353819
52779C53819P53m44k259l113j738J050L085L137J934Q89M03k05j450k938m014
$$ 353819 354572 354128 351869 348756 347018 348068 351153 354290 356224 357113 357516 357311 355861 352923 348909
52764C48909m561m763m446l434k326j996k285k091j141n85j167j844j295p4J39
$$ 348909 344348 339585 335139 331705 329379 327383 325098 323007 321866 321281 320114 318270 316975 316901 317040
52749C17040q24j305l51Q82Q52k38r59n81L63J149J637J950K053J730P65r20l083
$$ 317040 316216 314911 314560 315442 316294 316056 315097 314516 314879 316028 317665 319615 321668 323398 324163 323243 320160
52732C20160n077o094n662m076k442k064l324n183o239o215n925n784n298m327
$$ 320160 315083 308989 303327 299251 296809 294745 291421 286238 279999 273784 267859 262075 256777 252450
52718B52450l807m292m628l326r95M5j232l210l863l197k481j986q78P92J561
$$ 252450 248643 244351 239723 236397 235402 235447 234215 231005 227142 223945 221464 219478 218600 219392 220953
52703B20953M97j344k183j686j028j110j672k222k863l745m265l603j967n86m31
$$ 220953 221450 220106 217923 216237 215209 214099 212427 210205 207342 203597 199332 195729 193762 193176 192745
52688A92745j280k184k392j715m33P50J011J18j252k248k732l161l674l802l161
$$ 192745 191465 189281 186889 185174 184741 185491 186502 186620 185368 183120 180388 177227 173553 169751 166590
52673A66590k031j069p05q06q86o25m73j375l418m951m019r44J581J509j95j139
$$ 166590 164559 163490 162785 161979 161093 160468 159995 158620 155202 150251 146232 145288 146869 148378 148183 147044
52657A47044n79M04J295K824M941N764L821K79k332l066l026l280l734m033m159
$$ 147044 146465 146869 148164 150988 155929 161693 165514 165793 163461 160395 157369 154089 150355 146322 142163
52642A42163l673j695J496L821L483J226n91r04p04r70j172n16N04Q14M94O15
$$ 142163 138490 136795 138291 142112 145595 146821 146230 145326 144622 143652 142480 141964 142468 143282 143776 144391
52626A44391J471K032J459K93l32r4M92R81J297J305P57k22j005r66N3J620K765
$$ 144391 145862 147894 149353 149646 149314 149220 149712 150693 151990 153295 154052 153830 152825 151859 151912 153532 156297
52609A56297K455N94j441j866k76K045L601L948L361K107N76m36l55N18J531K521
$$ 156297 158752 159346 157905 156039 155763 157808 161409 165357 168718 170825 171401 170965 170610 171128 172659 175180
52593A75180L513L928L047J295J54M43J411J846J438N97l85j348j850j545q51
$$ 175180 178693 182621 185668 186963 187117 187560 188971 190817 192255 192852 192467 191119 189269 187724 186873
52578A86873n85r24j337j483j491j263k88J290K063P38j893l222j434K477N724
$$ 186873 186288 185364 184027 182544 181053 179790 179502 180792 182855 183593 181700 178478 177044 179521 185245
52563A85245O398M715J912j119l789n260m990l641k581k266j872q45M2j19p86
$$ 185245 191643 196358 198270 197151 193362 188102 183112 179471 176890 174624 172752 171907 171949 171830 171044
52548A71044o45M82J557K137K885L862L687J625o55r25M08P53r00k470j777M62
$$ 171044 170399 170881 172438 174575 177460 181322 185009 186634 185979 185054 185462 186215 185315 182845 181068 181530
52532A81530J928J894J540J655J761J550J606K121K169J106k37n87J86J341K427
$$ 181530 183458 185352 186892 188547 190308 191858 193464 195585 197754 198860 198623 198036 198222 199563 201990
52517B01990L339L642L022K174K163K789K699J298k71o38J38R73J248J216J338
$$ 201990 205329 208971 211993 214167 216330 219119 221818 223116 222845 222207 222345 223318 224566 225782 227120
52502B27120J904L061M581N646N498M329L044K115J262L34j26L81J412J924J432
$$ 227120 229024 232085 236666 242312 247810 252139 255183 257298 258560 258894 258768 259149 260561 262485 263917
52487B63917L51o64j303j366n39J116K614K577P39j409j964o45J065J875K102
$$ 263917 264268 263604 262301 260935 260396 261512 264126 266703 267442 266033 264069 263424 264489 266364 268466
52472B68466K673L345L027J662N87O28J015Q58O99J367K113J414m69j490o65N89
$$ 268466 271139 274484 277511 279173 279760 280388 281403 282261 282960 284327 286440 287854 287385 285895 285230 285819
52456B85819P25K22L47Q80O20m86j289j326j282j441j050L55J962K545J649l28
$$ 285819 286544 286766 287113 287993 288613 288127 286838 285512 284230 282789 281739 282094 284056 286601 288250 287922
52440B87922k423l371k520q19L3l07n80o6L59Kk56N76J797K125J678J374J070
$$ 287922 285499 282128 279608 278789 278822 278515 277935 277869 278228 278230 277974 278550 280347 282472 284150 285524 286594
52423B86594L1j127r13O07J649J354Q24J004J230R44J078K334L259J971p71k162
$$ 286594 286625 285498 284585 285192 286841 288195 289019 290023 291253 292197 293275 295609 298868 300839 300068 297906
52407B97906j036O52O15q55j660p72P33J365R90O01Q21J209J031L49q3J08M03
$$ 297906 296870 297522 298137 297282 295622 294850 295583 296948 297938 298539 299360 300569 301600 301949 301866 301974 302377
52390C02377J40n09o85J33J504K450K330J221l08j577k036j377K22J946K795K484
$$ 302377 302517 302008 301323 301456 302960 305410 307740 308961 308653 307076 305040 303663 303885 305831 308626 311110
52374C11110J739J377J214L48j397k873k783j266J42J51r18j585q96M98J140M76
$$ 311110 312849 314226 315440 315788 314391 311518 308735 307469 307611 307762 306844 305259 304363 304861 306001 306477
52358C06477n46p48m2Q98J776K743L505L375K410J695J992K693K670J722O27P6
$$ 306477 305931 305183 305141 306039 307815 310558 314063 317438 319848 321543 323535 326228 328898 330620 331247 331323
52342C31323J36O13J417K484L599M281L875K094l02j876j932j154m76J40J067
$$ 331323 331459 332072 333489 335973 339572 343853 347728 349822 349520 347644 345712 344558 344082 344222 345289
52327C45289J794J463M66K09J037J561P07n65n67P71J935K001J570J465J528J198
$$ 345289 347083 348546 349012 349221 350258 351819 352526 351961 351394 352165 354100 356101 357671 359136 360664 361862
52311C61862O09M02Q48J679K637L689M793N788O542O917O700N855M827M104L572
$$ 361862 362471 362873 363721 365400 368037 371726 376519 382307 388849 395766 402466 408321 413148 417252 420824
52296D20824K648J242J72L99J990M001N266N331M755M445M623M643M094L640M032
$$ 420824 423472 424714 424886 425285 427275 431276 436542 441873 446628 451073 455696 460339 464433 468073 472105
$$ [...]
##END NTUPLES=NMR SPECTRUM
##END=
