
##TITLE=AC1079_MACI01_5835926_jtKjstPYi0
##JCAMPDX= 6.0         $$ Bruker NMR JCAMP-DX V2.0
##DATA TYPE= NMR SPECTRUM
##DATA CLASS= NTUPLES
##ORIGIN= BRUKER
##OWNER= Administrator
$$ 1.72 TOPSPIN		Version 2.1
$$ 2012-03-28 11:07:09.687 -0500  Administrator@TOPSPIN
$$ Compression mode = diff/dup
##.OBSERVE FREQUENCY= 400.13188235
##.OBSERVE NUCLEUS= ^1H
##.ACQUISITION MODE= SIMULTANEOUS (DQD)
##.ACQUISITION SCHEME= undefined
##.AVERAGES= 8
##.DIGITISER RES= 22
##SPECTROMETER/DATA SYSTEM= spect
##.PULSE SEQUENCE= zg30
##.SOLVENT NAME= COFFEE_meoh
##.SHIFT REFERENCE= INTERNAL, COFFEE_meoh, 1, 14.98061
##AUDIT TRAIL= $$ (NUMBER, WHEN, WHO, WHERE, PROCESS, VERSION, WHAT)
$$ ##TITLE= Audit trail, TOPSPIN		Version 2.1
$$ ##JCAMPDX= 5.01
$$ ##ORIGIN= Bruker BioSpin GmbH
$$ ##OWNER= Administrator
$$ $$ C:\Bruker\TOPSPIN/data/COFFEE/nmr/AC1079_MACI01_5835926_jtKjstPYi0/10/pdata/1/auditp.txt
$$ ##AUDIT TRAIL=  $$ (NUMBER, WHEN, WHO, WHERE, PROCESS, VERSION, WHAT)
(   1,<2012-03-28 01:23:53.484 -0500>,<Administrator>,<TOPSPIN>,<go>,<TOPSPIN 2.1>,
      <created by zg
	started at 2012-03-28 01:22:46.859 -0500,
	POWCHK enabled, PULCHK disabled,
       configuration hash MD5:
       1A 1E CE 29 27 FD 77 03 67 4E F0 E3 C4 B2 CB 90
       data hash MD5: 64K
       74 6A 41 E3 6D 0D 42 12 4C F3 FC C8 5F BA 61 09>)
(   2,<2012-03-28 01:23:57.484 -0500>,<Administrator>,<TOPSPIN>,<proc1d>,<TOPSPIN 2.1>,
      <Start of raw data processing
       efp LB = 0 FT_mod = 6 PKNL = 1 PHC0 = 0 PHC1 = 0 SI = 32K 
       data hash MD5: 32K
       02 F4 41 1A 1B DB BA E6 EC 25 C4 81 9B 8B 29 6B>)
(   3,<2012-03-28 01:23:57.781 -0500>,<Administrator>,<TOPSPIN>,<proc1d>,<TOPSPIN 2.1>,
      <pk PHC0 = 210.0366 PHC1 = 0 
       data hash MD5: 32K
       CD EE 4C 2F 6E 01 36 F2 68 51 D4 55 36 29 B0 ED>)
(   4,<2012-03-28 01:23:57.859 -0500>,<Administrator>,<TOPSPIN>,<proc1d>,<TOPSPIN 2.1>,
      <abs ABSG = 1 
       data hash MD5: 32K
       0B 03 CB 05 A6 93 18 DC C5 14 26 71 FC B3 C9 A8>)
(   5,<2012-03-28 01:23:57.890 -0500>,<Administrator>,<TOPSPIN>,<proc1d>,<TOPSPIN 2.1>,
      <abs ABSG = 2 
       data hash MD5: 32K
       9F 11 CC 48 25 E4 26 E5 60 8F 96 25 DC 4D 3C 44>)
(   6,<2012-03-28 01:23:57.921 -0500>,<Administrator>,<TOPSPIN>,<proc1d>,<TOPSPIN 2.1>,
      <abs ABSG = 3 
       data hash MD5: 32K
       6B AB 97 03 B2 DC 38 1A C8 1B B0 C1 8D 7F BF E4>)
(   7,<2012-03-28 01:23:57.968 -0500>,<Administrator>,<TOPSPIN>,<proc1d>,<TOPSPIN 2.1>,
      <abs ABSG = 4 
       data hash MD5: 32K
       4E 3F 22 E4 FE 47 FB 6A B5 21 A4 A8 D7 25 E4 C5>)
(   8,<2012-03-28 01:23:58.000 -0500>,<Administrator>,<TOPSPIN>,<proc1d>,<TOPSPIN 2.1>,
      <abs ABSG = 5 
       data hash MD5: 32K
       D9 66 B7 F7 FC 8B 11 70 11 A4 83 7C FF 6F 79 DC>)
(   9,<2012-03-28 01:24:02.390 -0500>,<Administrator>,<TOPSPIN>,<audit>,<TOPSPIN 2.1>,
      <user comment:
       ICON-NMR User ID: COFFEE
       data hash MD5: 32K
       D9 66 B7 F7 FC 8B 11 70 11 A4 83 7C FF 6F 79 DC>)
$$ [...]
##$TP= (0..7)
150 150 150 150 150 150 150 150
##$TP07= 0
##$TPNAME0= <>
##$TPNAME1= <>
##$TPNAME2= <>
##$TPNAME3= <>
##$TPNAME4= <>
##$TPNAME5= <>
##$TPNAME6= <>
##$TPNAME7= <>
##$TPOAL= (0..7)
0.5 0.5 0.5 0.5 0.5 0.5 0.5 0.5
##$TPOFFS= (0..7)
0 0 0 0 0 0 0 0
##$TUNHIN= 0
##$TUNHOUT= 0
##$TUNXOUT= 0
##$USERA1= <user>
##$USERA2= <user>
##$USERA3= <user>
##$USERA4= <user>
##$USERA5= <user>
##$V9= 5
##$VALIST= <valist>
##$VCLIST= <CCCCCCCCCCCCCCC>
##$VD= 0
##$VDLIST= <DDDDDDDDDDDDDDD>
##$VPLIST= <PPPPPPPPPPPPPPP>
##$VTLIST= <TTTTTTTTTTTTTTT>
##$WBST= 2048
##$WBSW= 25
##$XGAIN= (0..3)
0 0 0 0
##$XL= 0
##$YL= 0
##$YMAX_a= 536141
##$YMIN_a= -661065
##$ZGOPTNS= <>
##$ZL1= 120
##$ZL2= 120
##$ZL3= 120
##$ZL4= 120
##$ABSF1= 14.98061
##$ABSF2= -5.57192
##$ABSG= 5
##$ABSL= 3
##$ALPHA= 0
##$AQORDER= 0
##$ASSFAC= 0
##$ASSFACI= 0
##$ASSFACX= 0
##$ASSWID= 0
##$AUNMP= <proc_prof1d_extract_pilot.lims>
##$AXLEFT= 0
##$AXNAME= <>
##$AXNUC= <1H>
##$AXRIGHT= 0
##$AXTYPE= 0
##$AXUNIT= <>
##$AZFE= 0.1
##$AZFW= 0.1
##$BCFW= 0
##$BC_mod= 0
##$BYTORDP= 0
##$COROFFS= 0
##$CY= 15
##$DATMOD= 1
##$DC= 0
##$DFILT= <>
##$DTYPP= 0
##$F1P= 0
##$F2P= 0
##$FCOR= 0.5
##$FTSIZE= 32768
##$FT_mod= 6
##$GAMMA= 0
##$GB= 0
##$INTBC= 1
##$INTSCL= 1
##$ISEN= 128
##$LB= 0
##$LEV0= 0
##$LPBIN= 0
##$MAXI= 10000
##$MC2= 0
##$MEAN= 0
##$ME_mod= 0
##$MI= 0
##$NCOEF= 0
##$NC_proc= -8
##$NLEV= 6
##$NOISF1= 0
##$NOISF2= 0
##$NSP= 0
##$NTH_PI= 0
##$NZP= 0
##$OFFSET= 14.98061
##$PC= 1
##$PHC0= 210.0366
##$PHC1= 0
##$PH_mod= 1
##$PKNL= yes
##$PPARMOD= 0
##$PPDIAG= 0
##$PPIPTYP= 0
##$PPMPNUM= 2147483647
##$PPRESOL= 1
##$PSCAL= 4
##$PSIGN= 0
##$PYNMP= <proc.py>
##$REVERSE= no
##$SF= 400.13
##$SI= 32768
##$SIGF1= 0
##$SIGF2= 0
##$SINO= 400
##$SIOLD= 32768
##$SPECTYP= <>
##$SREGLST= <1H.CDCl3>
##$SSB= 0
##$STSI= 32768
##$STSR= 0
##$SW_p= 8223.68421052632
##$SYMM= 0
##$S_DEV= 0
##$TDeff= 65536
##$TDoff= 0
##$TI= <>
##$TILT= no
##$TM1= 0
##$TM2= 0
##$TOPLEV= 0
##$USERP1= <user>
##$USERP2= <user>
##$USERP3= <user>
##$USERP4= <user>
##$USERP5= <user>
##$WDW= 1
##$XDIM= 32768
##$YMAX_p= 469759658
##$YMIN_p= -730553
##$CURPLOT= <Network HP LaserJet P1505>
##$CURPRIN= <$Network HP LaserJet P1505>
##$DFORMAT= <normdp>
##$LAYOUT= <+/1D_H.xwp>
##$LFORMAT= <normlp>
##$PFORMAT= <normpl>
##$SURQMSG= 1
$$ End of Bruker specific parameters
$$ ---------------------------------
##NTUPLES= NMR SPECTRUM
##VAR_NAME=  FREQUENCY,     SPECTRUM/REAL,   SPECTRUM/IMAG
##SYMBOL=    X,             R,               I
##VAR_TYPE=  INDEPENDENT,   DEPENDENT,       DEPENDENT
##VAR_FORM=  AFFN,          ASDF,            ASDF
##VAR_DIM=   32768,         32768,           32768
##UNITS=     HZ,            ARBITRARY UNITS, ARBITRARY UNITS
##FACTOR=    0.250966925370066, 1,           1
##FIRST=     8223.43324360095, 177424,       -46093
##LAST=      0,             -167018,         78831
##MIN=       0,             -730553,         0
##MAX=       8223.43324360095, 469759658,    0
$$ Real data points
##PAGE= N=1
##DATA TABLE= (X++(R..R)), XYDATA
$$ [...]
19468a39590j14373J14128E2818a33962l918E9680N1354A1079J45148a6846A09684
19456b1191j92644e0598C3674a610F9610a00335p7552j36707M8107b8686j52870
19445a81556E6325O3494a26641c7843j88770a09716l97921J10342a95387n3132
19435b48519m2078J02474j1653d862B9536K53103a03438A01081N3615d4768l5879
19424h0647o4993l1233j18074P1710A27693f152A29035a24868c6988k6599A71965
19412b7128k1114l46736A03314c46483d0653j90049B03856a81991A51328b52535
19401b6142A07531a9995j64103C24994a2884n7475D8133a83176b1839k55707A47874
19389B43279G5429c37205B09582c12104g7147k3900C5353i2173k81404i9198G2400
$$ y = [-139590, -253963, -139835, 52818, -133962, -137880, 59680, 111034, 11079, 156227, -16846, 109684, -21191, -213835, -50598, 33674, -1610, 69610, -100335, -177887, -314594, -266487, -28686, -181556, 56325, 119819, -126641, -37843, -226613, -109716, -507637, -397295, -195387, -248519, -290597, -188123, -199776, -4862, 29536, 282639, -103438, 101081, 154696, -44768, -80647, -145640, -176873, -294947, -223237, 127693, -6152, 129035, -124868, -36988, -63587, 171965, -27128, -48242, -394978, 103314, -346483, -40653, -230702, 203856, -181991, 151328, -252535, -26142, 107531, -19995, -184098, 324994, -12884, -70359, 48133, -183176, -21839, -277546, 147874, 243279, 75429, -337205, 209582, -312104, -77147, -101047, 35353, -92173, -373577, -99198, 72400]
19377c1147n3346j90625g8094m13255g601E7312a55765n053I0233g1917G235a9995
19364c3915A68805a69034j39349M2909G0721f208j16584A25106B662b42690H0002
19352d21928A46034a09928k80835A09164B014f8859A89359G494a7166l19710P3791
19341b63085J19793A13639q536a98492p6239f3405j02279N7237c0705m686G8064
19329h0677e049m0701D29429b80381q7048A39986B8314J10936b91021R0412K6988
19318a73621E1580b99520e4014j8241k22501D0581j5662R9894a65466L4045A07350
19306b3556J1618n0179m2898l0547A21852n335H825a30399c5371k07326j79227
19295d21924J22684h7855B52554H6208b38703A52122f0060C0829f4327r4475i226
$$ y = [-31147, -84493, -275118, -78094, -491349, -7601, 57312, -155765, -160818, 90233, -71917, 7235, -19995, -33915, 168805, -169034, -308383, -265474, 70721, -6208, -122792, 125106, 2662, -242690, 80002, -421928, 146034, -109928, -390763, 109164, 2014, -68859, 189359, 7494, -17166, -336876, -263085, -143292, 113639, 105103, -198492, -274731, -63405, -165684, -108447, -30705, -35391, 78064, -80677, -5049, -45750, 429429, -280381, -367429, 139986, 28314, 139250, -291021, -200609, -173621, 51580, -299520, -54014, -72255, -294756, 40581, 24919, 124813, -165466, -131421, 107350, -23556, -11938, -62117, -105015, -135562, 121852, 116517, 8825, -130399, -35371, -242697, -421924, -299240, -87855, 252554, 86208, -238703, 152122, -60060, 30829, -64327, -158802, -9226]
19283a69999E0364f9632m55547a5958B23990c22758g5391A06157c820k68600A81663
19271D5638K9732b9982H7980a07265r4503h9768k5708Q901B5512J03601l0052
19260I9061b15034j67260i5962D6853L5532a8694G7432e1823k7597j11019a8701
19248A33183g5278m415a9638j06255B1641J48827k790j5692N6561G9443P6965
19237A56408c26858A90573q8518b58411A41907k2948a07983M0372E7804B7575
19226b06623N7443e8179j71267l8876j18112i8998j59795B05923b86387m6614
19216c33001A8308c41660L5691J12056N0640D7485b48181l614L9813k16405e6582
19204b2789A58089a73752J0206B9009f7694p345K4719p0240k0301M2326G0324
$$ y = [-169999, 50364, -69632, -525179, -15958, 223990, -322758, -75391, 106157, -3820, -272420, 181663, 45638, 75370, -29982, 87980, -107265, -201768, -89768, -115476, -106575, 25512, 129113, 99061, -215034, -382294, -95962, 46853, 82385, -18694, 77432, -51823, -79420, -190439, -18701, 133183, -75278, -79693, -19638, -125893, 21641, 170468, 167678, 151986, 208547, 79443, 156408, -326858, 190573, 102055, -258411, 141907, 118959, -107983, -67611, 57804, 27575, -206623, -149180, -58179, -229446, -268322, -386434, -98998, -258793, 205923, -286387, -333001, 18308, -341660, -305969, -193913, -143273, 47485, -248181, -251795, -211982, -428387, -56582, -22789, 158089, -173752, -163546, 29009, -67694, -75039, -50320, -120560, -140861, -98535, 70324]
19192a92040M852p6449A49234m6128J0339a90924l9626J10126G4448a5090o11
19181a5701n03896a97464Q6795a7815A01488J22055h6897I6411c6145j99921R8060
19170a38006l7271A82890C4336d39404J09065C168c17286A43271M8175e4148j15430
19159a69578G5112a30798B62994b99203D24665b046A43813a26916P769j10967
19149b30114Q5147L4589o7775I3059C1386A1768b6900A39942a90379A41313d4778
19137A76807a8446B36175A2246a84540f9598q1941B2556q468d82239G1189a16217
19125b9760k85097a56296j25025P0654R4444I2077b99571M3838D5915N263a30725
19113F6769J78160A21126m8898f1342E5763b02667A54046a67918m5710B75341
$$ y = [-192040, -187188, -263637, 149234, 103106, 113445, -190924, -230550, -120424, 74448, -15090, -15701, -519597, -197464, -110669, -17815, 101488, 223543, -86897, 96411, -36145, -236066, -138006, -175277, 182890, 34336, -439404, -330339, 3168, -317286, 143271, 191446, -54148, -169578, 75112, -130798, 262994, -299203, 424665, -2046, 143813, -126916, -119147, -230114, -144967, -110378, -178153, 93059, 31386, 11768, -26900, 139942, -190379, 141313, -44778, 176807, -18446, 236175, 12246, -184540, -69598, -151539, 22556, 14088, -482239, 71189, -116217, -29760, -314857, -156296, -281321, -210667, -116223, 92077, -299571, -255733, 45915, 51178, -130725, 66769, 244929, 121126, 72228, -61342, 55763, -202667, 154046, -167918, -213628, 275341]
19102c0013h586A91980L01j7935C9024a14501B11581a36075k67914c5503A08865
19090G4987a13544b0990l9758p723K9102G9337K8401J66162f2561a0455M164r7282
19078a03573j4006A71845d004A12362a6930e13m2060A42389e0945m8816c4282
19066b19311r9954Q0501a18123j33319a13309j6468g227o0660o4019m8867Q8107
19055i2666L9916D46773j98754h9284B94401J14138b32372h2215D5713R2497C6393
19043b44027H5077a5374A09021A2584e8270l27105B3733a57086b6550j20836E3536
19031I0996e5887j02256F0866f4215k13494A36133a98079N9261A1951P733L8329
19020E8013b5743j81142l6134A99771a75787I1146a39738L0219A52880p3270j0262
$$ y = [-30013, -8586, 191980, 192281, 174346, 39024, -114501, 211581, -136075, -403989, -35503, 108865, 74987, -113544, -20990, -60748, -68471, -39369, 79337, 107738, 273900, -62561, -10455, -6291, -103573, -117579, 171845, -4004, 112362, -16930, -513, -42573, 142389, -50945, -99761, -34282, -219311, -319265, -238764, -118123, -251442, -113309, -129777, -7227, -67887, -131906, -180773, -92666, -52750, 446773, 248019, -89284, 294401, 408539, -232372, -82215, 45713, 138210, 36393, -244027, 85077, -15374, 109021, 12584, -58270, -385375, 23733, -157086, -26550, -147386, 53536, 90996, -55887, -158143, 60866, -64215, -277709, 136133, -198079, -138818, 11951, 19684, 58013, -25743, -206885, -243019, 199771, -175787, 91146, -139738, -109519, 152880, 79610, 69348]
19009F9348J30397b7635L560B7461H972g2075k40139A99843d8510A41230K173
18998A43403b44451B12380i120k01984a098k49060a05735B80807m1333A06845
18987A06435a39079E6820a05554A80981l8555B7424J36404a45709D2766f1304
18976hj32444A93019m6075d5250j11617b7845B7168J62333b68059g9001E0116
18964c21861a0004o1383J5573B5719K4868K55779H0439K36459K84248k97445n3399
18953B50302E4815d5680k8940G7147K26963i0004j27314e3160k8046k17158E8289
18941e7333A73605n3930a79353N9325q1200B45568m7620b10149J6474B20931a84018
18929a97660g9228j05289c6564F3190J19557C1639B459j086a03334A03182K47123
$$ y = [69348, 199745, -27635, -24075, 27461, 8972, -72075, -312214, 199843, -48510, 141230, 143403, -244451, 212380, -9120, -211104, -1098, -250158, -105735, 280807, 239474, 106845, 106435, -139079, 56820, -105554, 180981, 142426, 27424, 163828, -145709, 42766, -61304, -8, -132452, 193019, 146944, -45250, -156867, -27845, 27168, 189501, -268059, -79001, 50116, -321861, -10004, -71387, -55814, 25719, 50587, 306366, 80439, 316898, 601146, 303701, 250302, 54815, -45680, -74620, 77147, 304110, -90004, -217318, -53160, -81206, -298364, 58289, -57333, 173605, 119675, -179353, -120028, -201228, 245568, 197948, -210149, -193675, 220931, -184018, -197660, -79228, -184517, -36564, 63190, 182747, 31639, 2459, 1373, -103334, 103182, 350305]
18918C50305H8551d15o518A16641a20047D2457K0786K8629a29933b5726E5367
18906b10323A85383i3869J7966J3387J8549m8103d3368j57251e7950a5393A84824
18894C20147j7188J6337J55727k26892N9513B4622N3434K47900G7066K59010g449
18882a36213A06163c12310M1733J02521n2893i4371j00319a3443o017A10586a79790
18870a40921B8452h1350r6918k29713J64301a570j21538p2486K1190j23901H3677
18858a78197g5114n817A24744b72442c6169A3104J79601F1597Q9905M19963C5507
18846b92221f1195C30825A4666O7781b69941b4869B77398a40929H0202a91924
18835d24893A5240N4595N5406i2187A5586a69025N5946a0147A51128f8933A55509
$$ y = [350305, 88551, -415, -6933, 116641, -120047, 42457, 63243, 91872, -129933, -25726, 55367, -210323, 185383, -93869, -75903, -62516, -43967, -92070, -43368, -200619, -57950, -15393, 184824, 320147, 302959, 319296, 475023, 248131, 307644, 24622, 78056, 325956, 77066, 336076, -7449, -136213, 106163, -312310, -270577, -168056, -220949, -94371, -194690, -13443, -19460, 110586, -179790, -140921, 28452, -81350, -178268, -407981, -243680, -1570, -123108, -195594, -174404, -298305, 83677, -178197, -75114, -80931, 124744, -272442, -36169, 13104, 192705, 61597, 151502, 571465, 35507, -292221, -61195, 330825, 14666, 82447, -269941, -24869, 277398, -140929, 80202, -191924, -424893, 15240, 69835, 125241, -92187, 15586, -169025, -113079, -10147, 151128, -68933, 155509]
18823d5455F578f5906A36860a54877M137d3448k72157a17553j8673f4308n9350
18812a23658F4966J06917B5894e7638C38635A68951c10690A16059c0734m4394
18802g5128B8342a34093j6401F5233b81148a5320A24645a55304B23124a7896A66387
18790B36313D0385e1803m7011A78503a18088C6051f5069C2063d04470D7218O671
18779E3889g5538m6201F508a56210A42665J56248A19492b08533O0805L5212o7000
18768a79516F0406P253P362l1597a00063j23273J04924j32484h2479L3505D5425
18756A365L9541a2933j39078B2155a29070j652K2799j07903i0139k56416A05063
18744d8162C13669c26003A88P5735a15559A82827D0552c1031A55742a70803O8922
$$ y = [-45455, 6578, -65906, 136860, -154877, -150740, -43448, -315605, -117553, -136226, -64308, -123658, 64966, 171883, 25894, -57638, 338635, 168951, -310690, 116059, -30734, -75128, 28342, -134093, -150494, 65233, -281148, -15320, 124645, -155304, 223124, -17896, 166387, 236313, 40385, -51803, -98814, 178503, -118088, 36051, -65069, 32063, -404470, 47218, 53889, -75538, -121739, 6508, -156210, 142665, 298913, 119492, -208533, -147728, -112516, -179516, 60406, 67659, 75021, 43424, -100063, -223336, -118412, -250896, -82479, -48974, 45425, 1365, 40906, -12933, -152011, 22155, -129070, -130722, -107923, -215826, -90139, -346555, 105063, -48162, 313669, -326003, 188, 75923, -115559, 182827, 40552, -31031, 155742, -170803, -101881]
18733a01881c1470D8958b7012l19557a5542j88633j58182H0428a18136N6173l73143
18722d35106a24761A07549b45373j27626f9257J2965e434E8001J07296a89508
18711b65174a13286B3396R1696J62907b09594q6148J6365J02601r7751D3692O4286
18700A07978b19273A197i1879m3647j88237a59613c1932E4689a43366B46491a19013
18688a46925B95014h9880F2246h9716k94947a12836o1445b3696E9470B6440d11586
18676A02555b38900a08448b0673j07683j74161J01512d4943l8071F2824a7815
18665C47923a51506c3258j53709J0953G8104C6356K39627b05277D3056c3890N179
18654b8711k27k0319k6250r6588e1527f29A13141C7610K5596a48004m021C959
$$ y = [-101881, -31470, 48958, -27012, -346569, -15542, -204175, -362357, 80428, -118136, -61963, -435106, -124761, 107549, -245373, -372999, -69257, -56292, -5434, 58001, 165297, -189508, -265174, -113286, 23396, 115092, 277999, -209594, -295742, -279377, -176776, -274527, 43692, 107978, -219273, 1197, -91879, -135526, -323763, -159613, -31932, 54689, -143366, 246491, -119013, -146925, 295014, -89880, 62246, -89716, -384663, -112836, -174281, -23696, 59470, 26440, -411586, 102555, -238900, -108448, -20673, -128356, -302517, -201005, -44943, -83014, 62824, -17815, 347923, -151506, -33258, -186967, -176014, 78104, 36356, 275983, -205277, 43056, -33890, -28711, -28938, -49257, -75507, -172095, -51527, -629, 113141, 37610, 63206, -148004, -152025, 3959]
18641H7487O4878M360b39896P9707A8880K22017f4058E0576j2678a66125f5149
18629a2856F8237d7606O117A47648G0751b46890R9026C1041i5350K8294j2479
18618g9535p0436l8350H1293c30409F679K06769r5039a66283P3302A87413H0421
18606a18612g981B0135c25422a07976G2520B0943d4842j0586j34829l5862A85833
18594b3563A04704Q1212d17010A96903b0451l2365k2429l59705h2182A96518i8265
18582a76794A50352f5296o9907L4573D9689b48923f7197G0164f1641H3507g8879
18570H3334k7929e2343B73089b82890h5812L2359j64453C9186K50154c04169C2325
18558b57558L0937l98825b34050j066E9996f9883o905f411B32519b80962E453
$$ y = [87487, 152365, 156725, -239896, -160189, 18880, 240897, -64058, 50576, 37898, -166125, -65149, -12856, 68237, -47606, -41489, 147648, 70751, -246890, -147864, 31041, -95350, -67056, -79535, -149971, -188321, 81293, -330409, 6679, 213448, 118409, -166283, -92981, 187413, 80421, -118612, -7981, 20135, -325422, -107976, 72520, 20943, -44842, -55428, -190257, -226119, 185833, -23563, 104704, 185916, -417010, 196903, -20451, -52816, -75245, -434950, -82182, 196518, -98265, -176794, 150352, -65296, -135203, -100630, 49689, -248923, -67197, 70164, -61641, 83507, -78879, 83334, 55405, -52343, 273089, -282890, -85812, -53453, -217906, 39186, 289340, -304169, 32325, -257558, -226621, -625446, -234050, -235116, 59996, -69883, -76788, -6411, 232519, -280962, 5453]
18546b4301j78583A74010J57951a6059A48400c426o8346I0412K5039f1705j58075
18535b19780h4675B6008o898a62470C33234C9220a94750d4772G4077a47174A38054
18523g8615D74098F5513b33956a6551j61255H6767a03485A83036H5350A6872a52292
18511G5018c10417h6445B23760h191j11602F0196a70809e7447l07823a65491D8176
18499g4698A64261i5392j47842R0301G3133a27660A24318j9486J68916A00653
18488B0946b2539k11905C8796Q4080L5645b55856d0161B27909b8663A37889e7524
18476g9311A37807h727F9683b58525I2366l4982a47129d372A4203c07480j18818
18465d26298f2800K3675A08976b1820k85084A31097d06040a91889C03621b6921
$$ y = [-24301, -202884, 174010, 331961, -16059, 148400, -3426, -71772, 90412, 115451, -61705, -219780, -84675, 26008, 19110, -162470, 333234, 39220, -194750, -44772, 74077, -147174, 138054, -78615, 474098, 65513, -233956, -16551, -177806, 86767, -103485, 183036, 85350, 16872, -152292, 75018, -310417, -86445, 223760, -8191, -119793, 60196, -170809, -57447, -365270, -165491, 48176, -74698, 164261, -95392, -243234, -152933, 73133, -127660, 124318, 104832, 273748, 100653, 20946, -22539, -234444, 38796, 122876, 158521, -255856, -40161, 227909, -28663, 137889, -57524, -79311, 137807, -8727, 69683, -258525, 92366, 57384, -147129, -4372, 14203, -307480, -426298, -62800, -39125, 108976, -21820, -306904, 131097, -406040, -191889, 303621, -26921]
18454d16654J86782b1697q8653E8119F832a14927B12458h846m3890l9598a9788
18442b55229A16025h2809m7888a3368o278m7564k32449C998c42917J53344C11886
18430b77486i3106k19870J8141A99159g6498o8747A420b08267j10458i492l03724
18419c13216f9115C46424d48349A0229a66620C1363f0982j81798C4365a13591
18408a22311K5999C5290h7250G6068i4286E1142J64157c19078f2998A52249D6137
18396D4124h8576B36289a0029I9106J59714e6141q3651I2316l1150P8061o4636
18385G4591e3636A36477J31096b83334B69567H8601j443b63035A94943a53029
18374d5174n5580H9836a01902j10278c2396E3589c12497N158j2846I1086b13161
$$ y = [-416654, -229872, -21697, -110350, 58119, 6832, -114927, 212458, -8846, -52736, -92334, -19788, -255229, 116025, -82809, -130697, -13368, -19646, -67210, -299659, 3998, -342917, -189573, 311886, -277486, -93106, -312976, -294835, 199159, -76498, -145245, 1420, -208267, -318725, -9492, -313216, -69115, 346424, -448349, 10229, -166620, 31363, -60982, -242780, 34365, -113591, -122311, -96312, 35290, -87250, 76068, -94286, 51142, 215299, -319078, -62998, 152249, 46137, 44124, -88576, 236289, -10029, 99106, 258820, -56141, -139792, 92316, 61166, 139227, 74591, -53636, 136477, 267573, -283334, 269567, 88601, 87158, -263035, 194943, -153029, -45174, -100754, 89836, -101902, -212180, -32396, 53589, -312497, -307339, -320185, 91086, -213161]
18362F7881b06109F0142J02835R2393e9208p8595H6944a03877H8427j162d0505
18350A11239a4042j40003H9734b07386B87873i6212K5362A1284K98648K18167
18340E28099A36041a66039C2573K149Q80c10487J52470J1951F6728a14716D5464
18328A66971K5735R0902j34705c1742j28266k19162J53576n1700H973J26688a80529
18316D78876a85346B03718p7657G477K1931a01836p5977P4330A08396A0049a34305
18304i0793j43595b473F9731b8734j16638H8877a13776A82882e4634G3281b6412
18292C12781m6158c59941B7678J16676K7596B247a02039j03060a5013G0307A9743
18280B27293a17965D37626a55431D1013J51834J11476b12797g3679K1737A94519
$$ y = [67881, -206109, 60142, 162977, 255370, -59208, -137803, 86944, -103877, 88427, 87265, -40505, 111239, -14042, -154045, 89734, -207386, 287873, -96212, -70850, 11284, 309932, 528099, 136041, -166039, 32573, 34722, 35602, -310487, -158017, -146066, 66728, -114716, 45464, 166971, 192706, 283608, 148903, -31742, -160008, -379170, -225594, -277294, 8973, 135661, -180529, 478876, -185346, 203718, 126061, 7477, 29408, -101836, -177813, -103483, 108396, 10049, -134305, -90793, -234388, -2473, 69731, -28734, -145372, 88877, -113776, 182882, -54634, 73281, -26412, 312781, 266623, -359941, 27678, 144354, 171950, 2247, -102039, -205099, -15013, 70307, 19743, 227293, -117965, 437626, -155431, 41013, 192847, 304323, -212797, -73679, -51942, 194519]
18269a82205e2089p3587A46499B5840f4922K9961l8116j61655F3754O6322g1683
18257C52938a14061i005m806k52825B95391A0331K75339a24034B01803c1611B05631
18245A54564a87918C3164a25400B89359a23872C02007C1539M4155b27920M5883
18235a82037A21484J78078b42497O4897A28096j1493O2106O0423e8546H6585a30026
18223b83044a02381A37993F3372L19826c54047F6782h6384k16754A23685m3732
18213G9953K2622g2165B59129a75971c5414B20016b44482a3609k50294A65426
18202H1201a60125L9804e1009A02323m3591a28536c5677m5814q2493L0112I7080
18190B01733K5916K4645a54631B93374E630K8716h2729A4144i3757A32876b74819
$$ y = [-182205, -52089, -125676, 146499, 25840, -64922, -34961, -73077, -234732, 63754, 130076, -71683, 352938, -114061, -9005, -13811, -266636, 295391, 10331, 285670, -124034, 201803, -31611, 205631, 154564, -187918, 33164, -125400, 289359, -123872, 302007, 31539, 75694, -227920, -182037, 121484, 299562, -242497, -177600, 128096, 116603, 178709, 239132, -58546, 86585, -130026, -283044, -102381, 137993, 63372, 383198, -354047, 66782, -86384, -303138, 123685, 79953, 102575, -72165, 259129, -175971, -35414, 220016, -244482, -13609, -263903, 165426, 81201, -160125, -120321, -51009, 102323, 58732, -128536, -35677, -81491, -163984, -133872, 97080, 201733, 227649, 252294, -154631, 293374, 5630, 34346, -82729, 14144, -93757, 132876, -274819]
18178a57856K4346K2825C28809o4988j03210b04309H9955a92018b5752m9134A24571
18166E0986b62431p9932a69639e5613a7219E5434J45383e4762k9965r446b5822
18154a8168l61068A48132g9109q0829H5272K4280f0484a8634A14060J98542a58499
18142A02348g7522m357j93725D6492P3787a17139B5869a52530d2758B06714a24902
18130A44835l9049N7305L3683P2866a00982k1807o4589g5953B5940P411J06320
18119A39671J90523b22984I0004l7065e4432j64101F3833n075c7336q041j84531
18108b29908B12755B9493L656e1882j27278j13109a4146m5413A7753a10051j14400
18097b24451L3684g6495D1276r228N8659i6227D60a51349D84438j34815A11902
$$ y = [-157856, -133510, -110685, 328809, 263821, 160611, -204309, 89955, -192018, -25752, -74886, 124571, 50986, -262431, -342363, -169639, -55613, -17219, 55434, 200817, -54762, -84727, -94173, -25822, -18168, -379236, 148132, -79109, -159938, 85272, 109552, -60484, -18634, 114060, 312602, -158499, 102348, -77522, -81879, -275604, 46492, 120279, -117139, 25869, -152530, -42758, 206714, -124902, 144835, 105786, 163091, 196774, 269640, -100982, -122789, -187378, -75953, 25940, 33351, 139671, 330194, -222984, 90004, 52939, -54432, -218533, 63833, 58758, -37336, -45377, -229908, 212755, 29493, 33149, -51882, -179160, -292269, -14146, -59559, 17753, -110051, -224451, -190767, -76495, 41276, 32048, 90707, -96227, 460, -151349, 484438, 349623, 111902]
18085H2200L24235P1962B17891j3271L2731b00203h3013A89707l4440K3068d67042
18073B6450b18309B01450j3242d2548k53465g3785A86896l9949m4275a30019h413
18061B0486C844a32601M1560j43437c8871k25241A62674N4510E1979b5944I4572
18049H1928g2961j35531j29013A13073C5302a65181e8648l76707A56416b84422
18038a749n2293A24451D4579M7707a78162D8383K09388E559K33455k5310b54858
18026c14952G4859f5563C51932A52357e7802j3226B05603i6425L1457K6317E8730
18014g8667k66115B12208O4060c037H2937d9596A95465N4720e2381A67071H3159
18002c64948h0469D982g5987A08054K3457A1386J0121K3419j6137h0321c6535
$$ y = [82200, 406435, 478397, 217891, 204620, 237351, -200203, -83013, 189707, 155267, 178335, -467042, 26450, -218309, 201450, 188208, -42548, -296013, -73785, 186896, 146947, 102672, -130019, -8413, 20486, 3844, -132601, -91041, -234478, -38871, -264112, 162674, 217184, 51979, -25944, 94572, 81928, -72961, -208492, -337505, 113073, 35302, -165181, -58648, -435355, 156416, -284422, -1749, -54042, 124451, 44579, 92286, -178162, 48383, 257771, 5559, 239014, 213704, -254858, -314952, 74859, -65563, 351932, 152357, -57802, -71028, 205603, -96425, -64968, -38651, 58730, -78667, -344782, 212208, 276268, -3037, 82937, -49596, 195465, 250185, -52381, 167071, 83159, -364948, -80469, 4982, -75987, 108054, 131511, 11386, 21507, 44926, 28789, -80321, -36535]
17990A25034O1651D135a10130A36151k0017g88F7799c19776D4532P629K41583
17979B93744b70703N565R4824l5199g2786B64232A9534K7545d8526j36543R1185
17968i3884B16047H0526J03031D152M13031e0604A1221K19637A3214c34685c1928
17956C76490b416A4631J25864J08315C3133N3836b8440C81898f7608j5179D5501
17944b09594e0670j77875D3622a00436k08060A45362Q5516g0641b1233j07367
17934a28600K4711c833l39826h7028L6859a6830r7626k13612j25459A36768J92414
17923C29182j36026A6145f0993n5730H7756k0761c6339D3477N0916a15652c7057
17911c1633A37235a86585A44990L9523b7460D8098K48843r2380o0142a91306q5047
$$ y = [125034, 186685, 4135, -110130, 136151, 116134, -788, 67799, -319776, 44532, 52161, 293744, -270703, -265138, -170314, -205513, -72786, 264232, 19534, 47079, -48526, -185069, -93884, 216047, 80526, 183557, 4152, 417183, -50604, 11221, 230858, 13214, -334685, -31928, 376490, -2416, 14631, 140495, 248810, 33133, 86969, -28440, 381898, -67608, -82787, 45501, -209594, -50670, -228545, 43622, -100436, -308496, 145362, 230878, -70641, -21233, -128600, -103889, -3833, -343659, -87028, -50169, -16830, -114456, -328068, -453527, 136768, 329182, 193156, 16145, -60993, -116723, 87756, 66995, -36339, 43477, 94393, -115652, -37057, -31633, 137235, -186585, 144990, 184513, -27460, 48098, 296941, 204561, 144419, -191306, -276353]
17900b76353g7955B37896H1662J32501l2167C8630a67951C0089M6506c2186A1344
17888D20242E6567a76347j12302e1603j98648d1794j53265b6265C29124c81117
17877b01521r74F9067a05006C91189G9497J75608J42129A16337P7728R472a73727
17865A8284d4177B24184A09640c32975I1413O6439E1763a9126A63646D4105J81917
17854B26022K8117p7245b6196D1602J92664b0451l5548E3541d05034A33227K7121
17843A60348K11132H348a30550A21592c0737D00497j96068G147a55667B97494
17832A51210a20540D90099d0860B06525n6726n1002O5954D4580j1107m287K66333
17821B95519H8535D3226J14964C9974a0773k15652A35245c25505F5932K45797
$$ y = [-276353, -77955, 237896, 81662, 214163, 181996, 38630, -167951, 30089, 76595, -32186, 11344, 420242, 56567, -176347, -288649, -51603, -250251, -41794, -195059, -26265, 329124, -381117, -201521, -202495, 69067, -105006, 391189, 79497, 255105, 397234, 116337, 194065, 203537, -173727, 18284, -44177, 224184, 109640, -332975, 91413, 157852, 51763, -19126, 163646, 44105, 226022, 254139, 176894, -26196, 41602, 234266, -20451, -55999, 53541, -405034, 133227, 160348, 371480, 8348, -130550, 121592, -30737, 400497, 204429, 7147, -155667, 297494, 151210, -120540, 490099, -40860, 206525, 149799, 98797, 164751, 44580, 33473, 29186, 295519, 88535, 43226, 158190, 39974, -10773, -226425, 135245, -325505, 65932, 311729]
17811C11729a29498A41548o9463e5033C35914b4128p8518D5514J09303L17715
17801D72532f6456B32048b0113l995A58248e5675j88706g7039L5311A82189a11927
17789c93347b8591q1607B05887a43586A45852J17975a23300F8337a00981n2546
17779a53527A50207e0416A45368B5065J1727j202J08025i1304B11906f1783I1200
17767A8304P2621K41604D2093K8531N89457B03606a58107A27405e6145D07293
17756B49829C1912K70232I5277e7276B34351d7930A52330N8185F4418J666Q1278
17745A47362e7303A88567e1338B29790e8692l8839l5747b8985j20354A14210e6538
17733b28167A34732j9140K2998o8324J21090a44693A9662J20380n6179J10821
$$ y = [311729, -129498, 141548, 72085, -55033, 335914, -24128, -102646, 45514, 154817, 472532, -66456, 232048, -20113, -24108, 158248, -55675, -244381, -77039, -41728, 182189, -111927, -393347, -28591, -110198, 205887, -143586, 145852, 263827, -123300, 68337, -100981, -153527, 150207, -50416, 145368, 25065, 36792, 35590, 143615, -91304, 211906, -61783, 91200, 18304, 90925, 332529, 42093, 70624, 660081, 203606, -158107, 127405, -56145, 407293, 249829, 31912, 302144, 95277, -57276, 234351, -47930, 152330, 210515, 64418, 66084, 147362, -57303, 188567, -51338, 229790, -58692, -97531, -133278, -28985, -149339, 114210, -56538, -228167, 134732, 115592, 138590, 70266, 191356, -144693, 19662, 140042, 83863, 194684]
17723A94684l6404E4193J13631M3050o4857K78573D0697k723M5868K51272F1745
17711c329B61889a28120f3909A50873E8877K76303H9576j024j6279K42910j08009
17700B07174F1424c0823j38107e016H2193J2917a27360A45992L4349K33252j86465
17689B27128F6536K78024E5719d91149B51277b71357j6537A5863b30319A34664
17678a84781M9451I0206L0354J03059a19929N0937E6583K2440d7975m8113A5262
17666B9826K72625j46165e9202m2470G0420a06555G7129K96489j84574h0261L8856
17655d1405q2983C36622G2082B4763g4373b7474B29827a15478A76402R3175a256
17643A84569m1343L33000c82804I5202J876M6481p1626c4851k7578o367n7710
$$ y = [194684, 158280, 54193, 167824, 210874, 146017, 424590, 40697, 37974, 83842, 335114, 61745, -3329, 261889, -128120, -63909, 150873, 58877, 335180, 89576, 88552, 72273, 315183, 207174, 61424, -30823, -168930, -5016, 82193, 95110, -127360, 145992, 180341, 413593, 227128, 66536, 344560, 55719, -491149, 251277, -271357, -287894, 15863, -230319, 134664, -184781, -135330, 90206, 120560, 223619, -119929, -68992, 56583, 79023, -47975, -96088, 15262, 29826, 302451, 156286, -59202, -101672, 70420, -106555, 77129, 373618, 189044, -80261, -41405, -124388, 336622, 72082, 24763, -74373, -27474, 229827, -115478, 176402, 269577, -1256, 184569, 143226, 476226, -382804, 95202, 97078, 143559, 71933, -34851, -62429, -68796, -126506]
17632a26506A63464R9804K10429A22047b46566B35165r8702n9435A6449J26462
17622A42911J35956j21691b60381A37941K4993C6215b16515B76068A19489j5807
17612A03682e0062C00751j36683b56549A07956J17207H9866O1896K75187L3487
17602D60436A39783l557k0459Q6674L1942n1011a9635H1815l5540K38752e8607
17590C15604j12837g6034L5001C81088j81418o3852b389I0116M0967C0939J07714
17579A38653C2177M65026k02286N6142M8720A8290J83890j8142F4386L8919J5993
17568A19298J71930j06777h5351B19546q4348J33126r5701l6823a84605a4266
17557B77116B5092a06443F8755J53568F5729f1857K554a9798B71957K35322j97639
$$ y = [-126506, 163464, 263268, 473697, 122047, -246566, 235165, 136463, 77028, 16449, 142911, 278867, 157176, -260381, 137941, 162934, 36215, -216515, 276068, 119489, 103682, -50062, 300751, 164068, -256549, 107956, 225163, 89866, 151762, 426949, 460436, 139783, 136226, 115767, 202441, 234383, 183372, -19635, 81815, 46275, 285027, -58607, 315604, 202767, -76034, -41033, 381088, 199670, 135818, -2389, 90116, 131083, 30939, 138653, 32177, 497203, 294917, 351059, 399779, 18290, 202180, 184038, 64386, 103305, 119298, 291228, 184451, -85351, 219546, 135198, 268324, 172623, 135800, -184605, -14266, 277116, 25092, -106443, 68755, 222323, 65729, -61857, -59303, -19798, 271957, 507279, 309640]
17546C09640m0826a45820F7622a81791A79315a877B55469A27262R8099D8306K5433
17535G3739L4266K45239A03955L07645A78344L11940a77806I4784M2383O447k5795
17524A17819e288F23K13829A03526a23989B86913J76598p0529f2700B02757j002
17513B01755K31262Q7950k36387N13750J84429N6264l73313O2801A54068N91520
17503G45588C25845J04550K58208B32891J21158j17363L88440j84600Q3823L3327
17493E57676N64418l43896j56465j24827k29167P6128j46331L86182A73000M86983
17483F59983A99014L65622k73085N0852q601A59507J82945A64935A1910N61378
17473E73288B08810K71933r6636n9275j12307K61346A27191D3309L18998K12335
$$ y = [309640, 268814, -145820, 67622, -181791, 179315, -1877, 255469, 127262, 225361, 48306, 73739, 108005, 353244, 103955, 411600, 178344, 490284, -177806, 94784, 137167, 143614, 117819, -5288, 623, 214452, 103526, -123989, 286913, 463511, 392982, -62700, 202757, 201755, 433017, 520967, 284580, 798330, 982759, 1039023, 665710, 728511, 154068, 745588, 325845, 430395, 688603, 232891, 354049, 236686, 625126, 440526, 524349, 557676, 1122094, 778198, 621733, 496906, 267739, 343867, 197536, 583718, 173000, 659983, 199014, 564636, 291551, 342403, 333802, 159507, 342452, 164935, 11910, 573288, 208810, 480743, 384107, 324832, 212525, 473871, 127191, 43309, 362307, 574642]
17463E74642B01216P1771a35675C72587A80369A2358h1496B64821b7749C9149
17452A48539K36268J02060j81921A15468J07827c4726B15211J92879F5080K70638
17442C35718j13266J9228O6857b9286C52521j40079L22105N6702j38144K97417
17432G50522l52781l3345j9885R7574A63710K09169G6542M36454g4474C18438
17421G19983B32185J54754Q4594k07061A26061K87866j91816l8740K53756m4618
17411C92509o6882K12598A84497M32350B92453m1066J15337o8212j21450L83919
17401E60981j38626H9375a34304B39673K9184J36102Q7761k29243Q7551j64919
17391A86109o9385K08568D1679J06418p2525J76920J51511m1383j48114m6288
$$ y = [574642, 201216, 272987, -135675, 372587, 180369, 12358, -81496, 264821, -27749, 39149, 148539, 384807, 486867, 304946, 115468, 223295, -34726, 215211, 408090, 65080, 335718, 222452, 241680, 308537, -29286, 352521, 212442, 534547, 591249, 453105, 750522, 397741, 364396, 344511, 442085, 163710, 372879, 76542, 512996, -74474, 318438, 719983, 232185, 386939, 471533, 264472, 126061, 413927, 222111, 183371, 437127, 392509, 325627, 538225, 184497, 616847, 292453, 251387, 366724, 298512, 177062, 560981, 422355, 89375, -134304, 239673, 268857, 404959, 492720, 263477, 351028, 186109, 116724, 325292, 41679, 148097, 75572, 252492, 404003, 362620, 214506, 168218]
17381A68218K43722j36776J89192A58745N2555b66060A16004J09002A11147K45947
17371C57094j56502K7275P1715A11893R83n5090K93945K255p6836j462j20388
17360A55300K25568J04588k14840E9726M17001k24819P5383J45988k21811J44936
17350C96404m3304M0062O6962n8836D7638K86423G9588L00748k7556q2913O582
17339B76449a59889d5407G16876A82808L8692n1009J55833A09066Q1718L23256
17329E14040k49202K8991G3807R9307J99238R2396E2531L4849K54743k125e7698
17317A75980J23209q1843E1930H446L20352l1960q3764O6475j24375K2317L3962
17306B11453e5892J7830C34525J8099g8445D49541n1148l213A07006P9239M1457
$$ y = [168218, 411940, 275164, 464356, 158745, 211300, -266060, 116004, 225006, 111147, 357094, 200592, 227867, 299582, 111893, 112876, 57786, 351731, 353986, 277150, 275688, 155300, 380868, 485456, 270616, 59726, 476727, 251908, 327291, 473279, 251468, 396404, 353100, 393162, 460124, 401288, 47638, 334061, 79588, 380336, 352780, 269867, 276449, -159889, -45407, 716876, 182808, 221500, 170491, 326324, 109066, 190784, 514040, 264838, 293829, 73807, 173114, 372352, 464748, 52531, 87380, 342123, 339998, -57698, 175980, 299189, 217346, 51930, 8446, 328798, 296838, 213074, 279549, 155174, 177491, 211453, -55892, -38062, 334525, 352624, -78445, 449541, 398393, 395180, 107006, 186245, 227702]
17295B27702M5417j11349J3493n479K78792l4631j83857k4173a77361E67724c2792
17283A60337M6131i4167K1617C97736R6108k46582o226Q6339D408L32539A12397
17271A95954J94135b2576A57046J76591A57994J12829R856j39578P1280L42754
17261E55135C6469L70693j28172o2776J20298K2410M9046m9658d1984B56088j20439
17250A35649a59590A55263K30999a03993A30671M25684A64770L06232A62066K80431
17240D42497A25686l2060J8501J93602L16416j97397J9437n1695A91925K6151
17230B18076L20470C6709J96177K84651B09903Q7654L26055B03631L18593A86907
17219B73379Q9744j36847o9231c113B25814L63267B28194J53607J19575j35193
$$ y = [227702, 273119, 161770, 175263, 169784, 448576, 413945, 230088, 205915, -177361, 567724, -32792, 160337, 206468, -94167, -72550, 397736, 493844, 247262, 241036, 327375, 4408, 336947, 112397, 195954, 390089, -22576, 157046, 333637, 157994, 270823, 280679, 141101, 212381, 555135, 36469, 407162, 278990, 216214, 336512, 358922, 407968, 358310, -41984, 256088, 135649, -159590, 155263, 386262, -103993, 130671, 556355, 164770, 471002, 162066, 442497, 125686, 93626, 112127, 305729, 622145, 424748, 444185, 392490, 191925, 218076, 538546, 36709, 232886, 517537, 209903, 297557, 623612, 203631, 522224, 186907, 273379, 363123, 226276, 157045, -3113, 225814, 589081, 228194, 381801, 501376, 366183]
17209C66183K13957j07605A11083q599N99215C39368Q7564j75364J27039F6122
17198B51896K55116j61391l661K93597b63546C33892F8198L32756K67993A76176
17187C95096J473J48603k29956J96189A94219J10683J51635p5886j84343k5222
17177A71086O26719C6283M16846K0600n8110A38431K57728L0397J35893B55712
17166E46949j04511M0942R0655k40750N0489P3785B24904L71734k30230M1520
17156D07928j86628p5152L85962k02469K38269J91113C58776j6536k9401P9122
17146C91961K05977n6973B62778K76583j77331Q84N5808j3650m6321K1021o8833
17135C10939K48311a4002C74961J00813n5128K03294L7930C13082j55368L68790
$$ y = [366183, 580140, 472535, 111083, 102484, 701699, 339368, 426932, 251568, 378607, 66122, 251896, 507012, 345621, 341960, 635557, -263546, 333892, 68198, 400954, 668947, 176176, 395096, 396569, 545172, 315216, 511405, 194219, 304902, 456537, 380651, 196308, 171086, 797805, 36283, 453129, 473729, 415619, 138431, 396159, 426556, 562449, 255712, 546949, 442438, 483380, 574035, 333285, 383774, 457559, 224904, 596638, 366408, 407928, 221300, 146148, 532110, 329641, 567910, 759023, 358776, 342240, 312839, 391961, 597938, 540965, 262778, 539361, 362030, 362914, 418722, 405072, 358751, 379772, 310939, 559250, -14002, 374961, 475774, 420646, 623940, 661870, 313082, 157714, 526504]
17125E26504j70822R1942A68679N81378l08381n0001J08151P4897J13870J26337
17115H14930k77352k1289J65623j04619L2663k70995M8947L30135k74739J55522
17105E98826J38458k0888k43532A87523M70466K5983n9948j9424L92775l62468
17095F34907j67118r6764j4894o9828J59905L21651j10416L0819l33511k6212
17085C28539K11200B21872K45319L0249K8100J42440J08869p5998j96870M4843
17075E48824o1547L17170k55854Q9586j4344J57268J17402k62992k02103N41237
17065I74647r464D19692L85423l23319K26356K52026k36396M579r5071O6476j85780
17054E13986K14573R074k36791n1150k3881K08758m1261J39198k10133N5166L30107
$$ y = [526504, 355682, 447624, 168679, 750057, 441676, 391675, 499826, 574723, 688593, 814930, 537578, 516289, 681912, 577293, 609956, 338961, 387908, 718043, 443304, 598826, 737284, 716396, 472864, 187523, 657989, 683972, 624024, 604600, 997375, 634907, 467789, 371025, 356131, 286303, 446208, 767859, 657443, 688262, 354751, 328539, 539739, 221872, 467191, 497440, 525540, 667980, 776849, 700851, 503981, 548824, 487277, 804447, 548593, 638179, 623835, 781103, 898505, 635513, 433410, 974647, 965183, 419692, 805115, 481796, 708152, 960178, 723782, 728361, 633290, 699766, 513986, 728559, 737633, 500842, 449692, 425811, 634569, 593308, 732506, 522373, 577539, 907646]
17043I07646k97812J5527J98918K5836p2509j5594n562l9635J21621n0430l39159
17032D48847K26546m3297N8928m2962J42424N5383k88260J64130o1149L5841p0658
17021F25773K75105k8646m18137M35769l2350K63118k36859p3900Q1591k33999
17011F57465P8434O8917m7313L30309r0819k48623R9784N6315j66230L79542j95300
17000I22481o8179L29108j01050l29391K79983j52878K32211q7155r9502M98292
16990A423920l15850j78058O5374p2805K08207j51705Q7971O4579J3928K73725
16980A419286l77046L74338l78890J23159R6260k15144O2556K16768j72359J90419
16970A339347j79758J59987j98974N8577L3115j55867k53161M36365L5191K06669
$$ y = [907646, 609834, 625361, 824279, 850115, 777606, 762012, 756450, 716815, 838436, 788006, 448847, 675393, 632096, 691024, 648062, 790486, 845869, 557609, 721739, 660590, 696431, 625773, 900878, 872232, 454095, 889864, 857514, 1120632, 883773, 809873, 891464, 657465, 735899, 804816, 757503, 1087812, 996993, 748370, 848154, 904469, 738239, 1117781, 922481, 854302, 1183410, 1082360, 752969, 1032952, 880074, 1112285, 1025130, 925628, 1423920, 1108070, 930012, 995386, 922581, 1130788, 979083, 1067054, 1131633, 1145561, 1419286, 1042240, 1416578, 1037688, 1160847, 1257107, 1041963, 1104519, 1321287, 1148928, 1339347, 1159589, 1319576, 1120602, 1179179, 1212294, 1056427, 803266, 1239631, 1274822, 1481491]
16960A481491p3865L29028j70772l76294K17669m0115j90411j4717N3147j09585
16950A105576J09112J32975K26989j46463j74185j5131R6331o865K44664l9664
16940A533339P5419k58495J01694n7758J49087L4830q2458j16640L59633k18643
16930A520008k18684M0211k8620K01254J0380J97901J86611k62723M00606n25849
16920A521095K01344K25678j45917k52720K08184K91793k73421j48699J83795
16911A811132l5013Q1113j33936J25727J78604p5776J49822p3375k80738L94122
16901B141682N427P1736j56100J94377n0748J37820j90345m0846K20192O3607
16891B396802K01452l80928J34944O1883o713J35760o7760l05960K61678j10409
$$ y = [1481491, 1407626, 1736654, 1565882, 1189588, 1407257, 1367142, 1176731, 1162014, 1215161, 1105576, 1214688, 1347663, 1574652, 1428189, 1254004, 1238873, 1335204, 1328339, 1573003, 1533339, 1608758, 1350263, 1451957, 1394199, 1543286, 1578116, 1495658, 1379018, 1738651, 1520008, 1301324, 1341535, 1312915, 1514169, 1524549, 1722450, 1909061, 1646338, 2046944, 1521095, 1722439, 1948117, 1802200, 1549480, 1757664, 2049457, 1776036, 1627337, 1811132, 1776119, 1857232, 1723296, 1849023, 2027627, 1951851, 2101673, 2028298, 1747560, 2141682, 2147109, 2218845, 2062745, 2257122, 2206374, 2344194, 2153849, 2113003, 2333195, 2396802, 2598254, 2217326, 2352270, 2414153, 2407440, 2543200, 2475440, 2169480, 2431158, 2320749]
16881B320749L77078k34734K40343N385J35639m27987J51394J79023R705j38869
16871B617726J17032M01311j00571L2867K4908K8148j07610L04175J37894m20859
16861C035021P8768N7450j91022L59402J14444O5532n8221m1489R5275K16870
16851C732030L454l2210l23591K81217K9164j79930K71544P1408K69743r548J55632
16840D268913Q4474n2390N1648j02932L64600l4217j15145M91678l73422K27840
16830D811047L55598j24412k76230O44839N4208q5903K07382k90076N26545O285
16820E829283m0514k45031J95673K73959K15527J62614j23703K80933k4709J12641
16810F636673O2194J48801J82902J25026J51451n6165J39692K42104M5113J30350
$$ y = [2320749, 2697827, 2463093, 2703436, 2708821, 2844460, 2416473, 2567867, 2746890, 2756595, 2617726, 2734758, 3136069, 3035498, 3068365, 3093273, 3121421, 3013811, 3317986, 3455880, 3035021, 3113789, 3171239, 2980217, 3339619, 3454063, 3519595, 3461374, 3419885, 3515160, 3732030, 3735484, 3703274, 3379683, 3660900, 3690064, 3510134, 3781678, 3853086, 4122829, 4113281, 4268913, 4353387, 4300997, 4352645, 4249713, 4614313, 4580096, 4464951, 4956629, 4583207, 4811047, 5166645, 5042233, 4766003, 5410842, 5465050, 5379147, 5586529, 5296453, 5822998, 5829283, 5788769, 5543738, 5739411, 6013370, 6228897, 6391511, 6267808, 6548741, 6524032, 6636673, 6698867, 6847668, 7030570, 7155596, 7307047, 7250882, 7390574, 7632678, 7677791, 7808141]
16800G808141L00650L38861J00834j16092J87404K25574N19658K1132K15697K80719
16790I882578N3880K75588L39916J93410K03631N03575j13495L73290J58769M67635
16780A2338777J29536M28332L86266J8802O28164M20078K98866J55051R08331
16771A5712203m4335O48192L21010R05831O04658P5825O65603O39241O48971L87162
16761B0564361O92673R64039P61823L72376R76142L65802J119839Q88981Q45940
16752B7551976J019230P48980J520525Q30440J479446J496074N65649J565780
16744C6778100J425630J864152J275942J501197K254606J875037K225259J997525
16736E1197448J994253K309618K614798K478928K936050K752447L188365K971907
$$ y = [7808141, 8108791, 8447652, 8548486, 8432394, 8619798, 8845372, 9365030, 9386162, 9601859, 9882578, 9936458, 10212046, 10551962, 10745372, 10949003, 11452578, 11339083, 11712373, 11871142, 12338777, 12468313, 12896645, 13282911, 13301713, 13929877, 14349955, 14648821, 14803872, 15712203, 15667868, 16316060, 16637070, 17542901, 18147559, 18223384, 18888987, 19528228, 20177199, 20564361, 21257034, 22221073, 22982896, 23355272, 24331414, 24697216, 25817055, 26706036, 27551976, 28571206, 29320186, 30840711, 31671151, 33150597, 34646671, 35212320, 36778100, 38203730, 40067882, 41343824, 42845021, 45099627, 46974664, 49199923, 51197448, 53191701, 55501319, 58116117, 60595045, 63531095, 66283542, 69471907, 72443814]
16728G2443814L201309L847890L055310L978103M498801L587607M180832M337102
16720A03130768M196274M392492M390433M600948M269529M203519M266632L606793
16712A37057388L617519L508439K817724K610491K074534J033496R95192N29340
16704A54244123m96259j013499j285068k211080k156691l076124l439352l722986
16696A36843064l792758m132999m471273m375302m678623m420115m321070m462822
16688A02188102m033985m943004l725889l824492l873203l353231l551899l351453
16680G1530946l461737l297097k428354k891736k907736k521714k235839k356729
16672D9430004j888709k024895j885691j733162j652697j960295j482474j289712
$$ y = [72443814, 75645123, 79493013, 82548323, 86526426, 91025227, 94612834, 98793666, 103130768, 107327042, 111719534, 116109967, 120710915, 124980444, 129183963, 133450595, 137057388, 140674907, 144183346, 147001070, 149611561, 151686095, 152719591, 153714783, 154244123, 153747864, 152734365, 151449297, 149238217, 147081526, 144005402, 140566050, 136843064, 133050306, 128917307, 124446034, 120070732, 115392109, 110971994, 106650924, 102188102, 98154117, 93211113, 89485224, 85660732, 81787529, 78434298, 74882399, 71530946, 68069209, 64772112, 62343758, 59452022, 56544286, 54022572, 51786733, 49430004, 47541295, 45516400, 43630709, 41897547, 40244850, 38284555, 36802081, 35512369]
16664C5512369j480306j272221j400831r67519j339221p46365j396399o26157
16656B6283350r88224p57842p20216j088299q02856n02374m62938r51397o63690
16647A9345514o47630m37823o21865k73451q07793m85796n50471j92730m93364
16638A4834591o20870q05741L00200m79666m25866k89712l05766o88299J69011
16629A1687882l74073j57599k29104j82191o34479k70074j33392j784k10239m11705
16619I083242J0923j98742n10381Q2101j71900l52950l85327K72948m06773k16169
16609G206972K24529n23488o2208j46667M564l521p51851M60843m82405K01626
16599F128394l25791P4189r8471l16152J5790R5185l57788j02711r7459j55880
$$ y = [35512369, 34032063, 32759842, 31359011, 30391492, 29052271, 28305906, 26909507, 26283350, 25295126, 24537284, 23817068, 22728769, 21925913, 21423539, 20960601, 20009204, 19345514, 18697884, 18260061, 17638196, 17364745, 16556952, 16071156, 15520685, 15327955, 14834591, 14213721, 13407980, 13708180, 13228514, 12802648, 12512936, 12207170, 11518871, 11687882, 11313809, 11156210, 10927106, 10744915, 10110436, 9840362, 9706970, 9705186, 9494947, 9083242, 9094165, 8895423, 8385042, 8467143, 8295243, 7942293, 7556966, 7829914, 7423141, 7206972, 7431501, 6908013, 6845805, 6699138, 6703702, 6700181, 5948330, 6409173, 5926768, 6128394, 5802603, 5876792, 5778321, 5462169, 5477959, 5573144, 5215356, 5112645, 5015186, 4859306]
16589D859306L08813j97359m15936k18257L09819M6323l68058k19151J42236j3781
16579D233955o7394k21772K79977k38848j32169q7230K40511l68809j19810J57354
16569C675765n45036K26914K56956k28189K24692j32940j84029j69329K8214o1268
16559C091750l8103J57253k84992L44943m36240K11072j12288l73394J7217K00882
16549B778100j99018K45j01764J11814J8181m0103J70574m12734J91823J35069
16539B652187k50198p582J6099r9965M764l79575L88010j9431l22988J97089k52491
16528A925919M09903l47966J91057m077l57172L6705K65180m8328K39197o29762
16518A680656M55013m12377q261J83950L46137p25120P5991j20358K54585j36067
$$ y = [4859306, 5168119, 4970760, 4554824, 4336567, 4646386, 4692709, 4324651, 4105500, 4247736, 4233955, 4166561, 3944789, 4224766, 3985918, 3853749, 3766519, 4007030, 3638221, 3518411, 3675765, 3130729, 3357643, 3614599, 3386410, 3611102, 3478162, 3294133, 3124804, 3153018, 3091750, 3053647, 3210900, 2925908, 3270851, 2834611, 3045683, 2933395, 2560001, 2577218, 2778100, 2579082, 2579327, 2477563, 2589377, 2607558, 2567455, 2738029, 2325295, 2517118, 2652187, 2401989, 2394407, 2410506, 2310541, 2315305, 1935730, 2323740, 2304309, 1981321, 2178410, 1925919, 2335822, 1987856, 2178913, 2174836, 1817664, 1854369, 2119549, 2071221, 2310418, 1680656, 2135669, 1723292, 1715031, 1898981, 2245118, 1519998, 1595989, 1475631, 1730216, 1594149]
16508A594149J51596K30663l65687L7371L2318n8760l54496n7982J61333J17934
16498A488439j00844J08342Q6091J32287j29614K45379k81259j13064k50032K65165
16488A450890k0979j65087L2172l034J68655j26281r5722K43117j80042k0492
16478A283197j05722o2480K46411l21666q0835K56844k58544K13893j08348O6870
16468A129620j37827J78437j06283M8474m11617M38471J33858M6460j99128K08932
16458A329397m12500o854J40819k42254J88341J20744Q9514l85377Q9634j33409
16448G78055L06384k92527N48550n96482K60974m6337K5851j57799j3204K43819
16438A057284l32365q879M22010p3107k31305j77603L17510l7437k09398L2847
$$ y = [1594149, 1745745, 1976408, 1610721, 1648092, 1680410, 1621650, 1267154, 1209172, 1370505, 1488439, 1387595, 1495937, 1582028, 1714315, 1584701, 1830080, 1548821, 1435757, 1185725, 1450890, 1429911, 1264824, 1296996, 1293962, 1462617, 1336336, 1240614, 1483731, 1303689, 1283197, 1177475, 1114995, 1361406, 1039740, 958905, 1215749, 957205, 1171098, 1062750, 1129620, 991793, 1170230, 1063947, 1112421, 700804, 1139275, 1273133, 1319593, 1120465, 1329397, 916897, 910043, 1050862, 808608, 996949, 1117693, 1207207, 821830, 911464, 778055, 1084439, 791912, 1340462, 743980, 1004954, 958617, 984468, 826669, 813465, 1057284, 724919, 716040, 1138050, 1064943, 833638, 656035, 973545, 936108, 726710, 759557]
16428G59557k5869J00899J06143j35985O6021q6104P4435k69134k4275K14037
16418G79725Q479J35826j2611k35632K31769k64070J23210O7268m00839J49490
16408E82615k51175L90854J21595K9697l36475n8003K33210j37480L162M22462
16398A000462C49021L51891C24097M1450M63319m02648N69750k28184k47170J50421
16388F71035J41229C85347K30326O4643C28612K85878B67096L91943j1047J39789
16378G87781O7854l71068K72722C12705K36926j48396J77053j55337K72535l26791
16368C68695M57900k42377L23370m32691J16744L8924o0396J48422B95793O1877
16358C57670L04846J9043k01254K68240A83511L01415n4110Q1372j73532J41274
$$ y = [759557, 733688, 834587, 940730, 804745, 870766, 784662, 859097, 589963, 565688, 779725, 788204, 924030, 911419, 675787, 907556, 643486, 766696, 833964, 433125, 582615, 331440, 722294, 843889, 873586, 537111, 479108, 712318, 574838, 578000, 1000462, 349021, 700912, 324097, 365547, 828866, 426218, 995968, 767784, 520614, 671035, 812264, 385347, 615673, 680316, 328612, 614490, 267096, 659039, 647992, 787781, 855635, 484567, 757289, 312705, 549631, 401235, 578288, 422951, 695486, 368695, 826595, 584218, 907588, 474897, 591641, 630565, 570169, 718591, 295793, 357670, 662516, 681559, 480305, 748545, 183511, 484926, 430816, 512188, 338656, 479930]
16348D79930P7573K7815J21713C48182A23601K43898J69242k06965J5551Q2900
16338D28227j57023K84739m5553K48542k38220H5303K33194A42424M1169J73445
16328C57038J0644Q0602m4266K20333J00187j88689j08099n2618M32441l75866
16318D31707j47631K86305K30232A14997O5771K53584m8794j47786J45026K9916
16308D12714N1628J62074k30836J2573K19709B41998J26646n6702j08213N5228
16298B58957A1570L42308p3396L18028j14860N4853A04975K48225A37071e8581
16287A74708J91032r6678m5865N071J5517H1088L80671A17689N48000B99116K9739
16276C28855A61200P8987a5934C00077J00595J57243k52469N7691j6937r3755
$$ y = [479930, 557503, 585318, 707031, 348182, 123601, 367499, 536741, 329776, 345327, 428227, 271204, 555943, 510390, 758932, 520712, 85303, 318497, 142424, 183593, 357038, 367682, 448284, 404018, 624351, 724538, 535849, 427750, 375132, 807573, 431707, 284076, 570381, 800613, 114997, 180768, 434352, 385558, 237772, 382798, 412714, 464342, 626416, 395580, 408153, 627862, 241998, 368644, 311942, 203729, 258957, 11570, 353878, 280482, 598510, 483650, 538503, 104975, 353200, 137071, -58581, 174708, 365740, 269062, 223197, 228268, 243785, 81088, 461759, 117689, 665689, 299116, 328855, 161200, 240187, -15934, 300077, 400672, 557915, 305446, 363137, 346200, 252445]
16266B52445N1262A17727J92998J2314r4401r4575b0825B15263J35582K7886n067
16255C73664B2699J37024K8573J31095q0341r2052J59486r4909A04690K15433
16245C20123r7122M28393A86339k2291L55796k54394P2196H1031j6419J56669
16235B21281A00691J09809L39747A75009o239k4044C4279b7368A24132K18273
16225C42405j08045l3422M9201F1060i5712E60616A84167J44514A03320N9311
16215A62631n0522a18115A42620K62824A28048R3098p4091f735B74924A5257R2120
16204A07377l4512J48799o0050b19624J07541l3435C16389j5550o068P5426R5922
16193D66119j38246A14476J84290d4225C59779E8406L77440k17448B5836L16242
$$ y = [252445, 303707, 117727, 310725, 323039, 228638, 134063, -20825, 215263, 350845, 378731, 373664, 22699, 159723, 188296, 319391, 239050, 146998, 306484, 211575, 104690, 320123, 223001, 651394, 186339, 164048, 519844, 265450, 337646, 81031, 64612, 221281, 100691, 210500, 550247, 175009, 168770, 144726, 34279, -27368, 124132, 342405, 234360, 200938, 250139, 61060, -95712, 560616, 184167, 328681, 103320, 162631, 112109, -118115, 142620, 405444, 128048, 221146, 147055, -6735, 274924, 15257, 107377, 72865, 221664, 161614, -219624, -112083, -145518, 316389, 300839, 294771, 370197, 466119, 327873, 114476, 298766, -44225, 359779, 58406, 435846, 218398, 25836, 342078]
16183C42078A07516D7861d2455A01390p738g1721B70640L9148j37632D9981P1644
16172A21625K08799A02424a93438A57060K82044G9343J24089J58849I012J87115
16162A96127H2646P3181k5258a62352e4346I1699J00215G1045p843J89210n4979
16151A97433E624L52913k2226A41411J25237E7305N6322J74993l8048m7148i3904
16139C7053f8139c0746A56118N3586b4790j45083A30066J44069j31077a01933
16128I9929b16225B56481B5255a54112A54054a75894C70821j43254M8304P5693
16118C51564j56689I4887L20951A95989k3178M5657a46840o4665B0595a53640
16107C08145a29334j09656H9821j6624M0510R0776a09854A55938l6023n5890a71239
$$ y = [342078, 107516, 47861, -42455, 101390, 93652, -71721, 270640, 309788, 172156, 49981, 121625, 330424, 102424, -193438, 157060, 439104, 79343, 203432, 362281, 9012, 196127, 82646, 155827, 130569, -162352, -54346, 91699, 191914, 71045, 63202, 252412, 197433, 5624, 358537, 336311, 141411, 266648, 57305, 113627, 288620, 250572, 203424, -93904, 37053, -68139, -30746, 156118, 209704, -24790, -169873, 130066, 274135, 143058, -101933, 99929, -216225, 256481, 25255, -154112, 154054, -175894, 370821, 227567, 275871, 351564, 194875, 94887, 415838, 195989, 172811, 218468, -146840, -211505, 20595, -153640, 308145, -129334, -238990, 89821, 73197, 113707, 204483, -109854, 155938, 119915, 64025, -171239]
16095c8619p5592L8154A97783c4599B20089h5184A27077E9148g6187A65971C5351
16083e2269j15220H61b10390G5927h7790E3459J99646k494m6258F4351b75181
16071A75153c0259I88J28870a32389j1698F2845b66023A72845N781m7110a7707
16059A48762K5209P2602b24168B51482I7178J50958C2512d2209B05521B8152b02130
16047E4605a3990j1798C2693K81860a62073B19835r6643a99656e9116E3984b8457
16035c6367j0911A05563b08168A60103J2359R4067F6311a1303A05040a2744C84646
16023D3870J09977e219j67899a4022C63355j61915f7174A21528J49789d05353
16012C93910D597a69764B09144b1979A5571J96015K50590C9397J40497a07326
$$ y = [-38619, -114211, -76057, 197783, -34599, 220089, -85184, 127077, 59148, -76187, 165971, 35351, -52269, -167489, 861, -210390, 75927, -87790, 53459, 253105, 250611, 204353, 64351, -275181, 175153, -30259, 988, 129858, -132389, -144087, 62845, -266023, 172845, 178626, 131516, -17707, 148762, 173971, 246573, -224168, 251482, 97178, 248136, 32512, -42209, 205521, 28152, -202130, 54605, -13990, -25788, 32693, 314553, -162073, 219835, 123192, -199656, -59116, 53984, -28457, -36367, -47278, 105563, -208168, 160103, 172462, 266529, 66311, -11303, 105040, -12744, 384646, 43870, 153847, -5219, -173118, -14022, 363355, 201440, -67174, 121528, 271317, -405353, 393910, 4597, -169764, 209144, -21979, 15571, 211586, 462176, 39397, 179894, -107326]
16001b79020B3008N5161e9973E9483a81515B08090H6586c73569A01276a86206
15990a88371F3159J14247c3494r2459G49K60927A5963c69588B46109a9423I1816
15978A21525N5806J08984a1331A49480m2853K65868r2299J18418K53136j56953
15968D94797K59914l23997K29383k88756n0788A37505g8212E8688O6001C6193
15957b01148C64262g3837b9159A03778a26106q06i270B31265C685Q6029e02294
15945d3114C41399D1894j2143J0455D931a80550P3014L4105H617a07398G1079
15933e67344i4533k12980B92120G8768f1587j88515O5600j47704d0385A04855
15922a86193j41018C14434e9819b7502F6960b21918R103k47475B2943J0826G831
$$ y = [-279020, 23008, 78169, -59973, 59483, -181515, 208090, 86586, -373569, 101276, -186206, -188371, 63159, 177406, -33494, -125953, 749, 261676, 15963, -369588, 246109, -19423, 91816, 121525, 177331, 286315, -11331, 149480, 106627, 372495, 280196, 398614, 651750, 494797, 754711, 430714, 660097, 371341, 320553, 137505, -78212, 58688, 124689, 36193, -201148, 364262, -73837, -29159, 103778, -126106, -126912, -9270, 231265, 3685, 89714, -502294, -43114, 341399, 41894, 29751, 40206, 4931, -180550, -107536, -73431, 8617, -107398, 71079, -567344, -94533, -307513, 292120, 78768, -61587, -250102, -184502, -332206, -40385, 104855, -186193, -327211, 314434, -59819, -27502, 66960, -221918, -212815, -460290, 22943, 33769, 7831]
15910g4788A71307d6275H5411i5238q0922I2319Q4191d3585A33110n2413a62604
15898A71732h9315l44593A9845e1971o657A03723a9972j21346k73158a48761k2770
15887a71531h2036j87608A0488J01148N272a02248n9414N6746N0138o8177b0341
15875c81474d4378j01835D8907J78598G5258c65133B2163A0860f4225j82358j34273
15864c80856B8271a5722A31563o5540d47267c7649I0574g0792k27k05874f0425
15852H8468Q4367D9319b26953f0682A8264a6366n7719r614e196A22110R7397a23474
15839a61829O3599M5544C57447b77289H3320b00521B1510L1818J18102N6201J8403
15828B46034f5104K9168j9991A22132b00119d7673A41144a61692C33585I727a13690
$$ y = [-74788, 171307, -46275, 85411, -95238, -176160, 92319, 176510, -43585, 133110, 80697, -162604, 171732, -89315, -433908, 19845, -51971, -58628, 103723, -19972, -141318, -414476, -148761, -171531, -82036, -269644, 10488, 111636, 116908, -102248, -161662, -104916, -54778, -122955, -20341, -381474, -44378, -146213, 48907, 227505, 75258, -365133, 22163, 10860, -64225, -246583, -380856, 28271, -15722, 131563, 66023, -447267, -37649, 90574, -70792, -71019, -276893, -60425, 88468, 172835, 49319, -226953, -60682, 18264, -16366, -74085, -83699, -5196, 122110, 219507, -123474, -161829, -98230, -52686, 357447, -277289, 83320, -200521, 21510, 53328, 171430, 227631, 246034, -65104, -35936, -55927, 122132, -200119, -47673, 141144, -161692, 333585, 9727, -113690]
15816a16188B0222M1183M4859l6765c68506B45898E1018a13226B3571g0098E9703
15804c19979i2938D8218J31924G761d61832i3605E0318c90833P5360A6629M21337
15793D37966B2532a58617F8763J26447A0770R5366m8744R6888c47154C2539a21452
15781A60004f9591I3317L7293M4716m4862B2916J45549l1809F5804f8332l31156
15770c99488A51809b4710A0247N6308a32392A05804J30729e1643k11910i8756
15759a16735b3146j04601C03207c2001j19907F6542J89647j27589a14654A41830
15748B7554a03793C6191b0944q8636B55184j15653A099a7120A41275h0457I4186
15736E5637j7012K23535A29500h3373j01438P2603A36505n7918d7908H8983J07059
$$ y = [-116188, 20222, 61405, 106264, 69499, -368506, 245898, 51018, -113226, 23571, -70098, 59703, -319979, -92938, 48218, 180142, 7761, -461832, -93605, 50318, -390833, -315473, 16629, 437966, 22532, -158617, 68763, 195210, 10770, 106136, 57392, 154280, -347154, 32539, -121452, 160004, -69591, 93317, 130610, 175326, 130464, 22916, 168465, 136656, 65804, -68332, -399488, 151809, -24710, 10247, 66555, -132392, 105804, 236533, -51643, -263553, -98756, -116735, -23146, -127747, 303207, -32001, -151908, 66542, 256189, 128600, -114654, 141830, 27554, -103793, 36191, -20944, -109580, 255184, 139531, 1099, -17120, 141275, -80457, 94186, 55637, 38625, 262160, 129500, -83373, -184811, -112208, 136505, 78587, -47908, 88983, 196042]
15725A96042q5073g5502j05935Q5233q0924a040p2234k99373a56112K9339j21969
15714b48742A4609d6034j9559B6347d8549A76485a60656C3164a5857B44299j07409
15703A36890j3534a72760l4016F4832a21696e4223A92816a59260f8673j37460
15693b06133A97158E8095b05374e8182H1991a36389D3276j0426O8429J48147b17758
15681c78942B49321b13068C37155I3002M24738e513n5077k5868D14828A40568
15670c64340C9035J14586b6668H3315J32887G555a7777H5693c15242F2546a18913
15658a00861D3134b45256d2574j21322C45719G2671K0773c67045a76927M3557
15648a33370L509p6038Q931A40752L3983a65772F7771i7623j44649L9747m851
$$ y = [196042, 110969, -75502, -181437, -96204, -177128, -1040, -73274, -372647, -156112, -126773, -248742, 14609, -46034, -65593, 26347, -48549, 176485, -160656, 33164, -15857, 244299, 136890, 123356, -172760, -206776, 64832, -121696, -54223, 192816, -159260, -68673, -206133, 197158, 58095, -205374, -58182, 81991, -136389, 43276, 32850, 101279, 249426, -217758, -378942, 249321, -213068, 337155, 93002, 517740, -5513, -60590, -86458, 414828, 140568, -364340, 39035, 153621, -26668, 83315, 216202, 7555, -17777, 85693, -315242, 62546, -118913, -100861, 43134, -245256, -42574, -163896, 345719, 72671, 93444, -367045, -176927, -133370, -129861, -205899, -196968, 140752, 174735, -165772, 67771, -97623, -242272, -202525, -207376]
15637b07376R9285j32047N462N6962Q0988A13033b413A62361R4863e0081D4024
15625a21478B7472e1554m3309a5257E1219i9119B7293L7214J15717a89435R1280
15614i8155K901a4772B78097F7573B5450b05610K4013A85026a50911j66501f4970
15602c4150k70791E0424a08872E9288b89129H2763e1443C6444a52163O0166A33202
15590a0316q8373B78991b05293A32008B8477K1188a98884K6511M7236J2081j27543
15579b40599c8313A6028g3304j37524j26842A83380f2684l41964f1474j38036
15569a99510E3817b26473D836a96318D3963a65617O4436b3989A37994N6765c32068
15557A29778i2201f345B54623b91083B17423p2571b00679h3615L215b8880A12378
$$ y = [-207376, -108091, -240138, -234676, -177714, -96726, 113033, -2413, 162361, 257224, -50081, 44024, -121478, 27472, -51554, -94863, -15257, 51219, -99119, 27293, 64507, 180224, -189435, -98155, -95254, -14772, 278097, 67573, 25450, -205610, -181597, 185026, -150911, -317412, -64970, -34150, -304941, 50424, -108872, 59288, -289129, 82763, -51443, 36444, -152163, -91997, 133202, -10316, -98689, 278991, -205293, 132008, 28477, 49665, -198884, -172373, -125137, -113056, -240599, -38313, 16028, -73304, -210828, -337670, 183380, -62684, -404648, -61474, -199510, 53817, -226473, 4836, -196318, 43963, -165617, -101181, -23989, 137994, 194759, -332068, 129778, -92201, -6345, 254623, -291083, 217423, 144852, -200679, -83615, -80400, -28880, 112378]
15545h8438b7525k05183A72001P324a92952j48384A58216M2549i9690H8516J80294
15534B68810C4115e5286J2364j63240B27356f1096p7195l9896r4151B59025b08
15522c06546R2262A12165J15428D2796a2914k5896B47306D0262J48840C214J62129
15511A65343Q4398O88j13300c2004C91676a18932B14206P8028e6187j15746J7445
15500a54488D15314j31022C7945e711A8095J29869n0675h2077A81822h0191D79
15488I8072c9615D65108B9859b2073A12226Q6776L51614D0009h1488C64433j51690
15477B12743F4304K55608E0335K33875P570A29434i2204L2772C46493a75646D7232
15465A34536b82644e8465B68975A18212n7548O1794l0275M3930J10535J43604
$$ y = [-88438, -27525, -232708, 172001, 179325, -192952, -341336, 158216, 200765, -99690, 88516, 268810, 34115, -55286, -42922, -206162, 227356, -61096, -138291, -178187, -272338, 259025, -208, -306546, -214284, 112165, 227593, 42796, -12914, -38810, 247306, 40262, 189102, 3214, 165343, 249741, 250429, 137129, -32004, 391676, -118932, 214206, 292234, -56187, -171933, -154488, 415314, 284292, 37945, -5711, 18095, 147964, 97289, -82077, 181822, -80191, 479, 98072, -39615, 465108, 29859, -22073, 112226, 199002, 550616, 40009, -81488, 364433, 212743, 64304, 319912, 50335, 284210, 291780, 129434, -92204, -59432, 346493, -175646, 47232, 134536, -282644, -58465, 268975, 118212, 60664, 122458, 92183, 136113, 246648, 390252]
15455C90252j62396m5092O9577A0328L9067b58588I0751j7897b60532C2977a07342
15443A65396J01469a765j42822B63495I4726L6747K22763B4746K66373C0891J4751
15432D5642J40423n8657K77907A77268K76412M1875j35724J71991J66215j68049
15422E29988l6833J74100a54069D15963B7606J90871a05077C22189j56135J2266
15412A78320G0055M0203i4210C80589B1374i1090A5926a95837C92R5479b22428
15400b08607A43199b22121P0154A4912a78818N2085C14014b43751A3736Q239b22904
15388A40105F7543g3248H9176C0048L55510n0797b7600B56129a07782j61416b3106
15376a89769b2215A97519J0398I0087d7425A89240B4262N1442J14734P1560H252
$$ y = [390252, 227856, 182764, 252341, 10328, 49395, -258588, 90751, 72854, -260532, 32977, -107342, 165396, 266865, -1765, -144587, 263495, 94726, 131473, 354236, 24746, 291119, 30891, 45642, 186065, 127408, 405315, 177268, 453680, 495555, 359831, 531822, 698037, 529988, 493155, 667255, -154069, 415963, 27606, 218477, -105077, 322189, 166054, 178320, 70055, 110258, -94210, 380589, 21374, -91090, 15926, -195837, 392, 95871, -222428, -208607, 143199, -222121, -151967, 14912, -178818, -126733, 314014, -243751, 13736, 21975, -222904, 140105, 67543, -73248, 89176, 30048, 385558, 334761, -27600, 256129, -107782, -269198, -23106, -189769, -22215, 197519, 207917, 90087, -47425, 189240, 24262, 75704, 190438, 261998, 8252]
15364F9733J85941A11487C0214b10323A9372L8325P6981q959J75733b6262l2759
15353e9021Q309D7183J9299J44072G0325K49908k5269B9609L8798L4425Q5347
15342A88179H3088N4158J84152F4185M0150L42165A07876A1192a16238c4233B45920
15330A94411M44067E8546J28469R7031j17283J26043J19157A192J94817J12165
15320C08174L46499B22177p8762O3841l2635H1524K8903J99155j34033i1232I2063
15308C10251a35029A82797O9602A836e6714B19184L700G2002J43402C7051P4511
15297A11562d4114H3010K92918G6073A6029M6258L7615C7983b98797B7011e4158
15285A30371k3087L44332d1738A42511a75754C33285j39273O6838F3047f1733
$$ y = [69733, 255674, 111487, 30214, -210323, 19372, 57697, 134678, 125719, 301452, -26262, -59021, -50712, 47183, 66482, 210554, 70325, 320233, 294964, 29609, 68407, 102832, 188179, 83088, 137246, 321398, 64185, 104335, 446500, 107876, 11192, -116238, -34233, 245920, 194411, 638478, 58546, 187015, 284046, 166763, 292806, 411963, 1192, 196009, 308174, 654673, 222177, 143415, 207256, 174621, 81524, 110427, 309582, 175549, -91232, 92063, 310251, -135029, 182797, 252399, 1836, -56714, 219184, 222884, 72002, 215404, 37051, 111562, -44114, 83010, 375928, 76073, 16029, 62287, 99902, 37983, -298797, 27011, -54158, 130371, 107284, 451616, -41738, 142511, -175754, 333285, 194012, 260850, 63047, -61733]
15274I6179K80874C2692N9207k2268a0845A69365b86254f8437q5007q6831k12835
15263d53110J74622A75528K5178c13131A29543b60147A73369J52898C1568J50411
15253A81979b6766B08475m8985i4640M6175C97976A08206N588a6348I2139h1671
15241A07365B2879R0313Q4737E9723J28638a2894A67637J4374P4878J79869j16597
15230C20161K40292L47713L51075L907k50103M91817F49811j45368q2325I0106
15219c4426E1310R1578b91060C09969I5705a32935n1618i179B60047a4940C36779
15207A6102f4576C29037H5628J68945G3940f5093c432m7455j73202B0514a79862
15195C24173G1657A9174J89036E1485k0428J95080g8267B62158o5289Q8584a42033
$$ y = [96179, 377053, 32692, 91899, 69631, -10845, 169365, -286254, -68437, -153444, -240275, -453110, -278488, 175528, 200706, -313131, 129543, -260147, 173369, 326267, 31568, 181979, -26766, 208475, 159490, -94640, -48465, 397976, 108206, 113794, -16348, 92139, -81671, 107365, 22879, 113192, 197929, 59723, 188361, -12894, 167637, 182011, 256889, 436758, 320161, 560453, 908166, 1259241, 1263148, 1013045, 1504862, 649811, 504443, 422118, 90106, -34426, 51310, 142888, -291060, 309969, 95705, -132935, -184553, -9179, 260047, -14940, 336779, 16102, -64576, 329037, 85628, 254573, 73940, -65093, -3432, -50887, -224089, 20514, -179862, 324173, 71657, 19174, 208210, 51485, 31057, 226137, -78267, 262158, 196869, 285453, -142033]
15183I7860b70001A60684N609C9980L76299a71473D191J10043h144A25875J16243
15172B42118G5194c4201J0043A85485k1728H998L11225F7021Q6993K20966h6600
15160C30297a48681q4557a1695j15063d8425B46357p6743a1351o6135J5204B55189
15148b8712A98290N3533l1827F026e7406b7530C44758G9120K75093E0781K08331
15137B59112i1871B41713J896F3154a64559c2664A21307f2295K5974j43141B75812
15125A25345P2604m0899p5760a1913k07491C45807C7731a52478C40941a71712
15114f8218C8118d01640C1329J73254L5074A04922L68567A99795J75783A46861
15103C20400i0119E20343B49715n3438a18628e5358A34211L3093a07720D9831
$$ y = [97860, -270001, 160684, 166293, 39980, 416279, -171473, 4191, 114234, -8144, 125875, 242118, 75194, -34201, -24158, 185485, 163757, 8998, 320223, 67021, 154014, 374980, -86600, 330297, -148681, -233238, -11695, -126758, -48425, 246357, 169614, -11351, -77486, -62282, 255189, -28712, 198290, 251823, 219996, 6026, -57406, -27530, 344758, 79120, 354213, 50781, 259112, -91871, 241713, 243609, 63154, -164559, -32664, 121307, -62295, -36321, -179462, 275812, 125345, 197949, 157050, 81290, -11913, -219404, 345807, 37731, -152478, 340941, -171712, -68218, 38118, -401640, 31329, 204583, 239657, 104922, 473489, 199795, 375578, 146861, 320400, -90119, 520343, 249715, 196277, -118628, -55358, 134211, 167304, -107720, 49831]
15092C09955C0067K52540a53463I5155M6263O0978p1726L1197D3909M00425b3971
15080b324A86193k4945J54837j41292Q4030j01192a50854b0887D18207e9719B48680
15068c5668j05158G028J52731J5119J16810j29663O0160l1796k9522b8989B54052
15056D22198k07239n3837B8961N2030P78N3623K57613a28991C15096a50641C66358
15044C08107p0584o8926J46542N5119P8765j27358A60080c0132C55484j45614
15034B09870J94055p2516N2637J25841q7002K6831P6634j88077A12920k1050M10240
15023E02110B5946K49618J18994J40708j88664J44147k20189K21961J16105B64280
15012E06510a6945E13347J98453k34436j22720K5269L8604K333L21624j52509
$$ y = [309955, 30067, 282607, -153463, 95155, 141418, 202396, 130670, 161867, 43909, 444334, -23971, -2324, 186193, 161248, 316085, 174793, 258823, 157631, -150854, -20887, 418207, -59719, 248680, -35668, -140826, 7028, 159759, 174878, 291688, 162025, 222185, 190389, 160867, -28989, 254052, 422198, 214959, 161122, 28961, 80991, 81769, 135392, 393005, -128991, 315096, -150641, 366358, 308107, 237523, 168597, 315139, 370258, 449023, 321665, 160080, -30132, 355484, 209870, 403925, 331409, 384046, 509887, 422885, 449716, 526350, 338273, 112920, 91870, 502110, 25946, 275564, 394558, 535266, 346602, 490749, 270560, 492521, 608626, 264280, 506510, -16945, 513347, 711800, 477364, 354644, 379913, 418517, 420850, 742474, 589965]
15002E89965j53846J11845m6679j12645j15515Q7334l8033L79522A09532J90547
14992C00079M77719C75450m6226k2880J86930j29352A79476J98663K26562k56051
14982C48650K52807B59947J37413m928k5164J48403A23884K00905P8299q6984
14972C16104J50690M9587A94840N15140j82459K81306B28227P06515k02803J95206
14962I27145j01579l03574A76900K37547j74272M19455p1218R8601k66775Q9363
14952E09601j43663J05666j46704J20405j91509J06640k0202p459n5809K58100
14942E35066A80679H6245K71211m467J68908k05843n9045K88752B18617j5862
14932B02755O6106N23805C37490L47901l24442r2981M31983C21460K94805K15311
$$ y = [589965, 436119, 547964, 501285, 388640, 273125, 360459, 322426, 701948, 109532, 300079, 777798, 375450, 329224, 306344, 493274, 363922, 179476, 378139, 604701, 348650, 601457, 259947, 397360, 392432, 367268, 515671, 123884, 324789, 403088, 316104, 466794, 516381, 194840, 709980, 527521, 808827, 228227, 934742, 731939, 927145, 825566, 521992, 176900, 414447, 240175, 659630, 588412, 687013, 420238, 509601, 365938, 471604, 324900, 445305, 253796, 360436, 340234, 332775, 276966, 535066, 180679, 86245, 357456, 352989, 521897, 316054, 257009, 545761, 218617, 202755, 268861, 792666, 337490, 685391, 360949, 267968, 699951, 321460, 616265, 831576]
14922H31576C39650J77140j48793K41048j8286K81202j67783j15123J61765L04019
14912A054839O7452j66630K91903j52526L56016j87511M98785o20336L08335J95937
14902A646264m35174J55348J14400K57567j99445Q9938n11468J18416j84355m48161
14892F03330J91010k20057J53680l51468N8600J44825B53778J12865N9101J29870
14882E55614j88651J36531o7579P3409J19237B57173K5988M16831q9170B47632
14871D65595p3595J43014k42542K67613J14572J17889K3833k61423O2162L09910
14861I27028l91591J7486K26464J57543D61495L16965j02828j38110l3249N4012
14851E58285M2709j43300r3590L41345k1950k74116M71791l21386j86673M14150
$$ y = [831576, 339650, 516790, 367997, 609045, 590759, 871961, 704178, 589055, 750820, 1054839, 1122291, 955661, 1247564, 1095038, 1451054, 1263543, 1762328, 1141992, 1450327, 1646264, 1211090, 1366438, 1480838, 1738405, 1538960, 1628898, 1117430, 1235846, 1051491, 603330, 794340, 574283, 727963, 376495, 435095, 579920, 253778, 366643, 425744, 555614, 366963, 503494, 435915, 509324, 628561, 257173, 283161, 699992, 610822, 247632, 465595, 392000, 535014, 292472, 560085, 674657, 792546, 816379, 554956, 617118, 927028, 535437, 552923, 779387, 936930, 461495, 778460, 675632, 537522, 504273, 558285, 600994, 457694, 364104, 705449, 683499, 409383, 881174, 559788, 373115, 787265]
14841G87265C78325o9580L99011k25449j42833K84511k29291N2749L70713K3159
14831H41315B38661K02154R7797L26906k86858J02563L8505J89572k190J31887
14821A038997k85642M57347l22433Q3787K3170k26403Q9513m8359K0887N8125
14811H88989l77713P3678M86935k37647o314q5735q0130J20215m6731K5767r875
14800G51439j24829Q3816J14619J95677j36348n2223m5537k62362B38156M90315
14790G28471N4547j09977k3502K38850k35110J45278j35012P233m4735L8370k52013
14779D12400J31339K07876k00392n5121L2754L63486l82816K59372B71030N06268
14769G77298j32373j27862K40319l23354L58763j55795M56145D35526M88816j92512
$$ y = [787265, 378325, 308745, 707756, 482307, 339474, 623985, 394694, 447443, 818156, 841315, 238661, 440815, 538612, 865518, 578660, 681223, 719728, 909300, 907110, 1038997, 753355, 1210702, 888269, 972056, 995226, 768823, 858336, 809977, 830864, 888989, 511276, 584954, 1071889, 834242, 827928, 742193, 662063, 782278, 735547, 761314, 751439, 626610, 710426, 825045, 1020722, 884374, 832151, 786614, 524252, 238156, 728471, 783018, 673041, 649539, 888389, 653279, 798557, 663545, 670778, 626043, 664413, 412400, 543739, 751615, 551223, 496102, 528856, 892342, 509526, 768898, 271030, 777298, 644925, 517063, 757382, 434028, 792791, 636996, 1093141, 435526, 924342, 731830]
14759G31830k06512K46777K55677l12382K44444Q4691j04988j72408K1789j67995
14749F20923k03960L54419k03990L82785k08056j57915N0887J11670L01559j27719
14739I20603k78249J65007P8702r0728R9931j45923j03493M5385O343j78805K16148
14728G34921j65228J89785L3734J95841k68241K18589P7758q0804J98511j93178
14718I41688j75335k4518L91859q2902K11P0545J13357L89559l63775L98477J94247
14707A853413n98308K19555l32495p0196K65166j49812j72114m1927J72536J9500
14697A165318L7905l82163J32326j0445J51074J9555l54000N62331m07166J69967
14687A084702K40522J61150p9989k1236L78109j69044o924j74275j71045k58778
$$ y = [731830, 525318, 772095, 1027772, 715390, 959834, 1044525, 939537, 767129, 788918, 620923, 416963, 771382, 567392, 950177, 742121, 584206, 635093, 746763, 1048322, 920603, 642354, 807361, 886063, 795335, 895266, 749343, 645850, 691235, 697578, 518773, 734921, 569693, 759478, 793212, 989053, 720812, 939401, 1017159, 936355, 1134866, 941688, 766353, 741835, 1133694, 1050792, 1051003, 1121548, 1234905, 1624464, 1260689, 1659166, 1853413, 1255105, 1474660, 1142165, 1071969, 1337135, 1187323, 1015209, 973282, 1145818, 1165318, 1203223, 821060, 953386, 942941, 1094015, 1113570, 759570, 1321901, 914735, 1084702, 1325224, 1486374, 1406385, 1385149, 1763258, 1594214, 1587290, 1413015, 1241970, 983192]
14677I83192j7434J91787j2144J0460m04521K44261K64652j55459l69336M59061
14667A194519q0241j13842L442O7795K06624J00225k26845r0110O0285p6528R5417
14656A140741p545K36113o64262L69079n3221p3139j33566K64254J31034N3657
14646A263145L9087q3602j36813J17304q7471m8441O34075n42465r9395K77363
14636A332787j07333J07729J3087l6472K17408J03801k85020j35948R9752K42400
14626A552191m7152l44401O0340j62357M53314m24330R8981O28280n53990L6137
14616A297013J75728k90838N4200K30777o6567O5412K2386k29395J41333J73213
14606A573262J1407k9963j21134J31489m4491L457j64584M00531r3782p3072j32566
$$ y = [983192, 965758, 1157545, 1145401, 1155861, 751340, 995601, 1260253, 1104794, 735458, 1194519, 1114278, 1000436, 1003878, 1071673, 1278297, 1378522, 1151677, 1061567, 1121852, 1045324, 1140741, 1133196, 1369309, 705047, 1074126, 1020905, 947766, 814200, 1078454, 1209488, 1263145, 1302232, 1218630, 1081817, 1199121, 1111650, 1063209, 1697284, 1154819, 1055424, 1332787, 1225454, 1333183, 1346270, 1309798, 1527206, 1631007, 1345987, 1210039, 1309791, 1552191, 1505039, 1160638, 1220978, 1058621, 1511935, 1087605, 1186586, 1814866, 1260876, 1297013, 1472741, 1181903, 1236103, 1466880, 1400313, 1465725, 1488111, 1258716, 1400049, 1573262, 1584669, 1554706, 1433572, 1565061, 1520570, 1524027, 1359443, 1759974, 1666192, 1593120, 1460554]
14595A460554K39254K0602J5251j9677J41341m08566M34639P3708m92797N81118
14585B045427m33721L47009L2916n49699J65492N60621m11133K18590j59828J88767
14575B004441k20572J55338q8643J91178j94283j73607M87957O5726k06013Q5404
14565B106926p6313K91525j09469k54475K1250o8547L98239j04104J08214J72847
14555B486093j04776l80540L77747l8830L38312j72648J22768J47626j20005J76631
14545B832378k22916P40127J44461J82830L2247L83371N0562R75670J42857J623203
14535F884790P89845K594581L970413O415445J0586793J072500j2683508q134625
14527A1496234m044517j938516r02618R49297q42749j149401j49433n32360j67468
$$ y = [1460554, 1699808, 1720410, 1735661, 1715984, 1857325, 1448759, 1883398, 1957106, 1464309, 2045427, 1611706, 1958715, 1991631, 1441932, 1607424, 2168045, 1756912, 1975502, 1815674, 2004441, 1783869, 1939207, 1850564, 2041742, 1847459, 1673852, 2161809, 2227535, 2021522, 2106926, 2030613, 2322138, 2212669, 1958194, 1979444, 1910897, 2309136, 2205032, 2313246, 2486093, 2381317, 2000777, 2378524, 2339694, 2678006, 2505358, 2628126, 2775752, 2655747, 2832378, 2609462, 3349589, 3494050, 3676880, 3709127, 4092498, 4143060, 5118730, 5261587, 6884790, 7674635, 10269216, 14239629, 20655074, 31241867, 32314367, 19630859, 11496234, 7451717, 5513201, 4610583, 5559880, 4717131, 3567730, 3418297, 2885937, 2718469]
14518B718469l79685M24156k17413m4256M2307l1850K29568l03908J23674j30159
14508B430903P1150k34846M40812K38206k10232K34646l8152k82358J85051j35174
14498B700006J60941j05119J27473J08430Q3712k08115M64923l87815L87040k11181
14488C120295M06449j58464j10419J05867N1164j92877K57653o6240N6732K86803
14478C756963r5952j96267R9611J50953j52058P0602M08346n31051M66621J78495
14468D156263q6341J41147n58476N74193j69248L50056m95936L88006l75013L03161
14458D227812N30036l42870J34501l23945M64419j09656J94355J91889k05911
14449D760630k11396K19459J37285K54643Q0707R5030l07298J49555L51486l98257
$$ y = [2718469, 2338784, 2762940, 2545527, 2501271, 2543578, 2511728, 2741296, 2437388, 2561062, 2430903, 2502053, 2267207, 2708019, 2946225, 2735993, 2970639, 2932487, 2650129, 2835180, 2700006, 2860947, 2755828, 2883301, 2991731, 3075443, 2867328, 3332251, 2944436, 3331476, 3120295, 3526744, 3368280, 3257861, 3363728, 3414892, 3222015, 3479668, 3413428, 3470160, 3756963, 3661011, 3464744, 3564355, 3715308, 3563250, 3633852, 4042198, 3511147, 3977768, 4156263, 4069922, 4211069, 3652593, 4226786, 4057538, 4407594, 3911658, 4299664, 3924651, 4227812, 4757848, 4414978, 4549479, 4225534, 4689953, 4580297, 4774652, 4966541, 4760630, 4549234, 4768693, 4905978, 5160621, 5241328, 5336358, 5029060, 5178615, 5530101, 5131844]
14439E131844L30516J11868M6423k43757O21371j89802J6891j97196K70114L97509
14429F295781l43704L67926m2136M0211J97134Q3542j17831m7578L15329R1033
14419F839707N7899M899J60322l48779M92519L80234k61752M57485J24800L0162
14409G937496P9637K23502n4472K47054J7928J56687L10053K83004m9322J36546
14399I288113L42695l16209R5455J99688P2728J14840K68503j28774L61721r6445
14389A0202315L08985K41920M07847j3979N37087l49702K76252K69857N1438J67329
14379A2099349K78402K1550K26841K86107J84576M99538n7521O13845p3962M62338
14369A4541063m27354O23274O76920K30620J22177O21138j0988L96137L05368
$$ y = [5131844, 5462360, 5574228, 5620651, 5376894, 5998265, 5808463, 5825354, 5628158, 5898272, 6295781, 5952077, 6320003, 6277867, 6318078, 6515212, 6598754, 6480923, 6433345, 6748674, 6839707, 6897606, 6902505, 7062827, 6714048, 7206567, 7586801, 7325049, 7782534, 7907334, 7937496, 8017133, 8240635, 8186163, 8433217, 8451145, 8607832, 8917885, 9200889, 9151567, 9288113, 9630808, 9314599, 9410054, 9609742, 9682470, 9797310, 10065813, 9937039, 10298760, 10202315, 10511300, 10753220, 11161067, 11147088, 11684175, 11334473, 11610725, 11880582, 11932020, 12099349, 12377751, 12399301, 12626142, 12912249, 13096825, 13596363, 13538842, 14152687, 14078725, 14541063, 14113709, 14736983, 15413903, 15644523, 15766700, 16387838, 16376850, 16772987, 17078355]
14360A7078355M17350N0518N74351O9001N64544K4737P56708L39571Q2507M76271
14350B0433913O48714K00396J056140J13570P00749L97694N97970K48185L57475
14341B4754806L60272J002172Q53870K74068P93228N86393Q34627N07867J088687
14332C1055990P48278L08171J242062Q67007J089356Q04698R16710J208475J188941
14323C9429688P72446J364222J265993J118603J294659J683107J479176J039297
14315D9447191J807152J556385J742075J688878J994527J994639K268532K058012
14307F4557391K127555K459523L020917K661171K451372L377909L009808K897219
14299H6562865L685850L460041M060955L938969M235574M618758M821077N128959
$$ y = [17078355, 17495705, 17546223, 18120574, 18189575, 18754119, 18778856, 19535564, 19875135, 19957642, 20433913, 21082627, 21283023, 22339163, 22452733, 23153482, 23551176, 24149146, 24397331, 24754806, 25115078, 26117250, 26971120, 27245188, 28038416, 28624809, 29459436, 29967303, 31055990, 31804268, 32112439, 33354501, 34221508, 35310864, 36115562, 37032272, 38240747, 39429688, 40202134, 41566356, 42832349, 43950952, 45245611, 46928718, 48407894, 49447191, 51254343, 52810728, 54552803, 56241681, 58236208, 60230847, 62499379, 64557391, 66684946, 69144469, 72165386, 74826557, 77277929, 80655838, 83665646, 86562865, 90248715, 93708756, 97769711, 101708680, 105944254, 110563012, 115384089, 120513048]
14291A20513048N430784N861474O288704O990266O754684P674986P684810Q323943
14283A75522699Q865060R132791J0181966J0362766J1183017J1706767J2378695
14276B49333761J3042953J3686646J4041413J4217785J4102885J4558761J4407375
14269C47391579J4633236J4496727J3894279J3328285J2185988J0560811J0210144
14262D36701049R084709P782520O846453N435184K914831R94912o3195j07396
14254D69589067m826912o430164o431929r089459j1509239j2173151j4146930
14247D04981283j3995729j3680121j4355236j4231062j4289895j4441934j4114959
14240C05872347j3995198j3240333j2892715j2203969j2100875j0818006j0623338
$$ y = [120513048, 125943832, 131805306, 138094010, 145084276, 151838960, 159513946, 167198756, 175522699, 184387759, 193520550, 203702516, 214065282, 225248299, 236955066, 249333761, 262376714, 276063360, 290104773, 304322558, 318425443, 332984204, 347391579, 362024815, 376521542, 390415821, 403744106, 415930094, 426490905, 436701049, 445785758, 453568278, 460414731, 465849915, 468764746, 469759658, 469696463, 469589067, 464762155, 458331991, 451900062, 442810603, 431301364, 419128213, 404981283, 390985554, 377305433, 362950197, 348719135, 334429240, 319987306, 305872347, 291877149, 278636816, 265744101, 253540132, 241439257, 230621251, 219997913]
14233B19997913j0393532j0290567j0094021r239549q804018q427339p892843
14226A54856044p313004o815894o458997n746941n941523n401434n207548m486747
14218A07483956m791512l858840l810089m030251l624392l177024l542542l066834
14210G7582472l065163k353630k792337k377586k021847k483693k165592k037932
14202E8284692j751535j722735j773283j637234j336346j768205j545303j243149
14194D5506902j082502j222829j054601j209535j234851j236352o60475j334144
14186C6471613r10745j036906p77452j002695q90174q38244l59206j050023n89022
14177B9017146m67121r69088o13645l74597r20989n88279r36013k12087n87357
$$ y = [219997913, 209604381, 199313814, 189219793, 179980244, 171176226, 162748887, 154856044, 147543040, 140727146, 134268149, 128521208, 122579685, 117178251, 111970703, 107483956, 102692444, 98833604, 95023515, 90993264, 87368872, 84191848, 80649306, 77582472, 74517309, 72163679, 69371342, 66993756, 64971909, 62488216, 60322624, 58284692, 56533157, 54810422, 53037139, 51399905, 50063559, 48295354, 46750051, 45506902, 44424400, 43201571, 42146970, 40937435, 39702584, 38466232, 37805757, 36471613, 35560868, 34523962, 33746510, 32743815, 31853641, 31015397, 30656191, 29606168, 29017146, 28550025, 27580937, 26967292, 26592695, 25671706, 25083427, 24147414, 23935327, 23347970]
14168B3347970l32538j20872r40144n19186j61056p32357k15431m29732n92739
14159A9303915j49172k54132o55704j56183n56934k94116m37702P5711m29159
14150A6446524o1165j031844j20856o5034k44252k7150m21550o61782L9669k30529
14140A3622031j20141n39352j84797m77680Q4106j52172l73332K73945n34840
14131A1597768k36565j03622k70686k27167L6207r9727j26438j22508j25337j18281
14121A0203644m06105J72689o31103J8441l51638R4405j72520k37450K07954l11537
14111H586780j95930k29852n478k1249p3040o8116k78512j02r2125N8806l63296
14100G317886l886j30309q8188L06564k49727k24012m19742N6940L2771J59494
$$ y = [23347970, 23015432, 22894560, 21954416, 21435230, 21274174, 20541817, 20326386, 19896654, 19303915, 19154743, 18900611, 18244907, 18088724, 17531790, 17237674, 16799972, 16875683, 16446524, 16385359, 15353515, 15232659, 15167625, 14923373, 14896223, 14474673, 13812891, 13852560, 13622031, 13501890, 12962538, 12777741, 12300061, 12384167, 12231995, 11858663, 12132608, 11597768, 11361203, 11257581, 10986895, 10759728, 10795935, 10696208, 10569770, 10447262, 10321925, 10203644, 9797539, 9970228, 9339125, 9357566, 9005928, 9100333, 8927813, 8690363, 8898317, 8586780, 8390850, 8160998, 8155520, 8134271, 8061231, 7993115, 7714603, 7714501, 7622376, 7681182, 7317886, 7314000, 7183691, 7095503, 7402067, 7152340, 6928328, 6508586, 6565526, 6598297, 6757791]
14090F757791k07047k6310m58892K02323J25743q5692j40841n5644k94407j3256
14080E803768j44327J37701k64359l9506J26702p9474L20106k52618m26315J6756
14070E198434K2711Q1594L5188o35885j8499J03917j17385R7837j62116q1594
14060D524202P4176j59209M2721k64102K61300l5330R4754k78072J64031k90300
14050D134171q351K63014m91539L55915j25782K10811j22282k90370J74858k01123
14040C899322j7471N7156L4614m07219j34773j028K40586m11309J82331J35625
14030C577834r4747j06199K20321k61146J38010l68739M71183l66855L87814k76176
14020C321300l16004J03670m401J9825M942j65774J72285J52459Q4943l72756
$$ y = [6757791, 6550744, 6524434, 6065542, 6267865, 6393608, 6307916, 6167075, 6111431, 5817024, 5803768, 5659441, 5797142, 5532783, 5493277, 5619979, 5540505, 5860611, 5607993, 5181678, 5198434, 5221145, 5302739, 5337927, 4702042, 4683543, 4787460, 4670075, 4767912, 4605796, 4524202, 4598378, 4439169, 4481890, 4217788, 4479088, 4443758, 4538512, 4260440, 4424471, 4134171, 4125820, 4388834, 3897295, 4253210, 4127428, 4338239, 4215957, 3925587, 4100445, 3899322, 3881851, 3939007, 3973621, 3566402, 3431629, 3430601, 3671187, 3259878, 3442209, 3577834, 3483087, 3376888, 3597209, 3336063, 3474073, 3105334, 3576517, 3209662, 3597476, 3321300, 3005296, 3108966, 3104565, 3124390, 3129332, 2963558, 3135843, 3288302, 3373245, 3000489]
14010C000489r4249j36375k10371K75199l83321L23792R9917o41567O57895j58425
14000B732984m81061J18793K44848j89775j21483M39006k87136j21261Q7659k35036
13990B187538N6037J24000M7497k07833K70330J4169k77888j55689K29235J69941
13980B457337j15206L67666M21091K53401O99479M89434J855062L215845N699101
13971A5343210J0903777O746447r750452q382786m745456k491758j920290q92889
13963D809803m11381o45893j47764j69128j01572o89747L0438J07987J36555k31566
13953B687732l91150J22885j13790J02238j04198j03628K34138n30037L43953
13944B248143J9633j68282M9626J94448l65605K12644m0660q126k07765J01327
$$ y = [3000489, 2906240, 2769865, 2559494, 2834693, 2451372, 2775164, 2875081, 2233514, 2891409, 2732984, 2251923, 2370716, 2615564, 2425789, 2304306, 2743312, 2456176, 2334915, 2422574, 2187538, 2243575, 2367575, 2415072, 2207239, 2477569, 2491738, 2213850, 2058161, 2287396, 2457337, 2342131, 2709797, 3130888, 3384289, 4083768, 4573202, 6428264, 9644109, 15343210, 26246987, 32993434, 23242982, 14860196, 10114740, 7622982, 5702692, 4809803, 4398422, 3752529, 3604765, 3435637, 3334065, 2644318, 2674756, 2782743, 2919298, 2687732, 2296582, 2419467, 2305677, 2407915, 2303717, 2200089, 2434227, 1904190, 2248143, 2267776, 2099494, 2149120, 2343568, 1977963, 2190607, 2149947, 2141821, 1934056, 2035383]
13934B035383j88781J14874J1075r3975j61307o0348K33233K9474J11854m38758
13924A592724J43667k499O934K34691k60685J93330k46618J07885l4183j28249
13914A606997L39306n29093L07092o0774j55522J97416j68882j30649j9178p1113
13904A315600J9677J45693j38328J00638j00572K09417n2721L15609q4336m64849
13894A265828J69968p5333J85794o8350k05196J20112k59138L77690j37061p934
13884A366380o5969J6966l8923j97654O9875J0592M91302l51880l26859N35029
13874A508859l91265l6660J42556q5208J80741m8735j39689r0522k32431N77214
13864A384860j1733k93564J45064O1614k88428m0461M41914l48206N4713J77528
$$ y = [2035383, 1846602, 1961476, 1972551, 1878576, 1717269, 1656921, 1890154, 1919628, 2031482, 1592724, 1736391, 1733892, 1740826, 1975517, 1714832, 1908162, 1661544, 1769429, 1735246, 1606997, 1946303, 1417210, 1724302, 1663528, 1508006, 1705422, 1536540, 1405891, 1386713, 1315600, 1335277, 1480970, 1342642, 1443280, 1342708, 1552125, 1499404, 1815013, 1730677, 1265828, 1435796, 1360463, 1546257, 1477907, 1272711, 1392823, 1133685, 1511375, 1374314, 1366380, 1300411, 1317377, 1278454, 1080800, 1150675, 1161267, 1652569, 1300689, 973830, 1508859, 1117594, 1080934, 1223490, 1138282, 1319023, 1270288, 1130599, 1040077, 807646, 1384860, 1373127, 1079563, 1224627, 1286241, 997813, 957352, 1399266, 1051060, 1105773, 1283301]
13854A283301j30959j82340N55647m74500L04370m68062K14907j41928M5144L71100
13844A376680k40197J12213j9305l53127K21476j6035J57665k13491p8584p8497
13834H68798K68558m6826j75624q8184K61733K07141m18408L40321l15744J14019
13824A015784K09577n25119K12785m32333P03734k04268m300k14042J07135J50352
13814A019305l4272m58171N20759k40019J24364k9652P3226M0036l39004J44975
13804H21547L0239L2769k73719J89037j18180L1878K7176J5172l27650K08181
13794F36450K23988j35439J71456Q8146j95808L3468J93682k77401Q1815N5712
13784H76069J49463j09232m25885L20248Q8130l18901J74142L0704L33193l70818
$$ y = [1283301, 1152342, 970002, 1525649, 1051149, 1355519, 887457, 1102364, 960436, 1005580, 1376680, 1136483, 1248696, 1229391, 876264, 1097740, 1081705, 1239370, 1025879, 947295, 868798, 1137356, 1090530, 914906, 826722, 1088455, 1295596, 877188, 1217509, 901765, 1015784, 1225361, 700242, 913027, 480694, 1184428, 980160, 975860, 761818, 868953, 1019305, 985033, 526862, 1047621, 807602, 931966, 902314, 975540, 1015576, 676572, 821547, 851786, 884555, 610836, 799873, 681693, 713571, 740747, 755919, 428269, 636450, 860438, 724999, 896455, 984601, 788793, 822261, 1015943, 738542, 820357, 876069, 1025532, 916300, 490415, 810663, 898793, 579892, 754034, 784738, 1117931, 747113]
13774G47113J85101l05965L98730n07670K56533K05728j58180j34203q6814J34312
13764G34685C00197K92662K99846L2758m60778J82794K33910j74888j29929J42791
13754G19363j12450K2751L07314j43894k8625Q5659r0306k49234K10520r0362
13744F30736J4549J85795j21927K3256l15579J37734K37276k33424j29344J68361
13734E97433j96566p6225L80220j83306k2701J33611j01580j7265K04215j07133
13724F10703K31973l49619K55856l17400L73077k62670K8611K73416D06907K39968
13714F46875K55713C00069K3773j08935N67123B22720L20533j3852O3296r5850
13704D96847J01843K05436C66941O9350J19595N4539B35459K83860k5856L4250
$$ y = [747113, 932214, 626249, 1024979, 517309, 773842, 979570, 821390, 687187, 600373, 734685, 300197, 592859, 892705, 925463, 464685, 647479, 881389, 706501, 576572, 719363, 606913, 629664, 936978, 793084, 764459, 850118, 759812, 510578, 721098, 630736, 645285, 831080, 709153, 732409, 416830, 554564, 791840, 558416, 429072, 597433, 400867, 324642, 704862, 521556, 498855, 632466, 530886, 513621, 717836, 610703, 842676, 493057, 748913, 431513, 804590, 541920, 570531, 843947, 406907, 646875, 902588, 300069, 323842, 214907, 782030, 222720, 543253, 529401, 592697, 496847, 598690, 804126, 366941, 436291, 555886, 610425, 235459, 519319, 493463, 527713]
13694E27713j53288K778J76998k6672K10323o3043N5847k45478j4376N70780D14581
13682D85914J67814j57884A52158K26752L23479j99684J2165j25812M2920j01155
13672C30823j28113O44567l47062L28751l75883Q3324R8950A43725L77554Q9622
13662F10901k07120L97827l82625G0174K52420K01151K4070A58067M71849K0478
13652F50394k28679J39590H4450J48936J10908J51754q9313O2818J01432k38589
13642C32396j11869M58170k53285j44652L47126k19462m7852K02617k50610A45346
13631E61501j08542O1108j83327K75858j82053A23906L97492l5397M2214j31594
13621C96621A20607J54741J74592m5234J97240k55036L9542J45808q2584r9670
$$ y = [527713, 374425, 377203, 554201, 527529, 737852, 674809, 730656, 485178, 470802, 1041582, 414581, 485914, 653728, 495844, 152158, 378910, 702389, 502705, 514870, 389058, 431978, 330823, 202710, 847277, 500215, 828966, 453083, 536407, 635357, 143725, 521279, 610901, 403781, 801608, 418983, 70174, 322594, 523745, 547815, 158067, 629916, 650394, 421715, 561305, 84450, 233386, 344294, 496048, 406735, 469553, 570985, 332396, 220527, 678697, 425412, 280760, 627886, 408424, 360572, 563189, 312579, 145346, 561501, 452959, 514067, 330740, 606598, 424545, 123906, 521398, 486001, 528215, 396621, 120607, 275348, 449940, 404706, 601946, 346910, 386452, 532260, 449676, 350006]
13611C50006n0612K9024J87882B07798K46755j1152j68754M4411J08667L28390
13601G56115k59513k19307Q6357R7767A79994L09175J02524k22694l9278J48429
13591D78150E9968M54749k49460H0345N07917j94202l3678K39242k31481A80021
13580D15974p3466q9739J19561j07926j14381L02343k21413b7110C64302j07869
13570B56433O1333A15213J26101k0209q6107L44384A34839J75770A43843K84595
13560D28438j48545N2678o7752n9504m974K26206j29775a24469B44620l5023J62367
13549C71964A29811K48967j09345J98071c165A42109l0592L09858q4573r9815
13539B36987P0459j9655R4924j33249J12316P5038A80263H1895K63162J58005
$$ y = [350006, 299394, 328418, 516300, 207798, 454553, 443401, 274647, 319058, 427725, 756115, 496602, 277295, 363652, 461419, 179994, 489169, 591693, 368999, 329721, 478150, 59968, 514717, 265257, 80345, 588262, 394060, 360382, 599624, 368143, 180021, 415974, 342508, 252769, 372330, 264404, 150023, 452366, 230953, -27110, 364302, 256433, 317766, 115213, 241314, 221105, 134998, 479382, 134839, 310609, 143843, 428438, 279893, 332571, 264819, 205315, 200341, 426547, 296772, -124469, 244620, 209597, 371964, 129811, 378778, 269433, 467504, -3165, 142109, 111517, 421375, 336802, 236987, 307446, 287791, 382715, 249466, 361782, 436820, 180263, 81895, 345057, 503062]
13529E03062O1873k13955D5371K19317J52627A21627J9371J8555O1737K97531
13519E18821b0429E4035M29031l8379j48573J69571C6565L93866r5280k271J51855
13508D84735k40776N9052k0879K4802p5484Q0343A5015L072l053K59675o4523
13497B10186J69369A59517k7963K546J35361o9191N7360J68358j50958a18856
13486C85769l0718j48855f5260D82419j5640L1629E4866J58057O9796J76070a91760
13474c63D73065D8361K24416M0996Q0306R7272j94420K33516H0367L79317j51242
13463C08442J45387A78880J86707P3135A01138N4183J06530l6530I1101Q8305
13453A79406J92720A54828M9030P9713K16289e006C72845K63857A04058K52976
$$ y = [503062, 564935, 350980, 45371, 264688, 417315, 121627, 140998, 159553, 221290, 518821, -20429, 54035, 483066, 444687, 296114, 465685, 36565, 430431, 335151, 332880, 484735, 243959, 303011, 282132, 306934, 231450, 311793, 15015, 18087, 15034, 274709, 210186, 379555, 159517, 131554, 134100, 269461, 200270, 257630, 425988, 275030, -118856, 385769, 355051, 206196, -65260, 482419, 466779, 498408, 54866, 212923, 282719, 458789, -191760, -363, 473065, 48361, 272777, 313773, 394079, 491351, 296931, 530447, 80367, 459684, 308442, 453829, 178880, 365587, 438722, 101138, 155321, 261851, 225321, 91101, 179406, 372126, 154828, 203858, 283571, 499860, -5006, 372845, 636702, 104058, 357034]
13443C57034B7355e2738A69789K77817A99275L42605A55305L4601L28213a7735
13432C89494a90423C87335C8395K26637P6606Q4301D0710h1305B92413j01251
13422A91162L24144a1990D00474j1641F677b236B77522g4576E19921A67145h4718
13410A96034p0835l6386J91104a9059A18945J46334m7711R4117E3431J49721I4588
13398B81018j01208k2493m764J63513A18739n7307O9520D5073a53380A64370n8165
13387A06205K14183I1615a43031B80282J14991A67620f4374C18300B7762e9383
13376I967J51758J92919A16255k9488C9599K76176a34674f844B4770J19106D8976
13364A39415K5846J78663H6774J48823K0100I9332L07514A23135M05142A46537
$$ y = [357034, 27355, -52738, 169789, 447606, 199275, 541880, 155305, 189906, 518119, -17735, 389494, -190423, 387335, 38395, 265032, 341638, 425939, 40710, -81305, 292413, 191162, 515306, -11990, 400474, 388833, 6677, -2236, 277522, -74576, 519921, 167145, -84718, 196034, 125199, 88813, 279917, -19059, 118945, 265279, 217568, 311685, 53431, 203152, 94588, 281018, 179810, 157317, 152553, 316066, 118739, 61432, 130952, 45073, -153380, 164370, 106205, 320388, 91615, -143031, 280282, 395273, 167620, -64374, 318300, 27762, -59383, 9967, 161725, 354644, 116255, 86767, 39599, 315775, -134674, -6844, 24770, 143876, 48976, 139415, 165261, 343924, 86774, 235597, 255697, 99332, 406846, 123135, 528277, 146537]
13353B29143a4607j9584I7433L2507N82674A03705L2168N0950P1423K11363A07199
13341C8268L72986k9291p4086O7045J2182E4856L77096B03857A9067K91251j1201
13330B99117O060K6111A13834J8601K38747J07124j73175L50478A63297L02707
13320D66004C2701L45494J0153G7889j8044L50686k4268q0847g2399A50669C3595
13308B0368J71325F0244J37299m0672K94474j58178H6688Q3814K59516e8260j17616
13297a75876C20141J0260Q8129E4577m346J81617G5812M8383K20457j09779F4478
13285B1463g0843b7791A28519k6399R5199p5497a3001A09992J07693h83A65790
13273B1791f5272C08155I726M08703A19847f3027C50050I0801J89128J24955A2089
$$ y = [229143, -14607, -34191, 97433, 129940, 712614, 103705, 135873, 186823, 258246, 469609, 107199, 38268, 411254, 381963, 307877, 374922, 387104, 54856, 431952, 203857, 19067, 310318, 299117, 305177, 331288, 113834, 132435, 371182, 478306, 305131, 655609, 163297, 466004, 32701, 378195, 388348, 77889, 59845, 410531, 386263, 305416, -72399, 150669, 33595, 20368, 191693, 60244, 197543, 156871, 451345, 293167, 86688, 170502, 430018, -58260, -175876, 320141, 330401, 418530, 54577, 50231, 231848, 75812, 124195, 344652, 234873, 64478, 21463, -70843, -27791, 128519, 102120, 197319, 121822, -13001, 109992, 217685, -883, 165790, 21791, -65272, 308155, 9726, 418429, 119847, -63027, 350050, 90801, 279929, 404884, 12089]
13261B02411a5127B39796C7756L7673J21858E7744a37961O6133k1957B63610j09031
13250A54579E0756J91956b3860H4259M4916Q9460o3970a28511A35752a33615D32635
13238A88460K51600a71075L8200f5522l5581I5981b6317j4510C21586j20627h7212
13226D06538b34392B00565c32527B29280E9402a819B36013R5035b7704B53267
13215a41797O9523B46258O3020c08626A19195c9714Q764p71B01028o8712E687
13203H6859e6791A80134l1079b15930A83941B7588f5909A65898e8457j99111B85604
13191c113B64752c6980B34913C9744N20312k57101j09490b1581n6216A00027L36163
13180D36190j05737J97958A78135a21614N0411A51541b66541A60092l7088g1986
$$ y = [202411, -15127, 239796, 37756, 75429, 197287, 57744, -137961, -71828, -93785, 263610, 154579, 50756, 242712, -23860, 84259, 129175, 218635, 154665, -128511, 135752, -133615, 432635, 188460, 440060, -171075, -132875, -65522, -101103, 95981, -26317, -40827, 321586, 200959, -87212, 406538, -234392, 200565, -332527, 229280, 59402, -1819, 236013, 331048, -27704, 253267, -141797, -72274, 246258, 309278, -308626, 119195, -39714, -30950, -31721, 201028, 132316, 5687, 86859, -56791, 180134, 149055, -215930, 183941, 27588, -65909, 165898, -58457, -257568, 285604, -3113, 264752, -36980, 234913, 39744, 560056, 302955, 193465, -21581, -77797, 100027, 436190, 330453, 528411, 178135, -121614, -71203, 151541, -266541, 160092, 123004, -71986]
13169b38814A02786J03015D2487N2680d3810A40922j6745P6659J29014A17217
13158A14128m2210l734k0956K83579b08478B02381n7791g1350A34605f1619C93950
13146B6529J72532e6551G2200p032h0966R100H6778m1532d89C08228A30572c1606
13133B62663g7029C72913D0741c5248A73494n4204K16231q848b23007f1603A90165
13121g3581j80339O2592H5846J02008g7242n2195I1058A3580J71022n956j878
13110A76768K47066A21253K2317o3056K67200A38843h7381a0257D0607J30451
13100A71058I135a83524j5490o4348l2550B19113j01936e8411A91362a61152q4161
13089b45313a07207K9247j54015h4731r0043l9668A70582c19197a29174A48635
$$ y = [-238814, 102786, 205801, 42487, 95167, -43810, 140922, 124177, 200836, 329850, 117217, 114128, 71918, 68184, 47228, 330807, -208478, 202381, 144590, -71350, 134605, -61619, 393950, 26529, 199061, -56551, 72200, 65168, -80966, -71866, 86778, 45246, -489, 308228, 130572, -31606, 262663, -77029, 372913, 40741, -35248, 173494, 119290, 335521, 326673, -223007, -61603, 190165, -73581, -253920, -191328, 85846, 187854, -77242, -129437, 91058, 13580, 184602, 178646, 176768, 423834, 121253, 143570, 80514, 347714, 138843, -87381, -10257, 40607, 171058, 9135, -183524, -199014, -263362, -295912, 219113, 117177, -58411, 191362, -161152, -245313, -107207, -77960, -231975, -84731, -174774, -214442, 170582, -319197, -129174, 148635]
13078A29453L9865p7599h4783C21759a2353A6641a74819A63333e8967j0441j96639
13067b66047A87179C8291j8342d925A26793E5005a63050I4517f1840A17775a01658
13055h1452n954b3680D799K03742b03253A26523m3101J20675H8659k9428J394
13044F0625c4050j12203E7133J57011b5693A6858e2020A76928e5613i386j47217
13033a56603I830J7114e8591A32171a35334B36093E4168d3089Q122a507B32448
13021a60427A18443r620J88857A7741a5877E6450M2333m8409f7323B81131b46892
13009E8300Q5581J17399o5813I3139k8583A4782J6639J162J66825p5822K29795
12998C53381r8256R4237H1922N2461F6909K39965a5787j40705L9211j69151E7534
$$ y = [129453, 169318, 91719, -84783, 321759, -12353, 16641, -174819, 163333, -58967, -69408, -266047, 187179, 38291, 19949, -4925, 126793, 55005, -163050, 94517, -61840, 117775, -101658, -81452, -87406, -23680, 4799, 208541, -203253, 126523, 83422, 204097, 88659, 59231, 60625, -34050, -146253, 57133, 214144, -25693, 16858, -52020, 176928, -55613, -9386, -156603, 9830, 26944, -58591, 132171, -135334, 236093, 54168, -43089, -34967, -1507, 232448, -160427, 118443, 108823, 297680, 17741, -15877, 56450, 98783, 50374, -67323, 281131, -246892, 58300, 143881, 261280, 195467, 93139, 64556, 14782, 31421, 32583, 199408, 123586, 353381, 255125, 349362, 81922, 134383, 66909, 306874, -15787, -156492, -117281, -286432, 57534]
12986h3216E3300a55264a0604m4559G5542k9912r217J03056c15710H0905i9594
12974A43507e8367m2911B57047j26749J54290A15577b40915A24325a67701A67862
12963B21533b2171B07630r5302a04988A54062A7518M269L59250a2601H8663c9757
12951B07039C1247K04570b54041i2444J8930c2762A18294c47021J30592F5405
12940a08961L9139c425D5968J07065A2075N2301a49911P0335K4457A38188h3663
12928D7569a00865j51148J00258A12221N3892f3298C1096a28375F7205q802e8425
12916B21433e0862A3252b5353C31774j01487J48824g766G9908J22383M9790c670
12904a88035g5336C58113a71936M5852A80467J22844A35725M8028p7391J08157
$$ y = [-83216, 53300, -155264, -10604, -55163, 75542, 45630, 36413, 139469, -315710, 80905, -99594, 143507, -58367, -101278, 257047, 130298, 284588, 115577, -240915, 124325, -167701, 167862, 221533, -22171, 207630, 112328, -104988, 154062, 17518, 21787, 381037, -12601, 88663, -39757, 207039, 31247, 235817, -254041, -92444, -73514, -32762, 118294, -347021, -216429, 65405, -108961, -69822, -3425, 45968, 153033, 12075, 64376, -149911, -79576, -55119, 138188, -83663, 47569, -100865, -252013, -151755, 112221, 166113, -63298, 31096, -128375, 67205, 58403, -58425, 221433, -50862, 13252, -25353, 331774, 230287, 379111, -7766, 79908, 202291, 252081, -3670, -188035, -75336, 358113, -171936, -126084, 180467, 303311, 135725, 183753, 106362, 214519]
12894B14519a90435j0130k3052A01242D8795J72271H0886a33283C7055b33379
12883A72440D9238a29050k23173A07469j854l0832c1134A02709f9858j21600H4031
12871d2065J4463A22062h9990D8314a0253A0738b5134l6062C2381a37143A49317
12859c50130A4270K3197c04080D1903a27755A20793i1836A20747n0905p835P8263
12848A40270l5112J1704a41753A34705e6673K4006H9369a02908j43042k0150D84742
12836b1115j05223k53410a25324D34171H6108J53768E5176a78967f8039A83618
12825b16310c2545j25763G2426a39673f8033C0863h1159k10034A94767c8262A30329
12813i4590A95899h3162n2060a6897A47889i4074l1328M172j16485a4163j00927
$$ y = [214519, -190435, -200565, -223617, 101242, 48795, 221066, 80886, -133283, 37055, -233379, 172440, 49238, -129050, -352223, 107469, 105615, 74783, -31134, 102709, -69858, -191458, 84031, -42065, -27602, 122062, -89990, 48314, -10253, 10738, -25134, -61196, 32381, -137143, 149317, -350130, 14270, 37467, -304080, 41903, -127755, 120793, -91836, 120747, 69842, 62007, 140270, 105158, 116862, -141753, 134705, -56673, -32667, 89369, -102908, -245950, -266100, 484742, -21115, -126338, -379748, -125324, 434171, 86108, 239876, 55176, -178967, -68039, 183618, -216310, -32545, -158308, 72426, -139673, -68033, 30863, -81159, -291193, 194767, -38262, 130329, -94590, 195899, -83162, -135222, -16897, 147889, -94074, -125402, -121230, -237715, -14163, -115090]
12802a15090r7317L3956N9725G5605J24388M0820d6971k15448J04327j44840f9893
12790G8551B223c12247A23078b0153k582A10262a34792k09667b9438C6451O5970
12779A02421R1295a8558k08186B82102f5880B09393o8487g2598E6916A7210a94183
12767g3112p6612N840D9571h8001J4997G5321a87767A07848C8267g4362a2219
12755b38519A21083C6766M4144a24687N6014C95353C8882a44724j16878F936i0074
12743h5504j39157A06782b97964A07004i3961B82577a13454n1694B4490k921J27463
12732A49032F3827c12830A15078a6562A6462O4750b06113B8270i6480B24268f6162
12720c8036n2749L3193B9405a03617B45497a05829A78795h6897J6156B53903n8657
$$ y = [-115090, -212407, -178451, -118726, 75605, 199993, 240813, -46971, -262419, -158092, -302932, -69893, 78551, 2223, -312247, 123078, -20153, -22735, 110262, -134792, -344459, -29438, 36451, 102421, 193716, -18558, -226744, 282102, -65880, 209393, 140906, -72598, 56916, 17210, -194183, -73112, -149724, -143884, 49571, -88001, -73004, 75321, -187767, 107848, 38267, -74362, -12219, -238519, 121083, 36766, 80910, -124687, -68673, 395353, 38882, -144724, -261602, 6936, -90074, -85504, -224661, 106782, -297964, 107004, -93961, 282577, -113454, -165148, 24490, 21569, 149032, 63827, -312830, 115078, -16562, 16462, 81212, -206113, 28270, -96480, 224268, -66162, -38036, -90785, -57592, 29405, -103617, 245497, -105829, 178795, -86897, -70741, 253903, 195246]
12709A95246d2757C17739b232C49713a3680k44437c1978A10616C0103J82653a86504
12697B26297P2716A06177a38541d1628H4450K78924c10460a51946D02083H6162
12686I2484J53441b56821A86554a29359A76629b12022A36541J82431g2946B47640
12675B23436a18699D51232e3574F5046K2719f19o9264A24936a03544A70675f1498
12663B88980A29170k490a00571C19544I6611b32709B74605K8044b62220A87383
12652A86338d3235B69370F4309a99218a6830A92674Q3103q5466h7938A40990P1379
12641B12369J63204C9181J22807n23N478b25459B68191a72493B08848a47007A09457
12629C09926b01581B8008a01581a3528m8751G2779a87764a2667j6328B03487K3941
$$ y = [195246, -42757, 317739, -2232, 349713, -13680, -258117, -31978, 110616, 30103, 212756, -186504, 226297, 299013, 106177, -138541, -41628, 84450, 363374, -310460, -151946, 402083, 86162, 92484, 245925, -256821, 186554, -129359, 176629, -212022, 136541, 318972, -72946, 247640, 223436, -118699, 451232, -53574, 65046, 87765, -619, -69883, 124936, -103544, 170675, -61498, 288980, 129170, 126680, -100571, 319544, 96611, -232709, 274605, 302649, -262220, 187383, 186338, -43235, 269370, 64309, -199218, -16830, 192674, 275777, 190311, -87938, 140990, 212369, 375573, 39181, 161988, 161465, 166943, -225459, 268191, -172493, 208848, -147007, 109457, 309926, -201581, 28008, -101581, -13528, -62279, 72779, -187764, -12667, -28995, 203487, 227428]
12618B27428A08564K5759c0838H9557J23774J36151r1036A0697K06789h4388B00028
12606F0168E453a7113A73107o7831c677A5943b7415k98778C818e0113B33695o5932
12594A67763r46g192k24948c7679A50144i7842G1264Q5383A4711Q26J84749a45372
12581a52735D4282J26022n0524g6986d809k14678H9066P6129b9010f867B10144
12569B02478g8986j03094L4709L3093A30771b55955A98411n0860e7892l6606B56482
12557c19026F5615c24429B9385L290j2802k461N8597A1713Q0709I161K68315j21956
12545A55520b06749G2267a23351e3707B78819J62647A37594r320J42418c14844
12534C12607E4430c8340A09778B2268H275J44068a35337L2600B20847K4089D9691
$$ y = [227428, 108564, 134323, -30838, 89557, 213331, 349482, 258446, 10697, 217486, -84388, 200028, 60168, 5453, -17113, 173107, 105276, -3677, 15943, -27415, -326193, 3818, -50113, 233695, 167763, 166817, -7192, -232140, -37679, 150144, -97842, 71264, 156647, 14711, 15537, 200286, -145372, -152735, 44282, 170304, 119780, -76986, -4809, -219487, 89066, 165195, -29010, -6867, 210144, 202478, -78986, -182080, -147371, -114278, 130771, -255955, 198411, 147551, -57892, -94498, 256482, -319026, 65615, -324429, 29385, 32675, 19873, 17412, 76009, 11713, 92422, 9161, 277476, 155520, -206749, 72267, -123351, -53707, 278819, 441466, 137594, 128274, 270692, -314844, 312607, 54430, -38340, 109778, 22268, 8275, 152343, -135337, -102737, 220847, 244936, 49691]
12522A83193n9989E8495h6486A67373I479O0867J56169a78005j10304h713G6433
12510A18849g3584I8405a23203b4307k19007A47844c36193c0470I3186G987J24071
12499A32058R6711a9611l74051i7975j0707c328A24812C9994d0257C1538a56464
12487d5953A26204R4396d33540i5606m8940N0574A01222a33105b5547d368A84874
12475a57110b9060B26631a95034I3812J14720a20244N3693n0216q1485B10488
12464C06557c034A03681d9811H1784k9403N315e9755k57418P6815a07436k8029
12453a35465f4270G9067a78029e9080k40996A28776J54142d56236a60936a1150
12442a33233B43900B6868P6408a34394k16585A34319b84538A37495B4143a04308
$$ y = [183193, 123204, 58495, -86486, 167373, 9479, 70346, 226515, -178005, -288309, -8713, 76433, 118849, -73584, 98405, -123203, -24307, -243314, 147844, -336193, -30470, 93186, 7987, 132058, 228769, -19611, -393662, -97975, -108682, -3328, 124812, 39994, -40257, 31538, -156464, -45953, 126204, 220600, -433540, -95606, -144546, -93972, 101222, -133105, -25547, -4368, 184874, -157110, -29060, 226631, -195034, 93812, 208532, -120244, -66551, -116767, -198252, 210488, 306557, -3034, 103681, -49811, 81784, 52381, 57696, -59755, -317173, -240358, -107436, -135465, -64270, 79067, -178029, -59080, -300076, 128776, 282918, -456236, -160936, -11150, -133233, 243900, 26868, 103276, -134394, -350979, 134319, -284538, 137495, 24143, -104308]
12431c00723B2291J46568p9428r173O7002b04797g7244C74685a54906r0049a11419
12419c41035C1669b60227k10469G6495c66516J54081A42284F9326K39622f0425
12408a49154g235k31074P6820i254j47028O9832j38675A95294f8802j18947h2806
12396A19108i023j36121l9570m8931A71938a1860C20731J20782h8858b1213I4360
12384E4193e4908A95620a28786k28931E104g964p9704B49985B8868K13364e2908
12372c2886C03351a29685A71068a63703H9943J60325F2763g6291B1751J64735
12362A86486i2451F1561C0011K23715C1929a84053H1193N053K28185h3982G8986
12350C4864d8647b0750E948b84633f1506b2789M100A25301a98650c8012r3900
$$ y = [-300723, 22291, 168859, 89431, 80258, 147260, -204797, -77244, 374685, -154906, -244955, -111419, -341035, 31669, -260227, -470696, 76495, -366516, -212435, 142284, 69326, 308948, -60425, -149154, -7235, -238309, -161489, -9254, -156282, -86450, -225125, 195294, -68802, -187749, -82806, 119108, -9023, -145144, -184714, -233645, 171938, -11860, 320731, 441513, -88858, -21213, 94360, 54193, -54908, 195620, -128786, -357717, 5104, -7964, -87668, 249985, 28868, 242232, -52908, -32886, 303351, -129685, 171068, -163703, 89943, 250268, 62763, -76291, 21751, 186486, -92451, 61561, 30011, 253726, 31929, -184053, 81193, 86246, 314431, -83982, 78986, 34864, -48647, -20750, 5948, -284633, -61506, -22789, -18689, 125301, -198650, -38012, -131912]
12339a31912l9567c8890G6147D766a70325G4091c44746J27018D4143C075J74431
12328A77506a93728q6717B2231b21809G2496a23506H1098J45399L9309b66918
12317A97406b5061o5414j59875B57527K63984j18499a92696h7061b2261C1096
12306C15303J59576A7476P2484L89886A18297a21197B70615r8075K25960A79075
12295A71200J34034A199K15650r3975J04900a16115A22491m4840b06684B52032
12284C98802A03159m9794J7695M65279e2521H822K5094K92525Q6190j70825a53835
12272A88252o0296k3917K43468O7127A00048J05387h7289l0823c0810A57390L9295
12261A96685b41698B73180F8317J55412J18602b48696A03505J4354l9306c917
$$ y = [-131912, -171479, -38890, 76147, 4766, -170325, 74091, -344746, -217728, 44143, 3075, 177506, -193728, -280445, 22231, -221809, 72496, -123506, 81098, 226497, 265806, -266918, 197406, -25061, -90475, -250350, 257527, 521511, 403012, -192696, -87061, -22261, 31096, 315303, 474879, 17476, 89960, 479846, 118297, -121197, 270615, 172540, 398500, 179075, 171200, 305234, 1199, 216849, 122874, 227774, -116115, 122491, 77651, -206684, 252032, 398802, 103159, 53365, 71060, 536339, -52521, 8822, 33916, 326441, 412631, 241806, -153835, 188252, 127956, 104039, 347507, 414634, 100048, 205435, -87289, -118112, -30810, 157390, 196685, -241698, 273180, 68317, 223729, 342331, -248696, 103505, 117859, 78553, -3917]
12250A76574J21526a20685C1196e8197B1773a16657A2837d2330A91103n4479Q933
12239A45557J66582j56001J23981a02792G6756a6845a385H1992L26984a7204A60567
12227A30406d594j11458D2592J4080f421D6778a22878c6847j62991B79461a17226
12215B73678j27408P2490I3631B8398b3442l3404B69878m4430A07294J33724a43811
12203E6906M56620k46118a14978o7092A77788d7400A15246J03247i5675B87613
12192b55256A85619C0623i8742A57041M1817o6786P3935c2388F00908I67L2898
12181C3865Q6632J55183a30588B60587p5795J11736A07577K14987R6081I1844
12170b55897A32033J25550J84786A74028l9541A2225b53417B68892c6547G9956
$$ y = [176574, 298100, -120685, 31196, -58197, 21773, -116657, 12837, -42330, 191103, 136624, 145557, 312139, 156138, 280119, -102792, 76756, -16845, -1385, 81992, 408976, -17204, 160567, 130406, -4594, -116052, 42592, 56672, -6421, 46778, -122878, -36847, -199838, 279461, -117226, 273678, 146270, 218760, 93631, 28398, -23442, -56846, 269878, 225448, 107294, 241018, -143811, 56906, 513526, 267408, -114978, -182070, 177788, -47400, 115246, 218493, -95675, 287613, -255256, 185619, 30623, -98742, 157041, 198858, 132072, 206007, -32388, 600908, 967, 33865, 120497, 275680, -130588, 260587, 184792, 296528, 107577, 322564, 418645, 91844, -255897, 132033, 257583, 442369, 174028, 134487, 12225, -253417, 268892, -36547, 79956]
12159d4634A32511J44049e284m5218C08091A46358l1024K35576K43242B96733
12148A25851E9629N972M2292M9048F5865J97874H0354J88952l2073a40127b0452
12136B7885e1662j3905A46295l489e2421o9206e1573p8804C63179a58783b6940
12124d4729A28586i5005j0378B73247D7354L4108J55364M3754J53793j61039A15797
12112H6698O5981E5638b08618A72062i123A16591l3450J23231q0474d5864E71498
12100I8765L746B9295P148a14530B5397J08620R2952c44025A92152A0886J36370
12089A47256C5568a52421C59325j49878o5704b5400G4976R9794b92209F3313N6451
12078A19764J43814H4093d9790C24535j41069J29052a71173A64865J7384E9724
$$ y = [-44634, 132511, 276560, -5284, -50502, 308091, 146358, 115334, 350910, 594152, 296733, 125851, 59629, 65601, 107893, 156941, 65865, 263739, 80354, 269306, 237233, -140127, -20452, 27885, -51662, -65567, 146295, 142806, -52421, -121627, -51573, -130377, 363179, -158783, -26940, -44729, 128586, -95005, -105383, 273247, 47354, 81462, 236826, 280580, 434373, 273334, 115797, 86698, 152679, 55638, -208618, 172062, -9123, 116591, 83141, 206372, 125898, -45864, 571498, 98765, 102511, 29295, 36443, -114530, 25397, 134017, 226969, -344025, 192152, 10886, 147256, 35568, -152421, 359325, 209447, 143743, -25400, 74976, 174770, -292209, 63313, 119764, 263578, 84093, -49790, 324535, 183466, 312518, -171173, 164865, 182249, 59724]
12067C14022r4368Q6297E5712h213C18722J38165A31577e51389B64409A26305
12056A45758b08920A78494A149J67730F8218K98757A72386a05277C15495r7909
12046B17586p8675N5358a73609o7900B96312d9707j15484c8492j1707p5498D34389
12034D11957h9785H2522j0730e9036l8482B12489a37635c8878j11606B17295a40109
12022B97368a68620D6575a76042A93695F5063b43145J1302I8617C0479D796K4656
12011B9452a20241C47289j65906A3713f2574k8662A69458J04290I0255c5995j22370
12000a58365F5981A3217N7912R6840K3295a0214b991D9736P9997F4834f43F2495
11987F7107a88906A5853a17642I2537C8968c36081B01359i850j88137B51224j03258
$$ y = [314022, 219654, 305951, 55712, -8213, 318722, 456887, 131577, -551389, 264409, 126305, 145758, -208920, 178494, 1149, 168879, 68218, 366975, 172386, -105277, 315495, 217586, 138911, 194269, -173609, -241509, 296312, -49707, -165191, -38492, -50199, -125697, 434389, 411957, -89785, 82522, 71792, -59036, -97518, 212489, -137635, -38878, -150484, 217295, -140109, 297368, -168620, 46575, -176042, 193695, 65063, -243145, -231843, 98617, 30479, 4796, 29452, -120241, 347289, 181383, 13713, -62574, -91236, 169458, 273748, 90255, -35995, -158365, 65981, 13217, 71129, 167969, 191264, -10214, -2991, 49736, 129733, 64834, -643, 62495, 67107, -188906, 15853, -117642, 92537, 38968, -336081, 201359, -9850, -197987, 251224, 147966]
11976A47966a43175k3069C7564L52156c4708C19256D690a12347M1976j75117b0830
11964b67322P4926A66836H1964i1174A41013i2350K4231k34041J1884Q2375Q8088
11953a19813A26013K05836a34286f5328G4162h1442B14091b81773g0564A85139
11942a97360j31849J47641O7167N038j79805a09743H8286O1543a5291j21041k10590
11931c46922c7640A32236i3508D4937K19228a15181K1029H8347a16874C3482h4378
11919C78599G8651a0259n030H4217a4690k79993B10542F492d0428B87678L5372
11908C23050a28326b5856j9223E0494a3091j26424e5368j23425B72363a48240
11897D3832b37358f6876A67358m0991l1700f5660H1105b28564A70098c03874I1403
$$ y = [147966, -143175, -166244, 37564, 389720, -34708, 319256, 4690, -112347, -70371, -245488, -20830, -267322, -192396, 166836, 81964, -91174, 141013, -92350, -68119, -302160, -290276, -207901, -119813, 126013, 331849, -134286, -65328, 74162, -81442, 214091, -281773, -70564, 185139, -197360, -329209, -181568, -114401, -109363, -289168, -109743, 88286, 149829, -15291, -136332, -346922, -37640, 132236, -93508, 44937, 264165, -115181, -94152, 88347, -116874, 33482, -84378, 378599, 78651, -10259, -15289, 84217, -14690, -294683, 210542, 6492, -40428, 287678, 323050, -128326, -25856, -45079, 50494, -13091, -139515, -55368, -178793, 272363, -148240, 43832, -237358, -66876, 167358, 126367, 94667, -65660, 81105, -228564, 170098, -303874, 91403]
11885A64064b01577B47444a74544A16499J55885A27400J06175a17618m714A18377
11874c2344k70310M8902A39827a10332m2665p5851J13971q6268h8303G43R3508
11863I4251B164J9193c35772f8123B41794b07578i5066k34575A03254c3527K439
11852c1088I3248O608a44724C7950N7499b17071H5138a20805I0459D848b25540
11840d7300B34116c9167l41142e5987A6659o366b56174J26572J1940H2042L9380
11829A21422C2752a73136n7297A36732F1349K2682g7072j10231K4320A85968q2048
11818A03920P6484d8739B22103q3309B335b64583C4884K10380A07690J9464h2280
11806B48507b6380I1599a18332A09380K42081C5681h6317k81804A78585b08049
$$ y = [164064, -201577, 247444, -174544, 116499, 272384, 127400, 233575, -117618, -122332, 118377, -32344, -302654, -253752, 139827, -110332, -152997, -228848, -114877, -201145, -88303, 743, 94251, 2164, 21357, -335772, -68123, 241794, -207578, -95066, -329641, 103254, -33527, -31088, 93248, 99856, -144724, 37950, 95449, -217071, 85138, -120805, 90459, 4848, -225540, -47300, 234116, -39167, -380309, -55987, 16659, 10293, -256174, -129602, -117662, 82042, 121422, 32752, -173136, -230433, 136732, 61349, 84031, -77072, -187303, -162983, 185968, 103920, 180404, -48739, 222103, 138794, 2335, -264583, 34884, 245264, 107690, 127154, -82280, 248507, -26380, 91599, -118332, 109380, 351461, 35681, -86317, -368121, 178585, -208049]
11795a86111A76655a90322O6104Q366k1737B06564i3655A07343a18389o0708n3581
11784b32678i8508J9261a3845j00130j70611J02041m8159J02748j71501A0017
11773C29684a09428A73370J58081F1909N5746a62077n012g0469A45008f3374b6896
11761A04115a6856j48655J7832a2531C84986i0013A2465a25491K394b8678j21798
11750a50476C8206c67120A34269Q1327h7139K5725A05850J4073C2853J56862q7947
11739A01768a19636J2219A42995E7512a11514N1089m8283p4729g9113c6421F1351
11727B28924i1933l08793A34688c47827a01865K5137A61176G0895B03c03708a09265
11715a02080R206A72884a09050k03597R4426L1371q2431H3396c81846a46663C0190
$$ y = [-186111, 176655, -190322, -124218, -115852, -137589, 206564, -93655, 107343, -118389, -179097, -232678, -98508, -79247, -13845, -113975, -284586, -182545, -230704, -127956, -299457, 10017, 329684, -109428, 173370, 331451, 61909, 117655, -162077, -167089, -70469, 145008, -63374, -26896, 104115, -16856, -165511, -147679, -12531, 384986, -90013, 12465, -125491, -123097, -28678, -150476, 38206, -367120, 134269, 215596, -87139, -61414, 105850, 119923, 32853, 189715, 101768, -119636, -107417, 142995, 57512, -111514, -60425, -108708, -183437, -79113, -36421, 61351, 228924, -91933, -400726, 134688, -347827, -101865, -76728, 161176, 70895, 203, -303708, -109265, -102080, -92874, 172884, -109050, -312647, -218221, -186850, -269281, 83396, -381846, -146663, 30190]
11703H7639a28770F4697L944P1864J04130a52777N9660L2422c0216B1291c3938
11691D0509K28592a886A1498M1117A8742b19748I5753O5349a24303A10633a360
11679I3025J24978a12910h930k43388n1709a12722A62561a72313l4276L7196D4808
11667B02589a41705e3424j54054h8641K9015B8293J22633b24814Q1365A66256
11656d314D9480K1132a4762n913B9543b01109E1955a64066b9880k01389D50413
11644D31091A3042J40769j5756c8183H4626p000Q3019f8086A38882J75849d2227
11632C8708h8361M1473j91731A81374d20557a09153k3958C35689a14267A22618
11621a41857n9776D5175J08203K85562a96742m8063J9768D6772K14757c09735
$$ y = [87639, -128770, 64697, 68641, 140505, 244635, -152777, -93117, -60695, -30216, 21291, -33938, 40509, 269101, -1886, 11498, 52615, 18742, -219748, 95753, 161102, -124303, 110633, -1360, 93025, 218003, -112910, -8930, -252318, -304027, -112722, 162561, -172313, -206589, -169393, 44808, 202589, -141705, -53424, -207478, -88641, -59626, 28293, 150926, -224814, -143449, 166256, -4314, 49480, 70612, -14762, -20675, 29543, -201109, 51955, -164066, -29880, -231269, 450413, 431091, 13042, 153811, 138055, -38183, 84626, 77626, 160645, -68086, 138882, 314731, -42227, 38708, -88361, -46888, -238619, 181374, -420557, -109153, -133111, 335689, -114267, 122618, -141857, -201633, 45175, 153378, 438940, -196742, -244805, -225037, 46772, 261529, -309735]
11610a04209G1667i8670j24923B65607i7497F929f4056A07477J8123k3514a87433
11598h35D24136H6065J22212o9776d6349j49728i3534a8835B28616f3329C42575
11586C3373b994j9677j28523P066B38256a35202F2259b1437B20960M2759a07495
11574C11127j51697a88714E3314M39647f1416b7134j82779O2699B21115D2821
11563B38129d0339B8932J52417b91153C47499d6778k03606L0991B00270K75340
11553D75610a19642H1598J47756F5767h9265F0582h853C02750E0457a32523O0065
11542g2458C9542j4468b74710B63390i1318A22115c5278B44311J78621a8188l6364
11531e4552l7423B51214i421F2646a3890A1370L12219I04K2664P5540b76938A20259
$$ y = [-104209, 71667, -98670, -223593, 265607, -97497, 6929, -64056, 107477, 125600, 102086, -187433, -835, 424136, 86065, 208277, 138501, -46349, -196077, -93534, -18835, 228616, -63329, 342575, 33373, -2994, -22671, -151194, -144128, 238256, -135202, 62259, -21437, 220960, 263719, -107495, 311127, 159430, -188714, 53314, 492961, -61416, -27134, -209913, -147214, 221115, 42821, 238129, -40339, 28932, 181349, -291153, 347499, -46778, -250384, -219393, 200270, 475610, -119642, 81598, 229354, 65767, -89265, 60582, -8853, 302750, 50457, -132523, -72458, 39542, 25074, -274710, 263390, -91318, 122115, -35278, 244311, 422932, -18188, -54552, -91975, 251214, -9421, 62646, -13890, 11370, 323589, 904, 23568, 99108, -276938, 120259]
11518d166H0913a3159E750J59150p0276m2824j2987a43901A47349k6463f353k8053
11506c4406A15562b1421C31339a19924A10764K2402D6334L1145K82821A13418
11495B00472j6113P0420a71082E9420f4951p5300j36503b9594B09048p4718K25255
11484C59585j8620i5079L3596B3439c1119B40052o6528c6755B58928J29754F6625
11472I4609a68400C4162j3882L22893H3825i8967A96829c4945A53139J36441M8556
11461C38136b99097C22095A4293a99010A8575c01560A62909C0991K49327J49791
11451D30109E9594N6727A4083R5720a73816K5009E4865J01160l8532K64651a15791
11439a30655C19359P5042A77868a98189G4057a27194a3518p352l08852A82903
$$ y = [-4166, 80913, -13159, 5750, 164900, 94624, 51800, 38813, -143901, 147349, 120886, -6353, -34406, 115562, -21421, 331339, -119924, 110764, 133166, 46334, 77479, 360300, 113418, 200472, 184359, 254779, -171082, 59420, -64951, -140251, -276754, -29594, 209048, 134330, 359585, 340965, -95079, -61483, 23439, -31119, 240052, 173524, -36755, 258928, 388682, 66625, 94609, -168400, 34162, 20280, 343173, 83825, -98967, 196829, -34945, 153139, 289580, 338136, -299097, 322095, 14293, -199010, 18575, -301560, 162909, 30991, 280318, 430109, 59594, 116321, 14083, 109803, -173816, -148807, 54865, 156025, 117493, 382144, -115791, -130655, 319359, 394401, 177868, -198189, 74057, -127194, -13518, -20870, -329722, 182903]
11428B55194b3651B75427J90339i2191B69599F6823c1064C13192a39215I5794
11417b94471B91334r5080b38923j01129i087A1324m187N6091N2671N6993a4997
11405B75697c8504A44936b72064h993k52958G2042b86738E5448a6120o9587j1418
11394i7125m7019G8926e8555k01293h1044b1691C6418a98046B79209m3288G347
11382a62574g2554C13199g06j86222P4668b4371j11756G8957K8483K17052r8629
11371B25863p5929a12435A37665M7569c57662O6610h6518C4556h7005B84797G9031
11359A09393d6866j36624A80858o6870a52642A63066e6238j35223j83443N1258
11349c23646a03135A39971m4236i5113K2406A13454b28455e0055M722B6681a79729
$$ y = [255194, -23651, 275427, 465766, -92191, 269599, 66823, -31064, 313192, -139215, 95794, -294471, 291334, 196254, -238923, -340052, -9087, 11324, 7137, 63228, 115899, 172892, -14997, 275697, -38504, 144936, -272064, -8993, -261951, 72042, -286738, 55448, -16120, -85707, -97125, -144144, 78926, -58555, -259848, -81044, -21691, 36418, -198046, 279209, 235921, 7347, -162574, -72554, 313199, -706, -186928, -112260, -24371, -136127, 78957, 107440, 324492, 225863, 149934, -112435, 137665, 185234, -357662, -291052, -86518, 34556, -87005, 284797, 79031, 109393, -46866, -183490, 180858, 113988, -152642, 163066, -56238, -191461, -374904, -323646, -103135, 139971, 95735, -95113, -72707, 113454, -228455, -50055, -45333, 26681, -179729]
11337A35818J37623l6258k6787c812A89619a42844o4593N8062j22492f0622a2488
11325C9882a2255A58609g1220L0657q6292B24558k2320n7834J05437i2468j87512
11314b79980b2201o4509H0314a46205B34367M794a17724q9754B22906p5729I080
11302E6247b60512B5921b8957j05086c8464J3834k63555O5393b1126j95508l49601
11291e66235b8632A10217b38094a15231B96125c6532F3596j5554b25511B03982
11280a09801d9041j90355H4677c14486a27956G911a3393f087r6720n9910A377
11268f4055r39a3110D322a86308d7538k05436F8729a75014C8971d33792G9085
11256b4050j99900A6295M4506d56212J94553A571a82011O5764B49655E6298J31793
$$ y = [135818, 273441, 237183, 210396, -3812, 189619, -142844, -207437, -149375, -271867, -60622, -12488, 39882, -12255, 158609, -71220, -40563, -126855, 224558, 202238, 144404, 249841, -92468, -279980, -22201, -86710, 80314, -146205, 234367, 239161, -117724, -207478, 222906, 147177, 9080, 56247, -260512, 25921, -28957, -134043, -38464, -24630, -288185, -222792, -21126, -216634, -566235, -28632, 110217, -238094, -115231, 296125, -36532, 63596, 48042, -225511, 203982, -109801, -49041, -239396, 84677, -314486, -127956, 7911, -13393, -6087, -102807, -162717, 1377, -64055, -64994, -13110, 4322, -186308, -47538, -252974, 68729, -175014, 38971, -433792, 79085, -24050, -223950, 16295, 60801, -456212, -261659, 1571, -182011, -116247, 249655, 56298, 188091]
11245A88091h6251E715J6271L11686j10251o7174n6085k9840b67122G5553e9872
11233b64823B80283f0017A82547a45155L391H134a09603I4314L4840b07753D895
11221a40194l4687A29415i1734A02029H077f5518o2418B28810b04450P6684j08283
11210b36049b571A63178b15346A49172b7908j67874j01079D75667A82745a89212
11199c72919D0818a91140E2936a17515j58057c0218j18143r8321C3045J55591
11189A88636b34971A11932f2152A39126J9286F3440J15548d9533l33607a16132
11178a29195D9111J48937a15231C099b31002J14017j65831B91814A38530a38110
11167a20056L3712B4297i1607p1526B36948c21708A0480h9544q3635C16593J955
$$ y = [188091, -86251, 5715, 21986, 333672, 223421, 156247, 100162, 70322, -267122, 75553, -59872, -264823, 280283, -60017, 182547, -145155, -141764, 8134, -109603, 94314, 129154, -207753, 4895, -140194, -174881, 129415, -91734, 102029, 8077, -65518, -127936, 228810, -204450, -127766, -236049, -2571, 163178, -215346, 149172, -27908, -195782, -296861, 475667, 182745, -189212, -372919, 40818, -191140, 52936, -117515, -275572, -30218, -148361, -246682, 33045, 188636, -234971, 111932, -62152, 139126, 158412, 63440, 178988, -49533, -383140, -116132, -129195, 49111, 198048, -115231, 3099, -231002, -116985, -282816, 291814, 138530, -138110, -120056, -86344, 24297, -91607, -163133, 236948, -321708, 10480, -89544, -173179, 316593, 318548]
11156C18548e8254l8654j93711b8160h895k44091i581j58350j71r705r5004d2441
11143B51155C7057c58037K0151h0096c9130k38295j83712g1109r7321m4041g2595
11131A02052a62975c4098a4937m2292B78105n5784H895d0021E8174b5803D7918
11119D27478c0485A03730D5463O4191m7214P195O0765c7874j8682I5100N230a10779
11106I484b2863H1452b5696j17792a9444C4341c23711f2336o832H4974a92005
11094a24804c1904A4536b37999R0243C31263f8811b05H8964L8432H443N5406P8500
11082A42349J69229j30324a21498B87504A13803B4965J79696n5525D7399K39993
11072B87392A04101R1037I2697J94954r7957J5156C3932J2618a8366A22623b6083
$$ y = [318548, -58254, -96908, -290619, -28160, -8895, -252986, -9581, -167931, -168102, -177807, -272811, -42441, 251155, 37057, -358037, -337886, -80096, -39130, -277425, -461137, -71109, -168430, -212471, -72595, 102052, -162975, -34098, -14937, -57229, 278105, 222321, 8895, -40021, 58174, -25803, 47918, 427478, -30485, 103730, 45463, 109654, 62440, 69635, 130400, -37874, -56556, 95100, 100330, -110779, 9484, -22863, 81452, -25696, -143488, -19444, 34341, -323711, -62336, -69168, 84974, -192005, -124804, -31904, 14536, -237999, -147756, 331263, -68811, -205, 88964, 127396, 8443, 63849, 142349, 311578, 181254, -121498, 287504, 113803, 24965, 204661, 149136, 47399, 287392, 104101, 195138, 92697, 287651, 189694, 204850, 33932, 46550, -18366, 122623, -26083]
11060A85653j7370j6212b05001b085A49354a15881B32503J14462j21438n8410
11050A67117L16525j06635j71996M70904B87834M59846B67938n2334K15046K00923
11040F31573j51408A27334M27335N0066J38868j36663k55239L29434r2117q8654
11030E00364J47008r0320J62825k18174K30186j26810J56206k99984L59650l81666
11020D39285K32715J25579C49699M65462j75107j80749O8981R581P7029L2370
11010F47266K82880k66822K64455k28709O5223p666n694J49796l07529n0986K14997
10999G57211j51585M0594k82074G0672N20377B62612J20646M1398M45577C88225
10988E79355k25524L30455j62751N911j33750L41103P2173C38093M51584C80005
$$ y = [185653, 168283, 152071, -205001, -2085, 149354, -115881, 232503, 346965, 225527, 167117, 483642, 377007, 205011, 675915, 287834, 747680, 267938, 215604, 430650, 631573, 480165, 127334, 554669, 604735, 743603, 606940, 351701, 681135, 589018, 500364, 647372, 557052, 719877, 501703, 731889, 605079, 761285, 461301, 820951, 439285, 672000, 797579, 349699, 815161, 640054, 459305, 528286, 537867, 614896, 647266, 930146, 663324, 927779, 699070, 764293, 756627, 750933, 900729, 593200, 542214, 757211, 605626, 646220, 364146, 70672, 591049, 262612, 383258, 424656, 870233, 388225, 579355, 353831, 684286, 521535, 527446, 393696, 734799, 806972, 338093, 789677, 380005]
10977C06243J46006K26255J88823k17115o7581M9314J85296j09680J25326P5277
10967I08164J61238O3878n6194r1723P8397m2036K00446J37914O074M26452P572
10956A800182J21474M92325j5712L2227k13813J13047J31472l05422l02847N8816
10946A911749l07265L24346l14316l65246J00327K25696n21308M05528k89667
10937A169844L50628k8624k20429J0096p1271C00985J21752K90597k39941l1325
10927D42068j90526J34921A19517K15439j21151G6004j3078R2282c29052A59435
10916A63035a14221c4312k42038B25629A03249a32464e2379o1300A15240c5203
10905B13659b13609J9571A141K43563a28523D27K64397a00480A30407b09040b7527
$$ y = [306243, 452249, 678504, 867327, 650212, 582631, 631945, 817241, 707561, 832887, 908164, 1069402, 1133280, 1077086, 985363, 1063760, 1021724, 1222170, 1360084, 1366158, 1792610, 1800182, 1921656, 2413981, 2398269, 2430496, 2216683, 2329730, 2461202, 2155780, 1852933, 1911749, 1604484, 1928830, 1614514, 1249268, 1349595, 1575291, 1053983, 1459511, 1169844, 1520472, 1491848, 1271419, 1281515, 1210244, 300985, 422737, 713334, 473393, 442068, 251542, 386463, 119517, 334956, 213805, 76004, 62926, 155208, -329052, 159435, 163035, -114221, -34312, -276350, 225629, 103249, -132464, -52379, -113679, 115240, -35203, 213659, -213609, -194038, 1141, 244704, -128523, 427, 264824, -100480, 130407, -209040, -27527]
10893C6521c01619C5473k070f5623C2187l493c25464p1946a67229O5929M1154
10882f0146A58505m3106B8031a43515A6778Q2795F504b2723k83321J45330e0410
10870a63219a7348C92457B9408a60778b1101A39688a08052c378E5883c10529A23011
10858B53573b4632A62089c05248k0714L7631h4307k4118M9043D9855b6335A40982
10846c1771k13743A34425R31K4343a59163A31693g1730q0718j53799B0017K16755
10835B36772b40769a2145j30889j92678a26263O0183o4042G0946A1962a51138
10824A98912a2522k19877B5350c48572G4386J34678b48875a06613c8672j35908
10814a74580f5322k65462B79740b74646G1240f2085B2478a15702j06662J05784
$$ y = [36521, -301619, 35473, 33403, -65623, 32187, 28694, -325464, -397410, -167229, -101300, -60146, 158505, 115399, 28031, -143515, 16778, 99573, 6504, -22723, -306044, -160714, -50410, -163219, -17348, 392457, 29408, -160778, -21101, 139688, -108052, -3378, 55883, -310529, 123011, 253573, -24632, 162089, -305248, -325962, -288331, -84307, -108425, -59382, 49855, -26335, 140982, -31771, -245514, 134425, 135356, 159699, -159163, 131693, -71730, -152448, -306247, 20017, 236772, -240769, -12145, -143034, -335712, -126263, -66080, -130122, 70946, 11962, -151138, 198912, -12522, -232399, 25350, -348572, 74386, 209064, -248875, -106613, -38672, -174580, -65322, -330784, 279740, -274646, 71240, -62085, 22478, -115702, -222364, -116580]
10804a16580j12657A73622b90685A27157g9623n8227L4245B946J33573J4952d22335
10792B16877b76316F4667b11995B77802E4766c29807f4845q4620b7660C8542d3131
10780b8994B232K65911f238D2348K6460d49608a06550A27341l0470g4178C08163
10768i2754j00694b8695a1729G6220f6953a133k09490A9733N185b44363P3577
10757a70786F6544K31169E052a39457B39107i3653k78016E114R5122D960a98307
10745b66130J17672c8084m0186F3384L1635i1642n9119O929B35143b528A6772
10733b08222H927d49838a42024k96779O7432g8284A3575a94982C8609b12471B42700
10721d6075D0758K22816j17316J38044A37928f4524A45413b1610E7333c5229j7278
$$ y = [-116580, -229237, 173622, -290685, 127157, -79623, -137850, -103605, 2946, 136519, 151471, -422335, 216877, -276316, 64667, -211995, 277802, 54766, -329807, -64845, -149465, -27660, 38542, -43131, -28994, 2232, 268143, -6238, 42348, 68808, -449608, -106550, 127341, 96871, -74178, 308163, -92754, -193448, -28695, -11729, 76220, -66953, -1133, -210623, 19733, 24918, -244363, -170786, 66544, 297713, 5052, -139457, 239107, -93653, -371669, 5114, 100236, 4960, -198307, -266130, -148458, -38084, -78270, 63384, 95019, -91642, -150761, -143832, 235143, -2528, 16772, -208222, 8927, -449838, -142024, -438803, -371371, -78284, 13575, -194982, 38609, -212471, 242700, -46075, 40758, 263574, 146258, 284302, 137928, -64524, 145413, -21610, 57333, -35229, -52507]
10710e2507j09551D7428a6230D0414a254j47048B61468O073E3876b35925j56056
10699c91981E9050b88718J39162A91889a49479a4280B4011L4107r729B1326a93337
10687b43303j2397a03171l5191O9075j40666M0558A1193d6967k5215j70892h9026
10675A92257c7914A5021g6530B14086c8907I803a2299j4985j58587d2220H2092
10663C7076R6420a30612f5065A16911b13622a9823j96547k00849A07469L9718
10653A47187a04995C9638J70491a02641P68c2074A67983c17k8132A62969d7642
10641c8621J6635j03886C0796P6541J82745a88000f2556j59670F5950f999A42063
10629F7259b9665j62691P8252A39336c23447B80036a677A15956D2037a68842d0643
$$ y = [-52507, -162058, 47428, -16230, 40414, -1254, -148302, 261468, 267541, 53876, -235925, -391981, 59050, -288718, -149556, 191889, -149479, -14280, 24011, 58118, 48389, 21326, -193337, -243303, -255700, -103171, -138362, -69287, -209953, -169395, 11193, -46967, -72182, -243074, -89026, 192257, -37914, 15021, -76530, 214086, -38907, 9803, -12299, -27284, -185871, -42220, 82092, 37076, 133496, -130612, -65065, 116911, -213622, -19823, -216370, -417219, 107469, 147187, -104995, 39638, 210129, -102641, -101873, -32074, 167983, -317, -28449, 162969, -47642, -38621, -21986, -125872, 30796, 107337, 290082, -188000, -62556, -222226, 65950, -6999, 142063, 67259, -29665, -192356, -114104, 139336, -323447, 280036, -1677, 115956, 42037, -168842, -40643]
10617b47166a05746j70563D5508c6964l5159G2906J02079a28138n2506A87297
10606c1729A97760F0629i5536K3672j45615m0313b5827A4697b02175A73379d21267
10594A23285d6397j38367C1940c40959J14157M989d713k63524f3913l09475l3093
10583d06481i8950C41168a28176j11409c7760j78338m0289I0408d60535g8591
10572A72055b46070H9912b38294a18674F6340d38225a30531A9282a71592A48483
10561a08202a064j20495L3954E5735a58081g3794k2225j27797B22866J03503a21629
10549b45205D7076g9518B54678e0710F409Q2013K03702b84321Q3523P8763J0119
10538a11916j35394Q6722p6289F2433e2326A77313a58934O2623G9120a16922j35654
$$ y = [-247166, -105746, -276309, 45508, -36964, -72123, 72906, 174985, -128138, -180644, 187297, -31729, 197760, 60629, -95536, -71864, -217479, -257792, -25827, 14697, -202175, 173379, -421267, 123285, -46397, -184764, 31940, -340959, -226802, -221813, -4713, -268237, -63913, -373388, -406481, -98950, 341168, -128176, -239585, -37760, -216098, -256387, 90408, -460535, -78591, 172055, -246070, 89912, -238294, -118674, 66340, -438225, -130531, 19282, -171592, 148483, -108202, -1064, -121559, -87605, 55735, -158081, -73794, -96019, -223816, 222866, 326369, -121629, -245205, 47076, -79518, 254678, -50710, 6409, 88422, 292124, -284321, -200798, -122035, -111916, -247310, -160588, -236877, 62433, -52326, 177313, -158934, -96311, 79120, -116922, -252576]
10527b52576B62865a08721I5199a66911E3444l758J8183a38087H0571c60054i4709
10515f8140A44347b91869a29005p5172g057j68112j18685I027Q2002a6123B31465
10503A31402c63577b3505f066G3020c73424B99279b98416J15249H7736b10269
10492b30049d7545j22963f9121B52597r2662e434G3118L9741a79934k33064a36720
10480B29685a59430E2874J56916N0255a54076b8018B1910L67462a3538D06081
10469b15237e5313R777k33171g3533B98873I8926k8499K26249J94060G7765J73826
10458B51591J99443j97256I6826P6900b49003B70485b88819A1303J05321E3918
10447H2753O2904k3010E8207g1890l9341r556H4564b88977H2436I128a4908j14797
$$ y = [-252576, 262865, -108721, 95199, -166911, 53444, 49686, 67869, -138087, 80571, -360054, -94709, -68140, 144347, -291869, -129005, -204177, -7057, -175169, -293854, 9027, 91029, -16123, 231465, 131402, -363577, -23505, -6066, 73020, -373424, 299279, -298416, -183167, 87736, -210269, -230049, -47545, -170508, -69121, 252597, 159935, -5434, 73118, 112859, -179934, -412998, -136720, 229685, -159430, 52874, 209790, 260045, -154076, -28018, 21910, 389372, -13538, 406081, -215237, -55313, -45536, -278707, -73533, 298873, 98926, 70427, 296676, 490736, 77765, 251591, 451034, 253778, 96826, 173726, -249003, 270485, -288819, 11303, 116624, 53918, 82753, 145657, 122647, 58207, -71890, -111231, -120787, 84564, -288977, 82436, 9128, -14908, -129705]
10435a29705j85673I2233g0351A6305P2712d7418p9791p6819l6228l255j19346
10424c62857a77851J0877P9154j0202k6793B03383c44523G2872J33495H4871e1165
10412h0815A14938K3356a1825A70555q1992J6930C3432L193c67808L4136a51030
10400e3955J6634A96189j613a84493j2714b2408j87616A76162A0303b16718e5234
10388F392f3659B5213a34586H7101H902a018B27086c8429Ko9358B02777h0270
10375A89233c30552h2931E12576D7695P3164R06A7244K20513L56179k30334a88702
10363A47823c72839A06397C1349K33893I1979A6649N0706H895J85950p8094Q9305
10352B06056B0563L01218A23510K81380q2898K4521r6546Q6297J12164j69082
$$ y = [-129705, -315378, 92233, -70351, 16305, 89017, -47418, -127209, -204028, -240256, -243511, -362857, -177851, -166974, -87820, -98022, -124815, 203383, -344523, 72872, 206367, 84871, -51165, -80815, 114938, 138294, -11825, 170555, 88563, 105493, 33432, 36625, -367808, -333672, -151030, -53955, -37321, 196189, 194576, -184493, -197207, -22408, -210024, 176162, 10303, -216718, -55234, 6392, -63659, 25213, -134586, 87101, 8902, -1018, 227086, -38429, -38427, -107785, 202777, -80270, 189233, -330552, -82931, 512576, 47695, 120859, 121765, 17244, 237757, 593936, 363602, -188702, 147823, -372839, 106397, 31349, 265242, 91979, 16649, 67355, 8895, 194845, 116751, 206056, 20563, 321781, 123510, 404890, 321992, 346513, 249967, 336264, 448428, 279346]
10342B79346D7998K80600M2240b7083H1037K90257l8764k9459O6615j14191L05487
10331E60982A83990p3855l6713J17654K66022J64947B65474M2517a06002H6251
10320A51140L03605E6764J10655L28374F808L33629j27894R9408Q7253j41425
10310B57779e2120k83732A84148F5618J00690q1397K67192j06144a17656A44728
10299B30129E0282Q8996h3759A11631a09977B55854e7628C0572a37728c6345k6819
10288f3164A55787b73656d8316j18704A55321a58032D71160A00149f7662k23554
10278b91216A18609E3425a42093e7134n6229e4837p9801N9240L2650o8688B7486
10266B72321a41600C9785h366A12613M2028b46785f3572n5422B50885A2595R8297
$$ y = [279346, 47998, 328598, 370838, -27083, 81037, 371294, 332530, 303071, 369686, 255495, 560982, 183990, 110135, 73422, 191076, 457098, 622045, 265474, 307991, -106002, 86251, 151140, 454745, 56764, 167419, 495793, 6808, 340437, 212543, 311951, 399204, 257779, -52120, -335852, 184148, 65618, 166308, 84911, 352103, 245959, -117656, 144728, 230129, 50282, 139278, -83759, 111631, -109977, 255854, -57628, 30572, -137728, -36345, -63164, 155787, -273656, -48316, -167020, 155321, -158032, 471160, 100149, -67662, -291216, 118609, 53425, -142093, -57134, -113363, -54837, -134638, -75398, -42748, -111436, 27486, 272321, -141600, 39785, -8366, 112613, 154641, -246785, -63572, -118994, 250885, 12595, 110892]
10255A10892b2419o2376B6583K52663a1426A19487a83613l3881P1121o826l59962
10244e13161A48606j7821d14171A70935a90315H9857b06248B00692a4877n1373
10234f6250G0846a41487K110E7638K37968e9248I1122N4328a82507j77220B12612
10222C9692J45172F4464b9042l65512J00601C75082d1499E7068J63760I4281a73898
10210H0908f1871l95245a22081j34214O2547f1469j38760C7126R907i4624l18283
10199d12907i7651o095A85321e7208B48360M6038A31448n9258o134a73637c2701
10187d4017j50332R6135k95531J71419N1725g126j2719A6020N0804a39161k20803
10176c59964P8045c1088j16356J8039j62179A9659a56045F7578k4035E382Q7604
$$ y = [110892, -22419, -84795, 26583, 279246, -11426, 119487, -183613, -217494, -146373, -153199, -513161, 148606, 130785, -414171, 170935, -190315, 89857, -206248, 200692, -14877, -66250, 70846, -141487, -139377, 57638, 295606, -59248, 91122, 145450, -182507, -359727, 212612, 39692, 184864, 64464, -29042, -394554, -293953, 375082, -41499, 57068, 220828, 94281, -173898, 80908, -61871, -457116, -122081, -256295, -193748, -61469, -200229, 37126, 47033, -94624, -412907, -97651, -103746, 185321, -57208, 248360, 294398, 131448, 72190, 66056, -173637, -32701, -44017, -194349, -98214, -393745, -222326, -170601, -7126, -19845, 16020, 66824, -139161, -359964, -281919, -31088, -147444, -129405, -291584, 19659, -156045, 67578, 43543, 5382, 92986]
10165I2986C0199b13985G7456A9633a80919G007a06937l58149a77200A56139C1255
10153B39052b56973D8954P0434d26993E8551a78341A54167A3390b02584N5790
10143a46794B90640c1675j63087b7442m64164A13640d6011j49999j7121a05180
10132e974H5694a71393D4158b29002k04906h0464Q995I7738a44211e9501o3527
10121a23028D0937i9681j5276a1278k16013R3384F5225b06813b210l88948c2087
10109b47609m0961N4319A02456Q5779k7176c76871i6193j4480l42053J04898a30417
10097a20719b9436o4361c7108A11388c77781J87086p3791a07568p3123E4287b98538
10085D9362b99420J29335c7650j55757c8431j41752H1285e2775O699k76765A15021
$$ y = [92986, 30199, -213985, 77456, 19633, -180919, 7007, -106937, -465086, -177200, 156139, 31255, 239052, -256973, 48954, 119388, -426993, 58551, -178341, 154167, 13390, -202584, -146794, 290640, -31675, -194762, -27442, -491606, 113640, -46011, -196010, -213131, -105180, -5974, 85694, -171393, 44158, -229002, -433908, -80464, -71469, 97738, -144211, -59501, -123028, 40937, -99681, -114957, -11278, -227291, -133907, 65225, -206813, -2210, -391158, -32087, -247609, -288570, -234251, 102456, 188235, 161059, -376871, -96193, -110673, -452726, -347828, -130417, -120719, -29436, -93797, -37108, 111388, -377781, -190695, -264486, -107568, -180691, 54287, -298538, 49362, -299420, -170085, -37650, -193407, -38431, -180183, 81285, -52775, -46076, -322841, 115021]
10073a68645A57960c10153E945a58678k2414C9751N1489P1649a00056B1996r680
10062A2316K40152A23856a90063M2777A36363a91489i31r1243q0086a8445B68694
10050A37370i7641A61965a28080g549l99019B35391J9403b49563h0669A9737R7136
10039A16873g757A9278J62870b5456A45182i1502j81539M8099i8487j5519K0929
10028i3077L517A75340h9201k17573B33295j8057b86516D0026h6222j29461G5598
10016A36572e8403k89039J06876i31n2761j92276B11972G9426b9007j60982l9920
10005b29909P5755B32046F0527a54646H7268a99235f0284l18502J70644l0960
9995b39102f3191C61904a78539Q7573j34270A25007a37233H9980J18205a57986
$$ y = [-168645, 157960, -310153, 5945, -158678, -181092, 39751, 91240, 162889, -100056, 21996, 12316, 252468, 123856, -190063, -147286, 136363, -191489, -931, -92174, -172260, -18445, 268694, 137370, -97641, 161965, -128080, -7549, -406568, 235391, 254794, -249563, -80669, 19737, 116873, -7757, 19278, 182148, -25456, 145182, -91502, -273041, -224942, -98487, -114006, -93077, -89560, 175340, -89201, -306774, 233295, 215238, -286516, 40026, -86222, -215683, 75598, 136572, -58403, -347442, -240566, -931, -53692, -245968, 211972, 79426, -29007, -189989, -229909, -154154, 232046, 60527, -154646, 87268, -199235, -60284, -378786, -208142, -239102, -63191, 361904, -178539, -90966, -225236, 125007, -137233, 89980, 208185, -157986]
9984E8853J06664E6781J36115a37977O692M7046A30989N3300a34826q5920N5759
9973a64987A2225M2993c6632l2969o1883p0700H506g8727p3090m213g6648q2686
9961a59334A89672a04583C9509a62036a7864o8752J8309j9030k50745g3247F8244
9949b39268B66864a16586D3571f4063k04466O7283k2855j43472J42108A22756
9938b75093a04270i913k18842d8517j72676i7396E5057j1102b49969d5601o1810
9927a07411M4084B90969b1974a0681l36024h2002C04075b19141M2168N5734E6433
9915b83574a00932o5664D2865b30884b4353r0067l5995j2765k14066J15131c9299
9903E0253d1368k47305B06859c10965J16141B8014C888b97394e6535A69710i775
$$ y = [58853, 165517, 56781, 192896, -137977, -131285, -84239, 130989, 184289, -134826, -220746, -164987, 12225, 55218, -36632, -69601, -131484, -202184, 8506, -78727, -151817, -156030, -76648, -159334, 189672, -104583, 39509, -162036, -17864, -86616, -68307, -87337, -338082, -73247, 68244, -239268, 266864, -116586, 43571, -64063, -268529, -201246, -224101, -367573, -225465, 122756, -275093, -104270, -9913, -228755, -48517, -221193, -97396, 55057, 43955, -249969, -45601, -107411, -63327, 290969, -21974, -10681, -346705, -82002, 304075, -219141, -176973, -121239, 56433, -283574, -100932, -166596, 42865, -230884, -24353, -114420, -150415, -163180, -377246, -262115, -39299, 50253, -41368, -288673, 206859, -310965, -194824, 28014, 3888, -297394, -56535, 169710, -9775]
9891a63185A29835c37224C4938b54061a19873D6964i3379j2357n7845k19982A16872
9879a48334l9996B29429c6447n5609A02258C4363h1341A69624c09569o6663J23063
9868b53169I7059f0335j19407j13358A5197J78727K6068q5072E1778d0947l07526
9857c48473e8575j41408A60187c44761A46115D7644h3415m8218j304C338b72476
9845d86425D3527b5535B8386d9803G6646N4670R118a24083K3501d1537l4803j80170
9833b56510m2822M3970L1456L2847l3146D2144e114k35723A2955O217L95754A33807
9820D9016a581D8374b83882A0714d9251B20135N3378a72556N2040j01281j55270
9809c77067d8108k05332B6015k354a22690A1070K4963a48540j12780L9378G2387
$$ y = [-163185, 129835, -337224, 34938, -254061, -119873, 46964, -93379, -105736, -163581, -383563, 116872, -148334, -188330, 229429, -36447, -92056, 102258, 34363, -81341, 169624, -309569, -376232, -253169, 97059, -60335, -179742, -293100, 15197, 193924, 219992, 134920, 51778, -40947, -348473, -58575, -199983, 160187, -344761, 146115, 47644, -83415, -131633, -132937, 3338, -272476, -486425, 43527, -25535, 28386, -49803, 76646, 131316, 140434, -124083, -100582, -41537, -76340, -256510, -299332, -255362, -223906, -191059, -224205, 42144, -5114, -240837, 12955, 19172, 414926, 133807, 49016, -1581, 48374, -283882, 10714, -49251, 220135, 273513, -172556, -120516, -221797, -377067, -48108, -253440, 26015, 23661, -122690, 11070, 36033, -148540, -261320, -221942, 72387]
9797d46467a24996i455A64803B8810g2484A5524c29608a59937p7235B06263M2040
9786B48303q1897p5631e6026m69101a49408b4626m02698a82901l8260M8423A31293
9774b29864A55665c53306J63190M3148N6208r7633b8793j43615f5274J7906A8098
9762f5196j5232L4479j17907N4660J3905D7744b55244G7828J61305j05034g9823
9750f5886p2449m4607j71762f798k28528B11063D3364Q3171c9135J5841A90548
9738C95703G4413g2908o0297g429o0229A518d9505m1463l23054A09619b19882
9726b20760p2646h9553A57157f8670G585b95017D8273a25225A47800a5314B3311
9714a07956f136E4742a14096A8859d8039f890A9241a69477l0048k97954b01263
$$ y = [-446467, -124996, -9455, 164803, 28810, -72484, 15524, -329608, -159937, -237172, 206263, 248303, 166406, 90775, -56026, -525127, -149408, -24626, -427324, -182901, -221161, -172738, 131293, -229864, 155665, -353306, -190116, -146968, -90760, -188393, -28793, -172408, -65274, -47368, 18098, -65196, -80428, -45949, -163856, -109196, -95291, 47744, -255244, 77828, 239133, 134099, -79823, -65886, -138335, -182942, -354704, -6798, -235326, 211063, 43364, 126535, -39135, -23294, 190548, 395703, 74413, -72908, -133205, -7429, -67658, 1518, -49505, -90968, -414022, 109619, -219882, -220760, -293406, -89553, 157157, -68670, 7585, -295017, 48273, -125225, 147800, -15314, 23311, -107956, -6136, 54742, -114096, 18859, -48039, -6890, 19241, -169477, -199525, -497479, -201263]
9702c59271c6293C6673c8973l11044i2184k67121B4814c25209d2555j35736f1669
9690b34225I6777m0934J7754O8488Q5713m2010C1188a39406L8584k5938B8440
9678C15435I9683i2254o3310J0484j45934l2566N7146B2582c00883A21111c35817
9666E0468A7291a59804A22725a14511G1449h2129m0204F4268b01623p7573J09725
9655a69471j7652I4099a20484j93195J35032r455j56276A78423C5840c24545a13392
9643a35477L2082j15146i1414f885L351j49339F0812a77142A04793c1891j49968
9632a81859N9162k99129a16990c7781A2684J25037d8281j05276l5913r092R0860
9621a07702o199B7393a85599A23166b27146D348a2938n09180E00901b38013I6429
$$ y = [-359271, -36293, 36673, -38973, -350017, -92184, -359305, 24814, -325209, -42555, -178291, -61669, -234225, 96777, 55843, 73597, 142085, 227798, 185788, 31188, -139406, -100822, -126760, 28440, 315435, 99683, -92254, -155564, -145080, -291014, -323580, -266434, 22582, -300883, 121111, -335817, 50468, 17291, -159804, 122725, -114511, 71449, -82129, -122333, 64268, -201623, -279196, -169471, -187123, 94099, -120484, -313679, -178647, -188102, -344378, 178423, 35840, -324545, -113392, -135477, -103395, -218541, -91414, -6885, -3534, -152873, 60812, -177142, 104793, -31891, -181859, -122697, -421826, -116990, -37781, 12684, 137721, -48281, -153557, -189470, -198562, -107702, -113901, 27393, -185599, 123166, -227146, 4348, -12938, -522118, 500901, -238013, 96429]
9609F3064c68107J69515Q1873N5708A27139e766j65783A10814k6179a13455A31778
9597H0418h9633j1334n8395j03962d4722k69460F3621a15777A53080a44849C5931
9585d85028H4343p153k8855c20672f1997B24572c4879A0553a19457c3765D812
9573B1001P1598d92817a61012A3391J22936a91026J4872j28982h4036b0469j63876
9562a84345A06393a40618i624A43913l9705J8124b59349R8461A03497b22972Q3057
9551a39915c4518A55653j1712j4855f216C7839c3462k14511M5894o5839B7805
9539a19397d1545r5692r4858P6365m3369r6232B42602a34587k3828L7177O244
9528a14994B41530b38100A19056i4836n9309M0484j08240k21375A6397F413a63367
$$ y = [63064, -368107, -198592, -116719, -61011, 127139, -5766, -171549, 110814, 84635, -113455, 131778, 80418, -89633, -100967, -159362, -263324, -44722, -314182, 63621, -115777, 153080, -144849, 35931, -485028, 84343, 77190, 48335, -320672, -61997, 224572, -34879, 10553, -119457, -33765, 4812, 21001, 92599, -492817, -161012, 13391, 136327, -191026, -176154, -305136, -84036, -20469, -184345, 106393, -140618, -9624, 143913, 104208, 122332, -259349, -160888, 103497, -222972, -139915, -34518, 155653, 143941, 129086, -6216, 37839, -33462, -247973, -202079, -267918, 27805, -119397, -41545, -137237, -232095, -155730, -199099, -295331, 242602, -134587, -158415, -121238, -114994, 241530, -238100, 119056, -94836, -154145, -113661, -221901, -443276, 16397, 6413, -163367]
9516a07531F5005c77082g3253j13513C24599A8682b54938a25238i719k33387C5541
9504d23379j9321d584k75718e6163k5352j81121B98267j14986a39801L5279d5735
9492d8038I3567c6405A2108h2773D4328J3705a79343B12813r8480h3820j43603
9481b27423J07282B0655a79750j00343G2499d7568j31931l0094P2932D4047c13188
9469g5683B8108K88153G4537g234o1025J465a3239B93620i6135J2817r6307I5607
9456a39456L8845d4064k88002a61640d8082O517C4148d10430a30720O501D18504
9444c14270J12952a544n8874l25860a38192k6159f7095L0322A53739D0328h1706
9432a67495F6792b78011a538j35445e1088j6617K2788I7109h9286B3293Q6218
$$ y = [-107531, 65005, -377082, -73253, -186766, 324599, 18682, -254938, -125238, -9719, -243106, 35541, -423379, -442700, -4584, -280302, -56163, -81515, -262636, 298267, 183281, -139801, -104522, -45735, -48038, 93567, -36405, 12108, -82773, 44328, 58033, -179343, 212813, 114333, -83820, -227423, -120141, 20655, -179750, -280093, 72499, -47568, -179499, -209593, -136661, 44047, -313188, -75683, 28108, 316261, 74537, -7234, -68259, -66794, -13239, 293620, -96135, -83318, -179625, 95607, -139456, -100611, -44064, -332066, -161640, -48082, -41565, 34148, -410430, -130720, -124219, 418504, -314270, -201318, -1544, -60418, -386278, -138192, -164351, -67095, -36773, 153739, 40328, -81706, -167495, 66792, -278011, -1538, -136983, -51088, -67705, -44917, 97109, -89286, 23293, 109511]
9421A09511J42151i7965o6414A11714b45666A17468b19363k86750a24661e7983
9410b906j05242h955o655G3820J09388I1281l2202d7358l01636A60125G5497J75414
9398B50911I0746i8238k1849A00246c3447n0287m5330d7309j89292d2524A03648
9386G6058c08984A91373B8814c35845a55503m4375c4704B80988h7711n1282A87956
9374c18033A09204b77857a6500B98066a28793C0059O9907k8155a62845k65193
9364d28038a22413k08221L6328Q2306k6099N4649I9810J16773b1991j83997j18791
9353c24779D32142a49916A60643m3513a71233p9106B75443b86768a35474k07852
9343c43326J49367i4765j9525l488L2302c6141k0003r1713A32693b06101j73238
$$ y = [109511, 251662, -97965, -164379, 111714, -245666, 117468, -219363, -506113, -124661, -57983, -2906, -108148, -8955, -15610, 73820, 183208, 91281, 59079, -47358, -348994, 160125, 75497, 250911, 90746, -98238, -120087, 100246, -33447, -83734, -129064, -47309, -236601, -42524, 103648, 76058, -308984, 191373, 28814, -335845, -155503, -199878, -34704, 280988, -87711, -138993, 187956, -318033, 109204, -277857, -16500, 298066, -128793, 30059, 99966, 71811, -162845, -428038, -122413, -330634, -294306, -212000, -238099, -183450, 99810, 216583, -21991, -205988, -324779, 432142, -149916, 160643, 117130, -171233, -250339, 275443, -286768, -135474, -343326, -193959, -94765, -114290, -117778, -85476, -36141, -56144, -147857, 132693, -206101, -379339]
9332c79339R7072g0757c4804r2357L9262J8189J9249F3448Q3307E072g3239L1523
9320d1716k59619h4977F4851d32669a11703I3909i9909k80444J46619A99662f0698
9308C3888f8790j72492e2622j22549A97983b39801g1440C9176J59904D720b05454
9296A34525a53829b564j90532Q9239B6349J83470a08444j6597B06379g5726C07058
9284a40702N468a7564n5935L3162k33433O6908h6012J6651J9289j21206b0124
9272I4687C0181a58927a6006B70533n9223c36979i5229m2803A37872d3660B25862
9260C336c30408H8865K52933c59673F0672i9700r8219O5582G5154a18093n6512
9249a74605A93370F4468e53488D3764c06977h5013l6303j94608o7846J02035K85
$$ y = [-379339, -282267, -70757, -34804, -127161, -87899, -69710, -50461, 63448, 146755, 5072, -73239, -41716, -301335, -84977, 64851, -432669, -111703, 93909, -99909, -380353, -233734, 199662, -60698, 33888, -68790, -241282, -52622, -175171, 197983, -239801, -71440, 39176, 199080, 4720, -205454, 134525, -153829, -2564, -193096, -103857, 26349, 209819, -108444, -125041, 206379, -75726, 307058, -140702, -135234, -17564, -73499, -40337, -273770, -206862, -86012, -69361, -50072, -171278, -20124, 94687, 30181, -158927, -16006, 270533, 211310, -336979, -95229, -138032, 137872, -43660, 225862, 3336, -330408, 88865, 341798, -359673, 60672, -99700, -197919, -132337, 75154, -118093, -174605, 193370, 64468, -553488, 43764, -306977, -85013, -121316, -315924, -383770, -281735, -281450]
9238b81450a32848k15289I3245g6739G2149b29127A26958J32951d8387p4487F8096
9226I656d5975l06393a67808G3138b0767k34410f3670C9259E236e7007J6572m08267
9214d48702h2838G1485b87443a15689K2354A18096a36246k97856I9193N2721b0221
9202A02390d4923A47478a79673E3628a7395D5167L60002j61462f765A23524f5741
9190c1011A9156b30650O0513M1198m9862o6031A30446g0753j42119c8650k74846
9179c13496J52683g946l07366A57744a14684H4649a37330a0420n1730D0728b06929
9167i6554j25046E0898n101c31038Q3849D01304A4002i4769m3227A33205a66447
9155b42100L8037J0068C8067c33785A03117l1382f1533B03166a34749e6192o9796
$$ y = [-281450, -132848, -348137, 93245, -76739, 72149, -229127, 126958, 259909, -48387, -122874, 68096, 9656, -45975, -352368, -167808, 73138, -20767, -255177, -63670, 39259, 5236, -57007, -40435, -448702, -82838, 71485, -287443, -115689, -93335, 118096, -136246, -434102, 99193, 151914, -20221, 102390, -44923, 147478, -179673, 53628, -17395, 45167, 405169, 243707, -6765, 123524, -65741, -31011, 19156, -230650, -170137, -128939, -178801, -244832, 130446, -70753, -212872, -38650, -313496, -160813, -7946, -315312, 157744, -114684, 84649, -137330, -10420, -62150, 40728, -206929, -96554, -221600, 50898, 45797, -331038, -247189, 401304, 14002, -94769, -137996, 133205, -166447, -242100, -204063, -193995, 38067, -333785, 103117, 71735, -61533, 203166, -134749, -56192, -125988]
9144a25988B5254e2369D0301a75898M59L6758f2264l7528l01577C10625n3558
9133B57067a28264d6176D1628J76798B7007b44911B21051a49110G414J40130a95276
9121A9563a40117A45220a0441F698P8909C9436J0832J73706a10884N1182a3421
9109A23540D4336N5544b02280b3792B40326a23803l4561E6779h9530F6146a11834
9097b42690J1872I9977m242K09717A42763L8554E435d0209G9969a59986B7615
9085a27620A02043a14072B01097a42728K5335C10363d94757J71552I9869a35478
9074d43955m2749b33753A9181B966c1670H3855c18062a08513B60613A6708L4420
9063E1128d96834h0399D8358b16468a03559j19062Q3305M2216k3596A82827a04122
$$ y = [-125988, 25254, -52369, 40301, -175898, -175439, -138681, -62264, -99792, -401369, 310625, 257067, -128264, -46176, 41628, 218426, 27007, -244911, 221051, -149110, 7414, 147544, -195276, 19563, -140117, 145220, -10441, 6698, 85607, 39436, 50268, 223974, -110884, -59702, -13421, 123540, 44336, 99880, -202280, -23792, 240326, -123803, -158364, 56779, -89530, 66146, -111834, -242690, -230818, 99977, 95735, 305452, 142763, 181317, 5435, -40209, 79969, -159986, 27615, -127620, 102043, -114072, 201097, -142728, -117393, 310363, -494757, -323205, 99869, -135478, -443955, -486704, -233753, 19181, 2966, -31670, 83855, -318062, -108513, 260613, 16708, 51128, -496834, -80399, 48358, -216468, -103559, -222621, -139316, -97100, -120696, 182827, -104122]
9051c31538A50717B4703b37515G1577Q4501m6050c15287a3664A7588J45191i8099
9039a69709g4071j12576H0794g6430j65542A08152N8372b68258f2435A09583J04164
9028B13747a28854j21899i817G8439a42829G3445a41072k78117A56455G0195A106
9016A7452M9006b87521j10430A70642K61835b39638D2515a92559B36378e9774
9005f1163l7758k3721j11752A39497a49390f836k35907k123A50763B3139K6075
8994D9214a96799b5795o9772k49810J69332c6238j31753j37452b9551k87158c0095
8982g680k6355j29043j61825A41168a3207A09417a55821A52353J77126e2454m5218
8971i7672D474b37073P7672j88278D3807J00895E7121a18873a1803n3831k78666
$$ y = [-331538, 150717, 24703, -237515, 71577, 156078, 110028, -315287, -13664, 17588, 162779, -98099, -169709, -74071, -186647, 80794, -76430, -241972, 108152, 166524, -268258, -62435, 109583, 213747, -128854, -250753, -9817, 78439, -142829, 73445, -141072, -419189, 156455, 70195, 1106, 17452, 66458, -287521, -397951, 170642, 432477, -239638, 42515, -192559, 236378, -59774, -61163, -98921, -122642, -234394, 139497, -149390, -6836, -242743, -244866, 150763, 23139, 49214, -196799, -25795, -95567, -345377, -176045, -36238, -167991, -305443, -29551, -316709, -30095, -7680, -34035, -163078, -324903, 141168, -13207, 109417, -155821, 152353, 329479, -52454, -97672, 4474, -237073, -159401, -347679, 43807, 144702, 57121, -118873, -11803, -65634, -344300]
8960c44300J20053J09777A83000a64051M0777A75180a54788n6276B0251c53880
8949b01235A01804a27109M573o759A5944g279R91E4207b06517G8984c4371k32377
8937b66748p9733R6058a0760j80236j50673J26702I9879J1954b82457M803J07215
8926a70439B0089L9140J65440F0048a24428e6959B8380a03186D7494a73519B41616
8914G9692O1452r113B8053J52888m0604N38383k56405O68944L68897J410356L056642
8903E927154P25548B934519j087823p89586l86887B65096d3263C63774F0749L0024
8893I0773N4289K49540j65358J09622A24502e8993i92o4048j90634A81833c7828
8881A80988a3433k2773A37259Q9021a8350j67693G5698c62401A30883J61732r2792
$$ y = [-344300, -224247, -114470, 183000, -164051, -123274, 175180, -154788, -211064, 20251, -353880, -201235, 101804, -127109, -122536, -129295, 15944, -7279, -6288, 54207, -206517, 78984, -34371, -266748, -346481, -250423, -10760, -190996, -341669, -214967, 99879, 111833, -282457, -277654, -170439, 20089, 59229, 224669, 60048, -124428, -56959, 28380, -103186, 47494, -173519, 241616, 79692, 141144, 132031, 28053, 180941, 140337, 678720, 422315, 1091259, 1460156, 2870512, 5927154, 6652702, 2934519, 1846696, 1057110, 670223, 265096, -43263, 363774, 60749, 90773, 145062, 394602, 229244, 338866, 124502, -58993, -992, -65040, -255674, 181833, -37828, 180988, -13433, -36206, 137259, 226280, -18350, -186043, 75698, -362401, 130883, 292615, 199823]
8870A99823N1481f2472J5149A80551b12453N0270m83734f2424A4175a40633O5580
8859g5053K6808A03687b2208o4210k8294A89537j4700a21810D9910J90809H8431
8847B6989B901K18531a966o8159a2938j07465L4078A7895O6268c0843k5956m38127
8835d94926a35126k0382A58037c04342L8536P9731N2466D4629b15047b4290j998
$$ y = [199823, 251304, -62472, -47323, 180551, -212453, -162183, -645917, -62424, 14175, -140633, -75053, -48245, 103687, -22208, -86418, -114712, 189537, 174837, -121810, 49910, 240719, 88431, 26989, 2901, 221432, -1966, -70125, -12938, -120403, -86325, 17895, 84163, -30843, -56799, -494926, -135126, -155508, 158037, -304342, -265806, -186075, -133609, 44629, -215047, -24290, -26288]
$$ [...]
##END NTUPLES=NMR SPECTRUM
##END=
