
##TITLE=AC1079_MACI01_5835926_jtKjstPYi0
##JCAMPDX= 6.0         $$ Bruker NMR JCAMP-DX V2.0
##DATA TYPE= NMR SPECTRUM
##DATA CLASS= NTUPLES
##ORIGIN= BRUKER
##OWNER= Administrator
$$ 1.72 TOPSPIN		Version 2.1
$$ 2012-04-16 19:09:48.531 -0500  Administrator@TOPSPIN
$$ Compression mode = diff/dup
##.OBSERVE FREQUENCY= 400.13188235
##.OBSERVE NUCLEUS= ^1H
##.ACQUISITION MODE= SIMULTANEOUS (DQD)
##.ACQUISITION SCHEME= undefined
##.AVERAGES= 8
##.DIGITISER RES= 22
##SPECTROMETER/DATA SYSTEM= spect
##.PULSE SEQUENCE= zg30
##.SOLVENT NAME= COFFEE_meoh
##.SHIFT REFERENCE= INTERNAL, COFFEE_meoh, 1, 14.98061
##AUDIT TRAIL= $$ (NUMBER, WHEN, WHO, WHERE, PROCESS, VERSION, WHAT)
$$ ##TITLE= Audit trail, TOPSPIN		Version 2.1
$$ ##JCAMPDX= 5.01
$$ ##ORIGIN= Bruker BioSpin GmbH
$$ ##OWNER= Administrator
$$ $$ C:\Bruker\TOPSPIN/data/COFFEE/nmr/AC1079_MACI01_5835926_jtKjstPYi0/20/pdata/1/auditp.txt
$$ ##AUDIT TRAIL=  $$ (NUMBER, WHEN, WHO, WHERE, PROCESS, VERSION, WHAT)
(   1,<2012-04-15 12:05:20.937 -0500>,<Administrator>,<TOPSPIN>,<go>,<TOPSPIN 2.1>,
      <created by zg
	started at 2012-04-15 12:04:14.343 -0500,
	POWCHK enabled, PULCHK disabled,
       configuration hash MD5:
       1A 1E CE 29 27 FD 77 03 67 4E F0 E3 C4 B2 CB 90
       data hash MD5: 64K
       82 7C D9 76 30 0B 21 58 AD 1B B2 A0 AE 33 05 19>)
(   2,<2012-04-15 12:05:23.562 -0500>,<Administrator>,<TOPSPIN>,<proc1d>,<TOPSPIN 2.1>,
      <Start of raw data processing
       efp LB = 0 FT_mod = 6 PKNL = 1 PHC0 = 0 PHC1 = 0 SI = 32K 
       data hash MD5: 32K
       C1 C5 EA 28 2B DA 82 ED 5D B8 21 5B A0 6F 15 B1>)
(   3,<2012-04-15 12:05:24.015 -0500>,<Administrator>,<TOPSPIN>,<proc1d>,<TOPSPIN 2.1>,
      <pk PHC0 = 215.0189 PHC1 = 0 
       data hash MD5: 32K
       15 51 42 74 77 E0 1B 02 1F 47 E0 22 96 7F C8 51>)
(   4,<2012-04-15 12:05:24.109 -0500>,<Administrator>,<TOPSPIN>,<proc1d>,<TOPSPIN 2.1>,
      <abs ABSG = 1 
       data hash MD5: 32K
       AC EE 13 BB 76 1C 77 BC 00 3E F4 57 B6 D7 BE 27>)
(   5,<2012-04-15 12:05:24.140 -0500>,<Administrator>,<TOPSPIN>,<proc1d>,<TOPSPIN 2.1>,
      <abs ABSG = 2 
       data hash MD5: 32K
       22 DE 94 0B CD FC 77 B1 76 E6 7E EF AF 12 3E 85>)
(   6,<2012-04-15 12:05:24.171 -0500>,<Administrator>,<TOPSPIN>,<proc1d>,<TOPSPIN 2.1>,
      <abs ABSG = 3 
       data hash MD5: 32K
       AC 01 5B 1B 9F BE 82 81 D6 EF A6 37 1C A1 70 BC>)
(   7,<2012-04-15 12:05:24.203 -0500>,<Administrator>,<TOPSPIN>,<proc1d>,<TOPSPIN 2.1>,
      <abs ABSG = 4 
       data hash MD5: 32K
       E6 DC 73 BB EE 0A 09 6D 4E B2 10 0E 8A 81 5C 00>)
(   8,<2012-04-15 12:05:24.218 -0500>,<Administrator>,<TOPSPIN>,<proc1d>,<TOPSPIN 2.1>,
      <abs ABSG = 5 
       data hash MD5: 32K
       A6 24 95 21 FF 83 70 E9 A0 C1 C0 C9 A0 E2 71 8A>)
(   9,<2012-04-15 12:05:27.921 -0500>,<Administrator>,<TOPSPIN>,<audit>,<TOPSPIN 2.1>,
      <user comment:
       ICON-NMR User ID: COFFEE
       data hash MD5: 32K
       A6 24 95 21 FF 83 70 E9 A0 C1 C0 C9 A0 E2 71 8A>)
$$ ##END=
$$ 
$$ [...]
##$TP= (0..7)
150 150 150 150 150 150 150 150
##$TP07= 0
##$TPNAME0= <>
##$TPNAME1= <>
##$TPNAME2= <>
##$TPNAME3= <>
##$TPNAME4= <>
##$TPNAME5= <>
##$TPNAME6= <>
##$TPNAME7= <>
##$TPOAL= (0..7)
0.5 0.5 0.5 0.5 0.5 0.5 0.5 0.5
##$TPOFFS= (0..7)
0 0 0 0 0 0 0 0
##$TUNHIN= 0
##$TUNHOUT= 0
##$TUNXOUT= 0
##$USERA1= <user>
##$USERA2= <user>
##$USERA3= <user>
##$USERA4= <user>
##$USERA5= <user>
##$V9= 5
##$VALIST= <valist>
##$VCLIST= <CCCCCCCCCCCCCCC>
##$VD= 0
##$VDLIST= <DDDDDDDDDDDDDDD>
##$VPLIST= <PPPPPPPPPPPPPPP>
##$VTLIST= <TTTTTTTTTTTTTTT>
##$WBST= 2048
##$WBSW= 25
##$XGAIN= (0..3)
0 0 0 0
##$XL= 0
##$YL= 0
##$YMAX_a= 501431
##$YMIN_a= -595350
##$ZGOPTNS= <>
##$ZL1= 120
##$ZL2= 120
##$ZL3= 120
##$ZL4= 120
##$ABSF1= 14.98061
##$ABSF2= -5.57192
##$ABSG= 5
##$ABSL= 3
##$ALPHA= 0
##$AQORDER= 0
##$ASSFAC= 0
##$ASSFACI= 0
##$ASSFACX= 0
##$ASSWID= 0
##$AUNMP= <proc_prof1d_extract_pilot.lims>
##$AXLEFT= 0
##$AXNAME= <>
##$AXNUC= <1H>
##$AXRIGHT= 0
##$AXTYPE= 0
##$AXUNIT= <>
##$AZFE= 0.1
##$AZFW= 0.1
##$BCFW= 0
##$BC_mod= 0
##$BYTORDP= 0
##$COROFFS= 0
##$CY= 15
##$DATMOD= 1
##$DC= 0
##$DFILT= <>
##$DTYPP= 0
##$F1P= 0
##$F2P= 0
##$FCOR= 0.5
##$FTSIZE= 32768
##$FT_mod= 6
##$GAMMA= 0
##$GB= 0
##$INTBC= 1
##$INTSCL= 1
##$ISEN= 128
##$LB= 0
##$LEV0= 0
##$LPBIN= 0
##$MAXI= 10000
##$MC2= 0
##$MEAN= 0
##$ME_mod= 0
##$MI= 0
##$NCOEF= 0
##$NC_proc= -8
##$NLEV= 6
##$NOISF1= 0
##$NOISF2= 0
##$NSP= 0
##$NTH_PI= 0
##$NZP= 0
##$OFFSET= 14.98061
##$PC= 1
##$PHC0= 215.0189
##$PHC1= 0
##$PH_mod= 1
##$PKNL= yes
##$PPARMOD= 0
##$PPDIAG= 0
##$PPIPTYP= 0
##$PPMPNUM= 2147483647
##$PPRESOL= 1
##$PSCAL= 4
##$PSIGN= 0
##$PYNMP= <proc.py>
##$REVERSE= no
##$SF= 400.13
##$SI= 32768
##$SIGF1= 0
##$SIGF2= 0
##$SINO= 400
##$SIOLD= 32768
##$SPECTYP= <>
##$SREGLST= <1H.CDCl3>
##$SSB= 0
##$STSI= 32768
##$STSR= 0
##$SW_p= 8223.68421052632
##$SYMM= 0
##$S_DEV= 0
##$TDeff= 65536
##$TDoff= 0
##$TI= <>
##$TILT= no
##$TM1= 0
##$TM2= 0
##$TOPLEV= 0
##$USERP1= <user>
##$USERP2= <user>
##$USERP3= <user>
##$USERP4= <user>
##$USERP5= <user>
##$WDW= 1
##$XDIM= 32768
##$YMAX_p= 464329764
##$YMIN_p= -789288
##$CURPLOT= <Network HP LaserJet P1505>
##$CURPRIN= <$Network HP LaserJet P1505>
##$DFORMAT= <normdp>
##$LAYOUT= <+/1D_H.xwp>
##$LFORMAT= <normlp>
##$PFORMAT= <normpl>
##$SURQMSG= 1
$$ End of Bruker specific parameters
$$ ---------------------------------
##NTUPLES= NMR SPECTRUM
##VAR_NAME=  FREQUENCY,     SPECTRUM/REAL,   SPECTRUM/IMAG
##SYMBOL=    X,             R,               I
##VAR_TYPE=  INDEPENDENT,   DEPENDENT,       DEPENDENT
##VAR_FORM=  AFFN,          ASDF,            ASDF
##VAR_DIM=   32768,         32768,           32768
##UNITS=     HZ,            ARBITRARY UNITS, ARBITRARY UNITS
##FACTOR=    0.250966925370066, 1,           1
##FIRST=     8223.43324360095, -246093,      44784
##LAST=      0,             76981,           -121552
##MIN=       0,             -789288,         0
##MAX=       8223.43324360095, 464329764,    0
$$ Real data points
##PAGE= N=1
##DATA TABLE= (X++(R..R)), XYDATA
$$ [...]
23775 70022 -11153 -255194 133215 6788 -54829 92249 -35025 -107218 -412973 -12062 28585
23763 -222813 10599 97220 99217 87957 -65447 135731 119807 -38883 61834 -123207 71837
23751 9371 -28901 94823 313262 -158264 -316077 -53133 182650 -34421 22801 154353 -75451
23739 129321 -111286 -142119 -144297 214464 249779 -55071 -78853 -133058 -75611 -171588 302744
23727 -317642 80298 250302 -366894 -189770 -357196 17623 257299 -11013 -201710 -90808
23716 82904 150902 44762 -14347 702 -123158 293272 -88095 48560 -114684 166914 -138326
23704 -58964 -199633 -213400 -314534 -268632 26169 -97036 226165 101539 -95934 -14022 -189745
23693 -189745 -148745 -94265 -63570 -345408 399609 -99659 211798 234953 -63552 -120112 28127
23681 -166919 -89133 210328 -35045 -206045 133684 -98295 -288378 36899 -85702 -140712 27018
23669 -216217 -163632 -174174 14035 232998 59789 42224 51479 276603 -170828 195218 -172726
23657 219210 42445 -111132 277975 380372 91231 130546 -453001 100681 105451 -94005 -51388
23646 -51388 357742 -51004 -17863 -137578 114110 309892 -12105 -589 204156 -311324 -156887
23635 -156887 -21623 179795 -321825 62531 -208875 -58689 -43831 -136505 174563 -62424 94443
23623 -116771 9791 73944 54424 -174889 69852 109583 117739 -222116 45740 -255344 -44566
23611 103814 46110 -99738 81124 -3334 -181286 -111295 12123 40304 156680 -11971 -113269
23600 -113269 -48596 299451 -9761 -108890 -156220 79747 278865 -136456 254787 23604 -150616
23588 -75027 316383 238623 -162857 391218 117735 -144458 70355 167072 33429 254984
23578 254984 64925 265058 199076 36251 -271215 343520 289171 -327811 -137737 25242
23567 -116307 -352840 195566 -55460 -148660 -53981 -310419 37949 98602 -111527 -52818 195105
23555 56095 63982 38243 22266 -185235 76689 56060 240520 -44950 -3366 -336397 154872
23543 -46344 -392468 -8612 -163061 207245 271131 78382 -241344 132282 117324 -94058 -30305
23531 -112370 259365 110095 -167052 -156249 -84233 162893 172249 -115913 -25060 -231717
23521 -231717 -87245 -358945 43050 -190472 69135 -368915 -577 154589 54237 -56820 -149844
23510 -149844 -108295 -109268 -46059 126595 -119721 6263 249112 -165534 -76422 76677 290423
23499 290423 -163016 -107042 -85823 -49783 33376 -139207 -95552 -59965 -188312 17528 12101
23488 12101 -110102 -147939 -272099 -169296 -207424 44395 55753 -70966 124667 65922 86479
23477 86479 -94819 289778 -53917 -210977 70186 -49492 -106055 -88289 207983 -144919 51685
23465 165125 -136086 56055 6749 171186 184372 -132702 -18644 216047 79153 -65063 -147486
23454 -147486 138330 -193735 7299 91553 117654 -21348 -180540 241454 9076 -564315 -156267
23442 -75612 257097 217996 -56935 59593 -41200 -63589 -15395 -175765 184113 124564 122166
23431 122166 -84570 -466185 204238 -156182 42198 239567 -187260 -54054 -130840 -137890 -101316
23420 -101316 -33451 -9313 -75253 -234929 175262 171120 119538 -176306 -222057 -305638 -92233
23408 -207065 -24285 82735 -155416 14218 -117164 39989 -205140 188550 -33608 300194
23397 167293 -50791 224966 -5889 -395426 -103276 96607 -58283 13630 130760 -170801 -96248
23386 -96248 55206 284546 17114 79833 185440 -207076 42743 55794 -46367 41650 -56659
23374 108387 -127714 -127918 59793 131754 -66961 -155964 -112487 323698 -51581 -307330 11218
23362 -241211 -222235 -92208 -116960 128807 141944 -7481 224796 -121556 -147738 -232220 177431
23350 34768 -74525 63325 -246016 -62364 -271196 86768 -126449 87708 63999 53855 -94827
23338 312320 159058 -64559 -242912 -3807 246119 -188839 -59816 -159318 8653 -102592 -41859
23326 215152 -121824 -15915 -40715 -75190 -51007 -100807 330624 -109468 -21846 194071 -448088
23314 7929 -185591 207798 181523 -207169 -121855 9984 257997 212814 261338 58476 -40441
23302 17252 193651 -379648 272265 -224338 -536076 318135 162332 -183653 -103482 -287950
23292 -287950 216998 -87000 -447584 177323 -89765 -229775 -141276 -175236 -157767 149847
23281 -18622 -58176 -1696 -199728 -135092 -26647 27485 89547 -68265 -331230 9805 47011 204692
23269 204692 149522 125230 -209113 -254180 -262191 -212653 92835 113245 -9057 -162727 227234
23257 -197579 34534 -202541 -279740 91500 38349 -171075 -139635 -91302 -47597 30760 -61068
23245 -143690 -119837 63444 -23842 7524 -45583 -193377 -114247 29437 -181877 -98137 -25727
23233 -87178 60508 5847 -44678 -207952 116401 -70169 -24275 -63643 -133290 324678 50100
23221 -240971 -245331 -223842 -200570 -262201 -126476 -18665 66929 -206689 -171288 118297 179311
23210 179311 -112760 -100324 -166473 -105363 181845 208146 -69520 -36730 142838 -101831 -154534
23199 -154534 -181335 -158103 92056 -32240 -270429 261813 7816 92096 -278228 -119699 -61300
23188 -61300 -246991 247000 -122522 127864 330937 -10924 256474 158360 -481084 -180489
23177 -26896 23444 -85361 -237366 -54771 -49586 -202042 -304144 -52892 244520 -226367 -221620
23166 -221620 -322721 327019 -165213 -148891 208780 -141694 125370 -252923 80033 -80745
23155 -15853 -11966 157074 -259947 31666 5509 52772 63127 77518 20576 298579 119325
23143 -260714 77662 -157691 -135101 -433198 -250359 -127594 267824 204733 -33325 200041
23132 -221386 -4650 -106563 123903 -47969 -37285 229744 185135 276148 -209356 -139608 289883
23120 -155984 -88638 243581 62606 270804 150915 -361768 -29928 114391 69635 -177757
23109 414709 123904 -49407 80747 91251 -87777 -118491 -182180 -25593 -259917 -43454 -283724
23098 -283724 41129 84412 44998 142846 -321024 -120814 114000 257000 184235 371162
23088 371162 -134322 385686 183193 104324 59946 256415 -17353 186622 -29002 61485
23077 -46892 137563 -238219 -125285 -149658 197955 -194600 522 -47666 -206752 -421731 -430300
23066 -430300 -68235 -270612 -268534 -143229 -119206 -102577 -176467 112609 -63834 -134620 249899
23054 131519 12672 51605 -23411 -87597 -13815 -32007 -222754 -42331 -113736 242597 73784
23042 -366538 86701 215083 -235798 33012 181194 137173 -35456 95006 -136658 -240991
23032 -240991 219513 16742 318761 153131 -201414 -317221 -143233 -223686 -129056 -45713
23021 -10152 15563 21123 320253 117452 -30071 76446 127495 -20168 250002 387980 -87510
23009 -219072 25338 -320978 45904 73463 -190441 -10134 37687 -50162 -287470 -87984 -232301
22998 -232301 -228837 93337 -205331 70460 120462 -176778 40150 -30823 -85959 -297197 260010
22986 221326 64758 184632 -85173 134293 17529 120171 -207295 -43549 77812 16514 52231
22975 52231 145430 -107365 160890 132154 -184225 -183772 45297 -79212 -228132 280396 -258446
22963 -108365 -144689 -110784 -37983 -59443 -215446 -122493 -81478 -119074 -63196 -70675 108854
22951 86556 14140 227577 80360 114793 -83870 39999 111149 -65510 -99317 -89355 -280997
22940 -280997 190113 -113687 273849 -183383 -110926 -13563 -100959 -33761 24009 -108143
22929 -188724 150646 78724 -34505 49328 31631 -98724 -208040 108416 -63111 48257 -60101
22917 -269490 327766 217020 51382 -103537 20105 78847 95088 89574 111995 -273071 -186168
22906 -186168 -200701 109910 75326 150591 64692 -1887 -112910 -318888 -177082 -190969 10872
22894 -231143 -31010 -81203 167072 45917 -123949 16228 95432 150218 -153060 260905 -4334
22882 -78194 23825 -125392 -251000 -13568 14167 -104572 476136 -37339 -109037 -22065 -8619
22870 -166282 159533 247077 -65465 -246527 317148 14155 -258988 103654 -92738 -153132
22860 -153132 -164453 -24591 -95408 13732 121303 108519 -38763 -50741 153594 -187029 -142337
22849 -142337 80951 -43051 -306638 -303008 -30402 51750 -318447 -13280 -160950 233723 -139236
22837 -212933 143602 -2952 -93446 -10455 30360 -95092 -176100 41575 -304398 -310479 -118457
22825 259786 -10102 -247424 -126294 -24232 211403 36257 -92350 -24570 157200 145692 85772
22814 85772 -34542 151242 49888 -89498 97557 -187172 -49 55813 -264632 127015 156182
22803 156182 98178 60614 107989 -243044 -202533 -229599 30953 -105997 -112509 60681 -53315
22791 -63964 43809 109856 -175071 -136610 -7713 189340 -221506 -96167 -10996 64476 -157855
22779 152589 8781 -180903 308730 -35522 28892 -83327 85195 -58717 -88677 173639 -206356
22767 23637 -415884 -93056 186810 -110721 -27329 -281160 -7399 -145994 -132103 -163084 -408986
22756 -408986 315481 -64569 -82785 -364686 -230031 -268933 145186 211784 -192564 -91996
22745 82575 -107918 19365 115130 276233 70635 -331774 -207203 188096 110297 8022 -263616
22733 -42185 -300051 -90004 3827 -32455 101852 -284987 -250950 -102680 22533 -30708 -35732
22722 -35732 -173557 38858 -128308 -2729 -218713 40921 -75186 -84143 -129264 -30446 -92554
22711 -92554 -193682 -187495 -130650 -194926 -320294 -97327 267667 -108382 -161188 -117725 241078
22699 123140 96222 -156527 33980 -16396 132 141890 -329955 55226 -45219 -39580 -77817
22688 -77817 -240652 -44581 132652 -112126 -152487 -82534 -179574 -129241 149196 -18699 -218205
22677 -218205 81991 -122402 89873 -82312 28524 -24214 298773 41346 66466 -43364 -50210
22666 -50210 229171 50285 51929 -229984 -134688 120135 132314 -174590 -195089 -19240 -219655
22655 -219655 23345 100033 5267 -217212 -107609 140813 -7816 -57171 151572 -224201 -169328
22644 -169328 -172234 -210066 -20390 76078 399465 51523 204118 -103251 7568 105639 107868
22633 107868 -96842 292167 -191508 751 159615 -79674 -368085 6969 -316911 92051 13514
22621 788 -178410 -185087 -18602 -103917 170558 -327865 303697 9412 -184931 9882 -169768
22609 796 226042 21207 -144215 257359 -215967 -126417 77765 538 118497 -195416 79741
22597 -151043 -88372 261361 189966 -233099 -11377 -2779 -101621 -87634 296814 -62077 38796
22585 248456 -1197 -120057 416769 -65580 -22238 46944 -142163 272126 -14100 288767 -236755
22573 141929 -311043 362867 245051 -106298 59614 -95770 -300987 -195 60485 -278382 -71669
22561 -96414 101528 -8849 -32940 -57025 146358 9313 -254684 -146094 -188741 -99829 -197873
22550 -197873 -109257 -55732 167738 -133792 17052 -384712 221943 -258750 43447 -71949
22539 -377972 125472 -79525 -381070 -47165 -191219 -235555 -87599 -181867 14328 -52330 -135209
22528 -135209 37698 -285097 187885 -145523 -158933 -151391 -336545 -212634 -189776 -23818 -112967
22517 -112967 -65981 4168 24811 86441 -261886 -55164 -452066 -77074 188288 67637 -145998
22505 27672 66057 29344 -461294 -188693 -230440 -163232 -380585 -120344 -76601 -157432 -228797
22494 -228797 -92933 253438 -177321 -46228 19515 32322 -127239 -170047 29870 61776 -170823
22482 -31198 -161666 103656 6920 -160599 280647 -21940 -242311 210367 -45109 322794
22471 -654753 126427 -26874 -368160 -110390 -1767 210834 -11611 -65287 95305 365930 42866
22459 64737 52915 -142023 203585 -225633 -404168 -122254 105665 -162341 -28174 -63061
22449 -63061 92860 7373 44985 135627 -233024 -348335 -74895 -416500 -60311 -46328 148675
22437 88278 -125958 -49147 16215 129267 107995 -54094 -50176 36730 395238 -11478 116928
22425 10237 -70693 116253 -59143 -223704 96493 7999 112610 -4968 -198348 -283296 -151993
22414 -151993 -47164 -360552 -227367 52282 92019 -27385 -10882 -56255 -55170 -113242 -99980
22403 -99980 142625 161053 -52346 152138 -127034 44442 -21661 188621 -165088 271829
22392 110316 -234857 -133683 -43895 3308 -69860 123609 5535 -434193 -58977 49282 -117720
22380 -358727 -364730 -82702 -85629 105760 -51941 22722 153452 -36881 307663 -75471 38799
22368 -195846 -252196 -501916 -77957 -49877 77428 221432 -357581 46040 -100466 -50407 134617
22356 -408526 175048 -343220 -323093 -392781 -184712 -291949 -133839 -67093 -140128 -264453
22346 -264453 -138196 99370 46077 -174658 62151 110496 -116020 214386 -274842 -47017
22335 -14362 -195623 -305413 -120664 -42628 -34688 -37132 -49979 117104 -211908 -25886 -100545
22324 -100545 -66744 -67035 -26698 -384449 69529 398 -79888 -181321 -237499 -114201 80189 47957
22312 47957 -289565 -15101 -147731 -113223 -341941 -66898 -187551 -81471 56953 205338 36102
22300 -103697 -251644 -133085 145374 -376421 -26060 19291 -271219 8006 25932 -196826
22289 384289 -68000 -19729 -223969 27160 268417 -276398 109385 32245 36419 -91429 138811
22277 -51244 305131 27826 -58557 87214 -78903 130292 -385179 -151445 -105532 -315506 -245581
22266 -245581 -226909 422865 -271143 -163664 -31983 175716 429471 -245590 -129155 -327360
22256 -327360 -213598 138428 99080 -30367 -70776 56605 -370976 172124 122195 86130 -265306
22244 -141864 98569 20068 -28886 3126 67147 -117288 72240 -290362 -184353 229783 189908
22233 189908 -273065 -11309 349799 -27182 -124023 -196172 -242765 52319 -118289 -99302 39829
22221 259393 6222 -81266 -18995 167267 -261659 -10291 187552 -89253 189440 -160454 -202246
22210 -202246 -320665 -180398 67735 -96422 -156595 16550 -25259 131258 -156824 247387
22199 182632 -271157 150168 24509 -83006 -275254 369491 -19605 -33732 -99594 -153493 101438
22187 28933 -131047 186280 105521 -205905 113669 164982 116771 -319124 260747 -35733
22176 -207524 80388 -219364 -94017 160268 79317 -263785 159711 -339477 -217405 112840
22165 -233373 -88450 -301035 192236 208822 -19712 -45634 291077 26852 79125 111122 -111167
22153 206134 -188496 -161464 82052 -168597 -189993 -149831 -293189 -140811 222753 96408
22142 -310747 -21886 -412970 -138460 -101249 38791 77607 -190500 38380 -49129 -148232 22187
22130 127631 18257 -300071 12063 80779 139333 -196043 168340 -270752 -89826 -199618
22120 -199618 -314035 17357 -123501 -97466 -25010 14205 27297 70956 12336 -77230 1002
22108 -141110 -166829 -507258 118659 -196016 -270501 -118299 144825 -115725 -121923 68192
22097 53921 142718 -135783 276562 -396325 -64841 305144 -289149 -27641 -170166 -127323
22087 -127323 -255202 -334821 457426 -168133 -12770 166862 -381003 153764 137820 409524
22077 409524 -17775 -52928 73635 -102926 320542 106931 -152810 -6749 -83929 -138937 42076
22065 -89228 45570 175727 -323319 -28988 -142281 14033 58128 -48838 -284210 41140 -123285
22053 87286 -95528 -123193 149170 -401805 -204753 9413 -68799 466396 -417161 30615 -277102
22041 -289634 -229064 -157760 -86386 -131610 -82225 180919 50135 62380 -230527 -438503 101149
22029 -356209 74129 -32237 -177924 253416 162389 -270587 249732 -35801 -377248 -15033
22018 -137515 178601 -40944 -180774 39094 36823 12126 -123602 145228 -340887 27171 -60777
22006 -70907 -21517 305369 76035 -76072 3479 76536 -26885 99134 -197014 -223232 61289
21994 -617100 -301720 -251570 -55547 -110707 -308985 -276191 -85668 -291982 140840 184797 -48069
21982 11183 52022 -166419 168989 346431 203716 101872 -45977 -413757 151818 70751
21971 37505 -85990 -37900 -163746 -74739 46331 75136 105288 -188186 -130164 163501 -45721
21959 -65811 -31828 291724 17073 -379669 80198 23260 -240051 100770 -257210 -96871 13792
21947 -209493 139535 -165277 125800 -110940 64297 -121473 -104572 -360770 -305869 98509
21936 -158779 100736 414684 -102354 -98812 131239 -16941 62458 -33594 -15085 66463 42943
21925 42943 -147988 241846 405371 51847 -241895 -90180 -131359 -321122 77427 -16079 266611
21913 196912 -36648 -359410 -496297 -171304 57843 -255809 -228922 19119 -112726 -345072
21903 -345072 -425851 -189514 -188957 20343 -134707 389465 -184378 -312221 -235298 -308832 -136219
21891 -29417 147479 73305 -124220 -141000 331570 -447329 58865 -136697 -48760 -202635
21881 -202635 -153744 112358 26818 224030 20549 -62368 -408803 -187841 -333447 45937
21870 -630 222586 11664 -134834 -47331 595 -25835 -178236 -3094 -4637 -15631 -237987 49255
21857 166225 -197821 -96906 -100552 -258474 -207116 -28556 19867 166822 -22557 -59105 -10349
21845 87719 -164278 -267138 125705 284550 53789 298674 -14403 217457 178024 -155708
21834 72978 279024 103105 -88758 57649 -310274 -130759 40165 -162713 -110677 24490 162060
21823 162060 -379110 298171 -260693 -44346 -18818 95978 -320908 -494253 77821 110963
21813 110963 89592 -190674 -264194 -88729 99239 50702 -120356 120844 50317 -99292 -88125
21802 -88125 53400 -143701 -15935 308043 29613 83119 39211 -74312 -15723 -15363 -216487
21791 -216487 -4357 15781 67653 45477 -93 -20810 -64926 54388 92423 -69572 48572 7550
21778 -18266 88526 -46417 12177 120773 -61441 137095 -146766 -208577 45615 55988 47684
21767 47684 -183161 20065 -88016 -26473 -80736 -278550 -329273 -303379 75794 -57892 -110442
21756 -110442 -182350 175669 -100494 28999 49303 -63931 -5897 225849 55736 98347 140828
21745 140828 -121487 -166326 -35696 -31854 19268 59861 167286 -79236 -280735 -330837 -67406
21733 96593 14116 -292291 -213353 -223514 -129513 88128 -132914 -155304 -10485 51081 -76391
21721 -32336 1823 49280 123047 -62588 -270460 73302 149419 -252578 -66238 179094 -222116
21709 -224355 132689 -310738 -114320 -168547 36185 47876 77646 94164 168538 -38399 -82651
21698 -82651 -55050 -119255 -83292 -125800 -277473 -384209 -72242 90610 56763 15624 -516 -369760
21686 -369760 -45463 -219375 -470 223881 74388 -282278 175607 141024 6348 255958 138127
21675 138127 -66326 -16197 215755 205856 -282939 275404 248527 -168467 -232342 -122559 201490
21663 92033 -64628 -11278 -96886 -61683 15514 -291423 208786 -245565 -124680 33587 -432439
21651 95916 309931 4910 -20997 -75142 142711 82245 857 -48088 93194 83770 159308 10487
21638 20088 -437994 -132025 261473 193760 -150162 -33897 -8820 37320 36684 -182759 179276
21626 -197250 -130513 67180 -289838 -102708 -155669 136216 -206683 -52560 -81080 -82439 -211959
21615 -211959 -14407 -53788 -263402 -44695 -390976 -248883 96139 -194003 -37855 -229283
21605 -229283 170372 62048 -145619 -290675 -41324 140232 -258378 -352442 2998 -66409 -88064
21594 -88064 -125747 41426 66485 -67068 15565 -56483 -161967 -424632 130258 -276275 -146616
21583 -146616 162208 280344 101457 -149446 -202081 215995 84984 -183653 136037 2795
21572 -93816 137434 -27124 252305 49748 53381 -104040 -84993 -12554 69585 -100048 359324
21560 -338617 -82860 -148125 35395 -55093 -295393 -172218 -8578 -197360 -119461 -262108 -197236
21549 -197236 -288773 -217053 -54491 -31782 140595 -164924 52689 -249190 -7811 -48159 -283162
21538 -283162 25394 -163824 139900 127730 -403272 -61357 46499 -271747 -96952 -277537
21528 -277537 -56601 -226969 -113526 24479 -164151 95353 160234 28734 192061 -186483
21517 40360 242072 147738 -208911 133539 -48346 -351775 -55893 57737 -199071 -88106 -150437
21506 -150437 -133228 -216388 24788 -55493 -88329 -154759 79734 -214318 -212474 138115 204626
21495 204626 -160549 -138030 -322546 -141774 -116363 -165578 -354776 10777 131440 -202008
21484 69616 -2086 -134806 -282630 -299834 267433 -49402 -361799 112885 420140 -15334 192573
21472 -142403 179804 -90083 -216985 -81514 202409 -193670 -31389 426933 113714 329376
21462 329376 108912 40598 -141947 -130732 -199854 61613 -219339 -57164 -172476 33302 -132694
21450 -68665 -162723 153528 -21660 -219294 329941 90695 -42224 -139703 239176 124925 319235
21439 319235 -84461 -243046 -32315 -47325 75870 -226969 -321459 14305 40991 203853 103748
21428 103748 -44540 -247282 106899 -178210 309498 436684 377425 46633 459932 167528
21417 51768 -83758 45411 -84231 114441 28443 -59636 228521 284323 -216871 -137233 230427
21405 109784 -162243 -190327 -356029 -167116 -81869 -280354 -218878 -176285 121896 -60361
21394 144025 -246575 208007 -113613 -324685 49230 -232864 145809 -120619 -152668 -124070
21384 -124070 37449 118703 -199905 -62025 -117626 -158908 40209 -204283 37952 -424420 -106080
21372 57952 205568 -17091 -65472 12101 -81442 -489121 80340 6726 207267 38820 -21199
21360 -246936 -11326 -148590 147487 -62785 39503 33026 -13449 211416 -131343 33678 -200356
21348 204390 39383 30812 167375 67944 -320251 137704 99277 -60728 92821 -249240 167939
21336 -295845 -75389 138044 -9789 56465 -62118 -24529 -59474 -305886 136198 -110363 30083
21324 146809 -137687 39441 316350 -163179 -340491 -300865 189101 331807 -263877 162345
21313 106992 19587 57560 -253458 -160672 -330945 126666 -288729 35314 -51637 -309503
21303 -309503 -100090 -197099 -275758 -79370 -176233 134925 -172163 -202927 -66086 -118435 -180627
21292 -180627 -310057 -237830 -160939 -163912 -8075 109393 -82588 -2407 227100 79192 -204336
21280 17154 -373318 106587 -92562 -339393 46113 -10557 -152653 -57251 -267141 63751 -98116
21268 118530 20831 -411876 -110457 119004 -35350 -181320 -22438 113514 -46807 -306735
21258 -306735 -297678 39381 -290516 181283 -218244 -77000 -122986 61295 102898 -264098 -109128
21246 -74881 -37123 -261692 81299 25625 229849 -180406 81755 -168638 189550 150486 -186133
21234 -119548 -166483 2693 -158719 -393803 -191250 55597 104219 87037 126532 -65643 -43293
21223 -43293 61769 -73131 -21839 -1182 -4515 -313913 11164 126760 -91877 145094 -136138
21211 124219 129062 -87465 8334 -282848 -158506 -93331 -69145 216545 -115866 -58863 -29381
21199 -4076 -58085 119782 -108119 134461 -133246 -189472 -297425 -156015 -152796 25798 -92908
21187 62523 -247571 -250669 -95420 -146094 -251588 -147368 -30506 -198221 -118619 6154 90324
21176 90324 -51580 -170221 219203 50460 -83870 154988 -70271 206547 53781 10378 160245
21165 160245 -173647 246277 -78660 -132459 131140 -87841 205548 45341 -199119 30406
21154 -193378 -97560 -44322 -170972 -124082 -58932 -193212 14246 297992 91850 -15322 -13526
21143 -13526 125116 -352383 21196 32653 261168 133191 -217791 -22016 118590 70242
21133 70242 -133946 -66173 -277808 96800 -178285 -28766 180011 -204516 139320 154517
21123 154517 -184213 -134749 -117777 104080 -55833 170500 -139067 10656 -140040 -261982
21113 -261982 -111081 32264 128722 -21668 -56144 -218878 21013 -10742 -240339 -222834 -108438
21101 124962 -66944 231020 -356795 -92503 -247978 60881 -464758 -160453 -129524 -287957
21091 -287957 -480310 -294698 10067 -47248 -21973 -375366 46589 -250311 59741 119996 -142077
21079 245635 49119 -100315 143508 207787 -44625 -247751 -158711 -257115 58625 -203801 108572
21067 -51447 72364 29729 -6887 -108898 -249887 -250112 -388097 355673 132438 7071 -149702
21055 -347767 -304265 58264 176810 76665 -159379 33075 78335 172474 -71876 90084 136566
21044 136566 38127 120324 70 224700 54933 -262091 147165 -258164 -190523 -121921 114633
21032 -2007 94741 287931 158046 219487 -12972 122031 -165216 112394 -300775 -114829
21021 -326048 103938 131181 -128639 59032 -156459 220796 267981 -113019 -158673 48607
21010 -141861 210628 -112620 -265662 -197945 -222565 -128381 -156877 69165 -185264 349746
20999 98781 215118 -251180 171803 -324812 -200404 66560 214718 391857 242400 46776
20988 90480 43769 -11586 -26004 138660 -318756 -228250 -323113 -13106 11148 179594 -234159
20976 84180 34887 121781 4829 -244135 -76444 -99021 -35417 -53160 -173130 235880 -775 -118879
20964 -118879 10392 -189275 85216 50174 16823 -130930 -325111 -103777 -188268 2005 46527
20953 46527 67330 -52532 -102945 88939 164796 33693 130777 135312 420298 -357053 -45347
20941 -96428 -77988 -92118 26528 -126374 2533 -169892 329456 -8489 287010 104521 215380
20930 215380 -69926 363528 519769 277140 261188 380049 -236222 310 247720 117069
20919 122956 -83962 151018 67885 -169936 -36405 -278667 -36511 -63186 -8911 279296 185527
20908 185527 -167060 -385285 -248999 46008 209477 -179354 -375475 -64515 118636 -36490
20897 8976 -186736 142456 -66446 67500 -250097 -244996 -232962 350235 6869 -58755 129650
20885 -129466 -87093 277601 -73470 51560 -123451 -118273 -94848 58877 -19496 62464 -214814
20873 -161610 116019 -298298 -178837 -162526 192625 -84268 -237077 -12953 -248872 -41146
20862 56955 120600 -40778 -267067 -297119 -198143 -176900 -119221 -185380 160033 133066 64217
20850 172051 -89895 -290448 -245394 -285402 -119173 -159565 280667 -159502 -123515 -4543 -50033
20839 -50033 -64902 164709 77801 -95314 -25370 21511 -100849 4925 145212 -140797 115765
20827 -155201 -37582 -189194 -218496 251103 59490 -68713 48387 -495511 170019 74641 63777
20816 63777 153661 -61165 32738 49359 146024 -8017 -62683 -114563 -96641 -207178 -97669 -478404
20804 -478404 -126463 -96548 -81506 -332635 -394648 -51919 58660 127025 140546 14148 -471982
20792 -182784 -179114 491438 85518 44989 -12801 -329672 9368 -139244 84153 115971 182706
20781 182706 -210542 -252077 -103975 -31079 -41753 -80389 -70786 -164148 110478 -49694 -283774
20770 -283774 252802 -243791 196268 -58600 -131665 -48333 60775 -104157 51668 3209 27510
20759 27510 10817 -26302 -244301 -37588 -135055 -67642 -40042 -150509 -171138 -556527 -126268
20747 188299 -186660 -248144 191051 -77786 -15294 70730 -47147 120136 -122572 -210827 -35466
20735 15794 -226910 -168170 -420154 -311416 4594 87787 249183 1508 -47560 -259755 -172486
20724 -172486 -11312 -64563 230305 91327 -736310 -157073 -100420 247143 3877 -80995 18219
20712 -348221 114945 -113276 -12736 -157204 -119154 -228499 21367 -136095 -25234 10940
20701 -122811 -157152 -214102 -301461 165065 146760 -234008 -193281 -181874 210919 -8297 121125
20689 -210901 264073 -232129 15741 110350 143262 -102769 -52526 34253 49901 -487330 -55506
20677 -312315 -181202 -400668 -233204 25567 -80714 107923 -150705 -201300 72134 134762
20667 134762 83924 -145176 53362 -101114 4980 -106582 -103264 -233958 -65250 -125536 -20296
20655 -216018 25672 -17816 72611 -293931 -231220 -7687 -186650 -375805 257724 103531 -195177
20643 -122702 -76524 -36750 -192269 -20484 -15407 30831 -134441 57558 22956 108068 59898
20632 59898 -113578 122032 -232352 19159 18589 -4983 -155282 -230006 -253919 321885 -304623
20620 -122466 -114712 -37326 170186 -10628 -189129 -171944 -214192 -112054 6896 -139141 57231
20608 -92502 -1597 67309 -367141 -176374 -291836 -52808 229899 234635 -60520 -367926 -181805
20596 -175157 -103314 211846 -92574 148561 -43256 -173172 -20534 -284266 -38851 217906
20585 -146479 -406647 143617 -73874 21551 -97395 65069 105354 11649 60553 35702 -70812
20573 -108846 -24734 -244674 -157503 -30280 -210560 -128941 -44141 160010 -150257 -76369 227542
20561 -86257 168084 66508 -163935 4394 -42823 11147 170865 82345 152111 131628 -25577
20549 -112149 -169672 -67533 -311591 62342 -134927 -244096 -367649 61364 11147 -397931
20538 -44776 90208 256082 -115039 108636 -167183 -244270 -40577 202612 171889 -118693
20527 -460573 33268 14250 125370 -240233 -265851 -69907 46190 -146322 -36012 -416606 -106499
20515 -318810 -190273 -121216 124690 49818 -103550 -363252 -32082 -289882 3762 -34197 80707
20503 -198688 -266072 -424234 -249391 -576859 122783 260192 -436763 93275 115314 -361476
20492 -114322 -93630 -376129 -22676 95109 -245084 83389 17208 -21057 -232911 -99722 150950
20480 -151653 -146427 119193 -288401 -103742 64642 4314 -1159 -99194 -392096 31909 93041
20469 93041 141486 -442463 -210949 -131939 -219503 -99417 -106718 -244991 193974 -53107 -20710
20457 160724 61905 89998 -317107 -344927 197396 65859 7234 -95402 327395 -175923 26181
20445 229415 248180 298279 38580 66178 -109664 -24609 8949 61218 233649 225062 16559
20433 -38855 44154 -503538 70761 7113 101418 106194 -211218 -336613 10383 123296 -210678
20421 -307751 149776 55232 -39517 -219146 -113616 -223757 -64871 -36771 -177050 136828
20410 221440 -172832 -192044 -256772 128061 -28435 -185208 25992 66543 34348 62425 48542
20399 48542 25571 -233995 19829 -53532 -308344 206172 -93350 -102289 17439 90906 119786
20388 119786 -213228 -296998 -300003 -95892 47235 223470 -58910 67531 -35188 -297689 -402872
20377 -402872 -53808 -248269 -129546 138826 -310911 -134312 224647 -357469 -70587 131395
20366 -73527 -235368 -127507 -268521 -212223 50672 188303 85248 -295627 -102379 -74014
20356 -74014 -332427 -45364 703 -288778 82861 156030 -224345 -97616 320563 78221 91371
20345 91371 150043 16415 -31588 -187638 -224802 298972 -162910 86749 -339741 -100832 -154176
20334 -154176 20102 -22417 351285 -128829 -73277 -281630 -14860 -50126 -228934 172396
20323 96552 -98277 -48577 -30717 187961 -415582 238394 68319 -287627 -289996 -109369 -30886
20311 -49476 -142764 -102689 -104626 70747 -88834 -326553 -277516 431545 -182145 -112370 55671
20299 -171811 44721 -294248 144543 76665 -127950 -116305 -131082 -18550 50062 -228180 -213666
20288 -213666 -286911 -7606 171218 -297870 186151 -7386 -7451 -20787 339558 -215722 55720
20276 -33981 73616 -7868 181558 -229420 -146817 -21535 -278955 -55464 -182536 -92547 -160588
20265 -160588 238719 -252381 -196901 -239438 -135709 110028 -205752 -18111 53310 -4870 -128298
20254 -128298 -71888 -70097 -173559 -66625 -108716 56790 -103184 28497 -462926 -234417 -141840
20243 -141840 -450732 -21881 -11315 120586 -64399 -312697 101573 242368 -96838 -130910
20233 -130910 71273 -153190 137910 199500 37929 -199826 -210924 -381699 -339178 141716
20222 -249291 -175726 -108844 -28450 2514 -375457 -2986 -99796 50375 -55646 -11090 131408
20210 -302561 -220415 -218759 -24669 3647 -71982 -69686 257806 296257 57134 -28812 -144030 -219774
20198 -219774 -237032 -231332 22953 -141976 143500 -106183 -45265 -178862 427021 274363
20188 274363 -308854 -244516 -13589 -123873 141649 -283586 -123895 -51355 322867 -160358
20177 -37930 -19189 379971 320958 -119643 147364 314568 117099 191921 -113115 215658
20166 -191188 58049 -81505 175314 182859 49425 -121166 -127425 42917 -139205 14850 304377
20155 304377 17448 -178415 103187 -240858 5081 -153628 -163549 -138612 17711 110620 219496
20144 219496 -1444 -493839 -163651 111495 -165332 109853 -25816 243127 289945 188442
20134 188442 96827 369069 234653 66035 275574 251678 436490 177103 324255 381778
20124 381778 322864 134369 499309 375300 304187 242298 56692 -142207 -54440 368786
20113 240241 -117063 46537 280296 -35296 -96090 24396 -65275 38916 75465 26108 -238136
20101 191886 -97224 214012 153666 96502 -76125 46962 -166568 141870 -332680 70829 -152779
20089 -36816 -164896 -301805 -52485 -73216 -93308 220493 -247051 -438735 111967 95601
20079 95601 -63120 -180444 -116355 12019 -189153 -8373 -107706 -16619 64625 168207 56723
20067 -277512 10324 -173867 226893 7505 21035 -342557 -360694 -50707 -65121 28887 259955
20056 259955 180647 41737 28416 -380416 145016 -374080 97893 315863 -254937 -193947
20046 -193947 -386139 -345674 -153738 43308 -117287 197357 79361 -211284 -2889 -50898 92194
20034 145881 -69818 -74425 193832 -80295 -171148 316449 -64134 -336483 -52531 -335316 -289039
20023 -289039 74731 91241 -107984 -393010 -144077 -209710 -72460 -175641 -31836 -341475
20013 -341475 -225261 73162 -70588 -117581 -141395 -37927 -149823 134152 -78753 -150417 -152251
20002 -152251 -281996 233369 -47345 -74363 -340513 -519916 -276832 -15177 -217629 104314
19991 -287908 140030 -146773 42735 165127 56403 -83623 16399 182975 -351399 173722
19980 -45400 576668 -168769 162230 12280 -12984 205117 -26427 -8860 -117404 353507 38610
19968 84511 -122376 211054 -70730 342232 385497 -273704 -143036 108676 -1376 214532
19957 148450 2945 260878 -296338 155279 -141412 117595 -181655 293705 214767 51776
19946 33328 165412 -14161 141255 -50321 13865 23110 301925 67464 237646 -14071 285758
19934 300845 -321823 187384 145899 110 8712 -231874 -206745 91839 -143281 -132905 106301
19922 -145358 157590 -219415 -13497 -9523 138907 428978 34584 -339445 -331 -104928 26933
19910 -161720 140477 -163994 -53089 -109186 9190 -343192 -357072 -176631 -103920 154383 88883
19899 88883 -169168 201100 103234 -70145 -60501 -227217 -174790 104313 -20965 -284149 188803
19887 -138859 -225512 128118 -155767 -199185 154388 141481 188229 -232089 50910 56079 -12152
19875 -181423 -8139 -118654 92554 -169162 -403548 -106454 -75334 34442 60676 -126059 -134109
19864 -134109 203988 -401999 -48794 21410 -212435 -172154 -326432 148735 102871 168030
19854 168030 152137 20554 -43297 110977 -31985 -242338 -261929 -178476 62050 -13680 90692
19842 -68031 -201660 -32921 317852 -93700 -256970 -18554 -93407 -132671 -444703 -267229 -142524
19831 -142524 40501 -197109 7756 -242262 -82606 -266253 225427 -104762 -7868 62264 -93850
19819 81260 -167568 69650 130333 214454 -15508 -251566 -23730 -171187 161849 -142897 115061
19807 -12647 -214572 185833 119131 -58127 -190319 -148648 -74401 -194253 39218 -81631 -146095
19796 -146095 -152366 74982 -260306 -58875 -180996 31442 4864 45279 -56328 -152251 -178856
19785 -178856 -243736 -305618 -92133 -202710 -182274 -208886 -465692 -44488 -234584 56600 -213588
19773 9928 100513 8741 32019 -53776 -477124 337335 -171704 -135121 159718 -78654 -219680
19762 -219680 -198331 55636 -367390 236446 -313349 -221154 -99937 -50591 -280291 229547
19751 -25779 -274033 -442036 -344756 -131467 -213987 -194523 -104077 231353 -188163 -244477 -102140
19739 -159836 -59487 -1736 58415 -312645 -47289 -84195 44111 -145917 -79368 -404474 28621
19727 165307 2179 188001 84113 -69672 300793 -289680 -196826 57638 239062 -6079 75957
19715 199815 -29722 398798 306876 478073 41248 146251 -301633 212860 234863 186514
19705 186514 -101416 -123742 -35269 -11753 -112825 -342292 -58774 191045 -231671 59802
19694 -63392 -412445 -112207 -101367 130133 172490 -104196 251756 -223285 133441 201130
19684 201130 10841 285050 152530 289660 93957 33966 336979 49645 213123 -111548
19673 -109326 -328312 -77542 -210940 92599 -2278 -192105 -70188 75569 -1739 103934 -441562
19661 139260 -125149 -93259 -222980 -54437 101054 -98966 65337 -33585 87338 63539 2771
19649 -175661 95795 27481 48684 159674 -154913 69785 -50611 -164511 -132917 65680 68885
19638 68885 -155862 50927 -267180 -188082 -193082 -292048 -93934 -236972 -202779 217948 -130606
19626 118034 84264 119050 139949 -252540 -27085 75382 -66641 -190693 -61386 60851 -264419
19614 56691 -95902 -144378 -126776 -110598 -136850 -241454 -110004 -362221 -86270 -64090 -29030
19602 -225521 -131656 -23583 -333183 -154677 -43139 -72413 -142033 -312624 -22756 -47822 133998
19590 -51522 43049 37453 23090 -366110 162064 -5774 13660 -148195 -357092 124285 146084
19579 146084 -281623 104170 -188614 -263323 -44692 -256144 -170411 -1376 36450 -339628 311894
19567 -36590 -95264 -379841 -307939 -13383 -317731 -101707 -384677 -294715 -336979 -169702 150711
19555 -91039 -150029 17764 -64614 304974 -60795 32160 -73008 -203623 51156 -376928 272143
19543 -66216 -121797 37749 -197526 -349219 -206737 87237 -9800 -369560 88369 -80422 11266
19531 -225501 -46170 108590 -62050 335 -181034 -241812 90275 -252363 252284 23397 128633
19520 128633 -307303 97388 117827 -224762 -164363 -173808 -211054 -198830 141089 -128672 -303487
19509 -303487 26884 60478 148785 269381 -61423 89015 -270358 49503 387250 76275 87504
19498 87504 -242850 -9836 -59533 -57810 -180667 -11711 122003 -262148 -186797 -53503 18210
19486 -509905 -147496 186853 114908 -20560 -60999 -61658 -102160 -67590 -75538 100014 186173
19475 186173 220520 -317282 20145 -157591 129862 130423 81658 1796 -213900 -104399 -114908
19464 -114908 -92523 -76178 31092 -181909 -424543 91896 33969 -100031 -64841 -84597 119817
19452 -124836 -118327 -35288 -90791 27380 124223 -503515 -7035 142591 -220711 90651 76613
19441 76613 -90989 -151448 -52092 109501 128613 -25544 -16015 -332929 -109838 82011 -75486
19429 -116158 -75278 -178227 -66961 100705 -326083 -7912 -95131 -8962 51918 -195919 -190956
19418 -190956 -198511 -113579 360421 140293 246778 138599 -42512 -113295 -69316 27310 -152262
19406 40029 -2818 -37350 -110580 -168160 -30179 -119440 -18596 164473 -139592 41346 -261084
19394 -196108 -322617 68572 -87461 37290 -89605 31805 -30592 62047 -120749 -49794 -316055
19383 -316055 -228753 99274 -142994 -114206 -162711 206142 -105562 87030 -109254 -157693 -243461
19372 -243461 -12851 6777 -57076 -150359 -10602 -199375 -100999 -41594 89674 20789 -240863
19360 -105012 -52547 105742 -77728 24361 32662 -113853 -98107 -214199 84567 -291262 -369092
19349 -369092 -81369 53841 1617 -365201 -4619 -21771 -112273 -26644 122307 -10625 -4979 -172866
19337 -172866 -49601 124133 -163895 114646 -35940 -95135 55903 54420 -381881 -159997 -42787
19325 -297737 61642 -174432 50830 -141843 113983 -97600 -163671 -194886 -189741 -92164 -221793
19314 -221793 189738 332275 7475 19403 24165 -99175 -216563 -172230 69569 360767 -209152
19302 -85908 13119 330901 64696 -106429 -267293 -125532 -34114 25790 854 -139456 -306037
19291 -306037 244226 -278256 -226741 131417 127846 -50046 -211803 -361711 -181645 197616
19280 -169352 -107179 -163169 -69187 -53843 126546 -103834 -6080 -158108 -38938 -192170 169601
19268 -12201 59448 -14131 -82895 -44378 82764 186150 48116 -128766 213395 -46884 -67860
19257 -67860 -170484 36848 -361448 -143539 -151399 -226801 -83325 106417 116283 -129585 -18047
19245 -110622 -41198 -117548 -229354 494754 41766 -491 -73259 87792 -243858 98234 230070
19234 230070 -29614 -217725 -341633 428476 213994 -298190 -51706 4547 -22101 167058
19223 31026 201863 -85330 120824 -127852 -101176 -150232 29563 -211389 -265985 -135761 246593
19211 215027 263754 -1265 -179698 -78964 113450 -173779 8714 7016 -312049 -2890 -48759
19200 -48759 -102723 -219296 170630 -50161 -329311 -161345 -44496 -245428 43880 -148189
19189 75792 -29388 -120531 -257744 9466 -180974 85331 -184620 100016 100581 547625 -30998
19177 -203721 -318943 -258143 22325 -172661 87129 -180418 -318056 34076 -84272 75541 96091
19166 96091 -274851 -95348 -171781 16559 -9233 95202 -144773 -83210 -80484 -314884 -80380
19154 184851 -145848 -200188 155362 138271 -119366 -256994 -293385 -188206 -265701 -186332
19144 -186332 -107542 33713 -490463 23243 -115647 46783 -68942 -37580 -221461 211408 -76324
19132 -4235 -313416 -10245 46694 224805 -246266 -181779 -363466 61351 232301 -280880 -52703
19120 63377 -151747 -57366 -341785 -2325 -166034 -239131 -262108 19375 91737 -206013 -193672
19109 -193672 105841 271185 22697 -68208 37435 -420703 117548 -108674 -351586 123782
19098 -101665 9424 -278612 78895 35737 -278588 -32460 -158230 28568 -141514 92746 -63488
19086 15147 350206 -223556 -149305 -75726 -145002 65125 115130 -125 -303364 -114309 152431
19074 479 -288347 31283 -183252 -75171 39743 -320649 -8620 136244 -157628 -151700 -104247
19063 -104247 300761 179100 144149 -391291 103276 -246993 110109 -32579 82798 -70402
19052 -90144 99009 -154797 133268 158160 149973 -158286 -35846 -380396 321923 290619 91511
19040 -309409 99634 -6448 87815 -17908 135123 -202090 120814 148443 -127195 -43857 -464572
19029 -464572 -75615 199339 73319 -164651 -157967 152857 -80917 -241351 161700 33024 -167658
19017 -23748 25484 -105826 -44931 -202711 -119379 -23422 -396427 -20400 1270 209495 167659
19006 167659 -14625 7092 217979 -14181 4175 524849 -83609 -227532 -106066 -354386 -1818
18994 89863 19273 134373 114329 43700 8094 -76954 -221030 254879 -238749 196778 231907
18983 231907 -239954 72276 -562 -315673 -467 19040 -227408 -252984 -4179 -61708 -250232 -275445
18971 -275445 -159968 -183671 -100276 223028 176357 175779 -487080 -394764 83703 7134 -120789
18959 -28404 13942 34568 112740 497456 419306 336470 296043 281375 158789 -93056 -58964
18948 -58964 89405 -308249 -12613 -235629 -1790 3125 -222360 -17879 -259315 31035 -136050
18936 -61747 -69727 -70539 67960 29200 -16359 -225 -122624 -137070 -70609 -191477 -138356 -78732
18924 -78732 42993 94704 -203777 120681 -171820 38263 -290676 8748 -168306 120699 -102573
18912 -142985 -4218 -36991 33370 -337621 138325 -107584 -158170 292987 -317476 -20690 -27508
18901 -27508 -118233 203932 280364 203951 -166180 110831 -29771 136863 169751 532747 164146
18889 209187 -17734 -77606 -190541 -177216 -252014 113391 265636 -60481 -124142 36569 -132558
18877 39589 334136 113401 39638 184783 -294882 -106931 -56890 -41344 -106394 -253449
18867 -253449 -263369 59870 -150151 -78188 -12837 -50771 -101502 -55205 246299 -275978 -117777
18855 -190521 -200302 -141598 25981 -10558 -44203 -406180 8999 115694 97497 -228611 242269
18843 44180 221844 -203465 56090 203172 -247571 -116050 -280817 -369026 87186 -43768
18832 -230379 -457508 -120899 100246 65090 93925 45186 120980 134936 -31958 270754 35273
18820 188485 11318 -148221 -64977 342671 -35423 6254 -86433 -153941 -134735 -113950 90344
18808 193691 -210889 114328 153858 36876 -198550 -295203 153885 104799 94638 47907 329501
18797 329501 25728 172914 -56504 -38075 273048 340774 76988 -137140 -148618 -47095 -232076
18786 -232076 62237 -121244 -322211 -130731 -48094 -35612 12302 158420 136229 -41987 -108974
18775 -108974 -186458 33505 81630 -301825 171917 -162090 -201178 139053 189404 -43563 -143225
18764 -143225 -106247 -269359 99267 -21757 227452 45015 32879 -305970 26994 -241644 201001
18752 321880 -288334 -191480 -43393 -326198 103630 49525 -164434 -41439 -130937 -346768
18742 -346768 -85576 -41312 -221314 -132430 107854 63803 119430 -175122 -86101 24830 129245
18731 129245 -18567 65759 -177096 -232666 -268558 -221097 -170616 -59843 -16622 -11537 -362993
18720 -362993 -204786 -73671 266446 -172965 105756 5474 47005 11188 59854 119715 -128388
18708 21767 -5396 7558 -254914 -181805 -243418 290297 -349673 -20112 -12043 -283232 -192084
18697 -192084 -16835 41115 135096 78079 -111702 -57030 -177729 -103161 -19194 -391393 -209504
18686 -209504 -136921 -41330 -373642 -298416 18007 164140 -154626 -44266 -55204 98513 -4741
18674 32160 -61409 3526 169116 69318 -206101 -207787 389029 -7931 32601 -23640 -300409
18663 -300409 14171 -1390 -178780 87973 -296549 -75196 64623 -151150 -135634 158320 -100553
18651 -118376 -157050 -153628 -122553 -72527 64272 -76003 -78927 199857 -220582 -234864 123323
18639 31823 -226110 -53229 -58509 -161306 53281 -208112 -143018 43165 296917 -8304 23510
18627 -30073 78560 -36589 -79855 -338476 -181706 211661 72424 248198 -352997 -301591 -111877
18615 146227 -61132 69559 16290 -63093 212804 -142599 226732 218236 -31308 -39896 -8744
18603 -283320 -250342 -358496 -163036 -155221 -12686 -48313 -186346 -45421 -271654 -210146 -146457
18592 -146457 -259899 -499676 3094 -315605 50375 65508 117243 -152181 -214059 -2381 168619
18580 51934 -42202 -295233 -424295 -65447 -238655 -89849 98296 -95841 214123 -69830 -352569
18569 -352569 171175 -66220 -235089 -76697 226230 -342933 74883 154004 11091 -9249 -434502
18558 -434502 -192627 109215 -27927 -8377 -148256 102512 -35727 144657 -172961 24124
18547 155494 -213534 -178578 -398498 149544 25073 60069 26066 -225158 -136514 -386155
18537 -386155 -101085 176249 -107306 -240374 95122 -171494 -290942 -472334 -291673 11209
18526 19987 64196 -35840 -193812 -374582 -56897 -165819 -213541 -6688 215963 -536521 -204838
18514 -160653 -163616 -146341 211282 59578 -21331 -114314 55757 -249285 248412 -46739 63752
18502 -187384 181724 -174278 -411169 46615 138388 -42565 140614 -301798 -141754 -35840
18491 80115 -4602 -76382 -316443 225478 88232 -252749 -296889 -37353 -46165 -28326 -24035 -230470
18479 -230470 -180940 37733 345008 -376465 101733 89757 222515 377952 -57034 -63871 -21775
18467 -60171 279950 -321141 -132423 -249546 -232947 45052 -52948 83472 56588 -35145 184513
18455 11859 5594 -2538 128943 118399 349726 -61312 75641 67177 49831 -187843 -484762
18444 -484762 -51322 60890 146276 101719 -22397 112432 -311697 199280 106796 -167983 -191223
18433 -191223 -254481 -71666 57713 -55885 -264571 -196163 -11372 -132480 314105 -147448 104938
18421 -199140 -9359 52312 -243378 -208214 85013 -47137 -147791 282331 -94286 -267364 114191
18409 -192686 8653 -291711 127586 -61175 205913 7865 -150837 -100164 99 73235 71229 -44336
18396 123059 -220852 115184 -14100 173270 -189059 -482046 -19817 37006 557 52609 -93628
18384 66564 158922 -295539 22936 -175549 44192 -134704 -205694 36383 -24635 87602 -202867
18372 180135 -69817 275599 -296416 343909 233013 -39809 52889 153944 33412 -283528
18361 -66625 -270520 -42171 79873 118510 136077 98838 98769 -166964 148668 -12693 494669
18349 -74796 35318 -98581 6389 222170 43454 163926 -38415 -190166 -220993 -135888 -135040 62687
18336 -271387 -267836 -34555 59621 -209764 -164949 -106115 196546 251262 72326 -183944 -172737
18325 -172737 -304625 -42437 274741 -58944 -285443 -192918 352185 47868 64365 -161525
18314 -32385 153094 -281339 -350804 -13365 331544 77783 148193 -273270 -389436 -150212
18303 -207336 -146864 178965 86728 -210090 140133 -18835 -73742 25684 61799 77191 -35729
18291 36817 -59495 163844 -73642 274558 112374 180677 26388 -76778 297369 -282105 -211199
18280 -211199 -3846 66377 -287310 -405153 27476 202707 15191 -11744 -281810 -147378 9095
18268 87776 -162893 60372 -33151 -130479 -309624 62094 -33306 227758 -106597 -90879 -6699
18256 97498 -106853 110316 105294 -92610 67875 -211799 114987 237653 -45408 -86130 122752
18244 -3896 417294 -201502 -173732 -1297 127241 -210460 241620 -164900 -142067 87296 232459
18233 232459 -199613 30938 -137074 70457 178038 -86712 -44282 -300210 60530 -104131
18222 -4737 101751 -96155 76009 -218761 -251532 4495 -135252 -260952 -36304 -64454 -190888
18211 -190888 202061 -79031 -23035 52349 -76140 117400 -73466 116866 -239369 -94515 -44226
18199 172815 114611 -145964 301794 -73485 92076 -187413 23257 -177639 -294835 -317862
18189 -317862 -9650 -67214 43338 187489 -86450 -96928 -154968 51736 7962 -73044 53240 -206901
18176 -153665 -161893 -317709 -411988 102721 -151680 115638 -5390 -79124 41964 -112149 -34571
18164 15299 -76130 -113350 53660 -102252 -131374 120802 145673 -139261 285287 -25337 -81540
18153 -81540 -177357 159166 -348582 49319 -85628 233196 -142677 104329 224442 172100
18143 172100 -57118 -390429 -109753 -214834 24196 54502 -299348 159525 342855 127429
18132 -17561 -91415 -67285 39975 -108918 55817 137704 73907 -153919 -127828 -39998 -217842
18121 -217842 217359 -17467 71169 -171996 -104026 122560 124154 142885 10603 60676 77480
18110 77480 4007 98633 -2643 120171 91289 -149178 -15502 77400 20551 -101129 -52033
18099 -52033 -1002 222341 1090 43430 -38068 -18055 104823 -40014 18124 -199552 155254
18087 -181191 62440 300060 11335 -363642 -182811 263544 -59951 287356 354011 -133347
18076 -79981 195116 99059 55774 -264817 -156927 -114460 113464 -184784 145894 -23693
18065 -14858 97513 -76820 -82722 134035 215185 118776 -154602 -294836 163198 133321 -93516
18053 328843 -61880 -148043 98707 27417 318169 80426 -99158 156828 -26899 -23720 -77636
18042 -77636 244091 59521 52395 -104444 -260909 34654 -227679 123249 -244808 -64782 84844
18030 -4504 -337685 -82483 -186847 -44625 45372 -52930 -47266 62446 36599 326365 -102596
18018 86860 -150781 -418495 106114 -5420 -165398 -67318 -124190 86439 102404 -78132 -94755
18007 -94755 3711 -120640 53248 -74908 -65352 -267082 28815 -202409 -158212 285408 45555
17995 -146920 -35176 105281 -64427 -136271 -152239 99078 148572 -172044 -106971 -196256 336406
17983 -153814 62779 -380219 -20661 248503 315013 -12066 314727 421321 -47564 -148816
17973 -148816 40449 -292046 223212 -151179 78560 252184 141834 -10009 176291 71249
17962 180126 374787 114 -8819 97476 52395 -27373 -122858 -25622 -224581 177287 -64062
17950 126139 -136115 110766 462823 117598 24702 2891 -41363 32667 -94745 -52167 42759
17938 -99376 57006 -34247 168838 67283 -41665 -157596 302683 133834 93072 100727 -22629
17926 172436 281196 161086 -18903 143055 104394 -227146 226502 -173541 -118156 -130654
17916 -130654 -202903 -356551 67417 38233 236482 58290 97232 -53685 46467 -73814 159160
17904 1448 21585 203102 -51005 -260024 -242838 137112 -7592 -315347 -10614 75575 274761
17893 274761 -406150 91274 -282316 140352 -6017 121666 -76566 49670 134851 216281 309512
17882 309512 141751 11741 13476 3657 -91895 -219651 -158509 -8754 155014 51525 -30100
17870 115543 -60465 -93790 -71 -96266 -282639 -87066 -184162 82955 197892 433728 -145499
17858 -8640 59035 -143904 16577 -26229 43217 -142302 138709 88883 46824 31829 52294
17847 52294 -71331 -48356 -80925 156270 -176019 206424 -72125 -40038 302638 -361363 -173959
17835 132521 -22807 281231 -222631 29082 126187 41035 238273 -29211 98464 -15150 16284
17823 -25746 -187645 -72235 -103248 -350877 332883 -64434 -91398 -220815 -58855 -49850 -63051
17812 -63051 33776 -101916 -60540 -176557 -35600 60609 -28509 -164206 187725 122851 -6444
17800 307158 -100857 50199 48476 -89503 -102778 -72342 41798 35359 -56643 461248 -453781
17788 -43996 -105793 108764 23268 -8469 274953 -132460 -7331 -2367 -68804 31179 -51576 -70257
17776 -70257 285924 40079 -178938 -271438 -14127 245343 -16759 319259 24732 -104791 446833
17764 358181 242968 -31783 -226266 -143284 -64101 84540 -381157 303342 135167 177782
17754 177782 -290112 -104517 307005 -80311 13009 -87462 -125970 -41798 145631 21173 336090
17743 336090 -7039 -32279 -60400 131383 -78485 136817 -34972 158106 134499 1696 -186466
17731 125609 -30325 -170236 500311 41600 134356 -302751 -351 239060 23530 -45557 153934
17719 174400 56815 -30183 -107898 17797 -42589 -24034 -209647 -74917 -50123 206357 91504
17707 -333138 241157 107225 120899 -267524 106290 258366 -38626 297886 8794 155480
17697 155480 -152668 64195 -249154 14712 -45976 126728 401403 -43162 -146754 253074
17686 -29428 151981 -78296 164320 66455 180363 -79282 255269 59565 -23576 -93894 -55540
17675 -55540 -147677 333384 40059 63633 -8917 -68122 73162 -206815 254339 101270 245627
17664 245627 207639 183036 -106333 126407 231834 62487 307390 206015 121039 313363
17654 313363 -103025 403726 -31416 96816 58619 101484 425150 109352 161737 -10135 -81438
17643 -81438 -132124 -204853 -63820 405875 285650 -16717 -163226 320506 255127 88802 194228
17632 194228 246368 -70439 42551 68423 166075 289253 363546 7126 -127537 181284 -166274
17620 252855 300459 -168256 23437 -313399 137522 -287699 -128928 517348 167145 3665
17609 -223032 145165 -11115 -87672 100745 67325 19524 145450 381529 238136 53090
17598 247485 100753 13810 58487 38284 -103196 -90859 -266422 236084 -142805 297429
17587 195904 -129158 -225111 -185150 326845 79073 200987 -31830 -211671 355589 33111
17576 237091 -19272 -109320 201938 127656 -75551 28282 176437 -27651 87601 336136 -244525
17564 199475 135026 149649 -32069 -175209 110257 183770 239949 -22138 167076 335510 78722
17552 47343 141795 21918 300777 84685 120014 -13155 418824 77063 93296 -41520 301038
17540 248846 169575 188221 293441 -1063 440714 -28011 134820 222690 289786 -101301 211902
17528 568928 -101337 85342 -181067 -55068 352955 149399 34844 122122 -256233 137429
17517 99812 17964 232265 237982 258171 363317 329690 427991 704298 479426 965237 831847
17506 831847 552801 793663 697636 574032 335398 205759 389869 377994 430311 385413
17496 385413 575056 635504 668952 834763 722321 620657 885470 664377 231537 444558
17486 444558 245027 478255 607365 368719 138740 -69696 286795 -54300 186966 181708
17476 181708 -27235 336546 381142 186349 51675 198431 77506 519360 330189 467895
17466 467895 39057 172219 312991 263094 105687 389020 351610 434757 159488 348427
17456 348427 238178 255423 115541 40169 66393 90523 194692 229888 358998 189858
17446 189858 78319 5853 21167 433882 71194 408250 110964 299485 344664 -105150 91279
17434 324683 440626 455980 435015 226914 262245 445181 216356 111469 293047 292376 341344
17423 341344 37205 406574 450335 379277 228307 441329 634968 125990 535582 488649
17413 488649 -110733 128301 176066 162494 406653 249677 -185149 296784 372730 299038
17403 299038 254493 428351 726125 233702 273997 -190515 258118 106432 392865 282556
17393 282556 622465 279823 240124 -100195 264089 267815 37918 200415 -330136 109943
17382 157977 -5889 245328 272964 587683 13543 56131 225370 116285 688396 -98961 718302
17370 208078 408362 149518 132207 325885 23824 249131 37362 324392 137734 322529
17360 322529 -56099 350552 -9369 95361 -133092 182323 146590 -300548 250862 166466 106289
17349 106289 21754 73810 103964 310530 235517 311189 322158 267425 91101 98698 121941
17338 121941 127652 278762 316095 324321 207233 374992 -218956 140470 394996 82712 113010
17327 113010 94423 340576 -129517 162807 221241 295761 127569 -127959 155182 260638
17317 260638 87649 306002 471267 157363 -60786 319841 357625 101339 258964 94525
17306 -111712 404839 237338 452884 119712 418781 219182 348342 112705 -12638 263332
17295 126014 91597 17390 651408 155447 -29368 97617 157344 7350 -38539 325992 128757
17283 300190 254716 255236 246848 37005 99794 258234 190331 250442 199520 250417 355865 497445
17271 497445 215945 294410 45804 -188451 179886 396929 421926 553508 133741 300786
17261 300786 201355 206702 239265 261367 333941 309174 207379 -14471 170872 403225 299978
17250 299978 161940 229586 243124 448479 406407 226924 338369 270708 185700 244665 205707
17239 205707 200728 435261 427537 243890 207838 273873 363693 232705 430714 176355 399731
17228 399731 354825 585101 210855 539070 193050 253221 279182 365009 191765 280101
17218 280101 242431 279288 290997 517257 489832 108011 274178 372133 288372 257369 -32685
17206 557534 190572 615648 195172 141083 237066 351243 484745 476660 18686 634908
17196 634908 50639 43602 320773 249923 212097 263624 263885 263912 137689 91594 428369 481212
17184 481212 304832 512077 146157 172429 206448 479816 360380 399875 503120 478651
17174 478651 326889 68138 518655 346723 361364 278564 297435 9972 354917 428544 391890
17163 391890 579181 153986 92656 422214 165965 -131439 85502 403590 332882 121067
17152 311637 467149 48189 585244 243912 442615 365173 335606 250081 260398 373112
17142 373112 471859 272231 558857 348602 293883 376641 630245 552957 410512 54977
17131 99756 157663 308547 289507 433626 502791 387541 418072 374916 535851 337791 185835
17120 185835 631788 244258 656790 324099 384934 291016 521039 248294 327299 237570
17110 237570 457794 750895 500950 468757 366562 340948 494289 136714 507272 361212
17100 361212 370718 576732 37013 372845 351816 503204 551221 199760 353517 405094 558264
17089 558264 277569 261841 593318 432447 300396 559382 544506 547993 489701 424228 608275
17078 608275 461392 615155 794942 597038 625904 627371 569487 251706 567981 615625
17068 615625 674878 525895 626385 580999 517329 393822 355019 810791 731229 545766
17058 545766 700982 393985 342713 354994 873539 625034 555212 623460 586733 823509
17048 823509 589970 723548 636580 827104 773329 357926 790607 698821 617609 471721
17038 471721 708461 812429 532880 728732 442802 639594 812026 629360 642647 876492
17028 876492 584196 746299 730354 761536 911933 501827 480994 684869 614404 862324
17018 862324 773562 826406 927240 750253 604619 584791 1148439 768524 692569 831961
17008 831961 330709 744243 796696 723906 690249 668497 815897 743727 975841 717611
16998 717611 739144 927033 981712 1006373 499255 799438 547674 885119 987357 541974
16988 541974 946419 641153 978343 907037 788351 930355 935876 1118418 980729 762433
16978 762433 1143091 770846 937922 1139246 1028247 1145080 916779 930761 910301 1108469
16968 1108469 1088503 1194472 914245 768113 891413 1429873 1306381 1156500 991630 1067616
16958 1067616 1374090 1174925 1361371 1165243 1368044 1074921 1118141 1317998 1106781 1500970
16948 1500970 1376140 1166783 1213487 1176421 1168845 1313044 1085669 1238369 1105802 1207927
16938 1207927 1210739 1421549 1319777 1244658 1488343 1402410 1505157 1266044 1399537 1303242
16928 1303242 1135509 1559561 1469263 1819815 1537714 1369968 1509361 1738681 1687722 1405911
16918 1405911 1707558 1740240 1656153 1405546 1435743 1736087 1383706 1204460 1732401 1541660
16908 1541660 1718966 1622321 1932106 1768205 1932612 1868227 2010286 2122587 1882327 1673564
16898 1673564 1673737 1735841 2190175 2066232 1805782 1905387 1984199 2086348 1746927 2358709
16888 2358709 1913707 1872444 2102913 2180767 2266877 2217783 2082094 2380834 2333462 2067639
16878 2067639 2079466 2412322 2394529 2547317 2958578 2366444 2504971 2552400 2578237 2463071
16868 2463071 2775131 2614512 2550285 2975646 2618865 2933592 2988965 2662495 2811995 3030307
16858 3030307 3041750 2870826 3309005 3043688 2967908 3436426 3001789 3450003 3268029 3220863
16848 3220863 3278245 3576791 3512703 3442517 3487619 3484355 3842660 3729421 3569976 4110005
16838 4110005 3534088 4098822 4339983 4037698 4410644 4204687 4337367 4095275 4548902
16829 4548902 4352903 4486104 4641100 4912205 4596059 4830104 4899137 4858522 5344852 5021872
16819 5021872 5217382 5527580 5593429 5322732 5831445 6071479 5861242 6215624 5847432 6163727
16809 6163727 6478582 6423959 6944801 6757199 7203353 7049149 6895432 7249887 7462533 7423602
16799 7423602 7754540 7788292 7865543 8034009 8402627 8164153 8778004 8756476 8610067 9330433
16789 9330433 9620942 9651273 9826071 10162619 10562513 10626554 10929713 11159823 11165965 11739429
16779 11739429 11923721 12229723 12491915 12911644 13133524 13646363 14135220 14445589 14815037
16770 14815037 14937867 15590273 16026895 16496602 16990509 17112960 18122172 18845906 19151033
16761 19151033 19489755 20569204 21167675 21737700 22625284 23229796 24310302 25248434 25536582
16752 25536582 26384043 27607922 28564631 29662015 30636648 31860435 33314028 34493250
16744 34493250 35805821 37293233 38884809 40553683 41966235 43987412 45990964 47596473
16736 47596473 49612404 51674766 54399915 56465576 59288415 61624979 64718356 67362568
16728 67362568 70407869 73747327 77263309 80358350 83761555 87743191 91327169 95034664
16720 95034664 99372688 103307941 107231613 111209147 115043062 119137874 122736026 126003756
16712 126003756 129153279 132420830 135171234 137473806 138888289 140154509 140927955 141077189
16704 141077189 141079042 140004275 138703495 136840648 134667307 132012175 129012344 125771375
16696 125771375 122128741 118234311 114204274 110334931 106239401 102127352 97958000 94085980
16688 94085980 90236552 86354892 82623190 78879446 75117663 71789839 68754647 66249696
16680 66249696 62896091 60061647 57419679 54646557 52124779 50039198 48073976 45709828
16672 45709828 44036001 42034232 40366509 38629425 36843818 35860360 34290745 32932379
16664 32932379 31544350 30175078 29638600 28369012 27117112 26190635 25185805 24282856
16656 24282856 23644651 23118904 21872768 21584464 20251900 20204383 19016150 18579339 18175169
16647 18175169 17575391 16986282 16449151 16073688 15732323 15129736 15073514 14419976 13797586
16638 13797586 13343500 13243604 12778486 12554771 11978740 11686235 11470325 11254450 11163446 10692070
16628 10692070 10519444 10501860 9993631 9624594 9491096 9521888 8998401 8928674 8721233 8643078
16618 8643078 8114737 8026839 7787966 7718175 7382166 7377691 7395583 7231525 6993513 6536865
16608 6536865 6650107 6584072 6327313 6195251 5888439 6259002 5979188 5852300 5497147 5435364
16598 5435364 5492544 5239530 5134338 5011525 4974983 5221265 4955227 4808517 4747320 4610420
16588 4610420 4617920 4648772 4436383 4556459 4216558 4129683 4166019 4001912 4194432 3880268
16578 3880268 4028598 3854459 3734778 3982930 3626774 3970954 3431337 3481003 3714859 3578119
16568 3578119 3304404 3371334 3529757 3326121 3373386 3133245 3131492 3151616 3154400 2850534 3129233
16557 3129233 3229231 2806708 2714487 2597167 2924514 2722717 2484490 2720177 2579152 2673148
16547 2673148 2609226 2444628 2608162 2372214 2430755 2309908 2548010 2603924 2576302 2127303
16537 2127303 2165383 2167074 2038508 2405677 1671868 1981637 1805693 2121999 2091015 1957046
16527 1957046 2194840 1500480 1976745 1816433 1846514 1784507 1943999 2086209 2030110 1624556
16517 1624556 2036997 1850650 1765695 2051502 1788394 1409969 1744429 1689147 1858850 1759202
16507 1759202 1554868 1884390 1929215 1945138 1779000 1366995 1367811 1544338 1559616 1575704 1383341
16496 1383341 1378752 1676453 1233670 1553361 1348267 1103684 1320682 1193711 1487760 1251086
16486 1251086 1341319 1188460 1318472 1218457 1004136 1122220 1061456 1249562 1186664 1044020
16476 1044020 1398027 1320936 1273081 1208597 993141 1032104 1216465 1195186 1015173 1242419
16466 1242419 1170488 915439 1377473 1083733 1321822 1322671 1115492 1005393 969199 1164911
16456 1164911 1115931 748680 852454 1090620 792911 735977 937873 985585 1246190 1022794
16446 1022794 1138968 758699 975133 1163615 1021200 668849 703181 834574 878253 961092
16436 961092 609564 533084 827094 1094742 991913 1050270 701429 931931 792571 615730
16426 615730 854894 1053566 1157976 638691 798891 544779 614647 706763 760068 715794
16416 715794 937071 317626 651192 664987 459156 503373 897995 466385 946708 484816
16406 484816 876396 633906 867563 565211 585796 606145 649172 186179 721207 781124
16396 781124 356993 911402 567184 562786 486455 654003 598009 956733 569292 509870
16386 509870 550361 563726 624560 552287 447493 434943 866456 807060 650727 715244 590845
16375 590845 592909 604954 605903 589865 398919 538837 523862 536593 468561 557846 499843 415760
16363 415760 141956 332105 560004 460502 534335 611099 540483 476228 347051 527828
16353 527828 407536 312029 418688 390091 507953 589351 541001 236629 211203 621721
16343 621721 386744 351943 561611 821019 615646 424660 484963 419965 527247 305046
16333 305046 520879 551653 577520 395860 384850 288518 588859 452307 369460 453795 205510
16321 603572 254213 474217 607451 223853 80539 346429 230997 549764 367816 611052
16311 611052 471917 254833 490605 460533 513256 272620 232774 374912 641336 82523
16300 423684 262200 -20890 324335 232608 180587 579453 198829 80874 416852 409947 -23193
16288 398890 301229 434094 364743 4390 363736 212387 626335 395899 34786 387977
16278 387977 252544 374818 382257 209380 229629 212792 491439 205021 354474 228119
16268 228119 340664 436548 528044 519914 416150 -19673 492436 25523 -199844 38068 415892
16257 415892 465903 53722 278580 285056 418601 -17767 259087 208012 249780 467143 103626
16245 390896 442316 32756 285116 413084 305993 284312 99818 236033 563162 266762
16234 327207 292401 285219 -11739 291404 287546 416539 181347 260267 91433 -97471 322762
16222 75321 -159481 221468 68713 63968 382189 177252 -171158 303404 285825 226128 344616
16211 344616 276398 158883 379224 234942 224967 172313 -113681 160092 229577 362433
16201 362433 -77899 340796 25943 270975 79702 198615 128486 102029 235396 145212 309484
16190 309484 332257 304716 410623 88216 541554 -181502 158709 134826 -225702 106712
16179 161421 51374 279667 -14578 -17655 -52798 318574 108450 180292 62006 260826 142211
16168 142211 185981 75498 289733 -128620 278247 71124 76992 -47053 63489 71408 553037
16157 553037 46547 39114 303147 274299 236199 -131564 129191 334600 127746 238797
16147 238797 194646 245389 322862 179658 76762 261934 73434 298999 180904 68005 -14688
16135 110145 133411 191737 -174351 95774 -134387 57851 287173 -103463 -148235 129188
16124 224656 -69357 252316 365946 -3555 198584 -33401 -125672 274261 -307569 44917 -72583
16112 -25511 149452 213087 189257 31955 -187627 94165 172251 27991 -9782 -20259 257992
16100 75770 247879 1412 138185 75575 -378406 591583 -5998 -128947 -21754 -188471 119924
16088 334131 197636 -242131 -62887 75722 221082 270770 -160810 -136505 -66650 24358 216470
16077 216470 29918 116305 -250525 19317 -48528 -90353 115948 241431 -197515 -297482 -235362
16066 -235362 -199653 120060 -32339 -114391 38936 277402 66259 -26467 -142043 -133317 -442017
16055 -442017 204866 -56027 13940 -145803 -13152 376821 -645483 59109 160618 -59735
16044 -80448 -192688 -65176 -3637 -26432 -5060 177642 40458 37270 234333 236733 281893 51999
16031 41325 89675 -445782 74442 -131135 -105892 10881 -1304 289056 423082 -129871 196526
16019 -39054 343425 -165748 -176561 -221892 167722 -198614 17412 -335940 340650 -270818
16008 162732 -258919 -80558 159469 -269356 45954 -142688 264090 -338283 -12103 -112677
15998 -112677 29275 -361647 -221755 45855 77931 185689 -167866 -137040 -8381 44394 69434
15987 69434 -25821 111562 402226 175037 51688 -45986 -67565 268477 -4055 206811 -177795
15975 -58472 276543 6660 99151 333612 681877 458436 803693 676352 644329 885219
15965 885219 416332 73287 282552 362335 46636 228723 -1344 11641 -26819 45626 -95427
15953 50929 141192 70430 257865 -73198 -265249 -167563 -43598 -49466 -245262 -345412 -353236
15942 -353236 -204336 -136111 -280062 -204737 175523 -84337 280778 108084 102908 74754 -288896
15930 -114664 -18492 63333 -121028 -34127 -10830 125013 94055 -5442 -208367 -280915 -393254
15919 -393254 -16929 -132672 239468 -355528 66007 -225182 -246043 -165120 -71561 155998
15908 -142818 -374468 -120287 95621 246960 -187526 -32137 -234447 37332 9398 15883 -21629
15896 -231329 -2039 25148 -299948 -110013 187500 -206040 74239 122803 86396 -105966 -307335
15885 -307335 -109401 -210522 157290 -73058 -205831 190763 52649 189734 -311924 308653
15874 -64278 60049 -87907 37888 1570 -111208 -190416 -375918 80144 -108968 -59269 212730
15862 -77975 29839 -138330 5793 -257327 -54276 11695 -30515 75614 8081 -204524 278719
15850 63194 130221 61963 57859 -116368 -156005 -836 -303363 -48668 -164339 19836 -154812
15838 -161933 -25817 -67616 -12795 -30872 41791 478180 -102771 84187 98746 -165569 -187737
15827 -187737 32859 36196 84422 -60978 -236272 127766 -12411 -179481 -242812 73336 -79176
15815 119166 -149374 230806 272859 67059 -20594 150036 -244387 134151 53439 -66666
15804 -78672 -106383 -100437 -428984 -322006 -69860 -23572 21541 -83510 -97262 64695 -98100
15792 100763 135619 -241917 9670 -204164 -24335 45523 -410663 147922 77705 21793 -135293
15780 -277930 43643 -39165 363312 -173876 -95881 -28979 8876 167523 76680 -217261 -86191
15768 -189108 -92510 17199 231929 -302384 19582 -13891 -29266 39396 -47687 16542 -115369
15756 -402010 220840 4960 -178128 -56440 -85044 -117669 180469 -222941 -301904 322907 -4453
15744 -331252 -85822 185018 -20871 132285 44611 -138510 379625 30030 -92482 234908
15733 -184222 -250160 305347 122441 -120641 -142884 -218034 -82238 -345090 182849 -49534
15722 13686 252212 153906 -183514 -187828 -344105 -189443 -367755 242508 -70204 -130652 22088
15710 80528 -101610 -125146 -641 -49768 100232 208381 -205946 223954 -194961 33977 -146839
15698 218389 -56962 -102366 -64958 -136113 137981 11465 -187983 -228450 186331 35594 -16560
15686 -138669 188231 -81119 143486 -133 223786 -255498 276345 -248710 40431 93142 -318675
15674 -309989 150036 301228 -38081 -76408 -29194 150026 -235776 11817 6471 -295543 217441
15662 78700 -120137 38182 -104781 -35312 -158867 -44159 49269 -38385 -307190 -15673 24845
15650 -210369 136606 -359864 -86930 -149628 -375128 164914 67734 -220750 -228043 -65505 -114041
15639 -114041 -277898 -402832 -281894 7847 -12350 83513 94645 77912 -68681 156380 104494
15628 104494 -225784 -61571 46476 165474 -111890 -175221 -65304 -53628 17439 178829 -284119
15616 -91373 -296468 -120948 -120221 115454 -301580 203558 -240209 137917 -35459 204157
15605 -34744 182291 63091 51351 -136937 -191167 58390 57252 56948 -127126 132880 148136
15594 148136 -216410 -327775 -504650 188989 -4056 -234914 -84247 116258 120813 251229
15584 251229 -58074 -224992 39994 1449 -79101 -137643 240692 -48325 -71324 -23667 252873
15572 -54693 -25944 -116789 -255771 -153727 -351836 -155642 -106891 400047 216908 180332
15562 180332 89584 -304647 -384464 -174606 217551 -10037 -192682 -354097 12358 -75696
15551 -98579 -242137 101058 82641 -249340 -80462 52920 -177454 -179411 32160 -118708 -180212
15540 -180212 26572 -130386 -105499 203233 -106880 -101053 -71484 -148720 11294 20656 -18362
15528 -173898 94654 -114849 -48676 -11521 162794 -115794 -57253 83441 174313 218398 61458
15516 360737 304810 -97339 150577 50706 -36094 145287 -244217 85405 99265 146280 288241
15505 288241 -1980 16398 34467 183723 -56826 -36971 -192892 175817 128207 304741 118530
15493 -78268 59078 178805 -94271 345894 147492 7401 -311981 143282 307180 67505 52265
15482 52265 117387 209560 -51679 304659 230452 276571 78616 -50938 -87223 -51762 -5020 57347
15469 -120390 48933 -259275 -22597 14190 -39083 198959 22821 -143589 218344 408513
15459 408513 165227 360657 462839 110318 272011 110231 295222 250988 252368 123051
15448 85968 -121297 24228 246589 216920 -39927 5427 115719 51377 111658 179620 51507
15436 10611 -163356 481490 -67081 -10589 -25824 41241 74574 58225 250682 73839 348261
15425 348261 272664 602186 725704 235262 575421 200426 48398 145890 67917 -133197
15414 44265 -114133 75363 -56653 -42763 -114288 -61035 -166780 122273 -233564 57482 249792
15403 249792 -7877 -180394 235459 -181023 6516 -45522 92780 174178 120418 -144188 130827
15391 84793 43718 -157123 -269749 -97353 183399 -223679 -182522 -250577 109167 -20616 88908
15379 57744 233475 91592 -58809 29957 -106490 -176047 345135 76860 134192 140023 215278
15368 215278 -217172 -261630 87563 31103 -2884 68520 -370829 157635 221459 -11182 134228
15356 77863 150117 108421 -41508 408594 -54230 -172792 206963 85875 12799 -24349 354770
15344 -85202 178385 150614 167890 -67730 225209 -225724 -346532 37609 189741 149985 18980
15332 154246 -61446 -145585 217286 235346 419369 308799 89322 584207 190122 226394
15322 226394 135560 82031 118451 46240 31201 -80054 -252226 -117200 272552 336174 -101710
15310 -691 68817 399462 83854 95550 197650 372152 58639 83751 96939 7919 153178
15299 153178 133228 7907 -71447 164595 -30866 167809 13682 357178 444513 70804 324108
15288 324108 -212595 -117653 94123 359518 76270 -287717 161327 366837 313767 -22891
15277 -251639 297907 -317335 342378 -49450 -107485 161149 -25369 -150597 329304 243815
15267 243815 -11895 -288176 -32388 169063 -147978 106737 56422 -129740 165454 -116748
15256 -37268 -130235 -238771 -25517 229244 -91792 -7860 -62365 4859 -133715 364113 1645
15244 -232230 -76174 161094 199129 125838 267293 188554 110126 -7640 116914 -75313 -243809
15233 -243809 73509 124551 45247 594507 299305 1106499 1273927 1428985 1060327 443383
15222 367746 326985 -30250 -70282 -148357 297633 180805 55236 85465 -56662 64546 -24368
15210 -35046 67189 114411 129485 -195765 -33438 -4449 91017 -128321 294772 7117 -126853
15198 144645 82645 -108185 118731 117692 35736 73452 36556 15539 12075 125106 -201805
15186 -136663 -132653 210348 168857 -91429 85503 -126365 66220 155381 115410 -62786 -90316
15175 -90316 26534 -166088 211390 447237 223008 12497 -135007 188206 -15604 -36808
15165 -36808 164558 259944 70598 31525 97173 -142303 -115541 -37026 -35388 65235 -3772 160034
15152 345187 38774 456086 79595 24210 -6714 131833 106588 1006 52673 414178 236941
15141 236941 106280 325021 80417 107668 231919 -106854 -173325 481627 135641 4047
15130 -31489 58754 158815 162990 -208935 -113849 -232715 262473 120190 368255 130551
15119 258474 497157 200002 257144 -63730 -18933 145857 -316732 152861 123499 -143317
15108 -15806 -111027 -155220 -25265 -143587 -91779 283963 15429 -224912 284414 103914 281355
15097 281355 -7203 -110527 -154602 58845 204952 245324 42818 137924 151882 92375 67659
15086 67659 84089 -202871 29124 346108 340318 157296 -35956 325227 -70807 282306 158409
15075 158409 212412 127829 451527 359824 -77132 116516 141229 50861 -96610 223368 -27439
15063 12693 310720 118838 172070 328750 347515 218130 147848 184115 -106279 206451
15052 -73618 217391 204707 216293 -164933 -82100 216376 147203 152629 340450 216891 318872
15041 318872 295147 259514 221708 413000 64017 448407 105204 141407 43241 134456 595820
15030 595820 577305 276856 280315 350644 252527 66846 228186 48957 190346 149053 454755
15019 454755 183603 -41635 175625 397593 365918 451546 455345 418843 594789 466236 268940
15008 268940 130134 200895 326039 30509 242736 29108 242294 549615 493928 91631
14997 257356 174479 -25559 458493 304479 514377 120462 113266 344869 275992 240333 186027
14986 186027 508213 431547 236957 432449 324415 313424 460392 213267 108543 238058
14976 238058 -4769 482778 355283 609494 220428 277798 250545 326813 254991 566113 461118
14965 461118 836741 578684 612142 490270 495455 378088 535871 498296 347337 -81345
14954 389511 199834 469366 124113 265183 469297 30683 571496 -29059 319033 240815
14944 240815 238463 186440 180117 165931 141175 385390 10441 -70886 130133 437310 236948
14933 236948 123771 350994 763550 352046 551765 462740 456782 255845 654683 219328
14922 90467 278459 559750 272498 577943 367938 319706 590465 702126 797902 803347
14912 803347 1297263 769602 909151 1220012 1347300 1107467 1123633 1097513 1244125 1377844
14902 1377844 1384320 1329047 1209142 1398180 1037771 1038938 804894 838061 598402 1057462
14892 1057462 704334 279461 159599 305811 229020 607707 143314 315077 445768 195895
14881 209174 291943 88141 388450 429944 65459 96568 383051 690155 449141 431654 481657
14870 481657 475976 564726 657699 618785 406479 475476 772433 642715 639929 646201 282387
14858 921028 374259 589988 296745 507865 439131 266173 745078 288431 624635 491903
14848 491903 350855 635104 422096 531992 356144 552278 708158 481484 287111 403872
14838 403872 256690 601181 428647 424823 250239 258125 668717 543618 511954 709391
14828 709391 349568 455294 717022 876232 1018444 937964 570779 1027855 747431 948641
14818 948641 685316 717974 637052 598239 342088 501929 474160 629041 586332 606287 421667
14807 421667 808307 717715 353961 312824 659870 463039 475658 651703 697638 706804 436299
14796 436299 411424 220766 444567 736303 127329 733548 284351 416432 571131 778476
14786 778476 877583 889776 573708 487010 668594 417415 105978 427389 445274 411665
14776 411665 358880 497743 487879 425752 1089255 702811 401324 654516 669934 825520
14766 825520 722793 829452 528802 584488 516067 777314 523271 678315 1231967 928145
14756 928145 668487 766819 592370 235007 733903 571483 472621 655137 695490 503646
14746 503646 582171 367422 650929 569935 439422 780811 623165 506917 352271 403115
14736 403115 353306 603665 400190 753835 456782 374862 637068 463013 517023 641258
14726 641258 667713 695457 475176 789396 635558 784735 637554 860170 812441 697656
14716 697656 1103894 719662 1142214 691890 742807 966666 1194036 1155719 1380576 1352881
14706 1352881 1109856 1143050 1015071 957651 741679 823377 721732 711402 965258 814033
14696 814033 488197 797685 921627 786080 813401 885537 574733 952418 914585 899236
14686 899236 1062685 1147732 1553812 1670727 1356979 1549461 1238060 1310456 904686 926514
14676 926514 753029 1091172 822566 945744 931231 964443 1000930 885021 1092944 996495
14666 996495 629665 1063414 800948 1223475 852405 781960 1049979 746460 1037886 1033656
14656 1033656 893959 631417 696671 692504 891476 782660 824591 845428 742767 605487
14646 605487 740557 801372 845061 728362 939071 876042 951504 929413 1014833 1063703 628288
14635 628288 734709 1224128 1041551 1065326 1310406 1103570 874444 1204972 1195211 1072257
14625 1072257 838716 775742 1023861 1201332 839968 900767 1284345 1084252 1227087 911536
14615 911536 1235426 997842 1541735 1085061 731559 1058784 1249003 1471343 1106960 1022634
14605 1022634 1382173 1398418 1395699 1364050 998636 1395034 1265209 1106779 1491186 1451336
14595 1451336 1290056 1133909 1247359 1551978 1495833 1101635 1586178 1690616 1233670 1181136
14585 1181136 1292626 1289621 1578726 1534491 1493254 1651988 1418272 1378821 1837080 1446535
14575 1446535 1298236 1657085 1593198 1742584 1605718 1788875 1494904 1842533 1377238 1559303
14565 1559303 1792917 1706277 1807755 1715033 1730292 1527893 1746569 1568913 1945318 1450474
14555 1450474 1850343 1876329 1986955 2052676 2034044 2384635 2218852 2111169 2272678 2121073
14545 2121073 2553710 2644894 2548614 2892711 2881337 3527288 3597747 4067635 4600227 5347368
14535 5347368 6485827 9417465 13131011 19236666 28245523 30264450 17772535 10364213
14527 10364213 6617476 4738311 4259918 4428601 4342034 3368783 2726904 2511272 2186981
14518 2186981 2545741 1918387 2014708 1873428 2461449 2113857 1908984 2014046 2019269 1813030
14508 1813030 1779727 2040960 1894850 2213442 2639310 2062314 2094654 2145477 2364469 2356579
14498 2356579 2162242 2505380 2564422 2374275 2527722 2171482 2426468 2477879 2484820 2814759
14488 2814759 2838028 2779915 2592776 2506342 2646644 3063226 2826792 2720980 2878314 2795974
14478 2795974 3351015 3106232 2960672 3008931 3004827 3015270 3150682 3328346 3278814 3399052
14468 3399052 3196299 3534607 3241531 3429379 3199199 3447661 3666819 3210966 3451814
14459 3451814 3468700 3785680 3331982 3793507 3780219 3819659 3806686 4004065 3821862 4018366
14449 4018366 3892892 4006561 4081410 4046237 4129199 4498060 3989675 4393308 4506217 4363252
14439 4363252 4708660 4731785 4277038 4606005 4792681 4879627 5037067 4968186 4746037 5083719
14429 5083719 5212976 4832081 4802887 5506919 5536698 5486627 5402809 5484285 5628698 5786161
14419 5786161 5499066 5679405 6167759 5983817 5843999 6331364 6227503 6466006 6504989 6310019
14409 6310019 6494344 6698094 6886451 6723128 7008516 7004324 7388616 7580884 7450597 7726571
14399 7726571 7973611 8195801 7742538 8010759 8029590 8078371 8335069 7927633 8731534 8644552
14389 8644552 8936557 9270893 8878326 9261087 9214963 9807650 9866219 9888598 10137161 10055153
14379 10055153 10543400 10342884 10544692 11063032 11043537 11250490 11726738 11267236 11713181
14370 11713181 12302192 12181046 12501966 12823843 12993863 13288730 13588530 13962779 14277627
14361 14277627 14486610 14489014 14896248 14907853 15106126 15786758 15799407 15963138 16721775 16807503
14351 16807503 17313215 17815489 18155113 18939029 18998208 19505044 19475946 20251223 20784781 20889621
14341 20889621 21677188 21888196 22645740 23400699 23352655 23711472 25084412 25618050 26261554
14332 26261554 26558077 27435260 28083813 28797946 29772851 30349888 31124208 32195772 33219723
14323 33219723 34374424 35141260 36352105 37464391 38265462 39356785 40588947 42056250
14315 42056250 43371888 44772364 45975258 47954972 49422790 51080318 52939996 54774150
14307 54774150 56773700 58836713 61039847 63526251 65589649 68347292 70654087 73323000
14299 73323000 76207054 79742143 82564077 86528950 89932541 94059052 98013146 102600637
14291 102600637 107515784 112529787 117823494 123538539 130106888 136621481 143353164 150692864
14283 150692864 158564817 166889417 175885456 185579161 195818896 206201407 217264599
14276 217264599 229393065 241887282 254941894 268333064 282204989 296261872 311061736
14269 311061736 325562343 340775008 355935510 371049431 385559523 399890046 413301446
14262 413301446 425283826 435934431 445906264 453234318 456296326 459100337 461409093 464329764
14254 464329764 463846674 456393388 450072494 443491204 434107743 422342954 408930879 394571159
14246 394571159 379726163 364767769 349498540 334171602 318928677 304111065 289627039
14239 289627039 275905772 262222063 249543370 236701989 223845181 212124772 200747002
14232 200747002 189891265 180195861 170550531 162004407 153812128 146342020 138918338 132433956
14224 132433956 126030933 120328358 114982521 109503608 104492124 99715829 95424809 91692979
14216 91692979 88304409 84361517 80781368 77538390 74777158 71407226 68767970 66423990
14208 66423990 63898486 61598966 59420432 57392674 55289127 53244555 51605441 50160575
14200 50160575 48539357 46861102 45793785 44064184 42835544 41555616 40301693 39480411
14192 39480411 38403695 37178813 36157685 35063996 34054791 33284773 32461268 31848954
14184 31848954 30980089 30160286 29294343 28301270 27420246 26725431 26407944 25211051 25086913
14175 25086913 24367701 24009767 23293423 22782223 21756202 21791842 21030108 20373442 20084685
14166 20084685 19975822 19556899 19063199 18503353 18036978 17795970 17290460 16683692 16781737
14157 16781737 16386124 16080200 16122130 15592714 15295031 15114875 14695714 14318374 14471069
14148 14471069 14079633 13900522 13623857 13473325 13061205 12495194 12413892 12543556 12088747
14139 12088747 11885656 11696690 11548042 11319077 11392617 10908516 10561607 10752386 10536658
14130 10536658 10355396 10097824 10067459 9725048 9452115 9837877 9402815 9187963 9107247 9249999
14120 9249999 8694651 8644392 8508112 8365631 8045143 8285852 8239193 8075771 7672781 7792018
14110 7792018 7807732 7560766 7672440 7251079 7220819 7328146 7295356 7056945 6898999 6725943
14100 6725943 7074127 6726862 6612925 6440461 6288608 6402704 5919537 6082227 5964202
14091 5964202 5945888 5967191 5685877 5791413 5657145 5478419 5816333 5616362 5361296 5522364
14081 5522364 5252029 5051989 4956299 5255222 4970736 5173045 5297480 5123539 4942277 4605038
14071 4605038 4681131 4860876 4419149 4670296 4755051 4863381 4583812 4431931 4532694 4174671
14061 4174671 4240003 4070600 4274781 4077802 4071646 4128225 3737761 4035669 4011190 4167694
14051 4167694 3753924 3901224 3936645 3831525 3781748 3521030 3934468 3626065 3815145 4062638
14041 4062638 3620226 3848268 3451742 3634495 3357856 3541539 3336548 3420063 3013245 3284303
14031 3284303 3139974 3077619 3212709 3126563 3095671 2904801 3079452 2952153 2940119 2775841
14021 2775841 3012418 2617590 2764692 2821011 2953969 2955754 2996353 2668172 3008237 2746064
14011 2746064 2703639 2646137 2421420 2412142 2503720 2289979 2356645 2666049 2505672 2304753
14001 2304753 2481373 2563300 2294291 2511570 2344693 2293641 2470451 2448724 2230358 2125474
13991 2125474 2061281 1695836 2117034 2052183 2335016 2041868 2047444 2162205 2324190 1949886
13981 1949886 2089891 2404068 2549672 2488414 3255233 3543958 4233672 6046096 9422160
13972 9422160 14602968 24442799 31553057 21573951 13909663 9179741 7114901 5142847
13964 5142847 4732369 3753650 3757854 3277561 3207257 2720654 2715008 2484218 2447515 2260185
13954 2260185 2456461 2368215 2470203 2036373 2132338 1932037 2105727 2087514 1817817 2062497
13944 2062497 2100826 1566674 1792861 1772571 1704327 1791695 1749596 2012786 1854435 1624885
13934 1624885 1430705 1809887 1834968 1689407 1776260 1728244 1391741 2017879 1692852 1296354
13924 1296354 1357431 1580531 1656348 1557702 1936907 1651615 1515965 1289000 1699036 1421400
13914 1421400 1607054 1697587 1590919 1541308 1697090 1391953 1755238 1332573 1624844 1374525
13904 1374525 1719226 1214731 1418433 1741444 1471312 1445721 1384372 1312288 1454660 1277021
13894 1277021 1666327 1260676 1353406 1378764 1187206 1299723 899058 1109238 1276440 1207811
13884 1207811 1080083 1204528 1534464 1214647 1088480 1348588 1009715 1187755 1204705 1231306
13874 1231306 1132324 982980 1250978 946570 1126788 1223839 1087079 1126212 1066922 1317106
13864 1317106 1323205 862318 1053869 775870 1002261 1096286 1061924 1234899 1024782 1108130
13854 1108130 854224 893873 901284 899718 1210332 1044763 1215859 919865 1057581 828096
13844 828096 941933 1197057 756487 1380555 1022270 1082638 905750 702471 966213 742290
13834 742290 928659 799181 1014800 948910 1239407 1086360 984544 975977 1100098 1033998
13824 1033998 839476 794666 734077 912140 795014 1013247 1057218 1083480 686716 784336
13814 784336 1091426 905669 717038 926014 689582 833976 1223521 717334 1153514 630652
13804 630652 1043800 861911 754212 840935 551540 836744 926497 555167 707735 492825
13794 492825 788428 721419 621370 634412 962922 927148 1071508 676069 899102 878864
13784 878864 609739 718396 293485 636817 716110 978314 839513 677314 789321 894252
13774 894252 635653 666156 669916 498367 357153 595466 611519 665252 504366 433452 343944
13763 343944 456191 298002 896186 385991 468980 453732 1169052 610897 907739 706988
13753 706988 674043 707246 312921 158833 938234 607372 275681 666392 651089 387313
13743 387313 766385 311130 1022247 594274 276531 874723 775688 576763 381512 766202
13733 766202 571026 394708 257272 299983 604510 1027098 436470 300534 554741 615851
13723 615851 1012699 516451 387757 547475 382648 590222 434196 720627 724433 649602
13713 649602 641224 630086 812673 382834 507379 454862 773386 647922 326860 556208
13703 556208 522497 795392 554617 362864 365505 491539 840443 540976 575771 647322
13693 647322 401030 741289 568948 534623 445053 287473 574479 520931 540016 286749
13683 286749 550935 749955 646097 580631 400272 455142 207310 238890 732559 266126
13672 404482 610943 677209 682615 162123 598571 269377 487659 518977 533130 499625 386545
13661 386545 474983 432529 573982 457416 423049 491646 484054 485581 245947 473532 505140
13650 505140 329991 762076 605477 208028 492355 610164 547354 438226 421952 187465
13639 318699 762312 536883 110069 483341 327302 296522 227664 569300 554223 573139
13629 573139 537871 279964 453728 431424 362976 512074 517639 173911 186313 89560 301488
13618 301488 505692 642771 429196 350976 27543 406414 531905 280402 387334 571551
13608 571551 196592 287939 513887 205302 348721 206343 109202 433523 199036 497178
13598 497178 366681 297104 398576 302936 311921 455970 129901 330130 110504 234581
13588 234581 224276 537821 285325 175658 308351 526990 583601 330197 242495 123353
13578 123353 795570 53839 202422 157359 490620 256529 202447 414856 338755 326475
13568 326475 346128 253690 720226 207430 205265 276160 264924 281690 134138 371474 167715
13556 178623 627604 171544 497760 10351 154063 95683 158595 419587 180034 22874
13545 22863 408329 324962 164909 194019 470710 198283 504184 202737 238793 456126
13535 456126 -83313 85354 314590 194309 119790 288599 393362 224714 695799 222274
13524 330278 411534 505322 407400 477008 158954 383900 451541 124250 279521 398538
13514 398538 347552 106179 190182 302014 482257 9008 -119767 188308 70540 33692 2992
13502 151633 445621 223361 22744 301686 422846 80086 335293 401226 356162 349110 76402
13490 -67928 527663 83112 294463 274132 235155 55463 318068 151155 114111 156756 -76853
13478 684672 -28622 186806 81985 93478 323775 171473 321092 394773 -43127 93284 8474
13466 397743 318672 403221 188502 648315 -19447 -110438 158629 -1163 19272 -28710 355036
13454 124935 432811 -111473 -99656 571516 162592 -37457 302093 182211 280058 83938
13443 76406 430366 85799 22565 403477 -36694 425730 160683 310544 58974 -8565 294456
13431 -34647 27318 157045 313181 -7720 106992 374559 437219 132028 212379 289233 69597
13419 115746 182922 330290 66499 265479 78155 23287 136288 95937 439135 30500 59366
13408 59366 354646 89164 118950 197312 -7880 221380 -8979 316298 190084 339641 73421
13396 -149277 446143 312025 245122 289304 269759 325664 312503 18752 239028 209658 261654
13385 261654 446271 191074 -101338 393592 420789 -42726 99100 101594 434284 -7263 105578
13373 36249 309475 66003 341570 -43350 100535 197929 263613 332638 -42851 546600 100724
13361 177365 369718 34551 191505 381654 -128254 307987 512998 199253 148681 43118
13350 477114 182831 227447 146174 162106 467664 75146 16861 90771 341728 390302 308849
13339 308849 -26035 -10479 280793 -103169 32325 246222 61857 30031 379530 345607 467545
13328 467545 156329 213964 64835 297003 224399 112514 295557 384783 122324 318898
13318 318898 182941 126108 -138525 -16850 205628 357800 322149 395254 381198 787342
13308 787342 276875 153842 156168 192658 223319 245507 447258 410031 117215 -151183 162601
13296 367995 295168 296524 383177 -27796 70376 314776 -25689 202175 179243 -47338 3855
13284 -31466 301270 102030 407668 313188 54569 111369 48656 240655 219063 80086 166590
13273 166590 235636 128495 21513 -14892 132342 -164138 146611 -180440 37289 78241
13263 78241 119788 250447 273068 266155 47744 393883 160720 -99975 98803 -92254 248138
13251 73484 142962 140834 -85272 -51660 262173 58787 -106285 106838 50863 -14497 77732
13239 9132 385568 224232 459201 25925 238009 492203 128797 8308 209734 171497 385008
13228 385008 150789 100351 315858 245564 199756 93962 455205 208685 204845 119217 228675
13217 228675 -136700 485307 -146868 86965 -140149 -254324 -200143 181620 281711 54689
13206 340733 -82931 3891 -21866 229659 -48812 306748 15333 81359 -114805 110575 210003
13195 210003 9344 85162 258609 -254169 154847 225708 -104063 78761 -176754 16114 27013
13184 27013 -99923 249122 63975 -328143 257756 467927 -242653 -55355 -66601 138378
13173 250045 234523 416474 290223 49977 74521 230489 250545 45390 -215764 49453 -57708
13161 -600408 -82629 93142 178318 -56463 257834 -89154 -234884 -259598 35884 293449 17549
13149 -1459 3793 57047 184168 132147 -211506 187650 -93744 -91968 42033 108441 213642
13138 213642 -86431 -100689 156314 194741 297710 -22056 -278977 -58403 4434 -271154 265235
13126 258550 -185969 318598 114815 59649 272386 -233559 96746 126591 -81655 158681
13115 -106323 -63102 66370 -172159 133428 39075 264495 229339 633355 -90808 106444
13104 -19397 171176 202296 -92844 -112094 -16916 110517 191507 484008 129659 -62123 -13607
13092 -12265 15323 109727 -21575 236800 -86555 -61404 58086 245486 198748 -30567 567180
13080 -58571 27699 109173 -26183 263521 273171 151212 -27772 75426 9513 87796 -68887 87889
13067 16226 82982 112649 -213436 -184071 -278118 183849 175100 293008 -140419 -64563 269777
13055 -81759 16401 180302 -212755 253977 244926 -10969 -122620 -190869 236185 236873 -80293
13043 9940 -52175 49733 83738 126676 24145 357899 -210620 102246 -198021 -62069 106807
13031 80293 443469 132338 -156459 181607 -109457 277541 90651 382476 223929 252742
13021 252742 130514 297155 53177 215123 67872 222083 -88235 234512 -23707 205174
13010 234895 488286 109896 -11186 184521 371636 -168674 -254621 318276 -40317 258828
12999 -21770 84854 124094 160210 -213257 343956 -302023 48896 181033 571317 -93075 219902
12987 194755 115176 89102 1767 -113994 289801 90532 -40360 58935 -97001 72178 -42048
12975 -85260 -11650 -89368 356775 2713 -34975 80539 133033 -18753 6122 -115191 -150317 198667
12962 33973 342967 247506 510 68242 45782 -53257 327135 -87062 -12791 -99923 206102
12950 43655 121363 -306993 99071 -47840 -163720 70203 247202 -197579 -24900 -50294 -379062
12939 -379062 357862 72660 148747 -39048 -68341 194027 -86325 -123426 240869 -8508 99126
12927 319573 472537 -131800 -181656 35781 -372720 -78374 69672 -195394 128791 57661
12916 208031 -136333 67032 143960 -118739 -26751 28329 175331 -92250 108415 -123084
12905 8960 -130858 -262976 -84150 -5267 224451 159863 -5402 4224 -128352 102101 -47252
12893 -200904 -72201 97681 293020 33494 -41235 -41234 -159924 161457 144307 12704 -24607 -47734
12881 -47734 -256350 300295 123110 -53090 -277818 -140622 342737 -496542 -44769 -73132
12871 -73132 -221987 -224688 21046 -59738 363 -15062 652202 368570 64736 9781 -239388 -11959
12858 22838 18207 324028 132211 -48607 6828 -4096 109243 -147847 79719 119097 102910
12847 102910 11108 124460 -18752 424391 -119513 -163167 53025 301288 -40329 154170
12836 27755 -76954 65636 -153094 -199713 76948 253542 101734 -2718 -190634 -18913 -37238
12825 -37238 -281261 -49963 -27614 152331 -21268 52255 23783 -68867 128520 389009 80994
12813 -121102 -62273 111084 75201 -16810 143880 242823 101238 -16226 91451 -9758 -81262
12802 -81262 194373 -309527 -103366 -304532 117472 99111 53388 98773 71993 40330 139602
12791 139602 -205970 -48950 8007 141404 -42276 62325 -40463 -32326 -111984 -381259 128382
12779 -299588 -49788 65900 184631 283030 160757 -101693 36378 170123 -44509 53022 380819
12768 380819 -64124 -355943 51882 -188024 -291234 -129818 -149316 64814 163165 -6002 -63812
12757 -63812 374900 -297802 119031 -221968 -4697 -94059 -186655 57212 102022 -48883 -82682
12746 -82682 -95418 -244921 -48108 -47513 -172726 178679 6380 -195559 386394 -68940 26689
12734 132548 108257 -39722 41447 -72929 -315966 -114393 266706 167449 -63417 129289 356868
12723 356868 104319 27325 172055 -89220 -785 248839 -137139 78202 115767 249111 72679
12711 -3748 290045 -35730 -83703 220574 -37520 -60781 272046 118158 -112071 -234007 433383
12699 264218 -479510 -71618 202752 225370 93599 -65351 101219 95961 259949 351259 165181
12687 280685 -45137 166710 365315 -13231 100128 -94432 -31064 210205 -200490 -188255
12677 -188255 64156 -79887 -149930 -240535 -67512 11780 -18433 93898 190438 318389 73097
12665 21960 366275 28879 154249 -89932 -236928 372517 -46345 134799 38515 -54556 -28660
12654 -28660 -27319 -210842 -217970 -18287 -216511 -84885 378476 182749 139940 -79176 47521
12642 -157860 49523 53755 262497 46398 -62381 365266 35697 137846 310634 60614 239289
12631 239289 242749 279221 95571 129412 251750 90173 -62435 127781 -42841 200408 266305
12620 266305 -56708 -147656 -30508 65720 166585 171493 145696 312865 93668 112433 49354
12608 428622 219560 -51488 191948 226408 65138 63289 -131062 197924 -95785 224492 -95755
12596 298987 -70412 -75209 -260121 48650 178801 -47226 -289560 301340 -108726 -55133 44708
12584 1575 20413 57279 401181 -154820 -28711 191160 145987 -223387 -52426 385012 224621
12573 224621 69226 -211245 166107 276370 912 -178761 171992 386726 261596 304275
12563 304275 -11943 28902 34926 -96547 193883 234972 62896 -526777 -313472 -8501 70635
12551 122472 29450 198743 398957 -96482 265183 50211 342718 144 -63712 -47835 -15559
12539 119883 -224146 126675 164582 -1212 -101938 190928 146723 -22247 69845 -86379 51168
12527 14215 224718 92103 -154164 -118458 226771 175555 175403 -352656 -107341 28479 -4153
12515 67033 -65458 -126185 158006 -101682 61381 -363507 -302869 -78989 -191755 254703 -101804
12503 -64643 95759 -77954 226846 395024 99003 88162 -58140 9831 -141407 102021 -63915
12491 -20087 37071 -68064 -173649 -54146 171531 -93733 -67611 143646 116908 -69694 244493
12479 -440006 254620 18385 -95516 -240027 60997 267100 -92477 130184 284960 -56837
12468 160925 -110429 248406 311846 -230446 109505 -8330 96620 -67455 386421 -36849 418200
12456 -245765 -20422 7942 -231924 -226495 456447 -60397 45463 -24201 47024 58383 -46214
12444 -132668 -326614 -294541 -130113 -160490 -101066 180073 -62070 -119883 -42807 -83503 58579
12432 65899 24892 36538 32838 -171166 -215229 -429462 135759 246234 -120450 -190107 21019
12420 -280500 -19139 -6548 -79429 82071 -152278 -76208 56758 -27793 99694 281666 -35953
12408 -204173 224 -257228 -199922 425049 -53124 235166 4174 -122439 234874 -99253 107298
12396 -114098 60370 18083 128590 -174566 -286728 72819 133173 -216253 -15024 -128821
12386 -128821 314530 -10947 -21149 -208471 260607 -136514 -198595 -126782 -119580 79872 -268160
12374 -35427 -65447 135256 90663 -101397 189572 263866 54208 -150465 30672 -82164 234963
12362 82225 80998 18891 -82765 -12399 104180 -244982 104039 152555 -39025 -198027 54882
12350 -26458 -384914 -198515 55893 -268603 -104513 65280 -70938 -221262 107018 28664
12339 -5719 182840 101138 -84395 -251155 398523 -153374 176804 -27806 58865 364217 220890
12328 220890 124396 255658 -188540 -16637 -217742 174356 196621 169094 353352 171980
12317 -153662 -261340 -84025 35808 101522 482364 154857 228245 -40424 149006 236638 -4267
12305 367688 380678 125762 324755 403472 -22589 32055 -7874 283526 45716 -89508 -93679
12294 -93679 33782 252474 -117130 -139588 -141459 339498 424092 -73375 -201549 -155253 -33440
12282 115251 134853 -23647 183539 68143 236303 35000 240652 -19045 17010 -133741 221745
12270 377555 260629 86311 -104707 -232606 419717 91961 108871 26868 254158 112803
12259 293074 -237521 -21220 92823 217608 96297 183911 309239 -205425 67731 336072
12249 336072 221619 -63655 253367 -112032 100797 17086 -51972 96426 17004 90540 47614
12238 47614 -163186 -1056 -42807 61212 -222393 64833 -72428 433151 -44468 -39430 -75776
12227 -75776 361603 215997 301432 321025 315183 263271 13328 281386 -67028 22204 -127444
12215 128651 138031 348272 68841 188107 -54521 311813 41843 311786 184844 173874 322089
12204 322089 588995 -167123 484048 535880 60182 444898 75929 177524 218075 45004
12193 217394 474397 -212479 8315 172964 56787 67034 -450637 452294 -10709 -210143
12183 -210143 127910 98372 359109 -179440 318017 119895 99330 33225 201926 157059
12173 157059 139876 342910 352565 515517 279003 181095 173915 23723 225617 140128 110929
12162 110929 401249 153829 103917 258292 254292 367632 62021 667790 36653 342634
12152 342634 337808 137146 478231 47712 433933 356221 494115 -7991 115240 -213222 -99728
12140 104197 38513 87034 226911 -56957 -183523 189017 76373 -47112 191157 213644 148522
12129 148522 -53513 61070 189343 -37445 -101278 -250532 330711 125160 146199 223204 -167963
12117 -1766 314537 -110336 330894 40999 -112930 179556 -88945 372825 256996 -124536
12106 394176 -39527 -26771 146320 -202249 -356308 45048 8059 149930 59409 202809 -124084
12094 -72344 72323 -15694 126001 237801 6662 -109082 66479 -49757 -24483 160444 -12226
12082 273701 189795 -123787 262423 -203733 -112328 -181747 -85593 411 216389 396551 249110
12071 249110 -1135 436803 -68745 -17408 16614 -114896 184906 87236 84896 36835 213796
12060 213796 -52999 -416170 265544 169045 -87634 437006 -28392 34378 118033 272732 -84241
12048 196312 267247 35451 -185688 160196 123626 -97177 -48938 114870 193771 11370 124774
12037 124774 101889 312665 -290464 118740 -226412 62464 -56804 -225828 -58939 -145217
12027 -145217 62639 213377 59743 125738 72000 186279 50882 -127960 149989 125038 267114
12016 267114 132018 241467 40823 77629 -39364 -6171 254514 -172554 254638 18694 101182
12005 101182 92322 180860 -61649 -332127 88988 -130459 32470 363468 -120024 148550 71888
11993 88722 -24945 -220 211856 -235852 -377016 -191940 7218 341483 -355530 -331377 -83415
11981 -283703 -53527 242949 -9020 88656 -217427 18327 121564 50836 301794 24108 106580
11970 106580 -87788 -472 49909 -276271 26520 -203404 111343 -146431 226548 -85246 21340
11958 -140524 -223907 -52098 -2813 157373 289242 14603 139619 113818 -339954 -62874 -101693
11947 -101693 187152 -101161 65513 -178814 -34698 -270386 -159544 -10178 -51513 -106772
11937 -106772 32437 -88178 -157540 -222582 -271303 125646 68569 51250 -345471 239032 146970
11926 146970 141785 119669 -84257 103291 -141352 -57380 -87734 -147362 -133529 -386199 -97193
11914 57402 118532 210405 -72831 -210322 91991 -137284 -10391 287864 89678 -266771 50893
11902 -284748 -363241 4413 475 -204647 -17567 261100 51298 43292 -71448 -94042 -243901 -170911
11890 -170911 72428 -129438 223315 39941 -12610 -374874 -136921 45068 290080 -4783 258052
11878 -26890 -230560 -93759 -83788 -154152 -70224 166755 167357 85838 -258313 18210 237507
11867 237507 -233478 88084 -131345 182660 50540 -108661 -79911 272639 137044 43995
11856 44773 -17041 40068 -581123 237535 81805 -37333 -55447 -85385 105793 143210 67804
11844 122658 86532 -70223 -50552 -342480 -414185 -71675 -305839 -87588 -79799 222328 -62787
11832 8636 -75049 -116797 -112132 -240062 -310016 -40133 1848 235701 -143338 -159488 -227090 -80680
11819 290883 150815 -128291 -149999 891 -80 -93919 138766 -64612 225220 -32109 33868 84689
11807 84689 -64609 180982 -158300 -178151 102149 251306 -179912 104887 34364 56288
11797 56288 -229242 224429 -182351 -181065 40256 -55920 83705 -21213 -5171 -37843 43204
11785 -11416 -207597 34696 -48016 -213414 -46965 96953 51586 -155085 159264 -153291 -195972
11774 -195972 -140800 -98227 28771 111490 -301500 -344418 273246 326022 12699 100199 -65010
11762 120730 344865 127586 25525 -7722 109708 -212007 -66217 64322 15403 118107 -38979
11750 25760 -13111 -84967 -221839 108059 108410 -140336 -57244 -134282 26371 23289 -325292
11738 227815 -83133 -139047 -288145 66399 -402694 -22729 -138045 -226079 -66674 -72544 -510490
11727 -510490 -94515 323952 -8483 -82953 -154447 -210730 -326382 -1699 -337511 -215329 -356581
11716 -356581 213844 -124240 -55194 -99420 -12469 125246 -78501 -368966 168985 204171
11706 204171 -36442 -207949 -37265 46803 3552 -86657 -183231 -159320 -9761 -373635 58640
11694 -228362 157084 75697 -130330 301040 35992 -97981 -130807 295465 48793 65985 -24428
11682 -232788 72188 -57877 371021 137756 -274525 256801 47305 48206 87984 -179384 28321
11670 -95299 158046 -35941 256354 244213 -113170 25415 49269 160045 288897 215310 165205
11659 165205 -213129 -71721 -109979 242525 -68138 -11312 92500 -145282 143155 42416 -12844
11647 24194 -146021 15615 -11666 -135383 -19864 -167943 54813 50656 110784 -47854 -232378
11636 -232378 99274 134575 -47231 70164 184770 195680 595719 17114 -137240 -170377 15809
11624 -1894 -3071 35533 -17895 158821 64056 -325219 213793 72363 -68420 24765 -114415
11612 101423 -219976 -277216 -302154 -65728 -305321 85847 268694 -51656 98688 82966 -351558
11600 216721 -11538 289604 -207862 -257956 18281 61966 -241131 -148648 183479 208815 -118528
11588 240242 -112083 21682 287894 -108656 229974 173506 25795 16644 -138277 192373
11577 13945 120287 -7129 123292 306852 285524 69041 -195197 204087 32238 -8771 4228
11565 43050 243551 252856 -265158 -204969 2414 232853 -13118 78597 -59629 74204 -69296
11553 72957 -191340 -62334 -86644 -238902 47864 -66689 -22877 322763 -478078 93004 218859
11542 218859 72844 90269 -272769 80041 -19591 149712 125415 -34109 124127 -17401 39533
11530 -150380 -72558 50975 130617 -28466 128428 266640 -176908 318940 184134 102775
11520 102775 138182 37966 -177926 -145561 241464 178700 162413 -41446 -16002 135405 -26145
11508 229360 120655 -136228 358263 -12315 -393676 -211421 275022 -159341 250712 478463
11498 478463 171732 -264118 316178 -44550 -13008 300029 -94019 174929 26334 -138423
11487 -182287 -43377 94683 484747 10483 -191992 358897 123020 216809 -46827 317396
11476 262591 264452 406411 63168 402117 293741 -283218 248697 -42341 101465 -195098
11465 371630 -124713 64694 -121112 32996 71182 106745 105862 136089 398105 -40146 -4321
11453 272486 -121657 -1395 259719 101106 -143554 206848 152039 -113399 132057 208713
11443 208713 179432 53950 -144144 6399 175106 -22180 129237 -125461 -195695 136629 255474
11432 255474 419096 288244 -100087 133650 96105 151609 270001 14196 74753 -60888
11421 -87481 -125022 116733 295524 67858 -76788 -43242 2559 -25347 274119 167434 392164
11410 392164 -27821 266642 -55956 129284 167832 62534 -3093 142442 101960 -53498 -43409
11399 -43409 -86358 256588 -138193 -326224 -133059 -68656 -232146 -197916 -60501 21389 85789
11388 85789 69820 108909 29728 158279 54471 410255 -198086 349574 -403601 -177217
11377 34506 34778 110257 -23555 -16942 293131 430254 -244612 -103890 -132101 -6174 -100800 167969
11364 116313 -200329 156345 41462 207549 -37875 234862 61591 45023 42687 -15384 -237954
11353 -237954 -204160 -210133 106653 -46727 133119 -162276 31943 -130026 -200220 -170745 -109544
11342 -109544 170827 -97962 -72917 -21925 -131354 198157 -16354 12292 -103897 -253621
11332 -253621 206153 -33179 239405 11443 -53664 -311837 -169793 -135299 36802 -194465
11321 319593 122066 -188997 -121134 -79907 -96462 -70067 -63975 -43915 160197 -161109 184706
11309 -267640 1147 -13521 179790 -325064 189335 -116832 -52084 27996 -54828 19332 -38392
11297 76510 137502 164474 -63747 -13446 333264 -172982 -47726 -152010 27706 -26676 196614
11285 -60562 -369044 -222756 -97245 160528 -27577 -142425 112282 -155514 -93277 -77266
11275 -77266 -19340 33601 12946 110580 -70915 -68659 -15056 -18507 -153939 -33661 -80689 -545936
11263 -545936 -141612 170608 -51391 -138178 -18418 -128661 150519 167149 160551 -279720 56233
11251 -66937 -91585 -69165 -22338 115337 -20394 -21918 96044 -273843 -89862 124515 55564
11239 293826 184588 22435 -13960 -307727 128888 251172 -349371 351551 -297503 -276455
11229 -276455 -232655 185689 -328394 -10895 -356092 -348765 -136642 204921 -28807 -125520 -131874
11218 -131874 -253129 162309 -188704 -69554 144183 40033 340461 -55470 -189160 -34415
11207 -171350 -149925 255503 -32124 -201025 12723 -290322 -253475 60842 89175 81790 -22316
11195 6802 236628 -22450 98731 17833 205918 -67750 -111800 39278 187624 64331 -7625
11183 -20507 -44713 128673 111163 26866 47531 136664 -262828 82105 -167160 -80563 15768
11171 68186 -285601 -52446 53609 -43241 -158542 176958 37660 -316596 -222061 -221075 49179
11159 83977 187932 72660 -175139 25753 13148 -23310 -51071 -90108 114879 -128163 -34236
11147 108972 -9670 -37990 -89405 -57187 -88246 153955 -244697 -44300 -165746 -330563 -75086
11135 16812 -309163 68493 -309291 -196818 -155981 -16241 189988 -67709 -112764 51468 -70130
11123 -42762 33824 -104710 44841 59050 -14507 126047 493016 305115 -1189 128014 37612
11111 96951 401146 -63361 -170907 291263 -184250 196159 -147155 65507 106380 36405
11100 -25516 -110437 241110 70985 277428 -88556 245151 -36336 6654 -251216 -435 -27222
11089 -27222 137859 296948 245110 36249 -166719 -132764 366473 591108 253149 406439
11079 406439 292092 214196 130581 388380 -131719 225653 195555 184519 106972 93410 -14846
11067 24129 323249 -103913 265887 349697 336947 187974 73966 227420 77699 7341 493296
11056 493296 169353 279169 208196 229458 120362 470185 66868 284352 475825 86555
11045 64502 290488 413364 137268 270717 512665 472272 677414 427641 598463 426079
11035 426079 510082 632328 404039 556434 690103 614519 699006 462603 700840 948960
11025 948960 603881 521857 384787 749085 815878 853702 593548 635309 716284 721855 837950
11014 837950 601496 354637 952589 864684 807221 595711 461228 688468 673485 830260
11004 830260 825729 313117 492992 541451 643333 247873 458732 441780 432288 357378 409513
10993 409513 611021 446844 488838 248420 585621 448382 406066 302819 720886 565573
10983 565573 781544 784136 457767 458996 583340 399281 489762 610988 382951 727559
10973 727559 733545 698203 662652 447046 611762 782927 464307 556096 893573 651187
10963 651187 1186888 1408942 1291039 1376580 1357734 1637927 1464336 1866555 2207949 1775025
10953 1775025 2383349 1992628 2019554 2217085 2045426 1892466 1831695 1407136 1509089 1430792
10943 1430792 1452846 1453231 1141178 1098669 1415703 1302207 1144114 1430614 1124011 1149205
10933 1149205 941002 715702 812624 733706 820983 410168 262699 374288 316921 607475
10923 607475 285379 143717 179741 106877 150406 -28343 -185656 205022 -40854 -98682 162931
10911 206019 5561 119951 -5449 10683 215423 136391 69655 282456 -5506 296565 128830
10899 191589 -21990 67605 80951 -39738 182276 125700 -89277 -270476 -260659 -60381 306161
10887 24794 -205571 -20420 -156510 -175357 37702 119293 102762 123001 -243440 154421 -108417
10875 -188922 -136541 -256882 -65948 266346 -61166 84909 24861 42090 -63845 106671 -108788
10863 -29847 41464 61261 -184214 -118893 36573 -63908 -21157 21070 -109658 62159 461 138163
10851 138163 185919 159816 66973 -388135 124754 -244555 -132109 -65547 -38623 -73301 -87445
10840 -87445 238292 -93823 79006 38094 38183 -137642 99843 182925 -128812 146121 -49293
10828 -179463 -73169 -67662 -142774 71033 76304 -86659 93825 -353465 201975 -154166 -175746
10817 -175746 24278 37457 -94234 -210984 104810 -283425 170926 209639 -64891 305 -33001
10805 -490449 97205 -3701 154632 -114476 -139202 -112493 -184051 -156784 -241189 -87114 -348089
10794 -348089 -180174 170968 -79955 -300634 -321831 91110 -81570 -74254 2250 103065 -11406
10782 -91112 125595 -203322 -365038 -45167 323354 -107705 43816 29672 -243114 71529
10771 -49094 -302456 266941 -61903 -75358 14869 25646 -2234 156684 76561 113278 147545
10760 147545 21496 -537772 -88127 194627 116462 211128 126805 -20490 -302093 21042 128667
10749 128667 -221383 262561 123371 223353 -167281 108169 41252 30681 -201229 -170778
10739 -170778 -27487 -99882 -58684 -73873 28930 -311210 -113283 382039 -126559 -196978 118846
10727 11078 207867 -22313 -114059 270358 -421935 -31355 255243 -357694 -199034 -159112
10717 -159112 194090 -223208 -129304 42372 -5568 140569 205983 -185262 -1118 121171 160923
10706 160923 76198 -113972 173598 -22289 -103354 -339495 54974 -287532 -140315 137120
10695 -17896 -58326 -233163 -53499 -187251 103808 -409383 135455 -267956 366475 32255
10684 38467 141935 -73758 -270034 10775 11592 -55899 -7681 -291044 -152923 -99007 -149375
10673 -149375 -221944 -277316 -254952 -50403 -27120 -430278 141591 -38642 -57345 424373 -186424
10661 -228117 -135338 146335 35626 -132220 4539 175715 -344473 -218839 -62237 -81639 -279603
10650 -279603 -66663 -87719 -110205 89212 -220933 110782 -161468 -42980 -301605 -121916
10639 -19608 -174873 -476606 54371 -56906 -24361 -111177 -249506 -101094 -165394 151351 -229424
10627 -232545 -205974 82380 -45722 50912 94889 192539 -160247 122727 -345392 92848 -211343
10615 113082 -37000 -351558 70022 -75984 -85284 36419 -15926 -83761 170039 -38327 -82593
10604 -82593 141216 -181196 -111662 -155699 -168067 -255658 -150860 -39369 -188378 40542 -181033
10592 91325 101099 -23247 253950 -31274 -219137 -292290 132590 -21934 -563811 -198606 24240
10580 -206013 -211740 146027 -75615 55916 -302386 -95875 -211364 -400467 34293 339545 293221
10569 293221 -22450 -36094 -50464 25414 -206611 157076 -77107 138418 -67834 55312 279885
10558 279885 -117287 -144940 34702 -374999 -134700 67249 26249 7397 -76465 16185 -333927
10546 -122988 57321 97599 128915 70297 205426 100129 17245 81577 -43020 116360 -95707
10534 -250598 -234790 -172523 -469843 -77280 -198792 -154088 230341 10281 17151 116889 -148511
10522 -128963 261842 -148122 -324245 -230711 -16523 -21831 -47566 -89061 -12705 -162868 43609
10510 191848 99769 -93284 -35714 111063 -187398 -144779 -457538 38165 -72886 109669 -135639
10498 -113119 -153558 199577 86047 135809 -469227 22672 1694 -206039 -204069 -32064 -417680
10487 -417680 166744 -106678 309501 48521 79472 -18947 11489 -106264 -34306 -244990
10477 -244990 -41595 10263 82242 -142205 -106427 198527 6910 83633 150253 40037 90100
10466 90100 -228404 -6223 -19591 104969 188539 618321 354919 281458 179952 67084 209152
10455 209152 105534 145988 -46120 189179 141906 -123044 148786 -77432 391370 131443
10444 -61455 241576 161066 -23568 -168748 135754 179111 -293507 -3039 -138584 -100751 -264956
10433 -264956 -198556 -106362 -59115 110281 -121565 102284 66635 -366032 121206 -128456
10422 -142512 -114712 -10104 90165 267839 -124459 25307 -100206 47956 -37679 180382 -131716
10410 -263003 -303644 64233 -234611 -67658 -61915 88116 -124913 -184506 22892 -47856 13136
10398 320367 -285938 -71288 31721 -56862 -90475 -17994 -453205 -24809 -46644 50361 -163220
10386 -168928 -188307 3798 -48526 -370947 -278453 287505 167918 16420 101040 35304 334702
10375 334702 392179 284769 -103314 562726 -130392 378003 464587 -67682 211900 200044
10365 200044 85162 218525 -49403 -190297 -242962 481333 -163427 -194992 226776 300904
10355 300904 135502 -53426 195449 233011 125075 299245 645881 357637 340613 101796
10344 397352 176927 199835 190083 332562 37855 -55078 188863 37880 80724 390630 385692
10333 385692 287521 419467 298253 190693 184621 299428 492818 370519 503161 68256
10322 82978 171002 259691 139814 135878 72259 392401 37471 117173 183593 56750 243129
10311 243129 64654 145139 23059 295255 -203052 -140796 246136 201403 125399 442627 280267
10300 280267 89724 -156573 320887 -205615 13068 -117758 60543 69353 -49291 318867 -108494
10288 323458 178113 60219 -6258 231732 -101023 -267953 -301353 85295 335782 254747 -168966
10276 -126756 28094 -15094 83958 -181916 80903 127888 -39351 73380 -184450 -3270 152377
10264 -159389 62638 -325091 85001 -316112 -471768 35194 -144880 56616 62715 -211742 370200
10252 25029 -75201 114279 -161923 133384 245659 176723 -146758 -220916 -17936 172801
10241 -95759 48001 479194 321974 25137 165290 236744 1632 -84526 382722 -204815 -13712
10229 25164 -10548 -191942 -56142 -366270 -251980 -107586 -272267 227302 57971 275197
10219 275197 -261569 -227326 -150131 -137315 -138010 -97043 143239 92230 -116853 -60403 67457
10207 160387 39104 313851 -132352 156854 74915 -91408 150426 82803 -95516 118775
10196 -226575 104752 -159388 -177051 -362865 149521 -126788 -112726 108319 187912 -96414
10185 -109833 13154 78014 -230095 -78014 2870 -90346 163131 103495 -127874 114128 -55955
10173 207903 -307866 -134668 -133613 -38752 -205762 -25679 -150544 -198518 132334 79679 -35307
10161 54849 -194818 -361467 -136021 60357 65203 -5786 -71786 -87415 -191446 164206 -21158
10149 34841 -66875 128415 -161300 86214 -73069 -281943 -99982 -184498 81850 -127788 -48972
10137 -169836 -218539 223632 35928 -354467 -200618 -16649 205630 -248987 -110326 -474377
10127 -474377 -234524 -83504 108791 -72766 -3200 144171 16366 116429 -305272 103530
10116 -223337 54321 18460 49974 -136362 -158576 258268 -60786 -281910 -197604 -18767 39943
10104 49231 239096 -194679 -141554 -204737 -33889 -61334 291867 -260133 -149629 -269175
10094 -269175 -98140 43880 -6988 150249 185793 -130508 -317284 204124 -22560 -10450 -76738
10083 -76738 -122835 128940 -437726 194669 -419722 15248 -254238 38994 52761 107231 25702
10071 280235 -36685 -164983 92259 -169183 -119295 -280445 256962 -115106 -307749 -71580
10060 37847 7806 78160 73411 -72373 165130 21674 127997 63172 112155 -413797 -66030
10048 -344763 62207 112171 -6006 17253 -417386 -9342 -12301 -170967 -96800 -251868 69622
10036 -175319 -313683 -137279 -43140 985 346278 -9054 -263629 42603 -115690 187442 -314009
10024 -161720 -100363 -243292 -4443 209477 123467 -371252 -147809 127025 211128 -8728 134298
10012 214647 -118188 24766 259006 -129560 108698 -257083 108795 -70094 -212002 27371
10001 -205309 -229085 240093 83423 -164460 -243032 187990 -232713 -20236 -295385 -149802
9991 -149802 147471 4408 -79494 -262998 -117318 -83195 -55889 -33028 -12921 -78692 -181775
9980 -181775 -263590 -164695 222334 215075 -29279 150332 303419 26523 -162856 -98652 -236987
9969 -236987 -37383 -375046 -83090 -74869 -224693 -81725 -69865 95263 -178503 -4792 87950
9957 -429151 86633 -419769 185153 -232918 57170 -77623 -240213 56422 -649306 20419 13712
9946 13712 -200937 -91717 -229111 -182081 -14838 269499 266462 -97487 -142067 24229 -13436
9934 -162783 -93575 208417 256204 -181714 -281792 -363018 -194895 119078 -86424 785 -270619
9922 -200532 85923 43070 372660 -69503 -160475 -210174 62155 -144502 155333 -128533 -299639
9911 -299639 -108529 -4423 47531 20612 -108048 -178862 -167170 -5304 -150016 222410 -10053
9899 -153201 -60121 40868 80882 -228375 -129752 -174010 97276 -115520 -23580 202181 -377298
9887 -166586 -161435 124135 -249930 312599 -22972 -28169 128229 -212291 -190503 -21344 -74475
9876 -74475 286439 -31584 -246248 -7284 -304180 -246254 -125663 -115538 -278612 -151035 179070
9864 -116880 -181310 270597 13783 164423 -333518 -58867 -63640 395997 20654 -102035 204488
9852 -86393 131749 -427680 -19023 119056 229661 -36823 -245990 25103 -215439 -146656 -6469
9840 -16407 -164795 -81831 -285654 291604 -244216 31803 813 -190141 114976 -38884 -70222
9829 -70222 52580 -124697 75767 -291688 169162 201386 172109 -42798 74119 -339994 104213
9817 247594 -257880 -180168 306220 -95676 -301706 349621 -283664 134700 -34494 -175128
9807 -175128 105877 61065 75709 113366 -10129 -207460 -191112 -112147 -117987 -16955 -253986
9796 -253986 152412 -248099 -95754 -312792 70025 240249 -58747 -327112 -31206 -323639
9786 -323639 -33985 -393854 -170826 218570 122398 41825 -115552 65573 -142225 -108776 -152949
9775 -152949 -314559 74192 -117376 -278910 80569 -4333 7915 -369343 -468953 34780 517579
9764 517579 -111536 223666 96051 -171513 -70308 -190214 -462910 -184851 -154101 -376980
9754 -376980 -443499 -167641 -13912 -220114 104187 168863 -288489 40699 57984 371913 27145
9742 -167414 -425323 -152959 -303915 31569 -134789 31789 -143825 -342171 -208094 -177218
9732 -177218 130854 100990 69346 -85053 -5305 -311829 286725 -139784 288284 -8747 30389
9720 -27503 -11592 63585 -125589 -242151 -53611 -191615 -238939 63949 78050 -235034 -58941
9708 -89561 -59785 62673 24576 -116666 198421 175457 -1589 -98225 -283500 -253663 -299689
9697 -299689 -172511 123846 -8881 -33263 -24194 158578 -107239 69087 -108779 -286202 -270184
9686 -270184 84773 323978 13705 269241 -59037 -28500 261521 109197 -58527 -16453 27960
9674 -183462 54990 -359854 133847 -89992 -3961 -121297 -211509 43068 133944 182339 89685
9662 -189893 -27191 160305 84847 -164948 -11749 -173246 24333 9033 -83360 -83106 42302 134023
9650 134023 122747 -224453 -284997 -163187 191906 136261 117523 -160690 -57314 102963 -171917
9638 -344771 88583 5895 99109 -84655 369860 -118476 -273931 -215451 -139246 -76596 -206304
9627 -206304 -307587 272281 102332 -144482 -24974 -103566 -58725 66484 -147365 108881
9616 -173938 -494761 227637 149920 -334495 -91814 -269539 -53653 73367 -338830 -14480 -108573
9605 -108573 -154074 -148795 307594 -58553 -58478 -294048 -266737 -14257 -138336 -34933 171856 -217105
9592 144659 -88683 -137897 -192898 -232155 -188396 -25253 -14042 -28376 -21324 -180410 10036 183060
9580 183060 -172325 210784 50132 -28643 -141068 3635 -144230 -261642 -85337 -418763 -170854
9568 64406 313526 -341252 -94946 63362 -213500 15102 149604 -144804 -92686 196473 123836
9557 123836 -212768 112177 36900 -111383 157206 -33831 126951 74039 -145625 -325793
9547 -325793 -164066 108444 313327 -131593 -164346 -325794 -10435 -74867 -77388 40198 -84021
9535 -256201 183949 -349213 103073 -136009 187498 -20429 -255426 -139167 25075 1577
9524 161682 -41306 -241677 -260439 -81686 -183609 -308587 -185088 8250 230920 50633 -342102
9512 -132060 79675 -56690 -264262 -107660 -221152 22088 -356601 85083 53272 -126595 267201
9500 16955 -23014 -184320 -102614 -381028 -191004 75967 -168194 -176008 -109762 -122063 -225497
9489 -225497 -29100 -218851 -147087 -1471 138535 111286 61223 -159343 121199 -208698 139005
9477 58426 119328 -113287 -42072 39850 -289602 8412 -151038 -11146 91898 -94156 -234728
9466 -234728 18793 43116 271704 4654 -42379 -262161 -6450 55904 -233348 -214673 21000
9454 -487776 128979 -295296 244951 -184757 -292069 209269 291508 168626 149072 -203221
9443 145523 -118583 229698 -85400 5831 137464 -62347 149339 -7272 -247416 -79681 -69741
9432 -69741 140279 -350044 -166886 -34692 -182451 236864 407 -87604 148198 309927 62587
9420 72409 -291050 1576 122924 -145734 20240 129000 35999 2765 -122356 -388294 -90624
9408 157097 42772 -132729 445200 11253 -445150 12531 -110315 -32605 -35541 69281 24175
9396 -102416 65404 -349474 -89856 75249 -34212 57472 272028 -75479 -49031 108741 63882
9385 63882 -139352 41054 23089 30225 -85641 -45967 -44787 128373 -320351 -57788 -309852
9374 -309852 55077 227919 -9460 -108487 -264877 -192165 33076 -46337 262166 -125143 -38969
9362 -190454 82768 -102251 31616 206931 -80857 -72553 -98552 -201510 79508 -2945 -493318
9351 -493318 74298 -200321 -44486 -153361 -38753 69358 -219424 286969 -20197 -66502 -26265
9339 55280 131894 -187916 -71518 -77931 196092 155329 144407 -193618 -317933 308084 -148584
9327 177634 57945 -51989 -92582 -154802 -58530 -72429 31928 -256599 188820 -161884 -132697
9316 -132697 -361280 76147 -50997 -147930 -33715 -161268 -23782 -246401 184014 -391071 91071
9304 74939 -258471 -30072 -287989 -35533 118907 293296 -69358 -180081 42318 -13309 386119
9292 -66220 -82085 -384726 -146245 107769 99371 74569 10719 318929 -52996 202619 165898
9281 165898 -213818 -52743 -251059 -21811 7533 -4051 -211935 -150800 -243129 -182311 -36318
9269 30680 -248390 10338 258335 -95117 -421266 -267847 -16502 -141269 -37391 -18525 -18437
9258 -18437 83853 -273130 133574 -230287 85276 -156412 -283987 -179512 105300 -5716 -17409
9247 -17409 -118395 -300469 122153 210934 -18239 144710 73683 -142764 -243921 -131478
9237 -131478 -202067 22135 -175216 -93622 -104870 171211 -22214 -208914 -55874 -258300 -124827
9225 -205513 -124035 146054 -188358 -186272 94648 -104150 -202147 -106305 356176 -182313 -76985
9213 -213224 -264854 98154 -114338 -292370 -32152 49755 29537 -81854 119286 -33181 -460968
9202 -460968 -18585 106068 -515621 -74592 -256517 -120794 -141612 249546 51110 -11215 -131840
9191 -131840 79378 124384 -83337 105941 -190316 62514 -135482 -141071 -46416 -8226 79751
9179 134903 78055 -127683 14625 216401 73958 -103313 -429925 -3228 57424 156143 362310
9168 362310 -219343 193758 -140858 254904 -27396 246070 5553 -412927 -188473 -88092
9157 -185189 -108202 -267087 48313 -236645 -30822 61055 22495 36866 192608 99233 -138350
9145 85736 417973 -71602 5518 -64071 63755 103653 62547 281516 -141699 325364 -166057
9133 131633 -301053 -182690 171807 117623 80055 -110261 18944 -150979 22307 -30084 -144922
9122 -144922 67489 -196807 -140371 -146940 -271937 122263 -121981 57221 -92550 199057 -55930
9110 -142467 -431195 -83754 -102179 57416 -293205 20414 106696 168017 -19106 -186933 -319918
9099 -319918 -196872 -58358 86226 -64584 216315 -221010 -279290 -174362 -50136 -169318 -8496
9087 -36654 68165 12132 70645 -211948 -208412 -121276 -249285 -41395 -27178 -110595 -31414 131553
9074 214905 -64211 -33670 -19073 46866 -173134 94260 243048 -350513 24861 -107035 25009
9062 -97546 -190571 -103304 113468 -61301 -237724 38866 -312468 -87212 22704 36523 62409
9051 62409 -52873 132781 -49505 -212363 -93871 -98906 -28461 -98581 -146334 66368 -39356 -153382
9039 -153382 -307581 -247031 246310 -259793 -94 -222 -203654 4802 -224446 127511 -13197 225934
9026 -137528 -162396 -136580 -212958 322848 -278521 79988 -33866 -68842 197121 325611 -53997
9014 -24755 136753 -318604 165500 163939 326500 -680 -51243 -153563 -158380 296016 -214632
9002 -26025 -15519 28229 -69455 55594 63254 -74183 -128933 -220575 -100536 28344 1676 142524
8990 142524 -90853 87427 -97425 172833 288453 -163936 110593 138022 -26578 -86138 3421
8978 -126037 -235039 281253 7162 -114008 239851 257053 -92340 248645 -222515 -24602 83352
8966 173369 -57718 -191894 -41740 -161427 156194 -228606 127946 -280160 6101 -12379 -114331
8955 -114331 -210727 235019 80367 -43373 63455 31677 -66692 58393 -44992 50514 83753
8944 83753 -26214 -29402 8791 -348957 33636 -162733 -181753 -306481 -395360 137942 -211257
8932 198828 -274467 -105214 -69182 -110389 -232561 -175155 -37242 -264935 -161851 255661
8921 -68681 -85397 113371 54481 -14901 462842 54523 27266 205948 51324 -106527 2684
8909 83039 276222 436814 754251 741443 1649629 3395303 5048281 2329403 1599312 685020
8898 424398 183713 77723 -181047 -48596 101197 -109746 247283 -29881 221116 137288
8888 137288 -283718 285545 -53741 -22768 -234050 15731 -199619 219837 36342 177213
8878 177213 44310 87380 -127292 -179651 -157889 -28884 40862 103916 -15071 -146136 42573
8866 -35381 60179 -32291 -28993 -88081 103659 -80108 -416985 212395 -176519 -46747 181045
8854 11623 129052 -147501 -165332 176008 -108445 -76917 85473 -127034 -131834 68153 -116592
8842 -139376 -210101 78291 108175 -151883 77794 -94095 -214122 105400 -205547 -123833 129635
8830 -144706 14008 -522653 46272 -74669 -234433 -107539 -112547 -105100 -60694 -153185 120514
8818 -71823 88883 119583 -141739 -259505 -74560 -132303 -10039 132068 94168 -123979 -122581
8807 -122581 216409 -360472 -16654 112671 -417105 1801 96784 -295994 -185770 -217498 171334
8795 42228 47298 113371 -470799 -149273 -46651 -133403 62954 104467 -140386 -301080 153032
8783 -206178 -114593 -131727 -279971 -100702 120421 -315215 -274455 -50349 -93879 64736 158096
8772 158096 67383 -19622 -210576 -194013 79709 28834 85014 7347 43224 -79130 72427 -157950
8759 -65055 -38267 -76197 119582 73063 -262004 -204740 187055 18277 -95867 -196654 114663
8747 -27792 -1049 162306 160464 -193138 -173611 207865 82449 -91649 39497 176159 -4752 -106361
8735 -106361 -263529 -60209 67184 -167907 77828 -73980 -268292 -79409 98873 -48493 -230659
8724 -230659 311504 -127148 -4040 -182369 -194339 -166682 -250150 56392 95717 -169945 -38199
8712 11918 -109288 13748 -31485 23988 326685 10474 -50390 -293057 134605 7377 -215013
8700 -247516 98958 -68749 -51549 -371284 -166684 -110466 295015 -91675 -152214 -77199 5484
8688 94907 17454 -180914 -278520 -51050 126555 94766 -26212 -226549 -118581 -196757 189890
8676 -207480 -153312 -312430 -117336 -81825 -51668 -189116 -72654 -87911 -101513 13514 20425
8665 20425 -81024 -47165 -172290 150312 -62872 -271493 119759 34871 -540555 -234473 7445
8653 -104805 23631 23424 -163766 3139 209723 -38859 348209 -93490 351403 162362 -48199
8641 -181080 175839 214709 182318 -331035 91541 -50652 -22858 -69136 -130465 -357727 -125034
8629 -195809 154457 -200125 -128931 -75618 60760 147077 -80680 21346 -181596 -160595 13346
8617 -208071 150977 -409889 -222221 -182283 60833 134869 -121876 93598 -245079 171837
8606 -75915 228892 -52021 -134960 -139997 -399107 2055 -169235 125 -41776 -217246 -113044 -72230
8594 -72230 191458 180881 -2307 274137 -51319 -221706 70660 78561 -173079 -226066 -302016
8583 -302016 51172 -73547 32227 266906 -309593 -63428 -119147 4211 -209855 -77602 -200956
8572 -200956 -27770 -119049 48640 -270638 -187188 10412 -211183 -3219 -179638 -316604 257586
8560 123288 -318501 -24688 -47688 139963 331290 11787 31991 191737 4809 -195055 -150922
8549 -150922 -363986 -205517 -74314 253800 -106725 -93212 34775 -13034 29670 193273 400535
8538 400535 -50195 -162215 -94249 -144596 -88609 52304 144653 -110654 -145862 27664 -212941
8526 234794 36983 -347037 -54272 -221590 -275646 309270 154520 -112273 201702 -122610
8515 -71377 -95375 63566 123206 -286595 -368848 82266 -239208 105891 -246305 54188 -317487
8503 -190581 216330 -149879 -268818 205491 -141461 289460 84343 152746 -175586 93862
8492 32936 -143678 -300677 78346 -142926 42929 279261 -31301 -178056 205844 -97354 -146667
8481 -146667 -306677 176951 -71778 -176243 -181355 -46063 4248 -56037 -101905 -146336 289413
8469 -66644 -105398 -17746 -155510 -187013 -303552 -176160 -71797 72742 4674 -254646 165845
8457 -56666 85862 -129444 -4066 -39265 275874 120702 274855 -11635 -173203 9980 298919
8446 298919 27815 37617 -77011 69323 -59677 59178 85147 10506 -94124 -266669 207915
8434 164173 6478 62286 -62987 -93941 -163682 -311627 35644 72790 -97310 225000 -9875 -91159
8422 -91159 -2146 156079 90157 209151 -274771 -45371 230018 -14347 -76050 -145483 -59469
8410 -200863 -217826 56251 -19712 -72409 -86959 134843 -272634 46811 -198837 24211 130594
8399 130594 101119 12660 -206127 -49235 92722 -253682 -39548 -85863 -232134 -3669 29303
8387 -60746 51692 -10391 138940 -247864 -15487 -138592 -173140 -201867 99795 -53091 -242251
8376 -242251 -147492 -45009 277246 -148029 -119479 -66983 41843 25736 -184547 -85353 -374674
8365 -374674 133897 100727 -109580 57612 -17814 404233 54989 -43355 81348 9154 -313600
8353 121366 73650 -316190 -141370 -342437 80131 -145885 105753 175849 -143915 -60727
8342 47891 -178818 -154214 -25972 161677 -198754 -7928 -163604 25320 -111959 12827 52944
8331 52944 -53759 85820 -23300 289894 115814 -67939 -391880 -239973 -76781 -239232 419385
8319 46784 -377489 -12453 -37529 46886 -8743 244023 -225704 -59339 27165 -195005 -267728
8308 -267728 60672 -77255 -140917 -14153 -35283 102674 29465 269974 336305 -67333 167306
8296 -306658 -190062 151085 65729 -467189 116011 -269498 -52662 114607 -452951 -82539
8285 74968 867 27710 96068 182832 -105785 16265 119032 65807 -789288 40681 -52312 237480
8272 75388 -133994 103189 -240938 5012 161206 -58297 354434 -172745 -79996 346918 107007
8260 301284 153485 63893 -69508 -47523 -76910 -6921 -19618 -152206 135570 -242534 86298
8248 71739 -69684 -40041 -61708 -67087 -92189 13898 -107063 -133847 -102320 -43311 -59329 -152282
8236 -152282 -218361 169916 -315417 22595 -81279 114694 -89065 57982 -141200 186722 77043
8224 -1856 -142152 -194613 -327794 143842 33997 -154127 -133257 -58452 19028 86329 30962
8212 -89611 170623 21071 351997 -417373 -46988 145906 -320423 -69449 -228170 24987 -66754
8200 16460 -178748 141328 -83001 -72745 -190762 -270902 -217263 -218540 -54982 -70672 85838
8188 -20859 -126742 306504 -145203 -274611 126899 -99126 62439 -302787 -128102 4992 -180621
8176 -190445 -58287 -203736 -92389 -61174 -130076 56638 -184349 -13631 -271232 -181134 -123589
8165 -123589 113299 133723 45887 43544 105227 229294 -100120 23140 -57246 -13281 213479
8153 -11641 -292050 17481 -30508 17717 -148343 94291 110411 -225505 -137026 -138271 257564
8141 5241 -126069 -262650 -31664 18079 -152661 -25453 -332097 59141 -69654 34732 -192376
8129 45948 87790 2598 171599 116208 146804 -233459 116831 -16255 27448 -16482 -33348
8118 -33348 -227151 -90931 106741 -154050 -139812 -220007 -56706 -183910 -249322 -216351 -87301
8106 -17928 196715 184547 -123376 125492 -98694 -174136 -232871 69515 -176205 -26791 -221470
8095 -221470 -142422 -209324 5293 -120195 255127 -100467 92505 27244 55279 116299 -155297
8083 -266907 161596 -252026 125499 -109070 137538 -18028 30700 -77490 64143 34028 -48780
8071 225095 -90153 85404 -164925 287167 80510 -183738 -170028 -107356 48524 -153962 4659
8059 210970 162600 -81731 -62085 -38820 -5475 183805 97474 52189 124029 145462 186103 73695
8046 215491 37070 -46725 -99015 99790 53918 5324 -86261 69549 -282391 409049 14604
8034 -353417 -129836 -204339 -134709 -67894 -157302 -69468 116609 -119261 161147 -361762 43801
8022 -263262 156362 -237299 -172860 -115231 -118588 -46506 -10077 -101191 309502 122036 -213022
8010 -67018 161320 -66890 -291263 -102890 -52958 -157759 263012 74485 -206365 -34044 -92328
7999 -92328 -278216 42369 -103473 -75806 -54612 94661 -259846 359736 77542 -278874 119093
7987 132297 15513 17551 -45210 70346 -23688 43857 -70057 10238 98646 -85246 -205756 43080
7974 -198808 -203371 422834 51617 -69749 3957 209323 -75360 -140145 32602 -272299 139712
7962 -44835 124133 -294421 156709 75799 -53969 -73360 -115466 -26923 -121722 -438163 -162868
7950 76343 82618 91110 -136554 -239645 -24066 -257239 -133587 -30526 195867 -136268 -97669
7939 -97669 -83241 -95752 60137 17944 -293879 -165942 -234586 19023 -146470 -163895 -41433
7927 -62282 -216192 -101021 -11467 205831 -207679 -30991 -283558 -2897 -349366 -129461 181708
7915 -218213 24718 42154 -247318 3534 -228689 104550 74887 -51283 -9395 -195346 -107802
7904 -107802 -143615 -219193 -195561 343902 -117307 -170062 182570 -65546 -102236 -220558 -11235
7892 37781 -219073 61824 183199 119220 -320641 -103598 88871 206976 -93942 108420 -203021
7880 -76537 -77878 10729 52761 -61724 -83322 198849 224176 -360340 -14263 270564 -173976
7868 66362 -181110 -88576 -439729 183990 -11782 -17203 -73060 -117864 -6446 179694 25144
7856 174650 242279 -114049 71922 -277285 46365 -115655 182515 -213920 -68445 -95284 -281342
7845 -281342 -8848 -78850 -385035 -12059 -251168 115649 107870 292726 74316 -58026 79289
7833 62451 253297 -16248 189501 31275 -60317 -272093 -138804 -164304 105599 -283898 -130408
7821 62978 -32490 -257592 149119 320088 344996 -67 -371118 -11095 -6971 117887 -138041
7809 -227403 266294 -235982 -110474 -267158 -158651 84836 -155711 61263 -366509 -75769
7798 -100909 102765 174140 -152265 77367 14525 -190376 -130565 82607 89693 39010 -277171
7786 -162274 -102546 -329314 76510 218106 -80517 -192740 132064 -155523 74210 -32372 10887
7774 12422 -106356 -298395 -118723 85852 59536 65010 -328764 -34951 -273919 -200158 192126
7762 -376725 -91319 243201 -5013 24165 -469074 -70422 -77153 45503 153421 82192 65527
7751 65527 -33458 258049 -155877 -21396 -252414 87092 -11704 -59443 -57308 -226777 161932
7739 -329945 -371001 -172890 -344426 71044 72782 -42108 -149450 -239135 -227061 -176696 -124672
7728 -124672 110249 -202232 66752 -101260 -106632 -284818 -72938 300323 -142963 194373
7717 126241 60837 -178709 81625 -148318 142760 -2923 170738 -124341 -2171 -452178 84272
7705 116359 181931 -266341 -85847 15971 -16269 367896 53787 39449 92677 57216 -231727
7693 -370549 103417 11048 -273406 -67675 -184911 -40195 -193425 -170869 -328593 -22037 268599
7681 -275124 -59209 -4111 -226281 -76286 62280 140088 53700 30695 59766 -311343 75313
7669 44535 198616 23467 -5279 -226860 266577 112298 -30489 233707 -60276 -35305 299048
7657 -113315 49159 -142512 -46591 -159940 -181050 -115275 88931 -60458 177394 123108 -289562
7645 -209 86027 -126412 -126901 -190914 -264697 12580 130765 319058 89949 -299420 -59152 90858
7632 60999 268494 -383756 -102772 -405966 -166241 -224476 34841 19959 -53301 -186262 141551
7620 2404 214643 -133990 168258 -3811 -282480 -71840 -183416 -198455 -440436 34053 159670
7609 159670 60538 70097 6318 -130280 -60057 334808 51981 -52107 -90845 -162747 260254
7597 500563 -69767 -32683 -85765 60048 -69672 28257 -15755 61044 139619 -107016 -9007 -14775
7585 -14775 -38386 406740 42056 -110347 -2299 -51974 -158113 -168822 -76395 -18958 -60053
7574 -60053 -286044 -127326 -68596 -598662 20771 12773 -35333 -303724 -107487 -42531 50443
7562 -135707 -274075 77442 73228 318244 -151509 -163744 167135 -102242 -201051 55716 21940
7550 13573 399612 177811 -513672 99491 19690 10902 67684 -147931 -498499 242750 -94165
7538 -103118 -115029 154292 125935 36127 -174986 54953 26787 332876 174462 -89321 -254580
7527 -254580 -251534 131102 -214457 -96831 -166113 -322166 -379150 -60033 251527 58912 -324149
7515 -122860 74270 -140592 97368 25146 -117392 -42546 -165126 132666 251124 36998 -45744
7503 151808 117248 68412 -41043 -50371 -86769 -162594 191066 -102344 280944 94551 -122535
7491 -181564 53504 -225778 10947 102320 -110054 -17054 -66908 90881 -57865 130604 -399
7479 -181693 -238890 82840 58205 47754 -44693 -246719 200974 -82615 -142968 151513 157054
7468 157054 60055 -308712 -277599 -57385 37047 285465 -262292 -341377 -31821 -108137 195781
7456 -150838 64123 -137673 40346 63114 -78251 -131410 249769 -13383 -250010 90611 -182331
7444 88912 -207341 -102977 -62172 152467 -73858 -195187 -163532 -157470 -44851 -61477 164017
7432 -70990 53820 233327 228809 32259 390144 -73340 64869 -14250 25976 193996 53821
7420 -26419 -13598 45053 -112586 -96596 -118878 213984 -219291 241258 86596 -22051 53917
7408 -239277 248677 -103873 -137968 280893 -101621 -90007 -215538 -34239 94171 8788 -19251
7396 -61437 -134942 202892 -64419 -52854 -89037 127888 -53785 -83843 -171883 -364957 -160791
7384 -161055 -375503 -125357 170621 -249399 -41020 58861 86622 260507 110016 127676
7374 127676 55522 62960 83169 150570 -19865 -9570 -164964 283621 -139820 72284 -234226
7362 309136 -275380 -204884 125221 -87229 -93919 86331 170413 -70417 68684 -244133 -101075
7350 -229074 52551 -26005 -308240 -55725 127797 -67117 226596 76072 -216590 -46291 257547
7338 -91950 51643 -293617 56963 -57146 47975 -104089 -256300 -94306 7644 -29907 318008
7326 -73308 -71817 -280093 -203340 73097 -57190 -61408 169720 -165298 -74055 -331559 -159965
7314 -195025 -34265 6180 158604 -133397 -287249 270809 -105052 -107489 -27477 195997 -265201
7302 268215 133700 12247 -12277 -131069 -47081 -62452 -179023 -197497 -108333 35950 -72545
7290 162137 -170266 -194919 -149245 24900 57923 245915 -90421 -320007 -4337 396363 121547
7278 -35219 -17890 -114145 44326 -204018 386740 245715 -39015 -8948 -55866 47719 395383
7267 395383 -30850 60389 -1942 -107116 86095 -257281 -125103 -78283 -102863 -137440 13597
7255 -16018 -200772 230831 262953 43375 64751 254757 -52353 -90847 -260246 200904 -112854
7243 -39541 -45437 -169803 -61957 -127270 -70561 222940 -120424 -476281 -22904 511052 72046
7231 162480 -9240 -136672 -110151 -229296 -204252 -14605 147517 -107542 71176 110952 -52581
7219 177405 -26980 -266099 12967 -38868 90436 100099 436144 139514 51744 -75608 87580
7207 -247457 428140 -241666 -45305 -68390 -247047 149414 -160217 -218885 -236017 -96382 -176815
7196 -176815 6662 115868 61737 -374759 80493 -108482 -86299 -175636 37944 6442 29500
7185 29500 -90042 -254173 122149 241525 -460840 217711 29686 -270310 32444 87871 -131383
7173 127006 -116327 -1621 -6544 55486 -186870 106447 -203161 -61765 132199 -72082 138505
7161 -299033 -21171 -94581 42667 -106796 334797 256549 85105 -9773 -217495 -235211 264514
7149 -115500 289866 -102641 -193549 -52291 -83457 -123024 -269045 174502 -174522 -24572 86676
7137 -133552 282296 -76997 -30983 -279622 -303771 -254098 116455 192738 184089 -234654 -57684
7125 63386 22161 -171730 102581 22831 -144453 90917 -80535 -43696 158343 144567 52884
7113 -131914 68607 -137629 108454 -428992 -163943 -461404 -41428 -6208 -70307 -221195 167752
7101 -36884 -25728 -267583 118164 -228603 139526 148064 -196266 -35062 118051 54072 -159010
7089 205969 -87404 -145700 225697 132505 231264 -3518 -21312 -214062 39269 177451 -238664
7077 -311448 35186 -6655 430049 -41173 -179292 49716 611426 51774 -26089 180413 -129890
7065 215227 -133953 -191694 -42166 -144101 -52951 21220 -81226 -120928 -21951 -140736 54522
7053 -378433 -323272 -10946 -96313 40323 39593 179888 -381159 68577 132523 139945 -98733 149653
7040 -249987 -460332 3533 -18850 204820 -76155 344348 -2193 -69069 103197 -197873 98477
7028 -119913 197877 -143139 -219491 -136355 -57877 -173844 -332989 -105079 199258 -51767
7017 -222637 -82024 55665 -84351 183760 9332 123417 -199860 -152922 -10422 -296247 -152612
7006 -152612 -131621 71226 -357187 -296949 -317506 -111031 89380 5609 31916 -382263 104512
6994 -72322 66171 -259938 -252590 137996 209946 210605 -228153 -119781 -34865 -89742 86164 -153349
6981 -264854 -54990 395819 -220390 -51582 -42451 74312 80268 24738 138992 -109681 -229652
6970 -229652 48410 -132785 -137649 -66109 -73481 -175384 45953 16360 -29812 7847 -92014 -97919
6958 -97919 -195938 -320472 227215 -256522 -148806 192968 35106 10050 77120 47557 -117978
6946 -641 -65746 182441 10470 49067 -87735 -268055 59813 -351650 -62642 -522 -15965 200791
6933 -317172 -253179 241032 100140 88042 225262 65210 64137 12197 -337484 226243 31318
6921 -88722 -92226 2423 -9196 -146410 -225583 -328014 144472 -15376 -90505 398521 268602
6910 268602 4060 -66458 194294 127584 -63763 -217744 103988 1959 -34781 -234938 116077
6898 239924 88373 -339539 224722 242264 180244 148988 73701 -208054 -199493 -13088 46206
6886 -2298 -62641 -232645 205764 -8171 -89421 -137585 356718 -302910 -77094 -35843 85343
6874 -209443 -136584 182596 -151763 -97225 257928 -8231 -215470 229865 -189408 266204
6863 6806 127914 -8662 16812 -326243 75762 -114291 -36364 -275830 -139676 -278590 -127085
6851 -120020 -29395 -154798 -29248 -60775 -144026 200537 17944 143241 -84350 90960 106940
6840 106940 -134219 -307839 -281230 8889 -22819 -157281 42640 210845 -225391 -249659 164159
6828 40819 111597 158919 -193917 -86264 190028 141817 84407 -309221 38029 -93447 -311733
6817 -311733 -21441 124807 174730 -285717 -104555 -51485 -132906 190062 28385 189273 76023
6805 -64810 28038 235048 -48864 -122676 -170667 -223435 -44911 -168605 -82064 -77021 -192811
6794 -192811 156795 15160 89262 98407 -11133 -223852 239742 -67270 -343954 262141 -135135
6782 -135837 -93167 -116919 110973 -13815 -28657 185560 -267804 100685 -84583 68522 -3246
6770 378212 89487 -46379 137223 89367 -103805 -41120 -110029 234954 -193186 143181 -155717
6758 -377220 200544 56758 -102757 118351 -166511 -187804 -359952 169512 212354 -144978
6747 34082 17641 138245 -291942 -299838 -295970 -105834 -78976 -24715 120389 132855 -123323
6735 228903 216049 -492390 23333 21591 64933 -56728 -157806 -216212 -222558 220145 -151292
6723 218894 -167770 -63680 -101307 24833 100284 -95979 45820 -149563 -107025 -2093 -65499
6712 -65499 531 273737 289572 -376579 -329021 -159601 -405405 -133330 363875 -241471 -14267
6700 -247783 162938 110992 -146337 -171609 -351108 -168848 217256 -40237 46748 2651 -34344
6688 -105175 -106398 29023 -107578 183051 198112 40595 -160266 -107757 205083 -241293 307209
6676 -107520 -285524 -63783 -246422 -97636 81637 -199961 -121131 -15187 192463 -47104 -159281
6665 -159281 61746 18199 -43709 -214060 148802 36277 -132580 266065 -101821 123175
6654 -116616 -84221 77112 118866 -96708 -43250 70202 457089 -36514 123986 135668 -12165
6642 -440659 251380 -14580 78588 -16990 274830 22120 311343 118791 17171 -135059 69225
6630 -18559 -211418 -78066 -228868 -21351 -178481 -115460 90456 78698 109909 -61982 48153
6618 10894 -96049 -23412 393625 66295 -109742 -115542 -190610 67902 -388315 -101461 -6071
6606 172897 -258750 226143 111660 105737 210042 -118391 -259101 116627 106952 -374797
6595 216489 83352 -126585 177240 -57826 -308030 -293765 -15846 283659 -122583 -124426 -198458
6584 -198458 27037 -66050 -205199 274431 -30001 36971 -124006 37941 -155160 -198062 61357
6572 229862 224802 -226239 101902 -63690 -92742 -57416 -49033 -123888 -107611 -125194 -215426 -137173
6560 -137173 229363 147741 -58194 -150294 169485 -102273 -82325 -120618 -64591 24206 86392
6549 86392 -301133 -116300 53701 -30405 -19144 -39571 -162866 -95107 113520 72464 126287
6538 126287 -120017 -189741 -96734 -111782 -45428 -232875 -271448 -28559 6344 -226844 110926
6526 151113 -59743 -163764 -73046 -276449 206337 -188006 228381 -109796 74356 -1564 262430
6514 11657 61915 -355585 -157206 58296 22823 117849 99205 -3358 -125695 96093 -279446
6502 -386403 -123834 282192 -65901 -249051 338991 183215 -55760 -136326 -171361 64034 269641
6491 269641 -71934 33126 -166483 -94058 -89608 170578 -6007 -35389 210996 443519 34040
6479 195064 -262763 100973 218676 -102438 34812 -256557 -82319 -112611 -58276 5205 336030
6468 336030 -81090 192348 21220 -119611 21253 -144293 207746 -198273 -122735 -67356 29980
6456 147790 -207029 331096 13491 -190611 -174030 336312 57751 -151759 -69119 299951
6445 332662 -297637 -118484 -178865 -27845 -147764 319034 63865 15842 98080 383116 -48087
6433 105075 146425 -4840 93109 456849 -174497 -47418 -96341 20916 176917 -29595 -104369
6422 -104369 60504 31274 -171590 -276575 -265827 143064 -172130 -57953 19743 146884 258718
6411 258718 -247573 -187821 86876 228222 -32556 115995 -189266 13860 -84265 -37185 -131375
6400 -131375 103623 306644 -74630 -49514 264159 -206260 -57648 173136 30184 225152
6390 225152 -73487 206973 -73870 155955 731 123790 -363980 308678 -88756 -1879 64106
6378 173033 -94262 81728 14703 -267369 15995 81154 -131140 -88125 35797 56617 -29120
6366 -246472 62859 147368 -81932 523000 68722 46601 -179934 -58233 -82119 36458 -224190
6354 -275004 115963 -13851 181168 -176708 77483 48443 81383 44194 -347581 214000 272373
6343 272373 54884 -302 -14964 -61602 148357 237193 -117971 305189 54757 -5507 -170500
6332 -170500 -160789 173448 -142232 165989 -263908 -32537 76830 128595 111040 12224 -198128
6320 -175886 -59794 -21047 48129 -212469 46013 110040 -463563 -470638 -73864 -240195 129247
6308 -297373 -89801 5299 189823 -240874 110005 71194 92336 -163651 26568 -189 -146284
6297 -146284 -38766 -478173 65552 -725687 -51156 -343350 304988 -232436 83976 55580 -58503
6285 278971 -12245 -198806 103777 409099 -60168 -145568 -5120 275990 158938 -208409 -121537
6274 -121537 421429 165693 -172418 205556 -104341 -40003 71900 -141557 -102950 205289
6263 83465 -237864 -96508 292645 -58432 26409 347803 2769 -128683 178916 -355893 -37795
6251 -81044 95689 161027 28242 -388600 47821 146514 163496 52979 -26797 158368 23636
6239 -266331 98582 205723 14904 -70598 52742 -774 -58112 -5959 130526 38961 13023 46912
6227 46912 -354474 -41083 49654 43582 -56393 -43706 -68289 -79591 128794 235317 65153
6215 191726 85916 357593 -32679 -27763 -296364 166958 57907 -219299 -171099 -26920 32605
6203 -142802 -107642 -260428 -36860 103119 116431 -45562 -48899 -28195 77691 49632 173526
6192 173526 182920 -111158 100033 -1874 -81058 -445375 45418 -124 -104650 48995 -17146 166632
6179 -178534 -179485 -230337 -119638 -174284 293961 22900 -195708 164640 -63326 202949 -235935
6167 67940 -179162 -137537 -91275 -332452 -211726 99972 85127 -148087 -200858 90653 -88323
6155 -59641 237513 101687 -164709 43384 220952 60181 -236346 159008 132507 -252565
6144 -88891 193237 -213812 -234819 -82506 340152 -294407 -49600 -60954 -116771 170371 -113745
6132 -14052 -99001 -247185 -233390 155857 83211 30149 -296257 -143894 411843 -52280 126221
6120 112510 9510 37783 -44938 19130 335610 -14251 -145483 130268 -277667 80714 73786
6109 73786 57742 -20097 -75594 -130323 77796 77254 -1937 -64942 -292371 117404 153122 -80757
6096 -60274 -320407 -297780 -101499 -102445 111267 253583 -120462 -406796 -5754 369915 259676
6085 259676 70231 118424 -25234 -185680 186709 10084 -189677 177548 29774 -55185 130039
6073 120513 -39445 -142259 -201779 -280198 155469 -303479 255174 66755 -30679 -121815 289441
6061 -156236 -7984 269379 -150828 298246 58613 -64061 88514 79222 367283 283214 -208570
6049 -124871 -80107 155520 -107129 133404 63284 -25179 -35905 -41754 27666 192569 2644
6037 -304615 73853 -55715 285329 28601 133310 -144208 -13610 -49612 217424 103520 50003
6025 107191 159048 -120083 341099 -55790 273655 126953 97731 87470 -106487 -52808 302596
6013 9376 52014 147744 -28298 20069 -15500 23391 -144731 170615 -173739 90187 43433
6001 24733 228777 -243165 -48031 -52873 -135869 176475 129577 5708 46931 96088 93742 -203022
5988 19477 80094 27296 16236 -33778 -101530 -38591 140506 232989 -86335 232385 -132560
5976 161468 43653 -41589 -69757 313914 -123039 -59935 294380 41624 -504093 -587 -90975
5965 -90975 -45847 358075 51825 -38726 99693 136270 -160684 -31079 -214615 130035 -77145
5953 -230168 -62411 -90958 -67590 106370 -123394 -55116 -366639 308854 144935 -271734
5942 -70812 -456048 -25608 30153 -41881 333534 -49842 41968 167217 -35163 11910 -25747
5930 69706 -422243 -224692 82490 -80738 -85556 -245871 -310522 305783 -29272 144736 -46285
5918 -149323 217561 -357169 -3552 -199649 207878 65350 46711 -7425 -109147 -56328 -40283
5907 -40283 -11394 160432 87855 193254 137793 -12869 -94741 345035 -202446 -34138 53256
5895 56774 59334 15777 -27996 103471 -83341 -152118 -252249 -154284 -36211 -62088 -27045 -259303
5883 -259303 -133512 -156382 -37813 170392 12102 -393460 -159999 172760 -294372 294188
5872 -4704 -95006 -192162 260228 111848 -381008 -20764 183409 124380 197869 248504 -21433
5860 156634 -225440 77744 -12388 136469 -239266 149080 -139788 103468 -182655 -25291
5849 -14567 64236 -44711 129755 181888 235197 -16980 -91926 -410087 -74726 282231 -427967
5837 -334780 143226 -166497 73326 -182819 -3394 95107 -36827 57199 -56656 104201 -35669
5825 -192002 -48845 -80904 -32906 54160 99869 -11668 -128854 34064 452363 -24800 342912
5813 -33486 83128 25306 -222913 -25737 151553 247355 -265468 30795 -23153 -138716 133843
5801 -9980 51236 -35541 -60701 -95928 -227010 110280 56149 137676 214607 -10565 -192504
5790 -192504 54637 36499 -158223 241662 109823 247681 25299 86770 -157657 -3666 -139709
5779 -139709 -36037 144596 48011 -110806 109409 106179 10489 355166 102151 62627 -123658
5767 -59733 227968 -157845 21877 -213209 -34467 177143 -109973 -77397 15092 343083 206976
5756 206976 -122502 -153301 -195786 -216355 -223675 50265 14620 80532 -130002 -250950 -390310
5745 -390310 -55705 271019 208966 -164549 316640 -278531 334406 253312 219136 -68884 72579
5733 -193531 -365392 77820 65663 210555 1478 13038 128947 -52879 -208940 -22726 -200984
5722 -200984 289414 -36141 145591 -69738 -140197 -41041 -3873 -134003 -2081 48852 31152
5711 31152 43065 -116583 -114551 72782 120657 130738 -266144 213966 -271901 33591 -103594
5699 159681 -85320 -239947 106753 -62430 261462 -53235 -139699 21349 -55469 -27277 -114883
5688 -114883 282429 67449 -135334 15560 103223 180196 46724 -68789 -34087 -262822 -50307
5676 -36997 114973 -90465 149987 219985 255718 -73939 -276465 -774 3522 -193740 186610
5664 -74102 140491 -43583 -104820 -3237 70169 44300 36654 -167187 166469 -31527 -10956 7483
5651 -71216 269980 -267692 -2175 -42686 -108657 114165 -394732 28761 -135180 -44220 -36529
5640 -36529 103724 -199234 305699 -34275 16425 19093 -23982 -50909 126776 -89492 -242931
5629 -242931 25443 179544 182328 388111 -138321 -375494 -106901 -1126 297243 -60518 126492
5617 15714 -106182 149424 -244778 -84455 -46577 76372 -269010 141975 140735 -86650 -8907
5605 30013 54359 -88412 -299698 -13573 -58181 357966 -93415 20336 -261498 211371 -229606
5593 -73086 -41068 -94835 57245 -304414 263033 -70054 127860 5284 -185399 -79010 -220615
5582 -220615 97518 233093 -245379 -134312 -263733 -154375 -28088 -141513 -20568 63618
5571 125613 23953 -22009 219972 -263788 362156 -64003 46672 -54497 -182925 -94828 -131131
5560 -131131 202255 -83402 -217542 -133342 226879 233895 14928 265605 -249516 -395934 -87058
5548 33336 313923 -93591 -151768 290787 203419 106970 -131553 -65371 15038 -49602 45150
5536 -11582 -294782 -151279 208389 -44738 248540 -273624 150084 271267 58921 137134
5526 137134 -4849 278515 -52153 -93905 -46048 -7328 -8317 64650 75200 -62077 -6083 -191680
5514 -191680 53797 -210004 -114771 173039 -268880 99070 -141252 19274 -54598 -592 -207389
5503 -207389 102974 10237 31114 -133466 132898 -146954 84688 -32366 34046 19862 -266096
5491 135968 100296 -184472 31678 -58034 91195 -95300 -55426 879 -130555 -142081 351409
5479 385296 -71525 283522 377706 -411092 125567 21251 -88461 -33054 49844 262820 198614
5468 198614 274390 55033 21908 -23767 -70005 37153 100224 -55279 89088 395470 60591
5456 -175745 -168616 215803 10778 -287763 40700 4732 -72390 -120075 -154083 -271277 -191070
5445 -191070 523958 -206482 86651 35740 140813 504863 -5374 -32943 -39386 -285260 -34517
5433 30238 235146 99831 118225 228399 70116 6200 -83166 172937 -126797 77553 -84708
5421 -71207 5441 -120104 -7302 71098 131735 245409 -19603 217664 -36315 -231087 100212
5409 14798 276241 -177022 203326 -23042 14257 -86107 -5133 196616 -12086 116287 13534
5397 296522 112295 -174707 172681 26661 71811 42317 -101360 -151518 13778 -100035 135345
5385 109363 405858 -318405 -44274 80125 -394286 -267990 265538 -167058 -7902 -200792
5375 -200792 209281 161422 86463 316990 -4753 -108154 -16154 254476 116876 63360 -92365
5363 -169284 148026 -238340 -50460 -121232 -66074 87152 -213867 -78017 295126 -19751 -8655
5351 -6104 46209 -53108 -10815 -76796 -334326 412675 278250 363272 65936 5567 122865
5340 122865 216870 -110338 -27541 156810 -164435 -120978 -21534 -18114 66673 210810 78510
5328 143586 -125324 -35921 168032 -69857 -3715 -172612 -68799 -23068 -267251 -345262 -36552
5316 -92997 131604 166230 25006 129806 254 16375 19879 -202901 -99226 43420 -100295 -237115
5304 -237115 199352 12728 182375 -25000 123308 -104319 -155674 -362442 -80907 150086
5293 26940 -56347 -164587 -200931 358625 273722 -68129 -102375 131945 237035 61850 -22689
5281 -11505 -416161 28753 82544 -47552 317752 160375 30089 -122834 -282906 139459 -73577
5269 -241819 383326 -102283 157278 -148903 10721 -92954 -174427 23467 -136116 -285337
5259 -285337 -224296 -60804 297649 -271342 136633 -304484 212319 -262713 -95818 193571
5248 134529 -267690 370221 36927 -51548 186964 -171843 -73646 32154 234610 231816 -159924
5236 92748 -2485 143755 -176293 12963 -87825 42811 3071 292253 169250 49069 65401
5225 65401 -193319 -188496 115321 -110165 -38374 107488 -159001 192314 137171 -6241 -31950
5214 -31950 -100187 -56666 118515 -202976 235088 -16233 41900 -141476 44569 -187527 -126187
5203 -126187 139147 69463 -70166 -105898 -46324 -31738 -194315 196013 77621 -146187 162676
5191 -259435 -392525 11951 -22298 307534 408908 311616 83418 -184972 283487 -124487
5180 -136054 292384 404910 103927 -25159 -11298 107907 34046 82037 66813 -165142 46913
5168 -206226 -240367 329361 23286 53177 130961 -226107 210816 -137097 190658 -27915 155332
5156 43778 216500 68933 -33913 148658 128980 17374 259982 -156802 32487 -113395 438696
5144 -293573 -7544 10125 182084 -213698 165381 -136041 -313127 -206725 30338 306514
5134 306514 142447 381883 16495 -107651 87258 35083 -5343 224990 50522 -64030 -225226
5123 -225226 93063 -437744 -574 164761 57824 -362179 -109331 172937 -105964 5201 -216575
5111 139545 -188533 97296 416598 -175666 -152589 83110 65292 144577 197304 -108035 153454
5099 -139140 531852 161704 -129981 -83318 -264639 18469 101905 -102304 -80855 397034
5088 -130619 -66874 -79270 91077 -33436 18450 84047 50669 -323807 -120483 -10211 45262
5076 149542 -6264 64055 -106455 372745 87551 136075 79787 55900 -157677 -259496 -287813
5065 -287813 -261758 138456 -346052 62059 -197425 -29334 -252248 94222 -117311 50583 82536
5054 82536 -322872 -31077 -70775 -183900 84520 -100540 107212 38537 54284 168560 65110
5042 116318 371688 -35859 120204 -162805 -94089 -262714 361250 143403 -249300 236980
5031 65280 95717 -208355 28362 -2050 -98144 111740 -117899 126834 204443 127399 -209644
5019 31755 -78883 -74084 23227 293350 -171240 -79194 167293 -111335 -332580 372632 -99888
5007 56682 237 231740 -25930 156042 183958 156701 86650 16837 -265667 136209 30157
4995 84904 62592 -168906 133921 94908 -311572 10935 106709 -177944 -344911 -114296 -126099
4984 -126099 89472 64544 83387 -98604 37698 112764 119938 131196 -94332 -251105 -122823
4972 -104168 -300500 -220617 -198663 132576 38488 169498 125457 395079 -165879 24358 -100431
4960 37334 -188811 107669 -42751 158869 38851 -30663 -133948 -148321 -37744 -184503 -114792
4949 -114792 216047 166759 -22894 -22090 126374 -36249 223575 -4843 -317441 -58821 -316825
4938 -316825 -186972 -71569 453556 103708 67838 131499 -13867 -8293 90918 -154335 31297
4926 318733 168633 -163000 132726 -58871 -120600 112580 713 -6825 99457 31818 41927
4915 41927 -25057 111573 -128112 -35490 131227 -198315 -12383 -178812 -24290 135495 91681
4904 91681 12355 -28401 -152979 -219095 -22242 14315 273928 114346 83742 13871 32483
4893 32483 192443 435841 31044 143649 328070 213135 138822 -53737 -6473 179639 -195909
4881 21881 -5715 -74656 -209230 170073 -173920 12266 -54828 -270951 -92069 -206106 -241415
4870 -241415 1324 -87828 -187432 124526 24664 -258494 -275452 -67465 -69982 99020 -162068
4858 -211769 -87894 -108096 -28019 -68514 94898 98612 -194456 -139906 119924 67024 107158
4847 107158 -79567 118587 56849 63962 -150622 10074 -305965 125458 177026 390065 -227624
4835 -69269 41594 -184566 -27553 167517 -127901 27001 -70656 -219024 -61124 -167221 103577
4823 -43063 -159170 199454 -34707 39395 108645 -149919 -131883 -220269 6992 85438 -81093
4811 82281 133007 -4578 -103638 -40314 -132041 91334 206659 -9286 58074 318537 -5783 -30854
4799 -30854 -242979 -47841 -19855 -348542 86221 -144935 -202475 -142361 -78762 284087 222085
4788 222085 -101735 -116271 151968 88007 96674 34554 155413 103741 45266 91380 30561
4776 98238 112979 266735 12201 65158 -71851 27034 231181 178742 115231 58899 211495
4765 211495 250889 147913 249682 -109906 -15321 250864 123755 -43032 -175534 -32874
4754 -29467 212668 265555 -52825 -85151 -272336 -319117 289673 255882 -126232 301827 18625
4742 -77881 -69880 -19928 162192 64729 74142 99935 313806 -265414 -89110 194424 166535
4731 166535 -107294 19468 72183 -159877 -105827 221728 16421 -79527 44172 -114694 -234203
4720 -234203 51155 78031 -223431 129763 -161897 174039 -64253 46155 205313 -2843 58534
4708 47784 -15342 -248834 134638 -67935 337141 -49308 -40541 -114436 -45882 -144959 -77376
4697 -77376 -169922 151772 179848 99267 85157 -287143 51477 -106773 62685 271419 10562
4685 -39650 114335 -88680 94396 -80246 -52294 39486 258158 -22555 152518 127379 -97149
4673 -98338 -57338 -67471 58760 -64492 -161807 69356 -103950 39172 55263 201325 168863
4662 168863 -47308 117254 93794 91020 -226829 -4744 -135658 -272087 65764 99141 -266626
4650 -271038 72565 -61578 -35254 47249 231118 364885 -69832 -185343 352780 -66438 -20649
4638 -181375 95278 -281166 -180541 6033 335476 79940 13165 68442 424366 129147 141928
4627 141928 24103 175903 -146415 -21276 -78715 -121490 351663 141798 56825 -69710 -148698
4616 -148698 203572 134738 99261 -9025 463909 45089 82317 -55913 -185635 -296406 -88871
4604 164329 -153011 317943 118098 32772 -63360 -139783 -262574 102682 -290355 259969
4593 -237499 24413 -204279 16410 -188930 18398 -14649 111300 -343750 175815 310334
4583 310334 28521 328516 -233548 -227528 101554 132420 -38033 -228384 139436 19691 -219874
4571 55467 71586 14811 89675 294551 -141029 22785 -43813 54971 2258 210147 274088
4560 274088 -149049 362827 191058 189359 -71026 158886 253799 221501 -180474 -252499 -110177
4548 31575 -157300 264561 191275 214472 161260 -76518 -118776 -268469 40632 -27072 32960
4536 100466 -93565 -156442 222061 76392 167892 -234787 202174 -205644 -25028 262511 96253
4524 -208555 -149878 197777 173694 -67763 162688 -194159 11588 -485238 32333 -26738 -175869
4513 -175869 183571 -190237 270651 -92378 -111900 133407 12348 327164 -33085 80695 39038
4501 455133 -312773 34072 24518 48640 -41204 -274208 -63803 -67252 -33440 62362 -10075 114979
4488 206845 96102 -182264 -199068 23734 156533 137083 511083 -41140 33856 -71659 152456
4476 -85973 -195701 77332 -168063 -198455 240889 -44727 71913 -78369 -103668 -8642 155140
4464 -110599 -16436 236228 78556 150396 -50242 76967 -284221 222146 -19839 132925 -102202
4452 -31857 83202 -7200 39718 159414 239563 -12714 -40026 -52641 -80311 -28784 85334 302123
$$ [...]
##END NTUPLES=NMR SPECTRUM
##END=
