
##TITLE=AC1079_MACI01_5835926_jtKjstPYi0
##JCAMPDX= 6.0         $$ Bruker NMR JCAMP-DX V2.0
##DATA TYPE= NMR SPECTRUM
##DATA CLASS= NTUPLES
##ORIGIN= BRUKER
##OWNER= Administrator
$$ 1.72 TOPSPIN		Version 2.1
$$ 2012-04-16 19:09:55.609 -0500  Administrator@TOPSPIN
$$ Compression mode = diff/dup
##.OBSERVE FREQUENCY= 400.13188235
##.OBSERVE NUCLEUS= ^1H
##.ACQUISITION MODE= SIMULTANEOUS (DQD)
##.ACQUISITION SCHEME= undefined
##.AVERAGES= 64
##.DIGITISER RES= 22
##SPECTROMETER/DATA SYSTEM= spect
##.PULSE SEQUENCE= noesygpps1d.comp
##.SOLVENT NAME= COFFEE_meoh
##.SHIFT REFERENCE= INTERNAL, COFFEE_meoh, 1, 14.96819
##AUDIT TRAIL= $$ (NUMBER, WHEN, WHO, WHERE, PROCESS, VERSION, WHAT)
$$ ##TITLE= Audit trail, TOPSPIN		Version 2.1
$$ ##JCAMPDX= 5.01
$$ ##ORIGIN= Bruker BioSpin GmbH
$$ ##OWNER= Administrator
$$ $$ C:\Bruker\TOPSPIN/data/COFFEE/nmr/AC1079_MACI01_5835926_jtKjstPYi0/22/pdata/1/auditp.txt
$$ ##AUDIT TRAIL=  $$ (NUMBER, WHEN, WHO, WHERE, PROCESS, VERSION, WHAT)
(   1,<2012-04-15 12:18:58.578 -0500>,<Administrator>,<TOPSPIN>,<go>,<TOPSPIN 2.1>,
      <created by zg
	started at 2012-04-15 12:07:26.906 -0500,
	POWCHK enabled, PULCHK disabled,
       configuration hash MD5:
       1A 1E CE 29 27 FD 77 03 67 4E F0 E3 C4 B2 CB 90
       data hash MD5: 64K
       A3 74 24 53 CE E6 06 B3 10 26 F4 6E AE E6 F8 F4>)
(   2,<2012-04-15 12:19:01.453 -0500>,<Administrator>,<TOPSPIN>,<proc1d>,<TOPSPIN 2.1>,
      <Start of raw data processing
       efp LB = 0.3 FT_mod = 6 PKNL = 1 PHC0 = 0 PHC1 = 0 SI = 128K 
       data hash MD5: 128K
       B6 E6 1E 44 9A CC 17 9A 69 FF 5B 68 B7 79 1C 2F>)
(   3,<2012-04-15 12:19:02.640 -0500>,<Administrator>,<TOPSPIN>,<proc1d>,<TOPSPIN 2.1>,
      <pk PHC0 = 37.02393 PHC1 = 0 
       data hash MD5: 128K
       6B 61 46 6D D1 FE C3 26 78 5F 16 74 9B AC E9 79>)
(   4,<2012-04-15 12:19:03.171 -0500>,<Administrator>,<TOPSPIN>,<proc1d>,<TOPSPIN 2.1>,
      <abs ABSG = 1 
       data hash MD5: 128K
       4F 1D 3E DF 05 59 49 5E E1 7D 2C B7 46 3D AC 4A>)
(   5,<2012-04-15 12:19:03.234 -0500>,<Administrator>,<TOPSPIN>,<proc1d>,<TOPSPIN 2.1>,
      <abs ABSG = 2 
       data hash MD5: 128K
       2D EF 93 50 20 75 EB 9E AA 0C B3 B5 1D 1A 26 7E>)
(   6,<2012-04-15 12:19:03.296 -0500>,<Administrator>,<TOPSPIN>,<proc1d>,<TOPSPIN 2.1>,
      <abs ABSG = 3 
       data hash MD5: 128K
       26 BF 9A D6 1E 72 D7 D8 23 AA 93 87 C2 79 43 64>)
(   7,<2012-04-15 12:19:03.343 -0500>,<Administrator>,<TOPSPIN>,<proc1d>,<TOPSPIN 2.1>,
      <abs ABSG = 4 
       data hash MD5: 128K
       ED F5 55 4D D8 DC E9 C4 DC 77 18 8E FF A7 E6 96>)
(   8,<2012-04-15 12:19:03.390 -0500>,<Administrator>,<TOPSPIN>,<proc1d>,<TOPSPIN 2.1>,
      <abs ABSG = 5 
       data hash MD5: 128K
       EF 05 AE 07 32 07 5B 0D 77 2F AD B1 F8 80 AC A8>)
(   9,<2012-04-15 12:19:03.625 -0500>,<Administrator>,<TOPSPIN>,<audit>,<TOPSPIN 2.1>,
      <user comment:
       ICON-NMR User ID: COFFEE
       data hash MD5: 128K
$$ [...]
##$TP07= 0
##$TPNAME0= <>
##$TPNAME1= <>
##$TPNAME2= <>
##$TPNAME3= <>
##$TPNAME4= <>
##$TPNAME5= <>
##$TPNAME6= <>
##$TPNAME7= <>
##$TPOAL= (0..7)
0.5 0.5 0.5 0.5 0.5 0.5 0.5 0.5
##$TPOFFS= (0..7)
0 0 0 0 0 0 0 0
##$TUNHIN= 0
##$TUNHOUT= 0
##$TUNXOUT= 0
##$USERA1= <user>
##$USERA2= <user>
##$USERA3= <user>
##$USERA4= <user>
##$USERA5= <user>
##$V9= 5
##$VALIST= <valist>
##$VCLIST= <CCCCCCCCCCCCCCC>
##$VD= 0
##$VDLIST= <DDDDDDDDDDDDDDD>
##$VPLIST= <PPPPPPPPPPPPPPP>
##$VTLIST= <TTTTTTTTTTTTTTT>
##$WBST= 2048
##$WBSW= 25
##$XGAIN= (0..3)
0 0 0 0
##$XL= 0
##$YL= 0
##$YMAX_a= 11172947
##$YMIN_a= -6602473
##$ZGOPTNS= <>
##$ZL1= 120
##$ZL2= 120
##$ZL3= 120
##$ZL4= 120
##$ABSF1= 14.96819
##$ABSF2= -5.58434
##$ABSG= 5
##$ABSL= 3
##$ALPHA= 0
##$AQORDER= 0
##$ASSFAC= 0
##$ASSFACI= 0
##$ASSFACX= 0
##$ASSWID= 0
##$AUNMP= <proc_prof1d_extract.lims>
##$AXLEFT= 0
##$AXNAME= <>
##$AXNUC= <1H>
##$AXRIGHT= 0
##$AXTYPE= 0
##$AXUNIT= <>
##$AZFE= 0.1
##$AZFW= 0.1
##$BCFW= 0
##$BC_mod= 0
##$BYTORDP= 0
##$COROFFS= 0
##$CY= 15
##$DATMOD= 1
##$DC= 0
##$DFILT= <>
##$DTYPP= 0
##$F1P= 0
##$F2P= 0
##$FCOR= 0.5
##$FTSIZE= 131072
##$FT_mod= 6
##$GAMMA= 0
##$GB= 0
##$INTBC= 1
##$INTSCL= 1
##$ISEN= 128
##$LB= 0.3
##$LEV0= 0
##$LPBIN= 0
##$MAXI= 10000
##$MC2= 0
##$MEAN= 0
##$ME_mod= 0
##$MI= 0
##$NCOEF= 0
##$NC_proc= -2
##$NLEV= 6
##$NOISF1= 0
##$NOISF2= 0
##$NSP= 0
##$NTH_PI= 0
##$NZP= 0
##$OFFSET= 14.96819
##$PC= 1
##$PHC0= 37.02393
##$PHC1= 0
##$PH_mod= 1
##$PKNL= yes
##$PPARMOD= 0
##$PPDIAG= 0
##$PPIPTYP= 0
##$PPMPNUM= 2147483647
##$PPRESOL= 1
##$PSCAL= 4
##$PSIGN= 0
##$PYNMP= <proc.py>
##$REVERSE= no
##$SF= 400.130004968971
##$SI= 131072
##$SIGF1= 0
##$SIGF2= 0
##$SINO= 400
##$SIOLD= 131072
##$SPECTYP= <>
##$SREGLST= <1H.CDCl3>
##$SSB= 0
##$STSI= 131072
##$STSR= 0
##$SW_p= 8223.68421052632
##$SYMM= 0
##$S_DEV= 0
##$TDeff= 65536
##$TDoff= 0
##$TI= <>
##$TILT= no
##$TM1= 0
##$TM2= 0
##$TOPLEV= 0
##$USERP1= <user>
##$USERP2= <user>
##$USERP3= <user>
##$USERP4= <user>
##$USERP5= <user>
##$WDW= 1
##$XDIM= 131072
##$YMAX_p= 234745729
##$YMIN_p= -312281694
##$CURPLOT= <Network HP LaserJet P1505>
##$CURPRIN= <$Network HP LaserJet P1505>
##$DFORMAT= <normdp>
##$LAYOUT= <+/1D_H.xwp>
##$LFORMAT= <normlp>
##$PFORMAT= <normpl>
##$SURQMSG= 1
$$ End of Bruker specific parameters
$$ ---------------------------------
##NTUPLES= NMR SPECTRUM
##VAR_NAME=  FREQUENCY,     SPECTRUM/REAL,   SPECTRUM/IMAG
##SYMBOL=    X,             R,               I
##VAR_TYPE=  INDEPENDENT,   DEPENDENT,       DEPENDENT
##VAR_FORM=  AFFN,          ASDF,            ASDF
##VAR_DIM=   131072,        131072,          131072
##UNITS=     HZ,            ARBITRARY UNITS, ARBITRARY UNITS
##FACTOR=    0.0627417313425165, 1,          1
##FIRST=     8223.62146879498, 1407,         -41254
##LAST=      0,             2663,            -41344
##MIN=       0,             -312281694,      0
##MAX=       8223.62146879498, 234745729,    0
$$ Real data points
##PAGE= N=1
##DATA TABLE= (X++(R..R)), XYDATA
$$ [...]
$$ plain form
62105 1111732 1138477 1166528 1195624 1225433 1255222 1283931 1310524 1334171 1354185 1370062 1381696
62094 1381696 1389482 1394100 1396207 1396253 1394450 1390785 1385099 1377316 1367670 1356720 1345119 1333405 1322087
62081 1322087 1311850 1303455 1297284 1293056 1290161 1288349 1287962 1289456 1292786 1297390 1302733 1308701 1315423 1322906
62067 1322906 1331062 1339989 1349962 1361052 1372959 1385340 1398158 1411555 1425582 1440300 1456004 1473024
62055 1473024 1491263 1510202 1529427 1548913 1568770 1589003 1609695 1631172 1653720 1677259 1701479
62044 1701479 1726225 1751553 1777534 1804267 1832056 1861254 1891795 1923027 1954160 1984812 2015038
62033 2015038 2044879 2074136 2102646 2130662 2158761 2187404 2216762 2246941 2277976 2309410 2340232
62022 2340232 2369771 2398548 2427788 2458078 2489039 2520398 2552627 2586060 2619930 2653068 2685327
$$ packed form
62105A111732K6745K8051K9096K9809K9789K8709K6593K3647K0014J5877J1634
62094A381696P786M618K107M6j803l665n686p783r646j0950j1601j1714j1318
62081A322087j0237q395o171m228k895j812l87J494L330M604N343N968O722P483
62067A322906Q156Q927R973J1090J1907J2381J2818J3397J4027J4718J5704J7020
62055A473024J8239J8939J9225J9486J9857K0233K0692K1477K2548K3539K4220
62044A701479K4746K5328K5981K6733K7789K9198L0541L1232L1133L0652L0226
62033B015038K9841K9257K8510K8016K8099K8643K9358L0179L1035L1434L0822
62022B340232K9539K8777K9240L0290L0961L1359L2229L3433L3870L3138L2259
$$ plain form
62011 2685327 2717666 2750854 2784804 2819262 2854400 2890365 2926773 2963123 2999364 3035554 3071141
62000 3071141 3105036 3136233 3163968 3187437 3205969 3219614 3229120 3235149 3237832 3237182 3233433 3226646 3216350
61987 3216350 3202105 3184306 3164084 3142475 3120014 3096988 3073630 3050087 3026651 3004072 2983123
61976 2983123 2963744 2945112 2926863 2909730 2894588 2881286 2868965 2857235 2846437 2836854 2828263 2820259
61964 2820259 2812517 2804735 2796790 2788998 2781800 2775158 2768680 2762275 2756034 2749478 2741744 2732855 2724049 2716286
61950 2716286 2709000 2700945 2691819 2682317 2672938 2663570 2654150 2644939 2635928 2626576 2616389 2605375 2593802
61937 2593802 2581779 2569195 2555752 2540989 2524519 2506301 2486459 2464863 2441222 2415596 2388553
61926 2388553 2360793 2332927 2305516 2278811 2252338 2225273 2197476 2169818 2143198 2117588 2092386
$$ packed form
62011B685327L2339L3188L3950L4458L5138L5965L6408L6350L6241L6190L5587
62000C071141L3895L1197K7735K3469J8532J3645R506O029K683o50l749o787j0296
61987C216350j4245j7799k0222k1609k2461k3026k3358k3543k3436k2579k0949
61976B983123j9379j8632j8249j7133j5142j3302j2321j1730j0798r583q591q004
61964B820259p742p782p945p792p198o642o478o405o241o556p734q889q806p763
61950B716286p286q055r126r502r379r368r420r211r011r352j0187j1014j1573
61937B593802j2023j2584j3443j4763j6470j8218j9842k1596k3641k5626k7043
61926B388553k7760k7866k7411k6705k6473k7065k7797k7658k6620k5610k5202
$$ plain form
61915 2092386 2067413 2043137 2020004 1997955 1976648 1955923 1935915 1916812 1898599 1881059 1864026
61904 1864026 1847548 1831701 1816305 1801017 1785761 1770892 1756890 1743973 1731961 1720409 1708918
61893 1708918 1697523 1686714 1676889 1667851 1659120 1650651 1642894 1636240 1630852 1627020 1625083 1624751 1625081 1625470
61879 1625470 1626309 1628325 1631658 1636086 1641834 1649582 1659603 1671284 1683557 1695757 1708194 1722065 1738552
61866 1738552 1757792 1778938 1801385 1825562 1852271 1881735 1913876 1949217 1988858 2033625 2083750
61855 2083750 2139284 2200340 2267113 2340361 2421848 2513613 2616638 2730779 2856086 2993515
61845 2993515 3144165 3308596 3487313 3681348 3891825 4119342 4364294 4627385 4909062
61836 4909062 5208367 5522473 5846912 6175536 6499999 6809398 7090328 7327592 7506096
$$ packed form
61915B092386k4973k4276k3133k2049k1307k0725k0008j9103j8213j7540j7033
61904A864026j6478j5847j5396j5288j5256j4869j4002j2917j2012j1552j1491
61893A708918j1395j0809r825r038q731q469p757o654n388l832j937l32L30L89
61879A625470Q39K016L333M428N748P748J0021J1681J2273J2200J2437J3871J6487
61866A738552J9240K1146K2447K4177K6709K9464L2141L5341L9641M4767N0125
61855B083750N5534O1056O6773P3248Q1487R1765J03025J14141J25307J37429
61845B993515J50650J64431J78717J94035K10477K27517K44952K63091K81677
61836D909062K99305L14106L24439L28624L24463L09399K80930K37264J78504
$$ plain form
61827 7506096 7613841 7644278 7596586 7474592 7286024 7042094 6756180 6441569 6109804 5770438
61817 5770438 5431428 5099299 4779153 4474683 4188099 3920241 3671236 3441218 3230204
61808 3230204 3037426 2861386 2700747 2554679 2422218 2301866 2192309 2093053 2003902 1924059
61798 1924059 1852319 1787936 1730745 1680409 1636032 1596628 1561617 1530781 1503998 1481084 1461590
61787 1461590 1444695 1429608 1416163 1404692 1395062 1386199 1376890 1366884 1356889 1347592 1339050 1331017 1323415
61774 1323415 1316298 1309700 1303849 1299398 1297101 1297234 1299483 1303334 1308331 1314029 1320009 1326109 1332364 1338582
61760 1338582 1344208 1348835 1352606 1355894 1358773 1361227 1363679 1366876 1371205 1376524 1382808 1390568 1400510 1413102
61746 1413102 1428634 1447320 1469040 1493302 1519802 1548845 1580936 1616266 1655012 1697905 1745978
$$ packed form
61827G506096J07745L0437m7692j21994j88568k43930k85914l14611l31765l39366
61817E770438l39010l32129l20146l04470k86584k67858k49005k30018k11014
61808C230204j92778j76040j60639j46068j32461j20352j09557r9256q9151p9843
61798A924059p1740o4383n7191n0336m4377l9404l5011l0836k6783k2914j9494
61787A461590j6895j5087j3445j1471r630q863r309j0006r995r297q542q033p602
61774A323415p117o598n851m451k297J33K249L851M997N698N980O100O255O218
61760A338582N626M627L771L288K879K454K452L197M329N319O284P760R942J2592
61746A413102J5532J8686K1720K4262K6500K9043L2091L5330L8746M2893M8073
$$ plain form
61735 1745978 1799691 1858728 1922610 1991091 2063968 2141106 2223005 2311066 2406917 2511541 2625196
61724 2625196 2747998 2880425 3023359 3177897 3345203 3526607 3723919 3939526 4175894
61715 4175894 4434935 4718008 5026539 5362307 5727058 6122200 6549037 7008824 7502071
61706 7502071 8027658 8582571 9161815 9757610 10358103 10946827 11503261 12003881 12423453
61697 12423453 12737285 12924750 12973020 12879391 12651431 12305180 11862172 11346127 10780194 10185273
61687 10185273 9579256 8976700 8388748 7823375 7285961 6779842 6306638 5866577 5459113
61678 5459113 5083538 4739081 4424487 4137792 3876684 3638989 3422669 3225548 3045407
61669 3045407 2880464 2729560 2591808 2466182 2351528 2246763 2150870 2062671 1980822 1904135
$$ packed form
61735A745978N3713N9037O3882O8481P2877P7138Q1899Q8061R5851J04624J13655
61724B625196J22802J32427J42934J54538J67306J81404J97312K15607K36368
61715D175894K59041K83073L08531L35768L64751L95142M26837M59787M93247
61706G502071N25587N54913N79244N95795O00493N88724N56434N00620M19572
61697A2423453L13832J87465M8270r3629k27960l46251m43008n16045n65933n94921
61687A0185273o06017o02556n87952n65373n37414n06119m73204m40061m07464
61678E459113l75575l44457l14594k86695k61108k37695k16320j97121j80141
61669C045407j64943j50904j37752j25626j14654j04765r5893q8199q1849p6687
$$ plain form
61659 1904135 1831972 1764274 1701081 1642123 1586950 1535416 1487635 1443376 1401884 1362579 1325598
61648 1325598 1291192 1258944 1228154 1198888 1171910 1147527 1125125 1104011 1084108 1065520 1048007
61637 1048007 1031260 1015216 999731 984340 968787 953378 938408 923669 908982 894758 881398
61626 881398 868468 855140 841274 827403 813843 800500 787475 775149 763652 752877 742977 734130
61614 734130 725787 716970 707626 698938 691883 686075 680466 674629 668800 663088 657337 651614 646295 641645
61600 641645 637667 634301 631449 628877 626397 624180 622653 622039 622093 622270 622118 621633 621344 621944 623691 626134
61584 626134 628420 629828 630175 629916 629813 630244 630848 631044 630696 629924 628529 626332 624095 623253 624350 626329
61568 626329 627734 628042 627438 626077 624261 622768 622072 621495 619981 617467 614657 611612 607623 602610 597648
$$ packed form
61659A904135p2163o7698o3193n8958n5173n1534m7781m4259m1492l9305l6981
61648A325598l4406l2248l0790k9266k6978k4383k2402k1114j9903j8588j7513
61637A048007j6747j6044j5485j5391j5553j5409j4970j4739j4687j4224j3360
61626H81398j2930j3328j3866j3871j3560j3343j3025j2326j1497j0775r900q847
61614G34130q343q817r344q688p055n808n609n837n829n712n751n723n319m650
61600F41645l978l366k852k572k480k217j527o14N4J77j52m85k89O00J747K443
61584F26134K286J408L47k59j03M31O04J96l48p72j395k197k237q42J097J979
61568F26329J405L08o04j361j816j493o96n77j514k514k810l045l989n013m962
$$ plain form
61553 597648 593719 590712 588030 585413 582605 578948 574148 569073 564941 561861 558875 555418 551993 549260
61539 549260 547113 545024 542919 541232 540298 540026 540105 540268 540376 540516 541024 542202 543966 545926 547856 549929
61523 549929 552424 555461 559167 563897 570027 577554 586116 595342 605019 615037 625505 636902 649752
61510 649752 664018 679086 694450 710170 726543 743667 761608 780659 800994 822113 843000
61499 843000 862856 881514 899225 916297 932906 948944 963977 977592 989909 1001609 1013345
61488 1013345 1025152 1036421 1046361 1054459 1060554 1064627 1066658 1066880 1066029 1064980 1063894 1061940 1058135 1052420
61474 1052420 1045752 1039251 1033488 1028504 1024237 1020872 1018958 1019166 1021835 1026731 1033374 1041499 1051202 1062784
61460 1062784 1076712 1093598 1113979 1138090 1165939 1197486 1232692 1271651 1314874 1363205 1417092
$$ packed form
61553E97648l929l007k682k617k808l657m800n075m132l080k986l457l425k733
61539E49260k147k089k105j687r34k72P9J63J08J40N08J178J764J960J930K073
61523E49929K495L037L706M730O130P527Q562R226R677J0018J0468J1397J2850
61510F49752J4266J5068J5364J5720J6373J7124J7941J9051K0335K1119K0887
61499H43000J9856J8658J7711J7072J6609J6038J5033J3615J2317J1700J1736
61488A013345J1807J1269R940Q098O095M073K031K22q51j049j086j954l805n715
61474A052420o668o501n763m984m267l365j914K08K669M896O643Q125R703J1582
61460A062784J3928J6886K0381K4111K7849L1547L5206L8959M3223M8331N3887
$$ plain form
61449 1417092 1476147 1539812 1608408 1683191 1765431 1855679 1953792 2059170 2170988 2288530 2411313
61438 2411313 2538571 2668594 2798842 2926397 3047766 3158380 3253195 3328303 3381737 3412754
61428 3412754 3421068 3407217 3373140 3321760 3256062 3178873 3093218 3002386 2909518 2817222 2727421
61417 2727421 2641337 2559758 2483482 2413411 2350174 2293953 2244866 2203203 2169037 2141884 2121112
61406 2121112 2106503 2098155 2096026 2099916 2109687 2125027 2145073 2168709 2195349 2225080 2257862 2292862
61394 2292862 2328823 2364960 2401243 2437777 2474133 2509509 2543547 2576702 2609608 2642248 2674008
61383 2674008 2704384 2733260 2760594 2786347 2810775 2834221 2856325 2875963 2892357 2905916 2917623
61372 2917623 2927917 2936594 2943416 2948240 2950790 2950914 2948955 2945309 2939698 2931540 2921072 2909445 2897458
$$ packed form
61449A417092N9055O3665O8596P4783Q2240R0248R8113J05378J11818J17542J22783
61438B411313J27258J30023J30248J27555J21369J10614R4815P5108N3434L1017
61428C412754Q314j3851l4077n1380o5698p7189q5655r0832r2868r2296q9801
61417B727421q6084q1579p6276p0071o3237n6221m9087m1663l4166k7153k0772
61406B121112j4609q348k129L890R771J5340K0046K3636K6640K9731L2782L5000
61394B292862L5961L6137L6283L6534L6356L5376L4038L3155L2906L2640L1760
61383B674008L0376K8876K7334K5753K4428K3446K2104J9638J6394J3559J1707
61372B917623J0294Q677O822M824K550J24j959l646n611q158j0468j1627j1987
$$ plain form
61359 2897458 2884783 2870884 2856233 2842124 2829470 2818198 2807750 2797740 2788065 2778688 2769551 2760614
61347 2760614 2751829 2743049 2734005 2724396 2713993 2702668 2690436 2677570 2664668 2652464 2641557 2632469
61335 2632469 2625958 2623042 2624524 2630740 2641946 2658766 2682043 2712412 2750356 2796552 2851779 2916452
61323 2916452 2990560 3074145 3167565 3271099 3384405 3506422 3635670 3770530 3909267 4049755
61313 4049755 4189086 4323437 4448359 4559218 4651565 4721691 4767470 4788737 4786572 4762177 4716627
61302 4716627 4651582 4569649 4473743 4366224 4248786 4122995 3990709 3854167 3715874 3578422
61292 3578422 3444123 3314536 3190225 3071113 2957222 2849094 2747390 2652248 2563456 2481297
61282 2481297 2406764 2340587 2282417 2231337 2186919 2149293 2118411 2093780 2074958 2061789 2054105
$$ packed form
61359B897458j2675j3899j4651j4109j2654j1272j0448j0010r675r377r137q937
61347B760614q785q780r044r609j0403j1325j2232j2866j2902j2204j0907r088
61335B632469o511k916J482O216J1206J6820K3277L0369L7944M6196N5227O4673
61323B916452P4108Q3585R3420J03534J13306J22017J29248J34860J38737J40488
61313D049755J39331J34351J24922J10859R2347P0126M5779K1267k165k4395m5550
61302D716627o5045q1933r5906j07519j17438j25791j32286j36542j38293j37452
61292C578422j34299j29587j24311j19112j13891j08128j01704r5142q8792q2159
61282B481297p4533o6177n8170n1080m4418l7626l0882k4631j8822j3169p684
$$ plain form
61271 2054105 2051563 2053843 2060710 2071845 2086894 2105558 2127328 2151318 2176910 2204308 2233822 2264589
61259 2264589 2294779 2323148 2349617 2374201 2396356 2415858 2433446 2449761 2464215 2475725 2484206
61248 2484206 2490490 2494938 2496974 2496029 2492242 2486080 2477686 2466720 2452558 2434656 2413134 2388981 2363372
61235 2363372 2336752 2308822 2279338 2248642 2217507 2186843 2157485 2129841 2103696 2078622 2054555
61224 2054555 2031764 2010450 1990720 1972761 1956605 1941854 1928141 1915728 1905036 1895644 1886456 1876977
61212 1876977 1867712 1859025 1850258 1840481 1829645 1818581 1808246 1799498 1793294 1790422 1790911 1794075 1799245
61199 1799245 1806335 1815786 1828118 1843533 1861871 1883074 1907682 1936575 1970108 2007820 2049239 2094559
61187 2094559 2144073 2197191 2252451 2308380 2363785 2417095 2465859 2507101 2537967 2556021 2559361
$$ packed form
61271B054105k542K280O867J1135J5049J8664K1770K3990K5592K7398K9514L0767
61259B264589L0190K8369K6469K4584K2155J9502J7588J6315J4454J1510Q481
61248B484206O284M448K036r45l787o162q394j0966j4162j7902k1522k4153k5609
61235B363372k6620k7930k9484l0696l1135l0664k9358k7644k6145k5074k4067
61224B054555k2791k1314j9730j7959j6156j4751j3713j2413j0692r392r188r479
61212A876977r265q687q767r777j0836j1064j0335q748o204k872M89L164N170
61199A799245P090R451J2332J5415J8338K1203K4608K8893L3533L7712M1419M5320
61187B094559M9514N3118N5260N5929N5405N3310M8764M1242L0866J8054L340
$$ plain form
61176 2559361 2546900 2518669 2475828 2420435 2355028 2282186 2204236 2123328 2041592 1960918 1882520
61165 1882520 1806949 1734645 1666282 1602453 1543224 1488280 1437457 1390975 1349107 1311764 1278524
61154 1278524 1248945 1222728 1199565 1179031 1160781 1144867 1131695 1121605 1114520 1110044 1107783 1107506
61142 1107506 1109096 1112491 1117623 1124325 1132305 1141247 1150880 1160820 1170437 1179017 1186074 1191450 1195159 1197274
61128 1197274 1197934 1197294 1195411 1192234 1187704 1181801 1174574 1166245 1157185 1147583 1137206 1125749 1113412 1100825
61114 1100825 1088294 1075455 1061855 1047510 1032619 1017039 1000495 983171 965567 947741 929210
61103 929210 909769 889994 870665 852022 833960 816737 800974 786949 774243 762187 750445
61092 750445 739091 728369 718491 709491 701040 692458 683014 672272 660193 647029 633191 619176
$$ packed form
61176B559361j2461k8231m2841n5393o5407p2842p7950q0908q1736q0674p8398
61165A882520p5571p2304o8363o3829n9229n4944n0823m6482m1868l7343l3240
61154A278524k9579k6217k3163k0534j8250j5914j3172j0090p085m476k261k77
61142A107506J590L395N132O702P980Q942R633R940R617Q580P057N376L709K115
61128A197274O60o40j883l177m530n903p227q329r060r602j0377j1457j2337j2587
61114A100825j2531j2839j3600j4345j4891j5580j6544j7324j7604j7826j8531
61103I29210j9441j9775j9329j8643j8062j7223j5763j4025j2706j2056j1742
61092G50445j1354j0722r878r000q451q582r444j0742j2079j3164j3838j4015
$$ plain form
61080 619176 605549 592897 581686 572048 563783 556680 550786 546215 542781 540085 537938 536441 535605 535218
61066 535218 535268 536166 538307 541584 545605 550244 555714 562179 569505 577307 585018 592065 598305 604287 610810
61051 610810 618208 626196 634313 642216 649602 656256 662271 667886 672930 676707 678625 678781 677724 675761
61037 675761 672638 667893 661533 654457 648086 643292 639671 636115 632085 627939 624005 620000 615688 611578
61023 611578 608350 605874 603450 600883 598635 596840 594906 592431 590009 588609 588427 588845 589360 589986 590663
61008 590663 590795 589733 587555 585121 583442 583091 584019 585602 586917 587349 587093 586895 587268 588189 589558 591478
60992 591478 593823 595924 597252 598230 599905 602882 607057 612255 618486 625405 632292 638974 646306 655211
60978 655211 665557 676470 687510 699024 711422 724625 738304 752354 767027 782781 799984
$$ packed form
61080F19176j3627j2652j1211r638q265p103n894m571l434k696k147j497q36l87
61066E35218N0Q98K141L277M021M639N470O465P326P802P711P047O240N982O523
61051F10810P398P988Q117P903P386O654O015N615N044L777J918J56j057j963
61037F75761l123m745o360p076o371m794l621l556m030m146l934m005m312m110
61023F11578l228k476k424k567k248j795j934k475k422j400j82M18N15O26O77
61008E90663J32j062k178k434j679l51R28J583J315M32k56j98L73R21J369J920
60992E91478K345K101J328R78J675K977M175N198O231O919O887O682P332Q905
60978F55211J0346J0913J1040J1514J2398J3203J3679J4050J4673J5754J7203
$$ plain form
60967 799984 818626 838440 859417 882008 906533 932623 959588 987236 1016050 1046672 1079578
60956 1079578 1115093 1153300 1193988 1237084 1283072 1332552 1385431 1441071 1499317 1560897 1626639
60945 1626639 1696714 1770915 1849346 1932658 2021858 2118163 2222940 2337598 2463595 2602511
60935 2602511 2756063 2926178 3115309 3326534 3563051 3827729 4123512 4454061 4823616
60926 4823616 5236674 5698933 6218820 6807548 7477698 8242640 9117344 10118028 11258536
60917 11258536 12543389 13957010 15449271 16925462 18256656 19318229 20039854 20434340
60909 20434340 20586140 20611363 20616926 20673953 20801102 20953051 21024354 20882263 20421380 19609215
60899 19609215 18494079 17175509 15762969 14347526 12992120 11732774 10584148 9547236
$$ packed form
60967G99984J8642J9814K0977K2591K4525K6090K6965K7648K8814L0622L2906
60956A079578L5515L8207M0688M3096M5988M9480N2879N5640N8246O1580O5742
60945A626639P0075P4201P8431Q3312Q9200R6305J04777J14658J25997J38916
60935B602511J53552J70115J89131K11225K36517K64678K95783L30549L69555
60926D823616M13058M62259N19887N88728O70150P64942Q74704J000684J140508
60917A1258536J284853J413621J492261J476191J331194J061573P21625L94486
60909B0434340J51800K5223N563N7027J27149J51949P1303j42091m60883q12165
60899A9609215j115136j318570j412540j415443j355406j259346j148626j036912
$$ plain form
60891 9547236 8616821 7785602 7045168 6386753 5802579 5286015 4830272 4427896 4071984
60882 4071984 3757131 3478711 3231926 3012166 2815858 2640323 2483016 2341311 2212867
60873 2212867 2095822 1988695 1890293 1799580 1715510 1637066 1563492 1494225 1428636 1366234 1307143
60862 1307143 1251907 1200614 1152633 1107381 1064820 1024910 987052 950644 915881 883452 853542
60851 853542 825539 798706 772765 747887 724451 702871 683375 665787 649594 634258 619491
60840 619491 605389 592350 580710 570374 560984 552446 544999 538645 532897 527360 522268 518096 514880
60827 514880 512324 510435 509543 509654 510171 510451 510415 510425 510671 510820 510303 508869 506778 504407 501765 498521 494409
60810 494409 489435 483798 477912 472372 467487 462796 457560 451881 446855 443386 441305 440040 439623 440507 442617
$$ packed form
60891I547236r30415q31219p40434o58415n84174n16564m55743m02376l55912
60882D071984l14853k78420k46785k19760j96308j75535j57307j41705j28444
60873B212867j17045j07127r8402r0713q4070p8444p3574o9267o5589o2402n9091
60862A307143n5236n1293m7981m5252m2561l9910l7858l6408l4763l2429k9910
60851H53542k8003k6833k5941k4878k3436k1580j9496j7588j6193j5336j4767
60840F19491j4102j3039j1640j0336r390q538p447o354n748n537n092m172l216
60827E14880k556j889q92J11N17K80l6J0K46J49n17j434k091k371k642l244m112
60810D94409m974n637n886n540m885m691n236n679n026l469k081j265m17Q84K110
$$ plain form
60795 442617 445222 447721 450175 453080 456932 461914 467783 474148 481052 488994 498151 507935 517710 527595
60781 527595 537985 548552 558395 567062 574816 581961 588526 594601 600307 605326 609101 611640 613519 614870
60767 614870 615059 613763 611832 610537 610239 610205 609463 607483 604255 600180 595883 591836 588080 584323 580235
60752 580235 575613 570448 564913 559141 553067 546701 540480 534955 530067 525147 519790 514355 509413 505060
60738 505060 500970 496818 492530 488455 485387 483905 483434 482560 480713 479070 479216 481287 484087 486750 489568
60723 489568 493198 497817 503234 509263 515693 522192 528606 535219 542531 550827 559963 569497 579047 588611
60709 588611 598451 608605 618654 628081 636716 644707 652301 659804 667344 674354 679664 682665 684152 685469
60695 685469 686990 688083 688459 688700 689244 689564 688884 687261 685440 683892 682374 680325 677382 673585 669272
$$ packed form
60795D42617K605K499K454K905L852M982N869O365O904P942R157R784R775R885
60781E27595J0390J0567R843Q667P754P145O565O075N706N019L775K539J879J351
60767F14870J89j296j931j295k98l4p42j980l228m075m297m047l756l757m088
60752E80235m622n165n535n772o074o366o221n525m888m920n357n435m942m353
60738E05060m090m152m288m075l068j482m71q74j847j643J46K071K800K663K818
60723D89568L630M619N417O029O430O499O414O613P312Q296R136R534R550R564
60709E88611R840J0154J0049R427Q635P991P594P503P540P010N310L001J487J317
60695F85469J521J093L76K41N44L20o80j623j821j548j518k049k943l797m313
$$ plain form
60680 669272 664747 659944 654553 648524 642175 635726 629027 621947 614767 607922 601533 595415 589411 583545
60666 583545 578046 573394 570104 568215 567169 566435 566093 566542 567817 569514 571274 573048 574983 577325 580369
60651 580369 584164 588270 592037 595091 597352 598786 599421 599567 599669 599957 600448 601147 601865 602078 601419 600213
60635 600213 598929 597151 593846 588779 582927 577161 571234 564532 557165 549635 541973 533975 525967 518464
60621 518464 511306 503936 496508 489779 483878 478046 471890 466071 461275 457198 453114 448954 445213 442169
60607 442169 439731 437878 436703 436240 436611 438084 440504 443004 444929 446884 450135 454916 460038 464347 467991
60592 467991 471921 476618 481737 486730 491371 495788 500265 505069 510330 516019 521927 527567 532223 535437
60578 535437 537510 539349 541746 545001 549109 553957 559244 564609 570015 575728 581810 587919 593812 599713
$$ packed form
60680F69272m525m803n391o029o349o449o699p080p180o845o389o118o004n866
60666E83545n499m652l290j889j046p34l42M49J275J697J760J774J935K342L044
60651E80369L795M106L767L054K261J434O35J46J02K88M91O99P18K13o59j206
60635F00213j284j778l305n067n852n766n927o702p367p530p662p998q008p503
60621E18464p158p370p428o729n901n832o156n819m796m077m084m160l741l044
60607D42169k438j853j175m63L71J473K420K500J925J955L251M781N122M309L644
60592D67991L930M697N119M993M641M417M477M804N261N689N908N640M656L214
60578E35437K073J839K397L255M108M848N287N365N406N713O082O109N893N901
$$ plain form
60564 599713 605978 612670 619711 627135 634814 642119 648297 653180 657250 661052 664721 668057 670757 672552
60550 672552 673316 673065 671892 669990 667741 665490 663009 659478 654336 647923 641013 633888 626332 618427 610809
60535 610809 603991 597840 591884 585871 579836 573871 568074 562613 557734 553753 551044 549802 549743 550275 551102
60520 551102 552519 554956 558378 562365 566668 571382 576478 581441 585614 588911 591892 594986 597849 599876
60506 599876 601289 603273 606723 611194 615429 618796 621771 625078 628842 632729 636498 640055 643125 645233
60492 645233 646116 646062 645785 645977 646960 648679 650936 653558 656440 659667 663665 669024 675990 684349 694004 705435
60476 705435 719220 735209 752564 770522 788671 806418 822650 836163 846150 852158 853955 851754
60464 851754 846274 838251 828080 816248 803935 792746 783762 777046 772097 768543 766382 765740 766522 768327
$$ packed form
60564E99713O265O692P041P424P679P305O178M883M070L802L669L336K700J795
60550F72552P64k51j173j902k249k251k481l531n142o413o910p125p556p905p618
60535F10809o818o151n956o013o035n965n797n461m879l981k709j242n9N32Q27
60520E51102J417K437L422L987M303M714N096M963M173L297K981L094K863K027
60506E99876J413J984L450M471M235L367K975L307L764L887L769L557L070K108
60492F45233Q83n4k77J92R83J719K257K622K882L227L998N359O966Q359R655J1431
60476G05435J3785J5989J7355J7958J8149J7747J6232J3513R987O008J797k201
60464H51754n480q023j0171j1832j2313j1189q984o716m949l554k161o42P82J805
$$ plain form
60450 768327 770738 773755 777884 783699 791417 800999 812524 826218 842140 860125 880149 902651 928325
60437 928325 957611 990512 1026920 1067043 1111401 1160406 1213959 1271422 1331929 1394864 1460336
60426 1460336 1529351 1603365 1683508 1770399 1864856 1968563 2083653 2211577 2352320 2504124
60416 2504124 2663091 2822800 2974799 3109886 3219086 3294102 3328285 3318362 3265416 3174099
60406 3174099 3051103 2904321 2742372 2573497 2404210 2238974 2080835 1931849 1793001
60397 1793001 1664375 1545809 1437278 1338666 1249514 1169162 1097000 1032578 975627 925826 882276
60386 882276 843347 807535 774549 745120 719680 697621 677955 660170 644143 629671 616573
60375 616573 604924 594724 585516 576762 568450 560910 554125 547729 541619 535967 530452 524124 516476 508358
$$ packed form
60450G68327K411L017M129N815P718R582J1525J3694J5922J7985K0024K2502K5674
60437I28325K9286L2901L6408M0123M4358M9005N3553N7463O0507O2935O5472
60426A460336O9015P4014Q0143Q6891R4457J03707J15090J27924J40743J51804
60416B504124J58967J59709J51999J35087J09200P5016L4183r923n2946r1317
60406C174099j22996j46782j61949j68875j69287j65236j58139j48986j38848
60397A793001j28626j18566j08531r8612q9152q0352p2162o4422n6951m9801m3550
60386H82276l8929l5812l2986k9429k5440k2059j9666j7785j6027j4472j3098
60375F16573j1649j0200r208q754q312p540o785o396o110n652n515o328p648q118
$$ plain form
60361 508358 501310 496120 492414 489583 487584 486632 486476 486444 486195 486121 486812 488233 489635 490313 490305 490235 490630 491574
60343 491574 492940 494586 496217 497438 498268 499472 501938 505690 509815 513456 516593 519728 523114 526602
60329 526602 530099 533807 537942 542312 546208 548811 549912 550336 551343 553385 555614 556890 557031 556753 556615
60314 556615 556632 556874 557694 559013 559955 559726 558644 557810 557893 558644 559582 560674 562196 564238 566582 568953 571213
60297 571213 573375 575623 578324 581869 586303 591085 595470 599349 603545 608973 615563 622451 629245 636521
60283 636521 644743 653272 661015 667720 673870 679400 683416 685477 686448 687553 688975 689994 690278 690416 691101
60268 691101 692352 693811 695462 697616 700215 702506 703601 703278 702076 700573 698731 696041 692201 687406
60254 687406 681990 676046 669607 663106 657299 652638 648913 645676 642839 640571 638665 636502 633918 631733
$$ packed form
60361E08358p048n190l706k831j999r52j56l2k49p4O91J421J402O78qp0L95R44
60343D91574J366J646J631J221Q30J204K466L752M125L641L137L135L386L488
60329E26602L497L708M135M370L896K603J101M24J007K042K229J276J41k78j38
60314E56615J7K42Q20J319R42k29j082q34Q3P51R38J092J522K042K344K371K260
60297E71213K162K248K701L545M434M782M385L879M196N428O590O888O794P276
60283F36521Q222Q529P743O705O150N530M016K061R71J105J422J019K84J38O85
60268F91101J251J459J651K154K599K291J095l23j202j503j842k690l840m795
60254F87406n416n944o439o501n807m661l725l237k837k268j906k163k584k185
$$ plain form
60240 631733 630939 631456 632167 632245 631975 632154 633161 634896 637108 639267 640423 639906 638097 636010 634063 631795
60224 631795 628859 625781 623475 622439 622699 624124 626476 629411 632747 636596 640988 645667 650553 656140
60210 656140 662970 670803 678739 686196 693444 701134 709572 718469 727086 734664 741072 747203 754463 763690
60196 763690 774763 787332 801522 817606 835320 854027 873580 894603 917776 943228 970851
60185 970851 1000914 1033979 1070289 1109648 1151966 1197633 1247177 1300801 1358437 1419968 1484975
60174 1484975 1552436 1621142 1690584 1761077 1832696 1904279 1973705 2039091 2099562 2155033 2205476
60163 2205476 2250326 2288385 2318324 2339522 2352458 2358236 2357854 2352069 2341731 2327764 2310800 2291327
60151 2291327 2270450 2250153 2232486 2218699 2209411 2205312 2207189 2215416 2229949 2250963 2278977 2314192
$$ packed form
60240F31733p94N17P11P8k70J79J007J735K212K159J156n17j809k087j947k268
60224F31795k936l078k306j036K60J425K352K935L336L849M392M679M886N587
60210F56140O830P833P936P457P248P690Q438Q897Q617P578O408O131P260R227
60196G63690J1073J2569J4190J6084J7714J8707J9553K1023K3173K5452K7623
60185I70851L0063L3065L6310L9359M2318M5667M9544N3624N7636O1531O5007
60174A484975O7461O8706O9442P0493P1619P1583O9426O5386O0471N5471N0443
60163B205476M4850L8059K9939K1198J2936N778l82n785j0338j3967j6964j9473
60151B291327k0877k0297j7667j3787r288m099J877Q227J4533K1014K8014L5215
$$ plain form
60139 2314192 2356085 2403998 2457744 2517128 2581083 2647836 2715944 2784601 2852760 2918480 2979540
60128 2979540 3034385 3082091 3121666 3151976 3172280 3182236 3181343 3169082 3146035 3114357 3076505 3033734
60116 3033734 2986446 2935942 2885025 2836565 2791973 2751494 2715635 2685739 2663255 2648870 2642469
60105 2642469 2643631 2652165 2668336 2692549 2724564 2763072 2806193 2852284 2899926 2947321 2992342 3033399
60093 3033399 3069779 3100871 3125578 3143066 3153811 3159332 3160952 3159320 3155144 3149897 3145516 3143737 3145937
60080 3145937 3153423 3167640 3190091 3221983 3263884 3315905 3378493 3452896 3540459 3641487 3755364
60069 3755364 3881871 4021859 4176262 4344899 4526644 4720338 4924914 5138753 5359515
60060 5359515 5584668 5811655 6037399 6258003 6469205 6667020 6847912 7008683 7146474
$$ packed form
60139B314192M1893M7913N3746N9384O3955O6753O8108O8657O8159O5720O1060
60128B979540N4845M7706L9575L0310K0304R956q93j2261k3047l1678l7852m2771
60116C033734m7288n0504n0917m8460m4592m0479l5859k9896k2484j4385o401
60105B642469J162Q534J6171K4213L2015L8508M3121M6091M7642M7395M5021M1057
60093C033399L6380L1092K4707J7488J0745N521J620j632m176n247m381j779K200
60080C145937P486J4217K2451L1892M1901N2021O2588P4403Q7563J01028J13877
60069C755364J26507J39988J54403J68637J81745J93694K04576K13839K20762
60060E359515K25153K26987K25744K20604K11202J97815J80892J60771J37791
$$ plain form
60051 7146474 7258788 7343406 7398320 7421920 7413245 7372138 7299349 7196625 7066760 6913527 6741514
60040 6741514 6555853 6361802 6164398 5968319 5777832 5596645 5427763 5273495 5135496
60031 5135496 5014793 4911931 4827231 4760772 4712114 4680326 4664503 4663931 4677330 4702130 4734963
60020 4734963 4772789 4813040 4852728 4888222 4916329 4935303 4944537 4943682 4932461 4911021 4879865 4839409
60008 4839409 4789890 4731664 4665212 4590847 4508775 4419698 4325221 4227524 4128615 4029866 3932166
59997 3932166 3836452 3744118 3656910 3576398 3503622 3439267 3384018 3338584 3303434 3278720 3264473
59986 3264473 3260756 3267635 3285121 3313129 3351196 3398146 3452305 3512287 3577427 3647004 3719029 3790195
59974 3790195 3857225 3917991 3971149 4015100 4047920 4068206 4075455 4069521 4050282 4018094 3974117 3919768
$$ packed form
60051G146474J12314Q4618N4914K3600q675m1107p2789j02724j29865j53233j72013
60040F741514j85661j94051j97404j96079j90487j81187j68882j54268j37999
60031E135496j20703j02862q4700o6459m8658l1788j5823n72J3399K4800L2833
60020D734963L7826M0251L9688L5494K8107J8974R234q55j1221k1440l1156m0456
60008D839409m9519n8226o6452p4365q2072q9077r4477r7697r8909r8749r7700
59997C932166r5714r2334q7208q0512p2776o4355n5249m5434l5150k4714j4247
59986C264473l717O879J7486K8008L8067M6950N4159N9982O5140O9577P2025P1166
59974C790195O7030O0766N3158M3951L2820K0286P249n934j9239l2188m3977n4349
$$ plain form
59962 3919768 3856150 3784349 3706011 3623327 3538736 3454995 3375045 3301013 3233472 3172367 3118669
59951 3118669 3074384 3040895 3018059 3005269 3002641 3010649 3029151 3057491 3095400 3143270 3201573 3270337
59939 3270337 3349095 3436980 3532779 3634909 3741165 3848507 3953531 4053442 4146331 4230312
59929 4230312 4302908 4361661 4405050 4432453 4443599 4438549 4417837 4381986 4331159 4266054 4189171
59918 4189171 4104560 4016244 3927335 3840516 3758455 3683381 3616757 3559660 3512990 3477076 3451644
59907 3451644 3436647 3432787 3440826 3460654 3491344 3531764 3580669 3636475 3697621 3763171 3832636 3905054
59895 3905054 3978591 4051190 4121421 4188539 4251859 4310301 4362741 4408886 4449738 4486977 4521803
59884 4521803 4554629 4585978 4617369 4651085 4689369 4734196 4787603 4851644 4927925 5017583 5121867
$$ packed form
59962C919768o3618p1801p8338q2684q4591q3741p9950p4032o7541o1105n3698
59951C118669m4285l3489k2836j2790k628Q008J8502K8340L7909M7870N8303O8764
59939C270337P8758Q7885R5799J02130J06256J07342J05024R9911R2889Q3981
59929D230312P2596N8753M3389K7403J1146n050k0712l5851n0827o5105p6883
59918D189171q4611q8316q8909q6819q2061p5074o6624n7097m6670l5914k5432
59907C451644j4997l860Q039J9828L0690M0420M8905N5806O1146O5550O9465P2418
59895C905054P3537P2599P0231O7118O3320N8442N2440M6145M0852L7239L4826
59884D521803L2826L1349L1391L3716L8284M4827N3407O4041P6281Q9658J04284
$$ plain form
59873 5121867 5242266 5379806 5534455 5705449 5891831 6092188 6303894 6522924 6744304
59864 6744304 6962376 7170634 7361847 7528694 7664232 7761983 7816432 7824337 7785711 7703397
59854 7703397 7581833 7426508 7244107 7042033 6827203 6605443 6382168 6162984 5952959
59845 5952959 5755441 5572072 5403973 5252617 5119636 5006261 4913107 4840226 4787214 4753430
59835 4753430 4738186 4740647 4759611 4793606 4841220 4901015 4970937 5047944 5128272 5207913 5282714
59824 5282714 5348221 5399805 5433173 5444958 5432900 5395640 5332596 5244364 5133187 5002590 4856207
59813 4856207 4697129 4528628 4354982 4180838 4009616 3843067 3682333 3528735 3383278
59804 3383278 3246194 3117648 2998549 2889973 2792026 2703984 2625556 2557301 2499511 2451154
$$ packed form
59873E121867J20399J37540J54649J70994J86382K00357K11706K19030K21380
59864F744304K18072K08258J91213J66847J35538R7751N4449P905l8626q2314
59854G703397j21564j55325j82401k02074k14830k21760k23275k19184k10025
59845E952959j97518j83369j68099j51356j32981j13375r3154p2881n3012l3784
59835D753430j5244K461J8964L3995M7614N9795O9922P7007Q0328P9641P4801
59824E282714O5507N1584L3368J1785j2058l7260o3044q8232j11177j30597j46383
59813D856207j59078j68501j73646j74144j71222j66549j60734j53598j45457
59804C383278j37084j28546j19099j08576r7947q8042p8428o8255n7790m8357
$$ plain form
59794 2451154 2410386 2375887 2347350 2324713 2307204 2293205 2280898 2268948 2256675 2243761 2230002
59783 2230002 2215451 2200653 2186480 2173531 2161734 2150559 2139497 2128186 2116140 2102644 2087079
59772 2087079 2069287 2049505 2028080 2005460 1982423 1959982 1938871 1919186 1900632 1882996 1866305
59761 1866305 1850798 1837017 1825784 1817757 1812928 1810730 1810643 1812550 1816575 1822836 1831407 1842298 1855461
59748 1855461 1871029 1889568 1911783 1937891 1967455 1999867 2034648 2071221 2108755 2146511 2184014
59737 2184014 2220606 2255099 2286251 2313606 2337555 2358718 2377577 2394771 2411411 2428803 2447813
59726 2447813 2468583 2491034 2515800 2544638 2579689 2622296 2672742 2731090 2797877 2873830 2959416
59715 2959416 3055135 3161978 3281074 3412973 3557741 3715708 3887546 4073373 4271897 4480131
$$ packed form
59794B451154m0768l4499k8537k2637j7509j3999j2307j1950j2273j2914j3759
59783B230002j4551j4798j4173j2949j1797j1175j1062j1311j2046j3496j5565
59772B087079j7792j9782k1425k2620k3037k2441k1111j9685j8554j7636j6691
59761A866305j5507j3781j1233q027m829k198q7J907M025O261Q571J0891J3163
59748A855461J5568J8539K2215K6108K9564L2412L4781L6573L7534L7756L7503
59737B184014L6592L4493L1152K7355K3949K1163J8859J7194J6640J7392J9010
59726B447813K0770K2451K4766K8838L5051M2607N0446N8348O6787P5953Q5586
59715B959416R5719J06843J19096J31899J44768J57967J71838J85827J98524K08234
$$ plain form
59705 4480131 4693002 4902534 5097599 5265245 5393212 5472393 5498476 5472612 5401076 5293895
59695 5293895 5162763 5018810 4870957 4725484 4586748 4458159 4342388 4241002 4154472 4082848
59685 4082848 4026307 3984973 3958572 3946548 3948420 3963797 3992137 4032840 4085688 4151072 4229689
59674 4229689 4321995 4427970 4547349 4680097 4826672 4987867 5164462 5357135 5566650 5793964
59664 5793964 6040036 6305709 6591864 6899550 7229649 7582374 7957258 8353557 8770352
59655 8770352 9205990 9657536 10120866 10591086 11062561 11528890 11983736 12422377 12842564
59646 12842564 13243959 13627298 13994556 14349444 14696598 15039685 15380269 15718236 16052387
59637 16052387 16380010 16696316 16994955 17269188 17512526 17718857 17882923 18001203 18072515
$$ packed form
59705D480131K12871K09532J95065J67646J27967P9181K6083k5864p1536j07181
59695E293895j31132j43953j47853j45473j38736j28589j15771j01386q6530p1624
59685D082848n6541m1334k6401j2024J872J5377K8340M0703N2848O5384P8617
59674D229689R2306J05975J19379J32748J46575J61195J76595J92673K09515K27314
59664E793964K46072K65673K86155L07686L30099L52725L74884L96299M16795
59655H770352M35638M51546M63330M70220M71475M66329M54846M38641M20187
59646A2842564M01395L83339L67258L54888L47154L43087L40584L37967L34151
59637A6052387L27623L16306K98639K74233K43338K06331J64066J18280P1312
$$ plain form
59628 18072515 18098145 18081835 18029512 17948491 17846753 17732910 17616230 17505837 17409589 17333952
59618 17333952 17284725 17267232 17285810 17343831 17444436 17590605 17784117 18024856 18311485 18642265
59608 18642265 19014653 19424232 19864174 20325119 20794840 21258105 21697325 22093296 22425435
59599 22425435 22672603 22815703 22840889 22741062 22515560 22169947 21716421 21173006 20560708 19900491
59589 19900491 19212012 18513449 17820795 17146717 16500329 15887869 15312917 14775676 14272383
59580 14272383 13795725 13335820 12881316 12421009 11946314 11453504 10944302 10424675 9902995
59571 9902995 9388364 8889028 8411045 7958007 7531959 7134337 6765849 6425978 6113322
59562 6113322 5826540 5564576 5325998 5108727 4910760 4730732 4567496 4419530 4285272
$$ packed form
59628A8072515K5630j6310n2323q1021j01738j13843j16680j10393r6248p5637
59618A7333952m9227j7493J8578N8021J00605J46169J93512K40739K86629L30780
59608A8642265L72388M09579M39942M60945M69721M63265M39220L95971L32139
59599B2425435K47168J43100K5186r9827k25502l45613m53526n43415o12298o60217
59589A9900491o88479o98563o92654o74078o46388o12460n74952n37241n03293
59580A4272383m76658m59905m54504m60307m74695m92810n09202n19627n21680
59571I902995n14631m99336m77983m53038m26048l97622l68488l39871l12656
59562F113322k86782k61964k38578k17271j97967j80028j63236j47966j34258
$$ plain form
59553 4285272 4163855 4054991 3958030 3871411 3793079 3721237 3654735 3592925 3535147 3480210 3426426
59542 3426426 3372367 3317449 3261598 3204504 3145587 3084710 3022572 2960308 2898909 2839064 2781341
59531 2781341 2726346 2674762 2627177 2583740 2544085 2507829 2475110 2446467 2422300 2402757 2387951
59520 2387951 2377851 2371925 2369302 2369430 2372337 2378260 2387336 2399620 2414920 2432543 2451700 2472273 2494715
59507 2494715 2519030 2544545 2570947 2598937 2629336 2662181 2697357 2735667 2778400 2826008 2878055
59496 2878055 2934477 2996183 3064307 3139433 3221761 3311484 3408806 3514017 3627699 3750395 3881838
59485 3881838 4020871 4166381 4317971 4475518 4638378 4805259 4974504 5144118 5311704
59476 5311704 5474715 5630776 5777648 5913011 6034470 6139877 6227880 6298517 6353230 6393820
$$ packed form
59553D285272j21417j08864r6961q6619p8332p1842o6502o1810n7778n4937n3784
59542C426426n4059n4918n5851n7094n8917o0877o2138o2264o1399n9845n7723
59531B781341n4995n1584m7585m3437l9655l6256l2719k8643k4167j9543j4806
59520B387951j0100n926k623J28K907N923R076J2284J5300J7623J9157K0573K2442
59507B494715K4315K5515K6402K7990L0399L2845L5176L8310M2733M7608N2047
59496B878055N6422O1706O8124P5126Q2328Q9723R7322J05211J13682J22696J31443
59485C881838J39033J45510J51590J57547J62860J66881J69245J69614J67586
59476E311704J63011J56061J46872J35363J21459J05407Q8003P0637N4713M0590
$$ plain form
59466 6393820 6421208 6435579 6437831 6430362 6416174 6397680 6376789 6355661 6336788 6322677 6316058 6320114
59454 6320114 6337737 6370393 6418174 6480815 6557914 6647946 6747582 6852124 6956038 7052838 7135216
59443 7135216 7196117 7229859 7232228 7200089 7131565 7026622 6887235 6717055 6521139 6305625
59433 6305625 6077053 5841684 5605334 5373344 5150027 4938097 4739076 4554343 4385447
59424 4385447 4233410 4098297 3979746 3877546 3791456 3720846 3664912 3622979 3594285 3577798
59414 3577798 3572841 3579745 3599360 3631921 3676894 3733847 3802742 3883120 3973631 4072809 4179847
59403 4179847 4294064 4413835 4536507 4659116 4778575 4891253 4992981 5079708 5148014 5195124
59393 5195124 5218894 5217844 5190987 5137756 5058661 4956065 4833807 4695864 4545692 4386732
$$ packed form
59466F393820K7388J4371K252p469j4188j8494k0891k1128j8873j4111o619M056
59454F320114J7623L2656M7781O2641P7099R0032R9636J04542J03914R6800Q2378
59443G135216O0901L3742K369l2139o8524j04943j39387j70180j95916k15514
59433F305625k28572k35369k36350k31990k23317k11930j99021j84733j68896
59424D385447j52037j35113j18551j02200q6090p0610n5934m1933k8694j6487
59414C577798m957O904J9615L2561M4973N6953O8895Q0378R0511R9178J07038
59403D179847J14217J19771J22672J22609J19459J12678J01728Q6727O8306M7110
59393E195124K3770j050k6857n3231p9095j02596j22258j37943j50172j58960
$$ plain form
59383 4386732 4222789 4057369 3892991 3731448 3574376 3423151 3278565 3141112 3011476
59374 3011476 2890404 2778186 2674657 2579606 2492880 2414100 2342603 2277711 2219008 2166472 2120421
59363 2120421 2081064 2047848 2019514 1995078 1974491 1958072 1945641 1936680 1931068 1928999 1930366 1934917
59351 1934917 1943079 1955773 1972946 1992721 2012364 2029898 2044616 2056562 2066215 2074689 2083726 2095134
59339 2095134 2110242 2129951 2155091 2186193 2222566 2261866 2301292 2339613 2377834 2417900 2461358
59328 2461358 2509560 2564268 2627043 2698220 2777389 2864876 2961977 3069713 3188280 3318019 3460147
59317 3460147 3616077 3786609 3972275 4173980 4392871 4629939 4886159 5162591 5459750
59308 5459750 5776940 6112359 6463395 6826439 7196809 7569326 7938780 8299583 8645648
$$ packed form
59383D386732j63943j65420j64378j61543j57072j51225j44586j37453j29636
59374C011476j21072j12218j03529r5051q6726p8780p1497o4892n8703n2536m6051
59363B120421l9357l3216k8334k4436k0587j6419j2431q961n612k069J367M551
59351A934917Q162J2694J7173J9775J9643J7534J4718J1946R653Q474R037J1408
59339B095134J5108J9709K5140L1102L6373L9300L9426L8321L8221M0066M3458
59328B461358M8202N4708O2775P1177P9169Q7487R7101J07736J18567J29739J42128
59317C460147J55930J70532J85666K01705K18891K37068K56220K76432K97159
59308E459750L17190L35419L51036L63044L70370L72517L69454L60803L46065
$$ plain form
59299 8645648 8971531 9273812 9551057 9802650 10028247 10228241 10403983 10557065 10688310
59290 10688310 10797348 10882823 10942809 10975052 10976853 10944983 10876255 10768538 10621164 10434561
59280 10434561 10210133 9950835 9661321 9347075 9013655 8666935 8313233 7958277 7606292
59271 7606292 7260678 6925181 6603517 6298073 6009871 5739831 5489200 5258635 5047787
59262 5047787 4856164 4683693 4530000 4393670 4272765 4165926 4072738 3993262 3927338 3874049
59252 3874049 3831739 3798782 3774328 3757986 3748899 3745699 3747391 3753558 3763467 3775645 3788687 3801939
59240 3801939 3814985 3826995 3837069 3844777 3849765 3851237 3848431 3841440 3830999 3817689 3801951 3784796
59228 3784796 3767788 3752191 3738637 3727789 3720778 3718661 3721825 3730399 3745140 3767472 3798462 3837979
$$ packed form
59299H645648L25883L02281K77245K51593K25597J99994J75742J53082J31245
59290A0688310J09038Q5475N9986L2243J801l1870o8728j07717j47374j86603
59280A0434561k24428k59298k89514l14246l33420l46720l53702l54956l51985
59271G606292l45614l35497l21664l05444k88202k70040k50631k30565k10848
59262E047787j91623j72471j53693j36330j20905j06839r3188p9476o5924n3289
59252C874049m2310l2957k4454j6342r087l200J692O167R909J2178J3042J3252
59240C801939J3046J2010J0074P708M988J472k806o991j0441j3310j5738j7155
59228C784796j7008j5597j3554j0848p011k117L164Q574J4741K2332L0990L9517
$$ plain form
59216 3837979 3885079 3939098 4000026 4067580 4140213 4215373 4290775 4365172 4437949 4508391 4575435
59205 4575435 4637664 4693196 4739877 4775990 4800780 4814077 4815637 4805238 4783439 4751949 4713076
59194 4713076 4668810 4620353 4568393 4513685 4457249 4399881 4341674 4282391 4222315 4162283 4102744
59183 4102744 4043308 3983652 3924436 3866727 3810719 3755723 3701471 3648845 3599126 3553135 3511493
59172 3511493 3475331 3446179 3425144 3412572 3408461 3412942 3426398 3449483 3483225 3528823 3587099 3658257
59160 3658257 3742456 3840588 3954125 4084070 4230237 4391699 4567651 4757474 4959858 5172074
59150 5172074 5389991 5608427 5821255 6021411 6201247 6353336 6471353 6550580 6587815 6580934
59140 6580934 6528749 6431535 6291769 6114333 5905988 5674549 5428042 5173873 4918284 4666382
$$ packed form
59216C837979M7100N4019O0928O7554P2633P5160P5402P4397P2777P0442O7044
59205D575435O2229N5532M6681L6113K4790J3297J560j0399k1799l1490l8873
59194D713076m4266m8457n1960n4708n6436n7368n8207n9283o0076o0032n9539
59183D102744n9436n9656n9216n7709n6008n4996n4252n2626m9719m5991m1642
59172C511493l6162k9152k1035j2572m111M481J3456K3085L3742M5598N8276P1158
59160C658257Q4199R8132J13537J29945J46167J61462J75952J89823K02384K12216
59150E172074K17917K18436K12828K00156J79836J52089J18017P9227L7235o881
59140F580934n2185r7214j39766j77436k08345k31439k46507k54169k55589k51902
$$ plain form
59130 4666382 4422455 4189914 3970945 3766488 3576783 3401874 3241724 3096118 2964584
59121 2964584 2846291 2740087 2644890 2560036 2485044 2419134 2361382 2311351 2269115 2234495 2206619
59110 2206619 2184423 2167232 2154559 2145753 2140266 2138105 2139693 2145267 2154609 2167312 2183175 2202363
59098 2202363 2225231 2251875 2281846 2314505 2349554 2386891 2425988 2465939 2506302 2547403 2589510
59087 2589510 2632091 2674172 2714958 2753709 2789433 2821260 2848845 2871976 2890007 2902256 2908775
59076 2908775 2910221 2907072 2899482 2887807 2872787 2855265 2836181 2816823 2798489 2781815 2766837 2753818
59064 2753818 2743641 2737315 2735479 2738488 2746687 2760463 2780251 2806490 2839273 2878084 2922255 2971731
59052 2971731 3027054 3088551 3155880 3228443 3305942 3388438 3476180 3569453 3668278 3772205 3880627
$$ packed form
59130D666382k43927k32541k18969k04457j89705j74909j60150j45606j31534
59121B964584j18293j06204r5197q4854p4992o5910n7752n0031m2236l4620k7876
59110B206619k2196j7191j2673q806n487k161J588N574R342J2703J5863J9188
59098B202363K2868K6644K9971L2659L5049L7337L9097L9951M0363M1101M2107
59087B589510M2581M2081M0786L8751L5724L1827K7585K3131J8031J2249O519
59076B908775J446l149p590j1675j5020j7522j9084j9358j8334j6674j4978j3019
59064B753818j0177o326j836L009Q199J3776J9788K6239L2783L8811M4171M9476
59052B971731N5323O1497O7329P2563P7499Q2496Q7742R3273R8825J03927J08422
$$ plain form
59041 3880627 3993269 4109982 4230029 4352021 4474634 4596823 4716942 4831960 4937888
59032 4937888 5030785 5107182 5163832 5197607 5205748 5186281 5138455 5063067 4962371 4839539 4698200
59021 4698200 4542358 4376294 4204112 4029228 3854276 3681361 3512273 3348546 3191343
59012 3191343 3041267 2898397 2762685 2634325 2513594 2400461 2294636 2195920 2104150 2018796
59002 2018796 1939066 1864532 1795273 1731210 1671707 1616118 1564348 1516479 1472075 1430314 1390769
58991 1390769 1353647 1319265 1287568 1258201 1230729 1204635 1179350 1154586 1130679 1108413 1088348
58980 1088348 1070279 1053449 1037346 1022163 1008399 996165 985143 975210 966727 960060 955012 950970
58968 950970 947577 945041 943800 944008 945423 947709 950610 953796 956802 959415 962003 965060 968344 970946
$$ packed form
59041C880627J12642J16713J20047J21992J22613J22189J20119J15018J05928
59032D937888R2897P6397N6650L3775Q141j9467m7826p5388j00696j22832j41339
59021D698200j55842j66064j72182j74884j74952j72915j69088j63727j57203
59012C191343j50076j42870j35712j28360j20731j13133j05825r8716r1770q5354
59002B018796p9730p4534o9259o4063n9503n5589n1770m7869m4404m1761l9545
58991A390769l7122l4382l1697k9367k7472k6094k5285k4764k3907k2266k0065
58980A088348j8069j6830j6103j5183j3764j2234j1022r933q483o667n048m042
58968I50970l393k536j241K08J415K286K901L186L006K613K588L057L284K602
$$ plain form
58954 970946 972437 973504 975026 976914 978444 979503 980812 982919 985615 988532 991758 995551 999815 1004139
58940 1004139 1008109 1011425 1013917 1015605 1016534 1016571 1015665 1014342 1013519 1013610 1014130 1014362 1014192 1014168 1014940 1016743 1019161
58923 1019161 1021409 1023194 1025317 1028998 1034529 1041044 1047723 1054714 1062577 1071369 1080661 1090118 1099762 1109914
58909 1109914 1121092 1133655 1147339 1161558 1176311 1192228 1209380 1226677 1243025 1258602 1274388
58898 1274388 1290838 1307740 1325071 1343167 1362070 1381371 1400840 1420784 1441869 1465019 1491208
58887 1491208 1520675 1552332 1584712 1617626 1652341 1689967 1730380 1773064 1818364 1867270 1920234
58876 1920234 1976795 2036374 2099010 2165190 2235271 2309368 2387760 2471186 2560549 2656447 2759212
58865 2759212 2869361 2987642 3114520 3250021 3394425 3548868 3714828 3893137 4083826
$$ packed form
58954I70946J491J067J522J888J530J059J309K107K696K917L226L793M264M324
58940A004139L970L316K492J688R29L7r06j323q23R1N20K32j70k4P72J803K418
58923A019161K248J785K123L681N531O515O679O991P863Q792R292R457R644J0152
58909A109914J1178J2563J3684J4219J4753J5917J7152J7297J6348J5577J5786
58898A274388J6450J6902J7331J8096J8903J9301J9469J9944K1085K3150K6189
58887A491208K9467L1657L2380L2914L4715L7626M0413M2684M5300M8906N2964
58876A920234N6561N9579O2636O6180P0081P4097P8392Q3426Q9363R5898J02765
58865B759212J10149J18281J26878J35501J44404J54443J65960J78309J90689
$$ plain form
58856 4083826 4286890 4502885 4732867 4978046 5239476 5517749 5812951 6125031 6454056
58847 6454056 6799801 7161261 7536825 7924707 8322580 8726645 9131312 9529710 9914134
58838 9914134 10276067 10606409 10896081 11136456 11319593 11438872 11489933 11471051 11382824 11228186
58828 11228186 11012941 10745646 10436105 10093658 9726688 9343082 8950436 8555622 8164403
58819 8164403 7781551 7411086 7056190 6718894 6400044 6099692 5817506 5552781 5304323
58810 5304323 5070847 4851615 4646393 4454576 4274829 4106000 3948023 3801326 3665483
58801 3665483 3539059 3420831 3310607 3208721 3115209 3029687 2951532 2879834 2813529 2751976
58791 2751976 2695386 2644439 2599534 2560457 2526692 2497885 2474032 2455160 2440884 2430569 2424194
$$ packed form
58856D083826K03064K15995K29982K45179K61430K78273K95202L12080L29025
58847F454056L45745L61460L75564L87882L97873M04065M04667L98398L84424
58838I914134L61933L30342K89672K40375J83137J19279N1061j8882q8227j54638
58828A1228186k15245k67295l09541l42447l66970l83606l92646l94814l91219
58819H164403l82852l70465l54896l37296l18850l00352k82186k64725k48458
58810E304323k33476k19232k05222j91817j79747j68829j57977j46697j35843
58801C665483j26424j18228j10224j01886r3512q5522p8155p1698o6305o1553
58791B751976n6590n0947m4905l9077l3765k8807k3853j8872j4276j0315o375
$$ plain form
58780 2424194 2422773 2427415 2437970 2453110 2471789 2494201 2521194 2553266 2590413 2632524 2679560 2731508
58768 2731508 2788482 2850799 2918857 2993089 3074039 3162205 3257764 3360757 3471664 3591439 3720813
58757 3720813 3859938 4009014 4168959 4341173 4526811 4726540 4940818 5170180 5415362
58748 5415362 5677331 5956965 6254471 6569178 6900006 7245865 7605433 7976719 8356908
58739 8356908 8742154 9127007 9504139 9864996 10200751 10502584 10761477 10968393 11115140
58730 11115140 11195367 11205381 11144705 11016105 10824894 10577890 10282747 9947797 9582020 9194727
58720 9194727 8794904 8390448 7987728 7591725 7206315 6834214 6476895 6135160 5809913
58711 5809913 5502070 5211751 4938201 4680804 4439637 4214666 4004858 3808716 3625410
$$ packed form
58780B424194j421M642J0555J5140J8679K2412K6993L2072L7147M2111M7036N1948
58768B731508N6974O2317O8058P4232Q0950Q8166R5559J02993J10907J19775J29374
58757C720813J39125J49076J59945J72214J85638J99729K14278K29362K45182
58748E415362K61969K79634K97506L14707L30828L45859L59568L71286L80189
58739H356908L85246L84853L77132L60857L35755L01833K58893K06916J46747
58730A1115140Q0227J0014o0676j28600j91211k47004k95143l34950l65777l87293
58720I194727l99823m04456m02720l96003l85410l72101l57319l41735l25247
58711E809913l07843k90319k73550k57397k41167k24971k09808j96142j83306
$$ plain form
58702 3625410 3454817 3296534 3149407 3012078 2883621 2763545 2651486 2547040 2449805 2359492
58692 2359492 2275948 2198865 2127418 2060521 1997657 1939197 1885722 1837226 1793145 1752786 1715460
58681 1715460 1680582 1648009 1618000 1590489 1564850 1540740 1518616 1498723 1480041 1461165 1442098
58670 1442098 1424210 1408406 1394195 1380662 1367438 1354409 1341275 1327811 1313940 1299223 1282920
58659 1282920 1264931 1245967 1226375 1205550 1183089 1159777 1136525 1112889 1087686 1060839 1033606
58648 1033606 1007024 981126 955851 931784 909492 888783 869086 850199 832210 815079 798716
58637 798716 783298 769084 756001 743702 731938 720680 709921 699536 689330 679141 668985
58626 668985 659105 649730 640756 631919 623394 615867 609797 604850 600400 596411 593492 592131 592177 593094 594448
$$ packed form
58702C625410j70593j58283j47127j37329j28457j20076j12059j04446r7235r0313
58692B359492q3544p7083p1447o6897o2864n8460n3475m8496m4081m0359l7326
58681A715460l4878l2573l0009k7511k5639k4110k2124j9893j8682j8876j9067
58670A442098j7888j5804j4211j3533j3224j3029j3134j3464j3871j4717j6303
58659A282920j7989j8964j9592k0825k2461k3312k3252k3636k5203k6847k7233
58648A033606k6582k5898k5275k4067k2292k0709j9697j8887j7989j7131j6363
58637G98716j5418j4214j3083j2299j1764j1258j0759j0385j0206j0189j0156
58626F68985r880r375q974q837q525p527o070m947m450l989k919j361M6R17J354
$$ plain form
58611 594448 596168 598593 602250 607381 613614 620228 626680 632672 637865 641890 644686 646478 647283 646721 644388
58596 644388 640252 634610 628011 621296 615364 610620 606815 603631 601180 599781 599460 599986 601287 603619 607387
58581 607387 612814 619627 627030 634352 641903 650844 661955 674872 688806 703596 719637 737102 755853
58568 755853 775973 797838 821735 847809 876245 906973 939375 972944 1008212 1046420 1088274
58557 1088274 1133732 1183042 1237144 1296687 1361353 1430646 1504731 1584020 1668401 1757563 1851789
58546 1851789 1951769 2057628 2168492 2282815 2398637 2513519 2624620 2728937 2823349 2904555
58536 2904555 2969229 3014405 3037841 3038423 3016547 2974036 2913527 2837977 2750644 2654978 2554127
58525 2554127 2450677 2346997 2245407 2147619 2054253 1965331 1881133 1802291 1729284 1662257 1601191
$$ packed form
58611E94448J720K425L657N131O233O614O452N992N193M025K796J792Q05n62k333
58596F44388m136n642o599o715n932m744l805l184k451j399l21N26J301K332L768
58581F07387N427O813P403P322P551Q941J1111J2917J3934J4790J6041J7465J8751
58568G55853K0120K1865K3897K6074K8436L0728L2402L3569L5268L8208M1854
58557A088274M5458M9310N4102N9543O4666O9293P4085P9289Q4381Q9162R4226
58546A851789R9980J05859J10864J14323J15822J14882J11101J04317R4412Q1206
58536B904555O4674M5176K3436N82k1876m2511o0509p5550q7333r5666j00851
58525B554127j03450j03680j01590r7788r3366q8922q4198p8842p3007o7027o1066
$$ plain form
58514 1601191 1545831 1495545 1449692 1408141 1371052 1338087 1308078 1279557 1251495 1223659 1196557
58503 1196557 1170985 1147369 1125412 1104426 1083875 1063555 1043567 1024350 1006469 989967 974081
58492 974081 957983 941697 925903 910899 896176 881031 865152 848522 831176 813387 795919
58481 795919 779762 765537 753090 741691 730732 720262 710753 702270 694121 685490 676249 666991 658506
58468 658506 651390 645875 641610 637708 633362 628400 623065 617456 611468 605147 598716 592251 585608 578626
58454 578626 571211 563295 554920 546278 537535 528874 520836 514226 509297 505358 501580 497891 494652 491818
58440 491818 489037 486344 484084 482320 480962 480277 480481 480894 480422 479072 478234 479066 481216 483485 485202 486540
58424 486540 487855 489157 490072 490169 489475 488650 488268 487980 486851 484578 481834 479327 477174 475420 474494 474723
$$ packed form
58514A601191n5360n0286m5853m1551l7089l2965l0009k8521k8062k7836k7102
58503A196557k5572k3616k1957k0986k0551k0320j9988j9217j7881j6502j5886
58492I74081j6098j6286j5794j5004j4723j5145j5879j6630j7346j7789j7468
58481G95919j6157j4225j2447j1399j0959j0470r509q483q149q631r241r258q485
58468F58506p116n515m265l902m346m962n335n609n988o321o431o465o643o982
58454E78626p415p916q375q642q743q661q038o610m929l939l778l689l239k834
58440D91818k781k693k260j764j358o85K04M13m72j350q38Q32K150K269J717J338
58424D86540J315J302R15R7o94q25l82k88j129k273k744k507k153j754r26K29
$$ plain form
58408 474723 475797 477064 478050 478542 478674 479161 480763 483109 484623 484178 482356 480530 479155 477578 475203
58393 475203 472114 468718 465421 462570 460127 457426 453836 449717 446259 444303 443665 443641 443765 443960 444320 444928
58377 444928 445751 446684 447868 449880 453207 457446 461351 463949 465489 467085 469397 471862 473289 473118 471951
58362 471951 470810 470177 469929 469977 470518 471633 473059 474502 475902 477337 478960 481140 484263 488260 492700
58347 492700 497492 502999 509177 515139 520091 524389 529071 534504 540066 545085 549544 553720 557503 560334
58333 560334 561612 561164 559519 557724 556672 556455 556481 556184 555567 555113 555322 556301 557668 558914 559930 561105
58317 561105 562806 564929 567053 568916 570567 572201 574063 576354 579052 581900 584774 587923 591688 596105
58303 596105 601035 606503 612579 619023 625418 631717 638343 645625 653417 661407 669531 677748 685549 692161
$$ packed form
58408D74723J074J267R86M92J32M87J602K346J514m45j822j826j375j577k375
58393D75203l089l396l297k851k443k701l590m119l458j956o38k4J24J95L60O08
58377D44928Q23R33J184K012L327M239L905K598J540J596K312K465J427j71j167
58362D71951j141o33k48M8N41J115J426J443J400J435J623K180L123L997M440
58347D92700M792N507O178N962M952M298M682N433N562N019M459M176L783K831
58333E60334J278m48j645j795j052k17K6k97o17m54K09R79J367J246J016J175
58317E61105J701K123K124J863J651J634J862K291K698K848K874L149L765M417
58303E96105M930N468O076O444O395O299O626P282P792P990Q124Q217P801O612
$$ plain form
58289 692161 697450 702319 707809 713864 719456 724047 728383 733423 738884 743527 746793 749444 752425 755786
58275 755786 759119 762535 766597 771437 776451 780973 784997 789152 794116 800074 806721 813758 821281 829583
58261 829583 838700 848422 858744 869945 882159 895089 908271 921447 934632 947997 961740 975883
58249 975883 990177 1004409 1018671 1033061 1047202 1060469 1072717 1084464 1096378 1108914 1122389
58238 1122389 1136953 1152451 1168685 1185839 1204164 1223376 1242967 1263129 1284660 1307803 1331917
58227 1331917 1356549 1382176 1409514 1438624 1469127 1500800 1533585 1567487 1602834 1640264 1680103
58216 1680103 1722076 1765826 1811203 1857826 1904918 1952009 1999433 2047879 2097894 2149965 2204463
58205 2204463 2261159 2319425 2379306 2441816 2507813 2577206 2649723 2725879 2806570 2892119 2982247
$$ packed form
58289F92161N289M869N490O055N592M591M336N040N461M643L266K651K981L361
58275G55786L333L416M062M840N014M522M024M155M964N958O647P037P523Q302
58261H29583R117R722J0322J1201J2214J2930J3182J3176J3185J3365J3743J4143
58249I75883J4294J4232J4262J4390J4141J3267J2248J1747J1914J2536J3475
58238A122389J4564J5498J6234J7154J8325J9212J9591K0162K1531K3143K4114
58227A331917K4632K5627K7338K9110L0503L1673L2785L3902L5347L7430L9839
58216A680103M1973M3750M5377M6623M7092M7091M7424M8446N0015N2071N4498
58205B204463N6696N8266N9881O2510O5997O9393P2517P6156Q0691Q5549R0128
$$ plain form
58194 2982247 3076684 3175437 3278713 3386854 3500026 3617877 3740014 3866864 3999479 4138451
58184 4138451 4283873 4436468 4597750 4768740 4949519 5140395 5342467 5556536 5782514
58175 5782514 6020554 6271782 6537193 6816741 7110283 7418710 7743679 8087158 8451832
58166 8451832 8841011 9257568 9703834 10182955 10699148 11256020 11855766 12500616 13193966
58157 13193966 13939665 14741753 15605781 16539191 17549801 18645132 19833483 21124139 22526579
58148 22526579 24052154 25718057 27548910 29575354 31833743 34366213 37216072 40421546
58140 40421546 44017940 48048079 52568969 57650362 63373387 69829747 77111105 85292859
58132 85292859 94437455 104630899 116035535 128925853 143653038 160447518 179016178
$$ packed form
58194B982247R4437R8753J03276J08141J13172J17851J22137J26850J32615J38972
58184D138451J45422J52595J61282J70990J80779J90876K02072K14069K25978
58175E782514K38040K51228K65411K79548K93542L08427L24969L43479L64674
58166H451832L89179M16557M46266M79121N16193N56872N99746O44850O93350
58157A3193966P45699Q02088Q64028R33410J010610J095331J188351J290656J402440
58148B2526579J525575J665903J830853K026444K258389K532470K849859L205474
58140D0421546L596394M030139M520890N081393N723025O456360P281358Q181754
58132H5292859R144596J0193444J1404636J2890318J4727185J6794480J8568660
$$ plain form
58125 179016178 198108464 215445031 228291912 234480561 233255067 225425079 212829409
58118 212829409 197550642 181325644 165314090 150143092 136073378 123166838 111399429
58111 111399429 100721258 91086938 82464403 74823409 68122403 62313023 57350878 53190354
58103 53190354 49771963 47026481 44888027 43287697 42134047 41314689 40716001 40218098
58095 40218098 39661828 38849196 37614010 35906287 33807162 31469215 29048092 26670557
58087 26670557 24427473 22370224 20513030 18846427 17351617 16006711 14790113 13685819
58079 13685819 12685087 11781520 10966914 10232853 9572861 8980485 8447220 7964039 7523410
58070 7523410 7118728 6743712 6393738 6066462 5760079 5472069 5200325 4944158 4703304
$$ packed form
58125A79016178J9092286J7336567J2846881O188649j225494p829988j2595670
58118B12829409j5278767j6224998j6011554j5170998j4069714j2906540j1767409
58111A11399429j0678171r634320q622535p640994o701006n809380m962145m160524
58103E3190354l418391k745482k138454j600330j153650q19358n98688m97903
58095D0218098n56270q12632j235186j707723k099125k337947k421123k377535
58087B6670557k243084k057249j857194j666603j494810j344906j216598j104294
58079A3685819j000732r03567q14606p34061o59992n92376n33265m83181m40629
58070G523410m04682l75016l49974l27276l06383k88010k71744k56167k40854
$$ plain form
58061 4703304 4476904 4264035 4064311 3877327 3702072 3537011 3380048 3228527 3080370
58052 3080370 2935364 2794647 2659182 2529658 2407424 2294007 2189486 2092430 2001531 1916340
58042 1916340 1836494 1761424 1690977 1625281 1563807 1505484 1449899 1397612 1349184 1304679 1264017
58031 1264017 1227031 1193128 1161649 1132391 1105096 1078726 1052201 1025626 999832 974920 950302
58020 950302 925947 902423 879701 857057 834255 811857 790293 769602 750128 732400 716229
58009 716229 700901 686401 673403 661850 650572 638728 626788 615751 606044 597519 589833 582569
57997 582569 575470 568706 562409 556041 548904 541198 533817 527110 520711 514583 509236 504699 500151 494918
57983 494918 489153 483322 477695 472518 467962 463769 459595 455757 452859 450614 447992 444766 442008 440645
$$ packed form
58061D703304k26400k12869j99724j86984j75255j65061j56963j51521j48157
58052C080370j45006j40717j35465j29524j22234j13417j04521r7056r0899q5191
58042A916340p9846p5070p0447o5696o1474n8323n5585n2287m8428m4505m0662
58031A264017l6986l3903l1479k9258k7295k6370k6525k6575k5794k4912k4618
58020I50302k4355k3524k2722k2644k2802k2398k1564k0691j9474j7728j6171
58009G16229j5328j4500j2998j1553j1278j1844j1940j1037r707q525p686p264
57997E82569p099o764o297o368p137p706p381o707o399o128n347m537m548n233
57983D94918n765n831n627n177m556m193m174l838k898k245k622l226k758j363
$$ plain form
57969 440645 440294 439949 439082 437665 435785 433750 432057 430921 430215 429995 430399 430908 430554 429260 428214 428419
57953 428419 429489 430354 430545 430254 429630 428570 426902 424383 420849 416575 412074 407386 402103 396320 390832
57938 390832 386095 381650 377064 372741 369217 366238 363189 359948 356705 353350 349694 345936 342223 338131
57924 338131 333308 328437 324758 322603 321095 319420 317817 317072 317430 318381 319370 320357 321648 323319 325080
57909 325080 326695 328224 329628 330488 330596 330573 331296 332714 333875 334166 333854 333295 332421 331322 330542 330200 329395
57892 329395 327181 323821 320504 318086 316623 315903 315819 316210 316771 317178 317173 316698 316108 316002 316602 317538 318395 319116
57874 319116 319638 319564 318599 316995 315167 313156 310813 308133 304959 300736 295189 289006 283244 278158 273189
57859 273189 268039 263178 259140 255826 252711 249484 246325 243677 241820 240626 239821 239523 240211 242004 244287
$$ packed form
57969D40645l51l45q67j417j880k035j693j136p06k20M04N09l54j294j046K05
57953D28419J070Q65J91k91o24j060j668k519l534m274m501m688n283n783n488
57938C90832m737m445m586m323l524k979l049l241l243l355l656l758l713m092
57924C38131m823m871l679k155j508j675j603p45L58R51R89R87J291J671J761
57909C25080J615J529J404Q60J08k3P23J418J161K91l12n59q74j099p80l42q05
57892C29395k214l360l317k418j463p20q4L91N61M07nm75n90j06O00R36Q57P21
57874C19116N22p4r65j604j828k011k343k680l174m223n547o183n762n086m969
57859B73189n150m861m038l314l115l227l159k648j857j194q05k98O88J793K283
$$ plain form
57844 244287 246434 248653 251747 256148 261531 267209 272573 277266 281324 285073 288600 291471 293293 294370
57830 294370 295384 296602 297791 298745 299347 299232 298003 295880 293554 291267 288559 285113 281344 277899 275000
57815 275000 272559 270456 268302 265439 261759 258338 256585 256763 257855 258923 260061 261848 264415 267443
57801 267443 270655 273774 276193 277366 277619 278093 279673 282258 285138 287604 289006 288791 287070 284851 283119
57786 283119 281803 280125 277814 275410 273404 271657 269720 267236 264011 260248 256803 254554 253315 251930
57772 251930 249696 247126 245021 243448 242039 240645 239093 236828 233493 229540 225630 221679 217151 212047
57758 212047 206895 201959 197127 192515 188413 184632 180634 176465 172880 170284 168188 166040 163986 162395
57744 162395 161089 159648 158252 157664 158412 160388 163178 166378 169509 172036 173750 174967 176095 177087 177582
$$ packed form
57844B44287K147K219L094M401N383N678N364M693M058L749L527K871J822J077
57830B94370J014J218J189R54O02j15j229k123k326k287k708l446l769l445k899
57815B75000k441k103k154k863l680l421j753J78J092J068J138J787K567L028
57801B67443L212L119K419J173K53M74J580K585K880K466J402k15j721k219j732
57786B83119j316j678k311k404k006j747j937k484l225l763l445k249j239j385
57772B51930k234k570k105j573j409j394j552k265l335l953l910l951m528n104
57758B12047n152m936m832m612m102l781l998m169l585k596k096k148k054j591
57744A62395j306j441j396n88P48J976K790L200L131K527J714J217J128R92M95
$$ plain form
57729 177582 177570 177611 178245 179429 180819 182415 184468 186789 188662 189670 190183 190721 191184 191110 190445 189494 188152
57712 188152 185739 181790 176692 171340 166357 161811 157504 153337 149457 146215 143971 142832 142561 142816 143493
57697 143493 144744 146538 148300 149228 149133 148765 149139 150670 153152 156329 160056 164019 167823 171433 175096
57682 175096 178728 181887 184441 186760 189034 190950 192409 194000 196259 198858 201104 202904 204715 206753
57668 206753 208863 210983 213211 215460 217571 219722 222258 225173 228194 231296 234648 238158 241646 245443
57654 245443 250219 256039 262124 267780 273145 278802 285012 291590 298295 305083 312124 319757 328333 337994
57640 337994 348652 360233 372851 386809 402486 420054 439135 458880 478685 498783 520011
57629 520011 543152 568688 596851 627529 660347 695284 733166 775153 821899 873564 930374
$$ packed form
57729A77582j2M1O34J184J390J596K053K321J873J008N13N38M63p4o65r51j342
57712A88152k413l949n098n352m983m546m307m167l880l242k244j139k71K55O77
57697A43493J251J794J762R28r5l68L74J531K482L177L727L963L804L610L663
57682A75096L632L159K554K319K274J916J459J591K259K599K246J800J811K038
57668B06753K110K120K228K249K111K151K536K915L021L102L352L510L488L797
57654B45443M776N820O085N656N365N657O210O578O705O788P041P633Q576R661
57640C37994J0658J1581J2618J3958J5677J7568J9081J9745J9805K0098K1228
57629E20011K3141K5536K8163L0678L2818L4937L7882M1987M6746N1665N6810
$$ plain form
57618 930374 992618 1060256 1133250 1212264 1298435 1392431 1494366 1604559 1723527 1850844 1984552
57607 1984552 2121825 2259279 2391971 2512619 2612714 2684769 2723908 2728440 2699929 2642761
57597 2642761 2562951 2466829 2360294 2248423 2135021 2022429 1912036 1805040 1702820 1606854
57587 1606854 1518387 1437883 1364679 1297575 1235990 1180321 1131055 1087889 1049934 1016399 986893
57576 986893 961426 940388 924112 912138 903289 896805 892991 892356 894612 899130 905972 915775 928805
57563 928805 944904 964232 987266 1013944 1043621 1076277 1113128 1155516 1203520 1256138 1312685
57552 1312685 1373471 1439033 1509042 1582182 1656966 1732313 1807121 1879359 1945922 2003548 2049682
57541 2049682 2082282 2099225 2098582 2079721 2043801 1993004 1929609 1855973 1775008 1690049 1604013 1518816
$$ packed form
57618I30374O2244O7638P2994P9014Q6171R3996J01935J10193J18968J27317J33708
57607A984552J37273J37454J32692J20648J00095P2055L9139M532k8511n7168
57597B642761p9810r6122j06535j11871j13402j12592j10393j06996j02220r5966
57587A606854q8467q0504p3204o7104o1585n5669m9266m3166l7955l3535k9506
57576I86893k5467k1038j6276j1974q849o484l814o35K256M518O842R803J3030
57563I28805J6099J9328K3034K6678K9677L2656L6851M2388M8004N2618N6547
57552A312685O0786O5562P0009P3140P4784P5347P4808P2238O6563N7626M6134
57541B049682L2600J6943o43j8861l5920n0797o3395p3636q0965q4959q6036q5197
$$ plain form
57529 1518816 1435498 1354640 1276606 1201706 1130376 1063125 1000223 941601 887188 837112 791326
57518 791326 749233 710130 673929 640955 610986 583092 556708 532320 510679 491713 474684
57507 474684 459029 444432 430441 416868 404505 394566 387157 380936 374568 367924 361575 355784 350586
57494 350586 346390 343774 342710 342501 342547 342953 344317 347130 351331 356362 361706 367368 373762 381184 389616
57479 389616 398986 409335 420677 433024 446562 461420 477289 493701 510787 529237 549407 571101
57467 571101 594440 620205 648801 679517 711542 745301 782059 822491 866312 913158 963021
57456 963021 1015806 1071107 1128443 1187137 1245838 1302650 1355882 1404192 1445918 1478764 1500456
57445 1500456 1509447 1504953 1486816 1455731 1413442 1362419 1305284 1244455 1182012 1119635 1058637 999973
$$ packed form
57529A518816q3318q0858p8034p4900p1330o7251o2902n8622n4413n0076m5786
57518G91326m2093l9103l6201l2974k9969k7894k6384k4388k1641j8966j7029
57507D74684j5655j4597j3991j3573j2363r939p409o221o368o644o349n791n198
57494C50586m196k616j064k09M6M06J364K813M201N031N344N662O394P422Q432
57479C89616R370J0349J1342J2347J3538J4858J5869J6412J7086J8450K0170K1694
57467E71101K3339K5765K8596L0716L2025L3759L6758M0432M3821M6846M9863
57456I63021N2785N5301N7336N8694N8701N6812N3232M8310M1726L2846K1692
57445A500456Q991m494j8137l1085m2289n1023n7135o0829o2443o2377o0998n8664
$$ plain form
57433 999973 944111 891058 840854 794048 751452 713366 679301 648502 620590 595640 573874
57422 573874 555286 539373 525241 512288 500891 492189 487026 485202 485815 488158 492157 498101 506217
57409 506217 516626 529616 545662 565010 587269 611687 637926 666364 697639 732150 770045
57398 770045 811276 855413 901799 950170 1000805 1053622 1107402 1160367 1211241 1259149 1302501
57387 1302501 1338521 1364057 1376659 1375166 1359838 1332008 1293225 1244680 1187703 1124531 1057954
57376 1057954 990186 922530 856017 791654 729975 671092 615478 564073 517264 474270 433923
57365 433923 395630 359368 325246 293512 264587 238623 215278 194163 175105 157612 140666
57354 140666 123646 107142 92252 79273 67630 56828 46812 37509 28701 20471 13180 6870
$$ packed form
57433I99973n5862n3053n0204m6806m2596l8086l4065l0799k7912k4950k1766
57422E73874j8588j5913j4132j2953j1397q702n163j824O13K343L999N944Q116
57409E06217J0409J2990J6046J9348K2259K4418K6239K8438L1275L4511L7895
57398G70045M1231M4137M6386M8371N0635N2817N3780N2965N0874M7908M3352
57387A302501L6020K5536J2602j493j5328k7830l8783m8545n6977o3172o6577
57376A057954o7768o7656o6513o4363o1679n8883n5614n1405m6809m2994m0347
57365D33923l8293l6262l4122l1734k8925k5964k3345k1115j9058j7493j6946
57354A40666j7020j6504j4890j2979j1643j0802j0016r303q808q230p291o310
$$ plain form
57342 6870 1089 -4593 -10315 -16251 -22721 -29662 -36332 -41921 -46436 -50778 -55947 -62121 -68423 -73676 -77489
57327 -77489 -80499 -83399 -86067 -88049 -89579 -91402 -93607 -95406 -96389 -97307 -99128 -101776 -104397 -106518 -108295
57312 -108295 -109796 -110743 -111106 -111417 -112218 -113494 -114869 -116184 -117687 -119711 -122246 -124864 -127169 -129368 -132156
57297 -132156 -135839 -139776 -143058 -145602 -148171 -151423 -155410 -159980 -165048 -170253 -174881 -178413 -180787 -181946
57283 -181946 -181678 -180323 -179108 -179156 -180380 -181868 -183095 -184228 -185495 -186916 -188609 -190675 -192774 -194410 -195680
57268 -195680 -197146 -198805 -199877 -199848 -199207 -198871 -199355 -200729 -202813 -205003 -206424 -206786 -206816 -207356 -208365 -209197 -209518
57251 -209518 -209415 -208852 -207679 -206111 -204609 -203223 -201501 -199144 -196350 -193380 -190096 -186115 -181194 -175404 -169063
57236 -169063 -162587 -156296 -150281 -144450 -138584 -132243 -124837 -115994 -105761 -94327 -81723 -67975 -53263
$$ packed form
57342F870A089d593n722n936o470o941o670n589m515m342n169o174o302n253l813
57327g7489l010k900k668j982j530j823k205j799r83r18j821k648k621k121j777
57312a08295j501r47l63l11q01j276j375j315j503k024k535k618k305k199k788
57297a32156l683l937l282k544k569l252l987m570n068n205m628l532k374j159
57283a81946K68J355J215m8j224j488j227j133j267j421j693k066k099j636j270
57268a95680j466j659j072K9O41L36m84j374k084k190j421l62l0n40j009q32l21
57251b09518J03N63J173J568J502J386J722K357K794K970L284L981M921N790O341
57236a69063O476O291O015N831N866O341P406Q843J0233J1434J2604J3748J4712
$$ plain form
57223 -53263 -37576 -20408 -1264 19589 41265 63173 85466 108425 131689 154189 174746 192739
57211 192739 208376 222295 234741 245188 252829 257225 258291 255982 250409 242046 231299 217977 201711
57198 201711 182958 163112 143477 124538 106264 88637 71628 55076 38929 23395 8583 -5746
57185 -19851 -33543 -46344 -58008 -68681 -78610 -87883 -96419 -104125 -111059 -117507 -123831 -130160 -136225
57172 -136225 -141583 -146074 -150059 -154068 -158065 -161223 -162762 -162979 -162996 -163389 -163573 -162798 -161160 -159096 -156365 -152326
57156 -152326 -146959 -140696 -133228 -123329 -110187 -94235 -76311 -56645 -35154 -12311 10918 33957
57144 33957 56896 80042 103411 126766 149925 172971 196158 219608 243139 266516 289807 313261
57132 313261 336850 360196 383049 405603 428204 450900 473407 495403 516752 537560 558089
$$ packed form
57223e3263J5687J7168a264A9589K1676K1908K2293K2959K3264K2500K0557J7993
57211A92739J5637J3919J2446J0447P641M396J066k309n573q363j0747j3322j6266
57198B01711j8753j9846j9635j8939j8274j7627j7009j6552j6147j5534H583e746
57185a9851j3692j2801j1664j0673r929r273q536p706o934o448o324o329o065
57172a36225n358m491l985m009l997l158j539k17j7l93j84P75J638K064K731M039
57156a52326N367O263P468R899J3142J5952J7924J9666K1491a2311A0918K3039
57144C3957K2939K3146K3369K3355K3159K3046K3187K3450K3531K3377K3291K3454
57132C13261K3589K3346K2853K2554K2601K2696K2507K1996K1349K0808K0529
$$ plain form
57121 558089 578606 599243 619940 640355 659852 677864 694497 710587 726869 743243 759129
57110 759129 774442 789903 806433 824429 843583 863211 882824 902463 922289 941786 959775
57099 959775 975415 988665 999445 1006902 1010139 1009133 1004158 994634 979375 957751 929758 895077
57087 895077 852997 803296 746337 682159 610259 530412 442833 347206 242161 126011 -2452
57075 -143949 -298786 -466862 -648107 -843086 -1052631 -1276952 -1515941 -1770533 -2043157 -2336700
57065 -2336700 -2653585 -2995828 -3365218 -3763328 -4192072 -4654405 -5153947 -5694145 -6278800
57056 -6278800 -6913518 -7605844 -8363996 -9196458 -10112903 -11124655 -12244357 -13486320 -14867330
57047 -14867330 -16406288 -18123502 -20041987 -22189921 -24601170 -27314279 -30373164 -33829301
$$ packed form
57121E58089K0517K0637K0697K0415J9497J8012J6633J6090J6282J6374J5886
57110G59129J5313J5461J6530J7996J9154J9628J9613J9639J9826J9497J7989
57099I59775J5640J3250J0780P457L237j006m975r524j5259k1624k7993l4681
57087H95077m2080m9701n6959o4178p1900p9847q7579r5627j05045j16150b452
57075a43949j54837j68076j81245j94979k09545k24321k38989k54592k72624k93543
57065b336700l16885l42243l69390l98110m28744m62333m99542n40198n84655
57056f278800o34718o92326p58152q32462r16445j011752j119702j241963j381010
57047a4867330j538958j717214j918485k147934k411249k713109l058885l456137
$$ plain form
57039 -33829301 -37742382 -42180346 -47222279 -52961733 -59503013 -66949302 -75390590 -84898326
57031 -84898326 -95526579 -107315839 -120292633 -134456937 -149764076 -166129418 -183466841
57024 -183466841 -201706460 -220708028 -240075683 -259019479 -276425076 -291132174 -302247424
57017 -302247424 -309311447 -312281694 -311411737 -307111186 -299823703 -289945274 -277807915 -263726963
57009 -263726963 -248065419 -231259343 -213786495 -196105889 -178609238 -161604962 -145326698
57002 -145326698 -129946487 -115583106 -102310645 -90171664 -79187715 -69358643 -60654997
56995 -60654997 -53015968 -46356976 -40580177 -35582365 -31261459 -27522808 -24282687 -21467857
56987 -21467857 -19014325 -16867588 -14982729 -13322730 -11856316 -10556838 -9401673 -8371529
$$ packed form
57039c3829301l913081m437964n041933n739454o541280p446289q441288r507736
57031h4898326j0628253j1789260j2976794j4164304j5307139j6365342j7337423
57024a83466841j8239619j9001568j9367655j8943796j7405597j4707098j1115250
57017c02247424p064023k970247Q69957M300551P287483R878429J2137359J4080952
57009b63726963J5661544J6806076J7472848J7680606J7496651J7004276J6278264
57002a45326698J5380211J4363381J3272461J2138981J0983949R829072Q703646
56995f0654997P639029O658992N776799M997812M320906L738651L240121K814830
56987b1467857K453532K146737J884859J659999J466414J299478J155165J030144
$$ plain form
56979 -8371529 -7450197 -6624508 -5883454 -5216965 -4615952 -4073279 -3583615 -3142024 -2743379
56970 -2743379 -2383177 -2057965 -1764698 -1500317 -1262195 -1048121 -855532 -681397 -523248
56961 -523248 -379736 -249928 -132543 -26136 70509 158458 238495 310682 374395 429152 475093
56950 475093 512520 541270 560755 570567 571586 567425 564656 569992 585596 606755 624521 631186 624142
56937 624142 605939 581635 555829 531009 507660 485361 463779 443053 423709 406192 390193
56926 390193 374627 358695 342987 329063 317825 308590 299716 289704 277590 262890 245760 227174
56914 227174 208588 191199 175330 160384 145464 130245 115314 101622 89758 79889 72104 66496
56902 66496 63059 61872 63290 67577 74410 83036 92790 103097 113139 122022 129268 134754 138319 140014
$$ packed form
56979h371529R21332Q25689P41054O66489O01013N42673M89664M41591L98645
56970b743379L60202L25212K93267K64381K38122K14074J92589J74135J58149
56961e23248J43512J29808J17385b6136G0509Q7949Q0037P2187O3713N4757M5941
56950D75093L7427K8750J9485R812J019m161k769N336J5604K1159J7766O665p044
56937F24142j8203k4304k5806k4820k3349k2299k1582k0726j9344j7517j5999
56926C90193j5566j5932j5708j3924j1238r235q874j0012j2114j4700j7130j8586
56914B27174j8586j7389j5869j4946j4920j5219j4931j3692j1864r869p785n608
56902F6496l437j187J418M287O833Q626R754J0307J0042Q883P246N486L565J695
$$ plain form
56888 140014 140656 141424 142703 143850 144331 144527 145231 146838 149386 152883 157230 162161 167696 174315 182312
56873 182312 191180 200081 208657 216936 224525 230348 233201 232251 227090 217914 205906 192997 180707 169234
56859 169234 157985 146947 137110 129369 123535 118864 115224 112993 111845 110556 108490 106673 106640 108543
56845 108543 111070 113085 114590 116088 117785 119785 122550 126663 132259 138927 146028 153028 159704 166260
56831 166260 173153 180761 189260 198729 209111 220013 230660 240018 246949 250510 250432 247250 241738 234454
56817 234454 226074 217721 210287 203597 197017 190922 186751 185381 186127 187800 190189 194027 199925 207913
56803 207913 217850 229801 243937 260179 277770 295171 310723 323568 333596 340460 343303 341813
56791 341813 336940 330030 321756 312490 303284 295566 289962 286165 284034 284143 287092 292903 301329 312276
$$ packed form
56888A40014O42P68J279J147M81J96P04J607K548L497M347M931N535O619P997
56873A82312Q868Q901Q576Q279P589N823K853r50n161r176j2008j2909j2290j1473
56859A69234j1249j1038r837p741n834m671l640k231j148j289k066j817l3J903
56845A08543K527K015J505J498J697K000K765M113N596O668P101P000O676O556
56831A66260O893P608Q499R469J0382J0902J0647R358O931L561p8l182n512p284
56817B34454q380q353p434o690o580o095m171j370P46J673K389L838N898P988
56803B07913R937J1951J4136J6242J7591J7401J5552J2845J0028O864K843j490
56791C41813m873o910q274r266r206p718n604l797k131J09K949N811Q426J0947
$$ plain form
56777 312276 325706 341542 359936 381209 405165 430650 455880 478789 496882 507472 508984 502104
56765 502104 489193 472478 453147 432043 410568 390510 373202 359138 348184 339958 334185 330972
56753 330972 330688 333464 339006 347111 358103 372362 389533 408589 428413 447654 463940 474101
56741 474101 475837 468980 454952 435562 412784 389087 366815 347044 329598 314220 301110 290227
56729 290227 280824 272225 264673 258990 255680 254741 256151 259998 266149 274081 283060 292180 300156 305343
56715 305343 306220 302064 293345 281568 268571 255668 243267 231239 219558 208576 198783 190432 183417
56702 183417 177429 172160 167330 162611 157780 153054 149037 146076 143784 141534 139334 137833 137409 137670 138048
56687 138048 138514 139351 140462 141291 141396 140749 139523 137879 136127 134771 134121 133944 133682 133025 132109 131149 130160
$$ packed form
56777C12276J3430J5836J8394K1273K3956K5485K5230K2909J8093J0590J512o880
56765E02104j2911j6715j9331k1104k1475k0058j7308j4064j0954q226n773l213
56753C30972k84K776N542Q105J0992J4259J7171J9056J9824J9241J6286J0161
56741D74101J736o857j4028j9390k2778k3697k2272j9771j7446j5378j3110j0883
56729B90227r403q599p552n683l310r39J410L847O151P932Q979R120P976N187
56715C05343Q77m156q719j1777j2997j2903j2401j2028j1681j0982r793q351p015
56702A83417n988n269m830m719m831m726m017k961k292k250k200j501m24K61L78
56687A38048M66Q37J111Q29J05o47j226j644j752j356o50j77k62o57r16r60r89
$$ plain form
56670 130160 129190 128554 128484 128592 128177 127127 126089 125548 125170 124435 123504 122962 122895 122823 122462 122004 121610 121170 120628
56651 120628 120081 119504 118808 118289 118454 119161 119470 118671 117113 115662 114748 114339 114501 115415 116888 118254 118809
56634 118809 118208 116619 114709 113368 113107 113708 114568 115296 115904 116595 117571 118913 120483 122127 124041 126719
56618 126719 130308 134238 137687 140269 142142 143710 145409 147478 149691 151578 153157 155073 157636 160105
56604 160105 161533 162087 162880 164494 166331 167561 168174 168796 169819 171011 171796 171723 170765 169287 167676 165999
56588 165999 164193 162463 161211 160504 159882 158776 156913 154311 151161 147836 144754 142052 139590 137406 135975
56573 135975 135754 136566 137617 138132 137851 136999 135968 135139 134871 135391 136551 137748 138365 138374 138329 138658 139138 139241
56555 139241 138834 138287 138036 138290 139051 140069 140803 140880 140662 140983 142191 143801 145291 146866 149040 151728 154239
$$ packed form
56670A30160r70o36p0J08m15j050j038n41l78p35r31n42o7p2l61m58l94m40n42
56651A20628n47n77o96n19J65P07L09p99j558j451r14m09J62R14J473J366N55
56634A18809o01j589j910j341k61O01Q60P28O08O91R76J342J570J644J914K678
56618A26719L589L930L449K582J873J568J699K069K213J887J579J916K563K469
56604A60105J428N54P93J614J837J230O13O22J023J192P85p3r58j478j611j677
56588A65999j806j730j252p07o22j106j863k602l150l325l082k702k462k184j431
56573A35975k21Q12J051N15k81q52j031q29k68N20J160J197O17Rm5L29M80J03
56555A39241m07n47k51K54P61J018P34P7k18L21J208J610J490J575K174K688K511
$$ plain form
56538 154239 156065 157207 157686 157268 156011 154751 154573 155750 157491 158812 159464 159948 160799 162001 163059 163539
56522 163539 163588 163988 165613 168703 172650 176529 179788 182442 184766 186980 189156 191256 193251 195271 197587
56507 197587 200364 203517 206935 210745 215214 220513 226737 233981 242089 250475 258552 266256 273786 280937
56493 280937 287199 292577 297781 303411 309428 315586 321831 327838 332654 335356 335930 335112 333554 331490 329019
56478 329019 326223 322990 319002 313919 307509 299888 291837 284522 278472 273051 267317 261156 255139 249509
56464 249509 243939 238245 232767 227956 223946 220556 217399 214034 210438 207280 205326 204620 204624 204973 205501 205658
56448 205658 204729 202854 201160 200533 200769 201150 201271 200971 200053 198622 197270 196440 195924 195381 194978 194949 194951 194513
56430 194513 193884 193674 193681 192822 190468 187328 184793 183731 184113 185393 186885 188043 188722 189218 189904 190875 191960
$$ packed form
56538A54239J826J142M79m18j257j260j78J177J741J321O52M84Q51J202J058M80
56522A63539M9M00J625L090L947L879L259K654K324K214K176K100J995K020K316
56507A97587K777L153L418L810M469N299O224P244Q108Q386Q077P704P530P151
56493B80937O262N378N204N630O017O158O245O007M816K702N74q18j558k064k471
56478C29019k796l233l988n083o410p621q051p315o050n421n734o161o017n630
56464B49509n570n694n478m811m010l390l157l365l596l158j954p06ML49N28J57
56448B05658r29j875j694o27K36L81J21l00r18j431j352q30n16n43m03k9Km38
56430A94513o29k10Pq59k354l140k535j062L82J280J492J158O79M96O86R71J085
$$ plain form
56413 191960 192966 193832 194633 195500 196520 197716 199196 201232 203968 207088 210063 212792 215740 219282 223212
56398 223212 227155 231220 235903 241382 247225 252795 257629 261399 263923 265483 266824 268468 270120 271086
56384 271086 271218 271064 271033 270805 269855 268287 266852 266133 265932 265462 264020 261543 258592 255783 253145 250140
56368 250140 246409 242404 239054 236818 235225 233395 230913 228202 226057 224832 224044 222909 221244 219699
56354 219699 218987 219079 219344 219273 218815 218156 217528 217178 217183 217234 216899 216158 215446 215076 214808 214128 212775 210973 209326
56335 209326 208489 208664 209295 209449 208656 207310 206225 205960 206551 207665 208862 209896 210875 211945 212877 213211 212922
56318 212922 212626 213005 214234 216073 218208 220294 222010 223334 224572 225849 226851 227408 228069 229591 231927
56303 231927 234231 235903 237212 238746 240626 242545 244314 246061 247890 249620 250953 251832 252536 253368 254353
$$ packed form
56413A91960J006Q66Q01Q67J020J196J480K036K736L120K975K729K948L542L930
56398B23212L943M065M683N479N843N570M834L770K524J560J341J644J652R66
56384B71086J32j54l1k28r50j568j435p19k01m70j442k477k951k809k638l005
56368B50140l731m005l350k236j593j830k482k711k145j225p88j135j665j545
56354B19699p12R2K65p1m58o59o28l50NN1l35p41p12l70k68o80j353j802j647
56335B09326q37J75O31J54p93j346j085k65N91J114J197J034R79J070R32L34k89
56318B12922k96L79J229J839K135K086J716J324J238J277J002N57O61J522K336
56303B31927K304J672J309J534J880J919J769J747J829J730J333Q79P04Q32R85
$$ plain form
56288 254353 255374 256611 258559 261413 264620 267320 269134 270265 270969 271331 271611 272368 273959 276114 278178
56273 278178 279635 280277 280170 279758 279846 281112 283546 286494 289238 291478 293459 295861 299416 304315 309936
56258 309936 315419 320485 325450 330540 335609 340602 345804 351309 356615 361177 365168 369297 373993 379154
56244 379154 384571 390146 395642 400730 405442 410255 415517 421077 426582 431825 436615 440667 443937 446843
56230 446843 449870 453142 456677 460757 465682 471297 477240 483549 490592 498375 506401 514402 522862 532566
56216 532566 543807 556265 569529 583569 598757 615584 634334 654916 677049 700652 726079
56205 726079 753949 784702 818340 854627 893631 936008 982566 1033515 1088423 1147025 1209777
56194 1209777 1277224 1349062 1424208 1501811 1581741 1663949 1747640 1831207 1912781 1990637 2063249
$$ packed form
56288B54353J021J237J948K854L207K700J814J131P04L62K80P57J591K155K064
56273B78178J457O42j07m12Q8J266K434K948K744K240J981K402L555M899N621
56258C09936N483N066M965N090N069M993N202N505N306M562L991M129M696N161
56244C79154N417N575N496N088M712M813N262N560N505N243M790M052L270K906
56230D46843L027L272L535M080M925N615N943O309P043P783Q026Q001Q460R704
56216E32566J1241J2458J3264J4040J5188J6827J8750K0582K2133K3603K5427
56205G26079K7870L0753L3638L6287L9004M2377M6558N0949N4908N8602O2752
56194A209777O7447P1838P5146P7603P9930Q2208Q3691Q3567Q1574P7856P2612
$$ plain form
56183 2063249 2129168 2186968 2235405 2273713 2301654 2319152 2326035 2322400 2309159 2287855 2259899 2226203
56171 2226203 2187533 2144795 2098903 2050716 2001231 1951369 1901340 1850626 1798956 1747007 1695632
56160 1695632 1644646 1592922 1539700 1485306 1430545 1375883 1321536 1267960 1215792 1165440 1117123
56149 1117123 1071284 1028562 989112 952195 916752 882404 849799 820000 793655 770636 750160
56138 750160 731237 713244 696271 680832 667169 654975 643894 634014 625630 618652 612571 607021
56126 607021 602137 598258 595421 593277 591470 590005 589113 588751 588458 588005 588021 589490 592491 595975 599069 602115
56110 602115 606016 611038 616940 623979 632846 643487 654747 665496 675659 685939 697050 709545
56098 709545 723884 740037 757145 774045 790210 806038 822241 839118 856418 873783 891252
$$ packed form
56183B063249O5919N7800M8437L8308K7941J7498O883l635j3241k1304k7956l3696
56171B226203l8670m2738m5892m8187m9485m9862n0029n0714n1670n1949n1375
56160A695632n0986n1724n3222n4394n4761n4662n4347n3576n2168n0352m8317
56149A117123m5839m2722l9450l6917l5443l4348l2605k9799k6345k3019k0476
56138G50160j8923j7993j6973j5439j3663j2194j1081r880q384o978o081n550
56126F07021m884l879k837k144j807j465q92l62k93m53J6J469L001L484L094L046
56110F02115L901N022N902P039Q867J0641J1260J0749J0163J0280J1111J2495
56098G09545J4339J6153J7108J6900J6165J5828J6203J6877J7300J7365J7469
$$ plain form
56087 891252 909353 928756 949959 973295 999016 1027252 1058167 1092423 1131214 1175485 1225394
56076 1225394 1280967 1343023 1412623 1489529 1571734 1656590 1741705 1824579 1902338 1972722 2035279
56065 2035279 2091165 2141900 2188480 2231164 2269303 2301151 2324235 2336353 2336624 2326009 2306988 2282399
56053 2282399 2254047 2222043 2185119 2141388 2089046 2027096 1955992 1877740 1795353 1712126 1631045
56042 1631045 1554272 1482910 1417402 1358135 1305487 1259428 1219495 1185174 1155984 1131233 1110181
56031 1110181 1092522 1078287 1067252 1058831 1052577 1048222 1045210 1042771 1040601 1038889 1037519 1035950 1034133
56018 1034133 1032795 1032335 1032134 1031595 1031302 1032419 1035280 1039272 1043883 1049179 1055298 1062075 1069265 1076801 1084790
56003 1084790 1093467 1103128 1113916 1125771 1138715 1152939 1168430 1184853 1202040 1220363 1240233 1261450
$$ packed form
56087H91252J8101J9403K1203K3336K5721K8236L0915L4256L8791M4271M9909
56076A225394N5573O2056O9600P6906Q2205Q4856Q5115Q2874P7759P0384O2557
56065B035279N5886N0735M6580M2684L8139L1848K3084J2118K71j0615j9021k4589
56053B282399k8352l2004l6924m3731n2342o1950p1104p8252q2387q3227q1081
56042A631045p6773p1362o5508n9267n2648m6059l9933l4321k9190k4751k1052
56031A110181j7659j4235j1035q421o254m355l012k439k170j712j370j569j817
56018A034133j338m60k01n39k93J117K861L992M611N296O119O777P190P536P989
56003A084790Q677R661J0788J1855J2944J4224J5491J6423J7187J8323J9870K1217
$$ plain form
55991 1261450 1283333 1305359 1327494 1350079 1373589 1398317 1424151 1450817 1478397 1507322 1537869
55980 1537869 1570041 1603970 1639930 1677838 1717259 1758030 1800305 1843825 1887791 1931792 1976268
55969 1976268 2021755 2068292 2115999 2165602 2217830 2272806 2330485 2391294 2455853 2524489 2597343
55958 2597343 2674585 2756187 2842044 2932528 3028285 3129094 3233708 3341348 3452667 3568739
55948 3568739 3689824 3815697 3946418 4082148 4222953 4369610 4523902 4687244 4859482
55939 4859482 5039861 5228709 5427437 5637387 5859421 6094208 6342122 6603201 6877788
55930 6877788 7166997 7472305 7795294 8138131 8503584 8894251 9312588 9761885 10246119
55921 10246119 10768508 11331436 11938119 12592782 13298835 14058872 14877536 15762707 16722961
$$ packed form
55991A261450K1883K2026K2135K2585K3510K4728K5834K6666K7580K8925L0547
55980A537869L2172L3929L5960L7908L9421M0771M2275M3520M3966M4001M4476
55969A976268M5487M6537M7707M9603N2228N4976N7679O0809O4559O8636P2854
55958B597343P7242Q1602Q5857R0484R5757J00809J04614J07640J11319J16072
55948C568739J21085J25873J30721J35730J40805J46657J54292J63342J72238
55939D859482J80379J88848J98728K09950K22034K34787K47914K61079K74587
55930F877788K89209L05308L22989L42837L65453L90667M18337M49297M84234
55921A0246119N22389N62928O06683O54663P06053P60037Q18664Q85171R60254
$$ plain form
55912 16722961 17765729 18898938 20132263 21475575 22938904 24536585 26290739 28230545
55904 28230545 30391133 32814067 35544134 38621884 42081970 45961966 50311229 55191760
55896 55191760 60679243 66870796 73888444 81869005 90951920 101277255 112985743 126212449
55888 126212449 141073361 157602321 175548687 194042771 211374126 225224386 233412327
55881 233412327 234745729 229422274 218767731 204588198 188581034 172041910 155830342
55874 155830342 140453993 126174808 113098734 101238667 90554514 80979475 72435995
55867 72435995 64842065 58114079 52171965 46942724 42357035 38343907 34831542 31752642
55859 31752642 29046717 26659153 24542004 22656125 20970208 19457359 18093776 16859715
$$ packed form
55912A6722961J042768J133209J233325J343312J463329J597681J754154J939806
55904B8230545K160588K422934K730067L077750L460086L879996M349263M880531
55896E5191760N487483O191553P017648P980561R082915J0325335J1708488J3226706
55888A26212449J4860912J6528960J7946366J8494084J7331355J3850260Q187941
55881B33412327J333402n323455j0654543j4179533j6007164j6539124j6211568
55874A55830342j5376349j4279185j3076074j1860067j0684153r575039q543480
55867G2435995p593930o727986n942114n229241m585689m013128l512365l078900
55859C1752642k705925k387564k117149j885879j685917j512849j363583j234061
$$ plain form
55851 16859715 15739220 14718490 13785528 12930760 12146213 11423972 10756356 10137128 9561418
55842 9561418 9024959 8524407 8057746 7623116 7217725 6838901 6485526 6157094 5851831
55833 5851831 5567006 5300749 5052310 4820727 4604309 4401282 4210002 4028653 3855603
55824 3855603 3689959 3531261 3378956 3232730 3092792 2959107 2830828 2707183 2588345
55815 2588345 2474653 2365561 2260280 2158935 2062173 1970096 1882559 1800096 1723559 1653075
55805 1653075 1588204 1528682 1474088 1423164 1374649 1328661 1286253 1247538 1210995 1174612 1137107
55794 1137107 1098265 1058962 1020827 985187 952280 921839 893988 868863 845820 823985 803374
55783 803374 784532 767212 750414 733777 718023 703876 691321 680075 670074 661319 653842 647957
$$ packed form
55851A6859715j120495j020730r32962q54768p84547p22241o67616o19228n75710
55842I561418n36459n00552m66661m34630m05391l78824l53375l28432l05263
55833E851831k84825k66257k48439k31583k16418k03027j91280j81349j73050
55824C855603j65644j58698j52305j46226j39938j33685j28279j23645j18838
55815B588345j13692j09092j05281j01345r6762r2077q7537q2463p6537p0484
55805A653075o4871n9522n4594n0924m8515m5988m2408l8715l6543l6383l7505
55794A137107l8842l9303l8135l5640l2907l0441k7851k5125k3043k1835k0611
55783H03374j8842j7320j6798j6637j5754j4147j2555j1246j0001q755p477n885
$$ plain form
55771 647957 643983 641597 639985 638678 637706 636914 635743 633910 631787 629858 628039 625588 621408 614583 605043
55756 605043 593684 581491 568624 554738 539930 524802 509675 494422 479144 464416 450736
55745 450736 438163 426630 416207 406934 398728 391535 385357 380147 375857 372405 369377 366173 362891
55732 362891 360650 360376 361505 362612 363079 363307 363400 362713 361000 359109 357988 357586 357191 356421 355405 354306
55716 354306 353019 351155 348068 343163 336418 328437 319850 310904 301745 292697 284001 275547 267228 259449
55702 259449 252953 248012 243917 239432 233834 227520 221405 215773 210014 203485 196245 188672 180917 173203
55688 173203 166256 160731 156421 152700 149613 147767 147120 146649 145474 143700 141853 140022 137935 135516 133054
55673 133054 131043 130008 130135 130882 131306 131011 130470 130230 130136 129624 128487 127030 125581 124131 122441 120400
$$ packed form
55771F47957l974k386j612j307r72p92j171j833k123j929j819k451m180o825r540
55756F05043j1359j2193j2867j3886j4808j5128j5127j5253j5278j4728j3680
55745D50736j2573j1533j0423r273q206p193o178n210m290l452l028l204l282
55732C62891k241k74J129J107M67K28R3o87j713j891j121m02l95p70j016j099
55716C54306j287j864l087m905o745p981q587q946r159r048q696q454q319p779
55702B59449o496m941m095m485n598o314o115n632n759o529p240p573p755p714
55688A73203o947n525m310l721l087j846o47m71j175j774j847j831k087k419k462
55673A33054k011j035J27P47M24k95n41k40r4n12j137j457j449j450j690k041
$$ plain form
55657 120400 118282 116613 115619 114917 113989 112902 112200 112118 112302 112429 112682 113396 114513 115609 116339 116725 117042
55640 117042 117428 117462 116395 114102 111637 110320 110298 110577 110516 110677 111917 114262 117124 120196 123578 127240
55624 127240 130855 134218 137466 140831 144363 147985 151800 156278 161975 168821 175717 181158 184377 185732
55610 185732 185961 185384 183885 181430 178362 175285 172698 170602 168518 166107 163713 162066 161566 162130 163554
55595 163554 165474 167071 167539 167042 166745 167623 169634 172122 174425 175866 175854 174516 172779 171375 170125 168588
55579 168588 166899 165356 163574 160806 157026 153082 149743 147043 144454 141277 136905 131270 125132 119519
55565 119519 114796 110588 106581 102921 99704 96549 93021 89201 85513 82097 78698 75165 71795 68992
55551 68992 66742 64622 62373 60230 58560 57335 56216 55098 54272 54016 54259 54673 54855 54433 53352 52151
$$ packed form
55657A20400k118j669r94p02r28j087p02q2J84J27K53P14J117J096P30L86L17
55640A17042L86L4j067k293k465j317k2K79o1J61J240K345K862L072L382L662
55624A27240L615L363L248L365L532L622L815M478N697O846O896N441L219J355
55610A85732K29n77j499k455l068l077k587k096k084k411k394j647n00N64J424
55595A63554J920J597M68m97k97Q78K011K488K303J441j2j338j737j404j250j537
55579A68588j689j543j782k768l780l944l339k700k589l177m372n635o138n613
55565A19519m723m208m007l660l217l155l528l820l688l416l399l533l370k803
55551F8992k250k120k249k143j670j225j119j118q26k56K43M14J82m22j081j201
$$ plain form
55535 52151 51626 52015 52759 53157 52991 52411 51646 51045 50983 51344 51368 50378 48448 46109 43757 41680 40336 40029
55517 40029 40470 41092 41675 42216 42398 41823 40768 40124 40378 41064 41474 41555 41916 43136 45260 47801 50052 51516
55499 51516 52148 52257 52244 52465 53075 53751 53724 52384 49844 46721 43533 40638 38528 37589 37406 36872 35276
55482 35276 33039 31148 30086 29583 29217 28967 29171 30082 31481 32680 33014 32416 31475 30924 31121 32019 33424
55465 33424 35170 37109 39127 41202 43454 46059 48964 51681 53473 53948 53467 52928 53183 54618 57051
55450 57051 59818 62111 63434 63737 63057 61255 58347 54889 51668 49084 47065 45423 43939 42235 40129
55435 40129 38124 37009 36744 36216 34470 31836 29441 27873 26795 25767 24836 24147 23394 22102 20299 18562
55419 18562 17333 16524 15931 15715 16085 16653 16648 15835 14752 13832 12815 11440 10191 9689 9580 8818 7068 5166
$$ packed form
55535E2151n25L89P44L98j66n80p65o01o2L61K4r90j930k339k352k077j344l07
55517D0029M41O22N83N41J82n75j055o44K54O86M10Q1L61J220K124K541K251J464
55499E1516O32J09j3K21O10O76k7j340k540l123l188k895k110r39j83n34j596
55482C5276k237j891j062n03l66k50K04R11J399J199L34n98r41n51J97Q98J405
55465C3424J746J939K018K075K252K605K905K717J792M75m81n39K55J435K433
55450E7051K767K293J323L03o80j802k908l458l221k584k019j642j484j704k106
55435D0129k005j115k65n28j746k634k395j568j078j028r31o89p53j292j803j737
55419A8562j229q09n93k16L70N68nq13j083r20j017j375j249n02j09p62j750j902
$$ plain form
55401 5166 4012 3633 3553 3518 3462 3230 2784 2348 2010 1452 503 -387 -670 -406 44 812 2285 4096 5061 4464
55381 4464 2978 1979 2199 3286 4374 4726 4015 2418 558 -850 -1379 -946 307 1963 3320 3827 3610
55364 3610 3374 3659 4412 5384 6652 8420 10503 12396 13830 14899 15589 15623 15016 14418 14536 15331 16119 16363
55346 16363 16069 15482 14806 14291 14211 14550 14895 14858 14446 13898 13277 12443 11375 10335 9658 9499 9834 10584 11553
55327 11553 12267 12132 11002 9545 8745 8952 9623 10018 9863 9165 7814 5771 3488 1666 638 308 618
55310 618 1640 3143 4483 5093 4897 4187 3347 2773 2736 3200 3904 4596 4977 4604 3266 1526 354 64 2
55290 -543 -1505 -2293 -2470 -1967 -1028 -174 129 117 619 1960 3371 3921 3640 3239 3062 2924 2784 2881 3223 3528
55270 3528 3686 3811 3848 3645 3489 3984 5209 6420 6774 6079 4769 3522 2985 3373 4120 4356 3951 3721
$$ packed form
55401E166j154l79q0l5n6k32m46m36l38n58E03c87k83K64D4P68J473J811R65n97
55381D464j486r99K20J087J088L52p11j597E58h50n29M33C07J656J357N07k17
55364C610k36K85P53R72J268J768K083J893J434J069O90L4o07n98J18P95P88K44
55346A6363k94n87o76n15q0L39L45l7m12n48o21q34j068j040o77j59L35P50R69
55327A1553P14j35j130j457q00K07O71L95j55o98j351k043k283A666F38C08L10
55310F18J022J503J340O10j96p10q40n74l7M64P04O92L81l73j338A526C54F4B
55290e43r62p88j77N03R39a74A29j2N02J341J411N50k81m01j77j38j40R7L42L05
55270C528J58J25L7k03j56M95J225J211L54o95j310j247n37L88P47K36m05k30
$$ plain form
55252 3721 4374 5669 6909 7786 8261 8032 6880 5429 4872 5682 7004 7606 7131 6150 5262 4528 3863 3520
55234 3520 3932 5102 6495 7647 8699 10090 11802 13215 13778 13557 12990 12325 11596 11026 11032 11630 12098 11577
55216 11577 10077 8593 8076 8446 8878 8957 9140 9974 11231 12088 11945 10816 9117 7425 6307 6005 6286
55199 6286 6879 7882 9365 10706 11005 10204 9195 8526 7689 6175 4660 4338 5278 6248 6228 5470 4852 4767
55181 4767 5043 5507 6071 6402 6036 4988 3941 3609 4024 4668 5201 5856 7034 8648 10036 10478 9751 8243
55163 8243 6651 5559 5157 5227 5412 5555 5787 6356 7367 8613 9607 9928 9646 9277 9179 9115 8687 7993 7513
55144 7513 7423 7479 7679 8501 10189 12162 13511 13918 13792 13675 13821 14215 14679 15000 15184 15470 15945 16277 16088
55125 16088 15412 14541 13594 12601 11801 11455 11447 11515 11761 12441 13235 13357 12583 11637 11302 11588 12030 12393 12645 12672
$$ packed form
55252C721O53J295J240Q77M75k29j152j451n57Q10J322O02m75r81q88p34o65l43
55234C520M12J170J393J152J052J391J712J413N63k21n67o65p29n70ON98M68n21
55216A1577j500j484n17L70M32P9J83Q34J257Q57j43j129j699j692j118l02K81
55199F286N93J003J483J341K99q01j009o69q37j514j515l22R40R70k0p58o18q5
55181D767K76M64N64L31l66j048j047l32M15O44N33O55J178J614J388M42p27j508
55163H243j592j092m02P0J85J43K32N69J011J246R94L21k82l69r8o4m28o94m80
55144G513r0N6K00Q22J688J973J349M07j26j17J46L94M64L21J84K86M75L32j89
55125A6088o76q71r47r93q00l46qO8K46O80P94J22p74r46l35K86M42L63K52K7
$$ plain form
55105 12672 12488 12460 12821 13127 12771 11970 11646 12244 13209 13863 14326 15133 16272 17051 16904 15961 14764 13694
55087 13694 12819 12113 11656 11612 12083 12962 13953 14769 15368 15911 16496 16993 17195 17015 16486 15732 15068 14956 15539
55068 15539 16337 16707 16687 16976 17880 18669 18402 17202 16215 16234 16829 17035 16640 16452 17349 19326 21485 22880
55050 22880 23274 23120 22898 22699 22517 22671 23560 25015 26245 26647 26435 26267 26422 26573 26341 25842 25586 25928
55032 25928 26650 27107 26783 25762 24676 24222 24747 26157 28041 29836 31094 31714 31910 31938 31977 32191 32715 33404
55014 33404 33809 33554 32727 31763 31043 30701 30722 31013 31368 31528 31356 30905 30281 29525 28661 27808 27202 27124 27832 29489
54994 29489 31957 34587 36353 36534 35360 33812 32700 32094 31745 31697 32182 33098 34008 34628 34974 35095 34973
54977 34973 34643 34032 32779 30749 28747 28056 29014 30552 31482 31710 31798 31894 31766 31548 31747 32585 33863 35328
$$ packed form
55105A2672j84k8L61L06l56q01l24N98R65O54M63Q07J139P79j47r43j197j070
55087A3694q75p06m57m4M71Q79R91Q16N99N43N85M97K02j80n29p54o64j12N83
55068A5539P98L70k0K89R04P89k67j200r87J9N95K06l95j88Q97J977K159J395
55050B2880L94j54k22j99j82J54Q89J455J230M02k12j68J55J51k32m99k56L42
55032B5928P22M57l24j021j086m54N25J410J884J795J258O20J96K8L9K14N24O89
55014C3404M05k55q27r64p20l42K1K91L55J60j72m51o24p56q64q53o06p8P08J657
54994B9489K468K630J766J81j174j548j112o06l49m8M85R16R10O20L46J21j22
54977C4973l30o11j253k030k002o91R58J538R30K28Q8R6j28k18J99Q38J278J465
$$ plain form
54959 35328 36617 37020 36077 34441 33455 33661 34333 34700 34989 35791 36990 37943 38408 38643 38710 38318 37439 36570
54941 36570 36158 36156 36373 36940 38043 39394 40408 41012 41800 43116 44260 44120 42545 40632 39537 39444 39981
54924 39981 41081 42801 44499 44997 43780 41601 39646 38539 38362 39155 40808 42665 43880 44320 44695 45570
54908 45570 46515 46600 45588 44312 43735 43966 44413 44729 45189 46124 47297 48135 48432 48640 49514 51480 54212 56722
54890 56722 58106 58409 58642 59768 61847 64304 66734 69110 71483 73956 76902 80712 85297 90240 95368
54875 95368 100752 106122 110848 114725 118219 121587 124182 125074 124159 122207 119874 117022 113065 107785 101741
54860 101741 95924 91017 86963 83300 79782 76531 73690 71254 69233 67612 66124 64464 62838 61893
54846 61893 61904 62442 63105 64089 65667 67455 68805 69760 71073 73317 76338 79658 83114 87077 92195 98865
$$ packed form
54959C5328J289M03r43j636r86K06O72L67K89Q02J199R53M65K35O7l92q79q69
54941C6570m12kK17N67J103J351J014O04P88J316J144j40j575j913j095r3N37
54924C9981J100J720J698M98j217k179j955j107j77P93J653J857J215M40L75Q75
54908D5570R45Q5j012j276n77K31M47L16M60R35J173Q38K97K08Q74J966K732K510
54890E6722J384L03K33J126K079K457K430K376K373K473K946L810M585M943N128
54875I5368N384N370M726L877L494L368K595Q92r15j952k333k852l957n280o044
54860A01741n817m907m054l663l518l251k841k436k021j621j488j660j626r45
54846F1893J1N38O63R84J578J788J350R55J313K244L021L320L456L963N118O670
$$ plain form
54830 98865 106698 114563 121330 126467 129799 131051 130060 127257 123422 118895 113467 107072 100233 93637 87614
54815 87614 82197 77474 73678 70940 68988 67032 64174 60190 55851 52199 49571 47593 45943 44669
54801 44669 43731 42800 41735 40860 40469 40410 40451 40770 41700 43149 44617 45688 46156 45819 44643 43157 42270 42355
54783 42355 42811 42801 42241 41760 41753 41880 41590 40832 40021 39503 39262 38987 38207 36544 34202 32144 31348 31804 32592
54764 32592 33054 33496 34515 36032 37343 37929 37852 37473 37132 37049 37280 37745 38437 39507 40957 42487 43831
54747 43831 45061 46245 47045 47078 46577 46256 46531 47263 48235 49434 50811 52195 53585 55163 56921 58663
54731 58663 60518 62996 66268 69772 72851 75551 78493 82234 87053 93113 100365 108356 116473 124388
54717 124388 131984 138912 144568 148550 150848 151506 150398 147509 143279 138442 133585 128947 124541 120295
$$ packed form
54830I8865P833P865O767N137L332J252r91k803l835m527n428o395o839o596o023
54815H7614n417m723l796k738j952j956k858l984m339l652k628j978j650j274
54801D4669r38r31j065q75l91n9M1L19R30J449J468J071M68l37j176j486q87Q5
54783D2355M56j0n60m81pJ27k90p58q11n18k41k75p80j663k342k058p96M56P88
54764C2592M62M42J019J517J311N86p7l79l41q3K31M65O92J070J450J530J344
54747D3831J230J184Q00L3n01l21K75P32R72J199J377J384J390J578J758J742
54731E8663J855K478L272L504L079K700K942L741M819O060P252P991Q117P915
54717A24388P596O928N656L982K298O58j108k889m230m837m857m638m406m246
$$ plain form
54703 120295 116078 111868 108004 105080 103392 102550 101881 101246 101197 102237 104117 106070 107572 108674 109702
54688 109702 110921 112533 114831 118258 123290 130069 137999 145806 152290 157083 160710 164089 168134 173480
54674 173480 179984 186304 190392 190811 187669 182216 175654 168376 160230 151292 142219 133744 125969 118491
54660 118491 111286 105020 100196 96343 92550 88612 85077 82231 79658 76950 74344 72376 71278 70938
54646 70938 71096 71305 70954 69651 67540 65145 62991 61377 60296 59537 59106 59493 61109 63438 65238 65778
54630 65778 65483 65163 65059 64957 64763 64476 63911 62967 62078 61924 62729 64089 65386 66110 65968 65097 64174 63910
54612 63910 64427 65349 66468 67918 69638 71078 71739 71868 72316 73648 75557 77281 78500 79594 80944 82358
54596 82358 83446 84337 85505 86983 88287 89223 90250 91784 93649 95505 97439 99651 101908 103806 105438
$$ packed form
54703A20295m217m210l864k924j688q42o69o35m9J040J880J953J502J102J028
54688A09702J219J612K298L427N032O779P930P807O484M793L627L379M045N346
54674A73480O504O320M088M19l142n453o562p278q146q938r073q475p775p478
54660A18491p205o266m824l853l793l938l535k846k573k708k606j968j098l40
54646G0938J58K09l51j303k111k395k154j614j081p59m31L87J616K329J800N40
54630F5778k95l20j04j02j94k87n65r44q89j54Q05J360J297P24j42q71r23k64
54612F3910N17R22J119J450J720J440O61J29M48J332J909J724J219J094J350J414
54596H2358J088Q91J168J478J304R36J027J534J865J856J934K212K257J898J632
$$ plain form
54581 105438 107375 110084 113698 118228 123558 129293 134992 140648 146735 153689 161383 169032 175504 179955
54567 179955 182298 182987 182294 180067 176313 171558 166376 160907 155144 149282 143366 137055 130312 123999 119093
54552 119093 115504 112356 109280 106654 104577 102488 100059 97765 96158 95107 94125 93004 91699 89958
54538 89958 87577 84849 82329 80248 78459 76870 75540 74286 72599 70217 67679 65941 65304 64969 63927
54523 63927 62155 60478 59272 57964 56126 54416 53769 53972 53870 52906 51709 51002 50584 49728 48133 46155
54507 46155 44398 43394 43401 44219 45266 45983 46200 46131 46178 46630 47376 47966 48194 48431 49086 49929 50436 50645 51054
54488 51054 51689 51964 51611 51124 51001 51122 51266 51709 52822 54384 55785 56771 57642 58848 60610 62824 65155
54471 65155 67347 69474 71651 73544 74681 75365 76744 79665 83853 88489 93002 96930 99580 100564 100411
$$ packed form
54581A05438J937K709L614M530N330N735N699N656O087O954P694P649O472M451
54567A79955K343O89o93k227l754m755n182n469n763n862n916o311o743o313m906
54552A19093l589l148l076k626k077k089k429k294j607j051r82j121j305j741
54538H9958k381k728k520k081j789j589j330j254j687k382k538j738o37l35j042
54523F3927j772j677j206j308j838j710o47K03j02r64j197p07m18q56j595j978
54507D6155j757j004PQ18J047P17K17o9M7M52P46N90K28K37O55Q43N07K09M09
54488E1054O35K75l53m87j23J21J44M43J113J562J401R86Q71J206J762K214K331
54471F5155K192K127K177J893J137O84J379K921M188M636M513L928K650R84j53
$$ plain form
54456 100411 99979 99389 98110 95911 93165 90223 87117 83967 81133 78758 76518 74041 71326 68597 65997
54441 65997 63596 61547 60034 59055 58288 57281 55892 54548 53869 53947 54250 54354 54462 54952 55690 56173 56208 56049
54423 56049 55962 55962 55970 55966 55985 56192 56900 58234 59898 61428 62618 63429 63724 63485 63170 63433 64422 65687 66742 67413
54403 67413 67680 67619 67556 67883 68512 68826 68401 67558 67037 67268 68106 69095 69853 70259 70388 70308 70005 69610 69507 69944
54383 69944 70558 70585 69649 68129 66645 65384 64076 62503 60853 59572 58908 58641 58353 57943 57698 57765 57770 57252
54365 57252 56335 55612 55431 55621 55931 56380 57047 57812 58482 58971 59205 59018 58372 57624 57433 58333 60324 62812
54347 62812 65033 66734 68370 70519 73156 75692 77622 78844 79408 79368 78978 78789 79314 80623 82298 83678
54331 83678 84296 84324 84509 85435 86841 87991 88586 88942 89235 89091 88098 86342 84226 82096 80239 78815 77537
$$ packed form
54456A00411m32n90j279k199k746k942l106l150k834k375k240k477k715k729k600
54441F5997k401k049j513r79p67j007j389j344o79P8L03J04J08M90P38M83L5j59
54423E6049q7%QmJ9K07P08J334J664J530J190Q11K95k39l15K63R89J265J055O71
54403F7413K67o1o3L27O29L14m25q43n21K31Q38R89P58M06J29q0l03l95j03M37
54383F9944O14K7r36j520j484j261j308j573j650j281o64k67k88m10k45O7Nn18
54365E7252r17p23j81J90L10M49O67P65O70M89K34j87o46p48j91R00J991K488
54347F2812K221J701J636K149K637K536J930J222N64m0l90j89N25J309J675J380
54331H3678O18K8J85R26J406J150N95L56K93j44r93j756k116k130j857j424j278
$$ plain form
54314 77537 75802 73460 71154 69531 68400 67132 65615 64300 63446 62853 62301 61774 61254 60684 60219 60021
54298 60021 59810 59051 57741 56579 56139 56313 56776 57561 58752 59979 60723 60959 61058 61188 61325 61736 62854 64562
54280 64562 66194 67442 68705 70201 71336 71561 71414 71941 73207 74164 74113 73488 72861 71938 70157 67791 65711
54263 65711 64224 62827 61122 59383 58070 57271 56825 56574 56293 55681 54745 53933 53612 53513 52980 51749 50301
54246 50301 49463 49684 50634 51388 51102 49666 47722 46039 44980 44547 44729 45493 46482 46966 46335 44671 42760
54229 42760 41397 40706 40230 39699 39480 40098 41458 42868 43782 44230 44485 44568 44280 43518 42474 41602 41419 42072
54211 42072 43054 43558 43312 42865 42889 43361 43653 43367 42887 43056 44366 46385 48022 48540 48379 48698 50023 51655
54193 51655 52602 52752 52769 53064 53354 53173 52393 51194 49853 48665 47779 47050 46304 45757 45874 46719 47780 48548
$$ packed form
54314G7537j735k342k306j623j131j268j517j315q54n93n52n27n20n70m65j98
54298F0021k11p59j310j162m40J74M63P85J191J227P44K36R9J30J37M11J118J708
54280F4562J632J248J263J496J135K25j47N27J266R57n1o25o27r23j781k366k080
54263F5711j487j397j705j739j313p99m46k51k81o12r36q12l21r9n33j231j448
54246E0301q38K21R50P54k86j436j944j683j059m33J82P64R89M84o31j664j911
54229D2760j363o91m76n31k19O18J360J410R14M48K55Q3k88p62j044q72j83O53
54211D2072R82N04k46m47K4M72K92k86m80J69J310K019J637N18j61L19J325J632
54193E1655R47J50J7K95K90j81p80j199j341j188q86p29p46n47J17Q45J061P68
$$ plain form
54175 48548 48963 49167 49236 49435 50359 52303 54601 56073 56172 55390 54541 53927 53308 52381 51184 50195 50113 51325
54157 51325 53469 55634 57051 57532 57359 57083 57381 58621 60291 61240 60830 59601 58546 58056 57964 58257 59061
54140 59061 60044 60531 60371 60131 60280 60632 60731 60282 59045 56912 54446 52734 52221 52085 51333 50086 49177 48845
54122 48845 48581 48172 48132 48942 50418 51884 52596 52046 50446 48882 48395 48776 48873 48181 47437 47382 47723 47867 48054
54103 48054 48988 50652 52198 52960 53028 52834 52595 52236 51518 50197 48300 46285 44697 43701 43063 42502 41862
54086 41862 41044 40040 39021 38245 37879 37959 38383 38799 38767 38232 37628 37272 36900 36169 35441 35537 36710 38229 39063
54067 39063 38729 37477 36011 35096 35135 35902 36805 37426 37704 37697 37490 37328 37533 38167 39022 39953 40937 41721 41776 40805
54047 40805 39110 37288 35764 34773 34494 34882 35502 35856 35929 36203 37139 38738 40615 42319 43596 44409 44780
$$ packed form
54175D8548M15K04O9J99R24J944K298J472R9p82q49o14o19r27j197r89q2J212
54157E1325K144K165J417M81j73k76K98J240J670R49m10j229j055m90r2K93Q04
54140E9061R83M87j60k40J49L52R9m49j237k133k466j712n13j36p52j247r09l32
54122D8845k64m09m0Q10J476J466P12n50j600j564m87L81R7o92p44n5L41J44J87
54103D8054R34J664J546P62O8j94k39l59p18j321j897k015j588r96o38n61o40
54086D1862q18j004j019p76l66Q0M24M16l2n35o04l56l72p31p28R6J173J519Q34
54067C9063l34j252j466r15L9P67R03O21K78pk07j62K05O34Q55R31R84P84N5r71
54047D0805j695j822j524r91k79L88O20L54P3K74R36J599J877J704J277Q13L71
$$ plain form
54030 44780 44649 44021 43278 43103 43870 45161 46179 46598 46748 46947 46996 46574 45846 45349 45342 45619 45935 46246 46423
54011 46423 46174 45534 45146 45674 47080 48801 50500 52179 53635 54364 54189 53583 53143 53072 53349 54044 55178
53994 55178 56562 58111 60022 62309 64449 65926 66897 67884 68996 70026 71169 72970 75442 77873 79799
53979 79799 81659 84117 87109 90019 92480 94562 96334 97824 99449 101977 105762 110214 114322 117622
53965 117622 120434 123233 126022 128510 130691 132919 135353 137541 138769 138819 138271 138062 138748 140127 141507
53950 141507 142383 142897 143542 144439 145109 145029 144169 142789 140964 138599 135789 132808 129814 126895 124339 122486
53934 122486 121242 120051 118500 116704 115068 113889 113272 113109 112976 112282 110767 108803 107103 106179 106053 106266
53918 106266 106122 105109 103258 101026 98927 97379 96703 96861 97204 97002 96356 96116 96691 97441 97597 97311 97247
$$ packed form
54030D4780j31o28p43j75P67J291J018M19J50J99M9m22p28m97pK77L16L11J77
54011D6423k49o40l88N28J406J721J699J679J456P29j75o06m40p1K77O95J134
53994E5178J384J549J911K287K140J477R71R87J112J030J143J801K472K431J926
53979G9799J860K458K992K910K461K082J772J490J625K528L785M452M108L300
53965A17622K812K799K789K488K181K228K434K188J228N0n48k09O86J379J380
53950A41507Q76N14O45Q97O70q0q60j380j825k365k810k981k994k919k556j853
53934A22486j244j191j551j796j636j179o17j63j33o94j515j964j700r24j26K13
53918A06266j44j013j851k232k099j548o76J58L43k02o46k40N75P50J56k86o4
$$ plain form
53901 97247 97465 97365 96629 95525 94283 92780 91137 90053 90120 91059 92086 92852 93624 94611 95599 96414 97348
53884 97348 98809 100752 102814 104910 107312 110151 113273 116722 120853 125567 129859 132759 134550 136381
53870 136381 138691 140773 142124 143424 145560 148172 149940 150245 149876 150052 151164 152658 153749 154112 154156 154849
53854 154849 157109 161093 166027 170792 174762 178153 181634 185598 189856 194012 197991 201925 205608 208452
53840 208452 210124 210863 210942 210241 208705 206943 205798 205364 204848 203435 200931 197636 193950 190238 186673 183073
53824 183073 179123 174841 170582 166550 162598 158601 154707 151083 147699 144491 141483 138571 135483 132177
53810 132177 129027 126331 123838 121094 118168 115696 114113 113067 111748 109704 107217 104854 102793 100764
53796 100764 98623 96686 95301 94362 93548 92831 92256 91380 89559 86917 84424 82745 81571 80417 79478 79140
$$ packed form
53901I7247K18j00p36j104j242j503j643j084O7R39J027P66P72R87R88Q15R34
53884I7348J461J943K062K096K402K839L122L449M131M714M292K900J791J831
53870A36381K310K082J351J300K136K612J768L05l69J76J112J494J091L63M4O93
53854A54849K260L984M934M765L970L391L481L964M258M156L979L934L683K844
53840B08452J672P39P9p01j536j762j145m34n16j413k504l295l686l712l565l600
53824A83073l950m282m259m032l952l997l894l624l384l208l008k912l088l306
53810A32177l150k696k493k744k926k472j583j046j319k044k487k363k061k029
53796A00764k141j937j385r39q14p17n75q76j821k642k493j679j174j154r39l38
$$ plain form
53780 79140 79106 78747 78068 77586 77402 77180 77029 77542 78701 79502 79126 77928 76773 75888 74903 73707 72638 71983
53762 71983 71811 72186 73044 73881 74107 73799 73690 74321 75531 76886 78249 79764 81602 83850 86391 88775
53746 88775 90529 91740 93030 94846 97128 99830 103193 107131 110827 113611 115983 119073 123162 127392
53732 127392 130983 134056 137086 140191 143304 146488 149638 152223 153781 154459 154709 154791 154934 155658 157351 159654
53716 159654 161816 163523 164859 165550 164957 163053 160769 159013 157793 156619 155315 153892 151971 148989 145073
53701 145073 141210 138374 136669 135466 134134 132448 130451 128114 125238 121700 117788 114175 111435 109580
53687 109580 108156 106743 105262 103857 102686 101831 101258 100780 100209 99605 99188 98923 98362 97088 95282 93668
53671 93668 92946 93353 94603 96013 96766 96438 95390 94458 94133 94296 94783 95818 97593 99713 101500 102708
$$ packed form
53780G9140l4l59o79m82j84k22j51N13J159Q01l76j198j155q85r85j196j069o55
53762G1983j72L75Q58Q37K26l08j09O31J210J355J363J515J838K248K541K384
53746H8775J754J211J290J816K282K702L363L938L696K784K372L090M089M230
53732A27392L591L073L030L105L113L184L150K585J558O78K50Q2J43P24J693K303
53716A59654K162J707J336O91n93j904k284j756j220j174j304j423j921k982l916
53701A45073l863k836j705j203j332j686j997k337k876l538l912l613k740j855
53687A09580j424j413j481j405j171q55n73m78n71o04m17k65n61j274j806j614
53671I3668p22M07J250J410P53l28j048r32l25J63M87J035J775K120J787J208
$$ plain form
53655 102708 103576 104302 104939 105778 107231 109216 111108 112517 113667 114841 115961 117045 118530 120615 122682
53640 122682 123994 124744 125777 127368 128898 129678 129608 129087 128839 129722 131941 134418 135702 135735 135996 137582 139946
53623 139946 142006 143670 145442 147082 147722 147219 146504 146425 146841 147040 146563 145454 144080 142912 142255 142133 142529
53606 142529 143578 145190 146677 147309 147214 147204 147620 147936 147709 147379 147706 148756 149837 150231 149659 148232 146358
53589 146358 144690 143845 144016 144918 146062 147040 147713 148188 148562 148644 148136 147181 146432 146352 146631 146596 146132 145897 146576
53570 146576 148206 150315 152560 154967 157537 159821 161215 161734 162247 163628 165800 167960 169726 171616 174239
53555 174239 177389 180270 182361 183772 184936 186285 188167 190719 193734 196796 199627 202273 205026 208195
53541 208195 211867 215789 219625 223307 226966 230508 233608 236200 238586 240918 243034 245118 247930 251772
$$ packed form
53655A02708Q68P26O37Q39J453J985J892J409J150J174J120J084J485K085K067
53640A22682J312P50J033J591J530P80p0n21k48Q83K219K477J284L3K61J586K364
53623A39946K060J664J772J640O40n03p15p9M16J99m77j109j374j168o57j22L96
53606A42529J049J612J487O32r5j0M16L16k27l30L27J050J081L94n72j427j874
53589A46358j668q45J71R02J144R78O73M75L74Q2n08r55p49q0K79l5m64k35O79
53570A46576J630K109K245K407K570K284J394N19N13J381K172K160J766J890K623
53555A74239L150K881K091J411J164J349J882K552L015L062K831K646K753L169
53541B08195L672L922L836L682L659L542L100K592K386K332K116K084K812L842
$$ plain form
53527 251772 255629 258083 258905 259002 258968 258640 258230 258835 261180 264470 267179 268695 269623 270709 272022 273186
53511 273186 273917 274209 274250 274232 274178 273994 273725 273608 273781 274127 274552 275198 276200 277449 278770 280095 281245 281834
53493 281834 281747 281526 281934 283189 284891 286543 287898 288944 289920 291235 293058 295061 296888 298702 300890
53478 300890 303324 305471 307302 309596 313120 317805 322905 327656 331671 335052 338407 342549 347928 354405
53464 354405 361639 369452 377705 386093 394353 402567 411082 420206 430091 440806 452357 464670 477629
53451 477629 491119 505044 519386 534218 549509 565012 580585 596561 613433 631184 649274
53440 649274 667414 685960 705356 725584 746422 767821 789652 811465 832930 854294 875874
53429 875874 897344 918173 938667 959862 982153 1004600 1025891 1045595 1064212 1082427 1100749
$$ packed form
53527B51772L857K454Q22R7l4l28m10O05K345L290K709J516R28J086J313J164
53511B73186P31K92M1j8n4j84k69j17J73L46M25O46J002J249J321J325J150N89
53493B81834q7k21M08J255J702J652J355J046R76J315J823K003J827J814K188
53478C00890K434K147J831K294L524M685N100M751M015L381L355M142N379O477
53464C54405P234P813Q253Q388Q260Q214Q515R124R885J0715J1551J2313J2959
53451D77629J3490J3925J4342J4832J5291J5503J5573J5976J6872J7751J8090
53440F49274J8140J8546J9396K0228K0838K1399K1831K1813K1465K1364K1580
53429H75874K1470K0829K0494K1195K2291K2447K1291J9704J8617J8215J8322
$$ plain form
53418 1100749 1119606 1139218 1159280 1179087 1198080 1216157 1233489 1250177 1266076 1280870 1294314
53407 1294314 1306500 1317747 1328123 1337216 1344617 1350515 1355496 1359737 1362690 1363670 1362460 1359214 1354047
53394 1354047 1347062 1338636 1329302 1319307 1308533 1296888 1284600 1272028 1259304 1246221 1232366 1217339
53382 1217339 1201006 1183598 1165483 1146929 1128198 1109739 1091911 1074537 1057261 1040470 1025279
53371 1025279 1012219 1000405 988607 976802 965962 956572 948227 940761 934824 930908 928480 926680 925452
53358 925452 925380 926678 928923 931715 935113 939413 944861 951658 959999 970051 981934 995620 1010726 1026626
53344 1026626 1043002 1060178 1078706 1098811 1120426 1143516 1168010 1193594 1220005 1247457 1276397
53333 1276397 1306892 1338630 1371512 1405869 1442059 1480114 1519747 1560425 1601519 1642773 1684608
$$ packed form
53418A100749J8857J9612K0062J9807J8993J8077J7332J6688J5899J4794J3444
53407A294314J2186J1247J0376R093P401N898M981M241K953R80j210l246n167
53394A354047o985q426r334r995j0774j1645j2288j2572j2724j3083j3855j5027
53382A217339j6333j7408j8115j8554j8731j8459j7828j7374j7276j6791j5191
53371A025279j3060j1814j1798j1805j0840r390q345p466n937l916k428j800j228
53358I25452p2J298K245K792L398M300N448O797Q341J0052J1883J3686J5106J5900
53344A026626J6376J7176J8528K0105K1615K3090K4494K5584K6411K7452K8940
53333A276397L0495L1738L2882L4357L6190L8055L9633M0678M1094M1254M1835
$$ plain form
53322 1684608 1727549 1771380 1815253 1858654 1901733 1944555 1986612 2027366 2066829 2105201 2142195
53311 2142195 2177066 2209168 2238234 2264307 2287602 2308263 2326101 2340784 2352452 2361761 2368983 2373364
53299 2373364 2373783 2369883 2362163 2351111 2336796 2319289 2298984 2276285 2251248 2223736 2193710 2161241
53287 2161241 2126401 2089347 2050511 2010616 1970517 1930981 1892456 1854930 1817989 1781132 1744170
53276 1744170 1707423 1671503 1636762 1602945 1569493 1536130 1503024 1470468 1438782 1408532 1380387
53265 1380387 1354486 1330266 1307237 1285590 1265638 1246967 1228768 1210917 1194130 1178960 1165134
53254 1165134 1152040 1139322 1126803 1114316 1102097 1090966 1081647 1074010 1067344 1061232 1055795 1051212
53242 1051212 1047490 1044687 1042957 1042219 1042180 1042835 1044642 1048001 1052806 1058674 1065351 1072707 1080637 1089367 1099642
$$ packed form
53322A684608M2941M3831M3873M3401M3079M2822M2057M0754L9463L8372L6994
53311B142195L4871L2102K9066K6073K3295K0661J7838J4683J1668R309P222M381
53299B373364M19l900p720j1052j4315j7507k0305k2699k5037k7512l0026l2469
53287B161241l4840l7054l8836l9895m0099l9536l8525l7526l6941l6857l6962
53276A744170l6747l5920l4741l3817l3452l3363l3106l2556l1686l0250k8145
53265A380387k5901k4220k3029k1647j9952j8671j8199j7851j6787j5170j3826
53254A165134j3094j2718j2519j2487j2219j1131r319p637o666o112n437m583
53242A051212l722k803j730p38l9O55J807L359M805N868O677P356P930Q730J0275
$$ plain form
53227 1099642 1112107 1126512 1141895 1157581 1173557 1189874 1206241 1222548 1239275 1256841 1274820
53216 1274820 1292327 1309054 1325352 1341296 1356212 1369279 1380180 1388960 1395704 1400709 1404632 1408009
53204 1408009 1410681 1411947 1411170 1408052 1402524 1394830 1385703 1376041 1366199 1355770 1344176 1331337 1317590
53191 1317590 1303064 1287348 1269867 1250562 1229990 1208733 1186879 1164339 1141504 1119160 1097657
53180 1097657 1076640 1055831 1035648 1016569 998212 979701 960904 942654 925625 909509 893623
53169 893623 877848 862569 847977 833873 820042 806464 793179 780266 767970 756634 746497
53158 746497 737630 729906 722780 715310 706869 697816 689040 680804 672467 663463 653998 644408 634388 623484
53144 623484 612044 600955 590492 580109 569492 559137 549586 540720 532205 524113 516534 508944 500644
$$ packed form
53227A099642J2465J4405J5383J5686J5976J6317J6367J6307J6727J7566J7979
53216A274820J7507J6727J6298J5944J4916J3067J0901Q780O744N005L923L377
53204A408009K672J266p77l118n528p694r127r662r842j0429j1594j2839j3747
53191A317590j4526j5716j7481j9305k0572k1257k1854k2540k2835k2344k1503
53180A097657k1017k0809k0183j9079j8357j8511j8797j8250j7029j6116j5886
53169H93623j5775j5279j4592j4104j3831j3578j3285j2913j2296j1336j0137
53158G46497q867p724p126p470q441r053q776q236q337r004r465r590j0020j0904
53144F23484j1440j1089j0463j0383j0617j0355r551q866q515q092p579p590q300
$$ plain form
53131 500644 491635 482471 473325 463823 453808 443674 433806 424203 414807 405673 396605 387069 376839
53118 376839 366395 356412 347134 338476 330476 323293 316917 311058 305227 298960 292293 286059 281217 277661
53104 277661 274198 270002 265498 261425 257607 253367 248748 244448 240718 237102 233288 229463 225721 221796
53090 221796 217633 213718 210558 208177 206265 204442 202303 199646 196829 194486 192696 190814 188279 185248
53076 185248 182263 179733 177891 176782 175955 174623 172550 170524 169559 169820 170600 171120 170973 170043 168483 166789
53060 166789 165537 164918 164659 164317 163594 162463 161193 160085 159103 157903 156325 154623 153042 151464 149704
53045 149704 147858 146063 144177 142092 140168 138908 138245 137562 136408 134911 133540 132706 132553 132827 133010 132867
53029 132867 132725 132875 132875 131994 130348 129029 128937 129936 131385 132994 134736 136312 137252 137505 137552 137871 138502 139104
$$ packed form
53131E00644r009r164r146r502j0015j0134r868r603r396r134r068r536j0230
53118C76839j0444r983r278q658q000p183o376n859n831o267o667o234m842l556
53104B77661l463m196m504m073l818m240m619m300l730l616l814l825l742l925
53090B21796m163l915l160k381j912j823k139k657k817k343j790j882k535l031
53076A85248k985k530j842j109q27j332k073k026r65K61P80N20j47r30j560j694
53060A66789j252o19k59l42p23j131j270j108r82j200j578j702j581j578j760
53045A49704j846j795j886k085j924j260o63o83j154j497j371q34j53K74J83j43
53029A32867j42J50%q81j646j319r2R99J449J609J742J576R40K53M7L19O31O02
$$ plain form
53011 139104 139266 138834 138101 137627 137708 138050 138125 137734 137050 136190 134999 133284 131059 128538 126117 124310 123423
52994 123423 123162 122788 121856 120673 119852 119614 119701 119769 119527 118589 116694 114213 112090 111006 110720 110450 109712 108587
52976 108587 107351 106183 105230 104608 104221 103767 103070 102293 101741 101532 101527 101463 101089 100251 98981 97556 96410 95895
52958 95895 96027 96439 96643 96320 95334 93616 91375 89432 88802 89601 90673 90756 89870 89063 88943 89052 88736 87944
52940 87944 86901 85611 84171 83230 83538 85065 86925 88179 88498 88134 87541 87079 86914 87033 87356 87787 88280
52923 88280 88936 89907 90997 91547 91123 90292 90147 90944 91775 91843 91552 91871 93034 94390 95300 95655 95646 95521 95569
52904 95569 95959 96581 97259 98081 99269 100847 102608 104230 105266 105346 104706 104226 104532 105359 106191 107124 108478
52887 108478 109843 110384 110081 109875 110444 111486 112441 113334 114510 115970 117340 118328 119029 119893 121375 123386
$$ packed form
53011A39104J62m32p33m74Q1L42P5l91o84q60j191j715k225k521k421j807q87
52994A23423k61l74r32j183q21k38Q7O8k42r38j895k481k123j084k86k70p38j125
52976A08587j236j168r53o22l87m54o97p77n52k09no4l74q38j270j425j146n15
52958I5895J32M12K04l23r86j718k241j943o30P99J072Q3q86q07j20J09l16p92
52940H7944j043j290j440r41L08J527J860J254L19l64n93m62j65J19L23M31M93
52923H8280O56R71J090N50m24q31j45P97Q31O8k91L19J163J356R10L55rj25M8
52904I5569L90O22O78Q22J188J578J761J622J036Q0o40m80L06Q27Q32R33J354
52887A08478J365N41l03k06N69J042R55Q93J176J460J370R88P01Q64J482K011
$$ plain form
52871 123386 125204 126353 127372 129177 131687 133839 135098 136136 137710 139564 141027 142129 143461 145141
52857 145141 146510 146826 145952 144475 143360 143271 144041 144980 145747 146550 147343 147507 146741 145768 145532 146018 146407 146160
52839 146160 145382 144359 143394 142984 143463 144400 144888 144604 144120 144015 144087 143681 142570 141287 140698 141269 142636 143870
52821 143870 144286 143987 143530 143208 142903 142513 142210 142246 142744 143613 144507 144972 144882 144687 144958 145745 146617 147255 147688
52802 147688 147968 147943 147476 146669 145854 145443 145693 146348 146617 145849 144269 142795 142165 142437 143242 144136 144718 144793 144657
52783 144657 145001 146376 148752 151537 153818 154770 154234 152938 151876 151398 151140 150780 150509 150712 151499 152620
52767 152620 153526 153517 152250 150242 148508 147563 147095 146662 146222 145772 144915 143224 140779 138084 135632 133805 132899
52750 132899 132876 133307 133828 134546 135705 137168 138458 139111 138713 136960 134114 131241 129450 128885 128827 128694 128459
$$ packed form
52871A23386J818J149J019J805K510K152J259J038J574J854J463J102J332J680
52857A45141J369L16q74j477j115q9P70R39P67Q03P93J64p66r73k36M86L89k47
52839A46160p78j023r65m10M79R37M88k84m84j05P2m06j111j283n89N71J367J234
52821A43870M16k99m57l22l05l90l03L6M98Q69Q94M65r0j95K71P87Q72O38M33
52802A47688K80k5m67q07q15m11K50O55K69p68j580j474o30K72Q05Q94N82P5j36
52783A44657L44J375K376K785K281R52n36j296j062m78k58l60k71K03P87J121
52767A52620R06rj267k008j734r45m68m33m40m50q57j691k445k695k452j827r06
52750A32899k3M31N21P18J159J463J290O53l98j753k846k873j791n65n8j33k35
$$ plain form
52733 128459 128120 127405 126234 125051 124317 123905 123340 122468 121606 121078 120784 120240 118951 116820 114263 111857 109821
52716 109821 108012 106415 105334 104855 104367 103041 100754 98184 95942 94011 92197 90720 89965 89822 89734 89361
52700 89361 88841 88367 87923 87533 87315 87057 86141 84321 82296 81014 80516 79928 78603 76791 75068 73648 72456
52683 72456 71460 70548 69355 67653 65798 64489 64098 64456 65138 65664 65521 64450 62833 61544 61199 61678 62443
52666 62443 63095 63540 63788 63862 63780 63469 62732 61533 60273 59529 59420 59435 59073 58476 58132 58094 57857 57089 56124 55540
52646 55540 55526 55935 56700 57790 58873 59469 59486 59246 58938 58412 57619 56885 56486 56191 55521 54310 52844 51558
52628 51558 50816 50804 51440 52408 53437 54436 55299 55826 55999 56145 56547 57060 57409 57699 58262 59068 59716 60113 60742
52609 60742 61980 63383 63998 63432 62375 61978 62765 64235 65502 66172 66526 67005 67772 68770 69846 70684 70912
$$ packed form
52733A28459l39p15j171j183p34m12n65q72q62n28k94n44j289k131k557k406k036
52716A09821j809j597j081m79m88j326k287k570k242j931j814j477p55j43q8l73
52700H9361n20m74m44l90k18k58r16j820k025j282m98n88j325j812j723j420j192
52683G2456r96r12j193j702j855j309l91L58O82N26j43j071j617j289l45M79P65
52666F2443O52M45K48P4q2l11p37j199j260p44j09J5l62n97l44l8k37p68r65n84
52646E5540j4M09P65J090J083N96J7k40l08n26p93p34l99k95o70j211j466j286
52628E1558p42j2O36R68J029R99Q63N27J73J46M02N13L49K90N63Q06O48L97O29
52609F0742J238J403O15n66j057l97P87J470J267O70L54M79P67R98J076Q38K28
$$ plain form
52592 70912 70627 70630 71750 73893 76029 77225 77457 77380 77507 77747 77634 76892 75836 75240 75650 76807 77817 77928
52574 77928 77055 75640 74231 73284 73110 73742 74855 75973 76814 77406 77928 78512 79215 80036 80819 81166 80648 79261
52556 79261 77576 76189 75062 73726 72208 71358 71902 73411 74671 74957 74544 73999 73532 73216 73292 73860 74553
52539 74553 74982 75316 76011 77057 77928 78282 78260 77985 77265 76130 75256 75347 76236 77098 77578 78171 79301 80509
52521 80509 80989 80676 80337 80655 81649 82974 84297 85325 85957 86654 88289 91162 94383 96634 97473 97628 98042
52504 98042 99030 100319 101529 102416 102876 102975 102940 103027 103362 103927 104590 105189 105655 106118 106817 107835 108975 109902 110461
52485 110461 110850 111475 112574 113985 115308 116247 116723 116791 116703 117000 118150 119924 121447 122102 122123 122136 122399 122851
52467 122851 123549 124586 125691 126393 126579 126532 126448 126311 126268 126677 127657 128839 129692 129888 129367 128313 127131 126157
$$ packed form
52592G0912k85LJ120K143K136J196K32p7J27K40j13p42j056n96M10J157J010J11
52574G7928q73j415j409r47j74O32J113J118Q41N92N22N84P03Q21P83L47n18j387
52556G9261j685j387j127j336j518q50N44J509J260K86m13n45m67l16P6N68O93
52539G4553M29L34O95J046Q71L54k2k75p20j135q74R1Q89Q62M80N93J130J208
52521H0509M80l13l39L18R94J325J323J028O32O97J635K873L221K251Q39J55M14
52504I8042R88J289J210Q87M60R9l5Q7L35N65O63N99M66M63O99J018J140R27N59
52485A10461L89O25J099J411J323R39M76O8q8K97J150J774J523O55K1J3K63M52
52467A22851O98J037J105P02J86m7q4j37m3M09R80J182Q53J96n21j054j182r74
$$ plain form
52449 126157 125409 124798 124470 124480 124301 123247 121577 120497 120721 121481 121445 120285 118893 118193 118259 118603 118939 119461
52431 119461 120469 121842 122986 123410 123275 123175 123459 124048 124850 125900 127028 127864 128354 128824 129302 129302 128644 128049
52413 128049 128343 129353 130137 130156 129709 129309 129150 129161 129152 128820 127959 126723 125462 124367 123554 123342 124041 125504
52395 125504 127228 128891 130386 131457 131781 131510 131241 131291 131414 131358 131272 131322 131309 131012 130633 130558 130844 131275 131792
52376 131792 132543 133512 134386 134857 134860 134491 133857 133105 132505 132343 132671 133182 133421 133255 133128 133753 135388 137490 139167
52357 139167 140074 140728 141887 143635 145283 146153 146253 146059 145924 145989 146506 147766 149623 151422 152506 152581 151627
52340 151627 149904 148201 147485 147876 148358 147919 146752 145888 145926 146651 147687 148850 149837 150138 149539 148434 147518
52323 147518 147335 148041 149300 150409 150902 151106 151857 153651 156259 159049 161389 162891 163678 164372 165460 166759
$$ packed form
52449A26157p48o11l28J0j79j054j670j080K24P60l6j160j392p00O6L44L36N22
52431A19461J008J373J144M24j35j00K84N89Q02J050J128Q36M90M70M78%o58n95
52413A28049K94J010P84J9m47m00j59J1rl32q61j236j261j095q13k12O99J463
52395A25504J724J663J495J071L24k71k69N0J23n6q6N0j3k97l79p5K86M31N17
52376A31792P51R69Q74M71Ll69o34p52o00j62L28N11K39j66j27O25J635K102J677
52357A39167R07O54J159J748J648Q70J00j94j35O5N17J260J857J799J084P5r54
52340A51627j723j703p16L91M82m39j167q64L8P25J036J163R87L01n99j105r16
52323A47518j83P06J259J109M93K04P51J794K608K790K340J502P87O94J088J299
$$ plain form
52307 166759 167866 168856 169999 171023 171474 171763 172953 175280 177755 179615 181350 183715 186453 188734 190357
52292 190357 191744 193065 194141 195070 196232 197686 199145 200593 202412 204830 207609 210345 212786 214893
52278 214893 216922 219392 222559 225896 228441 229794 230524 231561 233397 235919 238760 241699 244834 248387
52264 248387 252311 256221 259839 263348 267135 271358 276004 281160 286907 293028 299171 305295 311681 318561
52250 318561 326003 334066 342799 352128 362064 372889 384777 397268 409563 421490 433790 447294
52238 447294 462034 477290 492285 506678 520607 534494 548713 563360 578322 593469 608646
52227 608646 623511 637619 650736 662966 674540 685628 696262 706310 715481 723506 730308 735957
52215 735957 740586 744428 747731 750436 752194 752927 753121 753216 752996 752095 750872 750098 749824 749267 747947 746258
$$ packed form
52307A66759J107R90J143J024M51K89J190K327K475J860J735K365K738K281J623
52292A90357J387J321J076R29J162J454J459J448J819K418K779K736K441K107
52278B14893K029K470L167L337K545J353P30J037J836K522K841K939L135L553
52264B48387L924L910L618L509L787M223M646N156N747O121O143O124O386O880
52250C18561P442Q063Q733R329R936J0825J1888J2491J2295J1927J2300J3504
52238D47294J4740J5256J4995J4393J3929J3887J4219J4647J4962J5147J5177
52227F08646J4865J4108J3117J2230J1574J1088J0634J0048R171Q025O802N649
52215G35957M629L842L303K705J758P33J94R5k20r01j223p74k74n57j320j689
$$ plain form
52199 746258 744699 743237 741887 741283 742075 744056 746480 749004 751838 755156 758955 763447 769050 775856 783448
52184 783448 791378 799539 807971 816580 825165 833587 841821 849946 858096 866273 874166 881293 887365 892450
52170 892450 896788 900578 903915 906782 908995 910214 910057 908248 904813 900182 895065 890021 885182 880440
52156 880440 875743 870957 865457 858301 849082 838501 827820 817796 808405 799523 791421 784322 777848
52143 777848 771355 764732 758422 752655 747214 742084 737815 734797 732560 730270 727712 725283 723175 721156
52129 721156 719133 717386 716085 715028 714037 713193 712557 712041 711755 712031 712870 713693 713966 713732 713254 712517 711468
52112 711468 710402 709551 708514 706685 704279 702318 701439 701075 700059 697753 694372 690380 685998 681378 676946
52097 676946 673215 670150 666999 663057 658533 654405 651432 649610 648511 647706 646714 645043 642609 639810 636922
$$ packed form
52199G46258j559j462j350o04P92J981K424K524K834L318L799M492N603O806P592
52184G83448P930Q161Q432Q609Q585Q422Q234Q125Q150Q177P893P127O072N085
52170H92450M338L790L337K867K213J219j57j809l435m631n117n044m839m742
52156H80440m697m786n500p156r219j0581j0681j0024r391q882q102p099o474
52143G77848o493o623o310n767n441n130m269l018k237k290k558k429k108k019
52129G21156k023j747j301j057r91q44o36n16k86K76Q39Q23K73k34m78p37j049
52112G11468j066q51j037j829k406j961q79l64j016k306l381l992m382m620m432
52097F76946l731l065l151l942m524m128k973j822j099q05r92j671k434k799k888
$$ plain form
52082 636922 633805 630534 627863 626490 626089 625659 624718 623595 622622 621639 620374 618777 616870 614735 612791
52067 612791 611626 611362 611553 611829 612212 612630 612652 612088 611443 611387 612029 613159 614910 617715 621709 626631 632288
52050 632288 638701 645861 653732 662576 672780 684189 695995 707651 719643 732951 747848 763658
52038 763658 779693 795987 812832 829983 846786 863010 879071 895312 911445 926971 941827
52027 941827 956258 970147 982841 993745 1002826 1010457 1016934 1022284 1026404 1029271 1030942 1031367 1030295
52014 1030295 1027608 1023769 1019687 1015789 1011454 1005687 998350 990338 982570 975262 968351 962105 956847 952359
52000 952359 948033 943645 939595 936339 933940 932365 931892 932897 935302 938557 942199 946203 950660 955456
51986 955456 960518 966144 972636 979611 986212 992126 997962 1004332 1010963 1017120 1022488 1027073 1030519 1032345
$$ packed form
52082F36922l117l271k671j373m01m30r41j123r73r83j265j597j907k135j944
52067F12791j165k64J91K76L83M18K2n64o45n6O42J130J751K805L994M922N657
52050F32288O413P160P871Q844J0204J1409J1806J1656J1992J3308J4897J5810
52038G63658J6035J6294J6845J7151J6803J6224J6061J6241J6133J5526J4856
52027I41827J4431J3889J2694J0904R081P631O477N350M120K867J671M25j072
52014A030295k687l839m082l898m335n767p337q012p768p308o911o246n258m488
52000I52359m326m388m050l256k399j575m73J005K405L255L642M004M457M796
51986I55456N062N626O492O975O601N914N836O370O631O157N368M585L446J826
$$ plain form
51972 1032345 1032846 1032958 1032961 1031958 1029050 1024477 1019056 1012940 1005578 996772 987067 977017 966565 955408
51958 955408 943632 931688 919813 907633 894385 879551 863382 846789 830645 815148 799864
51947 799864 784250 768042 751234 733962 716496 699238 682580 666697 651414 636266 620807
51936 620807 604967 589117 573758 559147 545122 531207 516914 502179 487554 473719 460714
51925 460714 447899 434815 421798 409441 397696 386015 374323 363293 353417 344197 334668 324567
51913 324567 314612 305659 297917 291067 284789 278874 272963 266624 259811 253021 246871 241631 237284 233764
51899 233764 230881 228161 225108 221638 218011 214368 210651 207004 203859 201411 199294 197005 194459 191882
51885 191882 189324 186557 183423 180053 176745 173766 171256 169222 167598 166301 165163 163932 162509 161153
$$ packed form
51972A032345N01J12Lj003k908m573n421o116p362q806r705j0050j0452j1157
51958I55408j1776j1944j1875j2180j3248j4834j6169j6593j6144j5497j5284
51947G99864j5614j6208j6808j7272j7466j7258j6658j5883j5283j5148j5459
51936F20807j5840j5850j5359j4611j4025j3915j4293j4735j4625j3835j3005
51925D60714j2815j3084j3017j2357j1745j1681j1692j1030r876r220r529j0101
51913C24567r955q953p742o850o278n915n911o339o813o790o150n240m347l520
51899B33764k883k720l053l470l627l643l717l647l145k448k117k289k546k577
51885A91882k558k767l134l370l308k979k510k034j624j297j138j231j423j356
$$ plain form
51871 161153 160125 159121 157419 154805 152006 149877 148454 147161 145707 144364 143460 143030 142911 142826 142340 141114
51855 141114 139295 137416 135866 134636 133587 132655 131768 130834 129875 129075 128652 128762 129341 129903 129724 128579 127096
51838 127096 125908 124649 122438 119352 116715 115587 115557 115414 114564 113276 111938 110702 109794 109593 110220 111289
51822 111289 112096 111946 110552 108435 106851 106805 108042 109270 109489 108855 108183 107963 108124 108471 108958 109560 110195
51805 110195 110919 111987 113536 115297 116780 117758 118409 118992 119497 119736 119675 119533 119546 119725 119863 119783 119585 119641 120240
51786 120240 121195 121924 122037 121733 121548 121795 122430 123325 124440 125729 127007 128001 128454 128288 127747 127231 126904 126646
51768 126646 126563 127246 129118 131694 133918 135170 135543 135283 134536 133701 133391 133722 134138 134200 134152 134393 134852 135280
51750 135280 135740 136302 136567 136109 135231 134677 134624 134494 133853 133009 132474 132244 131964 131640 131826 132982 134779 136240
$$ packed form
51871A61153j028j004j702k614k799k129j423j293j454j343r04m30j19q5m86j226
51855A41114j819j879j550j230j049r32q87r34r59q00m23J10N79N62j79j145j483
51838A27096j188j259k211l086k637j128l0j43q50j288j338j236r08k01O27J069
51822A11289Q07j50j394k117j584m6J237J228K19o34o72k20J61L47M87O02O35
51805A10195P24J068J549J761J483R78O51N83N05K39o1j42J3J79J38q0j98N6N99
51786A20240R55P29J13l04j85K47O35Q95J115J289J278R94M53j66n41n16l27k58
51768A26646q3O83J872K576K224J252L73k60p47q35l10L31M16O2m8K41M59M28
51750A35280M60N62K65m58q78n54n3j30o41q44n35k30k80l24J86J156J797J461
$$ plain form
51732 136240 136708 136605 136999 138331 139817 140291 139472 138237 137748 138442 139732 140612 140689 140737 141942 144485 147206
51715 147206 148911 149631 150228 151201 152436 153832 155443 157047 158254 159182 160465 162430 164735 166983 169249
51700 169249 171764 174467 177123 179603 181869 183993 186306 189150 192256 194727 195913 196034 195719 195288 194821
51685 194821 194622 195178 196671 198793 200996 202802 204040 204967 205969 206988 207490 207215 206685 206661 207259 207961 208342
51668 208342 208452 208569 208921 209609 210528 211388 212026 212604 213245 213673 213585 213218 213032 212914 212276 211104 210257 210403 211146
51649 211146 211709 212077 212810 213887 214475 214060 213257 213175 214261 216112 218113 219852 221042 221573 221782 222317 223534
51632 223534 225210 226983 228757 230469 231814 232641 233479 235196 238081 241657 245434 249415 253722 258111 262094
51617 262094 265210 266917 266599 264116 260170 255702 251044 246016 240697 235547 230758 226022 221161 216520
$$ packed form
51732A36240M68j03L94J332J486M74q19j235m89O94J290Q80P7M8J205K543K721
51715A47206J705P20N97R73J235J396J611J604J207R28J283J965K305K248K266
51700A69249K515K703K656K480K266K124K313K844L106K471J186J21l15m31m67
51685A94821j99N56J493K122K203J806J238R27J002J019N02k75n30k4N98P02L81
51668B08342J10J17L52O88R19Q60O38N78O41M28q8l67j86j18o38j172q47J46P43
51649B11146N63L68P33J077N88m15q03q2J086J851K001J739J190N31K09N35J217
51632B23534J676J773J774J712J345Q27Q38J717K885L576L777L981M307M389L983
51617B62094L116J707l18k483l946m468m658n028n319n150m789m736m861m641
$$ plain form
51603 216520 212424 208576 204437 200026 195926 192490 189454 186432 183471 180916 178910 177288 175850 174517
51589 174517 173177 171638 169808 167874 166252 165420 165688 166837 167932 167878 166433 164455 162793 161206 158901
51574 158901 156051 154059 153955 155033 155575 154680 152906 151278 150271 149867 150021 150646 151321 151493 151078 150677 150990
51557 150990 152030 153073 153413 153067 152650 152679 153203 153982 154721 155090 154858 154235 153862 154233 155212 156286 157164 158002
51539 158002 159168 160920 163208 165694 168053 170317 172714 175128 177043 178193 178905 179530 179889 179677 179158
51524 179158 178919 179102 179312 179156 178438 176977 174912 173157 172818 173907 175156 175398 174675 173739 173038 172607 172591
51507 172591 173300 174861 177137 179839 182464 184365 185289 185698 186174 186666 186752 186588 187025 188535 190391 191351 191050
51490 191050 190352 190231 190593 190487 189378 187790 186609 186153 186284 187005 188342 189789 190622 190916 191568 193032 194620
$$ packed form
51603B16520m096l848m139m411m100l436l036l022k961k555k006j622j438j333
51589A74517j340j539j830j934j622q32K68J149J095n4j445j978j662j587k305
51574A58901k850j992j04J078N42q95j774j628j007m04J54O25O75J72m15m01L13
51557A50990J040J043L40l46m17K9N24P79P39L69k32o23l73L71R79J074Q78Q38
51539A58002J166J752K288K486K359K264K397K414J915J150P12O25L59k12n19
51524A79158k39J83K10j56p18j461k065j755l39J089J249K42p23r36p01m31j6
51507A72591P09J561K276K702K625J901R24M09M76M92Q6j64M37J510J856R60l01
51490A91050o98j21L62j06j109j588j181m56J31P21J337J447Q33K94O52J464J588
$$ plain form
51473 194620 195463 195665 195929 196420 196698 196553 196296 196177 196082 195850 195452 194824 193872 192731 191668 190750 189896 189193
51455 189193 188733 188171 187024 185495 184438 184282 184471 184302 183850 183622 183627 183345 182502 181377 180386 179714 179406 179482
51437 179482 179857 180402 181181 182473 184434 186813 189069 190752 191865 192899 194387 196300 198001 199012 199697
51422 199697 200900 202942 205306 207436 209481 212065 215486 219420 223311 226784 229732 232218 234439 236643
51408 236643 238998 241477 243868 245862 247244 248126 248962 250216 251944 253818 255511 256960 258212 259219 259884
51393 259884 260208 260278 260183 259985 259711 259269 258451 257201 255794 254580 253537 252224 250239 247612 244712 241885
51377 241885 239305 237123 235557 234654 233994 232825 230692 227880 225050 222511 220164 218126 216902 216706 217023
51362 217023 217262 217494 218041 218594 218501 217950 218053 219488 221534 222844 222733 221447 219659 218136 217500 217695 217830
$$ packed form
51473A94620Q43K02K64M91K78j45k57j19r5k32l98o28r52j141j063r18q54p03
51455A89193m60n62j147j529j057j56J89j69m52k28Nk82q43j125r91o72l08P6
51437A79482L75N45P79J292J961K379K256J683J113J034J488J913J701J011O85
51422A99697J203K042K364K130K045K584L421L934L891L473K948K486K221K204
51408B36643K355K479K391J994J382Q82Q36J254J728J874J693J449J252J007O65
51393B59884L24P0r5j98k74m42q18j250j407j214j043j313j985k627k900k827
51377B41885k580k182j566r03o60j169k133k812k830k539k347k038j224j96L17
51362B17023K39K32N47N53r3n51J03J435K046J310j11j286j788j523o36J95J35
$$ plain form
51345 217830 217033 215378 213604 212042 210293 207917 204998 201941 199057 196398 193705 190477 186359 181602
51331 181602 176949 173062 170185 168196 166665 164852 162117 158550 154972 152161 150209 148717 147346 146043
51317 146043 144869 143824 142841 141894 141067 140465 139970 139181 137758 135761 133518 131254 129048 127021 125340 124067
51301 124067 123193 122740 122623 122476 121928 120973 119870 118796 117936 117731 118498 119820 120772 120894 120517 120089 119679 119339
51283 119339 119395 120052 121071 122179 123411 124725 125633 125679 125075 124511 124517 125290 126857 128926 130786 131896 132519
51266 132519 133315 134346 134973 134809 134223 133726 133275 132555 131635 130881 130276 129273 127544 125600 124283 123613 122545
51249 122545 120150 116855 114079 112701 112259 111775 110878 109848 108892 107893 106706 105315 103693 101857 100153
51234 100153 99220 99441 100448 101243 100914 99372 97470 96279 96192 96836 97794 99080 100752 102421 103478 103710
$$ packed form
51345B17830p97j655j774j562j749k376k919l057k884k659k693l228m118m757
51331A81602m653l887k877j989j531j813k735l567l578k811j952j492j371j303
51317A46043j174j045r83r47q27o02m95p89j423j997k243k264k206k027j681j273
51301A24067q74m53j17j47n48r55j103j074q60k05P67J322R52J22l77m28m10l40
51283A19339N6O57J019J108J232J314R08M6o04n64OP73J567K069J860J110O23
51266A32519P96J031O27j64n86m97m51p20r20p54o05j003j729j944j317o70j068
51249A22545k395l295k776j378m42m84q97j030r56r99j187j391j622j836j704
51234A00153r33K21J007P95l29j542j902j191q7O44R58J286J672J669J057K32
$$ plain form
51218 103710 103424 102981 102409 101466 99971 98151 96696 96261 96839 97810 98667 99324 99589 98939 97314 95694 95223
51201 95223 95874 96572 96563 96041 95398 94536 93243 91749 90556 89938 89858 90210 90929 91977 93294 94671 95674 95925
51183 95925 95508 94893 94423 94059 93689 93402 93342 93449 93454 93092 92390 91823 92017 93067 94338 95202 95744 96333 96770
51164 96770 96509 95719 95348 95927 96907 97530 97769 97952 97950 97388 96506 96194 97080 98877 100722 101990 102789 103736 105236
51145 105236 107053 108660 109892 110925 111722 112042 112042 112321 113097 113920 114558 115609 117672 120279 122317 123283 123538
51128 123538 123496 123236 122915 122875 123131 123177 122585 121477 120259 119168 118196 117291 116456 115778 115315 114865 113907 112060
51110 112060 109603 107289 105653 104696 104188 103996 104076 104350 104598 104319 102923 100458 98002 96785 96860 97122 96732
51093 96732 95960 95401 95017 94461 93938 94112 95276 97066 98945 100481 101252 100998 100074 99304 99158 99293 99149 98713
$$ packed form
51218A03710k86m43n72r43j495j820j455m35N78R71Q57O57K65o50j625j620m71
51201I5223O51O98rn22o43q62j293j494j193o18q0L52P19J048J317J377J003K51
51183I5925m17o15m70l64l70k87o0J07Nl62p02n67J94J050J271Q64N42N89M37
51164I6770k61p90l71N79R80O23K39J83kn62q82l12Q86J797J845J268P99R47J500
51145A05236J817J607J232J033P97L20%K79P76Q23O38J051K063K607K038R66K55
51128A23538m2k60l21m0K56M6n92j108j218j091r72r05q35o78m63m50r58j847
51110A12060k457k314j636r57n08j92Q0K74K48k79j396k465k456j217P5K62l90
51093I6732p72n59l84n56n23J74J164J790J879J536P71k54r24p70j46J35j44m36
$$ plain form
51075 98713 98398 98296 97950 96956 95534 94367 94019 94574 95697 96811 97314 96886 95729 94429 93476 92937 92535
51058 92535 92021 91404 90929 90864 91283 92092 93230 94679 96157 97066 97065 96600 96416 96553 96352 95640 95241 95885 97147
51039 97147 98172 99101 100856 103522 105832 106622 106170 105627 105647 106071 106732 107858 109633 111744 113578 114725
51023 114725 115227 115411 115559 115772 116138 116833 117809 118511 118328 117489 117115 118146 120428 123051 125328 127123 128479
51006 128479 129387 129899 130109 129985 129467 128725 128102 127715 127368 126927 126594 126663 127147 127751 128205 128526 128932 129448 129704
50987 129704 129313 128395 127487 126830 126109 125126 124325 124251 124746 125230 125571 126054 126526 126335 125373 124447 124257 124556 124867
50968 124867 125439 126741 128374 129400 129735 130320 131687 133120 133708 133630 133814 134708 136046 137623 139640 142168
50952 142168 144811 147172 149324 151541 153808 155832 157473 158944 160567 162469 164600 166953 169711 173099
$$ packed form
51075I8713l15j02l46r94j422j167l48N55J123J114N03m28j157j300r53n39m02
51058I2535n14o17m75o5M19Q09J138J449J478R09jm65j84J37k01p12l99O44J262
51039I7147J025R29J755K666K310P90m52n43K0M24O61J126J775K111J834J147
51023A14725N02J84J48K13L66O95R76P02j83q39l74J031K282K623K277J795J356
51006A28479R08N12K10j24n18p42o23l87l47m41l33O9M84O04M54L21M06N16K56
50987A29704l91r18r08o57p21r83q01p4M95M84L41M83M72j91r62r26j90K99L11
50968A24867N72J302J633J026L35N85J367J433N88p8J84Q94J338J577K017K528
50952A42168K643K361K152K217K267K024J641J471J623J902K131K353K758L388
$$ plain form
50938 173099 177111 181468 185901 190355 194843 199290 203796 208940 215343 222807 230306 237145 243805 251241
50924 251241 259567 268006 276152 284688 294571 305964 318405 331749 346370 362479 379796 398076
50912 398076 417591 438788 461706 486075 511861 539427 569206 601509 636660 674915 716069
50901 716069 759355 803940 849444 895883 943335 991818 1041270 1091193 1140381 1187355 1231243
50890 1231243 1271976 1309543 1343250 1371930 1394777 1411788 1423500 1430495 1433179 1431896 1427133 1419554
50878 1419554 1409868 1398690 1386562 1373974 1361274 1348585 1335896 1323069 1309660 1294928 1278360
50867 1278360 1260070 1240290 1218604 1194218 1167068 1138020 1107712 1075796 1041785 1006071 969467
50856 969467 932147 893899 855298 817702 781925 747645 714473 682962 654046 627871 603707
$$ packed form
50938A73099M012M357M433M454M488M447M506N144O403P464P499O839O660P436
50924B51241Q326Q439Q146Q536R883J1393J2441J3344J4621J6109J7317J8280
50912C98076J9515K1197K2918K4369K5786K7566K9779L2303L5151L8255M1154
50901G16069M3286M4585M5504M6439M7452M8483M9452M9923M9188M6974M3888
50890A231243M0733L7567L3707K8680K2847J7011J1712O995K684j283m763p579
50878A419554r686j1178j2128j2588j2700j2689j2689j2827j3409j4732j6568
50867A278360j8290j9780k1686k4386k7150k9048l0308l1916l4011l5714l6604
50856I69467l7320l8248l8601l7596l5777l4280l3172l1511k8916k6175k4164
$$ plain form
50845 603707 580862 559342 539655 522292 507273 493994 481569 469518 458099 447920 439415 432760
50833 432760 428008 424977 423145 421923 421069 420653 420743 421335 422570 424697 427720 431193 434563 437723 441164
50818 441164 445497 450847 456853 463327 470685 479490 489657 500477 511441 522747 534936 548358 563107
50805 563107 579146 596307 614464 633932 655403 679261 705271 733252 763741 797552 834906
50794 834906 875462 919151 966529 1018291 1074812 1136295 1203076 1275606 1354196 1438727 1528504
50783 1528504 1622541 1720178 1821264 1925540 2032095 2139750 2247740 2355394 2461106 2562085
50773 2562085 2655235 2738051 2808797 2866484 2910965 2942652 2961919 2969044 2964844 2950988 2929474 2902123
50761 2902123 2870765 2837458 2804042 2771595 2740557 2711143 2683379 2656962 2631311 2605513 2577969
$$ packed form
50845F03707k2845k1520j9687j7363j5019j3279j2425j2051j1419j0179q505o655
50833D32760m752l031j832j222q54m16R0N92J235K127L023L473L370L160L441
50818D41164M333N350O006O474P358Q805J0167J0820J0964J1306J2189J3422J4749
50805E63107J6039J7161J8157J9468K1471K3858K6010K7981L0489L3811L7354
50794H34906M0556M3689M7378N1762N6521O1483O6781P2530P8590Q4531Q9777
50783A528504R4037R7637J01086J04276J06555J07655J07990J07654J05712J00979
50773B562085R3150Q2816P0746N7687M4481L1687J9267P125m200j3856k1514k7351
50761B902123l1358l3307l3416l2447l1038k9414k7764k6417k5651k5798k7544
$$ plain form
50750 2577969 2546450 2509023 2464899 2414092 2356538 2292021 2220894 2144245 2063237 1978658 1891378
50739 1891378 1802879 1715041 1629387 1546715 1467384 1391855 1320914 1255322 1195307 1140584 1091007
50728 1091007 1046974 1008901 976393 948288 923514 901660 882714 866625 853248 842418 833781
50717 833781 826660 820228 813848 807195 800257 793309 786700 780559 774750 769202 764088 759558 755410 751255
50703 751255 746907 742422 737751 732534 726430 719632 712996 707574 703927 701891 700951 700756 701195 702194 703709
50688 703709 705998 709570 714702 721160 728614 737290 748002 761539 778102 797345 818835 842467 868510
50675 868510 897347 929179 964001 1001842 1042982 1087869 1136772 1189498 1245405 1303713 1363863
50664 1363863 1425585 1488592 1552227 1615495 1677342 1736710 1792280 1842425 1885683 1921284 1949109
$$ packed form
50750B577969l1519l7427m4124n0807n7554o4517p1127p6649q1008q4579q7280
50739A891378q8499q7838q5654q2672p9331p5529p0941o5592o0015n4723m9577
50728A091007m4033l8073l2508k8105k4774k1854j8946j6089j3377j0830q637
50717H33781p121o432o380o653o938o948o609o141n809n548n114m530m148m155
50703G51255m348m485m671n217o104o798o636n422l647k036r40j95M39R99J515
50688G03709K289L572N132O458P454Q676J0712J3537J6563J9243K1490K3632K6043
50675H68510K8837L1832L4822L7841M1140M4887M8903N2726N5907N8308O0150
50664A363863O1722O3007O3635O3268O1847N9368N5570N0145M3258L5601K7825
$$ plain form
50653 1949109 1969106 1980847 1983741 1977727 1963713 1943240 1917649 1887807 1854899 1821243 1789714 1762036
50641 1762036 1737927 1716175 1696235 1678392 1662674 1648171 1633470 1617283 1598564 1576464 1550444
50630 1550444 1520230 1485598 1446512 1403657 1358474 1312356 1266001 1219751 1174269 1130496 1089109
50619 1089109 1050420 1014770 982558 953818 928192 905560 886491 871835 861958 856508 854759 856003
50607 856003 859797 866126 875387 887998 903894 922433 942675 963626 984334 1004144 1023081 1041767
50595 1041767 1060646 1079376 1097235 1114080 1130532 1147183 1164011 1180827 1197883 1215597 1233882
50584 1233882 1252342 1271113 1290902 1312030 1333941 1356032 1378555 1402269 1427544 1454282 1482416
$$ packed form
50653A949109J9997J1741K894o014j4014k0473k5591k9842l2908l3656l1529k7678
50641A762036k4109k1752j9940j7843j5718j4503j4701j6187j8719k2100k6020
50630A550444l0214l4632l9086m2855m5183m6118m6355m6250m5482m3773m1387
50619A089109l8689l5650l2212k8740k5626k2632j9069j4656r877n450j749J244
50607H56003L794O329R261J2611J5896J8539K0242K0951K0708J9810J8937J8686
50595A041767J8879J8730J7859J6845J6452J6651J6828J6816J7056J7714J8285
50584A233882J8460J8771J9789K1128K1911K2091K2523K3714K5275K6738K8134
$$ [...]
##END NTUPLES=NMR SPECTRUM
##END=
