
##TITLE=AC1080_MAST01_5819146_kSWaKvAYf4
##JCAMPDX= 6.0         $$ Bruker NMR JCAMP-DX V2.0
##DATA TYPE= NMR SPECTRUM
##DATA CLASS= NTUPLES
##ORIGIN= BRUKER
##OWNER= Administrator
$$ 1.72 TOPSPIN		Version 2.1
$$ 2012-03-24 20:55:37.984 -0500  Administrator@TOPSPIN
$$ Compression mode = diff/dup
##.OBSERVE FREQUENCY= 400.13188235
##.OBSERVE NUCLEUS= ^1H
##.ACQUISITION MODE= SIMULTANEOUS (DQD)
##.ACQUISITION SCHEME= undefined
##.AVERAGES= 8
##.DIGITISER RES= 22
##SPECTROMETER/DATA SYSTEM= spect
##.PULSE SEQUENCE= zg30
##.SOLVENT NAME= COFFEE_meoh
##.SHIFT REFERENCE= INTERNAL, COFFEE_meoh, 1, 14.98061
##AUDIT TRAIL= $$ (NUMBER, WHEN, WHO, WHERE, PROCESS, VERSION, WHAT)
$$ ##TITLE= Audit trail, TOPSPIN		Version 2.1
$$ ##JCAMPDX= 5.01
$$ ##ORIGIN= Bruker BioSpin GmbH
$$ ##OWNER= Administrator
$$ $$ C:\Bruker\TOPSPIN/data/COFFEE/nmr/AC1080_MAST01_5819146_kSWaKvAYf4/10/pdata/1/auditp.txt
$$ ##AUDIT TRAIL=  $$ (NUMBER, WHEN, WHO, WHERE, PROCESS, VERSION, WHAT)
(   1,<2012-03-24 20:55:29.718 -0500>,<Administrator>,<TOPSPIN>,<go>,<TOPSPIN 2.1>,
      <created by zg
	started at 2012-03-24 20:54:23.171 -0500,
	POWCHK enabled, PULCHK disabled,
       configuration hash MD5:
       1A 1E CE 29 27 FD 77 03 67 4E F0 E3 C4 B2 CB 90
       data hash MD5: 64K
       73 79 A0 CC F2 37 5E 62 94 9D C1 79 A7 30 C9 84>)
(   2,<2012-03-24 20:55:33.062 -0500>,<Administrator>,<TOPSPIN>,<proc1d>,<TOPSPIN 2.1>,
      <Start of raw data processing
       efp LB = 0 FT_mod = 6 PKNL = 1 PHC0 = 0 PHC1 = 0 SI = 32K 
       data hash MD5: 32K
       6A 30 9D 20 00 C8 44 9A 08 6D 25 56 8D 3B A6 DA>)
(   3,<2012-03-24 20:55:33.390 -0500>,<Administrator>,<TOPSPIN>,<proc1d>,<TOPSPIN 2.1>,
      <pk PHC0 = 217.5403 PHC1 = 0 
       data hash MD5: 32K
       62 B3 3A 5A 8C B2 68 19 5C 5E A2 D0 CE CD D8 11>)
(   4,<2012-03-24 20:55:33.484 -0500>,<Administrator>,<TOPSPIN>,<proc1d>,<TOPSPIN 2.1>,
      <abs ABSG = 1 
       data hash MD5: 32K
       0F E5 54 C9 46 8D 72 91 DA 13 7C 6F B7 74 AF 14>)
(   5,<2012-03-24 20:55:33.656 -0500>,<Administrator>,<TOPSPIN>,<proc1d>,<TOPSPIN 2.1>,
      <abs ABSG = 2 
       data hash MD5: 32K
       49 06 21 A0 31 F6 DC 7C DC A2 58 61 8C E4 6A CF>)
(   6,<2012-03-24 20:55:33.703 -0500>,<Administrator>,<TOPSPIN>,<proc1d>,<TOPSPIN 2.1>,
      <abs ABSG = 3 
       data hash MD5: 32K
       E6 D9 87 FD 5B 49 FC E7 48 36 A8 5F 4D 95 B1 B9>)
(   7,<2012-03-24 20:55:33.734 -0500>,<Administrator>,<TOPSPIN>,<proc1d>,<TOPSPIN 2.1>,
      <abs ABSG = 4 
       data hash MD5: 32K
       2F 17 B2 20 EA 5E 5A F7 2B 20 DE 81 65 E1 76 5C>)
(   8,<2012-03-24 20:55:33.765 -0500>,<Administrator>,<TOPSPIN>,<proc1d>,<TOPSPIN 2.1>,
      <abs ABSG = 5 
       data hash MD5: 32K
       5A D4 41 06 67 66 74 13 92 AB D9 3D 62 75 3A 89>)
$$ ##END=
$$ 
$$ $$ hash MD5
$$ $$ C4 F8 8F B4 1E E7 64 07 43 7A 15 77 D1 3A 7A CC
##$RELAX= 
##$RELAX= 
##$RELAX= 
##$RELAX= 
##$RELAX= 
##$RELAX= 
##$RELAX= 
$$ Bruker specific parameters
$$ --------------------------
$$ [...]
150 150 150 150 150 150 150 150
##$TP07= 0
##$TPNAME0= <>
##$TPNAME1= <>
##$TPNAME2= <>
##$TPNAME3= <>
##$TPNAME4= <>
##$TPNAME5= <>
##$TPNAME6= <>
##$TPNAME7= <>
##$TPOAL= (0..7)
0.5 0.5 0.5 0.5 0.5 0.5 0.5 0.5
##$TPOFFS= (0..7)
0 0 0 0 0 0 0 0
##$TUNHIN= 0
##$TUNHOUT= 0
##$TUNXOUT= 0
##$USERA1= <user>
##$USERA2= <user>
##$USERA3= <user>
##$USERA4= <user>
##$USERA5= <user>
##$V9= 5
##$VALIST= <valist>
##$VCLIST= <CCCCCCCCCCCCCCC>
##$VD= 0
##$VDLIST= <DDDDDDDDDDDDDDD>
##$VPLIST= <PPPPPPPPPPPPPPP>
##$VTLIST= <TTTTTTTTTTTTTTT>
##$WBST= 2048
##$WBSW= 25
##$XGAIN= (0..3)
0 0 0 0
##$XL= 0
##$YL= 0
##$YMAX_a= 554253
##$YMIN_a= -655882
##$ZGOPTNS= <>
##$ZL1= 120
##$ZL2= 120
##$ZL3= 120
##$ZL4= 120
##$ABSF1= 14.98061
##$ABSF2= -5.57192
##$ABSG= 5
##$ABSL= 3
##$ALPHA= 0
##$AQORDER= 0
##$ASSFAC= 0
##$ASSFACI= 0
##$ASSFACX= 0
##$ASSWID= 0
##$AUNMP= <proc_prof1d_extract_pilot.lims>
##$AXLEFT= 0
##$AXNAME= <>
##$AXNUC= <1H>
##$AXRIGHT= 0
##$AXTYPE= 0
##$AXUNIT= <>
##$AZFE= 0.1
##$AZFW= 0.1
##$BCFW= 0
##$BC_mod= 0
##$BYTORDP= 0
##$COROFFS= 0
##$CY= 15
##$DATMOD= 1
##$DC= 0
##$DFILT= <>
##$DTYPP= 0
##$F1P= 0
##$F2P= 0
##$FCOR= 0.5
##$FTSIZE= 32768
##$FT_mod= 6
##$GAMMA= 0
##$GB= 0
##$INTBC= 1
##$INTSCL= 1
##$ISEN= 128
##$LB= 0
##$LEV0= 0
##$LPBIN= 0
##$MAXI= 10000
##$MC2= 0
##$MEAN= 0
##$ME_mod= 0
##$MI= 0
##$NCOEF= 0
##$NC_proc= -8
##$NLEV= 6
##$NOISF1= 0
##$NOISF2= 0
##$NSP= 0
##$NTH_PI= 0
##$NZP= 0
##$OFFSET= 14.98061
##$PC= 1
##$PHC0= 217.5403
##$PHC1= 0
##$PH_mod= 1
##$PKNL= yes
##$PPARMOD= 0
##$PPDIAG= 0
##$PPIPTYP= 0
##$PPMPNUM= 2147483647
##$PPRESOL= 1
##$PSCAL= 4
##$PSIGN= 0
##$PYNMP= <proc.py>
##$REVERSE= no
##$SF= 400.13
##$SI= 32768
##$SIGF1= 0
##$SIGF2= 0
##$SINO= 400
##$SIOLD= 32768
##$SPECTYP= <>
##$SREGLST= <1H.CDCl3>
##$SSB= 0
##$STSI= 32768
##$STSR= 0
##$SW_p= 8223.68421052632
##$SYMM= 0
##$S_DEV= 0
##$TDeff= 65536
##$TDoff= 0
##$TI= <>
##$TILT= no
##$TM1= 0
##$TM2= 0
##$TOPLEV= 0
##$USERP1= <user>
##$USERP2= <user>
##$USERP3= <user>
##$USERP4= <user>
##$USERP5= <user>
##$WDW= 1
##$XDIM= 32768
##$YMAX_p= 470094147
##$YMIN_p= -771889
##$CURPLOT= <Network HP LaserJet P1505>
##$CURPRIN= <$Network HP LaserJet P1505>
##$DFORMAT= <normdp>
##$LAYOUT= <+/1D_H.xwp>
##$LFORMAT= <normlp>
##$PFORMAT= <normpl>
##$SURQMSG= 1
$$ End of Bruker specific parameters
$$ ---------------------------------
##NTUPLES= NMR SPECTRUM
##VAR_NAME=  FREQUENCY,     SPECTRUM/REAL,   SPECTRUM/IMAG
##SYMBOL=    X,             R,               I
##VAR_TYPE=  INDEPENDENT,   DEPENDENT,       DEPENDENT
##VAR_FORM=  AFFN,          ASDF,            ASDF
##VAR_DIM=   32768,         32768,           32768
##UNITS=     HZ,            ARBITRARY UNITS, ARBITRARY UNITS
##FACTOR=    0.250966925370066, 1,           1
##FIRST=     8223.43324360095, -128457,      -179624
##LAST=      0,             -152983,         -36826
##MIN=       0,             -771889,         0
##MAX=       8223.43324360095, 470094147,    0
$$ Real data points
##PAGE= N=1
##DATA TABLE= (X++(R..R)), XYDATA
$$ [...]
19485C0086c7801B7513a84374a7108k17716b1752A15862b84522b1665j1135E3123
19473c3470k67275a47721c4020D3088a7055j08575C5175a7458j2327o497k44487
19462b80769h3749k08582a21147a9627n7307A25987j1754A0663c05146G6986a38533
19450A39210Q0600b08848H2122a5355m1598A12114i1304j06298B8560P0712c104
19438b8711A10925a93086h1643A79432k3281B3068M7683a11385A77053a36985
19427a39892O6211m8826r2208A09735K5622a8553I0744b16761j68669m9011a05843
19415g6634A92478i8305M5950J0332J5348j00182B94279b08132K4575m16539b36172
19403A8454a11210I2191b24382J09439l15584H7588j1876A9898h5462H1778a38737
$$ plain form
19485 30086 -37801 27513 -184374 -17108 -234824 -21752 115862 -284522 -21665 -32800 53123
19473 -33470 -300745 -147721 -34020 43088 -17055 -125630 35175 -17458 -29785 -36282 -280769
19462 -280769 -83749 -292331 -121147 -19627 -76934 125987 114233 10663 -305146 76986 -138533
19450 139210 219810 -208848 82122 -15355 -56953 112114 -91304 -197602 28560 99272 -3104
19438 -28711 110925 -193086 -81643 179432 156151 23068 70751 -111385 177053 -136985
19427 -139892 -73681 -122507 -214715 109735 135357 -18553 90744 -216761 -385430 -434441 -105843
19415 -76634 192478 -98305 -52355 -42023 -26675 -126857 294279 -208132 -183557 -600096 -236172
19403 18454 -111210 92191 -224382 -114943 -430527 87588 75712 19898 -85462 81778 -138737
19391b6271k70909a44599M3614E3950R1575r669k4929d43671C171d4890k42379
19380b87269B568a16216e8016l3055P251k31379o350A03027a67791m6034b625
19368h2881C4232L4108a2088n6966c2647A6391b50184d5832B41659b07649G5529
19356d23235a15976j05289e1883J4984j66729Q6515j1079k46733D9144a35508
19345b39849C7764b08492A0234O4642b36202A8726d53072B55294d49212g733j62096
19334a69829j06827N9054L923O5895m6877K3423h2685A9998b29686e9215q8444
19323a47659q1054O8023l13787I30J67709a82296N8917a1513k75947k25332G7575
19311d31377a20628L9854A81215m6157o0817c04635h9778K8304J6966E1699i1762
$$ plain form
19391 -26271 -297180 -144599 -100985 53950 145525 135856 110927 -443671 3171 -44890 -287269
19380 -287269 2568 -116216 -58016 -91071 -83820 -315199 -321549 103027 -167791 -213825 -2625
19368 -82881 34232 68340 -12088 -69054 -32647 16391 -250184 -45832 241659 -207649 75529
19356 -423235 -115976 -221265 -51883 -36899 -203628 -117113 -128192 -374925 49144 -135508
19345 -239849 37764 -208492 10234 74876 -236202 18726 -453072 255294 -449212 -7733 -169829
19334 -169829 -276656 -217602 -213679 -147784 -194661 -171238 -82685 19998 -229686 -59215 -147659
19323 -147659 -228713 -160690 -474477 930 168639 -182296 -123379 -11513 -287460 -512792 77575
19311 -431377 -120628 -80774 181215 135058 74241 -304635 -89778 -61474 -44508 51699 -91762
19299B8317i3250A43540E8800b6014j30816L4164n1194M3835c5396m55664h5074
19287g8441A29454o2347J23774g2188B7227a43491b4984A7867i8821f695o8811
19276g5506G8267G52K44147b34244E4295a06661j22175L2988B21025a88754l39615
19265e28369A8326a02936G1127a7362q141B2012a29561a546A3640k687b09891
19253A50301a25631d486A86036a09512j74024A40405F3290a98801j0553a7087
19242b36450O8518H0420J7899K24261b35261E5651b38528J11410D2879b99694
19231E4825g2446l05828E4677a90283i1170q8302H9929J35775b24423D2770f7756
19219A67933e9181k20528A39671d0291k52963A88054f7069k47223a50799A44600
$$ plain form
19299 28317 -93250 143540 58800 -26014 -156830 -122666 -173860 -130025 -35396 -491060 -85074
19287 -78441 129454 67107 190881 -72188 27227 -143491 -24984 17867 -98821 -6695 -75506
19276 -75506 78267 752 244899 -234244 54295 -106661 -228836 -195848 221025 -188754 -528369
19265 -528369 18326 -102936 71127 -17362 -25503 22012 -129561 -1546 13640 10953 -209891
19253 150301 -125631 -4486 186036 -109512 -283536 140405 63290 -198801 -209354 -17087
19242 -236450 -167932 80420 98319 322580 -235261 55651 -238528 -127118 42879 -299694
19231 54825 -72446 -378274 54677 -190283 -91170 -179472 89929 225704 -224423 42770 -67756
19219 167933 -59181 -279709 139671 -40291 -293254 188054 -67069 -314292 -150799 144600
19208a98849B14903a03752A71368b53564p571a09665j01065J6826b2082M780j97733
19197b15035I9411E232J49166d4652p386a8758p4088l298C6074f1289J938E6934
19184c21476a18926B93b93237b3906C0744K08N553K27441b0296k3977k48395i8851
19171B92291G5833b66875O5619p9824A14153b98934a22815k10512A22853b29966
19160a35994L3624k67229A01663R1972c91888o2055J91029J5225P7888N7175C23105
19148a55511r7031J13445m7178p6888B26065j707H2976K4671B957h7666C36737
19136e8473k8735c7320l7293D8028g6911J8674L182j37022A41556d6433k86854
19125c33287J10096H9966a37738A35518a46273d4162j58833i523I9043J25780
$$ plain form
19208 -198849 214903 -103752 171368 -253564 -261135 -109665 -210730 -193904 -22082 -17302 -215035
19197 -215035 99411 5232 154398 -44652 -52038 -18758 -92846 -96144 36074 -61289 -59351 56934
19184 -321476 -118926 293 -293237 -23906 30744 30952 36505 263946 -20296 -44273 -292668 -98851
19171 292291 75833 -266875 -201256 -281080 114153 -298934 -122815 -333327 122853 -229966
19160 -135994 -102370 -369599 101663 193635 -391888 -453943 -262914 -247689 -169801 -112626 323105
19148 -155511 -252542 -139097 -186275 -263163 226065 224358 82976 107647 2957 -87666 336737
19136 -58473 -87208 -37320 -74613 48028 -76911 -58237 -55055 -192077 141556 -46433 -333287
19125 -333287 -223191 89966 -137738 135518 -146273 -44162 -202995 -9523 99043 224823
19115B24823q2532j725c36113a5424j17349D4872a39056a4253A81300i4394l15141
19104d09535l1872f866k79340J06474d8828p0773A4169h5732k24328d6351A57586
19092B34197e9999k90943a24178A66433C6684b90425o6662A1090a3138A43369
19081G9352a70179g5972C2579O6931A9916P9754C014i0594j36345A87196E2921
19069B0645f9874q5161F3574a84507N8670D6516j0877b8990A18861c62990o3315
19058d26305G0047a08922M1266H8166K08141f2330b3775k28705B78123F3132o768
19047E6364O520K3927a63133m5651E9999c0245n8169A50760b24640C61900G0632
19035G5421a46608j03429A66813J5430m6394a11957N1447B77512c12996A29708
$$ plain form
19115 224823 142291 140566 -336113 -15424 -132773 44872 -139056 -14253 181300 -94394 -409535
19104 -409535 -441407 -6866 -286206 -179732 -48828 -119601 14169 -85732 -310060 -46351 157586
19092 234197 -59999 -350942 -124178 166433 36684 -290425 -357087 11090 -13138 143369
19081 79352 -170179 -75972 32579 99510 19916 99670 3014 -90594 -226939 187196 52921
19069 20645 -69874 -155035 63574 -184507 -125837 46516 35639 -28990 118861 -362990 -426305
19058 -426305 70047 -108922 -67656 88166 296307 -62330 -23775 -252480 278123 63132 56364
19047 56364 62884 86811 -163133 -208784 59999 -30245 -88414 150760 -224640 361900 70632
19035 75421 -146608 -250037 166813 182243 135849 -111957 -60510 277512 -312996 129708
19024B3842g0518A19266K1591b869k45893k5281a4502n5298A02149L0194B2843
19012D5943a23773j79635a09201A9971J51808n6243J30828B4914J60072b84959
19001F1612a73623A71407h1547j69406C86948f7233A98440F4009O4715N5753B6204
18989b99417D2511a37179k17432C27N0078K13974a5213A00227i0296A39487a09275
18977a0541l160A23272n220E6540J10799e48268D5262d62319b26982a772A05407
18965b70333I8306a72739B7768R2165m048a27452M6931J7297D38993p1854D5686
18953D32656A81924F6330K62919D6164L32601a25894r8821N5902j9876O3301J2309
18942a13079A12561c8876l17511Q5054b4672q2595A47125e7723J7830l4944J921
$$ plain form
19024 23842 -70518 119266 140857 -2869 -248762 -274043 -14502 -69800 102149 132343 22843
19012 45943 -123773 -303408 -109201 19971 171779 115536 246364 24914 184986 -284959
19001 61612 -173623 171407 -81547 -250953 386948 -67233 198440 64009 128724 184477 26204
18989 -299417 42511 -137179 -354611 327 50405 264379 -15213 100227 -90296 139487 -109275
18977 -10541 -13701 123272 118052 56540 167339 -548268 45262 -462319 -226982 -1772 105407
18965 -270333 98306 -172739 27768 119933 115885 -127452 -80521 -63224 438993 367139 45686
18953 432656 181924 66330 329249 46164 378765 -125894 -224715 -168813 -188689 -125388 -113079
18942 -113079 112561 -38876 -356387 -271333 -24672 -107267 147125 -57723 -39893 -74837 -72916
18931g2916A55680j1630b87308J0709A3072h3211A52247a3198j04770B41964b72665
18919a32666j04322i3859C1246M5193c685A77637L7166b95944A88749b465n3234
18908e5699n5761l9948r4954B28706D9K4796a11653e0387A32778c3986j15056
18897a49042F2943N5490f9452q558K0275C22588J16072B01403l9678B8145R4399
18886A22544D298N2447b3140C35924a32635E6640b7984j22362G3847J66839c48051
18874a85863g4986k01465G7505b01062A15607a04392K9615l7078k06380J16909
18864b01326A94845f8619j62520P8936B7890a65736M0074j71565c0739n3673B3864
18852g7854j6197c7889B32773c38279a03591j05926B6999b74661b563B4181b82539
$$ plain form
18931 -72916 155680 144050 -287308 -276599 13072 -83211 152247 -13198 -117968 241964 -272665
18919 -132666 -236988 -93859 31246 76439 -3685 177637 214803 -295944 188749 -2465 -55699
18908 -55699 -111460 -151408 -246362 228706 49 24845 -111653 -50387 132778 -33986 -149042
18897 -149042 62943 118433 -69452 -78010 -57735 322588 438660 201403 161725 28145 122544
18886 122544 4298 56745 -23140 335924 -132635 56640 -27984 -150346 73847 240686 -348051
18874 -185863 -74986 -276451 77505 -201062 115607 -104392 -74777 -111855 -318235 -201326
18864 -201326 194845 -68619 -231139 -152203 27890 -165736 -125662 -297227 -30739 -84412 23864
18852 -77854 -94051 -37889 232773 -338279 -103591 -209517 26999 -274661 -2563 24181 -282539
18840b77156P3112B33959I9241J05496p7907N1329D5617M6372A3939J57724c669
18828D37380A30166a94712i2396C4906j1243a04080G569c9128D1893a78904B10951
18816C4047h2385k250n3923D4511c2101k19450I2587b00206G3200b27114l1297
18805b58411a02809m9901E4531g8697j24437D92044A84K30367f5571A61256O4416
18794B25672O0444K9028m2223b63187A28789E7698J8675c73500I3790a62048B86938
18782B33174b33860k4406F0430O262d04102A13809d6300B74994b71443M4902H2922
18770c9876j51853A879P4477K5760h3611B15801a32658O2753A45329a8855l04189
18759c23044b281k02611R3699j38898J7866J05664j9661M7135k1437B7291a01554
$$ plain form
18840 -277156 -204044 233959 99241 204737 126830 178159 45617 91989 13939 171663 -3669
18828 437380 130166 -194712 -92396 34906 23663 -104080 7569 -39128 41893 -178904 210951
18816 34047 -82385 -84635 -138558 44511 -32101 -251551 92587 -200206 73200 -227114 -258411
18805 -258411 -102809 -152710 54531 -78697 -203134 492044 184 230551 -65571 161256 225672
18794 225672 286116 315144 272921 -263187 128789 57698 76373 -373500 93790 -162048 286938
18782 233174 -233860 -258266 60430 66692 -404102 113809 -46300 274994 -271443 -226541 82922
18770 -39876 -191729 1879 76356 102116 -83611 215801 -132658 -69905 145329 -18855 -323044
18759 -323044 -2281 -204892 -111193 -250091 -232225 -126561 -146222 -99087 -120524 27291 -101554
18747a87456H0890i7421b1331q6028L4663a4863j30796A05972O7291b66349M8512
18736b17837b1208A66573b74612j0185M2121a01800A50173b32056a04002j29371
18726b33373B07055b09983l5626J18589j21366A32816a11410K7101C14283a75769
18715e1003a4551j84402A8739J2855Q6124b62106M4108m4699R0413A57622f1373
18703a13064A57207a13957r9073D0846K86929b48670A53391d01415A89266D0787
18692a55018e4159A63091a4014B09272D0179J70872C8581b36123N5292D8887a73513
18680f0176r8351a2801p4270C2230b76477H4086c4684A03172F376a72192L6256
18669a35936O4663r9414k29573g3628A31521D1975a31364N5482A8994P9583a50484
$$ plain form
18747 -187456 80890 -97421 -21331 -107359 -72696 -14863 -145659 105972 173263 -266349 -217837
18736 -217837 -21208 166573 -274612 -284797 -242676 -101800 150173 -232056 -104002 -233373
18726 -233373 207055 -209983 -245609 -127020 -248386 132816 -111410 -84309 314283 -175769
18715 -51003 -14551 -198953 18739 31594 117718 -262106 -217998 -262697 -172284 157622 -61373
18703 -113064 157207 -113957 -213030 40846 327775 -248670 153391 -401415 189266 40787
18692 -155018 -54159 163091 -14014 209272 40179 211051 38581 -236123 -180831 48887 -173513
18680 -60176 -158527 -12801 -87071 32230 -276477 84086 -34684 103172 6376 -172192 -135936
18669 -135936 -71273 -170687 -400260 -73628 131521 41975 -131364 -75882 18994 98577 -150484
18657B6327f7446K6427l25601J29393o4004A44950i8653q8653I2637J04541b10693
18645c59741a08264B66719a02574B85868e921A75114a79498I0083l055i1861O788
18634h5073C0034d6824A50013i5599G9362b42181Q228o9082L1152A25834o2129
18623F3705A1670O4377K12677a2327p175k2479A16380D8328f505j12228k5618
18612a44351L5860D8177d5541J3782E3791a19062k18122I5147b46819b7636G0442
18600b11830A80935a58634O6093A51754c39639H430a12969j36197A73385D7019
18589a34242j76770F2979M764a04170A7083P5448b02787o7907A19237d24227A43888
18577h2939N895A49893b93604G9416a25925A76684g8026j65547H1693c86717I0956
$$ plain form
18657 26327 -67446 -41019 -366620 -237227 -301231 144950 -98653 -187306 92637 197178 -210693
18645 -359741 -108264 266719 -102574 285868 -5921 175114 -179498 90083 87028 -91861 -85073
18634 -85073 30034 -46824 150013 -95599 79362 -242181 -233953 -303035 -271883 125834 63705
18623 63705 11670 76047 288724 -12327 -19502 -41981 116380 48328 -6505 -118733 -144351
18612 -144351 -108491 48177 -45541 -31759 53791 -119062 -337184 95147 -246819 -27636 70442
18600 -211830 180935 -158634 -92541 151754 -339639 8430 -112969 -249166 173385 47019
18589 -134242 -311012 62979 67743 -104170 17083 92531 -202787 -270694 119237 -424227 143888
18577 -82939 -77044 149893 -293604 79416 -125925 176684 -78026 -243573 81693 -386717 90956
18565D839K01781j0336L3066b69735F4192N5254R7140E2468a74055b3339P042
18554a6297o052D2213d90853h0090A97727a95619D26357a81872M4913A63767a99263
18542b55603a13840A030O2834a39425O6247l4716l7044c8446A55306b9718j41161
18531a70879m0780p4762E1602a45008j22994n5569A3272J29240a75638N0082j52811
18520b78367A10942a36476M8446D1721c5499B14781i6650j76971B30638j05303
18510A25335h1568G3154h8344d016B63451a6539j59895j11148i6382c5328l18726
18499c54054a54091I7709J690b7344l2568A0614O3069g80j8375m7358L2038A4178
18486d7474B03404G7597R2832q0456C8528a60902k79646g5918E8030a76200l4039
$$ plain form
18565 4839 206620 196284 229350 -269735 64192 119446 216586 52468 -174055 -23339 -16297
18554 -16297 -22349 42213 -490853 -80090 197727 -195619 426357 -181872 -136959 163767 -199263
18542 -255603 -113840 1030 63864 -139425 -73178 -107894 -144938 -38446 155306 -29718 -170879
18531 -170879 -211659 -286421 51602 -145008 -268002 -323571 13272 142512 -175638 -125556 -278367
18520 -278367 110942 -136476 -88030 41721 -35499 214781 -96650 -273621 230638 125335
18510 125335 -81568 73154 -88344 -4016 263451 -16539 -176434 -287582 -96382 -35328 -354054
18499 -354054 -154091 97709 99399 -27344 -59912 10614 73683 -780 -19155 -66513 -34475 14178
18486 -47474 203404 77597 170429 89973 38528 -160902 -440548 -75918 58030 -176200 -210239
18475b10239m014R9615k00042B41016G2179Q9421c61592a46180F1962A2236R3241
18464A05477b36704g5736A60390a38705j43082h8483G304g2505A31282a70644
18453A09244e7513k5854E0167K4280k4162D358d993A31977K6748l5472e3617j90970
18441b44587p3284H9958R9609a90599D317K196J64339m9094g1169l76219E353
18429d54929a99592k267q3296J30151A51616g3988J677I157a68155p5258g1712
18417B59231o2924J92930a72162A47775F515b29530J11191j17061j24748a68169
18406d9841n0375j9551d0822r383B63770D4372N1516A2985J6747d6630A63782
18394a45039q1201K7943A36803b9037C06707A17996K65828a29979G373J96705
$$ plain form
18475 -210239 -214253 -114638 -314680 241016 72179 161600 -361592 -146180 61962 12236 105477
18464 105477 -236704 -75736 160390 -138705 -281787 -88483 7304 -72505 131282 -170644
18453 109244 -57513 -83367 50167 74447 50285 4358 -4993 131977 158725 123253 -53617 -244587
18441 -244587 -317871 89958 189567 -190599 4317 6513 170852 121758 -71169 -447388 5353
18429 -454929 -199592 -201859 -285155 -155004 151616 -73988 -72311 9157 -168155 -243413 -71712
18417 259231 196307 389237 -172162 147775 6515 -229530 -118339 -235400 -360148 -168169
18406 -49841 -100216 -119767 -40822 -50205 263770 44372 95888 12985 29732 -46630 163782
18394 -145039 -226240 -198297 136803 -29037 306707 117996 383824 -129979 7373 204078
18384B04078r283J3397a56211I9970C7445h5987A49592D1300a04941k51188F9378
18372c19978p7221h8300B74956A04058a2729D7115c03767i5901B3757c2774k22350
18361b55124b6485C0050J40335i1077b0996A39433a31256p9346J2058C7109a54268
18349A19404D9140c41598R8732b0406C37145c32894d9784B34497a23237E9599
18338F5715a51220I7663a04134L1k22568a11724k03884A52852a3479l52568A21426
18326b64315R2598h2904D9050d9083j7646j79761O9466J0245d1030k41272e108
18314b7647a0576B22073b40496B04569A3310a3976B21523f4257A33125B1756d8932
18302B1527N8155l5801K3718N2757Q3662E0113a3270C47071a36170d4332H150
$$ plain form
18384 204078 194795 208192 -156211 99970 37445 -85987 149592 41300 -104941 -356129 69378
18372 -319978 -397199 -88300 274956 104058 -12729 47115 -303767 -95901 23757 -32774 -255124
18361 -255124 -26485 30050 170385 -91077 -20996 139433 -131256 -210602 -198544 37109 -154268
18349 119404 49140 -341598 -242866 -20406 337145 -332894 -49784 234497 -123237 59599
18338 65715 -151220 97663 -104134 -104103 -326671 -111724 -315608 152852 -13479 -366047 121426
18326 -264315 -171717 -82904 49050 -49083 -66729 -246490 -177024 -166779 -41030 -282302 -5108
18314 -27647 -10576 222073 -240496 204569 13310 -13976 221523 -64257 133125 21756 -48932
18302 21527 79682 43881 67599 120356 204018 50113 -13270 347071 -136170 -44332 8150
18290c80382f1829D1686P5726E3812M3049h06j59303k39423J89356i7128L9533
18279e7595A28488Q2251L2588j6086a8903A09325f4918j63940D3531m802A9354
18267A33959a13917c0182A7789a75543j92346a00593l4860D4855i9107a3305F1607
18255I6716a95798b6794R72j6680l20401A51901i2534j27448C7449c46486b412
18243g8959a89H586L0681c51708i3961C1560c38598D9923Q5578k9939J24271J52966
18231C82799A23626b7702q4288E8532A7859K40453a69039b6713a2873j79584Q3542
18220a08915M0790D4242O1580D7090a04036I311a04458c4207A88602i3164k62249
18209c55413H3421a78431c8605A00780b17431h5587o2054F9307R1242F0458J799
$$ plain form
18290 -380382 -61829 41686 117412 53812 96861 -806 -160109 -399532 -210176 -97128 -57595
18279 -57595 128488 210739 243327 227241 -18903 109325 -64918 -228858 43531 38729 19354
18267 133959 -113917 -30182 17789 -175543 -367889 -100593 -135453 44855 -99107 -13305 61607
18255 96716 -195798 -26794 -25822 -42502 -362903 151901 -92534 -219982 37449 -346486 -2412
18243 -78959 -189 8586 39267 -351708 -93961 31560 -338598 49923 135501 105562 229833 382799
18231 382799 123626 -27702 -111990 58532 17859 258312 -169039 -26713 -12873 -192457 -108915
18220 -108915 -68125 44242 105822 47090 -104036 9311 -104458 -34207 188602 -93164 -355413
18209 -355413 83421 -178431 -38605 100780 -217431 -85587 -147641 69307 160549 60458 62257
18198F2257a22166q6513i5764j04066A02775e5116a8001G6128i2278M2596j5573
18187f5255I4501a95406g6605A44336d05598k1708f6299L01j937E04316j34321
18176C69995b88177A94393f8763c88A40467b15552A80739a36599A37601C2658
18165A80885a94929B2971M4395N1434R9241f4083B00223a74375r9572A59223M6710
18154B05933j02660a16493I0213a03932A01996c8182q8973e1121A35020n0656
18144H4364b09006j23207A24655e563o676n1262q256k3228D3662B0044b28293
18132b44827n5288J5266N7739B38085p0979d3326j32702P7011c0913m1943q8866
18121a61722A53448M7450c1187j89898P3077A86002g5259k18350A25359m2375
$$ plain form
18198 62257 -122166 -208679 -95764 -199830 102775 -55116 -18001 76128 -92278 -49682 -65255
18187 -65255 94501 -195406 -76605 144336 -405598 -427306 -66299 -65998 -67935 504316 369995
18176 369995 -288177 194393 -68763 -388 140467 -215552 180739 -136599 137601 32658
18165 180885 -194929 22971 67366 118800 218041 -64083 200223 -174375 -273947 159223 205933
18154 205933 103273 -116493 90213 -103932 101996 -38182 -127155 -51121 135020 84364
18144 84364 -209006 -332213 124655 -5563 -12239 -63501 -71757 -94985 43662 20044 -228293
18132 -244827 -300115 -284849 -227110 238085 167106 -43326 -176028 -99017 -30913 -72856 -161722
18121 -161722 153448 200898 -31187 -221085 -148008 186002 -75259 -293609 125359 82984
18111H2984b00127M7346B63384b50288b9388O249A2824L11228A28009b23136J1576
18100b11560h2892B13484b3377G7944a08211A6457K97502a40016C42012A47645
18089c48142a67303c1023j33976j51300i1792L2718B4399L68350F0065A3485J09712
18078A23197b20990A96719J006O7896B5909J02192A774b4848k06319j46791J47612
18067b30346A13730B4409c08987g9140B5576P5547d1646F0634B6230K62096a6184
18055C969a21060p6375l2415G3120a90769J2358h1335K4556r5037G2655a70671
18043B11077G1772A1227e09379A92697D2645P6248J2026o2513a35599A64177b36909
18031b42640L1711f5587B0908J8974J03460J74413G9544J9943q00b4828C9781
$$ plain form
18111 82984 -200127 -152781 263384 -250288 -29388 -23139 12824 324052 128009 -223136 -211560
18100 -211560 -82892 213484 -23377 77944 -108211 16457 313959 -140016 342012 147645
18089 -348142 -167303 -31023 -164999 -316299 -91792 -59074 24399 392749 60065 13485 123197
18078 123197 -220990 196719 197725 265621 25909 128101 1774 -24848 -231167 -377958 -230346
18067 -230346 113730 24409 -308987 -79140 25576 101123 -41646 60634 26230 288326 -16184
18055 3969 -121060 -197435 -229850 73120 -190769 -178411 -81335 -56779 -151816 72655 -170671
18043 211077 71772 11227 -509379 192697 42645 118893 130919 68406 -135599 164177 -236909
18031 -242640 -210929 -65587 20908 39882 143342 317755 79544 99487 98687 -24828 39781
18019C10823j47721e824A9603K14280a90417A5128b73537a4997p678k52373A13119
18007C3134a12108I0285M6289L353D8565L7369e592A09771N0596J28184a71076
17995C1273L6070K30832i2254H5485L70525A21315J45534a99899E8083a50582
17984b09977m2135o9923D6787J56910b1824k70397A44675a98744A13335E0092
17973a81688B37551L1726f9451C09013a38707A002O6380a04444J5806A6215K02005
17962B18220e3130A3613f7092A56314D2539d24933a21105n6451c9713j13886N8226
17951i5373L9089k11821J11727r582A61829A8555J44217e3318q5381K4235G0135
17939b1821B3748J18177K5393E0528i8275E45b45855B25939r5967b60067A48818
$$ plain form
18019 310823 163102 -5824 19603 233883 -190417 15128 -273537 -14997 -22675 -275048 113119
18007 33134 -112108 90285 136574 139927 48565 85934 -5592 109771 160367 288551 -171076
17995 31273 67343 298175 -92254 85485 456010 121315 266849 -199899 58083 -150582
17984 -209977 -252112 -322035 46787 203697 -21824 -292221 144675 -198744 113335 50092
17973 -181688 237551 269277 -69451 309013 -138707 1002 67382 -104444 -88638 16215 218220
17962 218220 -53130 13613 -67092 156314 42539 -424933 -121105 -177556 -39713 -153599 -95373
17951 -95373 -56284 -268105 -156378 -165960 161829 18555 162772 -53318 -138699 -114464 70135
17939 -21821 23748 141925 167318 50528 -98275 545 -245855 225939 129972 -260067 148818
17927G7089L63168a26303B75K35225d8982l2292c3262H3096O746b7740D1202A8546
17914a93202J6806C6746L925Q9313b01237e4216n154a6554B22639L6841b03240
17902b280k42883J02441A75958K624a4706B21812j10197J50441o7326K68337f5114
17890i8772G4731J43420a51289J47d9210G6101R8302b25537M5344a8290A84026
17878b08987A55667o0714J14700H2922J95701M6083b15964D89574a2223H5103
17867a7396j42880C54894A72514a612A66050a18650B88632A42098F0164b7473
17856a68468E913e4619B6871a23679D4329b80033d5576k69410I4520P7363k7806
17845A44077b5604j05683B87742A06649a99874E49792b0343I9864d4183C46530
$$ plain form
17927 77089 440257 -126303 275 235500 -48982 -81274 -33262 83096 89842 -27740 41202 18546
17914 -193202 -176396 36746 40671 129984 -201237 -54216 -59370 -16554 222639 259480 -203240
17902 -2280 -245163 -142722 175958 178582 -14706 221812 111615 262056 194730 463067 -65114
17890 -98772 74731 218151 -151289 -151142 -49210 76101 174403 -225537 -180193 -18290 184026
17878 -208987 155667 94953 209653 82922 278623 324706 -215964 489574 -12223 85103
17867 -17396 -160276 354894 172514 -1612 166050 -118650 288632 142098 60164 -27473
17856 -168468 5913 -54619 26871 -123679 44329 -280033 -45576 -314986 94520 171883 144077
17845 144077 -25604 -131287 287742 106649 -199874 549792 -20343 99864 -44183 346530
17834b4544C6772P535A7835L16901b85823d4496I4538b11038A63346J23J29403
17823B92872j16628q7237J0364h510H9455Q851R2340h2290r8912e0580A52740
17811G3701a16667E4375M2690i9932B29219B9571a15526A38321P3161a69283B3665
17799a62757C4235K58775A06963K3044P7648l8768a3076E7376A5125h895C6171
17787B6837a3867A70058q0102a75303k3042Q9818c2720j28669G0022H188O8819
17776G7007m325h0151j26145F3888M4080k6978c5645C79600I732K12965I9336
17764d191j01800C64692a95720k5625Q5932A73926M2084p4617j5304D7285c00687
17752A65544R3696F3008H583J08890J92214g1978k63656A84134J35031j44214
$$ plain form
17834 -24544 36772 44307 17835 334736 -285823 -44496 94538 -211038 163346 163469 292872
17823 292872 176244 89007 99371 -8510 89455 98306 190646 -82290 -181202 -50580 152740
17811 73701 -116667 54375 97065 -99932 229219 29571 -115526 138321 211482 -169283 23665
17799 -162757 34235 293010 106963 130007 207655 168887 -13076 57376 15125 -8895 36171
17787 26837 -13867 170058 89956 -175303 -198345 -108527 -32720 -161389 70022 8188 77007
17776 77007 72682 -80151 -206296 63888 107968 80990 -35645 379600 9732 222697 99336
17764 -4191 -105991 364692 -195720 -221345 -135413 173926 216010 141393 126089 47285 -300687
17752 165544 259240 63008 8583 117473 309687 -71978 -335634 184134 319165 174951
17742A74951J69426e5151A68723J17443h3759E7662a67023A60570a23887B4519
17731B53460j12887A8455J16196J95274a85745f0629A0331J60671F8227K2120
17721I0347a3339p6234d029k95338H1048R5840D7478a54039I918i3722B12969
17709a99569B2654b9662B89201A2055b21658f9309B90365a4667D2206P5598a22059
17697e3680B72304a24242A18694D53K21381Q6902B4117K28581b17306A78097b76308
17685a39804C29662C6263M00085a28571B30026B5593K01518N9267o8621r0913
17675A26844J20869F5744N3731J39964j03903m7903M7102c553B73776I3634I573
17663b31847D89935a61336B74676p9369D6569J55403a00806A0664M51131A66612
$$ plain form
17742 174951 344377 -55151 168723 286166 -83759 57662 -167023 160570 -123887 24519
17731 253460 140573 18455 134651 329925 -185745 -60629 10331 171002 68227 90347
17721 90347 -13339 -89573 -4029 -299367 81048 176888 47478 -154039 9918 -93722 212969
17709 -199569 22654 -29662 289201 12055 -221658 -69309 290365 -14667 42206 117804 -122059
17697 -53680 272304 -124242 118694 453 221834 308736 24117 252698 -217306 178097 -276308
17685 -139804 329662 36263 436348 -128571 230026 25593 227111 286378 217757 126844
17675 126844 247713 65744 119475 259439 155536 107633 154735 -3553 273776 93634 9573
17663 -231847 489935 -161336 274676 195307 46569 201972 -100806 10664 461795 166612
17652A56561p2610K03316B2030K41958a01975c2106q7000D8828c4106H163K67194
17641B75357D9930J45139E2625a21286A83867j8976m3985k0841b62559B2612a49364
17629A39815D4987Q6904A8190J93381a52657E0692L13364b74298b2330A04574
17618A95228j1811J67311D6276N4188d8846A89398e718j16203C35670j11763d2745
17606A36379J86048p3520R389D1781J78570r663H6757K02800a14609B99070l7728
17595B61342a12501A70684e6899l0418A00333K02452j04036G2332J13282m2412
17585A43202D0817b1882F9464P7896G330K88165R2467j71260a12949A84278j0861
17574A73417O1576j4014K55178a00468C40805D638J42064J29776j00726D0517
$$ plain form
17652 156561 83951 287267 22030 263988 -101975 -32106 -119106 48828 -34106 8163 275357
17641 275357 49930 195069 52625 -121286 183867 164891 120906 100065 -262559 22612 -149364
17629 139815 44987 131891 18190 211571 -152657 50692 364056 -274298 -22330 104574
17618 195228 183417 350728 46276 100464 -48846 189398 -5718 -121921 335670 223907 -42745
17606 136379 322427 248907 258296 41781 220351 210688 86757 289557 -114609 299070 261342
17595 261342 -112501 170684 -56899 -87317 100333 302785 198749 72332 185614 143202
17585 143202 40817 -21882 69464 147360 7330 295495 387962 216702 -112949 184278 173417
17574 173417 234993 220979 476157 -100468 340805 4638 146702 276478 175752 40517
17563B6192J79834J49454j37678j7167a01745C41308Q8531A38116J59184h5962
17552b38299Q4395C25580c16200h787B17701L5889A04302L33550j06618A07186
17541A63736l9707d5840D43510j75759E6639N9454L09917j36786D3667J6689N121
17530F5477J78600J53127C1711a9927C03692d716A11622a11606F2481K57930J0597
17519C31008j41997J2938M0570N2038j08614K63248O45l107L26144k97677J27097
17508F02293M00664n5211M5309l05469k36938A70058K26326K69770B10762J64306
17498C75068K42375j62241k09512K94177P14M9328J26588o4350C19867J50943
17488D70810k00860J97699O3010B10602a1043F4717K27773H4906K05083n7179
$$ plain form
17563 26192 206026 355480 217802 200635 -101745 341308 429839 138116 297300 -85962
17552 -238299 -153904 325580 -316200 -8787 217701 253590 104302 437852 331234 107186
17541 163736 124029 -45840 443510 267751 56639 116093 426010 289224 43667 60356 65477
17530 65477 244077 397204 31711 -19927 303692 -4716 111622 -111606 62481 320411 331008
17519 331008 189011 201949 242519 294557 185943 449191 449836 446729 772873 475196 602293
17508 602293 1002957 947746 993055 687586 450648 170058 396384 666154 210762 375068
17498 375068 617443 455202 245690 539867 540581 589909 716497 652147 319867 470810
17488 470810 269950 467649 530659 210602 -11043 64717 292490 84906 289989 232810
17478B32810A14980K43239K15396j15843q108E0362K50873j40839M21177j55888
17468D25685j98062O7000M96429k99262C6670o612M87656A99029J02622m119J05189
17457D02721C6686J92882N4110r2123P3466F2853K18475J27363b6812H3646a24824
17445H55160A49992K85284j93343j02970J38162p9349L76620r0667k7028j20482
17435C36219j30931J02117P5403J63525G9123O07545n3170N0523j51699j28429
17425D03893J17037j25924J34253k33352J02930J65792a02985E28070B10130A04140
17414A16416J93114n4124O0894j18467K2958Q962k2611K71407k31776o0771K32930
17403D18932K58970B82992G4771N34956j67564A10973P3036M5030J83967H0332
$$ plain form
17478 232810 114980 358219 573615 457772 449664 50362 301235 160396 581573 425685
17468 425685 227623 294623 791052 491790 36670 30058 517714 199029 301651 297532 402721
17457 402721 36686 229568 283678 191555 265021 62853 281328 408691 -26812 83646 -124824
17445 855160 149992 435276 241933 138963 277125 197776 574396 483729 456701 336219
17435 336219 205288 307405 382808 546333 79123 686668 633498 684021 532322 403893
17425 403893 520930 395006 529259 295907 398837 564629 -102985 528070 210130 104140
17414 116416 309530 255406 316300 197833 220791 229753 207142 478549 246773 186002 418932
17403 418932 677902 282992 74771 609727 442163 110973 184009 229039 413006 80332
17392I6412K19224J915r7838A03175J69294E7911J64015n8949J67339M2712p5784
17381B97244A431J31953J72853K11101m2502A36882O9153M21202k85966J7626
17371C58897O7572k9575p458j80164J634g6179C04232J15171J73527k46423M7299
17360C93806j39284Q011L3535k8516R9854m6066A37019P0002M61469B18424J20377
17349C38801J46643n5026j01442F0214h5529A71459L02310M5257A58856K64950
17339D23806j75078J17793R4682j60675j42463L15701C6622N73357j15580B9420
17328a40263B68723J35064m2422A56576o5143L77400H9924L80063A54054Q1866
17318B35920K2239J48229A1871M5505b2018F68047B23415K69208j45175A38723
$$ plain form
17392 96412 315636 317551 219713 103175 272469 57911 221926 162977 330316 373028 297244
17381 297244 1431 133384 306237 517338 474836 136882 206035 627237 341271 358897
17371 358897 426469 396894 389436 209272 210906 -76179 304232 419403 592930 346507 393806
17360 393806 254522 262533 296068 267552 367406 321340 137019 207021 668490 218424 338801
17349 338801 485444 430418 328976 60214 -85529 171459 473769 519026 158856 423806
17339 423806 248728 366521 461203 300528 158065 473766 36622 609979 494399 29420
17328 -140263 268723 403787 361365 156576 91433 468833 89924 469987 154054 235920
17318 235920 258159 406388 11871 57376 -22018 668047 223415 492623 347448 138723
17307C73184j81646I3246L77732n9743b1479E45664A65735K73587B06918n0797
17297A56121J47148I3668K19002j2499K66570A19899R4262J47068I3443L80422
17287D73865Q6104k65529K12090E9131M09320j13245J8021q9718J12361A86254
17276B55035G3740J88912J26059j24833L6130J13445J62872B83087J10750P6063
17266D69900j84907j30028M14893n6265J63865b179C37576F3681K86852D3260
17255C46949J65707A52940J08799p4305L67620A84338L31615l8695A97602P2506
17245B70108L4010O4765K2735A36422L53356k13829l8326r8472K04061L6384J867
17234C81463K8678A70385m774M69707k01125n0597M9287j89885Q713J28401R3057
$$ plain form
17307 373184 191538 93246 470978 411235 -21479 545664 165735 439322 206918 156121
17297 156121 303269 93668 312670 300171 566741 119899 214161 361229 93443 473865
17287 473865 559969 294440 506530 59131 468451 355206 373227 283509 395870 186254
17276 255035 73740 262652 388711 263878 300008 413453 576325 283087 393837 469900
17266 469900 284993 154965 569858 513593 677458 -2179 337576 63681 350533 43260
17255 346949 512656 152940 261739 187434 555054 184338 515953 477258 197602 270108
17245 270108 304118 368883 391618 136422 489778 275949 237623 139151 343212 379596 381463
17234 381463 410141 170385 165611 635318 434193 383596 432883 242998 251711 380112 473169
17223D73169B29069J78155j73630N992P8021J79904J67502k55978F7533J23632
17213A91165L24244B43551J63146A23888D7783L04976N2555j48766O4175J79684
17203E00407j18468E705K43762M24853C29271J62454K10875k95089l7576N3743
17193D23678M1261k04077j24252K04250K35094J118r3479J05539j15071n5791
17183D18270j93415M40975l29333K34425N0487j95855J27282k4249k7864K417
17173E03140k0013p1241j41789M42786o7878k32319M39357l98853A70992J18800
17163B89792K15119j29320n6620M4198j2650J42206j03771n7360K2041l7338q915
17152C07382K62171G6490J09453L66683j200k9363J25042j38686J38477O8303
$$ plain form
17223 473169 229069 407224 233594 239586 317607 497511 665013 409035 67533 191165
17213 191165 515409 243551 406697 123888 47783 352759 405314 256548 320723 500407
17203 500407 381939 5705 249467 674320 329271 491725 702600 407511 369935 423678
17193 423678 464939 260862 136610 340860 575954 577072 483593 589132 474061 418270
17183 418270 224855 665830 336497 570922 621409 425554 552836 528587 500723 503140
17173 503140 483127 411886 270097 712883 645005 412686 852043 453190 170992 289792
17163 289792 504911 375591 318971 363169 350519 492725 388954 331594 353635 316297 307382
17152 307382 569553 76490 185943 552626 551426 522063 647105 508419 646896 715199
17142G15199j13661k74372K53278M3337J1117q5283k49561N12887j95564j00920
17132E16457N5507j38103M74425j91807l14397L62888j51385q5976j00787L85862
17122H12684j20759K7485r0297J63012C44067M9718j06420J62482P9098R7163
17112F26108j9385k13976K63716j12614J65953l06612M01045C59111L96168J88581
17102I43860m68423K84989L77617m80079P3066O5216K7672p2096J19038l98149
17092D72711P4832K02408K3248C35890l9658K20824L45818k04716O0762J50562
17082H69482k9328j75572J16390k32581K35867K46111m0785j08945q0221k13595
17072E86823L03686j05892B52953O21343r4833o5992P7572k09562j40667L99539
$$ plain form
17142 715199 601538 327166 580444 623781 634898 549615 300054 812941 617377 516457
17132 516457 571964 433861 908286 716479 402082 764970 613585 527609 426822 812684
17122 812684 691925 719410 629113 792125 344067 393785 287365 449847 528945 626108
17112 626108 606723 392747 656463 543849 709802 403190 804235 359111 755279 943860
17102 943860 475437 760426 1138043 657964 731030 796246 823918 751822 870860 472711
17092 472711 547543 749951 773199 335890 296232 517056 862874 658158 718920 869482
17082 869482 840154 664582 780972 548391 784258 1030369 989584 880639 800418 586823
17072 586823 890509 784617 252953 874296 779463 713471 791043 581481 440814 840353
17062H40353M5411l48652M36072l7234j22707l53704L32460p0697n384r6864J94796
17051H13850J80679l42687q541L04041M68J68396m36774j9815J36538K40476D11369
17039I24210k98580L86085j429j67930J01631m7627K14648q0931R011n7815k78158
17028G03115J8083j14926N20503K226m95966K86235k0526K91884M1664k52294
17018I79998J43679k87370K61205m11946O41333m69396L13995P4816J07585k31241
17008A122658j15922r0766K17911k88882k0028m9613L84865P598j4769R8727l85582
16997H66197p5258K58298J05319O1360k03764L53577o07756J81447r5259J53846
16987I98007K60384k58034L08334j21095J99645j27098J53994j62299O715k01893
$$ plain form
17062 840353 885764 537112 973184 935950 813243 459539 791999 721302 715918 619054 813850
17051 813850 994529 651842 643301 947342 947810 1116206 679432 659617 796155 1036631 411369
17039 924210 625630 1011715 1010286 842356 943987 896360 1111008 1030077 1039088 981273 703115
17028 703115 721198 606272 1126775 1129001 633035 919270 898744 1190628 1232292 979998
17018 979998 1123677 836307 1097512 685566 1326899 857503 1171498 1246314 1353899 1122658
17008 1122658 1006736 915970 1133881 844999 824971 775358 1160223 1167821 1153052 1251779 866197
16997 866197 790939 1049237 1154556 1215916 1012152 1365729 757973 939420 844161 998007
16987 998007 1258391 1000357 1308691 1187596 1387241 1260143 1414137 1251838 1258553 1056660
16977A056660L67939N358R6815k68075q5662J76395O9720k62643M80708m93631
16967A143584J82811l77064N75213J9699J46907k72331J37878k86492k7991J13902
16957A356116j6955M5698j15992M5749K61784m2698J46539j48014l32552O0297
16947A259972N95817j68973k8491l02072K37481o5075l7362K50177N3517k32804
16937A562187P5412R8067L6644J55478j20235m5489M32492m55693K45910l87618
16927A597155K05809P0635k74656M14313j81843K54915o1250k888l1570K43449
16917B234069o33930O86623l7728q1878J9451j72199j31637M17054l80584n1426
16907A867815M66267m1011J02123J86016k48654Q892P2098l13968L48886O0786
$$ plain form
16977 1056660 1424599 1429957 1526772 1258697 1173035 1349430 1419150 1156507 1637215 1143584
16967 1143584 1326395 949331 1524544 1544243 1691150 1418819 1556697 1270205 1242214 1356116
16957 1356116 1339161 1384859 1268867 1314616 1576400 1533702 1680241 1532227 1199675 1259972
16947 1259972 1855789 1686816 1658325 1356253 1593734 1528659 1491297 1741474 1794991 1562187
16937 1562187 1637599 1735666 1772310 1927788 1807553 1762064 2194556 1738863 1984773 1597155
16927 1597155 1802964 1873599 1598943 2013256 1831413 2086328 2025078 2022190 1990620 2234069
16917 2234069 1600139 2286762 2249034 2167156 2186607 2014408 1882771 2299825 1919241 1867815
16907 1867815 2334082 2293071 2395194 2581210 2332556 2341448 2413546 2099578 2448464 2509250
16897B509250r7195K58913j02564k83862K87457P1202J94375J19598j44216r2916
16887B720042J06662k09220M02853n2022q8458j05744P8974K60251k62434O78078
16877C528982j47360l38029P15229p76170K68767J01700N5664k8006R1625K4999
16867C497401k26384M33839q0566j74522O5485R5775K39479K2848J45566m44389
16857C574532J90342m4423n801K55975L57923l49893K60353K30001j71228L79680
16847D677461m85241L37035K46211J30461L22896k63840n7087L22766m62964N39920
16837E307618k11332J14208k19892K93782K19392n458J54767k13943K45630K56002
16827E940774r4159M24620Q0439k99790M91924M7129K95910k75079K52566L39682
$$ plain form
16897 2509250 2412055 2670968 2568404 2284542 2571999 2643201 2837576 2957174 2812958 2720042
16887 2720042 2826704 2617484 3020337 2968315 2879857 2774113 2853087 3113338 2850904 3528982
16877 3528982 3381622 3043593 3758822 2982652 3251419 3353119 3408783 3380777 3472402 3497401
16867 3497401 3271017 3704856 3624290 3449768 3515253 3611028 3850507 3873355 4018921 3574532
16857 3574532 3764874 3720451 3714650 3970625 4328548 3978655 4239008 4469009 4297781 4677461
16847 4677461 4192220 4529255 4775466 4905927 5228823 4964983 4907896 5230662 4767698 5307618
16837 5307618 5096286 5210494 4990602 5284384 5503776 5498318 5653085 5439142 5684772 5940774
16827 5940774 5846615 6271235 6351674 6051884 6543808 6590937 6886847 6611768 6864334 7204016
16817G204016o0050L67646j1890r2372L29605l54909L34961L26035n1069l7657
16807G954316O44966L26512j45218R381M42485L05420K69343n2809o6344M16677
16797A0104729m9726N27034J62792m7117N53096m45295O67936N06137l8456O81557
16787A2622687K91085K17171J76376P96773p5424K10101P06851L98878K81135
16778A5625633Q8796N24674L71044M07251N78227N70712N55537K67569P73040
16769A9762483O44134k02235J270114M11663Q33996O00243P61523O03591R21249
16760B5606761N83460P39430J200439R99109R80655O56211J564887Q48849J171915
16751C4351716J116789J153135J666993J604787J125165J733657J740475J509126
$$ plain form
16817 7204016 7143966 7511612 7499722 7407350 7736955 7382046 7717007 8043042 7991973 7954316
16807 7954316 8599282 8925794 8780576 8789957 9232442 9537862 9807205 9754396 9688052 10104729
16797 10104729 10055003 10582037 10744829 10697712 11250808 10805513 11473449 11979586 11941130 12622687
16787 12622687 12913772 13130943 13307319 14104092 14028668 14238769 14945620 15344498 15625633
16778 15625633 15714429 16239103 16610147 17017398 17595625 18166337 18721874 18989443 19762483
16769 19762483 20406617 20204382 21474496 21886159 22720155 23320398 24081921 24685512 25606761
16760 25606761 26190221 26929651 28130090 29129199 30109854 30766065 32330952 33179801 34351716
16751 34351716 35468505 36621640 38288633 39893420 41018585 42752242 44492717 46001843
16743D6001843J685739J614488K186286K317158K185085J907702K380455K668583
16735F2947339K476932K571961L127833K994489L018795L143940K994376L885642
16727H7161307L333778L573551L775877L561573M178729L626347L864690L648252
16719A16724104L967053L486614L572860L317761K919063L231379K181566K645802
16711A42046202J215777J730523J125890K74455l9063o41364j063913j055514
16703A43592993j740551k213508k889536k672450l313449l310013l735675l736506
16695A19981305l868745l996782l553353m188389l408086m252176l865732l243148
16687H9604894m006399l108598l504798l584457k841538l033011k971315k634926
$$ plain form
16743 46001843 47687582 49302070 51488356 53805514 55990599 57898301 60278756 62947339
16735 62947339 65424271 67996232 71124065 74118554 77137349 80281289 83275665 87161307
16727 87161307 90495085 94068636 97844513 101406086 105584815 109211162 113075852 116724104
16719 116724104 120691157 124177771 127750631 131068392 133987455 137218834 139400400 142046202
16711 142046202 143261979 144992502 146118392 146392847 146353784 145712420 144648507 143592993
16703 143592993 141852442 139638934 136749398 134076948 130763499 127453486 123717811 119981305
16695 119981305 116112560 112115778 108562425 104374036 100965950 96713774 92848042 89604894
16687 89604894 85598495 82489897 78985099 75400642 72559104 69526093 66554778 63919852
16679F3919852k533699l009651j647000k890048k029036k061407j905455j749511
16671D6094045j776764j880833j794017j116210j893558j242370j469467r94874
16663C3925952j150820j488915p72431j436002j010923p31638r61473q55622n88960
16654B4929168j079462o93948o31571n99484o60759q44098m59745p58744o34675
16645A8566682l13905l67411n73039m16318n48819q37287j46209M2280p24634
16636A4681340m27372m68073j82119n12695N7695o71256j18412j89628o88038
16627A1481442o4616m23478j24802l4814o91754q8407k27303k11640R737k37768
16617I386597k45246m58916K43786m45825j59528K82907n67009R3136j50177l30910
$$ plain form
16679 63919852 61386153 58376502 56729502 53839454 51810418 49749011 47843556 46094045
16671 46094045 44317281 42436448 40642431 39526221 37632663 36390293 34920826 33925952
16663 33925952 32775132 31286217 30513786 29077784 28066861 27335223 26373750 25518128 24929168
16654 24929168 23849706 23155758 22524187 21924703 21263944 20419846 19960101 19201357 18566682
16645 18566682 18252777 17885366 17312327 16896009 16347190 15509903 15363694 15405974 14681340
16636 14681340 14253968 13785895 13603776 13091081 13148776 12477520 12359108 12169480 11481442
16627 11481442 11416826 10993348 10868546 10833732 10141978 10053571 9826268 9614628 9624365 9386597
16617 9386597 9141351 8682435 8926221 8480396 8320868 8603775 8036766 8129902 7979725 7648815
16607G648815k99435k79516o1855l22441J6086O246N7639j65078j83026m48089
16597E969346J99685J31161n31867O9497J62012m88797j86232P1564k29416J65242
16587E332195j28854J73276o13625L19066n1470l96860j10635o9637N0776k17944
16577D286288K48512q2217l65987J07406K88913l33383j41756r6179j32314K05623
16567C984906j56211n1631K16161m60954l0304j62514M38045m88396K15113m71994
16557C032221K71844l33839M16606n42051N25069k99673o0987Q1453k64924J06816
16547B932535j2711j99231O3680K79596j91428m14102K03513n7364L3542j66417
16537B471613K69577j92674J04603j17244p373o5493k31027L82247m89261J87088
$$ plain form
16607 7648815 7349380 7069864 7008009 6685568 6701654 6707900 6765539 6600461 6417435 5969346
16597 5969346 6169031 6300192 5768325 5837822 5999834 5511037 5324805 5396369 5166953 5332195
16587 5332195 5203341 5376617 4762992 5082058 5030588 4633728 4523093 4453456 4504232 4286288
16577 4286288 4534800 4452583 4086596 4194002 4482915 4149532 4007776 3911597 3779283 3984906
16567 3984906 3828695 3777064 3993225 3532271 3501967 3339453 3777498 3289102 3504215 3032221
16557 3032221 3304065 2970226 3386832 2844781 3369850 3070177 3009190 3090643 2825719 2932535
16547 2932535 2919824 2720593 2784273 3063869 2872441 2458339 2661852 2604488 2638030 2471613
16537 2471613 2741190 2548516 2653119 2535875 2528502 2463009 2231982 2614229 2124968 2312056
16527B312056K41213k06352k65243P2092j54548P3343q013q910K66814m08546
16517A913906k0421J83225k06125q7386J2087K90742j61751J45470j76989o2139
16507A830619m76230L17792K8096l14624P38469n07880J75857J80460l84001l2603
16497A555955r3422M8746p2921L67856j08444q8548L6585j55710j47685M0283
16487A382695L91694k84342P4557l54742K69841k1463j64014J5378N1261L29391
16477A690256k79681l94719K80430N0261k42466J33184J13863j12545M5092k30124
16467A053551K28183q1789R80k66966K74697j15972J4123N68J06673J30003j53217
16456A190834q5685j33278J00251M2231J39052k31023J69913j06831j28724j37144
$$ plain form
16527 2312056 2553269 2346917 2081674 2153766 1999218 2072561 2064548 2055638 2322452 1913906
16517 1913906 1893485 2076710 1870585 1783199 1795286 2086028 1924277 2069747 1892758 1830619
16507 1830619 1354389 1672181 1700277 1385653 2124122 1616242 1792099 1972559 1588558 1555955
16497 1555955 1462533 1511279 1438358 1806214 1697770 1609222 1645807 1490097 1342412 1382695
16487 1382695 1774389 1490047 1564604 1209862 1479703 1458240 1294226 1309604 1360865 1690256
16477 1690256 1410575 1015856 1296286 1346547 1104081 1237265 1351128 1238583 1283675 1053551
16467 1053551 1281734 1199945 1200925 933959 1208656 1092684 1106807 1107375 1214048 1344051 1190834
16456 1190834 1105149 971871 1072122 1114353 1253405 1022382 1192295 1085464 956740 819596
16446H19596j78352O38554k71469j34058N1004K91970l69034K88232K34876m09060
16436I62259L27447n19249L79678j82354L9198p8823J2942O8896j5398l05626
16426F88970K25468J20364l54407M4618J70200o2194j38187J43588J59455P1858
16416A069733j91390J08286C62028R2999L8465O1690J40093q2298J75371J84519
16406I72867j36341n2000K94785j35073J00042l13684l518J2647L9534q3056l5607
16395F60596j33994k7822K92480Q1389J3771j84800J22983Q9966m00649K54327
16385G68247C77273M77405O0241B60836N91787J58879l86025o8914L76987l40991
16375E92559K28528m9631J038j59506j31367B7755N58300K66845j15664J06750
$$ plain form
16446 819596 641244 1279798 1008329 874271 925275 1217245 848211 1136443 1371319 962259
16436 962259 1289706 770457 1150135 967781 1006979 928156 941098 1009994 994596 688970
16426 688970 914438 1034802 680395 725013 895213 833019 694832 838420 997875 1069733
16416 1069733 878343 986629 362028 455027 493492 555182 695275 612977 788348 972867
16406 972867 836526 784526 1079311 944238 1044280 730596 727078 739725 779259 696203 660596
16395 660596 526602 498780 791260 872649 886420 701620 824603 914569 513920 768247
16385 768247 377273 854678 914919 260836 852623 1011502 625477 556563 933550 592559
16375 592559 821087 771456 772494 612988 481621 27755 586055 852900 737236 843986
16365H43986l38224n4953N6087J23659k46887K16497j69135K95637O0597j26439
16355F60825j39480O0869m5115k18707K69247m7140A86074N89411p793B99721
16344G93928l45930L17822j51443j76490j95741L18814k24503l0471K52216P8047
16334F36249j92918R1633M0774L00558k27606k56378j03334J2140J36107k01342
16324B35883L46894n3332A97340K51122J4468J32754B47806L44763j56688Q2891
16314E18772N4493A94792K25090L30185j20145B77123o0175L36912j25304M0039
16304D68595A48867L43681j6365k19632J12856l6170a5237A90392o6935K56044
16294C79501P3767B06063M39547B91803J30921p8238K30898k60052J03399A49498
$$ plain form
16365 843986 505762 450809 506896 630555 383668 600165 431030 726667 787264 660825
16355 660825 521345 582214 537099 318392 587639 540499 186074 775485 767692 299721
16344 793928 447998 765820 614377 437887 242146 560960 336457 305986 558202 636249
16334 636249 443331 534964 575738 876296 648690 392312 288978 301118 437225 235883
16324 235883 582777 529445 197340 448462 462930 595684 247806 592569 435881 518772
16314 518772 573265 194792 419882 750067 629922 277123 216948 553860 428556 468595
16304 468595 148867 492548 476183 256551 369407 333237 -15237 190392 123457 379501
16294 379501 453268 206063 645610 291803 422724 344486 575384 315332 418731 149498
16283C43887j1306A38618L89357j91275J70594B21260J38346K17840K658k04665
16273C75439R3363k16084L40659k83847j21294J88661K1803A33679M09092J17624
16263F60395A01937J01175J65184A52497A9208J50057K68522K73275j73248B41887
16252C68807A28353K19472o0707M902K5431A53132k0346O7089O0722K3696j1809
16241B72484n4560J07134N2534K402G5825J59547J15663j10188r5819K6129E2949
16229C44163g898B79532A7164K96240A44943K03696A03202A3882K57995l7869
16219B34008N4275P541J01202J52267j48672j71114O9606j35217K40709a12275
16208A16769a24649G5928L31704A66171O5826P6457a72603D54925J08169c3422
$$ plain form
16283 343887 332581 138618 527975 336700 507294 221260 359606 577446 580104 375439
16273 375439 468802 252718 593377 309530 188236 376897 398700 133679 542771 660395
16263 660395 101937 203112 368296 152497 19208 169265 437787 711062 537814 241887
16252 368807 128353 347825 287118 292020 317451 153132 132786 199875 260597 284293 272484
16241 272484 217924 325058 377592 379994 75825 235372 351035 240847 145028 171157 52949
16229 344163 -7898 279532 17164 313404 144943 348639 103202 13882 271877 234008
16219 234008 288283 295824 397026 549293 400621 229507 299113 163896 404605 -112275
16208 116769 -124649 75928 407632 166171 231997 308454 -172603 454925 563094 -33422
16197d2163B41164e6401A43466K24835j80135e2940A2604J2666J41971A2757e6645
16185A77006a09119B1586J31318b4296C44602F8579b0560A089K43416m4671F3536
16173C66259A68126K46310A03306i890A36579F3233J32657E8881n929J25840G2504
16161D0317K17052j15944j2695R8225b0B48799b8318N743k26786A04779G372P4531
16149H1903N5512J71422a47981B6832N73814j98996A02803E0815a52389B77207
16138C08429H3928N1851K10435b0798c786A06705d0438H5777L49713A31718r690
16127A22028i4203K9847C3924a41429n7305h4112D3184J59908K45248A07579a10138
16115f243A35266b1377A46342L64500a53584a541C02545o2377C1531c6091A44704
$$ plain form
16197 -42163 241164 -56401 143466 368301 188166 -52940 12604 25270 167241 12757 -56645
16185 177006 -109119 21586 152904 -24296 344602 68579 -20560 1089 244505 199834 63536
16173 366259 168126 414436 103306 -9890 136579 63233 195890 58881 52952 178792 72504
16161 40317 257369 141425 128730 226955 -20 248799 -28318 -22575 -249361 104779 7372 81903
16149 81903 137415 308837 -147981 26832 600646 401650 102803 50815 -152389 277207
16138 308429 83928 135779 346214 -20798 -3786 106705 -40438 85777 435490 131718 122028
16127 122028 -94203 -64356 33924 -141429 -198734 -84112 43184 203092 448340 107579 -110138
16115 -6243 135266 -21377 146342 510842 -153584 -1541 302545 240168 31531 -36091 144704
16103c28287f9218e778F5350Q8301f2319j14478B65562a80238C08116a45418E5082
16091A99723a24162A0097f8102k15464E20353I1511f9752a613q1340A00458M4620
16080A45078F7612a86825B03140E8967a07116A95199a62264B95424H5665d25769
16069B28960L4370A0160O4711g9828A04366b55575C58330A29867a28210N2456
16059g5754A46291p859A836b75016a25977A78418E0741J42274j9841m5133B9150
16047C7700e0922G81K2694a14315N3107J897j08021A3901a051j18354e7437A22123
16034a79186C43752A32328c4405D872I62J80558G1040l0252b9235A65828E2521
16022B01557l5066A3351J15345R6676H5608N0434a72971C52319j37337A8030K93237
$$ plain form
16103 -328287 -69218 -5778 65350 153651 -62319 -176797 265562 -180238 308116 -145418 55082
16091 199723 -124162 10097 -68102 -283566 520353 91511 -69752 -1613 -82953 100458 145078
16080 145078 67612 -186825 203140 58967 -107116 195199 -162264 295424 85665 -425769
16069 228960 263330 10160 74871 -79828 104366 -255575 358330 129867 -128210 -75754
16059 -75754 146291 138432 1836 -275016 -125977 178418 50741 193015 173174 128041 29150
16047 37700 -50922 781 23475 -114315 -61208 -59311 -167332 13901 -1051 -119405 -57437 122123
16034 -179186 343752 132328 -34405 4872 962 181520 71040 40788 -29235 165828 52521
16022 201557 166491 13351 128696 225372 85608 136042 -172971 352319 214982 18030 311267
16011C11267A54827J16582i2409A53138m8454d9890A84090E6387c08030J51061
16001a56969C2397i0683A1033k390L63600b7469j91239f5029D01723b91081J10423
15990a80658C0004J20263L6415g9395H0576c07338B11974b04581Q7832A36327
15979C41958A32403a65386B61988a45373a7094K399l5590D34304J08156J22422
15969F64882J23504o8573J08478l7852m0754j02658B06561M4243L5782a84949
15958A73555N5054D3365O4179J36333c2026A42592o8640b11220B07787c183B14836
15946c31750a5774r0123o5099N0413B6772a42989B04709B9646a06584o6462D6513
15934D1432c5441C3756h4783A27562b82661K5637F9151a63762e8024A31325h5057
$$ plain form
16011 311267 154827 271409 -92409 153138 104684 -49890 184090 56387 -308030 -156969
16001 -156969 32397 -90683 11033 8643 372243 -27469 -218708 -65029 401723 -291081 -180658
15990 -180658 30004 150267 186682 -79395 80576 -307338 211974 -204581 -116749 136327
15979 341958 132403 -165386 261988 -145373 -17094 -14695 -50285 434304 542460 664882
15969 664882 788386 719813 828291 790439 749685 647027 206561 250804 286586 -184949
15958 173555 228609 43365 107544 243877 -32026 142592 73952 -211220 207787 -3183 214836
15946 -331750 -15774 -105897 -170996 -120583 26772 -142989 204709 29646 -106584 -173046 46513
15934 41432 -35441 33756 -84783 127562 -282661 -257024 69151 -163762 -58024 131325 -85057
15922a79667p6651l058L7416i1251F3968K3068M1702i1666A64990a51919A47935
15910i6096l37502A63969J17424B9810e6699I5152N948d38530B14950E9161b99313
15898g4244k2448G4634a41229j088j35981J26953I5632a13056k06030H394b00394
15886b45362J06219g282j13242F7253e1548B30897d4299O077A64533b3674k6473
15875e0147B7938Q2896c64632H4178a47705A25195a28654D5530M1973a3169A82872
15863A36737J5866p4417a89014f6610F6681e9702j04512D5965e5935o774D2114
15851A99556i1541F658b26871j81388J74459b5147j2035m78377e1698k30959f8605
15839b56881B66415a86746B65156L8370a71701J3403b4582A7510c1176q0992A71619
$$ plain form
15922 -179667 -256318 -259376 -221960 -91251 63968 87036 128738 -91666 164990 -151919 147935
15910 -96096 -433598 163969 281393 29810 -56699 95152 101100 -438530 214950 59161 -299313
15898 -74244 -96692 74634 -141229 -142317 -278298 -151345 95632 -113056 -319086 8394 -200394
15886 -245362 -139143 -7282 -120524 67253 -51548 230897 -44299 -38222 164533 -23674 -50147
15875 -50147 27938 110834 -364632 84178 -147705 125195 -128654 45530 87503 -13169 182872
15863 136737 152603 78186 -189014 -66610 66681 -59702 -164214 45965 -55935 -62709 42114
15851 199556 -91541 6658 -226871 -408259 -233800 -25147 -37182 -515559 -51698 -282657 -68605
15839 -256881 266415 -186746 265156 303526 -171701 -158298 -24582 17510 -31176 -112168 171619
15827C26751j30454E1814J5544a45023G2019J84165d5825k30837A70943a5179
15816a03260j33805A26496g754A53571p6365a95095a2482B16546J43314j37813
15806B22047d7037B57184k5919g5052A73151a18795e016j10805E1409c07537A10691
15794C3988b97904b7173l25843c4304A00476R1865n9633K82014j15659h1598B3210
15782b74860J25239C98445c85682A62252j4035J78868c74832a09255N265C1881
15771a71831d6727C8290M8837C7119J41670C8443b54083H7079a26174o2205I2515
15759c39616b1765j26134F5587a99042e3410k47465d3238I0995l8618j5706f1515
15747C5874j7484J85220D5537a08812b1244B03686b552k12430D62721j87663Q290
$$ plain form
15827 326751 196297 51814 67358 -145023 72019 256184 -45825 -276662 170943 -15179
15816 -103260 -237065 126496 -7754 153571 77206 -195095 -12482 216546 359860 222047
15806 222047 -47037 257184 231265 -75052 173151 -118795 -5016 -115821 51409 -307537 110691
15794 33988 -297904 -27173 -353016 -34304 100476 192341 132708 414722 299063 -81598 23210
15782 -274860 -149621 398445 -385682 162252 148217 327085 -374832 -109255 -103990 31881
15771 -171831 -46727 38290 87127 37119 178789 38443 -254083 87079 -126174 -188379 92515
15759 -339616 -21765 -147899 65587 -199042 -53410 -300875 -43238 90995 52377 36671 -61515
15747 35874 18390 203610 45537 -108812 -21244 203686 -2552 -214982 462721 275058 283348
15736B83348B256K32064F9962a04119a4480k80034a27589k3604B2667g3367j573
15725g4940k0472b4880l12189H2092a67965k4379c8965B9108a36958G485N1273
15714E8758J33323c42987A98221C9873J18734B8774c21807e1326A14620b35269
15703a08676A32005B1797a6079l50580J56534i1410A35916h674A26763C1943a36018
15691c2422D09148c18496A60613H08c01713f3053F6338C3103J3629d9091D7784
15679b46640a02553p9787H0493L5420a18850B20980H0980a36762D8486f0233A56458
15667A9531a45901C87417R8292b16186a6846B26246R7677c11632E611M9086c51885
15655A79477J49341A26655D1861P1286K90717b75131A37996M73680a21908n0286
$$ plain form
15736 283348 2256 234320 69962 -104119 -14480 -294514 -127589 -151193 22667 -73367 -74940
15725 -74940 -95412 -24880 -337069 82092 -167965 -192344 -38965 29108 -136958 7485 58758
15714 58758 192081 -342987 198221 39873 158607 28774 -321807 -51326 114620 -235269
15703 -108676 132005 21797 -16079 -366659 -210125 -91410 135916 -8674 126763 31943 -136018
15691 -32422 409148 -318496 160613 808 -301713 -63053 66338 33103 46732 -49091 47784
15679 -246640 -102553 -182340 80493 115913 -118850 220980 80980 -136762 48486 -60233 156458
15667 19531 -145901 387417 485709 -216186 -16846 226246 323923 -311632 5611 54697 -351885
15655 179477 328818 126655 41861 113147 403864 -275131 137996 611676 -121908 -172194
15645a72194A20616J88518H3569a91062E3484a05699b171B56327a26133B23093
15634a59728k53340A2502O2531D810a75359L7789B19711h5757A78847p9453b15743
15622c8717j38278r4087j22000J48272Q6819q3387j7783a06957E8596b07640E2472
15610b3807F9739a37501A94042E6116h3627a7387j2608P739k8674C08600d1757
15598C11680i9321j08415i2324C12460b31158c5348A461Q1350b85173a05065B89128
15586b34639A6396i4063B3714b05735K8950d42C75802a71727q6559a00506a1538
15574b37109I6619N8988D5271e3996B24421E6613J27883b34637B4335C500J31487
15563A34987a05411C00384J254I7835a01696d5366C23361B619d2002B2985D343
$$ plain form
15645 -172194 120616 309134 83569 -191062 53484 -105699 -2171 256327 -126133 223093
15634 -159728 -413068 12502 75033 4810 -175359 -137570 219711 -85757 178847 99394 -215743
15622 -38717 -176995 -271082 -393082 -244810 -157991 -241378 -259161 -106957 58596 -207640 52472
15610 -23807 69739 -137501 194042 56116 -83627 -17387 -29995 -22256 -50930 308600 -41757
15598 311680 -99321 -207736 -92324 312460 -231158 -35348 1461 82811 -285173 -105065 289128
15586 -234639 16396 -94063 23714 -205735 -176785 -442 375802 -171727 -258286 -100506 -11538
15574 -237109 96619 155607 45271 -53996 224421 56613 184496 -234637 24335 3500 134987
15563 134987 -105411 300384 301638 97835 -101696 -45366 323361 2619 -42002 22985 4343
15551A22540d8222C4879j5927a54818N9288B14449i6981J2291c3645A59710j0191
15540A49519d0678A7606b2861j44105k22523a69836P1254d766F5182a07218B60423
15528d7695C19296J3448r9657b49741b8506k5876b1662j64614A1663K96507a31418
15516h9758D7099b8795H6849a32826B47001H7764b24343B11995b6967F3330L257
15505F6587K22391A20872R5567l7610a33770A04506g4118E2956K14805L8049j6738
15494B89072q5572E5149R1285M1182E4013J6504k9167h42G2641R1826p3568K31947
15482C22846c39733K8673D3604Q7763D88L71223a82861C43702A35535A4244e4977
15470a4533C71986a27558d0394j02278C6506J17407K3114P4024j0808A01546p089
$$ plain form
15551 122540 -48222 34879 18952 -154818 -95530 214449 -96981 -84690 -33645 159710 149519
15540 149519 -40678 17606 -22861 -166966 -389489 -169836 -98582 -4766 65182 -107218 260423
15528 -47695 319296 332744 233087 -249741 -28506 -54382 -21662 -186276 11663 308170 -131418
15516 -89758 47099 -28795 86849 -132826 247001 87764 -224343 211995 -26967 63330 66587
15505 66587 288978 120872 216439 178829 -133770 104506 -74118 52956 267761 305810 289072
15494 289072 203500 55149 146434 187616 54013 70517 41350 -842 72641 164467 90899 322846
15482 322846 -339733 -311060 43604 131367 488 371711 -182861 343702 135535 14244 -54977
15470 -14533 371986 -127558 -40394 -142672 36506 153913 177027 251051 240243 101546 94457
15459I4457K15122j02821K82932n0787r2617O7041A03060a17142l5598F5139J64126
15448B29265K2312A5581c61785A53722e7199B82120D1008l251O4807a30177A90310
15436B31536d1258B14118P4669i9213n8201P2343b0219B2772J40019G8134K72540
15425C50674J43717j04930N08445l18445A62368O4624n272G9798J01668F8170
15414B79419a819k7567j82276B52604D2301J49624F5660K42532b50472h5194C7919
15402d68509a24957A69293c1622o3646l3895A49859l2864E0288J58444m0502J08177
15391B76407D5723a39766A77805a30343K1575B37013q5229c58820b9836p623J2833
15380b4626A24465a70056E3103K02488K440a55589C69681j34285J5636k8165C2695
$$ plain form
15459 94457 309579 206758 489690 438903 346286 413327 103060 -117142 -152740 65139 229265
15448 229265 251577 15581 -361785 153722 -57199 282120 41008 37757 102564 -130177 190310
15436 231536 -41258 214118 288787 -99213 -157414 -85071 -20219 22772 162791 78134 350674
15425 350674 494391 389461 897906 579461 162368 226992 221720 79798 181466 68170
15414 279419 -1819 -29386 -211662 252604 42301 191925 65660 308192 -250472 -85194 37919
15402 -468509 -124957 169293 -31622 -95268 -129163 149859 116995 50288 208732 168230 276407
15391 276407 45723 -139766 177805 -130343 -108768 237013 151784 -358820 -29836 -37459 -24626
15380 -24626 124465 -170056 53103 255591 258031 -155589 369681 235396 251032 222867 32695
15368A28247b1437P421o4290j71615I733i9057F8346L564L1702J26512K1179m4435
15356B06868j691N770p5554A1419Q8264Q2569J0948B5412J79283I9700b17665
15344A85823A634J49484L61135k54145f6421A80893l5656K7439J5582q1553K00566
15333C07271P5944A79115i490H2206K46837a46345B97863K22782A69468M66522
15323F35990j82391j77161E784Q71M84944B18792m3419a51937d833C86212J30010
15312E16222B34840J32940r2580e3055A24470A8496M2996K9395a02192n24008
15302f26200G0830k5962L29468m6794J49827A61340a10297M3852H7488J86266
15292B73754e9564o6912A98424e2390p6628C37228b94532a13614A29528J39188
$$ plain form
15368 128247 -21437 -14016 -78306 -249921 9733 -99057 68346 71910 103612 230124 251303 206868
15356 206868 205177 210947 135393 11419 99683 182252 193200 25412 204695 99700 -217665
15344 185823 1634 151118 512253 258108 -66421 180893 145237 172676 188258 106705 307271
15333 307271 383215 179115 -9490 82206 329043 -146345 297863 520645 169468 635990
15323 635990 453599 276438 5784 6655 491599 218792 175373 -151937 -4833 386212 516222
15312 516222 234840 367780 275200 -53055 124470 18496 61492 90887 -102192 -626200
15302 -626200 70830 44868 374336 327542 477369 161340 -110297 -66445 87488 273754
15292 273754 -59564 -126476 198424 -52390 -129018 337228 -294532 -113614 129528 268716
15282B68716c792j17123k31553e2737a3637j53909f7570B70012k9561a19917G3994
15270b84453C33688b9444l7060A94191F166N8099b42164L5948k7630B6058K6881
15259E2939J02292r584K36796A54942L6750q0735k3339P9224J53425B6634J23946
15248A50580a2373r2751B03414b90122A52783K87286j48680j05914j3650I388
15237A47206C1542a23263c6342F35447l15518E5539L08892J1992L18073k26432
15227D68064J87191Q05556j63454k00309N50106o60296m46828o4925A77683n1889
15217A25794M1862G4255g8828C30499H2865A820Q4250b0698j38466N7055k7895
15206a30004A54147j4964n5513M33751g5201A87804b21368A57071F8309N8216
$$ plain form
15282 268716 -3792 -120915 -352468 -52737 -13637 -167546 -67570 270012 240451 -119917 73994
15270 -284453 333688 -29444 -66504 194191 6166 64265 -242164 -206216 -233846 26058 52939
15259 52939 155231 145647 382443 154942 191692 110957 87618 166842 320267 26634 150580
15248 150580 -12373 -105124 203414 -290122 152783 440069 291389 185475 171825 9388
15237 147206 31542 -123263 -36342 635447 319929 55539 364431 376423 694496 468064
15227 468064 655255 1460811 1297357 1097048 1647154 986858 540030 475105 177683 125794
15217 125794 167656 74255 -78828 330499 82865 1820 86070 -20698 -159164 -102109 -130004
15206 -130004 154147 139183 83670 517421 -75201 187804 -221368 157071 68309 126525
15196A26525b03306B02179a18362B26733A1690K93074B6143R0669g851B21884
15185E9518J86639a25048E24878A78252q481b30011b6774A15767N5968E0603J4860
15174F5463C962L77703b07937B84587j31347K40001Q9091A68409o0550j1520J54136
15163B50475P6393q3535a60725H7547M5703E156J50736b6359B96715j20836a05695
15151e5573B16085F0193J23580O0954F1802K33277M4185a89359B03735H7244C5736
15139A84131Q6333l4214N4530A33322R6573J79475n2169k3643j7124F1475J82971
15128B44446J3581P8244j3996C9818K05022Q886J14890j35282e441A16256a97897
15116B17570Q6349a01598A8452K45102a72634A98907L86997a08557o0585H5471
$$ plain form
15196 126525 -203306 202179 -118362 226733 11690 304764 26143 116812 -7851 221884
15185 59518 246157 -125048 524878 178252 169771 -230011 -26774 115767 171735 50603 65463
15174 65463 3962 381665 -207937 284587 153240 393241 482332 168409 107859 96339 250475
15163 250475 326868 243333 -160725 87547 133250 5156 155892 -26359 296715 175879 -105695
15151 -55573 216085 60193 183773 244727 61802 295079 339264 -189359 203735 87244 35736
15139 184131 270464 236250 290780 133322 229895 409370 357201 333558 316434 61475 244446
15128 244446 258027 336271 322275 39818 244840 253726 368616 233334 -5441 116256 -197897
15116 217570 303919 -101598 18452 263554 -172634 198907 585904 -108557 -169142 85471
15105B89355l4650j7602J51417K73399j46581k30009j26644J11372a2900B43003
15094A76466O07f1774j7545H7025K170o285a07108A39288k1474b69278e9715A21619
15081a25257A78409i4299q2358C61290E369M1864m045b36565A54722C1570L40688
15070C72258p3826c765N25C14534j48132K83608j43678J18710A72615F2266a4682
15058H9049C2567a1928e004j7072A30418a58219c1499A84910M1202m074K02362
15047D24400H824K53404J4360A08301K46772J08127A39773q884K76128a23153
15036c0665D11667j0032A87783D6768K81242j5004l1764p6276J68620Q516J0866
15025C92968P9918r1572l9219k2012K9551J98499k47814M00570B77622L28707
$$ plain form
15105 289355 254705 237103 388520 661919 515338 285329 158685 270057 -12900 243003
15094 176466 177073 -61774 -79319 87025 89195 82910 -107108 139288 117814 -269278 -59715 121619
15081 -125257 178409 -94299 -176657 361290 5369 47233 43188 -236565 154722 31570 372258
15070 372258 298432 -3765 -3240 314534 166402 450010 306332 425042 172615 62266 -14682
15058 89049 32567 -11928 -5004 -22076 130418 -158219 -31499 184910 226112 222038 424400
15047 424400 8824 262228 276588 108301 355073 463200 139773 130889 407017 -123153
15036 -30665 411667 401635 187783 46768 328010 313006 281242 204966 373586 382102 392968
15025 392968 472886 381314 342095 320083 349634 548133 300319 700889 277622 606329
15015F06329R9171k46438L47393B90694N05018l8009k71960l2861O4233P6366
15005E93481r7719J99117k79375j00853K25556k35997K11918A57283M00943k51276
14995C06950g8593B40841J04228J79365J55030l32439K6927j45795L51558j50784
14985D28931r812O9337D2667O63633j10928j90252j89092K16215J19687o0979
14975D90951K9222G9476M46325P5299P6944C12626M0606L75300k56519N209K96108
14964G73330k90948K33091k05269J25684k60903L04836l12663k3140N54581j34738
14954G63861l10305K78196B70374n2034P4992j29101P2038r0635J02142J75316
14944D23092l4272L7787j50885M6641k9676F9069K48361J79294q2567J56416k01884
$$ plain form
15015 606329 705500 459062 806455 290694 795712 757703 485743 452882 517115 593481
15005 593481 495762 694879 415504 314651 540207 304210 516128 157283 558226 306950
14995 306950 -78593 240841 345069 524434 679464 347025 373952 228157 579715 428931
14985 428931 419119 488456 42667 706300 595372 405120 216028 432243 551930 490951
14975 490951 520173 79476 525801 601100 678044 312626 353232 728532 472013 477222 773330
14964 773330 482382 715473 510204 635888 374985 679821 367158 344018 898599 763861
14954 763861 453556 731752 270374 218340 293332 164231 236269 145634 247776 423092
14944 423092 388820 426607 275722 322363 292687 69069 317430 496724 414157 570573 368689
14933C68689n0593J59005k26390K23898o3545J6515K05883J1117j64149P9452
14923E59882p7008O3637j97598J81245j77623J26990J69500J30736j59250K29170
14913H49681n9417M20630K37900j50938J7339J2K92631k30234J98906l02632K52145
14902A526023k80525K27562M02612j65935l19538k53791p5498j53211l0083M7111
14892I24727l13951j15120j57546L21232B98096O19266D35730j36932K02638k1132
14882D80304O0250p5080J58831j11943K58761k25415n6032J39020K7532B21128
14871H30890k276O7811j24862q9823M0420J83904j30636l9716M6223k87860L80767
14860H74842C91369j95533M46050B38175M31923p8710P6052O7309R1642l55895
$$ plain form
14933 368689 318096 477101 250711 474609 411064 427579 633462 644579 480430 559882
14923 559882 482874 546511 348913 530158 352535 479525 649025 779761 620511 849681
14913 849681 790264 1210894 1448794 1297856 1315195 1315207 1607838 1377604 1576510 1273878 1526023
14902 1526023 1245498 1473060 1875672 1709737 1390199 1136408 1060910 907699 877616 924727
14892 924727 610776 495656 338110 659342 298096 917362 435730 298798 501436 480304
14882 480304 540554 465474 624305 512362 771123 545708 489676 628696 656228 221128
14871 830890 828614 896425 771563 681740 722160 906064 775428 735712 781935 494075 874842
14860 874842 391369 195836 641886 238175 670098 591388 667440 734749 826391 470496
14850D70496N3709K89152M9775j98705C04313M08089A74362P8648J98335k0629
14840D30716J01896q9920N388M66853D06436J57698p1342J48869k2517J13067
14830G32211k24394K09189p443n531M47408m95205L70542K4304j2574p8675J05767
14819A065599k78494L7483k61699Q8210j19370J48713J32504o7284L7782r6998
14809F86446p7158N76375m24633O5663p310K362l49967J28834L24996p8611k58587
14798E88410J13844L49801k46473L4101C93232O08480j03751o7997k53006K79049
14788H56007j51485J87184r4577J29867l90945L42291A24694M84055N1194k72303
14778C87640Q2611K14711K52284k71259o6450Q5347p158P349J41887J7286O0216
$$ plain form
14850 470496 524205 813357 863132 664427 304313 712402 174362 253010 451345 430716
14840 430716 532612 442692 448080 914933 406436 564134 492792 641661 619144 732211
14830 732211 507817 717006 709563 704032 1151440 656235 1026777 1051081 1038507 959832 1065599
14819 1065599 787105 824588 562889 651099 531729 680442 812946 745662 783444 686446
14809 686446 609288 1185663 761030 826693 819383 821745 471778 600612 925608 846997 588410
14798 588410 702254 1052055 805582 839683 393232 1001712 897961 829964 576958 856007
14788 856007 704522 891706 797129 926996 536051 878342 124694 608749 659943 387640
14778 387640 470251 684962 937246 665987 599537 684884 677726 685075 826962 844248 904464
14767I04464K98171m45163K43862j60599l95038m2651O08081m09174M23448J64366
14757A189767n47166K90783K77223k35879l2651O7466j51665j94780j93749K38320
14747G07669Q1607k02573M18831k36924n7447k73400K98706J4823j13359Q2909
14737G20842j13345o654m4006L7983L28400k41668Q3159o3110l6756P2838m8337
14726F89346J58149p3731j59728L88704k65771K4705J47285j20705K72840k5574
14716A035520j51768k30577O17408l54623M89995j94412L50619L02233o75068
14707A189327N22969o93372J19859K11572m52459j62511M58113l2491m39352N04419
14697A226074n02792K21636J48321o9611K30287j30843n6806J19786k0048J81968
$$ plain form
14767 904464 1202635 757472 1001334 840735 445697 403046 1011127 601953 1025401 1189767
14757 1189767 642601 933384 1210607 974728 942077 1009543 857878 663098 469349 707669
14747 707669 789276 586703 1005534 768610 711163 437763 736469 751292 637933 720842
14737 720842 607497 600843 556837 594820 923220 681552 764711 701601 664845 737683 689346
14726 689346 847495 773764 614036 1002740 736969 761674 908959 788254 1061094 1035520
14716 1035520 883752 653175 1270583 915960 1405955 1211543 1562162 1864395 1189327
14707 1189327 1712296 1018924 1138783 1350355 897896 735385 1193498 1161007 721655 1226074
14697 1226074 723282 944918 1093239 1023628 1253915 1123072 1066266 1186052 1166004 1347972
14687A347972M0001j2169J46221J43867k27041N3414J0549J10027l40584j23184
14677A149073k8345j72363K68676k08888K6523J11004J1553m8738n2678j72643
14667H83174J033K21190J70496j30935k77931R5471p334k8104K22896P418j51763
14656A005611Q0558Q5198q9824o3704j8647L09561l05550N1319J60001K00114
14646A414637R636l65485m4781L11805J27535J69193n52711p7292N22360q9539
14636A425358j56197l201q1755N71614m55784K48526k88580P2762P1148j10546
14626A293345L73339o5301l01290k07585L58522j39807j81586P3651K45046r1920
14616A356414Q0846K3379J36377J40297m45309M78372j71703k14992J35140J51482
$$ plain form
14687 1347972 1387973 1375804 1522025 1665892 1438851 1492265 1502814 1612841 1272257 1149073
14677 1149073 1120728 948365 1217041 1008153 1034676 1145680 1157233 1108495 1055817 883174
14667 883174 884207 1105397 1275893 1144958 867027 962498 955164 927060 1149956 1157374 1005611
14656 1005611 1086169 1171367 1081543 1017839 999192 1308753 1003203 1054522 1214523 1414637
14646 1414637 1424273 1058788 1014007 1325812 1453347 1622540 1069829 992537 1514897 1425358
14636 1425358 1269161 1265960 1184205 1755819 1300035 1548561 1259981 1332743 1403891 1293345
14626 1293345 1666684 1601383 1300093 1092508 1451030 1311223 1129637 1203288 1448334 1356414
14616 1356414 1437260 1460639 1597016 1737313 1292004 1770376 1598673 1383681 1518821 1670303
14606A670303j29366J03595k85804M54968J23196m58343M68174m75018j68291
14597A303414P47880m12067l6283K5043j40476j0215R5822J07678k57798L16590
14587A739588j41767L30422k3391J04397k43594p1881K26947J46474j9008r6306
14577A951881N01457o10400N7431J07593M0405P648K2810j62482L6427K42575
14567B195345N6277l56864O71331j46279n3103k77266J21933k47639L10948K61108
14557B535791J68669j02853j99502M28910k78614L3734L0751J64333K63256l50837
14547B693638K79827j45654O40354r0477k18427N11320j9645O73778L65322N33862
14537E223898M61695R14818J775306K079132L920675O344534J1161241K819617
$$ plain form
14606 1670303 1540937 1644532 1358728 1813696 1936892 1478549 1946723 1471705 1303414
14597 1303414 2051294 1639227 1602944 1627987 1487511 1477296 1573118 1680796 1422998 1739588
14587 1739588 1597821 1928243 1904852 2009249 1765655 1693774 1920721 2067195 2048187 1951881
14577 1951881 2453338 1842938 1900369 2007962 2048367 2056015 2078825 1916343 1952770 2195345
14567 2195345 2251622 1894758 2566089 2419810 2366707 2089441 2211374 1963735 2274683 2535791
14557 2535791 2704460 2601607 2402105 2831015 2552401 2586135 2616886 2781219 3044475 2693638
14547 2693638 2973465 2827811 3468165 3377688 3159261 3670581 3650936 4324714 4690036 5223898
14537 5223898 5685593 6600411 8375717 10454849 14375524 20720058 31881299 34700916
14529C4700916j4553968q668157m290770j934494p76232o28488L97979K30388
14521D477174R11538j324037p43551m67074m57912L65311j63799j1348j48029
14512B438273O0666M9164K73375j52448N5920k71281M47738k61517J77367K1298
14502B838555J55665k11287m7190M38573j6016j21744J10140J1111K45230p51035
14492B652002M10559L22090K4501L9743O2297k68487L92546j5498J76180l04399
14482C491534K27997K23613n97561L23328M57281k10884J2683N4047L11314n48785
14472C744567J71794L452L95468l98506K45351M74720m60728L61370o8008n3045
14462D416435K0257L9895j04743L34453J18828K21908m70387L77126l61283N52012
$$ plain form
14529 34700916 20146948 11478791 7188021 5253527 4477295 3848807 4246786 4477174
14521 4477174 5388712 4064675 3321124 2854050 2396138 2761449 2597650 2586302 2438273
14512 2438273 2498939 2548103 2821478 2669030 2724950 2453669 2901407 2639890 2817257 2838555
14502 2838555 2994220 2782933 2735743 3174316 3158300 3036556 3146696 3157807 3403037 2652002
14492 2652002 3062561 3384651 3409152 3448895 3511192 3242705 3635251 3619753 3795933 3491534
14482 3491534 3719531 3943144 3345583 3668911 4126192 3915308 3927991 3982038 4293352 3744567
14472 3744567 3916361 3919813 4315281 3916775 4162126 4636846 4176118 4537488 4469480 4416435
14462 4416435 4436692 4476587 4371844 4706297 4825125 5047033 4576646 4953772 4592489 5144501
14452E144501j493l89974M84450m5200K5650M61543m83534K99831L01155k56787
14442E540142J55609j20297M75425j6753m31591K16597L53026p8628J27748Q6159
14432F307437J92545o5373Q5450J61515r7495q8676L21028K3107m752L48993j63872
14421G019907M94334J62986m11059K62930p8309M74094J13767R7409L426k14587
14411G924898K75329K08012o9658K31208K6520L35038J46485J9585J62905M58556
14401I718878K73742k38796j19533L14298K92927M7132J63239n6747J61959P2019
14391A0629118M33821q5467J21138R59902K87374m87266N57137o2219K1083J61806
14381A2536427P2305M91727Q653J45256M11818Q0470L40329J8363N30514M22431
$$ plain form
14452 5144501 5143008 4753034 5237484 5192284 5217934 5679477 5195943 5495774 5796929 5540142
14442 5540142 5695751 5575454 6050879 6034126 5602535 5819132 6172158 6093530 6221278 6307437
14432 6307437 6499982 6434609 6520059 6681574 6584079 6495403 6816431 6839538 6834786 7183779 7019907
14421 7019907 7514241 7677227 7266168 7529098 7450789 7924883 8038650 8136059 8139485 7924898
14411 7924898 8200227 8408239 8338581 8569789 8596309 8931347 9077832 9097417 9260322 9718878
14401 9718878 9992620 9753824 9634291 9948589 10241516 10288648 10451887 10395140 10557099 10629118
14391 10629118 11062939 10977472 11098610 12058512 12345886 11858620 12415757 12353538 12374621 12536427
14381 12536427 12608732 13100459 13109112 13254368 13666186 13746656 14086985 14105348 14635862 15058293
14371A5058293j47318P3996M59439M19787M8518N22977N04374J79201P80003k89338
14361A7609932N60104M39050J22873Q9274N26967K99376M98589M89592L15414
14352B0951171O08312J70514K75876N10499J082176J78381L53365N47042O80030
14343B5357366K55595Q06974P19412M12289L83204J123007K83359Q14036Q61823
14334C1017065P20798N11831Q58543J031554P72372R11644J052443Q86371P33670
14325C8496291J378031J105100J089113J079539J299817J383461J566689J135002
14317D8533043J447000J558140J499719J798444J581982K002926K070907J833958
14309F2326119K069727K227549K235145K556070K236129L018326K710034K967521
$$ plain form
14371 15058293 14910975 14984971 15444410 15864197 15912715 16435692 16940066 17119267 17899270 17609932
14361 17609932 18170036 18609086 18731959 18821233 19348200 19647576 20146165 20635757 20951171
14352 20951171 21559483 21729997 22005873 22516372 23598548 23776929 24130294 24677336 25357366
14343 25357366 25612961 26419935 27139347 27551636 27934840 29057847 29341206 30155242 31017065
14334 31017065 31737863 32249694 33108237 34139791 34912163 35823807 36876250 37762621 38496291
14325 38496291 39874322 40979422 42068535 43148074 44447891 45831352 47398041 48533043
14317 48533043 49980043 51538183 53037902 54836346 56418328 58421254 60492161 62326119
14309 62326119 64395846 66623395 68858540 71414610 73650739 76669065 79379099 82346620
14301H2346620L015174L036260L592607L458130L820486L639531M126786M725038
14293A11760632M983174M434456N308655N410093N906434O424439O157366P298750
14285A57683999P045472P553784P866315Q909153Q832940R512737J0053931J0749097
14277B28207428J0968215J1754815J2346438J2738053J3646365J3331369J4508764
14270C17501447J4888365J4647192J4085250J3289510J2555686J1732466J1174953
14263D09874869J0231801R509878Q399125Q584030P540732O132504L810388K854278
14255D66937605K988324J68218m643716l442780o933317q975809r921327j0760120
14247D25417078j1992952j2169104j3491178j3292271j3651334j3425328j3976876
$$ plain form
14301 82346620 85361794 88398054 91990661 95448791 99269277 102908808 107035594 111760632
14293 111760632 116743806 121178262 126486917 131897010 137803444 144227883 150385249 157683999
14285 157683999 164729471 172283255 180149570 189058723 197891663 207404400 217458331 228207428
14277 228207428 239175643 250930458 263276896 276014949 289661314 302992683 317501447
14270 317501447 332389812 347037004 361122254 374411764 386967450 398699916 409874869
14263 409874869 420106670 429616548 438015673 446599703 454140435 460272939 464083327 466937605
14255 466937605 469925929 470094147 465450431 462007651 455074334 446098525 436177198 425417078
14247 425417078 413424126 401255022 387763844 374471573 360820239 347394911 333418035
14240C33418035j3719730j3322336j2938633j2323719j2864744j1987404j1542769
14233B44718700j1358076j0186714j0835565j0629835r646826r449373q898081
14226A73714230q207812p438182p230428o755832o311363n904574o065854n224124
14218A20576061m969616m748204m027209m357296m046672l960476l390801l525188
14210H7550599l364642k678970l280736k492794k962709k011328k536402k330111
14202F5892907j819855k462241j762019j722693j773998k011368j298255j825191
14194E1217287j387106j459413j315592j231967j339833j042210j602760j072928
14186D0765478q51108r75139q67501j594973n88211j082263p38848o96130q06944
$$ plain form
14240 333418035 319698305 306375969 293437336 281113617 268248873 256261469 244718700
14233 244718700 233360624 223173910 212338345 201708510 192061684 182612311 173714230
14226 173714230 165506418 158068236 150837808 144081976 137770613 131866039 125800185 120576061
14218 120576061 115606445 110858241 106831032 102473736 98427064 94466588 91075787 87550599
14210 87550599 84185957 81506987 78226251 75733457 72770748 70759420 68223018 65892907
14202 65892907 64073052 61610811 59848792 58126099 56352101 54340733 53042478 51217287
14194 51217287 49830181 48370768 47055176 45823209 44483376 43441166 41838406 40765478
14186 40765478 39914370 38939231 38071730 36476757 35888546 34806283 34067435 33371305 32564361
14177C2564361n69413j045991q96953o77656n12008n57140r25352q08835j9477
14168B6551536j171459m03591k35437q35457l76260m71243o39172k41224n15760
14159B1661933n86223l03946m34931l74053k75630p06469o5941n85360m00834
14150A7928546r4803j46146n79351k10374p50525j53859q2410j93246n50454q8263
14140A5079115q527k91133l70265j19630o71190N58653q04446N7384n33174j39122
14130A2757665r0107j46671l83568r4687k37039m65933L95933m44238k76937P517
14120A1021935Q2938m78362j55151k71960J57924o29988L25313m14756K17478
14111I855371r9286m06989l99424J69253j10259m36828M33865k88984l53196n6233
$$ plain form
14177 32564361 31994948 30948957 30052004 29374348 28862340 28305200 27379848 26571013 26551536
14168 26551536 25380077 24976486 24741049 23905592 23529332 23058089 22418917 22177693 21661933
14159 21661933 21075710 20771764 20336833 19962780 19687150 18980681 18914740 18329380 17928546
14150 17928546 17833743 17687597 17108246 16897872 16147347 15993488 15911078 15717832 15167378 15079115
14140 15079115 15070588 14779455 14409190 14289560 13618370 14177023 13372577 13429961 12896787 12757665
14130 12757665 12667558 12520887 12137319 12042632 11805593 11339660 11735593 11291355 11014418 11021935
14120 11021935 11104873 10626511 10471360 10199400 10357324 9727336 10052649 9637893 9855371
14111 9855371 9756085 9349096 8949672 9118925 9008666 8571838 9005703 8716719 8363523 8307290
14101H307290m9478j46103j49702N5732r9119k31486K2701l3055J47613n67369
14091G257024L6248p3329K55990n50074k12563K98788l77074L6247n4362K9187
14081F646082P5294m28305J84666l00964k2997J17338o2917l42616L01969m41318
14071E726232j49427K44115l74258L26400k25402k18625K47073m20832L02037
14062E457313l03005L7010j3321j27440J22652l72630j27372L60475k26703n1758
14052D755221P6766L7850l72236M17666j58861n7191k70328J85926o9333P0871
14042D616351J85272l93895j53626N6460k22930n404J91831l46662L0807K55213
14032D213417k44396J0319k31438j93017L57171k97589o6784J75992m0129m14204
$$ plain form
14101 8307290 8257812 8111709 7962007 8017739 7918620 7687134 7709835 7676780 7824393 7257024
14091 7257024 7293272 7219943 7475933 6925859 6713296 7012084 6635010 6671257 6616895 6646082
14081 6646082 6721376 6293071 6477737 6176773 6153776 6271114 6208197 5865581 6167550 5726232
14071 5726232 5576805 5820920 5446662 5773062 5547660 5329035 5576108 5155276 5457313
14062 5457313 5154308 5191318 5177997 5050557 5173209 4800579 4673207 5033682 4806979 4755221
14052 4755221 4831987 4869837 4497601 4915267 4756406 4699215 4428887 4614813 4545480 4616351
14042 4616351 4801623 4407728 4254102 4310562 4087632 4082228 4274059 3927397 3958204 4213417
14032 4213417 3969021 3979340 3747902 3554885 3912056 3614467 3547683 3723675 3683546 3269342
14022C269342O6178M1375L00414k6999l85316R3769J32667j37742j75790K71868
14012C449766L26492n22703K37306k42305l4152k64295O9504R9258j49881K17106
14002C186096m08255M4162q618J70691j40982K09227j89831J39868j37158q6643
13992B778557L1774n7290n096m9474k50863L12770l34552N03128m84896K23625
13982B667683q1904R2191L20095r0857O31276L94420M50204P66650J410086L350011
13972I909855N480836J1245348R860090j1545940r114912n056664l174439j174427
13964F429747j045764n35539n34837l95016m06921l06412n1503R0245k940j5334
13954C225726j07993j73068k04552k28864L9889Q4302L22557o04426K30356j53129
$$ plain form
14022 3269342 3335520 3376895 3677309 3650310 3264994 3358763 3491430 3353688 3177898 3449766
14012 3449766 3776258 3253555 3490861 3248556 3214404 2950109 3019613 3118871 2968990 3186096
14002 3186096 2777841 2822003 2813385 2984076 2843094 3052321 2862490 3002358 2865200 2778557
13992 2778557 2810331 2753041 2747945 2698471 2447608 2760378 2425826 2928954 2444058 2667683
13982 2667683 2585779 2677970 2998065 2907208 3538484 3932904 4383108 5149758 6559844 9909855
13972 9909855 15390691 26636039 36496129 24950189 15835277 10778613 7604174 6429747
13964 6429747 5383983 4848444 4313607 3918591 3511670 3205258 3153755 3244000 3241060 3225726
13954 3225726 3117733 2944665 2740113 2511249 2551138 2635440 2957997 2353571 2583927 2430798
13944B430798m06367P70647m32073j04033J40112l7796Q9688j81167k1931m5966
13934B201912L34534o53386j88317M61288k51081N2378m675J08962l31805M0239
13924A770049M39981j44283K21340m61105k6649L39401k64108J04200o275j09990
13914A862561J7746k1131L24565o68752L94350j50655L5286J67258k55536j95570
13904A510122K43063j83241j12119M70947l55030J78965j24261J6704J68867j95490
13894A618527k83393L30862k30108j11303J95532o6622j20584L30676j51037j49801
13884A362749m0789J63257K37919J62824l16402J9940j0456l55153J61057l6190
13874A348756M71487l27180o9355j43379j07402M09030p7947l87073J78015J48259
$$ plain form
13944 2430798 2024431 2795078 2363005 2258972 2399084 2361288 2450976 2269809 2247878 2201912
13934 2201912 2536446 1883060 1694743 2156031 1904950 1957328 1952653 2061615 1729810 1770049
13924 1770049 2210030 2065747 2287087 1825982 1799333 2138734 1874626 1978826 1972551 1862561
13914 1862561 1880307 1859176 2183741 1514989 1909339 1758684 1793970 1961228 1705692 1510122
13904 1510122 1753185 1569944 1457825 1928772 1573742 1752707 1628446 1645150 1814017 1618527
13894 1618527 1335134 1665996 1435888 1324585 1520117 1453495 1332911 1663587 1512550 1362749
13884 1362749 1321960 1485217 1723136 1885960 1569558 1589498 1579042 1223889 1384946 1348756
13874 1348756 1820243 1493063 1423708 1280329 1172927 1581957 1504010 1116937 1294952 1443211
13864A443211j21583K21417k12311L45803n88183K91937J72538k50967J4423k30890
13854A085395P1554K12694j62921j23787J69752K4863k62460K42169j7026J02992
13844A343225j63443L12643k10233l29883K12020R3579L19482l45051j24488j41092
13834I66759K30405j8967j1754k37897j30141L06995P5119k36404J59242P5863
13824A179220R1599j45492J35251K25576n37526K4069M09172l85697J49011k55643
13814H89540J40616l1236Q3857J49465m47087k2011N26545k52792j58763J84588
13804A062722p4116J5880J63762j34960K37414n84885R1205J37710R2782m49913
13794E57601K76094o7507j07537M19028m59680J91110K48910l15044K4849K11875
$$ plain form
13864 1443211 1321628 1543045 1330734 1676537 1088354 1380291 1552829 1301862 1316285 1085395
13854 1085395 1156949 1369643 1206722 1082935 1252687 1277550 1015090 1257259 1240233 1343225
13844 1343225 1179782 1492425 1282192 952309 1164329 1257908 1577390 1232339 1107851 966759
13834 966759 1197164 1178197 1166443 928546 798405 1105400 1180519 944115 1103357 1179220
13824 1179220 1270819 1125327 1260578 1486154 948628 972697 1381869 996172 1145183 889540
13814 889540 1030156 998920 1082777 1232242 785155 763144 1289689 1036897 878134 1062722
13804 1062722 988606 1004486 1168248 1033288 1270702 685817 777022 914732 1007514 557601
13794 557601 833695 766188 658651 1077679 617999 809109 1058019 742975 767824 979699
13784I79699j10058J48955l25778j74394J56623K13582j32472l17336K39685K54649
13774I33155k09957K4918K10941p6745k37467J08204K41770k24678p1291K19761
13764I18611l24636K30587J22728m05119n8827K11359K46987M6049m33126M60909
13754A015522j17386C77105L84597Q0932O792l26694J46969M50562r7160l5198
13744I87905r5100k8692k78334J82505P8935r9966j38829O7140L2384j42981K36474
13733H01441L745n5107j94135r4721J26929J30541k3931l6818o8516M5411p2185
13722E62654J41708k28089o752Q5027L27331k09082Q5801J05963l08677N25703
13712A081587D22916J76755J31852L8717p3913j75754B36727P32897l74222J36638
$$ plain form
13784 979699 869641 1018596 692818 518424 675047 888629 756157 438821 678506 933155
13774 933155 723198 748116 959057 882312 644845 753049 994819 770141 698850 918611
13764 918611 593975 824562 947290 542171 483344 694703 941690 987739 554613 1015522
13754 1015522 898136 377105 761702 842634 849426 522732 669701 1120263 1023103 987905
13744 987905 892805 864113 585779 768284 847219 747253 608424 675564 707948 564967 801441
13733 801441 805186 750079 555944 461223 588152 718693 694762 657944 589428 634839 562654
13722 562654 704362 476273 469521 554548 881879 672797 758598 864561 555884 1081587
13712 1081587 422916 599671 731523 770240 696327 520573 236727 969624 595402 732040
13702G32040k32816K56665k71977P3017M18977j72277j08146C23459M66918k88156
13692E02221K26799j83254j06380K79955r3654B33305L33705j58524m0296L07384
13682F75574J11164l14111J84844j69265l2919K23781k63086o810R3967k397K2612
13671E23354j07817p1801N4959j81507N74184l93324k2618H8265M82488O3952
13661F34705k34422L66688k08580B32091L23857j07794q2581k3925J36820K10012
13651F88480k94744M28474l20164K58150o7832j11966k33127J88114k4376J83972
13641F94981j41751K18368l01120j24500L88506j1745C41930j209L25535n8735
13631F07521k12636M8876j71418M89007k80900N1858B36273M33471j46610A94229
$$ plain form
13702 732040 499224 755889 483912 556929 975906 803629 695483 323459 790377 502221
13692 502221 729020 545766 439386 719341 625687 233305 567010 408486 368190 675574
13682 675574 786738 472627 657471 488206 455287 679068 415982 409172 503139 500742 523354
13671 523354 415537 343736 398695 217188 791372 398048 375430 88265 570753 634705
13661 634705 400283 766971 558391 232091 555948 448154 365573 341648 478468 688480
13651 688480 393736 822210 502046 760196 692364 580398 347271 535385 511009 694981
13641 694981 553230 771598 470478 345978 734484 722739 341930 340721 666256 607521
13631 607521 394885 443761 272343 761350 480450 532308 236273 669744 523134 194229
13620F04324r3592M4931n0525j74427j41804M30014j7674K11360l70477L41532
13610G83662k07382B09047L31313j77762H8898K28577J4041A54977L60755j16064
13600C99668j6912J84076B05493R8768J02181B01875k201K89345p7244J13874
13590E25649n8344k9107A23036M45810k53799j56616N07684B73743O0410K76252
13580F10405j64654j32024J14517M8071J48606j46964j67728l4994p1583J01389
13570C05041L49085k73092o994A30909K6212K08217l1999J3139L24882B5890L49445
13559C75335J92900A57766J77886M4820g5887C66742o8600n3602K35584k10920
13549B69204o7567K01399j86927K0499O44827l61963j92607Q8859A93796J50216
$$ plain form
13620 604324 510732 555663 505138 330711 188907 618921 601247 812607 442130 783662
13610 783662 576280 209047 540360 362598 88898 317475 331516 154977 515732 399668
13600 399668 382756 566832 205493 304261 406442 201875 199674 489019 411775 525649
13590 525649 467305 438198 123036 568846 315047 158431 666115 273743 334153 610405
13580 610405 445751 313727 428244 476315 624921 477957 310229 275235 203652 305041
13570 305041 654126 381034 374040 130909 157121 365338 333339 346478 671360 25890 375335
13559 375335 568235 157766 335652 380472 -75887 366742 298142 244540 480124 269204
13549 269204 201637 403036 216109 236608 881435 519472 326865 415724 193796 344012
13539C44012M03564C03540Q3650j8022m315k6922N5865j26996L76561l13975A11982
13527C76807K93555I2213M06074B07052J13179P7719j77627A4328K16780J16900
13517C48008O4573j35379J19471j8279R2673k6281e740C3901K19480A08849b7783
13505A06570J71317q5557K54858k11156J27930j58542G7864J41102A4062J83291
13495A97353K01653a27586C62353J53127A11027M5321k0381m1806K37776l3319
13485B98618q7210J95946j02086J35165N7390A00551J74644L2527J19658A30692
13474A87819J82832A67802k3990A3122L32749c6832B84697A0951J19594C2934
13463C16631P7031M5419F0365K10714K68862B68782j4872H8403N62396B40834
$$ plain form
13539 344012 747576 303540 387190 369168 364853 337931 393796 266800 643361 329386 111982
13527 376807 670362 92213 498287 207052 320231 397950 220323 14328 231108 348008
13517 348008 412581 277202 396673 378394 471067 444786 -5740 33901 253381 108849 -27783
13505 106570 277887 192330 447188 236032 363962 205420 77864 218966 14062 197353
13495 197353 399006 -127586 362353 515480 111027 156348 135967 94161 331937 298618
13485 298618 211408 407354 305268 440433 497823 100551 275195 307722 427380 130692
13474 187819 370651 167802 143812 13122 345871 -36832 284697 10951 130545 32934
13463 316631 393662 439081 60365 271079 539941 268782 253910 88403 650799 240834
13452A77016K90624A44674J52767J11987A70647Q4317e7080D34721j8959C5942
13441A95269M51229C03087a8987E55231A73370j1110J02923c067B78227F3176
13430C75634D7293M35004A21461K18903J55510j43867A43854J49917m3691J16312
13420C66392j12457B5027g4211k22985E45220B16889a03617d3860B84174r8241
13410A85933l0076K04311I2023M05547g0706F96306i682n0877B18180J24715A45972
13398C26200o0013A05074J91111N9552G178M69747A61888o2882K99064A63312
13387E54160j40401J86798f0436D36561r5031p9737E2396c9341B16208K19210
13377D35418I3279J81058a82302I1822J33171J99332G7203n8N024L17700j83290
$$ plain form
13452 177016 467640 144674 297441 409428 170647 254964 -57080 434721 415762 35942
13441 195269 646498 303087 -18987 555231 173370 162260 265183 -3067 278227 63176
13430 375634 47293 482297 121461 340364 495874 352007 143854 293771 250080 366392
13420 366392 253935 25027 -74211 -297196 545220 216889 -103617 -43860 284174 185933
13410 185933 155857 360168 92023 497570 -70706 696306 -9682 -60559 218180 342895 145972
13398 326200 266187 105074 296185 355737 7178 476925 161888 99006 398070 163312
13387 554160 413759 600557 -60436 436561 341530 261793 52396 -39341 216208 435418
13377 435418 93279 274337 -182302 91822 224993 424325 77203 77145 82169 399869 216579
13366B16579r8180J44970A02228P0256G8651J06374H8270R0167K87942j98664
13356B67715J65037J49342k32645E1093J589j0761D531M69751p3190j68379K81493
13345E14206b27041C88747j68780r0439K83149j95926J49667r8650l8436K09283
13335D38615c1502C55553C5420R3515E8001J16277J20662J39527J38107k62276
13325C10298J77J80222A48155K10707A71214K7171K859K19407J84919k61336m3749
13314C00485J17728b8540F677N44964b5270B56204K99577k26447m5420L0217m1763
13303B72368b09417A23955J85149P7284A9028M09469N129j67320N5655n5007p8796
13292A88158C6947L90505n3592j05616N668e6990A69370n620A3689L66509r6433
$$ plain form
13366 216579 118399 263369 102228 172484 78651 185025 88270 178437 466379 267715
13356 267715 432752 582094 349449 51093 52682 41921 4531 474282 401092 232713 514206
13345 514206 -227041 388747 219967 129528 412677 216751 366418 267768 229332 438615
13335 438615 -31502 355553 35420 128935 58001 174278 294940 434467 572574 310298
13325 310298 310475 490697 148155 358862 171214 198385 201244 420651 605570 344234 300485
13314 300485 418213 -28540 6677 551641 -25270 256204 555781 329334 283914 314131 272368
13303 272368 -209417 123955 309104 386388 19028 428497 433626 266306 321961 266954 188158
13292 188158 36947 427452 373860 268244 273912 -56990 169370 163750 13689 380198 283765
13281B83765e5220C9552K02983m0982J4419Q3096A31789P6817D4614k0583j0970
13270A3061J69526O7617O2760a05575o527B47244r1066b56800C01151j22248b08388
13258a01350C4455K35101G1997l2443J47778D6463c1837C94297j5395j7905A58636
13246C95855d3622C25682A8053J65017K19644J94687H7175K36262j28929a22402
13235C61451j44165K05554a77909C23462A44157L5579E2404J8425L20699A55614
13224a40B56165d3581A47984D6421J77837J75514A89717J73603a11563E95434
13213C19521r8853i28E52116A61979n092H88R0865K4471P8836e6239M359A73826
13200g9994j94186C20201B5005L2956R2258a55181a4796o2592b2814k58370A93277
$$ plain form
13281 283765 -55220 39552 242535 201553 215972 299068 131789 208606 44614 24031 13061
13270 13061 182587 250204 312964 -105575 -112102 247244 156178 -256800 301151 178903 -208388
13258 -101350 34455 269556 71997 39554 187332 46463 -31837 394297 378902 360997 158636
13246 395855 -43622 325682 18053 183070 402714 597401 87175 323437 194508 -122402
13235 361451 217286 422840 -177909 323462 144157 179736 52404 70829 391528 155614
13224 -140 256165 -43581 147984 46421 224258 399772 189717 363320 -111563 595434
13213 319521 220668 -928 552116 161979 156887 888 91753 116224 195060 -56239 -51880 173826
13200 -79994 -274180 320201 25005 57961 150219 -155181 -14796 -77388 -22814 -281184 193277
13188B79198A456M9568L62013a43061B43083J61738J8152e1105F7384J4332K08598
13177B90314O8559a57714D87594j42936F7307J10724g9823A09594e259A59621
13166a97757o2814A80675i6487H2963b21031C11398a7800r2180p1663F4486L61788
13155D26274a89326I8555h9826B29706B6786K63040i4327A11137b7420C8037R4257
13144A32294O6712c2645k00484B28222J10049G6040J22991a46678A34685k7286
13134A07399m1155c6960C66025b48143B82789o8281G0348g3679B59685J25383
13124C85068p0522a23638A57522g4042C26670E1071J20470P355o4018i2795j94569
13113b87364A56824b46446C01183D8672A1508J31597o8023J54949i1605A80994
$$ plain form
13188 279198 1456 51024 413037 -143061 243083 404821 422973 -51105 67384 81716 290314
13177 290314 358873 -157714 487594 344658 67307 178031 -79823 109594 -5259 159621
13166 -197757 -260571 180675 -96487 82963 -221031 311398 -17800 -109980 -181643 64486 426274
13155 426274 -189326 98555 -89826 229706 26786 289826 -94327 111137 -27420 38037 132294
13144 132294 199006 -32645 -233129 228222 338271 76040 199031 -146678 134685 107399
13134 107399 66244 -36960 366025 -248143 282789 214508 70348 -73679 259685 385068
13124 385068 314546 -123638 157522 -74042 326670 51071 171541 178896 114878 -92795 -287364
13113 -287364 156824 -246446 301183 48672 11508 143105 75082 230031 -91605 180994
13102b46509b9719A50995J60243G8376J24848E4149Q2426g8826o2461B9963Q6189
13091A16152J0849L6176b1456j43364B02610p6644m4418K57733b22896J04174
13081a18722b1379B19736J0839o1863J38641a3515e582C04635i6917j12752D23769
13069B81724N60J40761a42385A23842c8110m2566A71518B2188g6514C44654g0513
13057D2166J1640a82013F0351e5289K1659c642B78112a35572A47587i1371E8325
13045i840A28971a0899A24013J34710i5082I7949a8397A88541k7506K23771g522
13033D0882b43313D0228K65094b30C17183o3099O86a16705b711p972C65250b8664
13020F2506d0819C71171h7212B89938a96819B59755J8224A09575g4901D04679
$$ plain form
13102 -246509 -29719 150995 311238 78376 203224 54149 136575 -78826 -141287 29963 116152
13091 116152 127001 163177 -21456 -164820 202610 125966 81548 339281 -222896 -118722
13081 -118722 -21379 219736 230575 168712 307353 -13515 -5582 304635 -96917 -209669 423769
13069 281724 282284 423045 -142385 123842 -38110 -80676 171518 22188 -76514 344654 -70513
13057 42166 53806 -182013 60351 -55289 -33630 -3642 278112 -135572 147587 -91371 58325
13045 -9840 128971 -10899 124013 258723 -95082 97949 -18397 188541 161035 384806 -7522
13033 40882 -243313 40228 305322 -230 317183 254084 254770 -116705 -2711 -10683 365250 -28664
13020 62506 -40819 371171 -87212 289938 -196819 259755 277979 109575 -74901 404679
13009B13949L63948H7408J20913A4139O0877a55911B5517L68523A0559J06060
12999A16619R9363a01384H7407J29410A0486K1845J80434f6236B57282g8823J6923
12988f1900B72693A18685J0983L53433B8389J51998q3856a76364n0483A03288
12977a76634p1673A11581N4570R7403a60202A45826e9191c81A68814h0294E1672
12965H6897l8315b72255E661M5681J00267a69805q119n8106D6134a0251B16380
12953B58513b4900A34575G768K73601a96754A22323l8349J04585b9416B0883K70913
12942B91796A8698a56013B427L33533j47051a66461P8320A7541K5096J81689r5722
12931A28604d3358A52609b4200k12151A7375J54129a30033O2453k31588i6891
$$ plain form
13009 213949 577897 87408 208321 14139 75016 -155911 25517 394040 10559 116619
12999 116619 215982 -101384 87407 216817 10486 32331 212765 -66236 257282 -78823 -61900
12988 -61900 272693 118685 129668 483101 28389 180387 96531 -176364 -226847 103288
12977 -176634 -248307 111581 166151 263554 -160202 145826 -59191 -381 168814 -80294 51672
12965 86897 48582 -272255 5661 51342 151609 -169805 -177924 -236030 46134 -10251 216380
12953 258513 -24900 134575 7768 281369 -196754 122323 83974 188559 -29416 20883 291796
12942 291796 18698 -156013 2427 335960 188909 -166461 -88141 17541 42637 224326 128604
12931 128604 -43358 152609 -24200 -236351 17375 171504 -130033 -67580 -299168 -96891
12920h1316L6137J3640B43768F3880a93851R194B67233A7413R368J99436p3450
12909A52767b19615A01490b16748O5034A72434j3416c38970f4990l5850a0810
12898g6219F3520K20543C630K64504F8036H997J20072a646A72918G7970N143b15103
12885b35217L9127e9616K3690F8380A877K63644R044a28786B0945C94a69794C85616
12872A3253N1251a78387f2838k9352o0923d8964F3830J0297K20483D8695j6823
12861C1872K43398c9265j01835o9775B65651j03416J5979a09803D60494b82217
12850a00971E5013O4151B2407h1978q0143A35299k5632K78015g9614j21467G7528
12838b25225D0461A3202Q657a01092G9008J75753a53488j66761A57323l8634j5565
$$ plain form
12920 -81316 -45179 -31539 243768 63880 -193851 -184657 267233 17413 26781 226217 152767
12909 152767 -219615 101490 -216748 -151714 172434 159018 -338970 -64990 -100840 -10810
12898 -76219 63520 284063 3630 268134 68036 8997 129069 -1646 172918 77970 83113 -215103
12885 -235217 -196090 -59616 -35926 68380 1877 265521 274565 -128786 20945 394 -169794 385616
12872 13253 64504 -178387 -62838 -92190 -153113 -48964 63830 74127 294610 48695 31872
12861 31872 275270 -39265 -141100 -210875 265651 162235 178214 -109803 460494 -282217
12850 -100971 55013 119164 22407 -81978 -162121 135299 109667 387682 -79614 -201081 77528
12838 -225225 40461 13202 21859 -101092 79008 254761 -153488 -320249 157323 118689 103124
12827A03124d1371j05420B616J54677n5113B1293d5401l346B69688r9111a6161
12815b1396B0113J44497j2678K11338A67237b8079k4399A78558c7956A19486D0324
12803C00117j19670c30942A39132J00702R5939b65638F3754A9206a65015j52627
12793c17642J15964F2115a43045j58224A04561N9551g7693A16272e9718j97264
12783b56982j22806H0124L7014c02758D8918K82305c13068M4936f4134A35560
12772A10492h5022I2215N551J96753A6004a26002F3415P5493E3383K42855I5658
12760b77280J03324b1688k01764F2584R1033i9943I75J20658m1122J73238E4743
12748A57641o4643A1749a97088c0913C5611q125a33842b1049C8378H628J45729
$$ plain form
12827 103124 -41371 -146791 2616 157293 102180 21293 -45401 -48747 269688 170577 -16161
12815 -21396 20113 164610 151932 363270 167237 -28079 -52478 178558 -37956 119486 40324
12803 300117 180447 -330942 139132 239834 335773 -265638 63754 19206 -165015 -317642
12793 -317642 -201678 62115 -143045 -301269 104561 164112 -77693 116272 -59718 -256982
12783 -256982 -379788 80124 117138 -302758 48918 331223 -313068 -268132 -64134 135560
12772 110492 -85022 92215 97766 294519 16004 -126002 63415 138908 53383 296238 95658
12760 -277280 -173956 -21688 -223452 62584 153617 -99943 975 121633 80511 253749 54743
12748 157641 92998 11749 -197088 -30913 35611 27486 -133842 -21049 38378 8628 154357
12737A54357a4642k19170H2738C0317i8193a9737o7991A11457d355H8683f6249
12725F7572e5024m6493B43318a35247C24163a41465D22089A58242J36537A0020
12714H7502b38659a12424a7839c510k31540d1685I4191R202J59558b8490B61034
12702A9614d01254A31563K23457h3499k65779a57439b4205C16735F5331b2996
12691C71744r9523b0052H1279J98366j24423j8762K3949J80230I6738O4198b24604
12679c8898m0027F7703J29622O4748i2640q2315I4496J22074G9599L36884F2243
12667a45564A2871L6518a73439A56023J06622n442a5372n3234A85574l0573l2697
12656A22304P7051K85999F5728l2265h493k3365a1357n9224G5859a61952p89j44299
$$ plain form
12737 154357 -14642 -233812 82738 30317 -98193 -19737 -87728 111457 -4355 88683 -66249
12725 67572 -55024 -101517 243318 -135247 324163 -141465 422089 158242 294779 10020
12714 87502 -238659 -112424 -17839 -3510 -235050 -41685 94191 103393 262951 -28490 261034
12702 19614 -401254 131563 355020 -83499 -349278 -157439 -24205 316735 65331 -22996
12691 371744 272221 -20052 81279 279645 155222 136460 160409 340639 96738 160936 -224604
12679 -38898 -78925 67703 197325 262073 -92640 -174955 94496 216570 79599 416483 62243
12667 -145564 12871 49389 -173439 156023 262645 257203 -15372 -68606 185574 155001 122304
12656 122304 199355 485354 65728 33463 -8493 -31858 -11357 -70581 75859 -161952 -162741 -307040
12644c07040h8628K4009j13051B55830d0970C9010a10433A70712J07026A17379
12633B42097A20883Q441E2537J59743n6545p3640b44546L0361E0377M8128k076
12622I6429K92133D9461j202L55958j23976a35090f4637A57222k2240K4860a3898
12610a67817H6764K99730j65992C415M6824B4829M59099a17708j88937A77453
12599E39325A62708b308F9064c12814h7512i591j09129M8363A0378a68166P9406
12588h8760D071M2196J80648e6664A96523h3532B81043A02590K4524n6927Q1533
12577A51720o6517l7650d17642A80803A4894a01262A40441K32612H5632N3215
12567A38847B6296b37149j4768F2929J32153d506q4876b9869B08203H204M8426
$$ plain form
12644 -307040 -88628 -64619 -177670 255830 -40970 39010 -110433 170712 277738 117379
12633 242097 120883 129324 52537 212280 155735 82095 -244546 -214185 50377 98505 96429
12622 96429 388562 49461 48259 404217 280241 -135090 -64637 157222 134982 159842 -13898
12610 -167817 86764 386494 220502 3415 50239 24829 483928 -117708 -306645 177453
12599 539325 162708 -2308 69064 -312814 -87512 -9591 -118720 -70357 10378 -168166 -88760
12588 -88760 4071 46267 226915 -56664 196523 -83532 281043 102590 127114 70187 151720
12577 151720 85203 47553 -417642 180803 14894 -101262 140441 373053 85632 138847
12567 138847 26296 -237149 -251917 62929 195082 -4506 -89382 -29869 208203 8204 56630
12556E6630K81469E9386d8840D7816c34086J22323I2902m2483O6100a9014q9262
12545a08276J1767A53153C711a587F2444e7025p919I0035c34910g4451B53975
12533C05769c73360B97071j17343c2829A30524k334m7965b49356A22052K35197
12523C57249c60873A80636a91250A91424L1277c6398j49708B86365a86988c2821
12512c19850C7645a53635M4290c2726G9814b62316J13072B87778H6410c2953D16692
12500A25818b09435A09242h1145n9556e1113C4423c15839d1175A37982j0490a23259
12488b07837B23836C3836e2804D7965b42431A4949J69632l9034b20341e772D0102
12476H1762Q6724c8310A30310a90870j715D4494j9146L8794c59159N8293J06835
$$ plain form
12556 56630 338099 59386 -48840 47816 -334086 -211763 92902 50419 116519 -19014 -108276
12545 -108276 -96509 153153 3711 -1587 62444 -57025 -64944 90035 -334910 -74451 253975
12533 305769 -373360 297071 179728 -32829 130524 128190 80225 -249356 122052 357249
12523 357249 -360873 180636 -191250 191424 222701 -36398 -186106 286365 -186988 -32821
12512 -319850 37645 -153635 -109345 -32726 79814 -262316 -149244 287778 86410 -32953 416692
12500 125818 -209435 109242 -81145 -140701 -51113 34423 -315839 -41175 137982 127492 -123259
12488 -207837 223836 33836 -52804 47965 -242431 14949 184581 145547 -220341 -5772 40102
12476 81762 168486 -38310 130310 -190870 -192585 44494 25348 64142 -359159 -300866 -194031
12465a94031H9618G725K55935b9449p7503c1242B21348F4335J46067a03489J6791
12454h6698E5255j2044h2571A3320K56852F9176A4947J19078b43010J07294k5935
12443a61651b7430j49003I5184a63049I0988A8833g4926b0893k9846h634l02306
12432c10940B4847P2897A2922a72980B47429J48181j48788a23506D6683J89977
12422B36660j10980a85604j26837c4227j56508K2986A23512a10158A22532o1180
12412F1352g9660k11087a14610r213k43650J56950A4377m706M1774a51254f7825
12400A35976c3387I2634k2354B7996r736a4248l4924j29360G6854c06598a1486
12388a98289R0028q8919O1632C9288b85605N0893J733g8911I9163c4365E7676
$$ plain form
12465 -194031 89618 7725 263660 -29449 -106952 -31242 221348 64335 210402 -103489 -86698
12454 -86698 55255 43211 -82571 13320 270172 69176 14947 134025 -243010 -135716 -161651
12443 -161651 -27430 -176433 95184 -163049 90988 18833 -74926 -20893 -50739 -8634 -310940
12432 -310940 24847 97744 12922 -172980 247429 395610 246822 -123506 46683 236660
12422 236660 125680 -185604 -312441 -34227 -190735 -167749 123512 -110158 122532 61352
12412 61352 -79660 -290747 -114610 -123823 -367473 -210523 14377 9671 51445 -151254 -67825
12400 135976 -33387 92634 70280 27996 18260 -14248 -49172 -178532 76854 -306598 -11486
12388 -198289 -108261 -197180 -135548 39288 -285605 -234712 -232979 -78911 99163 -34365 57676
12376a65075B40884b92139e5802N559J063A19972Q1156B467K5611J03147J4546
12365A45771E6897L2844J06918L214b2838H2725l0794J0043O873J59441B7443
12353c02240I0570J22251A02474g6377b4958D41707F7640e3739A37847g57E0924
12341A3083c9704A95201g2241A60704d7193C12135A29106b48069A6823g8591H7468
12329a99143I7168K19620j25388b16297b2173A22462a02040B57594c4559A06500
12318d5239B09292b32940A15170B9455a58815A07630L50078A27602O0308D3938
12307E8569I137a59464d2105C08858M021p3703a03485C78339A43314m058d3592
12295B95201d275B77089q8269D0254a93541c2824G1027a24106F6111j4814c78944
$$ plain form
12376 -165075 240884 -292139 -55802 -50243 -49180 119972 201128 2467 28078 131225 145771
12365 145771 56897 89741 196659 199873 -22838 82725 51931 61974 68847 228288 27443
12353 -302240 90570 212821 102474 -76377 -24958 441707 67640 -53739 137847 -757 50924
12341 13083 -39704 195201 -72241 160704 -47193 312135 129106 -248069 16823 -78591 87468
12329 -199143 97168 316788 191400 -216297 -22173 122462 -102040 257594 -34559 106500
12318 -45239 209292 -232940 115170 29455 -158815 107630 457708 127602 187910 43938
12307 58569 9137 -159464 -42105 308858 312879 239176 -103485 378339 143314 139256 -43592
12295 295201 -4275 277089 188820 40254 -193541 -32824 71027 -124106 66111 51297 -378944
12283D8740k2342K49414A31043n3306J16295k9300A7839O0680a05012A31343K2739
12272A54082D8985K04834r4188J32732e9062A13666k7673J39023A09697M66895
12262E76592F376K07834P149G3561P8020J71652b4296B02031J4455J3275H0212
12250G9263l3626R0004k2422M19605a22643H978K75970l6378P7201m0873j05579
12239A79319a1286B3459J51911g06B78790h1608F7983N5933b33276C73729A68059
12227C83186a46859M285C00711a54588A57175C6517f3455A51890c18943J45374
12217a73569k01509e60A17468J32692B9176c147A17536J42046G0012J19249J08900
12206B98161p0887d7653B46662a5506D00386j20741L9296J95147j82586N6721
$$ plain form
12283 48740 26398 275812 131043 77737 194032 164732 17839 78519 -105012 131343 154082
12272 154082 48985 253819 159631 292363 -59062 113666 85993 225016 109697 576592
12262 576592 6376 214210 221359 73561 151581 323233 -24296 202031 216486 229761 80212
12250 79263 45637 135641 113219 532824 -122643 8978 284948 248570 325771 284898 179319
12239 179319 -11286 23459 175370 -706 278790 -81608 67983 123916 -233276 373729 168059
12227 383186 -146859 -142574 300711 -154588 157175 36517 -63455 151890 -318943 -173569
12217 -173569 -375078 -560 117468 250160 29176 -3147 117536 259582 70012 189261 298161
12206 298161 227274 -47653 246662 -15506 400386 279645 318941 514088 331502 388223
12196C88223H1108J9435k6709A4208J48770o7152L0674m8314J21807b83364B82507
12184A65642j1045K20945j53896J04392P4275A48303J49845p2221n5135j04K88384
12173D59072j47961a55285A12748a07225M5258a0870A58931g1388E0867L78642
12163D29509L5606F0166L03119j80055L7773a15858d1077B01612r3319J80270
12153B88563b2352D3162j9815J69340n7977J5099j232K40603o7697D0528K39650
12142B80178j9649e6077A03843i3336F5417O1027D7914O4278g9954j33080B38129
12130A9295f5433A42112B0923J81190a30961C34133i8281B76052f3912B19302
12119D01204a06270E117J43550K0664l4468K84701F8626P3568i1412d3144A36823
$$ plain form
12196 388223 81108 100543 73834 14208 162978 95826 126500 78186 199993 -283364 282507
12184 165642 154597 375542 221646 326038 400313 148303 298148 225927 170792 170688 459072
12173 459072 311111 -155285 112748 -107225 -61967 -10870 158931 -71388 50867 429509
12163 429509 465115 60166 363285 183230 221003 -115858 -41077 201612 108293 288563
12153 288563 -22352 43162 23347 192687 134710 149809 148577 389180 321483 40528 280178
12142 280178 260529 -56077 103843 -93336 65417 126444 47914 112192 -79954 -213034 238129
12130 19295 -65433 142112 20923 202113 -130961 334133 -98281 276052 -63912 219302
12119 401204 -106270 5117 148667 169331 134863 419564 68626 142194 -91412 -43144 136823
12107B41605j13645b5404B49586H8455M7169B6110J06361d8583C7681i1396c1198
12095g9386c2157F5392e9504g734C50072C7850K10668g9981j38936B19844J96455
12084D16299J3235j01373E6300a66582B86626A03673a88120F8854K45948a29205
12073B15461a78806C9540f0520E9323P6369M9486J92341l2467d4287B69190r9790
12062A69400J81448j22052L8322g8388A16866J370D6415J86259J25841m6639J04290
12051D16166j83997F3582e6051B18339e1809l9349D6579O8059l2482a77292C29057
12039c1798A97236k2427e3488C57906J5374C9961L39532a0258A15598a22034B07769
12027G9329j2456K20466q3072G7398b04012F6366k563J03209K42223h6012m6771
$$ plain form
12107 241605 127960 -25404 249586 88455 135624 26110 132471 -48583 37681 -91396 -31198
12095 -79386 -32157 65392 -59504 -7734 350072 37850 248518 -79981 -218917 219844 416299
12084 416299 429534 328161 56300 -166582 286626 103673 -188120 68854 314802 -129205
12073 215461 -178806 39540 -60520 59323 135692 185178 377519 345052 -44287 269190 169400
12062 169400 350848 228796 267118 -78388 116866 118236 46415 232674 358515 311876 416166
12051 416166 232169 63582 -56051 218339 -51809 -91158 46579 114638 82156 -177292 329057
12039 -31798 197236 174809 -53488 357906 373280 39961 379493 -10258 115598 -122034 207769
12027 79329 66873 287339 204267 77398 -204012 66366 63803 167012 409235 -86012 -132783
12016a32783A67557J25047D1698B172J04848a22050F5759b0641h085B36007n4186
12005A81821i5860A4500a28727B10799B9737L19428b77339J05929G1039R3727
11995A64766e5190n5683A52591g9740A73624F8977b14025R1415k57106J53422
11985b26294D3370J80698j10334d4530B2869P1448h2642c6334j65975m7573J18662
11974a31220k90318A71321a85573A48574D3854L6175c3859H6100d8548j66762
11964b15310A52680J1780E0288b86937i9144A54196F1904b23560o4386p2843A07938
11952B21011c3238A35742a19797d1790D02954A52489a23330A94488J1114i865
11941a00002B0462a3119B18838b4353n8543n6512B11831e7938m6730j3541A61297
$$ plain form
12016 -132783 167557 292604 41698 2172 107020 -122050 65759 -20641 -8085 236007 181821
12005 181821 -95860 14500 -128727 210799 29737 349165 -277339 -171410 71039 164766
11995 164766 -55190 -110873 152591 -79740 173624 68977 -214025 -122610 -379716 -226294
11985 -226294 43370 224068 113734 -44530 22869 94317 -82642 -36334 -202309 -249882 -131220
11974 -131220 -421538 171321 -185573 148574 43854 80029 -33859 86100 -48548 -215310
11964 -215310 152680 164460 50288 -286937 -99144 154196 61904 -223560 -287946 -360789 107938
11952 221011 -33238 135742 -119797 -41790 402954 152489 -123330 194488 205602 -9865
11941 -100002 20462 -13119 218838 -24353 -82896 -139408 211831 -57938 -104668 -118209 161297
11929h1446A22252b77595c6851A69901l2665N4428C8035J89544b4361r6722E4773
11917A35279e5046h632l18886g6493n5234j12234d1482E8931h7771E0773Q2173
11906A32946n3316a47364A21453c4004A64661h849k23472A67541L4605H832b11842
11894A97394F7929B0484Q8057A6431O8814d1577A9503K5096k1375c18249i11n5062
11882e5973A665b90177J37853m6779C01780j09203c08691E7830j6518P601a24588
11870H2067h6475E6932a62649B0057a53697G8899c23454a26941A47472b3883A58724
11858b99812M3082Q6736E0381g4753c1629m3073j55211C7663a08787A98680i8746
11846A41182a61905A374K69553J6585a19604n8932H4310a4841j72278A55575L64578
$$ plain form
11929 -81446 122252 -277595 -36851 169901 137236 191664 38035 227579 -24361 -121083 54773
11917 135279 -55046 -8632 -327518 -76493 -131727 -243961 -41482 58931 -87771 50773 132946
11906 132946 79630 -147364 121453 -34004 164661 -8849 -232321 167541 202146 8832 -211842
11894 197394 67929 20484 108541 16431 85245 -41577 19503 44599 23224 -318249 -911 -55973
11882 -55973 1665 -290177 -152324 -199103 301780 192577 -308691 57830 41312 48913 -124588
11870 82067 -86475 56932 -162649 20057 -153697 78899 -323454 -126941 147472 -23883 158724
11858 -299812 -256730 -169994 50381 -74753 -31629 -74702 -229913 37663 -108787 198680 -98746
11846 141182 -161905 1374 270927 287512 -119604 -178536 84310 -14841 -187119 155575 520153
11835E20153a90832D2496e7509l9457j86821B91240c22700J43219A04772M3565
11825A48337J91046j58024a23328J2668k4886j97784A2621c1808j68340A09811
11814I9514J01825E4644a25164B78876g5094A10753N7084F6812a35669m3702B5382
11802a22608k2483C2893a96135O6112n2119A55823p2632J3437a92324H0920k07
11791H0713c49318F8140b78489M1968q6639J9494A07271a21587j61314a794B63914
11779B22098F5509b24512a03102n0043q3392c207k33931Q4105H1011h5648b6347
11767A73994c31230E1170b54708c0107J3008A96565a63205H1209d0790b559G1984
11755A29033d5635j17448d541k04563C01696b57679c2239j54544A74926b11223
$$ plain form
11835 520153 -190832 42496 -57509 -96966 -283787 291240 -322700 -179481 104772 148337
11825 148337 339383 181359 -123328 -110660 -135546 -333330 12621 -31808 -200148 109811
11814 99514 201339 54644 -125164 278876 -75094 110753 167837 66812 -135669 -179371 25382
11802 -122608 -145091 32893 -196135 -130023 -182142 155823 83191 96628 -192324 80920 80713
11791 80713 -349318 68140 -278489 -236521 -323160 -303666 107271 -121587 -282901 -1794 263914
11779 222098 65509 -224512 -103102 -153145 -236537 -3207 -237138 -153033 81011 -85648 -26347
11767 173994 -331230 51170 -254708 -30107 -17099 196565 -163205 81209 -40790 -2559 71984
11755 129033 -45635 -163083 -4541 -209104 301696 -257679 -32239 -186783 174926 -211223
11744C9437a7785k00988A412e4404j6478c46l3024G4834P4682K00393b3509j21528
11732a45037q7922A25990Q561c68713a70977G4664a08950B5855a20732c1226A16463
11720A6410J63643h1842j92225i4422o7975b0886C25615c8104p0508B40641D277
11708C25976l1712b80707a28237b1368j03616B25826a64800B7125c6309A75506
11697a54478c7033m4269l5770D276d51926H7713K4481M2889E9803M7933a21924
11685i3309n7652A93278m8576a17571A70270q3610J82220g6828A27548a92245
11674D8149Q6613A2907a23297A77535E3491f1535R139A59439J02246A04880O7116
11663A71996n5797g0690j52330A4100K35569c25842B57057j1890m2937b12647
$$ plain form
11744 39437 -17785 -218773 1412 -54404 -70882 -346 -33370 74834 149516 349909 -23509 -145037
11732 -145037 -232959 125990 134551 -368713 -170977 74664 -108950 25855 -120732 -31226 116463
11720 16410 180053 -81842 -274067 -94422 -162397 -20886 325615 -38104 -108612 240641 4277
11708 325976 294264 -280707 -128237 -21368 -124984 225826 -164800 27125 -36309 175506
11697 -154478 -37033 -81302 -117072 4276 -451926 87713 112194 155083 59803 107736 -121924
11685 -93309 -150961 193278 144702 -117571 170270 86660 268880 -76828 127548 -192245
11674 48149 134762 12907 -123297 177535 53491 -61535 -52396 159439 261685 104880 171996
11663 171996 116199 -70690 -223020 14100 249669 -325842 257057 245167 202230 -212647
11652A70703J69873a18883B96499j12836k3476b18810A19890A770K2837J68483
11642A93090C9181c50988e4283H4233b56257a23179B08166d6065C35654l4931
11632C00723J56072h7675A4592i0095b4471C42513B5837a82675B66757a78256
11621A15325a70997f6254A78689b72153c0125k8136A69819o2412f9220k5010L1798
11610f2432l4353A61853k2615K63279a44022d2780j19794E9386K32260a11762
11599c8138B16117j4654J14104l6002j20200B871a97690k70900h3454C7739b63195
11587H6590f1614A05376J5700d0420A2060a05041J9134L3341B19855m6972j27
11576A72756e9020B81863A01181J29245H626K11862E1213K4133d01093F4310O9497
$$ plain form
11652 170703 340576 -118883 296499 183663 160187 -218810 119890 1770 24607 193090
11642 193090 39181 -350988 -54283 84233 -256257 -123179 208166 -46065 335654 300723
11632 300723 456795 -87675 14592 -90095 -24471 342513 25837 -182675 266757 -178256
11621 115325 -170997 -66254 178689 -272153 -30125 -58261 169819 107407 -69220 -94230 -62432
11610 -62432 -96785 161853 139238 402517 -144022 -42780 -162574 59386 291646 -111762
11599 -38138 216117 201463 315567 279565 159365 2871 -197690 -468590 -83454 37739 -263195
11587 86590 -61614 105376 121076 -40420 12060 -105041 -85907 -52566 219855 172883 172756
11576 172756 -59020 281863 101181 230426 8626 220488 51213 75346 -401093 64310 133807
11565A33807A4411a56753C71405j73654J76209A17583b83586A89099D5392b25842
11554C0053d312A42387J42794a2000C21504J59235d3290A97063q0193k6117J55733
11543B46486A19115c2501G3211a72726G7418K41777o0663L993f1997K94i997A15471
11530a13348C6433j1927R845J64883f5796a0058D13834c31070D064a66970B07304
11518c84290C489b10098C1375M41871E5749L1057J060O7450d0323k8778A7171
11506g1808r6022d0312A62075n3141i9858j05302A20964L140A1741C35J16619
11495A16954a93423B22620I7412J17559L6212L1035k5569N9908c4110C16065F1035
11483b6844B18926A07752f9083A5325L3729J05414b03066f5584A6803L11433D1242
$$ plain form
11565 133807 14411 -156753 371405 197751 373960 117583 -283586 189099 45392 -225842
11554 30053 -4312 142387 285181 -12000 321504 480739 -43290 197063 116870 90753 246486
11543 246486 119115 -32501 73211 -172726 77418 319195 258532 262525 -61997 -61703 -9997 115471
11530 -113348 36433 24506 34351 199234 -65796 -10058 413834 -331070 4064 -166970 207304
11518 -384290 3489 -210098 31375 473246 55749 86806 87866 155316 -40323 -69101 17171
11506 -71808 -167830 -40312 162075 108934 -99858 -205160 120964 124104 11741 335 116954
11495 116954 -193423 222620 97412 214971 251183 282218 256649 316557 -34110 316065 61035
11483 -26844 218926 107752 -69083 15325 49054 154468 -203066 -65584 16803 328236 41242
11471B26462e5995A82663l3339J89771A58022f6044C13548o0105l4925F3953K97261
11460C61214L49O1500G9194K59144n4442A35918N1912D3974Q4466o1280G003P1119
11448G8122K90821F9240L0933d2328A93018K3112a75862P4625B4962d2198B7955
11436C61832b6514C6338e1729k02802B1816I215J4542K27374f6045A46144a73611
11424h971B85431b88537A35632b0471F4337c7705C26390C7237Q0756N8322a3753
11412C6959O36J6047J14094a77567B03103n4045R7336a5938k6381A07104l974
11401A03130e1986A17282A2228c57308C31614a28583A97687k1949F7791N5907
11391A23698h5866l9433j91757b3512j94939J03817f530A06130a01200B07636
$$ plain form
11471 226462 -55995 182663 149324 339095 158022 -66044 313548 253443 218518 63953 361214
11460 361214 361563 423063 79194 338338 283896 135918 187830 43974 128440 67160 7003 78122
11448 78122 368943 69240 100173 -42328 193018 216130 -175862 -101237 24962 -42198 27955
11436 361832 -26514 36338 -51729 -254531 21816 9215 23757 251131 -66045 146144 -173611
11424 -8971 285431 -288537 135632 -20471 64337 -37705 326390 37237 117993 176315 -13753
11412 36959 37595 53642 167736 -177567 203103 149058 246394 -15938 -42319 107104 103130
11401 103130 -51986 117282 12228 -357308 331614 -128583 197687 175738 67791 123698
11391 123698 -85866 -125299 -317056 -23512 -218451 -114634 -6530 106130 -101200 207636
11380b020E8384F412L21456P6834E8807P3333i6380j80580B6336N4087M5331A8713
11367d18772a5820C62680b7589E0738b8856A14560J36746d20544A46433b66162
11356D1166i1877A22321a0675C72492A29269c85796J51260k1608A08952f3107
11345a04100k13696A28011e9595k96769B75943K43111c70102A09731b5850m8950
11335g4800A4850J30206a64833P0078j04011A2430J45813d55411C3179f4019B66829
11323d279k88886B93569A26616N8777b06787A51686j7705a56826E30827h7168
11312C0890J36154a8182k9855j52885G4476J3919b00056J7117p9941A1552a52641
11300B05334L46h563j64288A93392B3268A0024a67286e4775q8848A3116Q503J05303
$$ plain form
11380 -2020 58384 6412 327868 404702 58807 132140 -96380 -276960 26336 80423 125754 18713
11367 -418772 -15820 362680 -27589 50738 -28856 114560 251306 -420544 146433 -266162
11356 41166 -91877 122321 -10675 372492 129269 -385796 -234536 -256144 108952 -63107
11345 -104100 -317796 128011 -59595 -356364 275943 519054 -370102 109731 -25850 -74800
11335 -74800 14850 145056 -164833 -94755 -198766 12430 158243 -455411 33179 -64019 266829
11323 -4279 -293165 293569 126616 185393 -206787 151686 133981 -156826 530827 -87168
11312 30890 167044 -18182 -48037 -200922 74476 88395 -200056 -182939 -262880 11552 -152641
11300 205334 205680 -8563 -172851 193392 23268 10024 -167286 -54775 -143623 13116 21619 126922
11288A26922g346F37811b10034A5201j328P144c58873L8721H2238b5018E7458
11276c51640G4917d8596j74324a4710I4457e0195A04964h9909k783B61763h6904
11264G7575b19973A29899j3826M1378G0331a20779J9463A20202a89038H6829b23489
11252A13004d27655f934A82694e53512b49866c2519r3529j6188B25448C7802K8880
11241F6682A2138i089B4102b09308o2408A15094h3999k1991D9549d8350G1460
11229F2880P3148k5270D0428K1840a9664n6322D4784L1926A0005K2913a40354
11217A31313i9812d638j27464j41893d3436B09143b02475E0379B5129c08552a42963
11205b18209j98233A00533c26960H2851e24099I0779b96452i0675L7902j91799
$$ plain form
11288 126922 -7346 637811 -210034 15201 13873 21017 -358873 -320152 82238 -25018 57458
11276 -351640 74917 -48596 -222920 -14710 94457 -50195 104964 -89909 -92692 261763 -86904
11264 77575 -219973 129899 116073 157451 70331 -120779 -101316 120202 -189038 86829 -223489
11252 113004 -427655 -6934 182694 -553512 -249866 -32519 -126048 -142236 225448 37802 66682
11241 66682 12138 -9089 24102 -209308 -271716 115094 -83999 -105990 49549 -48350 71460
11229 62880 136028 110758 40428 62268 -19664 -75986 44784 76710 10005 32918 -140354
11217 131313 -99812 -4638 -132102 -273995 -43436 209143 -202475 50379 25129 -308552 -142963
11205 -218209 -416442 100533 -326960 82851 -524099 90779 -296452 -90675 -52773 -244572
11195b44572K03b7289k41097d1913B0486c9617p3962J0867q3897j8419I6092J05770
11183B01862F7536b05279i3729J6019A88041k0849d8750O424A48370P8512H2444
11171B18956K3987B9742a46299e4708D9083A5158a56157P7806j63359J0680A51146
11159b46376b1932j69414C23157E6150A9472r036N17457A52086F6589o812R834
11148F9611f1553q2036b9754a565j08531C50680E8459J45600b5099I2101J975
11137I4076D7a8516B37000l4687F9241c6351A71649B0563b31976J15934A53367
11125a67285G3602a33224e8580j22532f0778L0131j84467A21053b432j57334B49266
11113a37853B39393q4296L17851b9831A65541a12179f289A32242a13930h455F209
$$ plain form
11195 -244572 -244369 -27289 -268386 -41913 20486 -39617 -113579 -102712 -186609 -205028 96092 201862
11183 201862 67536 -205279 -93729 -77710 188041 167192 -48750 -42326 148370 226882 82444
11171 218956 242943 29742 -146299 -54708 49083 15158 -156157 -78351 -241710 -231030 151146
11159 -246376 -21932 -191346 323157 56150 19472 10436 527893 152086 66589 59777 69611
11148 69611 -61553 -143589 -29754 -1565 -110096 350680 58459 204059 -25099 92101 94076
11137 94076 47 -18516 237000 202313 69241 -36351 171649 20563 -231976 -116042 153367
11125 -167285 73602 -133224 -58580 -181112 -60778 -30647 -215114 121053 -2432 -159766 249266
11113 -137853 239393 155097 472948 -29831 165541 -112179 -6289 132242 -113930 -8455 6209
11101G8998j4049j2373K37648h1966J5850K0632A02417A3886J16820b37033F7038
11089b9795G6421g7090B8164J60741k3058a23100n086A94015a88866D1726c07658
11077B50908q0567E9663K53183a07956A78990i271m2709D00435A14733P0079J69662
11066C54474D0546L0207J03441b5534E93896A85010K22925A84940L10087A88888
11055D08829G7937J87385A01657J77097K22801j91805P04660D44592r3672Q6392
11045D37312j96888C3225M07522L513J68272m2280j07975K46845R9846j66435
11035F42533j72890M02021j01581K2721j56756K19254n5952B87297M62115M9323
11025G98735K6599j31272k78343L18488l09908L19274B51615O58382q8068R9668
$$ plain form
11101 78998 64949 52576 290224 -81966 -66116 -45484 102417 13886 130706 -237033 67038
11089 -29795 76421 -77090 28164 188905 165847 -123100 -128186 194015 -188866 41726 -307658
11077 250908 170341 59663 312846 -107956 178990 -9271 -51980 400435 114733 184812 354474
11066 354474 40546 70753 174194 -25534 593896 185010 407935 184940 495027 188888
11055 408829 77937 265322 101657 278754 501555 309750 1014410 444592 350920 437312
11045 437312 240424 33225 440747 444260 612532 570252 462277 709122 808968 642533
11035 642533 469643 871664 770083 792804 636048 855302 799350 287297 749412 798735
11025 798735 825334 694062 415719 734207 424299 743573 251615 909997 821929 921597
11015I21597l58043M1046J30585j6591O1092R0049k61899J18028J59803l03765
11005E81902m100j13068J05723J93181j11313j66607N74142k06941k22138A91088
10994F59799J68696k73171k21974N98404m32856j28756K17813k53785J47413L19061
10984H00644j95664k07175K93941j23477K43233l97585M44247R0193J6911k90913
10974F74355l5678N1040K38193k65791L42491N7183l32139M21682R7249j51976
10964A096609k15439Q0359M5313J66891L80404J38302J81272m43299L44213n6818
10954A717807N29759j084K10497R4168j57788k10655J20850k43843l75280L65538
10944B049969l10546R5513m2429K34456k30116J36480l356j04211p7113j49439
$$ plain form
11015 921597 563554 604600 735185 718594 779686 869735 607836 725864 885667 581902
11005 581902 577802 464734 570457 763638 652325 485718 1059860 852919 630781 191088
10994 659799 828495 555324 333350 931754 498898 370142 587955 334170 481583 800644
10984 800644 604980 397805 691746 568269 811502 413917 858164 948357 965268 674355
10974 674355 638677 689717 927910 662119 1004610 1061793 729654 1151336 1248585 1096609
10964 1096609 881170 961529 1006842 1173733 1554137 1692439 1873711 1430412 1774625 1717807
10954 1717807 2247566 2246482 2456979 2551147 2393359 2182704 2303554 2059711 1684431 2049969
10944 2049969 1739423 1834936 1792507 2026963 1796847 1933327 1929971 1825760 1748647 1599208
10934A599208j96813k48247q9010L99187m94205m42135j4518l7009A89374L51716
10924E41090A61612K95031a09084H5241J56800J0955l1870Q6047a62713A83842
10913G4868P743J57692g2826A24531K45073A21714J340R9336j0871a32200c9286
10901A38166M4571e6964I6428h2391A0108b04259A78021k3373b77233b2413h639
10889e5882j5016j9201o2428j06819e6909A59959B0084L8498f0849B37095B9595
10877b02702A07864a44414j06608A5267N0289J52271F5300i0499j62k7260I4717
10865c26764a14089C18106b81563b843l6997n574A97713p974b25682j64011J05195
10854b84498D1428J0054K45601c23569b8514j48974C06116G5641a35757B20563
$$ plain form
10934 1599208 1402395 1154148 1065138 1464325 970120 527985 513467 476458 189374 541090
10924 541090 161612 456643 -109084 85241 242041 252996 221126 307173 -162713 183842
10913 74868 82611 240303 -72826 124531 369604 121714 123054 222390 211519 -132200 -39286
10901 138166 182737 -56964 96428 -82391 10108 -204259 178021 154648 -277233 -22413 -8639
10889 -55882 -70898 -90099 -152527 -259346 -56909 159959 20084 58582 -60849 237095 29595
10877 -202702 107864 -144414 -251022 15267 65556 217827 65300 -90499 -90661 -117921 94717
10865 -326764 -114089 318106 -281563 -2843 -39840 -45414 197713 189739 -225682 -389693 -284498
10854 -284498 41428 51482 297083 -323569 -28514 -177488 306116 75641 -135757 220563
10843a18268M09A24298A5253K6578a33889k49236f5578l23261a2442l8087B5527
10831B40762J32671f0070F2322b10954E5933a26143k02262j6043a5116D4784f4183
10819c63354a3494k95899g8772j53510R6751F7727f516D0382q526L21637A53474
10807B11183l1903L3440d23737a45213f7653j5404B06211A7403e5119F008c6207
10795a18350A44884g7959A0413b74691a00519M7207J8759G2173d37271A54294
10784H6521a27427B35611c33485h0267L5440m43235A41648n8564Q6215R8872j02298
10773A65873B8879K72411j33985a19246B28328B1585J42635o9930l8381k0404
10763C5505a32513L0458B72649E2884c0131j15898B76958b72985A11452L4672
$$ plain form
10843 -118268 -117859 124298 15253 41831 -133889 -383125 -65578 -388839 -12442 -50529 25527
10831 240762 373433 -60070 62322 -210954 55933 -126143 -328405 -344448 -15116 44784 -64183
10819 -363354 -13494 -309393 -78772 -232282 -135531 67727 -6516 40382 31856 353493 153474
10807 211183 179280 212720 -423737 -145213 -67653 -83057 206211 17403 -55119 6008 -36207
10795 -118350 144884 -77959 10413 -274691 -100519 -53312 -34553 72173 -437271 154294
10784 86521 -127427 235611 -333485 -80267 -44827 -488062 141648 83084 169299 268171 165873
10773 165873 28879 301290 167305 -119246 228328 21585 164220 94290 55909 35505
10763 35505 -132513 -102055 272649 52884 -30131 -146029 276958 -272985 111452 146124
10753A46124N51h3866r4589h4584j73658M6765H6252a3511D6117c12321J36740
10742a75581k02532b4656p9883k93606C11481a3443j04321c2493l34733g3237
10731b53981a02567j85636a15791o5962l22034b3126k83735e9919A2532K1921
10721C4453O3028b07226e067H9872J76762j28884a70814b0227j14361L0177L1878
10710g2533A36237k7857d6082j74019c3029A8732J67745f4740I0614b69009F7626
10698d4915l2161B07601a69816C77553c8151j84353m9760g4204p3152c9313A4955
10686A70352b62791b9990B2878c48400A49561a34662K995H7840j5675a12111L8114
10675g3997j92101F9042b76420A27296a71907f6714k20508I3048J33529H5131
$$ plain form
10753 146124 146675 -83866 -178455 -84584 -258242 -211477 86252 -13511 46117 -312321 -175581
10742 -175581 -378113 -24656 -104539 -398145 311481 -13443 -117764 -32493 -367226 -73237
10731 -253981 -102567 -288203 -115791 -181753 -503787 -23126 -306861 -59919 12532 34453
10721 34453 97481 -207226 -5067 89872 266634 137750 -170814 -20227 -134588 -104411 -72533
10710 -72533 136237 108380 -46082 -220101 -33029 18732 186477 -64740 90614 -269009 67626
10698 -44915 -77076 207601 -169816 377553 -38151 -222504 -272264 -74204 -147356 -39313 14955
10686 170352 -262791 -29990 22878 -348400 149561 -134662 -131667 87840 72165 -112111 -73997
10675 -73997 -266098 69042 -276420 127296 -171907 -66714 -287222 93048 226577 85131
10664e0509A6845J12851P8281F9522j1152a73281M1229J1945k18699a8170k13249
10653b31419b3928m8401j03556L8754a4848a093j73493j69956A13188f5996K6939
10642c9057B66057H1188L6365i3954j17006j04189a40877K6783A8777a11727I9443
10630B69927a45667A11695a23567F0856h7811B29111b45003n8246a35369d5145
10619i1955j05393K0793F0504J08203j096b12231f6168A8405N3617o205B15b10810
10606I5269f3701p428b6412j40943A9889b2585j38410A30300g3331n6467F4823
10594D91f9261a1227k37233k92705J83460A79376m2165C5030g3561k7397b832
10582B08643e391G0381b55049B86236e5211J5228j47795A4459c11464q0450B09355
$$ plain form
10664 -50509 16845 129696 207977 69522 58370 -173281 -132052 -120107 -338806 -18170 -231419
10653 -231419 -23928 -72329 -175885 -137131 -14848 -1093 -174586 -344542 113188 -65996 -39057
10642 -39057 266057 81188 117553 -93954 -210960 -315149 -140877 -114094 18777 -111727 99443
10630 269927 -145667 111695 -123567 60856 -87811 229111 -245003 -303249 -135369 -45145
10619 -91955 -197348 -176555 60504 168707 167611 -212231 -66168 18405 72022 65817 215 -210810
10606 95269 -63701 -71129 -26412 -167355 19889 -22585 -160995 130300 -73331 -129798 64823
10594 491 -69261 -11227 -248460 -541165 -357705 179376 137211 35030 -73561 -100958 -2832
10582 208643 -5391 70381 -255049 286236 -55211 -39983 -187778 14459 -311464 -391914 209355
10570c8034k04992G9256j1369R0518a0105l20005C4513b2981I4996G436d08897
10558i6799B3982a35492C849K25142A7507n160h972m03147a0304C38551A14120
10546a38124B69557d828A96234f6157c0664k5910l9385D5548k613a07810e595
10534a14003D2307h2367A82858d9568b3246Q01j08717q584E763d6810A17726L72264
10522D89990C5476a09962k56828H4709c82779J00817a30937n5249b9796B6328
10511a33865A39819m9428b85911l8316e177k89802C2424c2565j17355n186f5641
10499b11949k89746K42515O6378O0089A10538b14684N4700O3796a1045k92911
10489c03956F7055K6878N3419a95750d7768l16608O0421k1858D23345b09776m5205
$$ plain form
10570 -38034 -243026 79256 67887 158405 -10105 -330110 34513 -22981 94996 7436 -408897
10558 -96799 23982 -135492 3849 228991 17507 12347 -8972 -412119 -10304 338551 114120
10546 -138124 269557 -4828 196234 -66157 -30664 -56574 -95959 45548 42935 -107810 -5595
10534 -114003 42307 -82367 182858 -49568 -23246 -22445 -131162 -139746 5763 -46810 117726 489990
10522 489990 35476 -109962 -366790 84709 -382779 -281962 -130937 -186186 -29796 26328
10511 -133865 139819 90391 -285911 -324227 -5177 -294979 32424 -32565 -149920 -155106 -65641
10499 -211949 -501695 -259180 -192802 -132713 110538 -214684 -159984 -96188 -11045 -303956
10489 -303956 67055 93933 147352 -195750 -47768 -364376 -303955 -325813 423345 -209776 -254981
10478b54981A66668b54936l1384i2894a6058j57459k5889n3166A07486a13527
10467H2587a8956A69233R4360m9949A7719L55105K8787R9242j64934J5671J146
10456C52736q023C0669M8013f5401K6923E19175A31291E2371f4699Q500H0492
10444c07273B21024b68382l17568c2467A22373A6163R1581f4964j20199B54538
10433c74327J59617i8441o422j60120B26416a65868B04174a78499N9872e5226
10422d3505B56809f862A64385f3174o960C98908A98431c15601e2065C5375J45675
10411A81050E2806c22467L5308i0879f515D3422J25304q1405a5143l17159i5652
10399b3095D3919a52226d8675l4092p0707C7766f3877l8157b0721k03822k07637
$$ plain form
10478 -254981 166668 -254936 -286320 -92894 -16058 -173517 -199406 -252572 107486 -113527
10467 82587 -18956 169233 263593 213644 17719 372824 401611 500853 335919 351590 352736
10456 352736 344713 30669 78682 -65401 -38478 519175 131291 52371 -64699 -56199 80492
10444 -307273 221024 -268382 -585950 -32467 122373 16163 107744 -64964 -185163 254538
10433 -374327 -214710 -98441 -104863 -264983 226416 -165868 204174 -178499 -118627 -55226
10422 -43505 256809 -6862 164385 -63174 -70134 398908 198431 -315601 -52065 35375 181050
10411 181050 52806 -322467 -287159 -90879 -6515 43422 168726 87321 -15143 -332302 -95652
10399 -23095 43919 -152226 -48675 -82767 -153474 37766 -63877 -102034 -20721 -224543 -432180
10388d32180B29555d33625A58123b884A56338h5258B88740f6514r8520p2373I9718
10376C08455C0704c21122a7067A44802e6807A72117D8131N3746a12240a9026j51439
10365a70465K9886D39842h2576I4154j0216g988j52923A24209L22529N8141a9264
10353E7983K45690o2947P0328J33703A54321J98668A71646p4974J61073R6713
10343C54458l6081j41411o3358O5711B8409J49001N0414m1776J45120a1374B75916
10331D57830Q1306j20858A49951J71761D7063K3608K95024Q1849E4409J76552
10321B30961I9498K78128I7408O9042K33398m4580D0710J38802K39025r0808a28033
10309g9839A31656n6353a8964A86660J00607j23067l633a26668A57575J31270
$$ plain form
10388 -432180 229555 -433625 158123 -2884 156338 -85258 288740 -66514 -165034 -237407 99718
10376 308455 30704 -321122 -17067 144802 -56807 172117 48131 101877 -112240 -19026 -170465
10365 -170465 -140579 439842 -82576 94154 83938 -7988 -160911 124209 446738 504879 -19264
10353 57983 303673 240726 311054 444757 154321 352989 171646 96672 257745 354458
10343 354458 318377 176966 113608 179319 28409 177410 227824 186048 331168 -11374 275916
10331 457830 539136 418278 149951 321712 47063 70671 365695 447544 54409 230961
10321 230961 99498 377626 97408 166450 399848 355268 40710 179512 418537 327729 -128033
10309 -79839 131656 75303 -18964 186660 287267 164200 160567 -126668 157575 288845
10299B88845k6689o5735C3360L14261f8000B02061F4504a20424D3597h9456Q975
10288h0481B01163b20905L5949B48951c0382k3806j42263A74219b2475E1676b76312
10276A76410a07697K1702D6802a6341A70103f6881n4298j99454J55134D5028b90017
10264a78278m0632d4371a2069A76636a7559O34j69741m7306A20751h1012H2904
10252A09979a64096O4711c6145F4513J05245J00400b20895C6594a19305A26835
10241a30749A78343A2139M18817G2842J42710O8762m1264q5895a44419I9221M16964
10230E16185d226E2777c7365j1478q6573e5286A828a58771J9134j04041B45691
10218A13833f4177B7105h9338e572p5006a1580B21111J3020E7167d23019c3310
$$ plain form
10299 288845 262156 196421 33360 347621 -68000 202061 64504 -120424 43597 -89456 -80481
10288 -80481 201163 -220905 -184956 248951 -30382 -54188 -196451 174219 -22475 51676 -276312
10276 176410 -107697 -85995 46802 -16341 170103 -66881 -121179 -320633 -165499 45028 -290017
10264 -178278 -218910 -44371 -12069 176636 -17559 -16925 -186666 -233972 120751 -81012 82904
10252 109979 -164096 -99385 -36145 64513 169758 270158 -220895 36594 -119305 126835
10241 -130749 178343 12139 430956 72842 215552 284314 243050 157155 -144419 99221 516185
10230 516185 -4226 52777 -37365 -48843 -135416 -55286 1828 -158771 -139637 -243678 245691
10218 113833 -64177 27105 -89338 -5572 -80578 -11580 221111 234131 57167 -423019 -33310
10206b6011j8484A17484c48297a07911k47026J39808M2959m1692A9830R5973a43028
10194A95753Q4140C1863g8573j72083a5034A06850b12494F361a47636N9149A5530
10182A89522c26858P5038j6785R0975A24558C1082R2721g1783D0344b13443A46955
10170c60767h1083A08941m2820a38712C2621j644a20911b3255j16436C57982d88
10158f7315j99279d9020B21505h5284L9903A46193h4820A03558d31403A0081a02797
10146h353k8787A69782n6671a15833j9424j76187H7896K62541a73112A6950c4456
10134b9058k56959C2243d4689l8540j44486e5266K650j85259A47464a71078e6693
10122A05749a82126j99778E1570q684J85664D4012f5589j90512F5171j7071d28694
$$ plain form
10206 -26011 -44495 117484 -348297 -107911 -354937 -215129 -172170 -213862 19830 115803 -143028
10194 195753 279893 31863 -78573 -250656 -15034 106850 -212494 6361 -147636 -88487 15530
10182 189522 -326858 -251820 -268605 -177630 124558 31082 123803 -71783 40344 -213443 146955
10170 -360767 -81083 108941 66121 -138712 32621 30977 -120911 -23255 -139691 357982 -488
10158 -67315 -266594 -49020 221505 -85284 -45381 146193 -84820 103558 -431403 10081 -102797
10146 -8353 -37140 169782 113111 -115833 -135257 -311444 87896 350437 -173112 16950 -34456
10134 -29058 -286017 32243 -44689 -83229 -227715 -55266 -52616 -237875 147464 -171078 -56693
10122 105749 -182126 -381904 51570 42886 228550 44012 -65589 -256101 65171 48100 -428694
10110A04596a04735j58543c5553A38675c36539A07177F825A096K6261a01253l6354
10099a37607k80606B0762c11428A3675d6684F7303d33628a71425j38898C01410
10088D2033J14595a71D140b89750B4297b40796a5146A01841a84758L5439p1666
10077b20985d2541l5973k9825j09612r6950a39773E5986d21772A33317a29646
10066a71511d4100l2669G6688d10849E6090h4119A93199c2796l1188E5392a40707
10054h1834A6773a53019A32523h3713C139a13837n1478j68127E25060a6016m7915
10043f3931k49892A19132K64951A55526a41045c1489F1825a84792o1034C4884
10032C30642E3709J12899a91756A64244a4814l8196A29284m1866A7899J4144Q8247
$$ plain form
10110 104596 -104735 -263278 -35553 138675 -336539 107177 6825 1096 27357 -101253 -137607
10099 -137607 -418213 20762 -311428 13675 -46684 67303 -433628 -171425 -310323 301410
10088 42033 156628 -171 4140 -289750 24297 -240796 -15146 101841 -184758 -149319 -220985
10077 -220985 -42541 -78514 -108339 -217951 -314901 -139773 55986 -421772 133317 -129646
10066 -171511 -44100 -76769 76688 -410849 56090 -84119 193199 -32796 -63984 55392 -140707
10054 -81834 16773 -153019 132523 -83713 3139 -113837 -165315 -333442 525060 -16016 -63931
10043 -63931 -313823 119132 384083 155526 -141045 -31489 61825 -184792 -245826 34884
10032 330642 53709 166608 -191756 164244 -14814 -53010 129284 87418 17899 32043 120290
10021A20290a9332p4657A39856c76374B17431c83290a45884k5132I1119k2661
10011F8458a62458k5128j07421O257D896a16920D7761A5771b71519J00327I3754
9999C5548a89046G4171K3813r850b84271c408I762J22996A4174c82265A04134
9987e5924k11634f338B6135a57875d2705A44084C5200D146d13946a52799C5251
9975A72050j857e2811A30304a64760l5116E2294g7711c6438m62132g9822c4744
9963f688D1303b7386B29472k197g7314B2287K4629G689f9668j92052C0063J76012
9951B06075c00146C2203b56416a14547A78828b65984G066a05924M9110I0407i5533
9939F702N825i9576a8551k21438J7646B00295a18404J1540m9624B11460a27687
$$ plain form
10021 120290 -19332 -93989 139856 -376374 217431 -383290 -145884 -171016 91119 68458
10011 68458 -162458 -187586 -295007 -288750 4896 -116920 47761 15771 -271519 -171192 93754
9999 35548 -189046 74171 97984 88134 -284271 -3408 9762 132758 14174 -382265 104134
9987 -55924 -267558 -6338 26135 -157875 -42705 144084 35200 4146 -413946 -152799 35251
9975 172050 170193 -52811 130304 -164760 -199876 52294 -77711 -36438 -498570 -79822 -34744
9963 -6688 41303 -27386 229472 227275 -77314 22287 46916 7689 -69668 -261720 30063 206075
9951 206075 -300146 32203 -256416 -114547 178828 -265984 7066 -105924 -56814 90407 -95533
9939 6702 12527 -99576 -18551 -239989 -222343 200295 -118404 -106864 -156488 211460 -127687
9927c12803J9791a07609q9502c0197j15124A13679k6243c06080a677F2510d1796
9915A50877B6774b20109j28960l9002B349i1855L1941D3292c72680A4818b66032
9903E8256a5160l08858A20218O0698A4061B996J12846C0458a07560J9142q0521
9892a68939j14502B52756a48421i176n25261b13397h7033R755A46350a79454B09739
9880c59520a8755j61159Q8326p7280J8306o4190P7060e1320l17415J75499j60148
9869c53384J34145j24226a17168C60203a25360G1261i2924j37230O1295e1173
9858C40345p4165c44407E8794D423p94e6594D164b01014C2610g5050p245H2517
9845A1301a15349J3741L3337C71608i214k37665a16480B6003J4963c17200C9245
$$ plain form
9927 -312803 -293012 -107609 -197111 -30197 -145321 113679 87436 -306080 -1677 62510 -41796
9915 150877 26774 -220109 -349069 -388071 2349 -91855 -59914 43292 -372680 14818 -266032
9903 58256 -15160 -324018 120218 180916 14061 2996 115842 30458 -107560 -88418 -168939
9892 -168939 -283441 252756 -148421 -9176 -534437 -213397 -87033 -77278 146350 -179454 209739
9880 -359520 -18755 -179914 -91588 -168868 -150562 -214752 -137692 -51320 -368735 -193236 -353384
9869 -353384 -219239 -343465 -117168 360203 -125360 71261 -92924 -230154 -168859 -51173
9858 340345 266180 -344407 58794 4423 3629 -56594 4164 -201014 32610 -75050 -82295 82517
9845 11301 -115349 -101608 -68271 371608 -9214 -246879 -116480 26003 40966 -317200 39245
9833b77557B01196B0721b09753o0641a14030M3509j05436b1744A25922a75967
9822b02216R2709j77582A73330b98829J26194k0944O8332o8010P2719j96155a28210
9810A69049d5581D0879a97837e5579k32379L6683m3555G3505E712O9141c49920
9798D07182D0427d0635p6016j4796A61230E6531h7887L6164j50285c0796B0029
9786A07887N7289a16954N3880G3377J610a18930j2197P908K1403c7909j009R542
9774b9376j01833j10335M0421f4127G8917a69162r012A89677e6560m7458q8145
9763a92163A2087b09156j3925q8023J49367G23a0097D7239a56848A8344b91679
9751a25032j77091a40284j2524B57592m0812a18774j08924m3453a16866J7883
$$ plain form
9833 -277557 201196 20721 -209753 -270394 -114030 -70521 -175957 -21744 125922 -175967
9822 -202216 -109507 -287089 173330 -298829 -172635 -193579 -125247 -193257 -120538 -316693 -128210
9810 169049 -45581 40879 -197837 -55579 -287958 -251275 -294830 73505 5712 74853 -349920
9798 407182 40427 -40635 -116651 -131447 161230 56531 -87887 -51723 -202008 -30796 20029
9786 107887 165176 -116954 -63074 73377 74987 -118930 -131127 -123219 -101816 -37909 -38918 -29376
9774 -29376 -131209 -241544 -201123 -64127 78917 -169162 -178174 189677 -56560 -104018 -192163
9763 -192163 12087 -209156 -223081 -311104 -161737 723 -10097 47239 -156848 18344 -291679
9751 -125032 -302123 -140284 -152808 257592 216780 -118774 -227698 -271151 -116866 -98983
9741i8983k4907j43424F1858c79177K3526J42923A42838i6866A9157b56439i8105
9729b26919D9266J36206b50485B31314a01014k80559A4469a37663I3577J9563
9719A13140a33933A40334a19117k23678A3121J35237B5103f8380B39917a75219
9708e2486m88519B67476i5183l08033B76969C699L3218a33114j41594h9167j00144
9697a89311a3607k58021a1004j16811j73827C349K50482f14559a07221E2833a29498
9685a90376g084k69195O7720l8307A18551b50506Q1256k5338R2743j43728B17899
9673b10570E1742J41353g5690j01204g6215q9296n51d4787j91186G8834b728m7667
9661e0395m16085a10738E4113Q4562a10499A78572a59166N5623F1835g0565K1028
$$ plain form
9741 -98983 -123890 -267314 61858 -379177 -355651 -212728 142838 -96866 19157 -256439 -98105
9729 -226919 49266 185472 -250485 231314 -101014 -381573 14469 -137663 93577 113140
9719 113140 -133933 140334 -119117 -342795 13121 148358 25103 -68380 239917 -175219
9708 -52486 -541005 267476 -95183 -403216 276969 3699 36917 -133114 -274708 -89167 -189311
9697 -189311 -13607 -271628 -11004 -127815 -301642 3349 253831 -614559 -107221 52833 -129498
9685 -190376 -7084 -276279 -208559 -246866 118551 -250506 -169250 -194588 -101845 -245573 217899
9673 -210570 51742 193095 -75690 -176894 -76215 -165511 -166062 -44787 -235973 78834 -2728 -50395
9661 -50395 -466480 -110738 54113 138675 -110499 178572 -159166 -103543 61835 -70565 -49537
9650d9537A5135a02170q2584f6606j5623q998k53740f4013j19831n4299I4245
9638i323k3143a4146p2507G6257c62972j9489a61137A43037d0995j33750j57998
9627c32743J14055G0103b33649h9736A53928c63402J36850C2071a4525H0874b62497
9615C1781a12044k8335K1304r9086a02302k23973j88406b16484g2144E4630c92165
9603D51934b42390G1239a91382a5560l8292J7236D51882a23045d2899j99094E5426
9591b32689h874A43296J14592a07100c7372o7181j65054L5175e6105r836B11858
9579B0848a25734k9540m0865c2337j40575r0817J09461p5829A11911G823a64499
9567b04177A99080G9228L9965K5219N9320D27a22849o7666k71205H4113f135j62870
$$ plain form
9650 -49537 15135 -102170 -184754 -66606 -82229 -91227 -344967 -64013 -183844 -238143 94245
9638 -9323 -32466 -14146 -86653 76257 -362972 -382461 -161137 143037 -40995 -174745 -332743
9627 -332743 -218688 70103 -233649 -89736 153928 -363402 -226552 32071 -14525 80874 -262497
9615 31781 -112044 -140379 -119075 -218161 -102302 -326275 -514681 -216484 -72144 54630 -392165
9603 451934 -242390 71239 -191382 -15560 -53852 -36616 451882 -123045 -42899 -241993 55426
9591 -232689 -8874 143296 257888 -107100 -37372 -104553 -269607 -234432 -56105 -65941 211858
9579 20848 -125734 -155274 -196139 -32337 -172912 -263729 -154268 -230097 111911 7823 -164499
9567 -204177 199080 79228 119193 144412 203732 427 -122849 -190515 -461720 84113 -6135 -169005
9555a69005j01122i330k85510J1588a20046A84628a50677M2256k35942B10540
9544b27607R3182I0359h4539F6033f5082A79507b2443g836A00126a13883p887
9533a21770E3844a86745A9768b80581J04651H5564C3505a08208l35562a12392
9522E4125e36546B02196b14585M4294j14316n6409E2033b18871i2992j19175A3722
9510H5522a60286A06235n0635f2386B3337b12902D1709L67613a77976A65096l1464
9499A33632c79909a29227C76729G3980a3564C17606a5604j51422A15200a59869
9488e7827k40128A8844b8785e023H8130A8906M58963A08232E3765b67309J04369
9477a62940A80972c38511D7546J66958j03373b7221A26415e5251D3092c7587m7461
$$ plain form
9555 -169005 -270127 -9330 -294840 -283252 -120046 184628 -150677 -108421 -344363 210540
9544 -227607 -134425 90359 -84539 66033 -65082 179507 -22443 -7836 100126 -113883 -121770
9533 -121770 53844 -186745 19768 -280581 -175930 85564 33505 -108208 -443770 -112392
9522 54125 -536546 202196 -214585 -170291 -284607 -341016 52033 -218871 -92992 -212167 13722
9510 85522 -160286 106235 55600 -62386 23337 -212902 41709 409322 -177976 165096 133632
9499 133632 -379909 -129227 376729 73980 -13564 317606 -15604 -167026 115200 -159869
9488 -57827 -297955 18844 -28785 -5023 88130 18906 477869 108232 53765 -267309 -162940
9477 -162940 180972 -338511 47546 214504 111131 -27221 126415 -55251 43092 -37587 -85048
9466h5048k4902e0695k56961E3260J49918b10521B76501b92923m6762I803b63331
9454b61204F7428a99609n1605I258a62639b8774l2590g452B03198A4337b24214
9442B19565d2976k9984m3215A4367J66465f3580f608A15143B5546K073k596a76526
9429a20341J2862K0727l7264D1505a73588P1265L4327E0392d2905j17252G7887
9417b14249E1095b3487j47712j51411A95133G3590K30958d4313N231r2744J5461
9406a16365b2188k7513r5758O7897q9607n5879A43728a11998r5842A6227N24J76909
9394A93660A2029M0247c6356F6036b04255m2292f6467j91620i5846I039J0634
9383A9673b67660E640b5822A18047C6906c9646C2949R0241g3383F0000J55244
$$ plain form
9466 -85048 -109950 -50695 -307656 53260 203178 -210521 276501 -292923 -339685 9803 -263331
9454 -261204 67428 -199609 -251214 9258 -162639 -28774 -61364 -7452 203198 14337 -224214
9442 219565 -42976 -72960 -116175 14367 180832 -63580 -6608 115143 25546 27619 25023 -176526
9429 -120341 -107479 -86752 -124016 41505 -173588 -102323 -67996 50392 -42905 -160157 77887
9417 -214249 51095 -23487 -171199 -322610 195133 73590 304548 -44313 -39082 -131826 -116365
9406 -116365 -22188 -49701 -145459 -77562 -167169 -223048 143728 -111998 -207840 16227 16751 193660
9394 193660 12029 52276 -36356 66036 -204255 -246547 -66467 -258087 -95846 9039 19673
9383 19673 -267660 5640 -25822 118047 36906 -39646 32949 123190 -73383 60000 215244
9372B15244n1994a27453j62330P6620g0228C371a36160q8659J5222B9239d2216
9360b98411Q9146j08783e4344j99050r0847C07718b10220a1100n4171a1147p7268
9349h8415j29711J02322j3819b4982j40198l6649D6811h4888p5810H4078C1991
9337I1078J8748a95197l27698D3437O1735C1968b82642J14112k05667a02496E4817
9325H042b7811I9619B548K85404b78860A03284J8264C6552h3150B88065A4312
9313b12355A7507N5232f8744b5783k09624g9783J3849B22249b55546F252k571
9302C681b26635C7457a15079j05569R7786A52222A4963a54053o6459A9045b6473
9290d04355B49620j01216K4393e4230A84416i8474M0856G1266a64487G0180a56956
$$ plain form
9372 215244 163250 -127453 -289783 -213163 -70228 3371 -136160 -224819 -209597 29239 -42216
9360 -298411 -209265 -318048 -54344 -253394 -344241 307718 -210220 -11100 -65271 -11147 -88415
9349 -88415 -218126 -115804 -129623 -24982 -165180 -201829 46811 -84888 -160698 84078 31991
9337 91078 109826 -195197 -522895 43437 105172 31968 -282642 -168530 -374197 -102496 54817
9325 8042 -27811 99619 2548 287952 -278860 103284 121548 36552 -83150 288065 14312
9313 -212355 17507 72739 -68744 -25783 -235407 -79783 -65934 222249 -255546 6252 3681
9302 3681 -226635 37457 -115079 -220648 -122862 152222 14963 -154053 -220512 19045 -26473
9290 -404355 249620 148404 172797 -54230 184416 -98474 -57618 71266 -164487 70180 -156956
9278f49160G6363J37588c96010d5926j14867L4148j49321d1474k47574A3135d63707
9266A26131F1070G591a41397C17804b44704g0580K4089l44865P5779C30220c23258
9254C9401a33368B05177b28255A08426c2687A14595m256h7181n2265e8773F9739
9242i3625J3822l0807B5255a63823j71896a18643C26598a92557j64966J52825
9232b04698f7149H1598a57044j5632E7239c00646B13666m4622b46736k3107f1360
9220a03237H5074a23451A42967a52277j06465e5469C48201G0788a91908C5057
9209a39767d3097j38348L5072e4011E1029N8687B5293d5243B9016k773O7282d4677
9196g3756k32578a49327f852B50314M7066a50070A53799L1044E169a10662q4612
$$ plain form
9278 -649160 76363 213951 -396010 -45926 -160793 -126645 -275966 -41474 -289048 13135 -463707
9266 126131 61070 7591 -141397 317804 -244704 -70580 -46491 -391356 -315577 330220 -323258
9254 39401 -133368 205177 -228255 108426 -32687 114595 110339 -87181 -139446 -58773 69739
9242 -93625 -79803 -110610 25255 -163823 -335719 -118643 326598 -192557 -357523 -204698
9232 -204698 -67149 81598 -157044 -172676 57239 -300646 213666 169044 -246736 -269843 -61360
9220 -103237 85074 -123451 142967 -152277 -258742 -55469 348201 70788 -191908 35057
9209 -139767 -43097 -181445 -146373 -54011 51029 109716 25293 -45243 29016 26243 93525 -44677
9196 -73756 -306334 -149327 -6852 250314 297380 -150070 153799 184843 5169 -110662 -195274
9185a95274j09648J32219M5324d1344b0558A4566c360k99200j57586K20655c279
9173H6099d05551C37615b10052A36947b1038k13501R4684I5466a49737C3765L1165
9162F4930c12304d1638B10104a53273H0821C0833O0118K37110j00123a60905F1027
9150g3234b8264F9939J40621b50225g3107j28334d9746A21604A8969c66301h7657
9138c8144j51595A55862a67797h2397r0820N7834B5132d5834k15005k25376a57190
9126D1640i0899k19406B437R9622K0765l9383c49709d6475o0994B8089e1198E4884
9113d3239j48237D26987b52061J04265j1319o8542D54110a17698m5902F8971l377
9102F5594A5227O130a18666B44286g6118n6701M7555G5783A2605J62621H081J58426
$$ plain form
9185 -195274 -304922 -172703 -127379 -41344 -20558 14566 -3360 -302560 -460146 -239491 -3279
9173 86099 -405551 337615 -210052 136947 -21038 -234539 -139855 95466 -149737 33765 64930
9162 64930 -312304 -41638 210104 -153273 80821 30833 90951 328061 227938 -160905 61027
9150 -73234 -28264 69939 210560 -250225 -73107 -201441 -49746 121604 18969 -366301 -87657
9138 -38144 -189739 155862 -167797 -82397 -173217 -115383 25132 -45834 -260839 -486215 -157190
9126 41640 -90899 -310305 2437 102059 122824 83441 -349709 -46475 -107469 28089 -51198 54884
9113 -43239 -191476 426987 -252061 -147796 -159115 -227657 454110 -117698 -163600 68971 65594
9102 65594 15227 21357 -118666 244286 -76118 -132819 -85264 75783 12605 175226 8081 166507
9090A66507a00342G8474i0884a5074j10911n2185O4680M024o0981D06629j92671
9079B13958a5097j09872j90579a23510O335m1280j80903F6625g528m0394F9801
9067b76177C4382b48405L2630f4668m1244o23j09255D0045b19298C066b01340
9055a56968A49619J95194E6485a33227l6336n138A3190b05091h1919E0005i5369
9043a29955k39409J24258j010j75389A69136M7917C8504f2375j02518A10176a23096
9031d4253j74905l447P2943I3252c09130R2310C5212A7450h3790c7344D9533a32495
9018a65454B5734K17099c51907h823j55121o8744m3493H8352j3629l2614b6207
9006b46956B1928a52955C732b22102j2381O5861B59994a48824A50008h4783D505
$$ plain form
9090 166507 -100342 78474 -90884 -15074 -125985 -178170 -113490 -109466 -170447 406629 213958
9079 213958 -15097 -124969 -315548 -123510 -117175 -158455 -339358 66625 -7528 -47922 69801
9067 -276177 34382 -248405 -215775 -64668 -105912 -106535 -215790 40045 -219298 3066 -201340
9055 -156968 149619 344813 56485 -133227 -169563 -174701 13190 -205091 -81919 50005 -95369
9043 -129955 -369364 -245106 -246116 -421505 169136 217053 38504 -62375 -164893 110176 -123096
9031 -44253 -219158 -222605 -149662 93252 -309130 -216820 35212 17450 -83790 -37344 49533 -132495
9018 -165454 25734 242833 -351907 -8823 -163944 -232688 -276181 88352 74723 42109 -26207
9006 -246956 21928 -152955 3732 -222102 -234483 -168622 259994 -148824 150008 -84783 4505
8994b0049m65426K29012B8504h9944q3751p5273A63627a2428j27087M5906k62268
8983c55877m063B47829H7604b69066I5425f62882A35550b64986L8669B76602b92721
8971a36677Q179o1540i659k24647B1581a47251r8646f2938p4615o3087A23112
8959b24825C23212B3J52808J53316F6922b58528k09221b22605F7608c05289J04230
8948b01059A9454d42366a75703C7436b072D6648b79661c9824A19387h296k50523
8937b58819B1011a18167D4991a30450A13824P2700a8047B55427a58422C82697
8926a18381A38381o1241N468a63042F8009b49431i7747l1849B93588E9004h8378
8914C60315E9345b16977C69662A02715M6947a45173A72340M57644Q8197O75714
$$ plain form
8994 -20049 -485475 -256463 28504 -89944 -173695 -248968 163627 -12428 -139515 -93609 -355877
8983 -355877 -359940 247829 87604 -269066 95425 -662882 135550 -264986 -226317 276602 -292721
8971 -136677 -128498 -190038 -9659 -234306 21581 -147251 -245897 -62938 -137553 -200640 123112
8959 -224825 323212 23 152831 306147 66922 -258528 -467749 -222605 67608 -305289 -201059
8948 -201059 19454 -442366 -175703 37436 -2072 46648 -279661 -39824 119387 -8296 -258819
8937 -258819 21011 -118167 44991 -130450 113824 186524 -18047 255427 -158422 382697
8926 -118381 138381 77140 82608 -163042 68009 -249431 -97747 -129596 293588 59004 -88378
8914 360315 59345 -216977 369662 102715 149662 -145173 172340 629984 718181 1393895
8904A393895R12043K958827J785280C418743A426566n20169m27081k07748J35323
8895D06891B01568J69287P1974e3350l908B687O1169b3137H8526P2271a87143
8883c36431B91051a42225B01066j2529B3500f2400q1932p2702e0195B48245c12631
8871C14559I840f4261j98019b9118B3004h9185A57147K29225j58484A9123c45977
8859a31376j39310d0939j80262f2260k06640C1313g2345L1312l27352A77145a7926
8847c05228D0235b7173E2046d6376a8625l33849J20325c9666J4554O951j45840
$$ plain form
8904 1393895 2305938 5264765 7050045 3418743 1426566 906397 479316 271568 406891
8895 406891 201568 370855 442829 -53350 -57258 2687 63856 -23137 88526 160797 -187143
8883 -336431 291051 -142225 201066 188537 23500 -62400 -144332 -217034 -50195 248245 -312631
8871 314559 9840 -64261 -262280 -29118 23004 -89185 157147 386372 227888 19123 -345977
8859 -131376 -270686 -40939 -221201 -62260 -268900 31313 -72345 -41033 -368385 177145 -17926
8847 -305228 40235 -27173 52046 -46376 -18625 -352474 -232149 -39666 -25112 -18161 -164001
$$ [...]
##END NTUPLES=NMR SPECTRUM
##END=
