
##TITLE=AC1080_MAST01_5819146_kSWaKvAYf4
##JCAMPDX= 6.0         $$ Bruker NMR JCAMP-DX V2.0
##DATA TYPE= NMR SPECTRUM
##DATA CLASS= NTUPLES
##ORIGIN= BRUKER
##OWNER= Administrator
$$ 1.72 TOPSPIN		Version 2.1
$$ 2012-03-28 11:08:26.500 -0500  Administrator@TOPSPIN
$$ Compression mode = diff/dup
##.OBSERVE FREQUENCY= 400.13188235
##.OBSERVE NUCLEUS= ^1H
##.ACQUISITION MODE= SIMULTANEOUS (DQD)
##.ACQUISITION SCHEME= undefined
##.AVERAGES= 8
##.DIGITISER RES= 22
##SPECTROMETER/DATA SYSTEM= spect
##.PULSE SEQUENCE= zg30
##.SOLVENT NAME= COFFEE_meoh
##.SHIFT REFERENCE= INTERNAL, COFFEE_meoh, 1, 14.98061
##AUDIT TRAIL= $$ (NUMBER, WHEN, WHO, WHERE, PROCESS, VERSION, WHAT)
$$ ##TITLE= Audit trail, TOPSPIN		Version 2.1
$$ ##JCAMPDX= 5.01
$$ ##ORIGIN= Bruker BioSpin GmbH
$$ ##OWNER= Administrator
$$ $$ C:\Bruker\TOPSPIN/data/COFFEE/nmr/AC1080_MAST01_5819146_kSWaKvAYf4/20/pdata/1/auditp.txt
$$ ##AUDIT TRAIL=  $$ (NUMBER, WHEN, WHO, WHERE, PROCESS, VERSION, WHAT)
(   1,<2012-03-28 05:19:47.750 -0500>,<Administrator>,<TOPSPIN>,<go>,<TOPSPIN 2.1>,
      <created by zg
	started at 2012-03-28 05:18:41.250 -0500,
	POWCHK enabled, PULCHK disabled,
       configuration hash MD5:
       1A 1E CE 29 27 FD 77 03 67 4E F0 E3 C4 B2 CB 90
       data hash MD5: 64K
       3B 0D C8 26 9A B5 14 A1 13 DB 5F AE BC 45 6E 43>)
(   2,<2012-03-28 05:19:51.734 -0500>,<Administrator>,<TOPSPIN>,<proc1d>,<TOPSPIN 2.1>,
      <Start of raw data processing
       efp LB = 0 FT_mod = 6 PKNL = 1 PHC0 = 0 PHC1 = 0 SI = 32K 
       data hash MD5: 32K
       60 B1 18 06 84 E3 1D 4A B7 0E 63 79 3D 17 99 00>)
(   3,<2012-03-28 05:19:52.031 -0500>,<Administrator>,<TOPSPIN>,<proc1d>,<TOPSPIN 2.1>,
      <pk PHC0 = 215.3815 PHC1 = 0 
       data hash MD5: 32K
       E0 0E E8 75 D3 0D D1 3E 1A 52 AD 45 E5 62 0F F4>)
(   4,<2012-03-28 05:19:52.109 -0500>,<Administrator>,<TOPSPIN>,<proc1d>,<TOPSPIN 2.1>,
      <abs ABSG = 1 
       data hash MD5: 32K
       87 12 9E 66 CB 8A A5 7D AF A3 35 5E 9A BD 1B D2>)
(   5,<2012-03-28 05:19:52.328 -0500>,<Administrator>,<TOPSPIN>,<proc1d>,<TOPSPIN 2.1>,
      <abs ABSG = 2 
       data hash MD5: 32K
       BD EF 2C 10 43 6F 99 68 99 23 8F 20 14 B7 3D 23>)
(   6,<2012-03-28 05:19:52.375 -0500>,<Administrator>,<TOPSPIN>,<proc1d>,<TOPSPIN 2.1>,
      <abs ABSG = 3 
       data hash MD5: 32K
       8E 17 7B 20 85 3F 22 23 6D D0 AC C1 8D C9 5D 0B>)
(   7,<2012-03-28 05:19:52.406 -0500>,<Administrator>,<TOPSPIN>,<proc1d>,<TOPSPIN 2.1>,
      <abs ABSG = 4 
       data hash MD5: 32K
       14 BC 42 B1 FD 15 E6 39 8B E1 13 26 5D A2 BE 6D>)
(   8,<2012-03-28 05:19:52.437 -0500>,<Administrator>,<TOPSPIN>,<proc1d>,<TOPSPIN 2.1>,
      <abs ABSG = 5 
       data hash MD5: 32K
       01 6F EF C9 73 43 01 F2 6D 91 BE D5 7F B5 41 05>)
(   9,<2012-03-28 05:19:57.140 -0500>,<Administrator>,<TOPSPIN>,<audit>,<TOPSPIN 2.1>,
      <user comment:
       ICON-NMR User ID: COFFEE
       data hash MD5: 32K
       01 6F EF C9 73 43 01 F2 6D 91 BE D5 7F B5 41 05>)
$$ [...]
##$TP= (0..7)
150 150 150 150 150 150 150 150
##$TP07= 0
##$TPNAME0= <>
##$TPNAME1= <>
##$TPNAME2= <>
##$TPNAME3= <>
##$TPNAME4= <>
##$TPNAME5= <>
##$TPNAME6= <>
##$TPNAME7= <>
##$TPOAL= (0..7)
0.5 0.5 0.5 0.5 0.5 0.5 0.5 0.5
##$TPOFFS= (0..7)
0 0 0 0 0 0 0 0
##$TUNHIN= 0
##$TUNHOUT= 0
##$TUNXOUT= 0
##$USERA1= <user>
##$USERA2= <user>
##$USERA3= <user>
##$USERA4= <user>
##$USERA5= <user>
##$V9= 5
##$VALIST= <valist>
##$VCLIST= <CCCCCCCCCCCCCCC>
##$VD= 0
##$VDLIST= <DDDDDDDDDDDDDDD>
##$VPLIST= <PPPPPPPPPPPPPPP>
##$VTLIST= <TTTTTTTTTTTTTTT>
##$WBST= 2048
##$WBSW= 25
##$XGAIN= (0..3)
0 0 0 0
##$XL= 0
##$YL= 0
##$YMAX_a= 551887
##$YMIN_a= -663882
##$ZGOPTNS= <>
##$ZL1= 120
##$ZL2= 120
##$ZL3= 120
##$ZL4= 120
##$ABSF1= 14.98061
##$ABSF2= -5.57192
##$ABSG= 5
##$ABSL= 3
##$ALPHA= 0
##$AQORDER= 0
##$ASSFAC= 0
##$ASSFACI= 0
##$ASSFACX= 0
##$ASSWID= 0
##$AUNMP= <proc_prof1d_extract_pilot.lims>
##$AXLEFT= 0
##$AXNAME= <>
##$AXNUC= <1H>
##$AXRIGHT= 0
##$AXTYPE= 0
##$AXUNIT= <>
##$AZFE= 0.1
##$AZFW= 0.1
##$BCFW= 0
##$BC_mod= 0
##$BYTORDP= 0
##$COROFFS= 0
##$CY= 15
##$DATMOD= 1
##$DC= 0
##$DFILT= <>
##$DTYPP= 0
##$F1P= 0
##$F2P= 0
##$FCOR= 0.5
##$FTSIZE= 32768
##$FT_mod= 6
##$GAMMA= 0
##$GB= 0
##$INTBC= 1
##$INTSCL= 1
##$ISEN= 128
##$LB= 0
##$LEV0= 0
##$LPBIN= 0
##$MAXI= 10000
##$MC2= 0
##$MEAN= 0
##$ME_mod= 0
##$MI= 0
##$NCOEF= 0
##$NC_proc= -8
##$NLEV= 6
##$NOISF1= 0
##$NOISF2= 0
##$NSP= 0
##$NTH_PI= 0
##$NZP= 0
##$OFFSET= 14.98061
##$PC= 1
##$PHC0= 215.3815
##$PHC1= 0
##$PH_mod= 1
##$PKNL= yes
##$PPARMOD= 0
##$PPDIAG= 0
##$PPIPTYP= 0
##$PPMPNUM= 2147483647
##$PPRESOL= 1
##$PSCAL= 4
##$PSIGN= 0
##$PYNMP= <proc.py>
##$REVERSE= no
##$SF= 400.13
##$SI= 32768
##$SIGF1= 0
##$SIGF2= 0
##$SINO= 400
##$SIOLD= 32768
##$SPECTYP= <>
##$SREGLST= <1H.CDCl3>
##$SSB= 0
##$STSI= 32768
##$STSR= 0
##$SW_p= 8223.68421052632
##$SYMM= 0
##$S_DEV= 0
##$TDeff= 65536
##$TDoff= 0
##$TI= <>
##$TILT= no
##$TM1= 0
##$TM2= 0
##$TOPLEV= 0
##$USERP1= <user>
##$USERP2= <user>
##$USERP3= <user>
##$USERP4= <user>
##$USERP5= <user>
##$WDW= 1
##$XDIM= 32768
##$YMAX_p= 467206258
##$YMIN_p= -800759
##$CURPLOT= <Network HP LaserJet P1505>
##$CURPRIN= <$Network HP LaserJet P1505>
##$DFORMAT= <normdp>
##$LAYOUT= <+/1D_H.xwp>
##$LFORMAT= <normlp>
##$PFORMAT= <normpl>
##$SURQMSG= 1
$$ End of Bruker specific parameters
$$ ---------------------------------
##NTUPLES= NMR SPECTRUM
##VAR_NAME=  FREQUENCY,     SPECTRUM/REAL,   SPECTRUM/IMAG
##SYMBOL=    X,             R,               I
##VAR_TYPE=  INDEPENDENT,   DEPENDENT,       DEPENDENT
##VAR_FORM=  AFFN,          ASDF,            ASDF
##VAR_DIM=   32768,         32768,           32768
##UNITS=     HZ,            ARBITRARY UNITS, ARBITRARY UNITS
##FACTOR=    0.250966925370066, 1,           1
##FIRST=     8223.43324360095, -208567,      -82299
##LAST=      0,             -130762,         93371
##MIN=       0,             -800759,         0
##MAX=       8223.43324360095, 467206258,    0
$$ Real data points
##PAGE= N=1
##DATA TABLE= (X++(R..R)), XYDATA
$$ [...]
19477g1340b0342A07755b0432G2332p49e7930A59324P0367E1834e3196F5512b26872
19464g1560p4435q4589A90651a15719p728l0130n4810l840O7485o246A00379b40166
19451e7355f96k64969a01820j79059J01738B57182c13647J46452d5266A84561
19440C82127a11961D0250f817D87166d7990F4546a5159n43C83615a52379A83618
19428h4676L1003K5805k95670g3858j10584k33403P2968A14898h08q1282o4397
19417a46487C05962a32401r9680a04625E3216b3999n5120A10158b21070a1266
19406C6537a15444o5889B8936c06566G4340A2018b15646q0768D2725d3508j12215
19395a55723e555H994h1389A33742f1165G3262b54416a11236k1991A29822j1951
$$ plain form
19477 -71340 -20342 107755 -20432 72332 71583 -57930 159324 229691 51834 -53196 65512 -226872
19464 -71560 -145995 -230584 190651 -115719 -123447 -153577 -208387 -212227 -144742 -150988 100379 -240166
19451 -57355 -696 -265665 -101820 -280879 -179141 257182 -313647 -167195 -45266 184561
19440 382127 -111961 40250 -6817 487166 -47990 64546 -15159 -15702 383615 -152379 183618
19428 -84676 -53673 -27868 -323538 -73858 -184442 -417845 -344877 114898 -808 -82090 -146487
19417 -146487 305962 -132401 -232081 -104625 53216 -23999 -79119 110158 -221070 -11266
19406 36537 -115444 -181333 28936 -306566 74340 12018 -215646 -296414 42725 -43508 -155723
19395 -155723 -5555 8994 -81389 133742 -61165 73262 -254416 -111236 -133227 129822 117871
19384A17871B0375i8015d4206j22484O7754G471d29521A31973m6054a86060f9646
19372b23678j4650Q0163n29599b1658j68381j26732H1114b17106r2999J13246
19362a96859d7715j60306d8002D20152a13940k99557c1548j79611j33098B0313
19351B8174a00731n281B39042C243a45946E7437b13525F7177a96564l9103a08756
19339a8084A62084c93317a23289E1169M8325d74350K11992P0307h0084I9215b74297
19327A9219a1134E9527a09177J1048H0193G135K44859L8966F5832c69959M5556
19316c24403J35351c0329p5268E4785f1092A37030a64661O675J2039o0454L885
19305b02516E9247b30811A3568n536d16640g4610j53650b1829k69578P1751m631
$$ plain form
19384 117871 20375 -98015 -44206 -166690 -98936 7471 -429521 131973 85919 -186060 -69646
19372 -223678 -238328 -158165 -687764 -21658 -190039 -316771 81114 -217106 -310105 -196859
19362 -196859 -47715 -208021 -48002 420152 -113940 -413497 -31548 -211159 -344257 20313
19351 28174 -100731 -106012 239042 3243 -145946 57437 -213525 67177 -196564 -235667 -108756
19339 -18084 162084 -393317 -123289 51169 99494 -474350 -262358 -192051 -80084 99215 -274297
19327 19219 -11134 59527 -109177 -98129 80193 7135 251994 290960 65832 -369959 -324403
19316 -324403 -189052 -30329 -105597 54785 -61092 137030 -164661 -157986 -145947 -206401 -202516
19305 -202516 59247 -230811 13568 8032 -416640 -74610 -228260 -21829 -291407 -219656 -224287
19294b24287p5400c3759k1823b5306C6776K99694a20446A19229c67734B14925
19283b61450n588N8985N3642J2164a6468B551L3890H604O6526P902a7723k9523
19271d7246n8494A85830E9703b84308A2636K2062b52544I4185e5811k519C1218
19259F7360j7936b46685A8836c2950A26716O1117b8607F8268i7497A06766n0192
19248E6574b59257J02342A71479a84299I4316i6302l5476H0992a80850a9884A25915
19236a24321A05840b21135J02745A52146e34656B1270P1955N8997a93201A23J70781
19225A70904a2965B22404h6899J3368A1898b27433q6458f660G7280R3827F3658
19213c59252a43306j41483R4012A76527c02276B7514K00546r9286a04590N1504
$$ plain form
19294 -224287 -299687 -33759 -55582 -25306 36776 336470 -120446 119229 -367734 214925
19283 -261450 -267038 -208053 -154411 -142247 -16468 2551 36441 8604 75130 83032 -17723 -47246
19271 -47246 -105740 185830 59703 -284308 12636 34698 -252544 94185 -55811 -58330 31218
19259 67360 49424 -246685 18836 -32950 126716 187833 -28607 68268 -97497 106766 56574
19248 56574 -259257 -156915 171479 -184299 94316 -96302 -131778 80992 -180850 -19884 125915
19236 -124321 105840 -221135 -118390 152146 -534656 21270 93225 152222 -193201 123 170904
19225 170904 -12965 222404 -86899 -73531 11898 -227433 -313891 -6660 77280 171107 63658
19213 -359252 -143306 -284789 -190777 176527 -302276 27514 228060 128774 -104590 -53086
19203e3086l8923r9423b9341I0506a86967m723A51597b66255q5750J71383J1386
19192a69236c6779A23170b35236a09930l8511d6884A32784i8295l06951a4941
19181E9724J13107a89399j3352I6154a37732b1776j20247O7490o1172B01405b89253
19169A70718a51792l5432r3023a21942j15506d9456C1256m794L1514b1139j1049
19158c2188k06373l691P8432f6464H4279h7362l33936H4891L388c76149A80789
19146a58596n0631o877A33093A7716a61362r5672E3796Q238b0517H4782d05849
19134a8976r4286q9295C2078N5971b97139g7879l2140M9337K2135p8045j17303
19123b33895M3085F294b68984c764k35900J3745i2339f328E2092a28910j59378
$$ plain form
19203 -53086 -92009 -191432 -29341 90506 -186967 -191690 151597 -266255 -352005 -180622 -169236
19192 -169236 -36779 123170 -235236 -109930 -148441 -46884 132784 -98295 -405246 -14941
19181 59724 172831 -189399 -202751 96154 -137732 -21776 -142023 -74533 -135705 201405 -289253
19169 170718 -151792 -187224 -280247 -121942 -237448 -49456 31256 26462 57976 -21139 -32188
19158 -32188 -238561 -242252 -163820 -66464 84279 -87362 -421298 84891 88279 -376149 180789
19146 -158596 -209227 -216104 133093 17716 -161362 -257034 53796 62034 -20517 84782 -405849
19134 -18976 -113262 -202557 32078 88049 -297139 -77879 -110019 -60682 -38547 -116592 -233895
19123 -233895 -190810 6294 -268984 -3764 -239664 -225919 -92339 -6328 52092 -128910 -288288
19112b88288N6637o9496b1701F8960a41994c0813D5239K18526q1793A0298d1843
19100f1670j06874d3194C8694b83264H9232h6287A9022b56517B08866d6782j205
19089d7987o2588A14379B7342b67366j63346B8652R0836P2225b21635O7631A18987
19077a05655A31882c05724R9824h4689m7926j43242f472A87771E8257a17268A08997
19065e6350B91935b94667k661I6010K12510d87761a7755m53534A10376g0278c1383
19053C2695J29707j1100a81161e633m3603j96434e6268j90842A27327i4527B61814
19041B08561o3762a78422D2375c28824a17896d2440J4669A19147b14265F9985
19030E205J89462b98071a30985j93378A04743D3178P0950i3131k18714a00615
$$ plain form
19112 -288288 -231651 -301147 -21701 68960 -141994 -30813 45239 263765 181972 10298 -41843
19100 -61670 -168544 -43194 38694 -283264 89232 -86287 19022 -256517 208866 -46782 -47987
19089 -47987 -110575 114379 27342 -267366 -430712 28652 119488 191713 -221635 -154004 118987
19077 -105655 131882 -305724 -205900 -84689 -132615 -275857 -6472 187771 58257 -117268 108997
19065 -56350 291935 -294667 -297328 96010 308520 -487761 -17755 -471289 110376 -70278 -31383
19053 32695 162402 151302 -181161 -5633 -49236 -245670 -56268 -247110 127327 -94527 261814
19041 208561 144799 -178422 42375 -328824 -117896 -42440 -27771 119147 -214265 69985
19030 5205 194667 -298071 -130985 -324363 104743 43178 114128 -93131 -311845 -100615
19019a12770l1387p1918B18194p9269J02493c12465d7547k06314H3691R078a43363
19007a25582j70220d7698a4310r5323H9599k8854J91805m6244C2818b44975d3213
18995c32851A03486b75516a34979j9646P5425A40532a22821A66339A1071L2321
18985D3392b46460C73033a97064H1612K51097A9055H465b47750i2087j56147h761
18973a89997m8084J7257G5467A0040J49170a72025A9950e991A6918b93285G0221
18961d3001B76689j33045D1108R7787m8327K87928J35050j82462k5957Q0995c7568
18949i0844n8954q2039M7819O7993c068E7262M0750c89773f8095B06257b39341
18937A29895A9711Q648b31094K1426P5799m8577A73623M593a77298A77030a79074
$$ plain form
19019 -112770 -144157 -216075 218194 138925 241418 -312465 -47547 -253861 83691 92769 -143363
19007 -125582 -295802 -47698 -14310 -109633 89599 60745 252550 206306 32818 -244975 -43213
18995 -332851 103486 -275516 -134979 -154625 -79200 140532 -122821 166339 11071 43392
18985 43392 -246460 373033 -197064 81612 332709 19055 8465 -247750 -92087 -248234 -8761
18973 -189997 -238081 -220824 75467 10040 159210 -172025 19950 -5991 16918 -293285 70221
18961 -43001 276689 143644 41108 138895 90568 378496 513546 331084 305127 386122 -37568
18949 -90844 -149798 -231837 -184018 -116025 -3068 57262 98012 -389773 -68095 206257 -239341
18937 129895 19711 28359 -231094 -209668 -133869 -182446 173623 178216 -177298 177030 -179074
18925d8761k68701a42487A50293b0069B40022J62160F7111h2050G1688b7729f695
18913F2312N1902b80n9616A07944f4511A54867b48030h9073j31406l8356A04072
18901F1303a7151k59475P7898B164a65600A33808n894A5272L98115j83871J35909
18890C65425L2536A32819c6480A25743N7470e9446A53274A2677a96761N7679B0085
18878d07404h4280A95586c05207b0856j96238B17117b8984l92535A40215h2325
18867c17051d6534p54225F3508J17401a06265j37930k00680a38600A74650b7494
18856E5004k5149N9231g0764K029q7472k06570A91409c00948A31520a8288G6303
18844B74321C3811f5556r9773H4985b11365L1398J8582B56227a86675A79399b62435
$$ plain form
18925 -48761 -317462 -142487 150293 -20069 240022 402182 67111 -82050 71688 -27729 -6695
18913 62312 114214 -280 -59896 107944 -64511 154867 -248030 -89073 -220479 -258835 104072
18901 61303 -17151 -276626 -198728 2164 -165600 133808 127914 15272 413387 229516 365425
18890 365425 397961 132819 -36480 125743 183213 -59446 153274 12677 -196761 -139082 20085
18878 -407404 -84280 195586 -305207 -20856 -217094 217117 -28984 -421519 140215 -82325
18867 -317051 -46534 -800759 63508 180909 -106265 -244195 -444875 -138600 174650 -27494
18856 55004 29855 89086 -70764 -68735 -156207 -362777 191409 -300948 131520 -18288 76303
18844 274321 33811 -65556 -165329 84985 -211365 -179967 -161385 256227 -186675 179399 -262435
18832b45043A21521O4405c2391A07126a31707L2839j2543q2242d0250j43272k22715
18821d06237A10910k5992K00554h3784k63538a69984d0546E5853K58786h8111
18810A7159d1994q8996k70461J83910a3610k0295A24825J66257i9946l36B48381
18798D0459J78924D1385J40103a50472I1161J72837a47839A05005a5544O925B10342
18786B375b28978h8220A48805a83223G3467f7908j56679L827N8101F6691J72975
18775B39666j4642a51099E0209Q0166a33749l984G1582b13857L5662e4224k10553
18764b64777F516M669e0299I3645A9559G034K33703A0741e5794n30441a83059
18752f2660k09818B86148a1686E3493b64516c1658k37186b8425k8262m2699C624
$$ plain form
18832 -245043 121521 185926 -32391 107126 -131707 -98868 -111411 -193653 -40250 -183522 -406237
18821 -406237 110910 84918 285472 -83784 -347322 -169984 -40546 55853 314639 -88111
18810 17159 -41994 -130990 -401451 -217541 -13610 -33905 124825 291082 -99946 -100282 248381
18798 40459 219383 41385 181488 -150472 91161 263998 -147839 105005 -15544 -8619 210342
18786 2375 -228978 -88220 148805 -183223 73467 -67908 -224587 -220760 -162659 66691 239666
18775 239666 225024 -151099 50209 130375 -133749 -137733 71582 -213857 -178195 -54224 -264777
18764 -264777 6516 11185 -50299 93645 19559 7034 240737 10741 -55794 -586235 -183059
18752 -62660 -272478 286148 -11686 53493 -264516 -31658 -268844 -28425 -56687 -99386 3624
18740A3334g9159J2666J4445k70601A08206C4071a92381K3531A12895k1834f4595
18728b6617A33340a2403j19822q4340I7065j6807M6329h63k09662B17657A1520
18716a63032P3995c491r665j45074j27736N0184n4617a35923l3440A0106b19816
18704b72191C4735h8313A10106c80499a63162A21910g0546k39255B39882a02757
18693b32056d0410C09079A21353b00548a0452j43324N4816n9838a3351n2840G7401
18681c18129D3485b23241J07518n5077g9794p5406A07323J10206A034a51175k59207
18670d10382J88422j7453A1722c70312F0554b91861j03883J31305A1953g1686
18659b69083H0156a71414B31023c1844A00043K5213k2208dA07991Q4113h8550
$$ plain form
18740 13334 -79159 -66493 -52048 -322649 108206 34071 -192381 -168850 112895 91061 -64595
18728 -26617 133340 -12403 -132225 -216565 97065 80258 126587 -863 -210525 217657 11520
18716 -163032 -89037 -3491 -13156 -158230 -285966 -235782 -290399 -135923 -169363 10106 -219816
18704 -272191 34735 -88313 110106 -380499 -163162 121910 -70546 -309801 239882 -102757
18693 -232056 -40410 309079 121353 -200548 -10452 -153776 -98960 -158798 -13351 -66191 77401
18681 -318129 43485 -223241 -115723 -170800 -79794 -155200 107323 217529 1034 -151175 -410382
18670 -410382 -221960 -239413 11722 -370312 60554 -291861 -395744 -264439 11953 -71686
18659 -269083 80156 -171414 231023 -31844 100043 125256 103048 -4 107991 192104 -88550
18647A5152L2020Q9087C6999c78579d7695p898j12738h2535j60154K2103r563
18636b30149a7268j95920O8025E1780a26067b9825r9717E2948N6216a72764b8127
18624b03441n3665L32J02433B5354J58161g0067l3461j56504b1710A51670b70948
18612a40172j18568F4085O443c89560J61028A40077a38811k65062b5568i300H7301
18600a0483B83983b57669c53F1966j5652a69192G9851b78037i7614j9738j16409
18589b33761j01424L0663A2728i4035n5178A97869n870a39899l35155C9986f5302
18577C4508a59486N1447I6033a35894D8482J72058j01801b25005A9438M2482E944
18565A46620b04938I2758M6980b816B8365a08565K8392F4195b5859j30488G2554
$$ plain form
18647 15152 47172 136259 36999 -378579 -47695 -55593 -168331 -82535 -242689 -220586 -230149
18636 -230149 -17268 -213188 -145163 51780 -126067 -29825 -129542 52948 109164 -172764 -28127
18624 -203441 -257106 -256774 -154341 25354 183515 -70067 -103528 -260032 -21710 151670 -270948
18612 -140172 -258740 64085 70528 -389560 -228532 140077 -138811 -403873 -25568 -9300 87301
18600 -10483 283983 -257669 -353 61966 46314 -169192 79851 -278037 -97614 -117352 -233761
18589 -233761 -335185 -304522 12728 -94035 -149213 197869 191999 -139899 -475054 39986 -65302
18577 34508 -159486 -108039 96033 -135894 48482 220540 118739 -225005 19438 61920 5944
18565 146620 -204938 92758 139738 -2816 28365 -108565 -80173 64195 -25859 -156347 72554
18553a98215g2061l14561D1046d5484k61442b8707j9041I410J41972K02404a03584
18541E2864J09922R2704g8982A4272a62687O8773B90663b11920e3702l58227B46635
18529c64675a39899O5081C03633E8498A3604B05a21132k89143a17773l1942H7354
18517a75489B55698q5526b56542B43131c53505J14042F9341b76554N5081a10020
18506c23418H5641g4958p1562P0672D4706J92299A0609J1584K28188a72976J3414
18495a59562k27277J12215B2348P2465J19798H5868b37647B9451b11151k4759
18485b35910B6469d04150b4984k2150A42775j8284f5816B47603I5641h1349p4211
18474a55560O1656J8336k61941J00612F7412C232J9915f5411L1033k41443B92979
$$ plain form
18553 -198215 -72061 -386622 41046 -45484 -306926 -28707 -47748 9410 151382 353786 -103584
18541 52864 162786 255490 -78982 14272 -162687 -93914 290663 -211920 -53702 -411929 246635
18529 -364675 -139899 -74818 303633 58498 13604 205 -121132 -410275 -117773 -149715 87354
18517 -175489 255698 170172 -256542 243131 -353505 -239463 69341 -276554 -221473 -110020
18506 -323418 85641 -74958 -146520 -75848 44706 237005 10609 22193 250381 -172976 -159562
18495 -159562 -386839 -274624 22348 94813 214611 85868 -237647 29451 -211151 -235910
18485 -235910 26469 -404150 -24984 -47134 142775 124491 -65816 247603 95641 -81349 -155560
18474 -155560 -93904 -75568 -337509 -236897 67412 3232 23147 -65411 -34378 -275821 292979
18462a13583r165A26866h4336A99928e1404j60332N5264k8543e8070j08274k2741
18451a89085C80500i5593k01386a38187r9543N4953m2152D0112a34014k8550C25419
18439a05897c6222p4222C1616b21064c9070k8237b4304I5559Q5326i6388j467
18428i7855k0472q1140e2156L660j28982k30002B14698a6913A12965K2640a25229
18416C9089i3647k8278M387A93703e803l89709a57242A9091J21745a78388n2807
18405b31195B1153d11993F4447a32596C354N1517N7817b86368f0141p0664r7452
18394b28257E9859P775b55249B201J24118a02945B25834g1467C35009A38908j4224
18383A24684O4505a18730D00170c16851m6589j0921E9463N2692b51923K5939A66648
$$ plain form
18462 -113583 -122748 126866 -84336 199928 -51404 -211736 -156472 -185015 -58070 -166344 -189085
18451 -189085 380500 -95593 -296979 -138187 -237730 -182777 -224929 40112 -134014 -162564 325419
18439 -105897 -36222 -110444 31616 -221064 -39070 -67307 -24304 95559 180885 -96388 -97855
18428 -97855 -118327 -199467 -52156 -48496 -177478 -407480 214698 -16913 112965 135605 -125229
18416 39089 -93647 -121925 -117538 193703 -5803 -395512 -157242 19091 140836 -178388 -231195
18405 -231195 21153 -411993 64447 -132596 3354 54871 112688 -286368 -60141 -130805 -228257
18394 -228257 59859 67634 -255249 2201 126319 -102945 225834 -71467 335009 138908 124684
18383 124684 189189 -118730 400170 -316851 -363440 -374361 59463 112155 -251923 -225984 166648
18371h8082k06400P0826G2023b5071m29040C74099e6582A5371a83664F8781a85356
18359D32776k08386A07075k8197b19871Q3955E2334d53925D2781N5324a16500
18348a53009A82209K16841A13599c8519J8015B83637m7250c5046k14972A37215
18337b74690b0183B0745M0989c44977a20832o3119e1328A16394g2769j32828A95964
18325g6710m7737E4411J00893b73505H8560J20971r4750K42055e4147j40485M505
18314a90127G1419a60797j80366i1797h258A6612b0456A02296c13496c8079C42413
18302f4770q5808A38146i07A1402a23475D8927b21477I6495c41184a09038n9583
18291a68621q1208F1043K0190O5399a08202F5866L01890d9373B19138a63454c0127
$$ plain form
18371 -88082 -294482 -223656 72023 -25071 -454111 374099 -56582 15371 -183664 68781 -185356
18359 432776 224390 107075 78878 -219871 -135916 52334 -453925 42781 98105 -116500
18348 -153009 182209 399050 113599 -38519 -20504 283637 236387 -35046 -250018 137215
18337 -274690 -20183 20745 61734 -344977 -120832 -183951 -51328 116394 -72769 -205597 195964
18325 -76710 -124447 54411 155304 -273505 88560 209531 114781 356836 -54147 -194632 -190127
18314 -190127 71419 -160797 -341163 -91797 -8258 16612 -20456 102296 -313496 -38079 342413
18302 -64770 -150578 138146 -907 11402 -123475 48927 -221477 96495 -341184 -109038 -168621
18291 -168621 -249829 61043 81233 146632 -108202 65866 367756 -49373 219138 -163454 -30127
18279c59960D3747c66498c9813j00813I7603b52895B28512b96365K8817B4945
18268a9339A28362b83692g3122k33190a12844j9450j1674e6510q0618B61384H8096
18256a70233J5788n9610Q3534q0915G5893l2821e090j51338M5418A71907Q4774
18245B56681j00842a1960E5422J5098h8889A57889j8570e8723l9514o8248a9582
18233I5975a90435q7973G7311c3139j36266D0229d6826H9772b030j34364o9243
18222b05637B13631A00924a19254A68104a80176A11213c2999m34709B17099i1461
18211A25587a20908M422r4687h668F2472L0997a5020H2570j6665j2173A5238a44733
18198B6102M09744B08533b39293C8007a33843k3152A36566a42752D2109j7574
$$ plain form
18279 -359960 43747 -366498 -39813 -140626 97603 -252895 228512 -296365 -267548 24945
18268 -19339 128362 -283692 -73122 -306312 -112844 -132294 -143968 -56510 -137128 261384 88096
18256 -170233 -154445 -214055 -130521 -211436 75893 43072 -5090 -156428 -111010 171907 256681
18245 256681 155839 -11960 55422 70520 -88889 157889 139319 -58723 -98237 -166485 -19582
18233 95975 -190435 -278408 77311 -33139 -169405 40229 -46826 89772 -2030 -136394 -205637
18222 -205637 213631 100924 -119254 168104 -180176 111213 -32999 -467708 217099 -91461
18211 125587 -120908 -116486 -211173 -8668 62472 93469 -15020 82570 65905 53732 15238 -144733
18198 26102 435846 208533 -239293 38007 -133843 -156995 136566 -142752 42109 24535
18188B4535h6136A3465M2748a24207c3755A34898c28444c7660l33600a3298C05448
18176C1974g1384d74l4070j44031B43091Q6021a87096f1267C76502a24701B88003
18164b05965A19174e4158A66048o9501i1388j34510B38767B571J34863a50698
18153g2300j153p0343M3732j72989h2846B88918c03367G2051k0225L4515C5507
18141f3181j96156d3460B16493j00354b18873n1274P8049i3333A31057b13936
18130C36254E5795e5906k69143C00006r2614a20939A27309b68413H2568a94979
18119a15879n5934A63011E9528g6746j74191i2132A26130h111j41527b4230k32794
18108b57024k48302a14989a9127H3505b26873f8611D5088J24864b1181F9482J43907
$$ plain form
18188 24535 -86136 13465 56213 -124207 -33755 134898 -328444 -37660 -371260 -13298 305448
18176 31974 -71384 -474 -34544 -178575 243091 329112 -187096 -61267 376502 -124701 288003
18164 -205965 119174 -54158 166048 96547 -91388 -225898 238767 2571 137434 -150698
18153 -72300 -73453 -143796 -100064 -273053 -82846 288918 -303367 72051 51826 86341 35507
18141 -63181 -259337 -43460 216493 116139 -218873 -270147 -192098 -93333 131057 -213936
18130 336254 55795 -55906 -325049 300006 207392 -120939 127309 -268413 82568 -194979
18119 -115879 -171813 163011 59528 -76746 -250937 -92132 126130 -8111 -149638 -24230 -257024
18108 -257024 -505326 -114989 -19127 83505 -226873 -68611 45088 169952 -21181 69482 213389
18097B13389b25564i6762A19000A4998a6969k09512j41624C5081Q2926a94025
18086A02612f0109m2450A99608M9680a21178l32238F0691c14970A34827o3015
18076G1812f4561E2322K21978b711A85905b01747n048B63018a99493r506R4980
18065a14019A20144h1175j11863C23799A18979j4740e2671C74733E2189L1402
18055H3591a27943g701j33899D2596J43214B6906K1817Q8856a11727A22188J25619
18044B47807A3930N4134J8185J43291a74279L6465K3500E8620c1580k84076A14779
18032A08330b26357A73693N8836n5084i8270F0058K98722A21868J83811j41795
18022A63884a18523c0162j6521b2038B406a61382a2633A60771G6171a09307r0489
$$ plain form
18097 213389 -225564 -96762 119000 14998 -16969 -226481 -368105 35081 118007 -194025
18086 102612 -60109 -102559 199608 249288 -121178 -453416 60691 -314970 134827 71812
18076 71812 -64561 52322 274300 -2711 185905 -201747 -206795 263018 -199493 -208999 -114019
18065 -114019 120144 -81175 -193038 323799 118979 104239 -52671 374733 52189 83591
18055 83591 -127943 -7701 -141600 42596 185810 26906 48723 137579 -111727 122188 247807
18044 247807 13930 68064 86249 229540 -174279 -137814 -114314 58620 -31580 -315656 114779
18032 108330 -226357 173693 232529 177445 -98270 60058 358780 121868 305679 163884
18022 163884 -118523 -30162 -46683 -22038 2406 -161382 -12633 160771 76171 -109307 -199796
18011a99796h4162D0723K70261c11830J00756p6322c6147k52856A23708n2226
18001G1482A5603d9564B93047r6956I1614A0339J43891b03819d3111A20769l1969
17990H8800d953A92990a9295A1168J04082n7550b07124B1362L6070c5695j38761
17979a74456B85159a32387N4728B49031i0311j66819k5307C80522n0463D2945
17968a17186F2192P5127j2897a43597C50476l9660a40684l7638C7496i9374A2196
17956g3406A17253J1702N020J53267g4881r7325I0258B8271R2052K1815a05238
17944F5582a29903J5564j85946J49084j7619G3846c6739I2844h4921D1518a51301
17932D7171J36690a77689A22150n6765b03425A15965a04802A09748J13382a7765
$$ plain form
18011 -199796 -84162 40723 310984 -311830 -211074 -287396 -36147 -289003 123708 71482
18001 71482 15603 -49564 293047 196091 91614 10339 154230 -203819 -43111 120769 88800
17990 88800 -4953 192990 -19295 11168 115250 57700 -207124 21362 57432 -35695 -174456
17979 -174456 285159 -132387 -77659 249031 -90311 -257130 -282437 380522 330059 42945
17968 -117186 62192 137319 124422 -143597 350476 310816 -140684 -178322 37496 -99374 12196
17956 -73406 117253 128955 133975 287242 -74881 -172206 90258 28271 120323 142138 -105238
17944 65582 -129903 -114339 -300285 -151201 -168820 73846 -36739 92844 -84921 41518 -151301
17932 47171 183861 -177689 122150 65385 -203425 115965 -104802 109748 223130 -17765
17921G0522J01721a46720o372F1935c7509j27005B41328F8158f3705q7366H5904
17909b37127A76948D5965c49727M9309h8807A82628q2924i4112A18974b27289
17898a31002F8674g1600q8087B13141D4261J71256K1306k1673B6678b29813k3616
17887b53429A18784A7581J02832n8771c3428j24227A50649P4358M1363q798f4718
17875b09045B01863b39024J06346A9475J30662n5832c97486a82992m454E7110
17864a33656A85495b70878A14462J37605B4133P7135J9170C6947g5204j3495I6436
17852A88250q435d9461o6247F2726J72490b69254A79350m3836f2260B4531M6226
17841G0757j1526a25965E6853f7279j09027B08644C6233g3151o3366L4716B00339
$$ plain form
17921 70522 172243 -146720 -153092 61935 -37509 -164514 241328 68158 -63705 -151071 85904
17909 -237127 176948 45965 -349727 -300418 -88807 182628 99704 -94112 118974 -227289
17898 -131002 68674 -71600 -159687 213141 44261 215517 236823 215150 26678 -229813 -253429
17887 -253429 118784 17581 120413 61642 -33428 -157655 150649 225007 266370 257572 -64718
17875 -209045 201863 -239024 -132678 19475 150137 94305 -397486 -182992 -187446 57110
17864 -133656 185495 -270878 114462 252067 24133 101268 120438 36947 -75204 -88699 96436
17852 188250 179815 -49461 -115708 62726 235216 -269254 179350 135514 -62260 24531 70757
17841 70757 59231 -125965 56853 -67279 -176306 208644 36233 -73151 -136517 -101801 200339
17829B1083a37137A99420b31749d2118m6887A8928b0551k12224h6425k83403f5251
17817a5744H0033J02918a76599F1826J61647I4322G051J74648h149A82977C3156
17805a24528F7136B1946a61945j23279j06252A01306e1063j082A57772g8895c4467
17793B64337A3092J29898E3728b25436a9793j40125J7256A35987J96240f6209
17782b3748C2249P4008J67860D9451J61283o1628d4855A35044b70994A24780a13333
17770C51073O7080A30239J86021f6565o4973A22711b3792m8310q5771g877j05232
17759a13109J0899c9813A60953G9871e16202a40421O7421I9497o649k4199a16511
17747f173p846H4256J23606D4632K7433a86625c0845H7880A3666h6863j23689
$$ plain form
17829 21083 -137137 199420 -231749 -42118 -89005 18928 -20551 -232775 -86425 -369828 -65251
17817 -15744 80033 182951 -176599 61826 223473 94322 7051 181699 -8149 182977 33156
17805 -124528 67136 21946 -161945 -285224 -391476 101306 -51063 -52145 157772 -78895 -34467
17793 264337 13092 142990 53728 -225436 -19793 -159918 -142662 135987 332227 -66209
17782 -23748 32249 106257 274117 49451 210734 149106 -44855 135044 -270994 124780 -113333
17770 351073 418153 130239 316260 -66565 -131538 122711 -23792 -72102 -157873 -7877 -113109
17759 -113109 -102210 -39813 160953 79871 -516202 -140421 -73000 99497 92848 68649 -116511
17747 -6173 -14019 84256 207862 44632 72065 -186625 -30845 87880 13666 -86863 -210552
17736b10552B982J14151C3257a89246B97225j44072i4147K4252B5691R2512K4869
17725A43072J214k0273K58504D879K19029P28F8243J10748R7647P3687D511a157
17712B80483G9752b694q6299C16450l1462b47641f2947I9028C7033L11268r5857
17701B52444m7799J87956o6912E4941a36874p85n1950D33128e0189B6526K98652
17690C25178D9130J51557n2281a55201H5626K80576j56061r6895K3133b61737
17679A8028L77751H9651L32428A82377j8535c3576B75612C9156M28273a2588I7527
17667B18841J04232a22934A42976a14225A46607a0488A50899K36115A28922j177
17657A27745I609J35874b55070A28242d459j8107H2352a65335A49067a61849I0493
$$ plain form
17736 -210552 2982 117133 33257 -189246 297225 153153 -94147 -69895 25691 118203 143072
17725 143072 144286 124013 382517 4879 223908 224636 68243 178991 276638 350325 4511 -1157
17712 280483 79752 -2694 -88993 316450 284988 -247641 -62947 99028 37033 348301 252444
17701 252444 204645 392601 325689 54941 -136874 -137659 -189609 433128 -50189 26526 325178
17690 325178 49130 200687 148406 -155201 85626 366202 210141 113246 136379 -261737
17679 18028 395779 89651 422079 182377 163842 -33576 275612 39156 467429 -12588 97527
17667 218841 323073 -122934 142976 -114225 146607 -10488 150899 387014 128922 127745
17657 127745 9609 145483 -255070 128242 -4459 -22566 82352 -165335 149067 -161849 90493
17645A17631d31385A60229K18418G9020l6138f753A13452n5291b1230h551j09196
17634a17747o9490C99920a6408j47374q7930H4470b7996j22589A37610J28763
17624B66373M8628b4483r3070M8830E81251f4273E71628A09902J70772a02604
17613C133J53711o4635J595D0175J02314m0928d636j18748A49313a16668B46148
17601A05363J32824j5627K20346o7351j59235J64789a01712d9817B22528K3479
17591B46007L1240B8206J6602L4391K03676I5364H562N1905K93533A21759j2364
17580A09395c7256A68037a61020j21269g2359C52176k2613j00447b45629I592
17569C35123j13762m1128b9168B95711N5274e0463k8424A95763h0193A28628j4591
$$ plain form
17645 117631 -431385 160229 378647 79020 42882 -6753 113452 58161 -21230 -8551 -117747
17634 -117747 -187237 399920 -16408 -163782 -251712 84470 -27996 -150585 137610 266373
17624 266373 315001 -24483 -117553 -68723 581251 -64273 571628 109902 280674 -102604
17613 3133 156844 92209 93804 40175 142489 101561 -4636 -123384 149313 -116668 246148
17601 105363 238187 222560 442906 375555 216320 381109 -101712 -49817 222528 246007
17591 246007 277247 28206 44808 79199 282875 95364 8562 60467 354000 121759 109395
17580 109395 -37256 168037 -161020 -282289 -72359 352176 329563 229116 -245629 9592
17569 335123 221361 180233 -29168 295711 350985 -50463 -78887 195763 -80193 128628 114037
17558A14037O8305e7654k5774B84577f0469C0274L10900E3134L39986j28507d3253
17546A52907D6864J22821J90676a88678J7266k1077b8869C6084J59940r2417b05334
17534A90501d4628B90985G1876P9917K32648j86456M25265k49831F9849L14183
17524C84032A40143L6812K44727A83166l2090J38554L09838h7279A64379O8838
17514B33217m3302N13515l01965J80421j44568J76186M89753m20912J5735O2820
17504G60900j65608j32408N4820Q4463r5460J20773A24092N26157k35626J57943
17494E72566K83359j76822K62254O22j62670k18134j3059o7122j62182J82474
17484E01286e4208C85684J77643A63123j8234L2848o4356J03698J53286l0879
$$ plain form
17558 114037 182342 -57654 -83428 284577 -60469 30274 341174 53134 393120 264613 -43253
17546 152907 46864 169685 360361 -188678 -171412 -192489 -28869 36084 196024 103607 -205334
17534 190501 -44628 290985 71876 151793 384441 197985 623250 373419 69849 384032
17524 384032 140143 176955 421682 183166 151076 289630 599468 -87279 164379 233217
17514 233217 189915 703430 401465 581886 437318 613504 1103257 682345 698080 760900
17504 760900 595292 462884 517704 602167 506707 627480 124092 650249 414623 572566
17494 572566 855925 679103 941357 941979 779309 561175 548116 480994 318812 501286
17484 501286 -54208 385684 563327 163123 144889 177737 113381 217079 370365 339486
17474C39486j24091L96835B27867J78148j01440P9036n8503M6014j83053K70741
17464D58810A78938b7748B55514p6582L74566j75766A53325e014B94108A37865
17453i7657d6650A8336f3858G9578J94775R4431k6894N3413A89352L21417B15170
17441A23072J84543I5522j6732K65488A57266K11450q0077L58022A32648K87617
17431D20265A77407k2669K32819p6365P4303r0904J17568A38539L00861J04998
17421E44398j93932j71510J80049j70287N95609C84779K45349o5935j66073E8030
17410A18008K50485J25366j58021J40376B36658J10601O9697i2111D03705K8505
17400D32210q5333A62033J69465K4403a35998B57949r9881J44127O1111r0313
$$ plain form
17474 339486 215395 612230 227867 406015 304575 383611 325108 371122 188069 458810
17464 458810 178938 -27748 255514 178932 553498 377732 153325 -5014 294108 137865
17453 -97657 -46650 18336 -63858 79578 274353 368784 341890 395303 189352 510769 215170
17441 123072 307615 95522 78790 344278 157266 368716 288639 646661 132648 420265
17431 420265 177407 154738 387557 311192 385495 294591 412159 138539 439400 544398
17421 544398 350466 178956 359005 188718 784327 384779 630128 564193 398120 58030
17410 118008 368493 493859 335838 476214 236658 347259 416956 -92111 403705 432210
17400 432210 346877 162033 331498 355901 -135998 257949 158068 302195 363306 272993
17390B72993I5589M17181k51677K1259p5554L0747p5441G6609A8584J39660L17445
17379D75689B25338g0856D18462j74246J26953l5033Q204j25651P1484j07330
17369A82843J14204G2950J44203f2734C75024J37789j36844d213A50426J5667
17359A66093K6716m4335K84574o6182A28756Q6826J32188k4519j31941M49985
17349F41295B82349g9791E7281K93723j22305a29217k9021A71792L41394a26078
17338A80987K51100B06640J45866j32289j0925L87170A48548J37394A21899r969
17328A11930J41543A21102J01349o4751L29002I5357M00524f0646C36768r7550
17318B39218M9649J7357j31505n9299m4082J71528n5038L69774j85500A68294
$$ plain form
17390 272993 95589 512770 261093 282352 206798 237545 162104 76609 18584 158244 475689
17379 475689 225338 -70856 418462 244216 371169 336136 344340 218689 290173 182843
17369 182843 297047 72950 217153 -62734 375024 512813 375969 -4213 150426 166093
17359 166093 192809 148474 433048 366866 128756 215582 347770 323251 191310 641295
17349 641295 282349 -79791 57281 351004 228699 -129217 -158238 171792 513186 -126078
17338 180987 432087 206640 352506 220217 209292 596462 148548 285942 121899 111930
17328 111930 253473 121102 222451 157700 486702 95357 495881 -60646 336768 239218
17318 239218 288867 306224 174719 115420 71338 242866 187828 557602 372102 168294
17307C98388A96727I0817i7670C02115Q3293K67114I9963a92425D32632j304r4973
17296C36355K66042k00467D8245J52245K4047k8081d675C15839A46121L26629
17286D72750N8507j01229A90734h1467E4701N05551k00064A4200a16932D897L18099
17275C22996E9018a55544F12414j42084j64626o5493G7894M63964J9953k44759
17265C17052J35540A38075J10281M01543C01933R5577A89300K1968K52184A94605
17254B08168K41171J25526k76329J01076j1425J1641A69564L12260H1726L16001
17244C97727J06861B38364K800J049J64120j49046k0867M52534j98482O7505F974
17232A51393N1283J40687J7390I9458L38814k11602G3155M51931J09177k07812
$$ plain form
17307 398388 196727 90817 -97670 302115 385408 652522 99963 -192425 432632 431328 336355
17296 336355 602397 401930 48245 200490 224537 196456 -4675 315839 146121 472750
17286 472750 531257 430028 190734 -81467 54701 560252 360188 14200 -116932 4897 322996
17275 322996 59018 -155544 612414 470330 305704 240211 77894 541858 561811 317052
17265 317052 452592 138075 248356 649899 301933 397510 189300 211268 463452 194605
17254 208168 449339 574865 298536 399612 388187 399828 169564 481824 81726 397727
17244 397727 504588 238364 241164 242213 406333 257287 236420 688954 490472 557977 6974
17232 151393 202676 343363 360753 99458 438272 226670 73155 525086 634263 426451
17222D26451B01802K52137j05393n933O595j73583K01142J70129j63130j24917
17212B58849K86516B56953L94L19900j14949J3828B06472K91111j36206j48865
17202B12512J48367A04135a40593C59106L16217k09734J2520B26794J95012o1782
17192C60024j08118q784K08317r2601j23735J02587j1059Q9704J08922A41400
17181D36357A71464K53748j06899j34623l7056m0263J46602K05038j17829j02997
17171B37185J23087j41510L67528q0846n420K78048C38775L36952j05193B81132
17160A51380K12665N6159J93659j28979m5756J54352j33814j62022M10231C21425
17149H07542B78432K00702N930A79026F0532L22649l4903J29082J79085k5426
$$ plain form
17222 426451 201802 453939 348546 342613 349208 175625 376767 546896 383766 258849
17212 258849 545365 256953 257347 577247 462298 476126 206472 497583 361377 212512
17202 212512 360879 104135 -140593 359106 675323 465589 478109 226794 421806 360024
17192 360024 251906 243122 451439 358838 235103 337690 326631 416335 525257 141400
17181 436357 171464 425212 318313 183690 146634 106371 252973 458011 340182 237185
17171 237185 360272 218762 586290 505444 500024 778072 338775 675727 570534 281132
17160 151380 364045 420204 613863 484884 439128 593480 459666 297644 707875 321425
17149 807542 278432 479134 485064 179026 60532 383181 348278 477360 656445 631019
17139F31019r4889q1580L03774n5064k98573K83220k83793m4185J74174J9650
17129E53753j97988L12305O6092n645k50818q580M51848m59767J19834q4425J99466
17118F96075k31657b253C98473J93675k35344K73980O5045j70065j02564J11011
17108E34211O9820M2496l04786K38145n6377J55178O2752j36443p4034q8660N21800
17097I64102C97097J47908k27910K44109N5124o5375K42738j78594J62696C54744
17086F96934j24464o8374N841P4435A86114L18415J25658J89812O6068j54013
17076G32054K28915K7044j81246l00222L444K11034J36502k70988k8677J42846
17066G00706O599R6805o8015K33641K232m39254K18098J20886k20992L2115L7737
$$ plain form
17139 631019 536130 454550 758324 703260 404687 687907 404114 359929 534103 553753
17129 553753 355765 668070 734162 728517 477699 469119 920967 461200 581034 496609 696075
17118 696075 464418 -2253 398473 592148 356804 630784 695829 525764 423200 534211
17108 534211 604031 646527 341741 579886 523509 678687 741439 604996 530962 442302 964102
17097 964102 397097 545005 317095 561204 616328 550953 793691 615097 777793 354744
17086 696934 572470 504096 509937 584372 186114 504529 630187 819999 886067 732054
17076 732054 960969 988013 806767 506545 509989 721023 857525 586537 557860 700706
17066 700706 707305 804110 736095 969736 971968 532714 750812 871698 650706 682821 720558
17055G20558l26153N56816k88016O523K67197k55002K06237j40506L5517N0255
17045H33426L28943m26444K14815l07215K03621k4844J86020j38223K55939j788
17035A124250k72864j09962k03674M01116R1870o2036j03297J23546J56058j59837
17025I85170l9763j02785l3108o7802J17515j21874J07827k36648L58665m1765
17015I25432j00316j10943J86048J41737J66517k59269p9509O2467j17356J65908
17005I80716Q1203K78486k46939J8930J97373n22733M00578n2468K0706o9806
16995A086046J12585o5244J18770J05892j35558l72475L20744j39882k75191M66127
16985A221814K324k17577r6654M92766j74644m3308L38012j70090j90067K37387
$$ plain form
17055 720558 394405 951221 663205 669728 936925 681923 888160 747654 783171 833426
17045 833426 1162369 735925 950740 643525 847146 822302 1008322 870099 1126038 1124250
17035 1124250 851386 741424 537750 938866 1030736 968700 865403 988949 1145007 985170
17025 985170 945407 842622 809514 741712 859227 737353 845180 608532 967197 925432
17015 925432 825116 714173 900221 1041958 1208475 949206 869697 932164 814808 980716
17005 980716 1061919 1340405 1093466 1112396 1309769 787036 1187614 1135146 1155852 1086046
16995 1086046 1198631 1133387 1252157 1358049 1222491 850016 1170760 1030878 755687 1221814
16985 1221814 1224138 1006561 909907 1402673 1228029 1184721 1522733 1352643 1162576 1399963
16975A399963j38927j17779K91283k46338p095L6701M2905K99517j53584l15895
16965A090751L82696N7281k87579K95658j57536l05538K24652j8153j23287k42477
16955I16468N97835l09603K35409j07336m3698K35195n1215j39234K60397J49250
16945A743468N8118l29403K84250Q8782m11256L71637L3609k47616L1974J58980
16935A782543J90916j11050l8346K4782l28285K87906J74609j92536j7622j54756
16925A618161M18031J0331q397n2537K1496j02035k65986J73896J8070N70856
16915B401886l09235k555Q2445l22050O7599Q10995m94334j95218L60274J60465
16905B560272k81341L9599l93139N06990j40726J35963M7837J07104M3089k98286
$$ plain form
16975 1399963 1261036 1143257 1434540 1188202 1181107 1217808 1260713 1560230 1406646 1090751
16965 1090751 1473447 1530728 1243149 1538807 1381271 1075733 1300385 1282232 1158945 916468
16955 916468 1514303 1204700 1440109 1332773 1289075 1524270 1473055 1333821 1594218 1743468
16945 1743468 1801586 1472183 1756433 1845215 1433959 1805596 1839205 1591589 1623563 1782543
16935 1782543 1973459 1862409 1824063 1848845 1520560 1808466 1983075 1790539 1772917 1618161
16925 1618161 2036192 2046523 2038126 1985589 2007085 1905050 1639064 1812960 1831030 2401886
16915 2401886 2092651 2090096 2172541 1850491 1918090 2729085 2234751 2039533 2399807 2560272
16905 2560272 2278931 2318530 1925391 2432381 2291655 2427618 2475455 2582559 2625648 2327362
16895B327362J52804j4872L33813k75273K45078J11690l71334K75092Q7090j15567
16885B755883M7840K00286k03986R0220K26353q2810Q2346J27479k52281L53289
16875C344619k58126K14062k38261J05040n8533K59810P6134j25797j69156M72186
16865C621978j0719j47936L2855J58105l43611K05454N45035l57042J54037J7753
16855C875909N01345k64345J73338r2994J42125k8843l8410K52454O9325N4282
16845D644186k82378L50053K19662m10038N16338R8884K55722j98428l65221L15218
16835E143998K57114k59971K25856N28167l98485M69334j27237q7605L68911L4327
16825F154409K39486j19794K09157P5377J5720L99227J13768j61877L31050o2887
$$ plain form
16895 2327362 2480166 2465294 2799107 2523834 2768912 2880602 2509268 2784360 2871450 2755883
16885 2755883 2803723 3004009 2800023 2890243 3116596 3033786 3116132 3243611 2991330 3344619
16875 3344619 3086493 3300555 3062294 3167334 3108801 3368611 3444745 3318948 3149792 3621978
16865 3621978 3611259 3463323 3496178 3654283 3310672 3516126 4061161 3704119 3858156 3875909
16855 3875909 4377254 4112909 4286247 4193253 4335378 4306535 4268125 4520579 4589904 4644186
16845 4644186 4361808 4711861 4931523 4521485 5037823 5136707 5392429 5194001 4828780 5143998
16835 5143998 5401112 5141141 5366997 5895164 5496679 5966013 5838776 5751171 6120082 6154409
16825 6154409 6393895 6274101 6483258 6558635 6574355 6973582 7087350 6925473 7256523 7193636
16815G193636O98275m46708N0242K00304M9863K92707j15179N68226J39015M16723
16805I047104J58783J74353k55739J18391L77556K45819K45998K17833J41688
16796A0471786K46557n4807O20302O2498O6269M47703K95322J63168K80960N51018
16786A3150776L23336J76071M69732o7125R55946j33159N42545K54313L92891
16777A6065326O26990O01887L71627L97821L03393O37655N87196L25818P49103
16768B0666816P96834M29559N92673P55034N83246J145740O21594J044883L69203
16759B7005582J059304P91869J030077J037482J331926P94156R15174J241200
16751C5206770J543158J435049J333432J486507J287275J700761J471824J903532
$$ plain form
16815 7193636 7891911 7445203 7495445 7695749 7745612 8038319 7923140 8491366 8630381 9047104
16805 9047104 9205887 9380240 9124501 9242892 9620448 9866267 10112265 10330098 10471786
16796 10471786 10718343 10663536 11283838 11346336 11412605 11860308 12155630 12318798 12599758 13150776
16786 13150776 13474112 13650183 14119915 14052790 15008736 14875577 15418122 15672435 16065326
16777 16065326 16692316 17294203 17665830 18063651 18367044 19004699 19591895 19917713 20666816
16768 20666816 21463650 21893209 22485882 23240916 23824162 24969902 25591496 26636379 27005582
16759 27005582 28064886 28856755 29886832 30924314 32256240 33050396 33965570 35206770
16751 35206770 36749928 38184977 39518409 41004916 42292191 43992952 45464776 47368308
16743D7368308K056918J920776J741069K504740J842542K526783K722236K271209
16735F4954581K379522K858635L280207L045955L011709L103739L527723L363135
16727H9525206L563369L323394M090009L631314L423726M401683L422786L775447
16719A19156934L374270L535985L519050K997027L110617K377564K213879J526675
16711A41812001J618806J117091M57643j94006O2423j014023j108115j923643
16703A40828177k217301k498692k772751k964531l297447l518292l859226l676095
16695A16023842l831326l880622m000134l626187l882082l472704l655775l961478
16687H5713534k951833l476604l526837l048118k610036l211763l004107k252496
$$ plain form
16743 47368308 49425226 51346002 53087071 55591811 57434353 59961136 62683372 64954581
16735 64954581 67334103 70192738 73472945 76518900 79530609 82634348 86162071 89525206
16727 89525206 93088575 96411969 100501978 104133292 107557018 111958701 115381487 119156934
16719 119156934 122531204 126067189 129586239 132583266 135693883 138071447 140285326 141812001
16711 141812001 143430807 144547898 145005541 144811535 144873958 143859935 142751820 140828177
16703 140828177 138610876 136112184 133339433 130374902 127077455 123559163 119699937 116023842
16695 116023842 112192516 108311894 104311760 100685573 96803491 93330787 89675012 85713534
16687 85713534 82761701 79285097 75758260 72710142 70100106 66888343 63884236 61631740
16679F1631740k497197k481986k543772j625189k382233k033104j675336j982251
16671D4410672j506028j655098j793467j434528j590471j392081j011477j253444
16663C2774078j084295q92905j214159j166067j292672m06781q15239o59708j035270
16654B4206982q98564m62761j097391l71285o52579q55199m19675o04082o22970
16645A8222476m02075k75616n38344l43095p25773m30510j43022n57074l67762
16636A4439205l16449l52754l97613n30369k60536m56186J76742n00828m37363
16627A1363849k7737r3834k49793l38616l81455m47313N8760k8451m83614j88297
16617I183499o3096k76404m00435J87896j79946k64304L1262k25833l38548k83469
$$ plain form
16679 61631740 59134543 56652557 54108785 52483596 50101363 48068259 46392923 44410672
16671 44410672 42904644 41249546 39456079 38021551 36431080 35038999 34027522 32774078
16663 32774078 31689783 30796878 29582719 28416652 27123980 26717199 25901960 25242252 24206982
16654 24206982 23308418 22845657 21748266 21376981 20724402 19869203 19449528 18845446 18222476
16645 18222476 17820401 17544785 17006441 16663346 15937573 15507063 15364041 14806967 14439205
16636 14439205 14122756 13770002 13372389 12842020 12581484 12125298 12302040 11801212 11363849
16627 11363849 11336112 11242278 10992485 10653869 10272414 9825101 9883861 9855410 9371796 9183499
16617 9183499 9120403 8843999 8443564 8631460 8451514 8187210 8218472 7992639 7654091 7370622
16607G370622K82669m53109q5111j71983J16387l09271m79693J63171P8016j67309
16597F344389j88832K2490m26925L9175L5156j45116m57552J79303l8185j98335
16587E165568J99465K33030j89642p14447L39599m21734j17427P3335k04552O6465
16577D429660m8623Q7008j80370l16001L94897k61494k00752N0345J26776l52550
16567C728896M7835l02581K58827N3376j85500J25459m5615l13859J83480l91649
16557C158669j5787K99312q3954J96481n35376J67060J201o50q3235L5502l85503
16546B753720o8188j47928L31993m532J28299j10354L1692l33658K75832p44582
16536B112294N02605j28523k163k13275n8664K66699k20955K0194J03044k15591
$$ plain form
16607 7370622 7653291 7200182 7115071 6943088 7059475 6750204 6270511 6433682 6511698 6344389
16597 6344389 6155557 6178047 5751122 5790297 5825453 5680337 5222785 5402088 5363903 5165568
16587 5165568 5365033 5598063 5408421 4693974 5033573 4611839 4494412 4567747 4363195 4429660
16577 4429660 4381037 4468045 4287675 3971674 4366571 4105077 3904325 3954670 4081446 3728896
16567 3728896 3776731 3474150 3732977 3786353 3600853 3726312 3680697 3366838 3550318 3158669
16557 3158669 3142882 3442194 3358240 3554721 3019345 3186405 3187606 3186956 3103721 3139223 2753720
16546 2753720 2685532 2537604 2869597 2865065 2993364 2883010 2914702 2581044 2856876 2112294
16536 2112294 2614899 2486376 2484213 2270938 2212274 2478973 2258018 2278212 2381256 2165665
16526B165665L33545l57191k1101K03424l12413l2090r824M4112L45238l40180
16516B019185l90476O77638k87223J68183P9732j99619j22361k2049J23796O0206
16506B107012m4286m87054Q88J32157j59248R1694R6334o3853J07336l25101K21655
16495A677534R9865k03367j46733J37773n774k43783J3660M26729k89711j10186
16485A356007o2607j14235K04997q8266K20891J87966l13069O4736r3254P0459
16475A433625l72160M05392J36731k96644K13643j85019l42716Q9183N96222n83212
16465A095045j5899j8941M17943j60182R6746k6785m22055J54822K96968J8280
16455A435942n09300r5719L02151q3974Q8794k21376J91555L2672L8262K75397
$$ plain form
16526 2165665 2499210 2142019 2120918 2324342 2011929 1979839 1970015 2014127 2359365 2019185
16516 2019185 1628709 2306347 2019124 2187307 2267039 2067420 1945059 1923010 2046806 2107012
16506 2107012 2062726 1575672 1576560 1708717 1549469 1641163 1737497 1673644 1780980 1455879 1677534
16495 1677534 1777399 1574032 1427299 1565072 1559298 1315515 1329175 1755904 1466193 1356007
16485 1356007 1293400 1179165 1384162 1295896 1516787 1704753 1391684 1456420 1363166 1433625
16475 1433625 1061465 1466857 1603588 1306944 1520587 1335568 992852 1082035 1678257 1095045
16465 1095045 1079146 1060205 1478148 1317966 1414712 1387927 965872 1120694 1417662 1435942
16455 1435942 926642 830923 1133074 1049100 1137894 916518 1108073 1140745 1179007 1454404
16445A454404k15397o9191j67743r0546L98292k28478j14441M7048j06334k67403
16435F40211M34004P2666m12513M2888L65605k08183q5643R1819k32968K81060
16425I88946k06021K52073p952P5065J77411E66603L69143n008K88725o05594
16415F13869M70199l08778L27751m52778N86231l09082j43368K52925j29555M2450
16405I49864K51347k97371l6176J50848j49204l8840m14264K08969J38292K9537
16395G93002k14811l9191K86254j54385R7936J97012K7059k57989o6403R8993
16385G67477k61638L19840C58290M38116j28789l17011M37628l40642J29581L7516
16375F14689k1795r1365K25504j96621j25229L92473j30057j62497j30162K27973
$$ plain form
16445 1454404 1239007 1169816 1002073 911527 1309819 1081341 966900 1013948 907614 640211
16435 640211 1074215 1146881 734368 777256 1142861 934678 849035 940854 707886 988946
16425 988946 782925 1034998 1027046 1102111 1279522 566603 935746 930738 1219463 613869
16415 613869 1084068 775290 1103041 650263 1236494 927412 784044 1036969 907414 949864
16405 949864 1201211 903840 867664 1018512 869308 830468 416204 625173 763465 793002
16395 793002 578191 539000 825254 670869 768805 965817 992876 734887 668484 767477
16385 767477 505839 825679 358290 796406 667617 350606 788234 447592 577173 614689
16375 614689 592894 501529 727033 530412 405183 797656 667599 505102 374940 602913
16365F02913K23108l13037J10181J69387j91873o3005R2254r2862K25549C21633
16354F62805J15653k46994J70494K9276l9769j10283k2277J24306k77117O3304
16344D69398Q1943j29839J33975J13128r6393k6314K8696j40800j17995K23638
16334E39437m9459q8537J81625P7072B58864K55817L158J39705j67887P784r3329
16323D04112R9412J0541j37236M05783l56222j7894K23000A79893L09658o0279
16313D29272A500O94585k62731L3569A31059R7061H4607L34793L7116j28476L47980
16302F76020p4647d8512F62756A16308K07035j59329L68504k8022I802L03523
16292C13325j37407K68999A94599J52754K53604j79996J94210B73172M6640n9994
$$ plain form
16365 602913 826021 512984 623165 792552 600679 537674 629928 537066 762615 321633
16354 662805 778458 531464 701958 731234 691465 581182 558905 683211 406094 469398
16344 469398 551341 421502 555477 668605 572212 545898 574594 433794 315799 539437
16334 539437 489978 401441 583066 660138 258864 514681 517839 657544 489657 497441 404112
16323 404112 503524 514065 376829 782612 426390 408496 631496 179893 489551 429272
16313 429272 1500 696085 433354 466923 131059 228120 84607 419400 456516 328040 676020
16302 676020 601373 -48512 662756 116308 323343 164014 532518 504496 9802 313325
16292 313325 175918 444917 194599 347353 600957 420961 615171 273172 319812 259818
16282B59818J85789J8528J4250J53964I5801K28177K56559A98676J26504J65504
16272D90684B39344L67090A82890J74129j14639P5558K59K18809a1857B70669
16261B59344j8547L8829j4075K34441A13720J47255Q1930n9630A0969J99796M667
16250B15432J04402O5503n751O7798A40836k2993J22978L22657k41035E6797R5188
16239A51985J75919f1083B47585M6954j24377J06370F0077L51373j82289Q3559
16229C12720o1189K22136B22579k0725h5395B9283P7175L13174i9277C00347R4429
16218C94776j83212i5238E85799B04840g287A96493o5299M5394J89386d9862q5511
16207a35373A94102J09211N6289I2671n637m1950K87095P9715o7478j26947O7720
$$ plain form
16282 259818 445607 464135 478385 632349 95801 323978 580537 198676 325180 490684
16272 490684 239344 606434 182890 357019 242380 317938 318197 537006 -11857 270669
16261 259344 240797 279626 265551 499992 113720 260975 342905 283275 10969 210765 215432
16250 215432 319834 385337 379586 447384 140836 117843 240821 563478 322443 56797 151985
16239 151985 327904 -61083 247585 294539 170162 276532 60077 411450 229161 312720
16229 312720 251531 473667 222579 201854 -85395 29283 106458 419632 -99277 300347 394776
16218 394776 211564 -95238 585799 204840 -7287 196493 131194 176588 365974 -49862 -135373
16207 -135373 194102 303313 359602 92671 87034 45084 332179 411894 344416 217469 285189
16196B85189a18715C82043j78186I3850K50319i9425H3528K91156a3813j1549
16186b5362A86647N4593A00952J09999L3244j0851b8395D65413D0551P4304J82056
16175B96911e3926C24192L7988F2400Q950M4471I402K00624e2716p0360B2026
16163B76826C7389A0527K56328O1358R1383A64965k4023n4082P4097J06631M2923
16152C10511J70290h9151J6874j53420I1221L72782A13259L36858j35015j14574
16142B00528D9968O6320O7853h430C99905f2641i916A31477N6162A8391b27688
16130A30692q334h2026B84414F5547J41171E9163A3092K68668m5977m412F9978
16118B15575l7043n3795o0329K6380P9465N4594F0854K77961A63811G4098a07428
$$ plain form
16196 285189 -118715 382043 203857 93850 344169 -99425 83528 374684 -13813 -25362
16186 -25362 186647 241240 100952 210951 244195 233344 -28395 465413 40551 114855 296911
16175 296911 -53926 324192 362180 62400 71350 115821 9402 210026 -52716 -123076 22026
16163 276826 37389 10527 266855 328213 419596 164965 140942 86860 160957 267588 310511
16152 310511 480801 -89151 -72277 -225697 91221 464003 113259 450117 315102 200528
16142 200528 49968 116288 184141 -8430 399905 -62641 -9916 131477 187639 18391 -227688
16130 130692 122358 -82026 284414 65547 206718 59163 13092 281760 235783 231371 69978
16118 215575 178532 124737 64408 90788 170253 224847 60854 338815 163811 74098 -107428
16106E0427b83521C9311a04984H4036a6284B26264q1128J60557A51506b2024H7461
16094a89791A90264H5768B0202a46013B31336n2725L9849a2417A19915a18009
16083A94529M0381J18628o0368H8072P5323c2487A92350b1595B56361C5883H089
16071A4561J02045l3579J4241C0680a72241A22472K7265g4791K2231I4043J64731
16060B58774a25207j57215B17903a14397B47530b0547I9655K79787A45158b6428
16049d3559A06708m0081B0598K6680h0977K9531O099m8791J5223A43394f2418
16037d10122A4483a47326D68175c04805r5744I7237J08835d5453k36338A62002
16026c61035f156B54155p4440A1826L26043F9588a14961B14551D1521Q7619a27300
$$ plain form
16106 50427 -283521 39311 -104984 84036 -16284 226264 145136 305693 151506 -22024 87461
16094 -189791 190264 85768 20202 -146013 231336 178611 218460 -12417 119915 -118009
16083 194529 234910 353538 293170 88072 163395 -32487 192350 -21595 256361 35883 8089
16071 14561 116606 83027 97268 30680 -172241 122472 149737 -74791 -52560 94043 258774
16060 258774 -125207 -282422 217903 -114397 247530 -20547 99655 379442 145158 -26428
16049 -43559 106708 66627 20598 47278 -80977 -51446 -45347 -94138 -78915 143394 -62418
16037 -410122 14483 -147326 468175 -304805 -400549 97237 206072 -45453 -281791 162002
16026 -361035 -6156 254155 179715 11826 337869 69588 -114961 214551 41521 129140 -127300
16014a28738A58683l1019J92978G6805a47998A54977M2121a91454a7117A00572
16003C89875a90015A37414b19857f9100j230A24445D6287m975N3287L63886j79229
15992B79256a20164k25095a31241F1002K86101a05227k1857n6645i0345A35135
15981b81627g9203a6319p0687C50108I8410b31203A56434L0551K53145f3835C80704
15969F48254M15775o0988n4295P8491B48558J57144K10132A54063K5518k2726
15959A56855J37765J42859a35119A00739J87738G2729K6719m5389L4825J42276
15949B31160a1030o2606J4096I7805p440J27051h9657E1713b25620B38407C861
15937A95565a41727I2661a87081I5825M6723R4803A07920J86990a3660j25052
$$ plain form
16014 -128738 158683 127664 320642 76805 -147998 154977 197098 -191454 -17117 100572
16003 389875 -190015 137414 -219857 -69100 -70330 124445 46287 41312 94599 458485 279256
15992 279256 -120164 -345259 -131241 61002 347103 -105227 -127084 -183729 -90345 135135
15981 -281627 -79203 -16319 -87006 350108 98410 -231203 156434 186985 440130 -63835 380704
15969 648254 1064029 1003041 948746 1027237 248558 405702 615834 154063 179581 156855
15959 156855 294620 437479 -135119 100739 288477 72729 99448 54059 88884 231160
15949 231160 -11030 -73636 -59540 97805 90365 217416 -89657 51713 -225620 238407 3861
15937 195565 -141727 92661 -187081 95825 142548 237351 107920 294910 -13660 -138712
15927a38712A2731a7334j44921j21389c6984E8057J8802b02228j76792a19478
15916a04102A06541J00949a2525A33928F656a68550r2486C5393j0310M7951a09631
15904c28539R2023Q8730I9302a85837D6820a20331d9753r6982F1563P3169c8068
15892b37349D2506O0747b02170K3734B61828j22725b42142g2748A31736O2371
15882A94107F9861L397J25360c3687j54942c0529j80662j4669A8524a028k5326
15871b6354A77679d01926J42332A24697f57j41232B61366d5450F2370j9035d9446
15859D0891J09987b58650I937J31232e3299k20812I3911a80439N5365A64498l5056
15848A29442n7453b70759E337K43055p9683c0408E6471d8731A9087J6632a36309
$$ plain form
15927 -138712 12731 -17334 -162255 -283644 -36984 58057 76859 -202228 -379020 -119478
15916 -104102 106541 207490 -12525 133928 6656 -168550 -261036 35393 25083 73034 -109631
15904 -328539 -236516 -147786 99302 -185837 46820 -120331 -49753 -146735 61563 134732 -38068
15892 -237349 42506 103253 -202170 -178436 261828 139103 -242142 -72748 131736 194107
15882 194107 69861 73258 198618 -33687 -188629 -30529 -211191 -225860 18524 -1028 -26354
15871 -26354 177679 -401926 -259594 124697 -657 -141889 261366 -45450 62370 43335 -49446
15859 40891 150878 -258650 9937 141169 -53299 -274111 93911 -180439 -125074 164498 129442
15848 129442 71989 -270759 5337 248392 168709 -30408 56471 -48731 19087 35719 -136309
15836b39892I5304f3705A90161J07886a15626G7007k3521M8821B9825a86745N2218
15825a34527L1439p7945B27679b13175C1278J24108n3073b77035A08310a06453
15814b03916F9302b98187D4664b0532j34636c5434l15391A20357E4327c4267B30656
15802D49749e8734a9674l7782B46167a4586j37976a4281C3487J94879c2941k79626
15791c12567B5266R6543b1884A45712a40591j39117a30858O126B12062a5663k18299
15780b33962N4503n3052c4713j68642I8741c1000A23937a28879@b63098i9285
15768d7290A6720a13161n9378k7559r1294A99798a56054C9590b79150i4167j02445
15757a96612P6872G9523O5992b3997A9817b0069F7826b11542d4881D3985b29895
$$ plain form
15836 -239892 95304 -63705 190161 298047 -115626 77007 53486 102307 29825 -186745 -134527
15825 -134527 -103088 -181033 227679 -213175 31278 155386 102313 -277035 108310 -106453
15814 -203916 69302 -298187 44664 -20532 -155168 -35434 -350825 120357 54327 -34267 230656
15802 449749 -58734 -19674 -57456 246167 -14586 -152562 -14281 33487 228366 -32941 -312567
15791 -312567 25266 121809 -21884 145712 -140591 -279708 -130858 -124732 212062 -15663 -233962
15780 -233962 -179459 -232511 -34713 -203355 98741 -31000 123937 -128879 0 -263098 -99285
15768 -47290 16720 -113161 -172539 -200098 -291392 199798 -156054 39590 -279150 -94167 -196612
15757 -196612 -119740 79523 145515 -23997 19817 -20069 67826 -211542 -44881 43985 -229895
15745a83611A62171J6441J78977j22242j17348M0062a51172A78103N5260l4518
15735A98845f6226i234j36376d4821B93887j20032O6162n9792J66123D8685J15070
15724A63755b79388f9392A30902c35710e7177H2255f9040q6533P915b2697A81714
15712a50234L0802j70267A75685j3318c01680p903A85160F5323J10409b07309
15701C98385a32278B22019h9086a0634A70728d021j8580l06322C456L52385h2346
15689A60376b35539k94256A06150e8527A1176a45384A64756J01326a49663H1278
15678a3434n7331n5374D60266H579J32270Q6824G5181K31695a28944B53142a21443
15666f2056j49627A54488h2196n3526N8283f496l251j11967A19825l1358J66726
$$ plain form
15745 -183611 162171 178612 357589 235347 117999 158061 -151172 178103 233363 198845
15735 198845 -66226 -9234 -145610 -44821 293887 173855 240017 180225 346348 48685 163755
15724 163755 -279388 -69392 130902 -335710 -57177 82255 -69040 -155573 -147658 -22697 181714
15712 -150234 -119432 -289699 175685 162367 -301680 -309583 185160 65323 175732 -207309
15701 398385 -132278 222019 -89086 -10634 170728 -4021 -22601 -328923 3456 355841 -82346
15689 160376 -235539 -529795 106150 -58527 11176 -145384 164756 266082 -149663 81278
15678 -13434 -70765 -126139 460266 8579 140849 227673 75181 306876 -128944 253142 -121443
15666 -62056 -211683 154488 -82196 -135722 -77439 -6496 -9747 -121714 119825 88467 255193
15655B55193A08578b22464C4027b81427e7813F2863i5652l18264e5777j61501
15645b17278B74910h5871k7646n2710f5233k0555J6378q2889B08446i6813B52508
15633g7063b0643j6693j45716g1102k2658B4031a00158E445c83666h8963r0594
15622a79557A46064m8743b31232Q8836B28095A6400a42694F9590a40817B60333
15611a20951B17764f8873D9385b36685Q7373l2327R0088K0744A24378i8261j40030
15600b38291E0343a92666k71920B08198a02318k24516B05035d0857G1221b35917
15589C9942c150l4558j25568D9310a27897b7576l05830E021b31337B02460p4887
15578A27573b40948J17373a8698L684j68784A58815e6989A77443i4799i234q4570
$$ plain form
15655 255193 108578 -222464 34027 -281427 -57813 62863 -95652 -413916 -55777 -217278
15645 -217278 274910 -85871 -113517 -166227 -65233 -85788 -69410 -152299 208446 -96813 252508
15633 -77063 -20643 -37336 -183052 -71102 -93760 24031 -100158 5445 -383666 -88963 -179557
15622 -179557 146064 97321 -231232 -142396 228095 16400 -142694 69590 -140817 260333
15611 -120951 217764 -68873 49385 -236685 -149312 -181639 -91551 -70807 124378 -98261 -238291
15600 -238291 50343 -192666 -464586 208198 -102318 -326834 205035 -40857 71221 -235917
15589 39942 -3150 -37708 -163276 49310 -127897 -27576 -333406 5021 -231337 202460 127573
15578 127573 -240948 -123575 -18698 -15014 -183798 158815 -56989 177443 -94799 -9234 -93804
15567i3804B31009f2728r311p6759K2555K6406D13e2776I5437K04421j5279g9772
15554A42310M7328a55902j84795m8110a0017l80451B00467Q7769b48879K2490
15544b26389J06369D8604i5352a8327A55755M6216G9403D702b77538P6036A40743
15532B37966K9655b9816B36940E2736J0443e6085o0608M0086D51233G143f9498
15520B8051J55766C6327K04841a47957E0824P63P5292J4226P741b88595B66429
15508b54753p5156a61071I7628b08931B53150J48316A35911a13750k19642A31928
15497b9429C53071o435A10053J08047c4294j3493B40828q8984h0295b4312A37057
15485d4391F1464J45593a4585H9779b77840B98867r4034a57482e7155l5396H986
$$ plain form
15567 -93804 231009 -62728 -72039 -148798 -126243 -99837 413 -52776 95437 299858 284579 -79772
15554 142310 189638 -155902 -340697 -388807 -10017 -390468 200467 288236 -248879 -226389
15544 -226389 -120020 48604 -95352 -18327 155755 201971 79403 4702 -277538 -201502 140743
15532 237966 267621 -29816 236940 52736 63179 -56085 -116693 -76607 451233 7143 -69498
15520 28051 183817 36327 241168 -147957 50824 51587 126879 141105 148846 -288595 266429
15508 -254753 -329909 -161071 97628 -208931 253150 401466 135911 -113750 -333392 131928
15497 -29429 353071 346636 110053 218100 -34294 -47787 240828 151844 -80295 -24312 137057
15485 -44391 61464 207057 -14585 89779 -277840 298867 204833 -157482 -57155 -92551 8986
15473F9960N6246b6016a2682B50421K4159b32409h0663A02618b41613A32163e5438
15461a29288a4076A0459M9959K58924J94985r1376j37191J16322D2672d6458A77787
15449c2988B2434L6405n05J58998a01880l5870B0694L44163b8944C62763A0617
15437b01658N3678k2093k20751G1441J55028J34032I8826P7132B2827M67572A11484
15425F73062j41928L32369k03846j22414j58331C2164K49018M6731D9674J80279
15415B29953d4725A09254E4400n637b98693m1662i5435A67961d1211H5741b78956
15403a80232B18625H3031c44258J29316A87418J94272a11994p6282D17891A70507
15392B9184Q8299J62148D1959J9632J09489a14253j66831a17120B78011a30513
$$ plain form
15473 69960 126206 -26016 -12682 250421 274580 -232409 -80663 102618 -241613 132163 -55438
15461 -129288 -14076 10459 60418 319342 514327 422951 285760 402082 42672 -46458 177787
15449 -32988 22434 58839 58334 217332 -101880 -137750 20694 364857 -28944 362763 10617
15437 -201658 -147980 -170073 -390824 71441 226469 360501 98826 175958 22827 490399 111484
15425 673062 531134 863503 659657 537243 378912 32164 281182 327913 49674 229953
15415 229953 -44725 109254 54400 48763 -298693 -340355 -95435 167961 -41211 85741 -278956
15403 -180232 218625 83031 -344258 -214942 187418 381690 -111994 -188276 417891 170507
15392 29184 117483 279631 41959 61591 171080 -114253 -281084 -117120 278011 -130513
15381A69330c08762f1463n1019A50570b5002A92390J95915c9022A2600h5030C2504
15369H7055f5598F7426J1528b12861G8648K98977A53986n8506J6010J07914J41168
15358C60572A77334L00606A71009B5162g6838l15381C83086G9090K6453K86175
15348C91718e381n6818G2000J04966N3391A03415J89153A44837B4307J16700a9001
15336d3572E40343j97773A48732E7825j0468c40558G8877P3436a1223A06724P0152
15325A76876D9774K64561A48498a61D7021k112J02071i3659j7373A31173a8646
15313A5433K60007b77776f538B83977R3326j46724r6047O001b0677l5582I1094
15301b936k56485B39283f2584D23703q0231A48283D5919K04143J57512F0104a68158
$$ plain form
15381 169330 -308762 -61463 -112482 150570 -25002 192390 388305 -39022 12600 -85030 32504
15369 87055 -65598 67426 78954 -212861 78648 377625 153986 95480 111490 219404 360572
15358 360572 177334 477940 171009 25162 -76838 -392219 383086 79090 105543 391718
15348 391718 -5381 -62199 72000 176966 230357 103415 292568 144837 24307 141007 -19001
15336 -43572 540343 342570 148732 57825 47357 -340558 78877 152313 -11223 106724 176876
15325 176876 49774 314335 148498 -161 47021 44909 146980 -93659 -111032 131173 -18646
15313 15433 275440 -277776 -6538 283977 377303 230579 134532 140533 -20677 -56259 91094
15301 -2936 -259421 239283 -62584 423703 343472 148283 45919 250062 407574 60104 -168158
15289I3483a58178B30006A0539c2684A29401g9030C55235b1848q280C60492F00
15277A58177K290C2763O3188i5271c6692l1015E6428K65088j2652a17964n8345
15266a76309d3897A30270O941D7992k314J76763G4075J7606a1119A55383C5199
15254B601L54759g4269B66305k7478o8690a83523A1092K0240J57287E4369a69307
15242e1765E123L698K2001d2257B24209n618o9383h8784E1636M21512c3349B40164
15229A91554B3395O57827P5063Q71162P2059o12977M91087F78615k4887k08305
15219D45423h8830B75291K63085A25084O8183g968A32565D4855a16215k0925k07997
15208c45137A08683d8358A18568a59859M5711A36937J71852E6744A528e5251A70593
$$ plain form
15289 93483 -158178 230006 10539 -32684 129401 -79030 355235 -21848 -30128 360492 600
15277 158177 160467 32763 95951 -95271 -36692 -67707 56428 321516 308864 -117964 -176309
15266 -176309 -43897 130270 137211 47992 45678 222441 74075 91681 -11119 155383 35199
15254 2601 357360 -74269 266305 238827 170137 -183523 11092 31332 188619 54369 -169307
15242 -51765 5123 8821 30822 -42257 224209 218591 149208 -88784 51636 473148 -33349 240164
15229 191554 23395 681222 756285 1627447 1699506 1086529 1577616 678615 653728 445423
15219 445423 -88830 275291 538376 125084 193267 -7968 132565 44855 -116215 -137140 -345137
15208 -345137 108683 -48358 118568 -159859 -114148 136937 308789 56744 1528 -55251 170593
15196a21270I2178a06154A71881a24550H8223g1656L316C03501f1247l08551B97019
15184D25793E3599M7932e758A66113A1915J4811M21848k21568A03484a19003A42918
15172H1377a26790a4109B49014F7050J17339J77081m5629C7849J11827d5451A18746
15160A00207A9611e8545C32795r4375J6210f6304D87995B02428b15509H5327J93822
15149B79149I7510l2716J41350b86451A89063p6723M56817A76707Q7368a04268
15138E40559a27376A72564j7645K30370b33273B23971A09263b676I0730P8261
15128A68991b16630A75810c45411F4944L8973J02502L67303B19633c02324A84146
15117A41572R9844L8260K5440E3874k1600j5325a22202j35523G973J81174i3196
$$ plain form
15196 -121270 92178 -106154 171881 -124550 88223 -71656 -68340 303501 -61247 -369798 297019
15184 425793 53599 101531 -5758 166113 11915 26726 448574 227006 103484 -119003 142918
15172 81377 -126790 -14109 249014 67050 184389 361470 315841 37849 149676 -45451 118746
15160 100207 19611 -58545 332795 238420 254630 -66304 487995 202428 -215509 85327 279149
15149 279149 97510 64794 206144 -286451 189063 112340 569157 176707 264075 -104268
15138 540559 -127376 172564 154919 385289 -233273 223971 109263 -2676 90730 168991
15128 168991 -216630 175810 -345411 64944 103917 206419 573722 219633 -302324 184146
15117 141572 241416 279676 305116 53874 32274 16949 -122202 -257725 7973 189147 -93196
15105h5048K4159C44764J36520B38950q5887J98998j35850K4255i9189b3107F1123
15093B24067A11354K77832e0415A60792c988j7451F5394b99165C46188c7397B73916
15081B86315j8443N7657A28743P5798p4307J00276K36394B09708N2923K21900
15071D84531A9566P1027J1382l7813B4947J21563L97727j91791j51372p568P7849
15060B71355J10934j73007L6029J00933A36853P9065J49327f2677A62859m0166
15050A22693a17245C63384a02461A79378k8474L6837a29547C07610J49195m393
15040D52412M7702j10168b7370N37A57115h094B03297J00405o7972K8765J27007
15029C91502m2099j73507K98068a3250E17239j20085n3400H5124j8751Q5711M40047
$$ plain form
15105 -85048 -60889 344764 481284 238950 153063 352061 216211 240466 -99189 -23107 61123
15093 224067 111354 389186 -50415 160792 -3988 -21439 65394 -299165 346188 -37397 273916
15081 286315 267872 325529 128743 204541 130234 230510 466904 209708 262631 484531
15071 484531 19566 90593 101975 64162 24947 146510 544237 352446 201074 193506 271355
15060 271355 382289 209282 245311 346244 136853 215918 365245 -62677 162859 122693
15050 122693 -117245 363384 -102461 179378 150904 187741 -129547 307610 456805 452412
15040 452412 500114 389946 -27370 -26833 157115 -8094 203297 303702 235730 264495 391502
15029 391502 349403 175896 473964 -13250 517239 397154 343754 85124 66373 152084 592131
15018E92131k88616P819Q8519J64381l4634J61058j21047L3750B45159M45775
15008F90934j43460j93809J69797j58546A18072M93327F0862P50688B71156M86169
14998G57325C32667O5326J30224P2987k01017M03020k50118J606B44049J08881
14988C52930d9268F62356B71419N3444n5604J81337o4889p4243M23941k86660
14978D48745j41622K21145k57095J04792O5823Q0826N8193m4839j07879O2420
14968D90509Q8831N5221B03728L12958J64213R5489N4890k59896l5373J57034
14958F93043J70063l25828B09823N00167C27113O3500j06374k0005k8719O1986
14948B97501j25686L24799r8030n7199P2314G1602L26013L28477j91889E5129
$$ plain form
15018 592131 303515 311334 399853 564234 529600 690658 569611 603361 245159 690934
15008 690934 547474 353665 523462 364916 118072 611399 60862 811550 271156 757325
14998 757325 332667 397993 528217 601204 400187 803207 553089 554695 244049 352930
14988 352930 -49268 662356 271419 324863 269259 450596 385707 311464 735405 448745
14978 448745 307123 528268 271173 375965 441788 522614 580807 535968 428089 490509
14968 490509 579340 634561 203728 516686 680899 776388 831278 571382 536009 693043
14958 693043 863106 537278 209823 709990 327113 390613 284239 264234 235515 297501
14948 297501 171815 496614 398584 341385 413699 71602 397615 726092 534203 55129
14937B60001Q2351I1799L28663j69631K07098B4785K56873K19758L0450k55531
14927B76335L46152B82756K34312j3711L8056B52099R9555r6570K37577n3207
14917D39454L19781j67627K02449J56878k19030J75251K88275k1418l371K66203
14907A436845J75352j97012j15905j16988R1831p1828j31605O28911j20446j93192
14897A385963J53044n56520K04315l80647O7403o3923l06298o2423K16371B48567
14886C88044q1590K68121k00993j08299K95313j9872B44937K81115r4944J27122
14876E58230J62774j42149B31183K59527J25294j73740N27349k70888l7207J63755
14866H25273P9820k53386J28422n4502p0772L49580l35122J5000p7566p0401j82222
$$ plain form
14937 260001 342352 91799 420462 250831 457929 24785 281658 501416 531866 276335
14927 276335 622487 282756 517068 503357 541413 252099 351654 255084 492661 439454
14917 439454 759235 591608 794057 950935 731905 907156 1195431 1174013 1170642 1436845
14907 1436845 1612197 1415185 1299280 1182292 1274123 1202295 1070690 1699601 1579155 1385963
14897 1385963 1539007 982487 1186802 806155 873558 809635 503337 440914 657285 248567
14886 388044 306454 574575 373582 265283 560596 540724 244937 526052 431108 558230
14876 558230 721004 578855 231183 490710 616004 442264 969613 698725 661518 825273
14866 825273 905093 651707 780129 725627 654855 1004435 669313 684313 606747 536346 354124
14855C54124K88098J25670l42977K09856Q0462j69425J9313J8446m038j42910
14845D36619K98424j58224j12209M6336r4759m7987O121O5133P2104j31920R9567
14834D79205R3035Q0824k36634M24684K5503C39666M08094k3551K61772l41984
14824F43997K86240J47697j12683O7937K78495n03005J34107l01387l6012q5353
14814E20033J05168p8538J32801m092n8049K00180j53080q8534k0603K29261j71100
14803F13447j47408K10408j22348K16964j4533C51062K16238J44590l02804L79797
14793G88883R3348C44342M49446q3706j89875N05899k84833R3181J0453j97701
14783F47206p2458l471l3912J86777k80946K50345Q2663j94123N5208J08444k28810
$$ plain form
14855 354124 642222 767892 424915 634771 715233 545808 565121 583567 579529 436619
14845 436619 735043 576819 464610 510946 416187 368200 374321 439454 511558 379638 479205
14834 479205 572240 653064 416430 841114 866617 339666 747760 724209 985981 643997
14824 643997 930237 1077934 965251 1033188 1311683 808678 942785 641398 605386 520033
14814 520033 625201 546663 679464 675372 617323 817503 664423 575889 555286 784547 613447
14803 613447 466039 676447 554099 771063 756530 351062 567300 711890 409086 788883
14793 788883 882231 344342 793788 710082 520207 1026106 741273 834454 844907 647206
14783 647206 574748 571277 537365 724142 443196 693541 776204 582081 637289 745733 516923
14772E16923M2343L6061L22116m21714M15720j81001J42005l3084J02001M235
14762I45605j08969J15645Q1608p8271Q0249l12935J05908K79616k96170j5678
14752G96608J33237p9680l17687K16631j36846L5273K23297k73888p5863L69661
14742H90743k19673j11056K20724o2019O0006Q7969L9215j80090R7565j70164
14732F53220M9402Q3656k18058o7780K21072P8611m5021K64231k93590j5443k5025
14721F85275Q3388L71884k90350k07368N0359O9887L80432R6469P9237j81244
14711A137969L14944J06582J00706p1697l99546N4270k4525p6041m8541k62653
14701H31468J8998K35960n8789k34732K98000p1191L04485l50715n6905K42452
$$ plain form
14772 516923 559266 595327 917443 495729 911449 730448 872453 839369 941370 945605
14762 945605 836636 952281 1033889 955618 1035867 722932 828840 1108456 812286 796608
14752 796608 929845 850165 532478 749109 612263 647536 870833 596945 521082 890743
14742 890743 671070 560014 780738 718719 778725 866694 905909 725819 823384 653220
14732 653220 702622 786278 568220 500440 721512 800123 755102 1019333 725743 710300 685275
14721 685275 768663 1140547 850197 642829 693188 763075 1143507 1239976 1319213 1137969
14711 1137969 1452913 1559495 1660201 1588504 1188958 1243228 1218703 1142662 1094121 831468
14701 831468 850466 1086426 1027637 792905 1090905 1019714 1324199 973484 916579 1159031
14691A159031j86162L60858k64200J32879j52286K48961p879M43844J57235j87868
14681A704413n76115K16699l07682j78623M17120m50622K33206K7980J75976j25116
14671A137236q0739L1397O9548n0742L50237l25786k39541J37337p622L2304o4167
14660I89462J98384j839j64275k88397K82292J21317l68057K84399O83J57505
14650A211474L601j08169R9290q1686M5461J20289k63813Q3961J55567k34602
14640A031373N92745p72670L70005j77403K03290L59439l07372O7005J47355k78495
14630A235272M08131j9321Q6268l27625q9187J36131q1065J30322j06101l34231
14620A038594J78827j70677K58762J04448L0170j74469J43166N3635l79853M57359
$$ plain form
14691 1159031 972869 1333727 1069527 1202406 1050120 1299081 1291202 1735046 1892281 1704413
14681 1704413 1128298 1344997 1037315 858692 1275812 825190 1058396 1086376 1262352 1137236
14671 1137236 1056497 1087894 1157442 1106700 1456937 1131151 891610 1028947 1021325 1053629 989462
14660 989462 1187846 1186007 1021732 733335 1015627 1136944 768887 1053286 1053969 1211474
14650 1211474 1215075 1106906 1206196 1124510 1169971 1290260 1026447 1110408 1265975 1031373
14640 1031373 1624118 851448 1221453 1044050 1247340 1606779 1299407 1366412 1513767 1235272
14630 1235272 1643403 1624082 1710350 1382725 1293538 1429669 1348604 1478926 1372825 1038594
14620 1038594 1217421 1046744 1305506 1409954 1440124 1265655 1408821 1462456 1082603 1539962
14610A539962j57543R7759q9179p5226J57838M03438m86783L69414j80632r2463
14600A486585L62187m04668K17970q6360R068n8992N3140n7827k24192L43231
14590A640142l1282J78639k19355K89809j65624n048k1116n3183M07070l37597
14580A682455L78111k67606R3189J9244R2695J4809m8844J67210k92759j80819
14570A657685N60834k09144j0106K58819l6073j5900Q1465l17565K25537Q3278
14560B278830J02110K06096l08763k28253L04018p8893M68495j21244l51922L56781
14550B627255K26748l06646L90243K47853j87989J00496J83272m2108K3947P63212
14540D026283j48645R35735J72723N65083J089601J219444K262331M138576O172752
$$ plain form
14610 1539962 1382419 1480178 1390999 1315773 1473611 1877049 1390266 1759680 1579048 1486585
14600 1486585 1848772 1444104 1662074 1575714 1584782 1525790 1578930 1521103 1296911 1640142
14590 1640142 1608860 1787499 1568144 1857953 1692329 1687281 1666165 1612982 2020052 1682455
14580 1682455 2060566 1792960 1886149 1905393 1998088 2012897 1964053 2131263 1838504 1657685
14570 1657685 2218519 2009375 1999269 2258088 2222015 2206115 2287580 1970015 2195552 2278830
14560 2278830 2380940 2587036 2278273 2050020 2354038 2275145 2743640 2622396 2270474 2627255
14550 2627255 2854003 2547357 2937600 3185453 2997464 3097960 3281232 3239124 3263071 4026283
14540 4026283 3877638 4813373 4986096 5551179 6640780 7860224 10122555 14261131 20433883
14531B0433883J1057047M315086j5763999q748433m634330j732729r52311J26688
14523D100902k09378M62997R05906j281760q76484m04855n48073L45060k224m3631
14513B448460K48914o8474k26929j27055Q14009n42762L806L97768l39761K45956
14503B853932k73248j13082J60858j4565K12280L72058j43904k60540K03436l6691
14493B960534k44723K49748K91235j9152J71190k83508N07060k87938j6371n7588
14483C270487L00861J01492j45235j25471M66164j08045n6212J38991J26080P1729
14473D040841R288j28830K64915j13528n8369L52256k04216o7168J44946j02201
14463D137934q419K44941K40816l0805K26681Q8622j12614Q9788r0038j34418
$$ plain form
14531 20433883 31490930 35806016 20042017 11293584 6659254 4926525 3974214 4100902
14523 4100902 3891524 4354521 5260427 3978667 3102183 2697328 2149255 2494315 2492091 2448460
14513 2448460 2697374 2628900 2401971 2274916 3088925 2546163 2549969 2947737 2607976 2853932
14503 2853932 2580684 2467602 2628460 2613895 2826175 3198233 3054329 2793789 2997225 2960534
14493 2960534 2715811 2965559 3256794 3237642 3408832 3125324 3632384 3344446 3328075 3270487
14483 3270487 3571348 3672840 3527605 3402134 3868298 3760253 3704041 3843032 3969112 4040841
14473 4040841 4050129 3921299 4186214 4072686 4014317 4366573 4162357 4095189 4240135 4137934
14463 4137934 4129515 4374456 4615272 4584467 4811148 4899770 4787156 4876944 4786906 4652488
14453D652488M80207l50891J00869K06295o7346L71326m19161L98080m5492l2662
14443E293713O08557l24725m34349M77368o8242J24361j72034N96925K65241n8128
14433F308687o3659l04979L71258J20009k61485J86421M60418k39600Q5579K05733
14423F868382k08781L00589K33311J04104L2867K94163l71712K22595L98348k14353
14413G659513L90672J55527l7101K88000M3972L8372J20899k13173N63873j266
14403I009288J22314L60653J09403R4199J20383J21145j36205J79702L02542j46747
14393A0136677J77874J13084P38995l36693L44559N9508N31788j10823P61141
14384A2416110j49945o3013N32613P4377l7401o6390M88487N40005J49662J78493
$$ plain form
14453 4652488 5132695 4781804 4882673 5088968 5021622 5392948 4973787 5371867 5326375 5293713
14443 5293713 5902270 5577545 5143196 5620564 5552322 5676683 5504649 6101574 6366815 6308687
14433 6308687 6245028 5940049 6311307 6431316 6169831 6356252 6816670 6577070 6662649 6868382
14423 6868382 6659601 6960190 7193501 7297605 7330472 7624635 7252923 7475518 7873866 7659513
14413 7659513 8050185 8205712 8168611 8456611 8500583 8538955 8659854 8446681 9010554 9009288
14403 9009288 9131602 9492255 9601658 9695857 9816240 9937385 9801180 9980882 10283424 10136677
14393 10136677 10314551 10427635 11166630 10829937 11174496 11234004 11765792 11654969 12416110
14384 12416110 12266165 12203152 12735765 12810142 12772741 12706351 13194838 13734843 13884505 14062998
14374A4062998M6052L81593K9395K82027M70516L779N92467L48536K26891j13066
14364A6331188Q71037J16428M52007R7976L66332L50179L03745M51257J79926
14355A9520075K35975O09994N47644J99104M07035Q40635K61927N98254N65680
14346B3786323N07134L89388N78199K47619O84263Q20341M71526Q48327M15604
14337B8748724P64952P11738M48103Q75874J237893L95815R16958Q47771J087899
14328C6035727P63440J137190R71363J128426J052484R63808J671214Q56153J598216
14319D6178021J068159J631947J546002J523136J622122J424565J849910K099346
14311E8943208J705353K043302K535968J708233K387207K657269K722993K827091
$$ plain form
14374 14062998 14109050 14490643 14520038 14802065 15272581 15276360 15868827 16217363 16444254 16331188
14364 16331188 17202225 17318653 17770660 17868636 18234968 18585147 18888892 19340149 19520075
14355 19520075 19756050 20366044 20913688 21112792 21519827 22360462 22622389 23220643 23786323
14346 23786323 24293457 24682845 25261044 25508663 26192926 27013267 27484793 28333120 28748724
14337 28748724 29513676 30225414 30673517 31549391 32787284 33183099 34100057 34947828 36035727
14328 36035727 36799167 37936357 38907720 40036146 41088630 42052438 43723652 44579805 46178021
14319 46178021 47246180 48878127 50424129 51947265 53569387 54993952 56843862 58943208
14311 58943208 60648561 62691863 65227831 66936064 69323271 71980540 74703533 77530624
14303G7530624K775096K505003L178449L251670L474030L332264L989217M020449
14295A04056802M503127M523290M708285M915386N557463N245780O058521N677180
14287A45245834P009769P045392P350795Q034352P875883Q825276R045287R546718
14279B09979306J0430148J0439344J1467803J1638030J2503588J2998890J3330894
14272B92788003J3911363J4256964J4683370J4236818J3561057J3096569J2594039
14265C89128183J1615625J0456485J0670028R092182Q359946P627164O777704
14258D53727317M649300K907560K726993K947796K47292m526201m173591o527479
14250D51978987r866668j0590787j1836933j1736528j2635342j3378130j3271093
$$ plain form
14303 77530624 80305720 82810723 85989172 89240842 92714872 96047136 100036353 104056802
14295 104056802 108559929 113083219 117791504 122706890 128264353 133510133 139568654 145245834
14287 145245834 152255603 159300995 166651790 174686142 182562025 191387301 200432588 209979306
14279 209979306 220409454 230848798 242316601 253954631 266458219 279457109 292788003
14272 292788003 306699366 320956330 335639700 349876518 363437575 376534144 389128183
14265 389128183 400743808 411200293 421870321 430962503 439322449 446949613 453727317
14258 453727317 458376617 461284177 464011170 466958966 467206258 462680057 458506466 451978987
14250 451978987 442112319 431521532 419684599 407948071 395312729 381934599 368663506
14243C68663506j4135865j3550959j3830904j3309875j2879768j2801466j2842219
14236B75312450j2428321j1723543j1650797j0901225j0132358j0245034j0678561
14229A97552611r332100r144167q612812q020040p238744p145860o023878o413552
14221A35621458o019259n677464n231429m538868m751925m336391m117582m057962
14213I6890578l705269l579094l146162l202158l149951k897041k724407k381840
14205G2104656k361443k216774k270537k646169j790262j801722j846912j474823
14197E5696014j827298j739092j688011j132709j436669r17351j450580j380258
14189D4124046j461684r42930j006192r78519q23585j276874j241323p80461o84212
$$ plain form
14243 368663506 354527641 340976682 327145778 313835903 300956135 288154669 275312450
14236 275312450 262884129 251160586 239509789 228608564 218476206 208231172 197552611
14229 197552611 188220511 179076344 170463532 162443492 155204748 148058888 142035010 135621458
14221 135621458 129602199 123924735 118693306 114154438 109402513 105066122 100948540 96890578
14213 96890578 93185309 89606215 86460053 83257895 80107944 77210903 74486496 72104656
14205 72104656 69743213 67526439 65255902 62609733 60819471 59017749 57170837 55696014
14197 55696014 53868716 52129624 50441613 49308904 47872235 46954884 45504304 44124046
14189 44124046 42662362 41719432 40713240 39734721 38911136 37634262 36392939 35612478 34928266
14180C4928266j145258p30641m74894j375890m20485n69240j059092n73930n18731
14171B8060105m98215r07429n61978n63002o48640k91197m30160p22169p32471
14162B2704844p7914n23476k59881k77733r45506j81098n92042j76606n82278
14153A9088310J7054n32703k00086n92723O8956p41246k40682l32411l78729j67247
14143A5988493l19787k77891o1631j43773n05896j35525l7732o85503Q1053j22015
14133A3779793m12488J04466l01297m26890j11046k75143j77577k17825r8876
14124A1863117l70836k58456N81154j047026J43584r0567L2622m45262J14058
14115A0522388m38666j84610P9388j00695k43615J85j88734j72335j84064K91006
$$ plain form
14180 34928266 33783008 33052367 32577473 31201583 30781098 30211858 29152766 28578836 28060105
14171 28060105 27561890 26654461 26092483 25529481 24880841 24589644 24159484 23437315 22704844
14162 22704844 22626930 22103454 21843573 21565840 20620334 20439236 19847194 19670588 19088310
14153 19088310 19105364 18572661 18372575 17779852 17848808 17107562 16866880 16534469 16155740 15988493
14143 15988493 15668706 15390815 15329184 15185411 14679515 14543990 14506258 13820755 13901808 13779793
14133 13779793 13367305 13471771 13170474 12743584 12632538 12357395 12179818 11961993 11863117
14124 11863117 11492281 11233825 11814979 10767953 10911537 10820970 10853592 10408330 10522388
14115 10522388 10083722 9899112 9978500 9877805 9634190 9634375 9445641 9273306 9089242 9380248
14105I380248k39851l34964l15383m9928L2382k94484L45286m09286J54418o67245
14095G601193O25452l11490p02828M72539L0095j75182m45844O1959K74774k85839
14085G144829j21014l08702L77668p42466J25634Q5255r0458J39151k53596J23844
14075F480145l01259j13453P3712N709l97849L21115m47169J53261k8561k94300
14065E451351o5836m1336p1316J67698k66380k21160K51837l71292L09093j26557
14055E016102K71732n14151L70976k18378k40574j4602J01802J70115m27677J60023
14045D675368J44541l09504k4819N1183J36764K3131k56556L4747J46111l75778
14035D245188j49000j4606k19241k0035j03142K3592r7775J76031l37581M25849
$$ plain form
14105 9380248 9140397 8805433 8490050 8440122 8472504 8178020 8523306 8114020 8268438 7601193
14095 7601193 8226645 7915155 7212327 7684866 7714961 7539779 7093935 7155894 7430668 7144829
14085 7144829 7023815 6715113 7092781 6350315 6475949 6561204 6470746 6609897 6356301 6480145
14075 6480145 6178886 6065433 6139145 6144854 5747005 6068120 5620951 5774212 5745651 5451351
14065 5451351 5385515 5344179 5272863 5440561 5174181 4953021 5204858 4833566 5142659 5016102
14055 5016102 5287834 4773683 5144659 4926281 4685707 4671105 4772907 4943022 4515345 4675368
14045 4675368 4819909 4510405 4485586 4536769 4673533 4696664 4440108 4474855 4620966 4245188
14035 4245188 4096188 4081582 3862341 3842306 3739164 3762756 3664981 3841012 3503431 3929280
14025C929280k87573K12505j66786l6263P3615k07953K78490j27223o99204P28404
14015C697292k54068M422K36227k88163j3465J74292o5139k71200J16829o2969
14005C274058k38872K06634l14661L24250l04242j22101K01024j78947K85878
13996C133021o12703K94037j77986J44440p5893p0840Q6569l33622O2069J89189
13986B638281K7599L4654k08123M2146K03451j6161L43500k69551O77126M91685
13976C964607O07230L24003J751406L179434N774124J0986609J1123850j2730031
13968B4981232r217860n162991k652777j480845j011947o60506m25734l55071
13960D013501l44542k48217k41660L1741N9336J0581j90705L87135m26790k36666
$$ plain form
14025 3929280 3641707 3854212 3687426 3651163 3724778 3516825 3795315 3668092 2968888 3697292
14015 3697292 3443224 3447646 3683873 3395710 3382245 3556537 3491398 3220198 3337027 3274058
14005 3274058 3035186 3241820 2927159 3251409 2947167 2825066 3026090 2847143 3133021
13996 3133021 2520318 2814355 2636369 2780809 2704916 2634076 2720645 2387023 2449092 2638281
13986 2638281 2665880 2700534 2492411 2534557 2738008 2721847 3065347 2795796 3472922 3964607
13976 3964607 4571837 4895840 6647246 9826680 15600804 26587413 37711263 24981232
13968 24981232 15763372 10600381 7947604 6466759 5454812 4794306 4368572 4013501
13960 4013501 3668959 3420742 3179082 3210823 3270159 3280740 3090035 3477170 3050380 2813714
13950B813714j27100K43772n96057J47828O8765k19483K33559k99889M7665K50289
13940B563063q0546j12429o4730m1081N665j60186K31357J24736k19444R8790
13930B345195J28859k78151j57444K60258l29277K97439m15659L29027m56234
13921A724013N33750j33137J03900k46016P6114k15531L5836k50008J17617M31736
13911B178274j26652o04918K96899l3519r758J43377j83917j04754K79880J36719
13901A971631l26663o2684J37840j2818K95337M3329k61363j70153p8123L23744
13891A860077k26666l9804J54987j78420K20729q5022j28396m5192K11239J44743
13881A888275m59141K05987r3149k28119K92128k08275N2448J09181n2406K9166
$$ plain form
13950 2813714 2686614 2930386 2334329 2482157 2550922 2331439 2564998 2265109 2312774 2563063
13940 2563063 2482517 2370088 2305358 2264277 2269942 2109756 2341113 2465849 2246405 2345195
13930 2345195 2474054 2195903 2038459 2298717 1969440 2266879 1851220 2180247 1724013
13921 1724013 2257763 2124626 2228526 1982510 2058624 1843093 1878929 1628921 1746538 2178274
13911 2178274 2051622 1446704 1743603 1710084 1700326 1843703 1659786 1555032 1834912 1971631
13901 1971631 1644968 1582284 1720124 1707306 2002643 2045972 1784609 1614456 1536333 1860077
13891 1860077 1633411 1593607 1748594 1570174 1790903 1705881 1577485 1532293 1743532 1888275
13881 1888275 1429134 1635121 1541972 1313853 1605981 1397706 1450154 1559335 1506929 1536095
13871A536095J4577k39829J50451l0432j15987M26402k31883n8729J35163j33810
13861A452018K6030l23895j09711L28298O1478Q0610j18751j78025J28056l35871
13851A010237N13751J376k81493j44961N30817n84851M75179m08872L70364O6597
13841A548144l45500j41641L10844m12344J72450n3776J64635l5001L1735r355
13831A230191Q086j11892J47775j96996o6912J14264m2081K4496K9453L300j56059
13820I83625J29659L1846Q8348k07099r5677M4139J15403j38205p8888K16581
13810A089732j96254L95914k84826K23453L9958k64154j39344J70726J11179k04481
13800I41903M27149k79642j12579J73653l99383J36175j12626M08203j30900k366
$$ plain form
13871 1536095 1550672 1310843 1461294 1430862 1314875 1741277 1509394 1450665 1585828 1452018
13861 1452018 1478048 1154153 1044442 1372740 1434218 1514828 1396077 1218052 1346108 1010237
13851 1010237 1523988 1525364 1243871 1098910 1629727 1044876 1520055 1111183 1481547 1548144
13841 1548144 1202644 1061003 1371847 959503 1131953 1078177 1242812 1207811 1239546 1230191
13831 1230191 1238277 1126385 1274160 1077164 1010252 1124516 1082435 1106931 1136384 1139684 983625
13820 983625 1113284 1145130 1233478 1026379 930702 974841 1090244 952039 873151 1089732
13810 1089732 893478 1289392 1004566 1228019 1267977 1003823 864479 1035205 1146384 941903
13800 941903 1369052 1089410 976831 1150484 751101 887276 774650 1182853 1051953 1049587
13790A049587Q9135m4801r3270N8177o0574l6615J82788k56384K38617L0172k23150
13779I33682J74728j30512j27802R7145M0376j25210J24603j83914N008K36918
13769A045022l48517k0763j06076M37713j71233J93090k31996O5186J68771k25827
13759H05370j8637j66216J56387J32040k46498M1730J78253l7347m8075o0579
13749G36428J94259l04938J90516R6644k84072N64252m48981k8121M3070L21127
13739A080184m03547L65542C16744J90038L46506J64245k43847l26489J81644
13730F28841B59170O94982j85135j13K06841r6610j86470n2936Q2544M3460j03948
13719F61785j8482J32452N0070j85764K25500O3026n3421j69892O8369j93044
$$ plain form
13790 1049587 1138722 1093921 1000651 1058828 998254 961639 1144427 888043 1126660 1156832 933682
13779 933682 1108410 977898 850096 947241 987617 862407 987010 803096 808104 1045022
13769 1045022 696505 675742 569666 1007379 836146 1029236 797240 862426 1031197 805370
13759 805370 786733 620517 776904 908944 662446 704176 882429 845082 797007 736428
13749 736428 930687 625749 816265 912909 628837 1193089 744108 715987 759057 1080184
13739 1080184 676637 1042179 316744 506782 853288 1017533 773686 447197 628841
13730 628841 259170 954152 769017 768904 975745 879135 692665 639729 722273 765733 661785
13719 661785 643303 775755 825825 640061 865561 928587 875166 705274 773643 580599
13709E80599K84345J9628M0358m00557K65923j95524J41706l41470K48987J48857
13699G92852l90723L01187k38032K68320r236j54405L31939q8476j65753j6777
13689F30896k22739J96770m1789J98024k61234J46739n021k19845J92126N8827
13679F72754J57491l89051O4460Q4466p621R2098l07634L34831j53921J92180
13669G40053k97645J40755j61280M9339J51134R3666J0519O7451j95492o7810
13659E30690k10358J83026K16456B90661K48064J18943k83961J04571K21749K51312
13649I51339B74378J16345K31248j22453n1982M7300O707K0138B08583J12400
13639C20983J65005Q2707j78509K11750j6596L0415B60618P0486j25207L01571
$$ plain form
13709 580599 864944 884572 924930 524373 790296 594772 736478 395008 643995 792852
13699 792852 402129 703316 465284 733604 724368 569963 901902 813426 647673 630896
13689 630896 408157 604927 563138 761162 499928 646667 641646 421801 613927 672754
13679 672754 830245 441194 505654 590120 582499 674597 366963 701794 547873 740053
13669 740053 442408 583163 421883 471222 622356 716022 726541 793992 598500 530690
13659 530690 320332 503358 719814 290661 538725 657668 373707 478278 700027 951339
13649 951339 274378 390723 621971 499518 447536 494836 501543 521681 208583 320983
13639 320983 485988 568695 390186 601936 585340 615755 260618 331104 205897 507468
13629E07468n8547j53379K61677J04576j70134Q3534B30354Q0432L8535r020J37939
13618D78240j47636L30518k35824k7197K5358L9487q1883F9914N12872N3042J1911
13607F47739j13832n2991n633A82020K52498o3086L07285I5892L33103J10227
13597E39222j74052k4412J04876K76604C37392j45026J13270n5532Q2824A63437
13586E19824Q047J82368B87570K97255j63362K18558j62512j31981K5708j56493
13576B14743J99430n7346E5932J16200J92137A46265J67019m5828M05011p0866
13566F01601k65786F2832N79073j12715k39424L1638A22619J83037P0860J49744
13556E26260m9668j32582F1954L02752j46587N28053B73351L86005j18455Q9060
$$ plain form
13629 507468 448921 295542 557219 661795 491661 575195 230354 310786 349321 340301 478240
13618 478240 330604 661122 425298 398101 423459 462946 381063 69914 582786 635828 647739
13607 647739 533907 480916 475283 182020 434518 371432 678717 95892 428995 539222
13597 539222 365170 340758 445634 722238 337392 192366 305636 250104 332928 163437
13586 519824 527871 710239 287570 584825 421463 640021 477509 345528 371236 214743
13576 214743 414173 356827 55932 172132 364269 146265 313284 267456 672467 601601
13566 601601 335815 62832 641905 529190 289766 321404 122619 305656 376516 526260
13556 526260 476592 344010 61954 364706 218119 746172 273351 659356 540901 629961
13546F29961B38873O6248q2019l3291M03485B09706L75069j53651J18487j38926
13536D10685H2519K17013M19162B03188K23320k12221J14653J1135j44569J90260
13526C85766j1547o2418A45229M13295j11241J02653A89353J38932M87057C71694
13515D31137J52884A30522J7407J16103K46589j2312F5572J89760k8575K45088
13505D71845j00435A77941L98217c65804C74506J24204k011R0895E2225J79149
13495B31374h1951C03702I6415j4625J11129M47571j23046A94853Q5190A36892
13484C65951M8059m6993D0722K68098A33797K97710j41343J07434j25454N2863
13474C25007G5628K11958I0150L62466J35001B89294K7775j45391J89378A79138
$$ plain form
13546 629961 238873 305121 223102 189811 593296 209706 584775 431124 549611 410685
13536 410685 82519 299532 718694 203188 426508 214287 328940 340075 195506 385766
13526 385766 374219 311801 145229 558524 447283 549936 189353 328285 815342 371694
13515 431137 584021 130522 147929 264032 510621 498309 65572 255332 226757 471845
13505 471845 371410 177941 576158 -365804 374506 498710 496699 587594 52225 231374
13495 231374 -81951 303702 96415 81790 192919 640490 517444 194853 280043 136892
13484 365951 414010 367017 40722 308820 133797 431507 290164 397598 272144 325007
13474 325007 75628 287586 90150 452616 587617 289294 317069 171678 361056 179138
13463E92296k21913K22707j88026A93117O6477r7083J07788P0953j22983Q0651
13453B98920Q7730L7863I5176J04370B1758K51415F8716H683J9097K91699J30033
13442D49512N817k16930K29817k6973B02960C8391O0571d5945A31112K86497A16172
13430A30572c1202E17276A94634R2663A9716a75804A87665J02549j7067O680J42870
13419D22697l6095K05206A24383h486C83614j00916j08373Q3038a07168B75747
13408B79516K71064A26530K66781j51299L04692k65224J78862j89913B6190M02188
13398D28378E0192K26398j14348J68060L2468D2710J79471f5753E32297a34288
13387D10923R5898A47704C9239b5126N379D08045J37881j94546b1043E0227J55821
$$ plain form
13463 592296 370383 593090 405064 193117 259594 162511 270299 341252 218269 298920
13453 298920 386650 424513 95176 199546 21758 273173 68716 8683 27780 319479 449512
13442 449512 455329 238399 468216 441243 202960 38391 98962 -45945 131112 417609 116172
13430 130572 -31202 517276 194634 287297 19716 -175804 187665 290214 273147 279827 422697
13419 422697 386602 591808 124383 -8486 383614 282698 174325 257363 -107168 275747
13408 279516 550580 126530 393311 242012 546704 281480 460342 270429 26190 428378
13398 428378 50192 276590 162242 330302 362770 42710 222181 -65753 532297 -134288
13387 410923 506821 147704 39239 -25126 -19747 408045 545926 351380 -21043 50227 206048
13376B06048J2499J80723G2320K35007A15655J62150M7758N2788j24839C6900
13365B20591p4162L00180A42216a43626C92471k3218G3224M32K25461o4716j8598
13354B15803L81553k67853M46c5413C09451n3245J22384j76543B2623K1616J31640
13343A75879K87211k22576e6808C5560a12821B12555P646e195B55036J63286n5432
13332C62890j79847Q8685l6629c2022j7696B95388J21118F6773K16304K46079
13322E29156I4053L95494k36784m3787B6289J17261M43783n31A03801N93381A95667
13310B91224r7525L2578J05825A01838c8889A71692K91809j08568F1945M10987
13300D72932j67131b25666B81961r3992J7768J364K9327K9747O8820H3526j1977
$$ plain form
13376 206048 218547 399270 72320 307327 115655 277805 325563 378351 253512 36900
13365 220591 146429 446609 142216 -143626 392471 369253 73224 73656 299117 234401 215803
13354 215803 597356 329503 329949 -35413 309451 256206 378590 202047 22623 44239 175879
13343 175879 463090 240514 -56808 35560 -112821 212555 220201 -5195 255036 418322 362890
13332 362890 183043 271728 235099 -32022 -49718 295388 416506 66773 283077 529156
13322 529156 94053 489547 252763 208976 26289 143550 587333 586802 103801 697182 195667
13310 291224 193699 226277 332102 101838 -38889 171692 463501 354933 61945 472932
13300 472932 305801 -225666 281961 187969 205737 207101 236428 266175 334995 83526 71549
13289G1549a4128A17263J86795j48544A5127N7341K09635g6590A70550l9569F2544
13277B43268o1036k8074p4518M6780K54712j85723i7278B7442N9091K78055A26342
13265A24435K6745F0546b3569A73542Q6960L0400D6144K71489a86016C42108A07591
13253D11947A66371G4914C3979J04154K7681J67951b57084F1327d5083B86393
13242a30794K7757J0790H4585D1985a24049A09698M8129O3168A1181B940J20490
13231A23430J13108a30724D12746J656A7266J52084R3993L5870L2023A37974h2765
13219A13321a86574i3123C23309k9446d0832l1992D8654P8271a30530C24251J65033
13208D89284f0768A67045J38640A52077E9896B1721N04341k27786M0174G6912
$$ plain form
13289 71549 -14128 117263 304058 155514 15127 72468 282103 -76590 170550 130981 62544
13277 243268 182232 154158 79640 126420 381132 195409 -97278 27442 86533 364588 126342
13265 124435 151180 60546 -23569 173542 260502 290902 46144 317633 -186016 342108 107591
13253 411947 166371 74914 33979 138133 165814 333765 -257084 61327 -45083 286393
13242 -130794 -103037 -92247 84585 41985 -124049 109698 157827 220995 11181 2940 123430
13231 123430 236538 -130724 412746 414402 17266 169350 263343 299213 331236 137974 -82765
13219 113321 -186574 -93123 323309 293863 -40832 -72824 48654 126925 -130530 324251 489284
13208 489284 -60768 167045 305685 152077 59896 21721 526062 298276 338450 76912
13197I7083K47944j50260a00269C17832E8145K83608J09758a27774B63169M6831
13187C10000b39398A77373d4037F23495c152H1157j7393J16628J34603j56061
13177A58934Q8043J65789A59148b99962G0372L43261g7603A91466n5185m631a32088
13165e8661B04477K8508j00005Q1881b1842B20682J19481n8019A33930a15139
13154A85764a12782E42990a8357j83556C28233I2015D1830f1831A64119d9080
13143E8806B0261J48510J4635o6134h5612A55275j5879a34499p8709C13708a04660
13131c7588j12770A45959F9872A9743K18475M6220h7968a8001k7269D0833J42424
13120A83257j6190B2468C392a04797K3067B63340A1498L10157b56261A05378h0146
$$ plain form
13197 97083 345027 194767 -100269 317832 58145 341753 451511 -127774 263169 310000
13187 310000 -239398 177373 -44037 623495 -3152 81157 63764 180392 314995 158934
13177 158934 246977 412766 159148 -299962 70372 413633 -77603 191466 136281 131650 -132088
13165 -58661 204477 232985 132980 214861 -21842 220682 340163 282144 133930 -115139
13154 185764 -112782 542990 -18357 -201913 328233 92015 41830 -61831 164119 -49080
13143 58806 20261 168771 183406 117272 -85612 155275 139396 -134499 -213208 313708 -104660
13131 -37588 -150358 145959 69872 19743 238218 284438 -87968 -18001 -45270 40833 183257
13120 183257 167067 22468 3392 -104797 -81730 263340 11498 321655 -256261 105378 -80146
13108C83880a3736E4178a92123a2169I0018b1496O836D4858j2631J53038D4449
13096B27876M8005J2698A8480q560b23062a06909C31467a13651B05027K21152
13086D26179D4912a56054H6683k4883O9862g7137A28429O4450N170C1372P4659
13075A06031B256f4188c468B26392b81903A59715n4600O7296H2136o168J7879
13064I3847i6563C48473A16754e5512a7717B53518d7938m3536C40848A36420d4108
13052a0475A64463D1719M30593m6595A82988a15675C89032j41897g486A61979
13041F642a20253I04b23347A01095a4541A50935C1815l574K43854R7100r9855
13030B69340K2122A07145Q3634e7101r0987E9907R0478l5371K75020a39178A09777
$$ plain form
13108 383880 -13736 54178 -192123 -12169 90018 -21496 -14660 44858 32227 185265 44449
13096 227876 275881 288579 18480 9920 -223062 -106909 331467 -113651 205027 426179
13086 426179 44912 -156054 86683 61800 131662 -77137 128429 192879 198049 31372 106031
13075 106031 2256 -64188 -3468 226392 -281903 159715 105115 172411 82136 75968 93847
13064 93847 -96563 348473 116754 -55512 -17717 253518 -47938 -91474 340848 136420 -44108
13052 -10475 164463 41719 472312 425717 182988 -115675 389032 247135 -7486 161979
13041 6642 -120253 904 -223347 101095 -14541 150935 31815 28241 272095 369195 269340
13030 269340 291462 107145 190779 -57101 -148088 59907 150385 115014 390034 -139178 109777
13018B08882r1506J48874b78830R6325F0156a10225D05802a50204c2943H2292
13007A99303k1048L4171G4995J42684q2154J14652n4393r4869D5290P5670b19778
12995F9073J11388H0863B8190d3406A28199K4198n9740J10481a0943m1493n0406
12984a02842A66082f0258A49354h18o8803k53397B12538a97407A08526C0057O6747
12973I6804a4532h21A42767F3981J14915a43057D5576A783f421j13838D558a20991
12960D02633H1252J65619a53489A65808p2254A9342a703B25822p7802B5361d5547
12948C7954N9006B8125a24155B7496P5343a11570B596P7416J0405a52007C37996
12936C54423N7001j30133q9895D3643R91K9344j0354f2740E0951e5901J8038F113
$$ plain form
13018 208882 117376 266250 -278830 -182505 60156 -110225 405802 -150204 -32943 82292
13007 199303 178255 212426 74995 217679 135525 250177 195784 100915 45290 120960 -219778
12995 69073 180461 80863 28190 -43406 128199 152397 92657 203138 -10943 -52436 -102842
12984 -102842 166082 -60258 149354 -818 -69621 -323018 212538 -197407 108526 30057 96804
12973 96804 -14532 -821 142767 63981 178896 -143057 45576 1783 -6421 -120259 4558 -120991
12960 402633 81252 246871 -153489 165808 93554 19342 -1703 225822 148020 25361 -45547
12948 37954 96960 28125 -124155 27496 102839 -111570 2596 80012 90417 -152007 337996
12936 354423 411424 281291 191396 43643 44634 73978 63624 -62740 50951 -55901 -37863 6113
12923B1072a35538A4112h5127k03789c039j20692D7246R1346a45069B12004l9018
12912A72986d2003A628a97454A38784a69379A23315m9931i6711A53066N2638E1556
12900G7365J43260D5499J99308j21073b09832Q9421K2667B61576b46542a1992
12889I2646K41922o4087I9940i3343B60716j28730J11168d0001k3604q2018f9474
12877e268A08048b00474B15806I9263g6728p1098e6390B25438H1709K07151Q226
12866B97086I1302a08119A50740K96073f0720B26003c6014D64143a35116D05563
12855a26508n7270b1913A79235b36369e394A62336P9436A19017C2086L45810j9975
12844C57921l4707A44426h35l7802j10795e3007j17107f9764D7860a29966m6149
$$ plain form
12923 21072 -135538 14112 -85127 -288916 -3039 -123731 47246 138592 -145069 212004 172986
12912 172986 -42003 1628 -197454 138784 -169379 123315 73384 -96711 153066 205704 51556
12900 77365 220625 45499 244807 123734 -209832 -120411 -97744 261576 -246542 -11992
12889 92646 334568 270481 99940 -93343 260716 131986 243154 -40001 -63605 -145623 -69474
12877 -5268 108048 -200474 215806 99263 -76728 -147826 -56390 225438 81709 288860 297086
12866 297086 91302 -108119 150740 446813 -60720 226003 -36014 464143 -135116 405563
12855 -126508 -183778 -21913 179235 -236369 -5394 162336 241772 119017 32086 377896 357921
12844 357921 323214 144426 -835 -38637 -149432 -53007 -170114 -69764 47860 -129966 -176115
12833a76115B91132h5679B209b7462k87048Q103a14811C29804b50047E6913l604
12822E3309i868A10813a74468b3689j48608P0000A35287h8993m8638G7487g2696
12810b24062A48779J64919a97869I385h2883G569d0804j29715M6912A26730a27559
12798a41709B45044a73976C00386b1364j6372j90881H9616Q4895b50404F6982
12787A50704a59130D0715a84926O1626c8031i423C33872H404d7380A9596K28046
12776B47642a48807A47322f5631B2130K7032J722A4395M5369K90439A42761b11506
12764A08167J8023j8164a68475G5117Q9187E2690a75038F8014K65696B2756I185
12752B85613F1188K6170b00509O2446B75276b9864E761M5481a43722H9355a5848
$$ plain form
12833 -176115 291132 -85679 2209 -27462 -314510 -306407 -114811 329804 -250047 56913 53309
12822 53309 -9868 110813 -174468 -23689 -172297 -102297 135287 -88993 -137631 77487 -72696
12810 -224062 148779 313698 -197869 9385 -82883 7569 -40804 -170519 -123607 126730 -127559
12798 -141709 245044 -173976 300386 -21364 -37736 -228617 89616 174511 -250404 66982
12787 150704 -159130 40715 -184926 -123300 -38031 -9423 333872 8404 -47380 19596 247642
12776 247642 -148807 147322 -65631 22130 49162 50884 14395 59764 350203 142761 -211506
12764 108167 126190 108026 -168475 75117 164304 52690 -175038 68014 333710 22756 9185
12752 285613 61188 87358 -200509 -138063 275276 -29864 5761 51242 -143722 89355 -15848
12740c8717C89693B3242J70277a68206C6278a63279j39071c6134j79596j0329
12730b26059o7160b2987G2129J36653g4679A56783K6368A8586K69916g0491F1041
12718D2592J7945L8712B0464Q3500L19258b1409H1310J67605l5077E3875b73733
12706A02847R1942B7893J63615G5223a55742K4921B8766h285j50800A36158a19488
12694d072A97918C3688M66772p3289j07481B0893M81629H4212K37663E8957K96036
12683C54993j18577K66611A20944j2224a57690A65515b02990c1023B74186f8818
12672A98696r3766h457A71583a30274j42o0097j46602A39442O0504J23322A02797
12660A54798b53108B9058M4683a31758L9041B00645A1173c13980C61137A44220
$$ plain form
12740 -38717 389693 23242 193519 -168206 36278 -163279 -302350 -36134 -215730 -226059
12730 -226059 -293219 -22987 72129 208782 -74679 156783 183151 18586 288502 -70491 61041
12718 42592 60537 99249 20464 103964 423222 -21409 81310 248915 213838 53875 -273733
12706 102847 194789 27893 191508 75223 -155742 -130821 28766 -8285 -159085 136158 -119488
12694 -4072 197918 33688 500460 427171 319690 20893 502522 84212 321875 58957 354993
12683 354993 236416 503027 120944 108720 -157690 165515 -202990 -31023 274186 -68818
12672 198696 104930 -8457 171583 -130274 -130416 -190513 -337115 139442 199946 323268 102797
12660 154798 -253108 29058 73741 -131758 -92717 200645 11173 -313980 361137 144220
12649B29950C2422b42692B78966A33334K18030F53b12541B90433i4537A45626
12638d9863A03425L76261a43035D6814K53517d165A03243a20896A78530M3465
12628B21995f8926D1643a82748E293a14057l4382D17556D4325R4426J04687j11007
12617A32431J27334j27330J35307J16407J13617j0390A13779n3929J08042B1615
12606A2522P4027j1824L23766j25491F7332L19811a03949l7809c0433C7990J21224
12595A59214N617A7389J3265K33521A04457m6046J37560k6361k3296D9178K46972
12584B96150M39448B72191j04821J62706p9311i1617m09040E9963J96450j04344
12574A52069b26560B18157f733j00099A11445N846K74269G1014b89712J00120
$$ plain form
12649 229950 32422 -242692 278966 133334 351364 653 -212541 290433 -94537 145626
12638 -49863 103425 479686 -143035 46814 300331 -4165 103243 -120896 178530 221995
12628 221995 -68926 41643 -182748 5293 -114057 -148439 417556 44325 138751 243438 132431
12617 132431 259765 132435 267742 384149 497766 487376 113779 59850 167892 21615
12606 12522 86549 74725 398491 273000 67332 387143 -103949 -141758 -30433 37990 159214
12595 159214 164831 17389 30654 264175 104457 58411 195971 169610 146314 49178 296150
12584 296150 735598 272191 167370 330076 250765 -91617 -500657 59963 256413 152069
12574 152069 -226560 218157 -6733 -106832 111445 117291 391560 71014 -289712 -189592
12564a89592j3829A6804K93066a56333G6733J43118b7892A18177l3359J62578
12554B47396D229O3496P9935b64353C16515A35664K65591e8289A40302b30980
12543B56582A04470Q3122N2498a28298n2466Q8225E2821Q1124K0262a04562A27973
12531a13489j27700J3440B21222B8424P1331B3141J00200J31462Q3707A9812L73946
12520C93758d13688d7488j23292d3105B11105a75515C5478g3427F8804a95813
12509d4988A13013l9954J78398b19989a0372l8151j81334A94352H3446L5373P6034
12498A94853H7749l1549M0131b86316q6610J73142B0327O1991l3590b6426g177
12486B03873d3854A484J43283M9135M5619j17533b64179A31200N0395G1128a582
$$ plain form
12564 -189592 -203421 16804 309870 -156333 76733 219851 -27892 118177 84818 247396
12554 247396 4229 67725 147660 -264353 316515 135664 401255 -58289 140302 -230980
12543 256582 104470 187592 240090 -128298 -180764 -92539 52821 133945 154207 -104562 127973
12531 -113489 -241189 -227749 221222 28424 99755 23141 123341 254803 338510 19812 393758
12520 393758 -413688 -47488 -170780 -43105 211105 -175515 35478 -73427 68804 -195813
12509 -44988 113013 73059 251457 -219989 -10372 -48523 -229857 194352 83446 118819 194853
12498 194853 87749 56200 96331 -286316 -372926 -199784 20327 82318 48728 -26426 -7177
12486 203873 -43854 1484 144767 193902 239521 121988 -264179 131200 181595 71128 -1582
12474H8462f6642j38380b2714k6309k89407a25145g546m05298A94986c8524k6841
12463f5365B61886G7655b45483A19103n5778c26842c3410F6952a31328N3250F5371
12451F2257J05882b18221j10919c306j29523A05863D584R9832f0160A96992P7371
12440B74363a44252A86378e2947A2618b45816a1072j21231d3160J7453l29977
12430c55684a3620E0224M1664i294I9588e0985j77787d7400B96991M7286a35767
12418D627a37131B68273b2293a464k53504a19023E5448J72733g1437B41910A6215
12406a38794r825c7963k09862A01052L90239b01738B17029a89278O2409B90139
12395B16998C4596a64002A03512b68987B17506k1292A2887c6752C14612b8383
$$ plain form
12474 88462 -66642 -205022 -22714 -49023 -338430 -125145 -7546 -412844 194986 -38524 -65365
12463 -65365 261886 77655 -245483 119103 63325 -326842 -33410 66952 -131328 -78078 65371
12451 62257 168139 -218221 -329140 -3306 -132829 105863 4584 104416 -60160 196992 274363
12440 274363 -144252 186378 -52947 12618 -245816 -11072 -132303 -43160 -25707 -355684
12430 -355684 -13620 50224 91888 -9294 99588 -50985 -228772 -47400 296991 344277 -135767
12418 4627 -137131 268273 -22293 -1464 -254968 -119023 55448 228181 -71437 241910 16215
12406 -138794 -148619 -37963 -247825 101052 491291 -201738 217029 -189278 -126869 290139
12395 216998 34596 -164002 103512 -268987 217506 196214 12887 -36752 314612 -28383
12384D9063c10920a21728F5570a8901B05746B3086K27921C052g5124B87101o8181
12373B18920j07285l6627K42151c9927j33596B95992q4546H8364e8591q7757A74242
12361G15f7255A48423D6771N1972e1947k07506C2334d8259k83636N5358B07271
12349c02098A42979a00311C51305A29610a83201a5893k28794A22091C2231Q5347
12339A17578l4671a08841H5822J65478j0381h7777k9837c755j60139b2087B04666
12327a49698i880A93710h7725M1824j83230g1043H1410a11651B5683o125L96434
12316D15992a26661p9453P5935A13265a1921E14294F7724j2839k3456L33325H2030
12304A08302M58900e3258E0524L8106K76226G6487J62093J58536A06703g8940
$$ plain form
12384 49063 -310920 -121728 65570 -18901 205746 23086 251007 3052 -75124 287101 218920
12373 218920 111635 75008 317159 -39927 -173523 295992 211446 88364 -58591 -146348 174242
12361 715 -67255 148423 46771 98743 -51947 -259453 32334 -48259 -331895 -276537 207271
12349 -302098 142979 -100311 351305 129610 -183201 -15893 -244687 122091 32231 117578
12339 117578 82907 -108841 85822 251300 240919 -87777 -117614 -3755 -163894 -22087 204666
12327 -149698 -9880 193710 -87725 -45901 -229131 -71043 81410 -111651 25683 19558 415992
12316 415992 -126661 -206114 -130179 113265 -11921 514294 67724 54885 31429 364754 82030
12304 108302 567202 -53258 50524 88630 364856 76487 238580 397116 106703 -78940
12293E4555P8654Q8235M96k7175c70993A42468a08263J1691A46337K33775j69323
12282B10789C7076m15K916k11K61498P3211B6544a48011A1033J35455K9147G4214
12269g2022A51536P7104a25076B99142A41268l7761K22842J5257A1877K45304
12259B57181p2138e2203B93649j22066l8194K0134a409F09838A09199J90944A46188
12247B23027o7529a58302A49565B0228J18542J99399H1648d6799C52573I3960
12236B31135D1849K24032L44637B33271J52253F0057J17610J37829G1865K66642
12226C38507h4728F2955J59484H9067K36101j56138O1941p4807b6786I3214a24203
12214a34933F27645E4811a62538A8654J79656L6589J00043c7359B27898F0757
$$ plain form
12293 54555 133209 221444 221940 194765 -370993 142468 -108263 -96572 146337 380112 210789
12282 210789 37076 36661 39577 39366 300864 374075 26544 -148011 11033 146488 175635 74214
12269 -72022 151536 228640 -125076 299142 141268 103507 326349 341606 11877 257181
12259 257181 185043 -52203 293649 171583 133389 153523 -1409 609838 109199 300143 146188
12247 223027 155498 -158302 149565 20228 138770 338169 81648 -46799 352573 93960
12236 231135 41849 265881 610518 233271 385524 60057 177667 315496 71865 338507
12226 338507 -84728 62955 222439 89067 325168 169030 230971 156164 -26786 93214 -124203
12214 -134933 627645 54811 -162538 18654 198310 234899 334942 -37359 227898 60757
12203D88128A65741K85068E4902J80097m5637P1382j24198A5423a40095B0484
12192A58751B1214c17826A23356E8529c0816p7371B61976H2007A5018L55319j30289
12181B40048J50459j93652K17645A60164K51072d2697B2004K71771l2686j26282
12171A34807R7627l6539m4588b00359A91482h8101B02299L2510n1589P4996a46208
12159b6499G4111J55164O305I0579M66154I3564R2229L22172j55154k0558I7230
12147B66450H9259J18860K05611j09788j42592P2363I9314l4507M9446B4833a69655
12135B07958F5933L07574b42641m3104C2647P0151a40141e0856B02166p8867e4391
12123E2093K93821b04965A47921a45557o464A96575L8640b39911A2957L12186
$$ plain form
12203 488128 165741 450809 54902 234999 189362 260744 136546 15423 -140095 20484
12192 158751 21214 -317826 123356 58529 -30816 -108187 261976 82007 15018 370337 240048
12181 240048 390507 196855 414500 160164 411236 -42697 22004 293775 261089 134807
12171 134807 232434 195895 151307 -200359 191482 -88101 202299 234809 183220 258216 -146208
12159 -26499 74111 229275 235580 90579 556733 93564 185793 507965 352811 332253 97230
12147 266450 89259 208119 413730 303942 161350 233713 99314 64807 114253 24833 -169655
12135 207958 65933 373507 -242641 -285745 32647 102798 -140141 -50856 202166 123299 -54391
12123 52093 345914 -204965 147921 -145557 -152021 196575 235215 -239911 12957 325143
12113C25143c6914F8374Q5996M7124c81947a79684B2575R1738J56978E133L38317
12102C43450j58066j6097h7259B463J13643J34393G0136c898J301m5388B78229
12090C6749c74613C25731C2787J0038P0406D5540c97101a5231A10342J23790K91183
12079E25315j86121j486o1738A16051a20918B81920k3883c4143A92167N9404Q0427
12068C31998M8778I4657h6476A29204f7918m0359A938J58823i4685c340j73254
12057a76594A17265N9602p5153J02651i4723D42971C1775L63915G9723C5016K05077
12046B40093A11696c0859k38930c0986k82005E6949J03567K38423A12603L4664
12036A47267d4297A12990M2470e1027j44061f3608j83770A61337g640B21757a5609
$$ plain form
12113 325143 -36914 68374 154370 201494 -381947 -179684 22575 114313 271291 5133 343450
12102 343450 185384 169287 -87259 2463 116106 250499 70136 -3898 -2597 -47985 278229
12090 36749 -374613 325731 32787 42825 113231 45540 -397101 -15231 110342 234132 525315
12079 525315 339194 337708 275970 116051 -120918 281920 258037 -34143 192167 251571 331998
12068 331998 380776 94657 -86476 129204 -67918 -108277 1938 160761 -94685 -3340 -176594
12057 -176594 117265 176867 101714 204365 -94723 442971 31775 395690 79723 35016 240093
12046 240093 111696 -30859 -269789 -30986 -312991 56949 160516 398939 112603 147267
12036 147267 -44297 112990 155460 -51027 -195088 -63608 -247378 161337 -7640 221757 -15609
12024a77241A08933K8133e9686n0199b4521k68928B04544h8334c4618C9587L59317
12013C98904a36301k1517A9172L87043c2749C87469b16055C51649d8848C85508
12002A49213f1092A14058a09738d4314I0856K49455a72865b571k20611A9475b62270
11990G0642a3905p9395B35998E4050a83176D37529c1244j56030K2434A62503J7189
11979A79692j3786A0999P9428J32186b989D40662j40977H9879J5964L05458j91881
11968B19420Q1176c0829j19794b3853I9119m94L22541A5001N4674j3805J64419
11957B20289l5657a10927j16867C00832E9354a67394A23375h4552E5245a03281
11946b27781A19667k1322a22880J3793D60299d39822a34318O957B502a10376b2177
$$ plain form
12024 -177241 108933 137066 -59686 -109885 -24521 -293449 204544 -88334 -34618 39587 398904
12013 398904 -136301 -157818 19172 406215 -32749 387469 -216055 351649 -48848 385508
12002 149213 -61092 114058 -109738 -44314 90856 340311 -172865 -2571 -223182 19475 -262270
11990 70642 -13905 -93300 235998 54050 -183176 437529 -31244 -187274 -164840 162503 179692
11979 179692 165906 10999 90427 222613 -2989 440662 299685 89879 105843 411301 219420
11968 219420 300596 -30829 -150623 -23853 99119 98625 421166 15001 69675 55870 220289
11957 220289 184632 -110927 -227794 300832 59354 -167394 123375 -84552 55245 -103281
11946 -227781 119667 98345 -122880 -109087 460299 -439822 -134318 -127361 2502 -110376 -22177
11934e7418m7137A3122O0716K20526p2150c09990G0878N9228E0464O9985c78625
11922e0557C5523i7118E6343P6206j6216N0428a54007f1766A89670c34418B17045
11910b389A9684K27160A446J29321B0442K99631a4129j212j14027D05344B5074
11898A50131b22810N8205B21490j6841a13475C69931a2487A24246d04752a40887
11887b0324A65459N664A9827J03376c32229a57254P0949A01449a17209n6279j95847
11876c69335B5900c06216l8359a29091a070k63543j3141J33283E6665J24031c59064
11864a01120p4872P3219D4228R3428a11749A73381a38675l6135r871A60958a44367
11852a48147p9510j19418h1604j7323m6902b1814E717J89418H749K36536a1302
$$ plain form
11934 -57418 -104555 13122 73838 294364 222214 -309990 70878 130106 50464 120449 -378625
11922 -50557 35523 -97118 56343 132549 116333 166761 -154007 -61766 189670 -334418 217045
11910 -2389 19684 246844 1446 130767 20442 320073 -14129 -15341 -129368 405344 25074
11898 150131 -222810 -164605 221490 204649 -113475 369931 -12487 124246 -404752 -140887
11887 -20324 165459 171123 19827 123203 -332229 -157254 -86305 101449 -117209 -173488 -369335
11876 -369335 25900 -306216 -344575 -129091 -1070 -264613 -277754 -144471 56665 180696 -359064
11864 -101120 -175992 -102773 44228 137656 -111749 173381 -138675 -174810 -184681 160958 -144367
11852 -148147 -227657 -347075 -81604 -98927 -145829 -21814 5717 195135 8749 245285 -11302
11840a37464r3025h0108K2191E3637q804M4893O3250K3259b08039l05872b33239
11828c47582B05758c14740F0380Q6867c4765A85112f9793E2416b56264B13929
11817g8634B06945e3363H0943h322B91259i5757j76806A02301l9214N5021E2474
11805h6122B2472i675m25024B52575a90579h649k24896B3394a16184j1688F803
11793i123A28410m3492a21384l5400O3129p4713A93975G1250b2015F6265c6394
11781i0127k61449C0336J39104a11602A67215a8690E5632a73577l1025R8042C7403
11769G5623g3898k38357b2969A82898B5666J16127a89360N0400j27716J2754B7587
11757a4760j58731N9659n4340g4480k893k2860l01466h2293A78229a26724A7053
$$ plain form
11840 -137464 -230489 -80108 -57917 53637 44833 89726 152976 176235 -208039 -513911 -233239
11828 -347582 205758 -314740 60380 147247 -34765 185112 -69793 52416 -256264 213929
11817 -78634 206945 -53363 80943 -8322 291259 -95757 -272563 102301 63087 118108 52474
11805 -86122 22472 -9675 -434699 252575 -190579 -8649 -233545 23394 -116184 -127872 6803
11793 -9123 128410 84918 -121384 -156784 -93655 -168368 193975 71250 -22015 66265 -36394
11781 -90127 -351576 30336 169440 -111602 167215 -18690 55632 -173577 -204602 -106560 37403
11769 75623 -73898 -312255 -22969 182898 25666 141793 -189360 -138960 -266676 -253922 27587
11757 -14760 -173491 -113832 -168172 -74480 -77373 -100233 -401699 -82293 178229 -126724 17053
11745H8985J5860J6313a56728B24360b52464H5413J01615C4802J37436c0674A48228
11733c13948B79335k6402e142p9277A94074g2799j01250d5802B56751b33787c0483
11721b299m846j14803A22204R0910g9090A7772b4550A81154E4147K18790g2786
11709c63557C355l77J88892i1870M1102B19208a49391A00009a16681B53090K6980
11698B80070e6909j50879B47565R6876a45379I7369m7489j7232K49929b14678
11687B5414N1359a8761B00125p0687b9256B52222g428j121E5366M9896M3750a41968
11674A09255R775a07823m1381C5486g8451k94567a74072A4312L24126a73628I3592
11662I9266a94844C00060a38609A7508a0278F2658J80113I905b25576A25576c9162
$$ plain form
11745 88985 104845 121158 -156728 224360 -252464 85413 187028 34802 172238 -30674 148228
11733 -313948 279335 252933 -5142 -84419 194074 -72799 -174049 -45802 256751 -233787 -30483
11721 -2299 -7145 -121948 122204 213114 -79090 17772 -24550 181154 54147 272937 -72786
11709 -363557 3355 2978 191870 -91870 -50768 219208 -149391 100009 -116681 253090 280070
11698 280070 -56909 -207788 247565 344441 -145379 97369 49880 32648 282577 -214678
11687 25414 76773 -18761 200125 129438 -29256 252222 -7428 -8549 55366 105262 149012 -141968
11674 109255 119030 -107823 -149204 35486 -78451 -373018 -174072 14312 338438 -173628 93592
11662 99266 -194844 300060 -138609 17508 -10278 62658 242771 9905 -225576 125576 -39162
11650G4368J7907J28655N0106a97736A38432J62874a66917A28370a43453A93484
11639D9532A578a19518o8278B2147M75488G9305J82885i2711H2805J00260p4934
11628A08131J66618A03818l0516c8285J4084p0726k13187D9180d9775k57353B73771
11616a79423k62749J06520d5910k31665J28660A31532e4290q212a4272A61023
11605g9814B39661b745E3985K00476B2982N6183b6896F2772A3046d4660j65620
11594b10280Q7623j8709B09931G4285l6442a34970c4123n4375j24761A64919P0174
11583B35093E9096R4788b2316k32366A60025B1084M65733e3447A98365h1426A15171
11571C8770d2816C3908e2035q1725j2150B35013d3413A10748R5275n1305J31616
$$ plain form
11650 74368 92275 220930 271036 -197736 138432 301306 -166917 128370 -143453 193484
11639 49532 1578 -119518 -187796 22147 497635 79305 262190 -92711 82805 183065 108131
11628 108131 274749 103818 73302 -38285 -24201 -94927 -308114 49180 -49775 -307128 273771
11616 -179423 -442172 -335652 -45910 -277575 -148915 131532 -54290 -62502 -14272 161023
11605 -79814 239661 -2745 53985 254461 22982 79165 -26896 62772 13046 -44660 -210280
11594 -210280 -122657 -141366 209931 74285 37843 -134970 -34123 -88498 -213259 164919 235093
11583 235093 59096 153884 -22316 -254682 160025 21084 486817 -53447 198365 -81426 115171
11571 38770 -42816 33908 -52035 -133760 -145910 235013 -43413 110748 206023 154718 286334
11560B86334e7857K0073I7668M1256f294k28965A96687N0609J3719C7279L1165
11549F8444g5692A98413J73369I4350l9054N3801J85803Q7881A4423Q4789c65066
11537A66943g6978H5327a85366B1633b03810I6716M09a08290B69K39381K8878
11526B68528n6508E8505h4133B22598R5876l1172J07886a79735d6558r889j19904
11515a76351C02666h9664A3635R6238J37386a03093b0334j93710F0667i6100C44275
11503g8654A40319O1620G2205l400j1921i6353L7933j48174A53168K0999f3046
11491E0052K33453d998B35394Q3599n6693j26536J35320b79752B88690H9491J70817
11480B60308C0900G030J025b145A69546J51175j19009F7681L70311G08a75820
$$ plain form
11560 286334 -57857 -37784 97668 138924 -6294 -235259 196687 247296 261015 37279 68444
11549 68444 -75692 198413 371782 94350 55296 109097 294900 382781 14423 99212 -365066
11537 166943 -76978 85327 -185366 21633 -203810 96716 97125 -108290 269 239650 268528
11526 268528 212020 58505 -84133 222598 318474 287302 395188 -179735 -46558 -56447 -176351
11515 -176351 302666 -89664 13635 109873 247259 -103093 -20334 -214044 60667 -96100 344275
11503 -78654 140319 201939 72205 68805 56884 -96353 -58420 -206594 153168 174167 -63046
11491 50052 283505 -4998 235394 318993 262300 135764 271084 -279752 288690 89491 260308
11480 260308 30900 7030 8055 -2145 169546 320721 201712 67681 437992 708 -175820
11468a0034j04229J4765A95211a15636G7103L78297e6394G7446a92340I1319R4913
11457A86232O6337P0048j10627J09271H576K30284A05912K19386l7262p6536R1592
11446C03092n4958j6279Q2481a81068d7012A46941c7459J6302A29409J99497A10744
11434B08346c4943C08660d9416F7899Q3740i4297C53898a60923A89817F1455j2203
11423D9252L80875A32001Q2190M1538C2512i9792B95850m2375a33124A43283A5938
11411H6974J46564G3525e7432B3852a63461b7725l5405J8154A35955P8574a48240
11399a62782A190J15556P7778F3011j5536K34971a2384j03074N0247I2121b55801
11387a13641m188E16927B46688n5424e0214B90668b73123i2954e068A830M1497
$$ plain form
11468 -10034 -114263 -99498 195211 -115636 77103 455400 -56394 77446 -192340 91319 186232
11457 186232 252569 322617 211990 321261 8576 238860 105912 325298 288036 211500 303092
11446 303092 248134 231855 314336 -181068 -47012 146941 -37459 -21157 129409 328906 110744
11434 208346 -34943 308660 -49416 67899 151639 -94297 353898 -160923 189817 61455 49252
11423 49252 430127 132001 214191 255729 32512 -99792 295850 253475 -133124 143283 15938
11411 86974 233538 73525 -57432 23852 -163461 -27725 -63130 -44976 135955 214529 -148240
11399 -162782 1190 116746 194524 63011 47475 282446 -12384 -115458 -65211 92121 -255801
11387 -113641 -117829 516927 246688 191264 -50214 290668 -273123 -92954 -5068 1830 43327
11376D3327K05440a7880A31563L10751G7874d3896r991j02353f6372A68176N2222
11365B20398N7502i7376E4210L23635q6325A2868K48771H4986a53252c7065B24002
11353A3048g8781b2152D81208I6376M6872b3611j97531i8999A99017A6685f0272
11341d27937a8441L557j81020l3677A43494a4738m5430P47C0338a19844M457j93240
11329c08627A30648E8749e401j14193H8211b46458P0630A36305b5095E680c8553
11317D29574C4751d9278B94874a4546k48970M5436m7995R4969C96858j23191R7557
11306C71224I4947a71649j98962a05822k16728b466B7987b0293j51714F7326c34137
11294h0756j13832A46313e74056a48472p4911E4881e3109A0460d34360B02049
$$ plain form
11376 43327 248767 -17880 131563 442314 77874 -43896 -53887 -156240 -66372 168176 220398
11365 220398 277900 -97376 54210 377845 291520 12868 261639 84986 -153252 -37065 224002
11353 13048 -78781 -22152 481208 96376 143248 -23611 -221142 -98999 199017 16685 -60272
11341 -427937 -18441 -14884 -195904 -229581 143494 -14738 -60168 -59421 30338 -119844 -115387 -308627
11329 -308627 130648 58749 -5401 -119594 88211 -246458 -175828 136305 -25095 5680 -38553
11317 429574 34751 -49278 294874 -14546 -263516 -218080 -266075 -171106 396858 273667 371224
11306 371224 94947 -171649 -370611 -105822 -322550 -2466 27987 -20293 -172007 67326 -334137
11294 -80756 -194588 146313 -574056 -148472 -223383 54881 -53109 10460 -434360 202049
11283b7010k78125B61569i7918H0326L09712a08300A0435J10638b56121A53474
11272h956H40d4861d222G3298b24084l7631a24767j83263b4789j71874B87757
11260a10926n0481l9960A71170a68576j09319D7208a26436A58627F4215J87942
11250B52157C2861a74097F5689a75862A2989d94009A2790c6779A37674f5201k13154
11239b78355A9122f5668l79785a39912F1633N7986c2268j37213A34852L9289a80785
11227A5789g271j09092m44274A75543a5225l72709j23946i9042B29202I3811K48692
11216C42503a25131L527B83523F8624a01946B4460J70263f837j00349K6733h250
11204a88280o3270Q7658j92137a56613p9750m2386k4091h8724c5423n1027j584
$$ plain form
11283 -27010 -305135 261569 -97918 80326 390038 -108300 10435 121073 -256121 153474
11272 -8956 840 -44861 -4222 73298 -224084 -261715 -124767 -308030 -24789 -196663 287757
11260 -110926 -161407 -201367 171170 -168576 -277895 47208 -126436 158627 64215 252157
11250 252157 32861 -174097 65689 -175862 12989 -494009 12790 -36779 137674 -65201 -278355
11239 -278355 19122 -65668 -445453 -139912 61633 119619 -32268 -169481 134852 174141 -180785
11227 15789 -7271 -116363 -560637 175543 -15225 -387934 -511880 -99042 229202 93811 342503
11216 342503 -125131 -121604 283523 68624 -101946 24460 194723 -6837 -107186 -80453 -8250
11204 -188280 -251550 -163892 -356029 -156613 -236363 -278749 -302840 -88724 -35423 -86450 -88034
11193h8034I7631a19279C9605g9228o1204J5756F9595J9452A1977a6193j4721
11182c0914B58094A5396J40876c00242A08842c11922J45839D9888R9749a37775
11171C434P3607a72578A5766M524b57472g5267G9329a11447A05024J54834l9851
11160B20007e26953B08949c4274A24750P1698D49a08541K2382j37690A20571d2284
11148G0596L9953c48046B028a53656e6845B54791c2065n0460F7740a85364q5205
11137b70569R3872Q3459j79716h7250D8927R0089J0893d00917a77765j81902h6322
11125B87203A34667L34184b9854F9751j543b02904B6299a33181f1919j96645A41226
11113a2281E545J04781a69984j56618D3261Q7130J14270n3734r4744J9881b42411
$$ plain form
11193 -88034 97631 -119279 39605 -79228 -140432 -124676 69595 89047 11977 -16193 -30914
11182 -30914 258094 15396 156272 -300242 108842 -311922 -166083 49888 149637 -137775
11171 3434 77041 -172578 15766 20290 -257472 -75267 79329 -111447 105024 259858 220007
11160 220007 -526953 208949 -34274 124750 196448 449 -108541 -86159 -223849 120571 -42284
11148 70596 110549 -348046 2028 -153656 -56845 254791 -32065 -82525 67740 -185364 -270569
11137 -270569 -176697 -93238 -272954 -87250 48927 139016 149909 -400917 -177765 -359667 -86322
11125 287203 134667 468851 -29854 69751 68208 -202904 26299 -133181 -61919 -258564 141226
11113 -12281 5545 110326 -169984 -326602 43261 130391 244661 190927 96183 116064 -242411
11101G6420a84489L0680j32824C16367e3019I4929K9720l4252G055a6072A3587
11089H8135c4534l2013C34519A47682J24609r1763l1732M6528D0723g5471A88000
11077A0556J71280P4716A3360a19387C09873J4509A19580a06487A81951D9220
11066C71947j48158Q2109d77117B02741q6132a02757a8688B15254L5356q191r1960
11055A50459J00915b84560B10222J78893i9320F55463j95493A84353R6279k3006
11045B57626L7333J78543J7710j3128J99359j40917l4902K79674k73398K06593
11035G14493k30122L74109j94640j82538K43127j83060L19145p8418C68374O8752
11025D37126L38447N328j14666K43089j45502j28074K23053j05927n2819K18517
$$ plain form
11101 76420 -184489 -153809 -286633 316367 -53019 94929 124649 90397 7055 -16072 13587
11089 88135 -34534 -66547 334519 147682 272291 180528 148796 195324 40723 -75471 188000
11077 10556 181836 256552 13360 -119387 309873 324382 119580 -106487 181951 49220
11066 371947 223789 305898 -477117 202741 116609 -102757 -18688 215254 250610 242419 150459
11055 150459 251374 -284560 210222 389115 -99320 655463 459970 184353 280632 257626
11045 257626 294959 473502 491212 478084 677443 536526 501624 781298 507900 714493
11035 714493 484371 858480 663840 481302 724429 541369 860514 782096 368374 437126
11025 437126 775573 780901 666235 909324 763822 635748 858801 752874 700055 918572
11015I18572j62576J86858k80802J03502L210r8650k4702J55755j71694j29814
11005D99659K99742M5715M4932k40093l16741R1004J72585j75409M79606m38863
10995D62137K51871Q0060j46520J85771k74059L86974k89510m5451L33637l10459
10985F34451j08108L60201o6979k09505K1375J22168k99379J25999J40669j13045
10975F07847N47375n72055m5755R3149M08779j34427j41618L50550j24525J90526
10965A179846r08j38308q35J52292J14232k6973j57687L04136N5923L72718N32180
10954B386616j14053K49080m14247J02523J92009j07574j90331k90900Q746J70913
10944A992782j36578K336r087r9612j08892M91954l27651l9600n00392K81578
$$ plain form
11015 918572 755996 942854 662052 765554 768764 670114 645412 801167 629473 499659
11005 499659 799401 845116 890048 649955 333214 424218 596803 421394 901000 462137
10995 462137 714008 794068 647548 833319 559260 946234 656724 611273 944910 634451
10985 634451 526343 886544 819565 610060 631435 753603 454224 580223 720892 607847
10975 607847 1155222 583167 537412 630561 1039340 904913 763295 1113845 989320 1179846
10965 1179846 1178938 1040630 1039795 1192087 1306319 1279346 1121659 1425795 1481718 1854436 2386616
10954 2386616 2272563 2521643 2107396 2209919 2401928 2294354 2104023 1813123 1821869 1992782
10944 1992782 1856204 1858540 1849453 1749841 1640949 2132903 1805252 1765652 1265260 1546838
10934A546838K26738n37213K05833l08962r8183k6036D55080J56473B87807L88870
10924F76677C07388g868k04035A82506J87887A71400k3857l4779b49886G1327
10913B94596o4268B0829a4A23100e9224C90587A31838E7595J19647N4339d2395
10901A91359k7438A6168a76157K5553a0261B97491B3725b6452j36408j19783D5943
10889b55806d0692B20883g2065g951B53676b55739f4814f7A0742J82756G0285
10877c57138E2535B4911b04244A8800b41129a7494G3517A1082b51705H1623C3220
10865a56057B27022a32538a517j96420G5984a11863j40138h8359B27421B8021
10854d51082A84703b06226d259j39306A98462C4770a84524A70319a14391A76835
$$ plain form
10934 1546838 1773576 1236363 1442196 1133234 1035051 1009015 455080 611553 287807 676677
10924 676677 307388 -7868 -211903 182506 370393 171400 147543 112764 -249886 71327
10913 294596 230328 20829 -14 123100 -59224 390587 131838 57595 177242 231581 -42395
10901 191359 163921 16168 -176157 -150604 -10261 297491 23725 -26452 -162860 -282643 45943
10889 -255806 -40692 220883 -72065 -7951 253676 -255739 -64814 -67 10742 193498 70285
10877 -357138 52535 24911 -204244 18800 -241129 -17494 73517 11082 -251705 81623 33220
10865 -156057 227022 -132538 -1517 -197937 75984 -111863 -252001 -88359 227421 28021
10854 -451082 184703 -206226 -4259 -143565 198462 34770 -184524 170319 -114391 176835
10843a55517G1392a79249A3286l063c6628j64034H2046O5818i8422j9849D9396
10831B10837a92139h732C06944j377A35129n3952k3112a25092Q749J7203d8139
10819A40072a16173F9946k9597c2150D9621A1352M5776a09901J3127p093D738
10807d0513A9634Q8113a44126A6756Q6786a61819F0849c94144B10188l2238D6848
10795d2380O678j02953F4859g3282b0358k59896A04545c50624k2722C9750a89612
10783C4453J8846a38423E0145a07361I9347b05324k19217a27115m0225o234k4896
10772a98470D784K06392b20654P0915j21715f1008E0511i485A7250p316d6512
10760B61125m6033d18665G8434a60272E4427K7074r828K83880c42066f328B14620
$$ plain form
10843 -155517 71392 -179249 13286 10223 -36628 -200662 82046 147864 -98422 -118271 49396
10831 210837 -192139 -8732 306944 305567 135129 81177 58065 -125092 -116343 -99140 -48139
10819 140072 -116173 69946 40349 -32150 49621 11352 57128 -109901 -96774 -103867 4738
10807 -40513 19634 107747 -144126 16756 103542 -161819 60849 -394144 210188 177950 46848
10795 -42380 -35702 -138655 64859 -73282 -20358 -280254 104545 -350624 -373346 39750 -189612
10783 34453 53299 -138423 50145 -107361 99347 -205324 -424541 -127115 -167340 -173574 -198470
10772 -198470 4784 211176 -220654 -149739 -271454 -61008 50511 -9485 17250 9934 -46512
10760 261125 215092 -418665 78434 -160272 54427 81501 71673 355553 -342066 -6328 214620
10748b15777D3931b9261H8025g5425j28286J0150P2510c6353j10877g373B23824
10736A5596a11184j86369A64292G4677g4001j84817c9854j06224D9917K6187Q1225
10725A57329a97273m2697B03449d3112O158A46119a81688e1202j33077l06908
10715d91187a55189k64433A09224f707E918M4565A7168J00341b49057A07233G425
10703a92580P3235a155I8231J04447a10311k88873A10175n3888O4698D9232e6240
10691a16728q6338O1469d6400E1608P3991g554k37505K6364J1085C3433Q5223
10680A18656J26114P4050A26553a29323c9329l65479C5529g1987a6880D826P8161
10669H2987a33900F3677a1755B21058f0965j01921k9498Q5842B94573r1258f4770
$$ plain form
10748 -215777 43931 -29261 88025 -75425 -203711 -193561 -121051 -36353 -147230 -7373 223824
10736 15596 -111184 -297553 164292 74677 -74001 -258818 -39854 -146078 49917 76104 157329
10725 157329 -197273 -239970 203449 -43112 -36954 146119 -181688 -51202 -184279 -491187
10715 -491187 -155189 -419622 109224 -6707 5918 50483 17168 117509 -249057 107233 7425
10703 -192580 -119345 -1155 98231 202678 -110311 -399184 110175 56287 120985 49232 -56240
10691 -116728 -203066 -141597 -46400 51608 125599 -7554 -245059 -218695 -207610 33433 118656
10680 118656 244770 318820 126553 -129323 -39329 -404808 35529 -71987 -16880 4826 82987
10669 82987 -133900 63677 -11755 221058 -60965 -162886 -192384 -106542 294573 203315 -64770
10657A49288i1373q4069B1880b99440a15683j42673a6652j84260i5954j24118
10647b20072Q4083i65D5250J52007a36398A43332a47614K9849C35181A19822a88134
10635h0752D2762b22484o8164G9409a99366j2475h9497n1861A16822g6983k34846
10624c11829C67302a74927m6543A71880f15717A63627n8567J99494a50105A4691
10613D3508E628a01330A33855a31117H6217a3584A55552p856h666B30499h2323
10601B13842q9066c90177a21160G2739Q4220O074b1478G272f2620k02145a21620
10589a72911Q3462l9613A4775a39869j7047n1547i7278j17818L5101j38314k5661
10578c43970c7332D5814n199i2404G1142k9325J0244b76393A12621e2833k7276
$$ plain form
10657 149288 -91373 -175442 21880 -299440 -115683 -258356 -16652 -200912 -95954 -220072
10647 -220072 -135989 -965 45250 197257 -136398 143332 -147614 -117765 335181 119822 -188134
10635 -80752 42762 -222484 -290648 79409 -199366 -211841 -89497 -141358 116822 -76983 -311829
10624 -311829 367302 -174927 -221470 171880 -615717 163627 105060 304554 -150105 14691
10613 43508 5628 -101330 133855 -131117 86217 -13584 155552 147696 -8666 230499 -82323
10601 213842 124776 -390177 -121160 72739 156959 163033 -21478 7272 -62620 -264765 -121620
10589 -172911 -89449 -129062 14775 -139869 -156916 -208463 -97278 -215096 -179995 -318309 -343970
10578 -343970 -37332 45814 40615 -92404 71142 41817 52061 -276393 112621 -52833 -80109
10567h0109A88150b27250i151j68088f4923A9307a56652Q226C4129R2785m8550
10556G8364K07522o1523i7419b9320A77856H1259b5497A14636e6698C23433C3139
10544a40978k48788d7771C08324b38033d0899j19504j01263C75118I3809b27915
10533d8643k14954D5293a16872d0900r7422C9258J63525E6411J94508B8176K30710
10522B58886b71427C73581B1403R0771k6350i0748B27353K36771b58422N3660
10512b04762A44536b97122a18815C87530b5618j24356k7813K9387H5637b41882
10501b8822n1392e537B3258a84331j01265n6122E0093d07823J01849c5633j23593
10490a59226A00146C5852a80023n4233D3661e7163E0177b398k85732b5405k72083
$$ plain form
10567 -80109 188150 -227250 -9151 -177239 -64923 19307 -156652 -148426 34129 126914 78364
10556 78364 285886 224363 -97419 -29320 177856 81259 -25497 114636 -56698 323433 33139
10544 -140978 -389766 -47771 308324 -238033 -40899 -160403 -261666 375118 93809 -227915
10533 -48643 -263597 45293 -116872 -40900 -138322 39258 202783 56411 250919 28176 258886
10522 258886 -271427 373581 21403 112174 85824 -90748 227353 464124 -258422 -204762
10512 -204762 144536 -297122 -118815 387530 -25618 -149974 -177787 -148400 85637 -241882
10501 -28822 -80214 -5537 23258 -184331 -285596 -341718 50093 -407823 -305974 -35633 -159226
10490 -159226 100146 35852 -180023 -234256 43661 -57163 50177 -2398 -288130 -25405 -297488
10479b97488g3296j53326H831M3372j3754a08235A26102R3795E6334j528J31862
10468A86668N4064j11507P5219n9723O10Q2243J35149m4077q7078K33255K34298
10457F99121B09763A8120L64931f6371J3304B53791a66229A17450a57005O8354
10447h8651C6845h5440L8145A80970f3545I097b84134A21315J8123a74129D068
10435b11283b2873k01928F1691P9640J0926c4067r2292A46043J43884c21249j3980
10424c35229c5891E4290B6320f5298j66439a4668m5787A70134c7257l8445a6754
10412a50139G5078a49872N3383j36541a00358j45297P5724K7201j11329G5201
10401D2851a21375j22104D3690j2006d9447k89584g6283I8846c58345J54982c5555
$$ plain form
10479 -297488 -73296 -226622 8831 52203 38449 -108235 126102 219897 56334 54806 186668
10468 186668 240732 129225 204444 144721 145331 227574 362723 318646 231568 464823 699121
10457 699121 209763 18120 383051 -66371 -53067 253791 -166229 117450 -157005 -88651
10447 -88651 36845 -85440 -47295 180970 -63545 9097 -284134 121315 139438 -174129 4068
10435 -211283 -22873 -224801 61691 141331 152257 -34067 -126359 146043 289927 -321249 -335229
10424 -335229 -35891 54290 26320 -65298 -231737 -14668 -60455 170134 -37257 -75702 -16754
10412 -150139 75078 -149872 -96489 -233030 -100358 -245655 -169931 -142730 -254059 75201
10401 42851 -121375 -243479 43690 31684 -49447 -339031 -76283 98846 -358345 -203363 -35555
10389E766L72367j78017p4469f0555B2503b66486A04305J3304H615J41433o924
10378A43124g3017H2895b82328c0312C81951E2656a65228C30288A43787A3960
10367b98684J39968e5954D10256a15542B71210J69396j49222J92565j79869e5219
10356C89861m9260r1586A24496N36021l00430L252n4245q6408M3190j745o9195
10345A94936M284K54524A99981m4963J43003H029d191C0091K93258A31732M16666
10334E48398l6242k9206A80161K06838L6685K40625a00085E50633M7154B20752
10323E20008j56704J32489B05270J41708h9691o011C23696r4811b68601B43818
10312b13476A05900j6868b8686B63144d5115A27193r626J03424J22205h2275o2876
$$ plain form
10389 5766 378133 200116 125647 -60555 22503 -266486 104305 117609 8615 150048 143124
10378 143124 -73017 82895 -282328 -30312 381951 52656 -165228 330288 143787 13960
10367 -298684 -158716 -55954 410256 -115542 271210 440606 291384 483949 304080 -55219
10356 389861 340601 249015 124496 660517 360087 363339 309094 222686 265876 264131 194936
10345 194936 199220 453744 199981 155018 298021 8029 -4191 30091 323349 131732 548398
10334 548398 512156 482950 180161 386999 423684 664309 -100085 550633 597787 220752
10323 520008 363304 495793 205270 346978 -89691 -95702 323696 228885 -268601 243818
10312 -213476 105900 89032 -28686 263144 -45115 127193 117567 220991 343196 -82275 -145151
10301a45151m2784H1964J48777a52963D47351D4848A8230b02065B06670H298K57018
10290B65316c28662a2383A12754a41724j10421a18510B92513j10392b23251C9855
10279a72695A38047D5100b18217G8806c29069N3128B25369b11502A71593D0815
10268b24916A02420Q7126l1085i0119A39089L8375c5942q7597C98559A7281a7609
10256a36489C76013a13518j02947C3025d3247p1521b8925I7364J7736a18715A86601
10244h6508I8117l8586H284a03043j85776B01728b58484B35977m3138J50851J86647
10233E30337b9753j04051A17169c6932r0629B87737a03093j08298D25444C6043
10222A9026J2667a00395A72324g2435K3359G5834b0157L574q3794B95401A3089
$$ plain form
10301 -145151 -187935 81964 230741 -152963 447351 44848 18230 -202065 206670 8298 265316
10290 265316 -328662 -12383 112754 -141724 -252145 -118510 292513 182121 -223251 39855
10279 -172695 138047 45100 -218217 78806 -329069 -275941 225369 -211502 171593 40815
10268 -224916 102420 189546 158461 -90119 139089 177464 -35942 -123539 398559 17281 -17609
10256 -136489 376013 -113518 -216465 33025 -43247 -114768 -28925 97364 115100 -118715 186601
10244 -86508 98117 59531 8284 -103043 -288819 201728 -258484 235977 192839 343690 530337
10233 530337 -29753 -133804 117169 -36932 -127561 287737 -103093 -211391 425444 36043
10222 19026 31693 -100395 172324 -72435 -49076 75834 -20157 -16583 -100377 295401 13089
10210C35981a65905d1913j87157J11560q7487D0359a77874M5646A70895L0668
10200B01563b4444m0810c737j19263j28971L2399R5754L9961k27545C4870a55448
10188a89751d2742j9518C8653a9604l40546F1639a57706g6008m5454B8570d3148
10176A18406a19840C5058J46928H62b96591C23950D9078a47778j96872q5075h4440
10164d01317g7860k70220B50464a45183N8629I6602f8657j14098C66343l8810
10154C27533B2619J39250a6933j71481c6072j16875d1384C0576a2799F6399N9173
10143A25572a73788B83177c8241F1327g9861Q665j50653O6771m0389G0070K31870
10132C01940A4714b7773H3772a51256E3707O2373B2146b54668f7462A59353c34236
$$ plain form
10210 335981 -165905 -41913 -229070 -117510 -204997 40359 -177874 -132228 170895 201563
10200 201563 -24444 -65254 -3737 -123000 -251971 -219572 -123818 -83857 -311402 34870 -155448
10188 -189751 -42742 -62260 38653 -19604 -360150 61639 -157706 -76008 -121462 28570 -43148
10176 118406 -119840 35058 181986 862 -296591 323950 49078 -147778 -344650 -429725 -84440
10164 -401317 -77860 -348080 250464 -145183 -86554 96602 -68657 -182755 366343 327533
10154 327533 22619 161869 -16933 -188414 -36072 -152947 -41384 30576 -12799 66399 125572
10143 125572 -173788 283177 -38241 61327 -79861 -71196 -221849 -155078 -195467 70070 301940
10132 301940 14714 -27773 83772 -151256 53707 116080 22146 -254668 -67462 159353 -334236
10120E1930b18818n8235N0273A35571F0289N2723b31329G2410a58001j9109k4632
10109b01742L9610k56123a67496E4650a13867M4690a9830j82482B18000b7328
10098i6059j55897H5373k3196r477M9287a1073I8585c62167J48073Q2405j5943
10087a47632L452P407A84031a99165p6378h0550L6643B91119A11826d0470N032
10076c5438j78684A35181k9276b35908D6455a23196A3223a27229p2133B07387
10065A56164h9445F4716a07717A11722L9337F3884K9171m2160L1018g2411j65256
10054b37667j69233A14481k4540d05146a94302N4908e7535j69371R1610m865j54239
10043b94400J35243j43526C32178h2398K5985n1769F3010c1376q5985j97322a16987
$$ plain form
10120 51930 -218818 -277053 -226780 135571 60289 113012 -231329 72410 -158001 -177110 -201742
10109 -201742 -162132 -418255 -167496 54650 -113867 -69177 -19830 -202312 218000 -27328
10098 -96059 -251956 85373 62177 52700 101987 -11073 98585 -362167 -214094 -131689 -147632
10087 -147632 -144180 -136773 184031 -199165 -275543 -80550 -43907 291119 111826 -40470 -35438
10076 -35438 -214122 135181 105905 -235908 46455 -123196 13223 -127229 -199362 207387
10065 156164 -89445 64716 -107717 111722 151059 63884 93055 50895 81913 -72411 -237667
10054 -237667 -406900 114481 89941 -405146 -194302 -139394 -57535 -226906 -135296 -140161 -294400
10043 -294400 -159157 -302683 332178 -82398 -56413 -108182 63010 -31376 -117361 -314683 -116987
10031B29764a02660C99981b70969h7408m896i333B582a55603A12877j5577G186
10019A574a03966A30576d29437J77438a18406G0056a77490k1256A5141J96973
10009B12114a9393E4537a2932C2435d9152B9526a24993I298M2247d04866B87661
9997A33576a04025A15658P0270a55292j00678a12531A930q62b20410L3776C96432
9985a45444j3381G5842J8151h6525C07417F9511l2359e8852j42716j11781J43429
9974a69920m2934A38043N4309N1056A9268e36166A6582J57239b24576j4517K902
9963b36191R9246f8339j45023B5977e9431K7356l03918P3826Q0633I9539h3010
9951h4898j51881R4032p7901e7342p4597b8363n8345A21166d8830I7724g4259
$$ plain form
10031 229764 -102660 399981 -270969 -87408 -92304 -9333 2582 -155603 112877 97300 7186
10019 1574 -103966 130576 -429437 -251999 -118406 70056 -177490 -198746 15141 212114
10009 212114 -19393 54537 -12932 32435 -49152 29526 -124993 9298 51545 -404866 287661
9997 133576 -104025 115658 185928 -155292 -255970 -112531 1930 1068 -220410 -186634 396432
9985 -145444 -158825 75842 93993 -86525 307417 69511 37152 -58852 -201568 -313349 -169920
9974 -169920 -212854 138043 192352 243408 19268 -536166 16582 173821 -224576 -239093 -236191
9963 -236191 -136945 -68339 -213362 25977 -59431 -32075 -335993 -262167 -181534 99539 -83010
9951 -84898 -236779 -142747 -220648 -57342 -131939 -28363 -86708 121166 -48830 97724 -74259
9939h9098l3475j37714B6896f5993o0462r798B1926L2340a39422J3855d2620J7897
9927b4723A07759R1096L5911i839k15698O7959f2010e996j92132q6618I1594K3049
9915A14643a89726A62132e24029a22287k78228a46181f1658q2011D3424a68287
9904A3246P2997K4829J53465c16479r2860A34597E6128A2396O129a35284d6603
9892d2313B1990a50604q1771j60974G1684c7179B67003j17515a72193A25276b41497
9880d310j22312E403R4605b84908D2637K60554H9527i2897n8078G3182i1543A1123
9867F2657c42633E2191b24307g5880J0063j20423j15171A02029c0104C32061B2774
9855a55191q0220J8414B13005C2723a64719k09501j2717c017j89806j70382e7529
$$ plain form
9939 -89098 -122573 -260287 26896 -65993 -126455 -136253 21926 54266 -139422 -125567 -42620 -24723
9927 -24723 107759 198855 234766 -9839 -225537 -157578 -62010 -5996 -198128 -284746 91594 114643
9915 114643 -189726 162132 -524029 -122287 -400515 -146181 -61658 -143669 43424 -168287
9904 13246 86243 111072 264537 -316479 -409339 134597 56128 12396 18525 -135284 -46603
9892 -42313 21990 -150604 -232375 -393349 71684 -37179 267003 149488 -172193 125276 -241497
9880 -4310 -126622 5403 100008 -284908 42637 303191 89527 -92897 -150975 73182 -91543 11123
9867 62657 -342633 52191 -224307 -75880 -65817 -186240 -301411 102029 -30104 332061 22774
9855 -155191 -235411 -216997 213005 32723 -164719 -374220 -386937 -3017 -192823 -363205 -57529
9843A79789c35355a13961n3241o2223R2591f226k75804E7996b04199a8587l69449
9832c88036A1785b15334F5121f0949k64500g1269A14415d9548m7577B2209a87598
9820a91127n1984f8956J5276j32A715e6238r3943g1435B1011a95486o9426J28406
9808a36506A24104C0615a85205m9841L8117c1477B22437h3873A24909a87820A88146
9796C5391Q886A5601K38114q3450e1441A1487a48907j81692a16360I011K1457
9785C0468J45074b20983G8943l7238J14843k1413M6797b89979B67239B2022b63661
9773E9569a89988C0910M1374f6078j53656O1400B16424a74403n4223A06231d6702
9761i2985j36673i2010l46728i5701n3621a159j77419r0703r406B11815b39793
$$ plain form
9843 179789 -335355 -113961 -167202 -229425 -136834 -6226 -282030 57996 -204199 -18587 -388036
9832 -388036 11785 -215334 65121 -60949 -325449 -71269 114415 -49548 -97125 22209 -187598
9820 -191127 -243111 -68956 -53680 -53812 1715 -56238 -150181 -71435 21011 -195486 -264912 -136506
9808 -136506 124104 30615 -185205 -235046 -196929 -31477 222437 -83873 124909 -187820 188146
9796 35391 44277 15601 253715 170265 -51441 11487 -148907 -330599 -116360 9011 30468
9785 30468 175542 -220983 78943 41705 156548 135135 181932 -289979 267239 22022 -263661
9773 59569 -189988 30910 72284 -66078 -219734 -158334 216424 -174403 -228626 106231 -46702
9761 -92985 -229658 -92010 -438738 -95701 -149322 -1159 -178578 -269281 -278687 211815 -239793
9749e9319n2819k52789g0001B03521c4619j35809j12410e5831j84841I9955a75068
9737b03880J00110D0129b92045B90290k5267c003B17779a59195A01625i90A98409
9725b35612B09149p2430e02393i0025A66413L0999a43923A31408C1068e1150D820
9713f4628E3270J15211D2618f5559j43134B26080a82262D38193a60227N5930b5322
9701b78881h9065c6382j51873h0756r0550A25089d0003F2644b85468h5171D6417
9689b40259J10795N2205j59594j72073i5974d5861j826B06403l8810b55031D5569
9677A33123n5429b7217n6367j14486d4416j53709e9949j52687A20038a01234E2161
9665g7697m41866a66275B53673I757e761B0146a07484n5125j25051E5619N0159
$$ plain form
9749 -59319 -112138 -364927 -70001 203521 -34619 -170428 -282838 -55831 -240672 99955 -175068
9737 -203880 -103770 40129 -292045 290290 265023 -3003 217779 -159195 101625 -990 198409
9725 -235612 209149 136719 -502393 -90025 166413 197412 -143923 131408 31068 -51150 4820
9713 -64628 53270 168481 42618 -65559 -208693 226080 -182262 438193 -160227 -104297 -25322
9701 -278881 -89065 -36382 -188255 -80756 -171306 125089 -40003 62644 -285468 -85171 46417
9689 -240259 -129464 -77259 -236853 -408926 -95974 -45861 -47687 206403 167593 -255031 45569
9677 133123 77694 -27217 -83584 -198070 -44416 -198125 -59949 -212636 120038 -101234 52161
9665 -77697 -519563 -166275 253673 9757 -5761 20146 -107484 -162609 -287660 55619 105778
9654A05778a44460d2601I1097a6621C4928K1424k5198C741a05434k97497a2475
9642c2427n5983j15863a1245A54580a64917b3318q331O051k6954A56419R049a33870
9629B1979c38448a19194N6532H064c67130J44473k21560a61135b4741F3984k0574
9618D3410a27805A51985a82021J2749o0960G2439a28607j96796a1255j63654j369
9607a76278L8288A19931c4828o7741A94400p6150B5268K26238a89950G701J18544
9596A26245e6747p0094j0961J9420j96517D7397Q2426b49286b7421j6370N77C1155
9583H2230a67932l6816q8627a26689k06029O2364A98617g044n6297C5865g2648
9571d51319H1323K23321a50020B3779a16053K1430A5916b03652O2059e1954j56408
$$ plain form
9654 105778 -144460 -42601 91097 -16621 34928 56352 31154 3741 -105434 -402931 -12475
9642 -32427 -88410 -204273 -11245 154580 -164917 -23318 -31649 -25598 -52552 156419 165468 -133870
9629 21979 -338448 -119194 -62662 8064 -367130 -222657 -444217 -161135 -24741 63984 43410
9618 43410 -127805 151985 -182021 -169272 -230232 72439 -128607 -325403 -11255 -174909 -176278
9607 -176278 -137990 119931 -34828 -102569 194400 118250 25268 251506 -189950 7701 126245
9596 126245 -56747 -126841 -137802 -118382 -314899 47397 129823 -249286 -27421 -43791 -43214 31155
9583 82230 -167932 -204748 -293375 -126689 -332718 -270354 198617 -7044 -63341 35865 -72648
9571 -451319 81323 304644 -150020 23779 -116053 -94623 15916 -203652 -141593 -51954 -208362
9560b08362Q7588G3946b50837F4040b0916C3485b28809A02639D9040g4084k78495
9549c52579J2005f0978o1746H1359c35190b6016F6309K73527b38373A0667J36314
9538A46981b68696d3807l09013A43550b72335F7404a24502k51733c5408B8095
9527B99084a81859I9398a07167G3203a11541B22964m0872E419a98809k0245b8681
9515a17953N3943r7329a1058A13169b11664B6557f4683j1981k17360l8522J09704
9504b22842H865J01362a00585A53398h199C57696b18001I1228b8190k83889A9920
9492b18863b0304k62115J10256L2099M8586A89034b2297m3570k35961j9605D038
9480A01846f8482C57387b87110A5629b98540a48542m5656d3600A17750a13259
$$ plain form
9560 -208362 -120774 73946 -250837 64040 -20916 33485 -228809 102639 49040 -74084 -352579
9549 -352579 -340574 -60978 -122724 81359 -335190 -26016 66309 339836 -238373 10667 146981
9538 146981 -268696 -43807 -352820 143550 -272335 67404 -124502 -376235 -35408 28095
9527 299084 -181859 99398 -107167 73203 -111541 222964 182092 5419 -198809 -219054 -28681
9515 -117953 -64010 -161339 -11058 113169 -211664 26557 -64683 -76664 -294024 -332546 -222842
9504 -222842 8865 110227 -100585 153398 -8199 357696 -218001 91228 -28190 -312079 19920
9492 -218863 -20304 -282419 -172163 -140064 -91478 189034 -22297 -65867 -301828 -321433 4038
9480 101846 -68482 357387 -287110 15629 -298540 -148542 -194198 -43600 117750 -113259
9469b03639C2937c36486a20625F9483a2322q5673j74152C57768a55278E016a58674
9457B4937b76983a19710k18515a34159E3332a46531A42922K054b56115P9532l1398
9446b07981E2325a96587R4884o1237j50189a9328j0173B39185c8327k81383O3876
9435b55834G3928a8584a686H049b04561J7617J0590P7875j19088I67b03819f7185
9422B7283b34897j17120R8241f6248A04866c95635A00241d5697j03858q7040A20147
9410I0418f7815k89665D7437K850b52070J18763P663j9456n979c481r0062k6607
9398a20150M4441B01915H8979C9992i2888a3417A45615a69517A43450J6119d7894
9386B78293H2549b04890f0380D8673a53689A26674B0293R9626a6238A23692a74416
$$ plain form
9469 -203639 32937 -336486 -120625 69483 -12322 -97995 -272147 357768 -155278 5016 -158674
9457 24937 -276983 -119710 -338225 -134159 53332 -146531 142922 144976 -256115 -176583 -207981
9446 -207981 52325 -196587 -101703 -162940 -313129 -19328 -29501 239185 -38327 -319710 -255834
9435 -255834 73928 -18584 -1686 8049 -204561 -186944 -176354 -98479 -217567 967 -203819 -67185
9422 27283 -234897 -352017 -253776 -66248 104866 -395635 100241 -45697 -149555 -236595 120147
9410 90418 -67815 -357480 47437 50287 -252070 -133307 -125644 -145100 -151079 -3481 -93543 -120150
9398 -120150 -75709 201915 88979 39992 -92888 -13417 145615 -169517 143450 159569 -47894
9386 278293 82549 -204890 -60380 48673 -153689 126674 20293 119919 -16238 123692 -174416
9374A1203K510e6600j13702J662F7726M2481m7020b98297e497F855K00342a72297
9361a67813e8178E0536J7348f8743G7494d00951B00778Bb98580a10040k10497
9350c20537Q1982a09916k9155H8877a46428A5102J02620a10183L3653L3594j38385
9339a81321g3720J9863k07111l00343d3021B85518b20608J7756j4955B07801r1098
9328A16703e7643A28817a81395o4823D8914J73745a50831N84j00786k49377b25504
9316b98735A810Q6557k7479f6343j52531N6059A86666F1674a46872B36068a50739
9304b54194g5807l4172M7681A07450b80152B62038c52940A3465e6905q3170N6248
9293h3827F3148c9805k9418j62285g621F0644f5654k8156A13108a06912C6310
$$ plain form
9374 11203 13713 -56600 -170302 -168640 67726 110207 63187 -298297 -5497 6855 207197 -172297
9361 -167813 -58178 50536 67884 -68743 77494 -400951 200778 2 -298580 -110040 -320537
9350 -320537 -238555 -109916 -139071 88877 -146428 15102 117722 -110183 -76530 -42936 -181321
9339 -181321 -73720 -53857 -260968 -561311 -43021 285518 -220608 -202852 -217807 207801 116703
9328 116703 -57643 128817 -181395 -246218 48914 222659 -150831 -150247 -251033 -500410 -225504
9316 -298735 1810 88367 60888 -66343 -218874 -162815 186666 61674 -146872 236068 -150739
9304 -254194 -75807 -109979 -62298 107450 -280152 262038 -352940 13465 -56905 -140075 -83827
9293 -83827 63148 -39805 -69223 -231508 -7621 60644 -65654 -93810 113108 -106912 36310
9281c68450A54781k6407i0417F8990A1100g1232j31388k9969h2975k45138e3328
9269a40411j47864J33995L1339I9449e2669j3765k18673a24431D7811e685j94706
9258b00391k37283F7465a68923A97649a39331C8373h4053G9243g8382j70635B78521
9246d53297D13585C4730J7319J7264J20758a7190l9466G6450a79948L0094f4586
9234h2305C4007p491c18546h0829C7884J42550b02432B38087b91337J42880j26510
9223b74967A58935B4787l964f3374I258a35191A62032n754b04872P0999E4517
9211d09580a21228B1624J17991c44187A47560a68435k20104A21888e8018q5167
9201a43185K1757j62199A06812a09643p5331g4887j16827k40906D8311a81005
$$ plain form
9281 -368450 154781 128374 -90417 68990 11100 -71232 -202620 -232589 -82975 -328113 -53328
9269 -140411 -288275 -154280 -122941 99449 -52669 -66434 -285107 -124431 47811 -5685 -200391
9258 -200391 -437674 67465 -168923 197649 -139331 38373 -84053 79243 -78382 -249017 278521
9246 -453297 413585 34730 52049 69313 190071 -17190 -56656 76450 -179948 -149854 -64586
9234 -82305 34007 26516 -318546 -80829 37884 180434 -202432 238087 -291337 -148457 -274967
9223 -274967 158935 24787 20823 -63374 9258 -135191 162032 156278 -204872 -133873 54517
9211 -409580 -121228 21624 139615 -344187 147560 -168435 -388539 121888 -58018 -143185
9201 -143185 -121428 -283627 106812 -109643 -184974 -74887 -191714 -432620 48311 -181005
9190a36725G3389b02611N4968I7794c28386A6826K17861c62783B41914a19593
9179b895l10752g3707A2718C764b28413B0504a35773C7847b51122h3198I8833
9167b08477e1639n1638j0601k05195J27630A22310b30995J3349j14928f7482A89115
9155H7308b18007H2841b96175N4853R6184j89540J62093A53496E6581a43446E0662
9143b2034j70993C5256L0283K7507i1904o2162K1672k02688f5428l4293c8651
9131f9774j30282e409G6913d1560k834r5541k56242a10246B76470b77015J177
9120b75838R8869K7624A51463a41639j5413P3133p1803N5715c5732Q067A99093
9108b00534b5673c190j12171e297j67o9490B44644a1903j02300a5749H4233R6519
$$ plain form
9190 -136725 73389 -202611 -147643 97794 -328386 16826 234687 -362783 241914 -119593
9179 -2895 -313647 -73707 12718 3764 -228413 20504 -135773 37847 -251122 -83198 98833
9167 -208477 -51639 -103277 -113878 -319073 -191443 122310 -230995 -217646 -332574 -67482 189115
9155 87308 -218007 82841 -296175 -241322 -145138 -334678 -172585 153496 56581 -143446 50662
9143 -22034 -193027 35256 65539 93046 -91904 -154066 -132394 -335082 -65428 -99721 -38651
9131 -69774 -200056 -5409 76913 -41560 -44394 -139935 -396177 -110246 276470 -277015 -275838
9120 -275838 -176969 -149345 151463 -141639 -157052 -83919 -155722 -100007 -35732 -27665 199093
9108 -200534 -25673 -3190 -115361 -5297 -5464 -74954 244644 -11903 -114203 -15749 84233 180752
9096A80752c52061I8315h6892b3952l2690j6296k45369h32p3403G6072K32958
9085C09030J35622g5081A1402b99469a35733q6395d824m22385a51608J1872B0549
9073c6150k26367h4433C2450b46769N8167L0353A82367b02358f584l4887C541
9061b70499J01888j6920p163l4430J01755c467l77601J23848A24272a01424M1571
9050e9853C3128M4762a48658A47892B1458J8552J05909f7707C7940d51738J86751
9039b64987H7504N870K51619E6766K76250a30629j46769E7279b6300j05125J8697
9028a12728I4587D120J22575a26353B51298m5279c5964m7250r368j41945c7562
9016B8491a99163M1217N118O7018l8311d9231r2994r3192G2039b32377A9636a64784
$$ plain form
9096 180752 -352061 98315 -86892 -23952 -56642 -72938 -318307 -832 -74235 76072 309030
9085 309030 444652 -75081 11402 -299469 -135733 -222128 -4824 -427209 -151608 -139736 20549
9073 -36150 -262517 -84433 32450 -246769 -188602 -158249 182367 -202358 -6584 -41471 3541
9061 -270499 -168611 -185531 -192694 -227124 -125369 -3467 -381068 -257220 124272 -101424 -59853
9050 -59853 33128 77890 -148658 147892 21458 40010 145919 -67707 37940 -451738 -264987
9039 -264987 87504 93374 344993 56766 333016 -130629 -277398 57279 -26300 -131425 -112728
9028 -112728 94587 4120 126695 -126353 251298 206019 -35964 -83214 -92582 -234527 -37562
9016 28491 -199163 -157946 -152828 -85810 -124121 -49231 -142225 -235417 72039 -232377 19636 -164784
9003a60795H2301a93173e8358b3481j66695J5230f3870A7225b44765J14039c3558
8991A37461F6819P0099c33860a50840j447E4104i7779c1372A49950K3427a01537
8979E4475A7249a30426A48159j0456f3445C3097a62659k16993H7030h5231k80996
8968c66227b9152B6408a76528b0106o4970j70430A56167c05301J50035L9238J8854
8957i7174R705n3079I6193b48629J16248l944A24180i8413M1173p5445A23140
8945H9567c33454C31787a67151j0728f4633A17625R298C0076b81978P6294D37463
8933e9178A75499d3899k4875A47572m8617a96536A95839b85637F443d6838A78648
8921A7260b12247L4894e2564B8789b5652C12107B2451J3810J8126J83830O6982
$$ plain form
9003 -160795 82301 -193173 -58358 -23481 -190176 -174946 -63870 17225 -244765 -130726 -33558
8991 137461 66819 136918 -333860 -150840 -152287 54104 -97779 -31372 149950 173377 -101537
8979 54475 17249 -130426 148159 137703 -63445 33097 -162659 -379652 87030 -85231 -366227
8968 -366227 -29152 26408 -176528 -20106 -85076 -255506 156167 -305301 -155266 -116028 -97174
8957 -97174 -87469 -140548 96193 -248629 -132381 -136325 124180 -98413 -57240 -132685 123140
8945 89567 -333454 331787 -167151 -177879 -64633 117625 126923 30076 -281978 -205684 437463
8933 -59178 175499 -43899 -68774 147572 98955 -196536 195839 -285637 6443 -46838 178648
8921 17260 -212247 -177353 -52564 28789 -25652 312107 22451 36261 54387 238217 305199
8910C05199J57137j90047k7995K86694L67235L64310J224880K053105L007559
8901G548077C443356A689885m61721D86815A23429L61936g6440B71242c17867
8891C43348n6563m1341m611m9757c32793a58809G2612J73350J64731A91342H7112
8879B83526M6678f250l8154m2887b1185j46303g4878k57453a43376B31645l5192
8868A96453c9678F7904b9068C12410g446F0595b2939j59771q5325i2011j33141
$$ plain form
8910 305199 462336 272289 244294 530988 898223 1262533 2487413 4540518 7548077
8901 7548077 3443356 1689885 1228164 486815 123429 485365 -76440 271242 -317867
8891 343348 286785 245444 240833 191076 -332793 -158809 72612 245962 410693 191342 87112
8879 283526 330204 -6250 -44404 -87291 -21185 -167488 -74878 -332331 -143376 231645 196453
8868 196453 -39678 67904 -29068 312410 -7446 60595 -22939 -182710 -268035 -92011 -225152
$$ [...]
##END NTUPLES=NMR SPECTRUM
##END=
