
##TITLE=AC1080_MAST01_5819146_kSWaKvAYf4
##JCAMPDX= 6.0         $$ Bruker NMR JCAMP-DX V2.0
##DATA TYPE= NMR SPECTRUM
##DATA CLASS= NTUPLES
##ORIGIN= BRUKER
##OWNER= Administrator
$$ 1.72 TOPSPIN		Version 2.1
$$ 2012-03-28 11:08:34.109 -0500  Administrator@TOPSPIN
$$ Compression mode = diff/dup
##.OBSERVE FREQUENCY= 400.13188235
##.OBSERVE NUCLEUS= ^1H
##.ACQUISITION MODE= SIMULTANEOUS (DQD)
##.ACQUISITION SCHEME= undefined
##.AVERAGES= 64
##.DIGITISER RES= 22
##SPECTROMETER/DATA SYSTEM= spect
##.PULSE SEQUENCE= noesygpps1d.comp
##.SOLVENT NAME= COFFEE_meoh
##.SHIFT REFERENCE= INTERNAL, COFFEE_meoh, 1, 14.96881
##AUDIT TRAIL= $$ (NUMBER, WHEN, WHO, WHERE, PROCESS, VERSION, WHAT)
$$ ##TITLE= Audit trail, TOPSPIN		Version 2.1
$$ ##JCAMPDX= 5.01
$$ ##ORIGIN= Bruker BioSpin GmbH
$$ ##OWNER= Administrator
$$ $$ C:\Bruker\TOPSPIN/data/COFFEE/nmr/AC1080_MAST01_5819146_kSWaKvAYf4/22/pdata/1/auditp.txt
$$ ##AUDIT TRAIL=  $$ (NUMBER, WHEN, WHO, WHERE, PROCESS, VERSION, WHAT)
(   1,<2012-03-28 05:33:25.640 -0500>,<Administrator>,<TOPSPIN>,<go>,<TOPSPIN 2.1>,
      <created by zg
	started at 2012-03-28 05:21:54.062 -0500,
	POWCHK enabled, PULCHK disabled,
       configuration hash MD5:
       1A 1E CE 29 27 FD 77 03 67 4E F0 E3 C4 B2 CB 90
       data hash MD5: 64K
       A2 3E BA 7A 0A C2 C5 10 C4 8A 23 7D E1 B4 F7 E8>)
(   2,<2012-03-28 05:33:30.859 -0500>,<Administrator>,<TOPSPIN>,<proc1d>,<TOPSPIN 2.1>,
      <Start of raw data processing
       efp LB = 0.3 FT_mod = 6 PKNL = 1 PHC0 = 0 PHC1 = 0 SI = 128K 
       data hash MD5: 128K
       0F 02 76 A5 23 FE 82 68 A0 E3 DC FE 5E BD 80 5A>)
(   3,<2012-03-28 05:33:32.125 -0500>,<Administrator>,<TOPSPIN>,<proc1d>,<TOPSPIN 2.1>,
      <pk PHC0 = 37.86987 PHC1 = 0 
       data hash MD5: 128K
       01 B6 B3 4D 51 2A 7A DF 95 E0 4A C0 A7 DE EA CD>)
(   4,<2012-03-28 05:33:32.687 -0500>,<Administrator>,<TOPSPIN>,<proc1d>,<TOPSPIN 2.1>,
      <abs ABSG = 1 
       data hash MD5: 128K
       74 6B BE 85 CB 3A 8E 92 50 43 64 A5 E3 F6 9C 17>)
(   5,<2012-03-28 05:33:32.828 -0500>,<Administrator>,<TOPSPIN>,<proc1d>,<TOPSPIN 2.1>,
      <abs ABSG = 2 
       data hash MD5: 128K
       FB 28 24 59 23 F7 1B AE 22 08 47 F5 0F 86 39 77>)
(   6,<2012-03-28 05:33:32.906 -0500>,<Administrator>,<TOPSPIN>,<proc1d>,<TOPSPIN 2.1>,
      <abs ABSG = 3 
       data hash MD5: 128K
       B9 D8 3E A0 D4 29 61 DF AF B9 44 03 44 43 F3 49>)
(   7,<2012-03-28 05:33:32.968 -0500>,<Administrator>,<TOPSPIN>,<proc1d>,<TOPSPIN 2.1>,
      <abs ABSG = 4 
       data hash MD5: 128K
       85 A8 A5 90 7A E6 67 15 0F 59 28 F9 D7 DA 97 19>)
(   8,<2012-03-28 05:33:33.031 -0500>,<Administrator>,<TOPSPIN>,<proc1d>,<TOPSPIN 2.1>,
      <abs ABSG = 5 
       data hash MD5: 128K
       6B AF D2 E7 B4 2C 4A B6 A7 5B 63 4E A9 B4 07 43>)
(   9,<2012-03-28 05:33:33.765 -0500>,<Administrator>,<TOPSPIN>,<audit>,<TOPSPIN 2.1>,
      <user comment:
       ICON-NMR User ID: COFFEE
       data hash MD5: 128K
$$ [...]
##$TP07= 0
##$TPNAME0= <>
##$TPNAME1= <>
##$TPNAME2= <>
##$TPNAME3= <>
##$TPNAME4= <>
##$TPNAME5= <>
##$TPNAME6= <>
##$TPNAME7= <>
##$TPOAL= (0..7)
0.5 0.5 0.5 0.5 0.5 0.5 0.5 0.5
##$TPOFFS= (0..7)
0 0 0 0 0 0 0 0
##$TUNHIN= 0
##$TUNHOUT= 0
##$TUNXOUT= 0
##$USERA1= <user>
##$USERA2= <user>
##$USERA3= <user>
##$USERA4= <user>
##$USERA5= <user>
##$V9= 5
##$VALIST= <valist>
##$VCLIST= <CCCCCCCCCCCCCCC>
##$VD= 0
##$VDLIST= <DDDDDDDDDDDDDDD>
##$VPLIST= <PPPPPPPPPPPPPPP>
##$VTLIST= <TTTTTTTTTTTTTTT>
##$WBST= 2048
##$WBSW= 25
##$XGAIN= (0..3)
0 0 0 0
##$XL= 0
##$YL= 0
##$YMAX_a= 14287334
##$YMIN_a= -6374359
##$ZGOPTNS= <>
##$ZL1= 120
##$ZL2= 120
##$ZL3= 120
##$ZL4= 120
##$ABSF1= 14.96881
##$ABSF2= -5.58372
##$ABSG= 5
##$ABSL= 3
##$ALPHA= 0
##$AQORDER= 0
##$ASSFAC= 0
##$ASSFACI= 0
##$ASSFACX= 0
##$ASSWID= 0
##$AUNMP= <proc_prof1d_extract.lims>
##$AXLEFT= 0
##$AXNAME= <>
##$AXNUC= <1H>
##$AXRIGHT= 0
##$AXTYPE= 0
##$AXUNIT= <>
##$AZFE= 0.1
##$AZFW= 0.1
##$BCFW= 0
##$BC_mod= 0
##$BYTORDP= 0
##$COROFFS= 0
##$CY= 15
##$DATMOD= 1
##$DC= 0
##$DFILT= <>
##$DTYPP= 0
##$F1P= 0
##$F2P= 0
##$FCOR= 0.5
##$FTSIZE= 131072
##$FT_mod= 6
##$GAMMA= 0
##$GB= 0
##$INTBC= 1
##$INTSCL= 1
##$ISEN= 128
##$LB= 0.3
##$LEV0= 0
##$LPBIN= 0
##$MAXI= 10000
##$MC2= 0
##$MEAN= 0
##$ME_mod= 0
##$MI= 0
##$NCOEF= 0
##$NC_proc= -3
##$NLEV= 6
##$NOISF1= 0
##$NOISF2= 0
##$NSP= 0
##$NTH_PI= 0
##$NZP= 0
##$OFFSET= 14.96881
##$PC= 1
##$PHC0= 37.86987
##$PHC1= 0
##$PH_mod= 1
##$PKNL= yes
##$PPARMOD= 0
##$PPDIAG= 0
##$PPIPTYP= 0
##$PPMPNUM= 2147483647
##$PPRESOL= 1
##$PSCAL= 4
##$PSIGN= 0
##$PYNMP= <proc.py>
##$REVERSE= no
##$SF= 400.130004723396
##$SI= 131072
##$SIGF1= 0
##$SIGF2= 0
##$SINO= 400
##$SIOLD= 131072
##$SPECTYP= <>
##$SREGLST= <1H.CDCl3>
##$SSB= 0
##$STSI= 131072
##$STSR= 0
##$SW_p= 8223.68421052632
##$SYMM= 0
##$S_DEV= 0
##$TDeff= 65536
##$TDoff= 0
##$TI= <>
##$TILT= no
##$TM1= 0
##$TM2= 0
##$TOPLEV= 0
##$USERP1= <user>
##$USERP2= <user>
##$USERP3= <user>
##$USERP4= <user>
##$USERP5= <user>
##$WDW= 1
##$XDIM= 131072
##$YMAX_p= 550147382
##$YMIN_p= -407840041
##$CURPLOT= <Network HP LaserJet P1505>
##$CURPRIN= <$Network HP LaserJet P1505>
##$DFORMAT= <normdp>
##$LAYOUT= <+/1D_H.xwp>
##$LFORMAT= <normlp>
##$PFORMAT= <normpl>
##$SURQMSG= 1
$$ End of Bruker specific parameters
$$ ---------------------------------
##NTUPLES= NMR SPECTRUM
##VAR_NAME=  FREQUENCY,     SPECTRUM/REAL,   SPECTRUM/IMAG
##SYMBOL=    X,             R,               I
##VAR_TYPE=  INDEPENDENT,   DEPENDENT,       DEPENDENT
##VAR_FORM=  AFFN,          ASDF,            ASDF
##VAR_DIM=   131072,        131072,          131072
##UNITS=     HZ,            ARBITRARY UNITS, ARBITRARY UNITS
##FACTOR=    0.0627417313425165, 1,          1
##FIRST=     8223.62146879498, -5390,        -105559
##LAST=      0,             -1046,           -106472
##MIN=       0,             -407840041,      0
##MAX=       8223.62146879498, 550147382,    0
$$ Real data points
##PAGE= N=1
##DATA TABLE= (X++(R..R)), XYDATA
$$ [...]
$$ plain form
62940 3473710 3438170 3413320 3398030 3392032 3395649 3408628 3429929 3458510 3493314 3532333 3572819 3613136
62928 3613136 3653826 3696280 3740780 3786205 3831105 3874351 3914921 3951728 3983787 4010202 4029878
62917 4029878 4041375 4043124 4033697 4011851 3976435 3926587 3862413 3785493 3698237 3602244 3497567
62906 3497567 3384187 3264111 3141310 3019384 2899883 2783154 2670091 2562297 2460810
62897 2460810 2365464 2275649 2191234 2112628 2040374 1974897 1916320 1864132 1817155 1774130 1734417
62886 1734417 1698069 1665318 1636084 1609805 1585436 1561683 1537629 1513282 1489299 1466075 1443388
62875 1443388 1421023 1399275 1378438 1358265 1338611 1320247 1304027 1289170 1273500 1255949 1237846
62864 1237846 1220892 1204688 1187640 1169925 1153906 1141231 1130914 1121072 1111379 1102641 1094751 1086623
$$ packed form
62940C473710l5540k4850j5290n998L617J2979K1301K8581L4804L9019M0486M0317
62928C613136M0690M2454M4500M5425M4900M3246M0570L6807L2059K6415J9676
62917D029878J1497J749r427k1846l5416m9848o4174p6920q7256r5993j04677
62906C497567j13380j20076j22801j21926j19501j16729j13063j07794j01487
62897B460810r5346q9815q4415p8606p2254o5477n8577n2188m6977m3025l9713
62886A734417l6348l2751k9234k6279k4369k3753k4054k4347k3983k3224k2687
62875A443388k2365k1748k0837k0173j9654j8364j6220j4857j5670j7551j8103
62864A237846j6954j6204j7048j7715j6019j2675j0317r842r693q738p890q128
$$ plain form
62852 1086623 1078041 1070194 1064019 1059018 1054169 1049180 1044328 1039729 1035385 1031464 1027957 1024437 1020668 1017049
62838 1017049 1013935 1011026 1008069 1005603 1004138 1003064 1001536 1000138 1000289 1001899 1003043 1002509 1001294 1000730 1000279
62823 1000279 998493 995418 992574 990693 988783 985621 981223 976514 972290 968916 966472 964704 963028 960876
62809 960876 958021 954665 951432 949138 948128 947716 946506 943318 937781 930309 921946 914051 907628 902710
62795 902710 898515 894142 889100 883577 878542 875161 873551 872385 870262 867206 864215 861769 859731 858538
62781 858538 859206 861886 865426 868851 872338 876096 879276 881059 882303 884817 888947 892857 894579 894183 893481
62766 893481 894081 896221 899323 903045 907550 913080 919568 926586 933398 939223 943867 948204 953522 960067
62752 960067 966602 971854 976159 981222 988336 997375 1007570 1018695 1031089 1044648 1058220 1070346 1080779
$$ packed form
62852A086623q582p847o175n001m849m989m852m599m344l921l507l520l769l619
62838A017049l114k909k957k466j465j074j528j398J51J610J144n34j215n64m51
62823A000279j786l075k844j881j910l162m398m709m224l374k444j768j676k152
62809I60876k855l356l233k294j010m12j210l188n537p472q363p895o423m918
62795I02710m195m373n042n523n035l381j610j166k123l056k991k446k038j193
62781H58538O68K680L540L425L487L758L180J783J244K514M130L910J722l96p02
62766H93481O00K140L102L722M505N530O488P018O812N825M644M337N318O545
62752I60067O535N252M305N063P114R039J0195J1125J2394J3559J3572J2126J0433
$$ plain form
62739 1080779 1091070 1103332 1118511 1136270 1156348 1179006 1203879 1229635 1255745 1283804 1315907
62728 1315907 1352067 1390420 1429821 1471158 1516222 1566361 1622219 1683583 1749330 1818617 1892362
62717 1892362 1972526 2059678 2152577 2250621 2355473 2469320 2592449 2723424 2860930 3004465
62707 3004465 3153675 3307806 3465465 3624221 3780602 3930877 4071415 4198118 4306520
62698 4306520 4393333 4457303 4497757 4512909 4500626 4460482 4394153 4304189 4193461 4065652 3924984
62687 3924984 3775026 3618250 3456783 3293045 3129731 2969821 2816381 2671419 2534802
62678 2534802 2405111 2281854 2166218 2059545 1961935 1872775 1791881 1719293 1654266 1595175
62668 1595175 1540520 1489681 1442655 1399367 1359484 1322895 1290231 1262647 1240803 1224008 1210520
$$ packed form
62739A080779J0291J2262J5179J7759K0078K2658K4873K5756K6110K8059L2103
62728A315907L6160L8353L9401M1337M5064N0139N5858O1364O5747O9287P3745
62717A892362Q0164Q7152R2899R8044J04852J13847J23129J30975J37506J43535
62707C004465J49210J54131J57659J58756J56381J50275J40538J26703J08402
62698D306520Q6813O3970M0454J5152j2283m0144o6329q9964j10728j27809j40668
62687C924984j49958j56776j61467j63738j63314j59910j53440j44962j36617
62678B534802j29691j23257j15636j06673r7610q9160q0894p2588o5027n9091
62668A595175n4655n0839m7026m3288l9883l6589l2664k7584k1844j6795j3488
$$ plain form
62657 1210520 1198804 1188512 1180317 1174855 1171914 1170711 1171021 1173833 1180514 1191322 1205199 1221152 1239305
62644 1239305 1260345 1284489 1311644 1342150 1376538 1414657 1455951 1500755 1550604 1606817 1669299
62633 1669299 1737191 1810222 1888837 1973240 2063014 2157756 2257451 2361888 2470084 2580601 2692079
62622 2692079 2802819 2909777 3008522 3094609 3165007 3218242 3253566 3270397 3268415 3247844 3209437
62611 3209437 3154248 3083422 2998275 2900697 2793347 2679087 2560181 2438438 2316101 2195882
62601 2195882 2079716 1968160 1861557 1761125 1668103 1582312 1502614 1428565 1360594 1298657
62591 1298657 1241823 1189338 1141113 1096921 1055980 1017616 981542 947366 914763 884433 857764
62580 857764 835030 814894 796285 779725 765954 754173 742817 731436 720643 710518 700296
$$ packed form
62657A210520j1716j0292q195n462k941j203L10K812O681J0808J3877J5953J8153
62644A239305K1040K4144K7155L0506L4388L8119M1294M4804M9849N6213O2482
62633A669299O7892P3031P8615Q4403Q9774R4742R9695J04437J08196J10517J11478
62622B692079J10740J06958R8745Q6087P0398N3235L5324J6831j982k0571l8407
62611C209437n5189p0826q5147r7578j07350j14260j18906j21743j22337j20219
62601B195882j16166j11556j06603j00432r3022q5791p9698p4049o7971o1937
62591A298657n6834n2485m8225m4192m0941l8364l6074l4176l2603l0330k6669
62580H57764k2734k0136j8609j6560j3771j1781j1356j1381j0793j0125j0222
$$ plain form
62569 700296 689760 679998 672422 667496 664549 662517 660754 659318 658521 658279 658220 658356 659029 660078 660828 661337
62553 661337 662877 666526 671871 677953 684993 694215 706036 719322 732637 745744 759677 775604 793734
62540 793734 813371 834110 856714 882314 910962 941860 975113 1012079 1053480 1098213 1144876
62529 1144876 1193677 1246073 1303311 1366146 1435014 1509192 1586379 1664389 1742840 1822004 1900513
62518 1900513 1975666 2045640 2109732 2166282 2211969 2243726 2260254 2261313 2246878 2217829 2176576
62507 2176576 2125987 2067969 2003523 1933766 1860296 1784803 1708701 1633081 1558880 1487256 1419732
62496 1419732 1357683 1301602 1251050 1205260 1163567 1125374 1090042 1056770 1024617 993140 963232
62485 963232 936558 913571 892706 872240 852294 834083 817887 802962 789007 776329 764755
$$ packed form
62569G00296j0536r762p576m926k947k032j763j436p97k42n9J36O73J049P50N09
62553F61337J540L649N345O082P040R222J1821J3286J3315J3107J3933J5927J8130
62540G93734J9637K0739K2604K5600K8648L0898L3253L6966M1401M4733M6663
62529A144876M8801N2396N7238O2835O8868P4178P7187P8010P8451P9164P8509
62518A900513P5153O9974O4092N6550M5687L1757J6528J059j4435k9049m1253
62507B176576n0589n8018o4446o9757p3470p5493p6102p5620p4201p1624o7524
62496A419732o2049n6081n0552m5790m1693l8193l5332l3272l2153l1477k9908
62485I63232k6674k2987k0865k0466j9946j8211j6196j4925j3955j2678j1574
$$ plain form
62474 764755 753842 744146 736819 731613 726708 721134 716263 714283 716061 721013 728154 736691 746325 757591
62460 757591 771309 787288 804178 820965 837992 856303 876924 901055 929777 962698 997745
62449 997745 1033347 1070348 1110985 1156358 1205692 1257695 1311829 1368319 1427521 1489176 1551868
62438 1551868 1613353 1671699 1725778 1774449 1815805 1847725 1868770 1878159 1875523 1861416 1837626 1806077
62426 1806077 1767534 1722055 1670545 1615024 1557426 1498974 1440939 1385094 1332773 1283954 1237932
62415 1237932 1194770 1155488 1120735 1089775 1061132 1033972 1008557 985521 965195 947607 932600
62404 932600 919659 908002 897221 887671 879955 874196 870050 867161 865390 864805 865629 867875 870888 873777
62390 873777 876632 880715 886969 894876 903295 911738 920107 927935 935015 942275 950779 959984 968086 974016
$$ packed form
62474G64755j0913r696p327n206m905n574m871j980J778M952P141Q537R634J1266
62460G57591J3718J5979J6890J6787J7027J8311K0621K4131K8722L2921L5047
62449I97745L5602L7001M0637M5373M9334N2003N4134N6490N9202O1655O2692
62438A551868O1485N8346N4079M8671M1356L1920K1045R389k636j4107k3790l1549
62426A806077l8543m5479n1510n5521n7598n8452n8035n5845n2321m8819m6022
62415A237932m3162l9282l4753l0960k8643k7160k5415k3036k0326j7588j5007
62404I32600j2941j1657j0781r550p716n759m146k889j771n85Q24K246L013K889
62390H73777K855M083O254P907Q419Q443Q369P828P080P260Q504R205Q102N930
$$ plain form
62376 974016 978057 980594 981376 980002 975973 968250 955965 939841 921795 902981 883344 863135 843396
62363 843396 824617 806417 789246 774884 764221 755634 746721 736927 727535 719878 714575 711893 711703
62350 711703 713345 716247 720444 725959 732227 738799 746110 754896 765250 776839 789520 803105 816916
62337 816916 830207 842672 854156 864419 873655 882639 891864 901112 910247 919453 928016 933883 935625
62324 935625 934240 931997 930011 928008 925916 924338 923557 923225 923259 924303 927289 933110 942494 955509 971342
62309 971342 989150 1008905 1030890 1054940 1081128 1110786 1145746 1186582 1232442 1282513 1336799
62298 1336799 1395634 1459409 1528774 1604091 1684415 1767722 1852237 1936857 2020336 2100933 2176961
62287 2176961 2246731 2307701 2356738 2391921 2413577 2423126 2421371 2408340 2384301 2350229 2307471 2257314
$$ packed form
62376I74016M041K537P82j374m029p723j2285j6124j8046j8814j9637k0209j9739
62363H43396j8779j8200j7171j4362j0663q587q913r794r392p657n303k682j90
62350G11703J642K902M197N515O268O572P311Q786J0354J1589J2681J3585J3811
62337H16916J3291J2465J1484J0263R236Q984R225R248R135R206Q563N867J742
62324I35625j385k243j986k003k092j578p81l32L4J044K986N821R384J3015J5833
62309I71342J7808J9755K1985K4050K6188K9658L4960M0836M5860N0071N4286
62298A336799N8835O3775O9365P5317Q0324Q3307Q4515Q4620Q3479Q0597P6028
62287B176961O9770O0970M9037L5183K1656R549j755j3031k4039l4072m2758n0157
$$ plain form
62275 2257314 2200831 2138818 2072073 2002066 1931269 1862264 1796240 1732557 1670186 1609566 1552590
62264 1552590 1500644 1453250 1409143 1367995 1330071 1294545 1259728 1225494 1194224 1168441 1148198
62253 1148198 1131603 1117254 1105185 1095797 1088839 1083412 1078493 1073555 1068898 1065019 1061568 1057770 1054137
62240 1054137 1052382 1052642 1052074 1047857 1040878 1034704 1031217 1029032 1026290 1023150 1020880 1019859 1019468 1019245 1019408
62225 1019408 1020656 1023721 1028579 1033977 1038471 1042245 1047297 1055445 1066654 1079514 1092801 1106303 1120532
62212 1120532 1135999 1152562 1169483 1186319 1203592 1222222 1242681 1265215 1290375 1318403 1348520
62201 1348520 1380083 1414416 1454065 1499748 1549208 1599863 1651936 1708327 1771863 1842992 1919497
62190 1919497 1997876 2075286 2150561 2223179 2291407 2352074 2402245 2440439 2466126 2479007 2479337 2468209
$$ packed form
62275B257314n6483o2013o6745p0007p0797o9005o6024o3683o2371o0620n6976
62264A552590n1946m7394m4107m1148l7924l5526l4817l4234l1270k5783k0243
62253A148198j6595j4349j2069r388o958n427m919m938m657l879l451l798l633
62240A054137j755K60n68m217o979o174l487k185k742l140k270j021l91k23J63
62225A019408J248L065M858N398M494L774N052Q148J1209J2860J3287J3502J4229
62212A120532J5467J6563J6921J6836J7273J8630K0459K2534K5160K8028L0117
62201A348520L1563L4333L9649M5683M9460N0655N2073N6391O3536P1129P6505
62190A919497P8379P7410P5275P2618O8228O0667N0171L8194K5687J2881L30j1128
$$ plain form
62178 2468209 2446872 2416028 2376076 2327581 2271337 2208655 2141897 2073997 2006857 1940618 1874901
62167 1874901 1810297 1748313 1690500 1638106 1592033 1552379 1518267 1488582 1462658 1440170 1420918
62156 1420918 1405129 1393292 1385094 1379054 1373806 1369246 1365805 1363275 1361387 1360998 1363221 1367263 1370547 1371724
62142 1371724 1372593 1376060 1382766 1390841 1398801 1407405 1418123 1430796 1443904 1456822 1470682 1486760 1505022
62129 1505022 1524775 1546120 1569939 1596746 1626146 1657186 1688667 1719457 1749207 1778657 1808612
62118 1808612 1838833 1868635 1898315 1928937 1960545 1991593 2020579 2047697 2074586 2103078 2134406
62107 2134406 2169043 2206905 2248043 2293249 2343455 2398455 2456823 2517203 2578919 2641096 2701886
62096 2701886 2759004 2810500 2854798 2890798 2918404 2938337 2951094 2956741 2956038 2950722 2941932 2929099
$$ packed form
62178B468209k1337l0844l9952m8495n6244o2682o6758o7900o7140o6239o5717
62167A874901o4604o1984n7813n2394m6073l9654l4112k9685k5924k2488j9252
62156A420918j5789j1837q198o040n248m560l441k530j888l89K223M042L284J177
62142A371724Q69L467O706Q075P960Q604J0718J2673J3108J2918J3860J6078J8262
62129A505022J9753K1345K3819K6807K9400L1040L1481L0790K9750K9450K9955
62118A808612L0221K9802K9680L0622L1608L1048K8986K7118K6889K8492L1328
62107B134406L4637L7862M1138M5206N0206N5000N8368O0380O1716O2177O0790
62096B701886N7118N1496M4298L6000K7606J9933J2757N647p03n316q790j2833
$$ plain form
62084 2929099 2911193 2888415 2861766 2831696 2798481 2763773 2730460 2700635 2674455 2651302 2631492
62073 2631492 2616363 2606860 2602302 2600636 2599986 2599968 2601322 2604541 2609569 2616859 2627617 2642240 2659257 2676823
62059 2676823 2694910 2715082 2738331 2764130 2791567 2820370 2850591 2882177 2915349 2950861 2989422
62048 2989422 3031122 3075610 3122462 3171089 3220635 3270366 3320101 3370184 3421180 3473670 3528161
62037 3528161 3585053 3644582 3706702 3770949 3836703 3903790 3972647 4043654 4116553 4190866 4266495
62026 4266495 4343250 4419809 4493987 4564483 4632016 4698506 4765461 4833474 4902856 4973998 5046792
62015 5046792 5120092 5192209 5262105 5329915 5396176 5460867 5523674 5585229 5647536 5712849 5782386
62004 5782386 5856319 5934432 6016198 6100531 6186326 6273423 6362371 6452833 6542557 6628294 6707595
$$ packed form
62084B929099j7906k2778k6649l0070l3215l4708l3313k9825k6180k3153j9810
62073B631492j5129r503m558j666o50j8J354L219N028P290J0758J4623J7017J7566
62059B676823J8087K0172K3249K5799K7437K8803L0221L1586L3172L5512L8561
62048B989422M1700M4488M6852M8627M9546M9731M9735N0083N0996N2490N4491
62037C528161N6892N9529O2120O4247O5754O7087O8857P1007P2899P4313P5629
62026D266495P6755P6559P4178P0496O7533O6490O6955O8013O9382P1142P2794
62015E046792P3300P2117O9896O7810O6261O4691O2807O1555O2307O5313O9537
62004E782386P3933P8113Q1766Q4333Q5795Q7097Q8948R0462Q9724Q5737P9301
$$ plain form
61993 6707595 6779530 6844013 6900969 6950284 6992203 7027362 7056196 7078297 7092546 7098149 7095564 7086141
61981 7086141 7070758 7049154 7021094 6988086 6953242 6919044 6885608 6851704 6817178 6783441 6751480
61970 6751480 6720518 6689458 6658904 6630514 6604470 6578868 6552030 6524445 6497802 6472913 6449454
61959 6449454 6427207 6406385 6386719 6367258 6347618 6328862 6312540 6299032 6287305 6276286 6266006
61948 6266006 6257161 6249883 6243476 6237434 6232289 6229150 6228600 6230298 6233322 6236413 6238100 6237429 6234846 6231785
61934 6231785 6228902 6224967 6217838 6206276 6190408 6170568 6146326 6116976 6082717 6044712 6003637 5958509
61922 5958509 5907748 5851615 5792862 5734292 5676197 5616988 5555935 5494155 5433097 5373361 5315263
61911 5315263 5259179 5204661 5150400 5096003 5042901 4992500 4944204 4896447 4849052 4803234 4759575
$$ packed form
61993F707595P1935O4483N6956M9315M1919L5159K8834K2101J4249N603k585r423
61981G086141j5383k1604k8060l3008l4844l4198l3436l3904l4526l3737l1961
61970F751480l0962l1060l0554k8390k6044k5602k6838k7585k6643k4889k3459
61959F449454k2247k0822j9666j9461j9640j8756j6322j3508j1727j1019j0280
61948F266006q845p278o407o042n145l139n50J698L024L091J687o71k583l061
61934F231785k883l935p129j1562j5868j9840k4242k9350l4259l8005m1075m5128
61922E958509n0761n6133n8753n8570n8095n9209o1053o1780o1058n9736n8098
61911E315263n6084n4518n4261n4397n3102n0401m8296m7757m7395m5818m3659
$$ plain form
61900 4759575 4717414 4676214 4636146 4597124 4558537 4520515 4484476 4451831 4422819 4396949 4373676
61889 4373676 4352017 4330489 4308434 4286995 4267933 4251778 4237965 4226420 4218013 4213372 4212094 4213363
61877 4213363 4216677 4221781 4228578 4237501 4249421 4264630 4282273 4301276 4321663 4344568 4371173 4402167
61865 4402167 4437959 4478636 4523486 4571305 4621809 4676547 4738011 4807898 4886448 4973303 5068721
61854 5068721 5174084 5291502 5422903 5569370 5731573 5911055 6110773 6333966 6582570
61845 6582570 6857235 7158742 7488999 7850756 8246968 8680422 9153249 9666532 10220778
61836 10220778 10816781 11454973 12133057 12844146 13576797 14315153 15037230 15713017 16305828
61827 16305828 16777497 17094592 17233179 17181989 16944101 16536252 15985420 15324216 14586743
$$ packed form
61900D759575m2161m1200m0068l9022l8587l8022l6039l2645k9012k5870k3273
61889D373676k1659k1528k2055k1439j9062j6155j3813j1545q407m641j278J269
61877D213363L314N104O797Q923J1920J5209J7643J9003K0387K2905K6605L0994
61865D402167L5792M0677M4850M7819N0504N4738O1464O9887P8550Q6855R5418
61854E068721J05363J17418J31401J46467J62203J79482J99718K23193K48604
61845F582570K74665L01507L30257L61757L96212M33454M72827N13283N54246
61836A0220778N96003O38192O78084P11089P32651P38356P22077O75787N92811
61827A6305828M71669L17095J38587n1190k37888m07849n50832o61204p37473
$$ plain form
61818 14586743 13805062 13006156 12210400 11432588 10684285 9974917 9310888 8694795 8126481
61809 8126481 7604947 7129045 6696889 6305681 5952387 5633974 5346731 5086108 4848071
61800 4848071 4630529 4432978 4254900 4094830 3950814 3821208 3704962 3601423 3509892 3429245
61790 3429245 3358219 3296174 3243122 3198475 3160260 3126315 3095991 3069838 3047755 3028467 3010982
61779 3010982 2995519 2982384 2970501 2957635 2942033 2923898 2905701 2890895 2881327 2875526 2870210 2863858
61767 2863858 2858215 2856076 2858471 2864577 2873442 2884746 2898191 2913007 2928081 2942225 2954706 2965998
61755 2965998 2977599 2990534 3004424 3018583 3033476 3050280 3069425 3090737 3115072 3144789 3182114
61744 3182114 3227465 3279584 3336934 3398927 3466390 3541210 3625333 3719824 3824599 3938697 4060737
$$ packed form
61818A4586743p81681p98906p95756p77812p48303p09368o64029o16093n68314
61809H126481n21534m75902m32156l91208l53294l18413k87243k60623k38037
61800D848071k17542j97551j78078j60070j44016j29606j16246j03539r1531q0647
61790C429245p1026o2045n3052m4647l8215l3945l0324k6153k2083j9288j7485
61779C010982j5463j3135j1883j2866j5602j8135j8197j4806r568n801n316o352
61767B863858n643k139K395O106Q865J1304J3445J4816J5074J4144J2481J1292
61755B965998J1601J2935J3890J4159J4893J6804J9145K1312K4335K9717L7325
61744C182114M5351N2119N7350O1993O7463P4820Q4123R4491J04775J14098J22040
$$ plain form
61733 4060737 4189851 4326985 4474976 4636519 4812063 5000432 5201492 5417305 5650381
61724 5650381 5901734 6171365 6460132 6770312 7104586 7465297 7854935 8276851 8735222
61715 8735222 9234601 9779676 10375042 11024690 11731791 12499481 13331926 14234051 15209762
61706 15209762 16260521 17385572 18582470 19845735 21163806 22516382 23872940 25191445
61698 25191445 26417455 27486307 28330466 28890466 29125240 29018297 28578681 27837767 26843744
61689 26843744 25654907 24332043 22931053 21498568 20072098 18682168 17352593 16099013
61681 16099013 14929160 13845710 12848599 11935084 11100054 10338250 9645810 9018798 8451225
61672 8451225 7936005 7467587 7042379 6656911 6306986 5988767 5699455 5436434 5196605
$$ packed form
61733D060737J29114J37134J47991J61543J75544J88369K01060K15813K33076
61724E650381K51353K69631K88767L10180L34274L60711L89638M21916M58371
61715H735222M99379N45075N95366O49648P07101P67690Q32445R02125R75711
61706A5209762J050759J125051J196898J263265J318071J352576J356558J318505
61698B5191445J226010J068852Q44159N60000K34774j06943m39616p40914r94023
61689B6843744j188837j322864j400990j432485j426470j389930j329575j253580
61681A6099013j169853j083450r97111r13515q35030p61804o92440o27012n67573
61672H451225n15220m68418m25208l85468l49925l18219k89312k63021k39829
$$ plain form
61663 5196605 4977021 4775551 4590491 4419867 4261561 4113952 3976294 3848400 3729769
61654 3729769 3618923 3513957 3413961 3319460 3231070 3148291 3070115 2996239 2926825 2861478 2799398
61643 2799398 2740415 2684977 2633142 2584383 2538393 2495288 2454892 2416495 2379441 2343431 2308272
61632 2308272 2274023 2241368 2211155 2183352 2156956 2131003 2105199 2079632 2054493 2030123 2006754
61621 2006754 1984193 1962286 1941540 1922518 1904703 1886771 1868083 1849177 1830724 1812950 1796219
61610 1796219 1781125 1767382 1753441 1738045 1721798 1706626 1693863 1683205 1673218 1662411 1650015
61599 1650015 1636219 1621827 1607702 1594541 1582934 1573205 1565174 1558415 1552731 1548089 1544279 1541090 1538678
61586 1538678 1537210 1536276 1535335 1534721 1535443 1537821 1541031 1544236 1547484 1551105 1554879 1558311 1561442 1564930 1569449
$$ packed form
61663E196605k19584k01470j85060j70624j58306j47609j37658j27894j18631
61654C729769j10846j04966r9996r4501q8390q2779p8176p3876o9414o5347o2080
61643B799398n8983n5438n1835m8759m5990m3105m0396l8397l7054l6010l5159
61632B308272l4249l2655l0213k7803k6396k5953k5804k5567k5139k4370k3369
61621B006754k2561k1907k0746j9022j7815j7932j8688j8906j8453j7774j6731
61610A796219j5094j3743j3941j5396j6247j5172j2763j0658r987j0807j2396
61599A650015j3796j4392j4125j3161j1607r729q031o759n684m642l810l189k412
61586A538678j468r34r41o14P22K378L210L205L248L621L774L432L131L488M519
$$ plain form
61571 1569449 1575110 1581240 1586634 1590398 1592747 1594744 1597263 1600426 1603918 1607342 1610258 1612346 1613542 1613604
61557 1613604 1611694 1607035 1599969 1591694 1582914 1573463 1563295 1552979 1542845 1532450 1521407 1510133
61545 1510133 1499183 1488240 1476347 1463040 1448909 1435136 1422660 1411774 1402456 1394911 1389250 1384453
61533 1384453 1378566 1370949 1363812 1360166 1360329 1361814 1362792 1364131 1367508 1373026 1379847 1388101 1398816 1412345
61519 1412345 1427849 1444152 1460532 1477093 1494995 1515848 1540221 1567105 1595311 1624764 1655821
61508 1655821 1688123 1721152 1755312 1791294 1828714 1866745 1905930 1947827 1992370 2036825 2078302
61497 2078302 2116661 2154099 2192250 2230506 2266957 2300132 2329566 2355408 2378099 2398219 2416073
61486 2416073 2431312 2443351 2452184 2458421 2462442 2464027 2462953 2459333 2452994 2443379 2430805 2417152 2404277
$$ packed form
61571A569449N661O130N394L764K349J997K519L163L492L424K916K088J196O2
61557A613604j910m659p066q275q780r451j0168j0316j0134j0395j1043j1274
61545A510133j0950j0943j1893j3307j4131j3773j2476j0886r318p545n661m797
61533A384453n887p617p137l646J63J485R78J339L377N518O821Q254J0715J3529
61519A412345J5504J6303J6380J6561J7902K0853K4373K6884K8206K9453L1057
61508A655821L2302L3029L4160L5982L7420L8031L9185M1897M4543M4455M1477
61497B078302L8359L7438L8151L8256L6451L3175K9434K5842K2691K0120J7854
61486B416073J5239J2039Q833O237M021J585j074l620o339r615j2574j3653j2875
$$ plain form
61473 2404277 2392272 2380391 2369239 2360471 2354444 2349922 2346547 2346006 2349990 2358439 2370740 2387312 2408769
61460 2408769 2434664 2464607 2499934 2542631 2592914 2649423 2711871 2782188 2862612 2953600 3054145
61449 3054145 3163686 3283254 3414820 3559601 3717107 3886357 4068108 4265147 4479847
61440 4479847 4712167 4960614 5224151 5501797 5790604 6085011 6377824 6660650 6923633
61431 6923633 7156352 7349717 7496829 7592716 7634845 7624309 7565487 7464162 7326599 7160176
61421 7160176 6973222 6773256 6566084 6356879 6150929 5952532 5764171 5587745 5425730
61412 5425730 5279997 5150240 5035114 4934885 4851581 4786313 4737604 4702989 4681462 4673615 4679819
61401 4679819 4699009 4729212 4768750 4816850 4873362 4938085 5010265 5088550 5171290 5256916 5344248
$$ packed form
61473B404277j2005j1881j1152q768o027m522l375n41L984Q449J2301J6572K1457
61460B408769K5895K9943L5327M2697N0283N6509O2448P0317Q0424R0988J00545
61449C054145J09541J19568J31566J44781J57506J69250J81751J97039K14700
61440D479847K32320K48447K63537K77646K88807K94407K92813K82826K62983
61431F923633K32719J93365J47112R5887M2129j0536n8822j01325j37563j66423
61421G160176j86954j99966k07172k09205k05950j98397j88361j76426j62015
61412E425730j45733j29757j15126j00229q3304o5268m8709l4615k1527p847O204
61401D679819J9190L0203L9538M8100N6512O4723P2180P8285Q2740Q5626Q7332
$$ plain form
61390 5344248 5432548 5521012 5608030 5691311 5769364 5842681 5912778 5980032 6043318 6102036 6157354
61379 6157354 6210530 6260760 6306011 6345667 6380923 6412441 6439181 6460329 6477139 6491639 6504169
61368 6504169 6513385 6518423 6519946 6519075 6516248 6511375 6504320 6494772 6482084 6465701 6445835 6423619 6400466
61355 6400466 6376968 6352407 6325907 6298300 6272301 6250264 6232143 6215977 6199780 6182503 6163999
61344 6163999 6145002 6126459 6107831 6086621 6060881 6031843 6002766 5975460 5949449 5924515 5902377
61333 5902377 5885512 5875882 5875384 5886229 5910157 5948310 6002455 6075193 6168276 6281751 6415311
61322 6415311 6569321 6743758 6937523 7150051 7382737 7637324 7913127 8206513 8512371
61313 8512371 8824961 9137712 9443273 9733783 10000540 10233824 10424056 10563558 10647527 10674328
$$ packed form
61390E344248Q8300Q8464Q7018Q3281P8053P3317P0097O7254O3286N8718N5318
61379F157354N3176N0230M5251L9656L5256L1518K6740K1148J6810J4500J2530
61368F504169R216N038J523q71k827m873p055r548j2688j6383j9866k2216k3153
61355F400466k3498k4561k6500k7607k5999k2037j8121j6166j6197j7277j8504
61344F163999j8997j8543j8628k1210k5740k9038k9077k7306k6011k4934k2138
61333E902377j6865r630m98J0845K3928L8153N4145P2738R3083J13475J33560
61322F415311J54010J74437J93765K12528K32686K54587K75803K93386L05858
61313H512371L12590L12751L05561K90510K66757K33284J90232J39502Q3969K6801
$$ plain form
61303 10674328 10645662 10565978 10440808 10275363 10074372 9842387 9583908 9303878 9008319 8703571
61293 8703571 8394497 8084370 7776826 7476596 7187417 6910430 6645798 6394969 6160170
61284 6160170 5942395 5741200 5556040 5386793 5233457 5096315 4976027 4872646 4785091 4712415
61274 4712415 4654964 4613249 4586261 4571848 4568218 4574223 4588991 4612438 4645318 4687485 4736751 4790724
61262 4790724 4849079 4912449 4979724 5048192 5116005 5182742 5247708 5309408 5366770 5419328 5466164
61251 5466164 5506202 5539590 5567248 5588966 5603664 5611741 5615300 5615305 5609958 5596717 5574804 5545092 5508772
61238 5508772 5466996 5420910 5371204 5318127 5262329 5204972 5146792 5087867 5028501 4969293 4910142
61227 4910142 4850425 4790708 4733113 4679285 4628943 4581181 4536292 4495385 4458868 4426251 4397104
$$ packed form
61303A0674328k8666p9684j25170j65445k00991k31985k58479k80030k95559l04748
61293H703571l09074l10127l07544l00230k89179k76987k64632k50829k34799
61284F160170k17775k01195j85160j69247j53336j37142j20288j03381q7555p2676
61274D712415n7451m1715k6988j4413l630O005J4768K3447L2880M2167M9266N3973
61262D790724N8355O3370O7275O8468O7813O6737O4966O1700N7362N2558M6836
61251E466164M0038L3388K7658K1718J4698Q077L559Nn347j3241k1913k9712l6320
61238E508772m1776m6086m9706n3077n5798n7357n8180n8925n9366n9208n9151
61227D910142n9717n9717n7595n3828n0342m7762m4889m0907l6517l2617k9147
$$ plain form
61216 4397104 4371499 4349594 4331067 4314639 4298076 4279238 4257518 4233853 4209395 4184872 4161312
61205 4161312 4140299 4122934 4109251 4099167 4093415 4093024 4098404 4109364 4125540 4146405 4171422 4200705
61193 4200705 4235358 4276979 4327250 4387992 4460813 4546088 4642584 4748387 4861922 4981919 5106798
61182 5106798 5234184 5360530 5480801 5588654 5677105 5739317 5769644 5764832 5724274 5648834 5540101
61171 5540101 5401523 5239630 5062719 4878144 4691329 4506580 4327175 4154706 3989897
61162 3989897 3834337 3690260 3558502 3438080 3328069 3228523 3139173 3058679 2985943 2921100
61152 2921100 2864506 2815659 2773551 2737224 2705640 2678064 2654831 2636643 2622985 2612659 2606176
61141 2606176 2605811 2612544 2624706 2640702 2661358 2687949 2719100 2751224 2781295 2807844 2830023 2847226
$$ packed form
61216D397104k5605k1905j8527j6428j6563j8838k1720k3665k4458k4523k3560
61205D161312k1013j7365j3683j0084n752l91N380J0960J6176K0865K5017K9283
61193D200705L4653M1621N0271O0742P2821Q5275R6496J05803J13535J19997J24879
61182E106798J27386J26346J20271J07853Q8451O2212L0327m812m0558p5440j08733
61171E540101j38578j61893j76911j84575j86815j84749j79405j72469j64809
61162C989897j55560j44077j31758j20422j10011r9546q9350q0494p2736o4843
61152B921100n6594m8847m2108l6327l1584k7576k3233j8188j3658j0326o483
61141B606176l65O733J2162J5996K0656K6591L1151L2124L0071K6549K2179J7203
$$ plain form
61129 2847226 2859424 2866918 2870100 2870104 2868801 2867162 2864246 2858665 2850178 2838898 2824096 2805194 2783247
61116 2783247 2759936 2735657 2709969 2683267 2656322 2628380 2597457 2562651 2524810 2484775 2442432
61105 2442432 2397908 2352488 2307612 2263622 2219944 2175974 2131475 2086640 2042242 1999452 1959187
61094 1959187 1921582 1886110 1852271 1820355 1791391 1765821 1742224 1718117 1692212 1665041 1637041
61083 1637041 1607240 1574859 1541379 1509724 1481648 1456832 1434269 1413571 1394920 1378586 1364674
61072 1364674 1353052 1343533 1336317 1331864 1330157 1330615 1332956 1337396 1343736 1351179 1359569 1369737 1381916
61059 1381916 1394910 1407901 1422035 1438903 1458133 1477848 1496965 1515744 1534513 1553280 1572436
61048 1572436 1592558 1613478 1634432 1654928 1674590 1692566 1708236 1722061 1734490 1744296 1749466 1749773
$$ packed form
61129B847226J2198P494L182Mj303j639k916n581q487j1280j4802j8902k1947
61116B783247k3311k4279k5688k6702k6945k7942l0923l4806l7841m0035m2343
61105B442432m4524m5420m4876m3990m3678m3970m4499m4835m4398m2790m0265
61094A959187l7605l5472l3839l1916k8964k5570k3597k4107k5905k7171k8000
61083A637041k9801l2381l3480l1655k8076k4816k2563k0698j8651j6334j3912
61072A364674j1622r519p216m453j707M58K341M440O340P443Q390J0168J2179
61059A381916J2994J2991J4134J6868J9230J9715J9117J8779J8769J8767J9156
61048A572436K0122K0920K0954K0496J9662J7976J5670J3825J2429R806N170L07
$$ plain form
61036 1749773 1747228 1743847 1740073 1735466 1729722 1722672 1714272 1705015 1695740 1686840 1678234 1670001 1662330 1654903
61022 1654903 1647130 1638971 1630739 1622173 1612410 1600924 1587876 1573758 1559333 1545612 1533046 1521016
61010 1521016 1508874 1497188 1487045 1478528 1470819 1463464 1456461 1449462 1442084 1434844 1428598 1423231 1418018
60997 1418018 1413130 1409509 1407274 1405375 1402931 1400039 1397518 1396823 1399633 1406045 1413450 1418840 1422274 1426654
60983 1426654 1434158 1444453 1456347 1469336 1483091 1497082 1511302 1526166 1541330 1555944 1570311
60972 1570311 1585908 1603465 1622544 1643328 1667235 1695219 1726895 1761764 1799783 1840261 1881956
60961 1881956 1925002 1971156 2021305 2074173 2128404 2184531 2244067 2307876 2376150 2448655 2524334
60950 2524334 2602114 2682811 2768856 2861668 2960994 3067268 3182277 3306490 3438156 3576668
$$ packed form
61036A749773k545l381l774m607n744p050q400r257r275q900q606q233p671p427
61022A654903p773q159q232q566r763j1486j3048j4118j4425j3721j2566j2030
61010A521016j2142j1686j0143q517p709p355p003o999p378p240o246n367n213
60997A418018m888l621k235j899k444k892k521o95K810O412P405N390L434M380
60983A426654P504J0295J1894J2989J3755J3991J4220J4864J5164J4614J4367
60972A570311J5597J7557J9079K0784K3907K7984L1676L4869L8019M0478M1695
60961A881956M3046M6154N0149N2868N4231N6127N9536O3809O8274P2505P5679
60950B524334P7780Q0697Q6045R2812R9326J06274J15009J24213J31666J38512
$$ plain form
60940 3576668 3724757 3885613 4059685 4246102 4445294 4658135 4884331 5124127 5380368
60931 5380368 5656758 5955458 6278520 6630153 7015171 7436578 7897088 8401657 8956295
60922 8956295 9566740 10241637 10994963 11841425 12791393 13854595 15046273 16383843 17880733
60913 17880733 19553511 21435763 23575243 26016870 28801336 31975402 35555173 39417052
60905 39417052 43210935 46436162 48683211 49854667 50175671 50013294 49699299 49483642 49544513
60896 49544513 49924425 50420331 50594962 49983624 48350930 45785159 42583725 39071504 35498907
60887 35498907 32034957 28787565 25813002 23126702 20723823 18594052 16721946 15084774
60879 15084774 13657316 12417054 11342810 10411670 9600220 8887578 8256169 7691589 7183223
$$ packed form
60940C576668J48089J60856J74072J86417J99192K12841K26196K39796K56241
60931E380368K76390K98700L23062L51633L85018M21407M60510N04569N54638
60922H956295O10445O74897P53326Q46462R49968J063202J191678J337570J496890
60913A7880733J672778J882252K139480K441627K784466L174066L579771L861879
60905C9417052L793883L225227K247049J171456L21004j62377l13995k15657O0871
60896D9544513L79912M95906J74631o11338j632694k565771l201434l512221l572597
60887C5498907l463950l247392k974563k686300k402879k129771j872106j637172
60879A5084774j427458j240262j074244r31140q11450p12642o31409n64580n08366
$$ plain form
60870 7183223 6723606 6306140 5924612 5575094 5256154 4966149 4701842 4460304 4239987
60861 4239987 4038523 3851214 3673426 3503439 3341624 3187984 3042065 2904224 2775165
60852 2775165 2654557 2541567 2436438 2340110 2252310 2171243 2095352 2024525 1959359 1899943 1845540
60841 1845540 1795118 1748111 1704808 1665771 1630713 1598419 1567961 1539334 1512674 1487749 1464818
60830 1464818 1444953 1428663 1415061 1403410 1394472 1388923 1385282 1381222 1376497 1372699 1370185 1367330 1363137
60817 1363137 1358541 1354286 1349407 1343064 1336337 1330576 1324946 1317177 1306195 1292636 1277386 1261150 1245169
60804 1245169 1230803 1218142 1206153 1194272 1182828 1171794 1160434 1148687 1138018 1130294 1126414 1126241
60792 1126241 1129019 1133337 1137545 1141122 1145328 1151877 1161204 1172582 1185650 1201122 1219922 1242112 1266808
$$ packed form
60870G183223m59617m17466l81528l49518l18940k90005k64307k41538k20317
60861D239987k01464j87309j77788j69987j61815j53640j45919j37841j29059
60852B775165j20608j12990j05129r6328q7800q1067p5891p0827o5166n9416n4403
60841A845540n0422m7007m3303l9037l5058l2294l0458k8627k6660k4925k2931
60830A464818j9865j6290j3602j1651q938n549l641m060m725l798k514k855m193
60817A363137m596m255m879o343o727n761n630p769j0982j3559j5250j6236j5981
60804A245169j4366j2661j1989j1881j1444j1034j1360j1747j0669p724l880j73
60792A126241K778M318M208L577M206O549R327J1378J3068J5472J8800K2190K4696
$$ plain form
60779 1266808 1292891 1319665 1346931 1374400 1401099 1425591 1446927 1465221 1481178 1495468 1508787
60768 1508787 1522122 1536239 1550800 1564271 1574854 1581423 1583772 1582407 1578263 1572484 1566219 1560447 1555607
60755 1555607 1551215 1546083 1539338 1531186 1522409 1513283 1503390 1492423 1480571 1467970 1454228 1438735 1421091
60742 1421091 1401143 1379132 1356104 1333607 1312413 1291957 1271686 1252534 1236120 1222601 1210436
60731 1210436 1198574 1187949 1180157 1175421 1172684 1171288 1171535 1173678 1177172 1181193 1185414 1190100 1195913 1203729
60717 1203729 1214123 1226731 1240455 1254572 1269362 1285498 1303236 1322507 1343436 1366146 1390093
60706 1390093 1414040 1436871 1458258 1478499 1497915 1516510 1534036 1550211 1564913 1578296 1590777
60695 1590777 1602836 1614700 1626100 1636327 1644655 1650877 1655504 1659398 1663054 1666175 1668054 1668479 1668101
$$ packed form
60779A266808K6083K6774K7266K7469K6699K4492K1336J8294J5957J4290J3319
60768A508787J3335J4117J4561J3471J0583O569K349j365m144n779o265n772m840
60755A555607m392n132o745q152q777r126r893j0967j1852j2601j3742j5493j7644
60742A421091j9948k2011k3028k2497k1194k0456k0271j9152j6414j3519j2165
60731A210436j1862j0625p792m736k737j396K47K143L494M021M221M686N813P816
60717A203729J0394J2608J3724J4117J4790J6136J7738J9271K0929K2710K3947
60706A390093K3947K2831K1387K0241J9416J8595J7526J6175J4702J3383J2481
60695A590777J2059J1864J1400J0227Q328O222M627L894L656L121J879M25l78
$$ plain form
60682 1668101 1667669 1667051 1665344 1661859 1656541 1649310 1639651 1627233 1612581 1596741 1580527 1564326 1548188
60669 1548188 1531686 1514071 1495136 1475608 1456268 1437225 1418682 1401905 1388372 1378121 1369789
60658 1369789 1362201 1355136 1348848 1343971 1341784 1343193 1347151 1351253 1354302 1357195 1360978 1365352 1369680 1374035
60644 1374035 1378144 1380539 1380184 1378240 1376852 1376669 1376814 1376886 1377488 1378766 1379678 1379112 1376995 1374046 1371019 1368246
60628 1368246 1365363 1361407 1355534 1347558 1337460 1324883 1309816 1293332 1276691 1259803 1241481 1221289
60616 1221289 1200352 1180266 1161927 1145475 1130598 1116685 1103342 1091065 1080851 1072911 1066232 1059625
60604 1059625 1052946 1047189 1043712 1043264 1045302 1048239 1050807 1053227 1056709 1061960 1068688 1076337 1084539 1092762
60590 1092762 1100289 1106841 1112828 1118777 1124896 1131238 1137791 1144236 1150058 1155114 1159823 1164706 1169919 1175157
$$ packed form
60682A668101m32o18j707l485n318p231r659j2418j4652j5840j6214j6201j6138
60669A548188j6502j7615j8935j9528j9340j9043j8543j6777j3533j0251q332
60658A369789p588p065o288m877k187J409L958M102L049K893L783M374M328M355
60644A374035M109K395l55j944j388j83J45P2O02J278R12n66k117k949l027k773
60628A368246k883l956n873p976j0098j2577j5067j6484j6641j6888j8322k0192
60616A221289k0937k0086j8339j6452j4877j3913j3343j2277j0214p940o679o607
60604A059625o679n757l477m48K038K937K568K420L482N251O728P649Q202Q223
60590A092762P527O552N987N949O119O342O553O445N822N056M709M883N213N238
$$ plain form
60576 1175157 1179827 1183580 1187129 1192297 1200543 1211419 1223110 1234546 1246400 1259823 1274765 1289974
60564 1289974 1304423 1318507 1333825 1351789 1372354 1394189 1416093 1437830 1459474 1480525 1500140
60553 1500140 1517797 1533132 1545567 1554770 1561320 1566330 1570544 1574026 1576191 1575709 1571165 1562767 1552844
60540 1552844 1543709 1535481 1526902 1517609 1508224 1498531 1487184 1473384 1457669 1440950 1423881 1407321
60528 1407321 1392290 1379229 1368091 1359066 1352252 1346963 1342693 1340478 1341631 1345116 1348083 1349407 1350850
60515 1350850 1354069 1358302 1361989 1364941 1367585 1369496 1370259 1370773 1372236 1374552 1377055 1380075 1384400 1389762
60501 1389762 1395363 1401638 1410107 1421334 1434084 1446689 1458413 1469235 1478945 1486939 1492906 1497680 1503220
60488 1503220 1511289 1522021 1534197 1546823 1559809 1573339 1587811 1604659 1625897 1652111 1681998
$$ packed form
60576A175157M670L753L549N168Q246J0876J1691J1436J1854J3423J4942J5209
60564A289974J4449J4084J5318J7964K0565K1835K1904K1737K1644K1051J9615
60553A500140J7657J5335J2435R203O550N010M214L482K165m82m544q398r923
60540A552844r135q228q579r293r385r693j1347j3800j5715j6719j7069j6560
60528A407321j5031j3061j1138r025o814n289m270k215J153L485K967J324J443
60515A350850L219M233L687K952K644J911P63N14J463K316K503L020M325N362
60501A389762N601O275Q469J1227J2750J2605J1724J0822R710P994N967M774N540
60488A503220Q069J0732J2176J2626J2986J3530J4472J6848K1238K6214K9887
$$ plain form
60477 1681998 1714681 1751361 1793764 1842118 1895948 1955859 2022724 2095338 2170262 2243730 2312323
60466 2312323 2371903 2417655 2446236 2457337 2452796 2434787 2405235 2366419 2321457 2274062 2227821
60455 2227821 2185571 2149364 2120790 2100968 2090124 2087571 2092334 2103525 2120174 2141266 2166284 2195309
60443 2195309 2228428 2265335 2305636 2349117 2395929 2447277 2505802 2574206 2653243 2742131 2841191
60432 2841191 2952978 3080323 3224439 3385446 3563398 3757794 3967122 4189988 4425927
60423 4425927 4674309 4933606 5203206 5485514 5785346 6107654 6455988 6830859 7226528
60414 7226528 7628478 8014650 8359251 8635833 8819612 8891068 8840033 8667608 8385495 8014151
60404 8014151 7579645 7108825 6624937 6146033 5685115 5250041 4844150 4468897 4126076
$$ packed form
60477A681998L2683L6680M2403M8354N3830N9911O6865P2614P4924P3468O8593
60466B312323N9580M5752K8581J1101m541j8009k9552l8816m4962m7395m6241
60455B227821m2250l6207k8574j9822j0844k553M763J1191J6649K1092K5018K9025
60443B195309L3119L6907M0301M3481M6812N1348N8525O8404P9037Q8888R9060
60432B841191J11787J27345J44116J61007J77952J94396K09328K22866K35939
60423D425927K48382K59297K69600K82308K99832L22308L48334L74871L95669
60414G226528M01950L86172L44601K76582J83779P1456n1035j72425k82113l71344
60404H014151m34506m70820m83888m78904m60918m35074m05891l75253l42821
$$ plain form
60395 4126076 3816841 3539685 3291226 3068789 2870799 2695084 2538530 2398481 2273067
60386 2273067 2160238 2058031 1965908 1884298 1812476 1748183 1689569 1636305 1588477 1545503 1506436
60375 1506436 1470303 1435951 1402611 1370818 1341835 1316064 1292894 1271924 1253033 1235331 1217524
60364 1217524 1199617 1182970 1168372 1155381 1143833 1134495 1127588 1121984 1116631 1111703 1107712 1104565 1102268
60351 1102268 1101561 1102917 1105646 1108753 1112082 1115915 1120000 1123678 1126623 1129001 1131268 1134141 1138277 1143660
60337 1143660 1149689 1155979 1162490 1168921 1174834 1180663 1187707 1196682 1206852 1216815 1225482 1232185 1236882 1240688
60323 1240688 1245307 1251275 1257289 1261702 1264114 1265205 1265697 1265955 1266039 1265672 1264559 1262890 1261066 1258929 1256019
60308 1256019 1252662 1249889 1248109 1246772 1245631 1245304 1246221 1247994 1250395 1253998 1259204 1265401 1271652 1277517
$$ packed form
60395D126076l09235k77156k48459k22437j97990j75715j56554j40049j25414
60386B273067j12829j02207r2123q1610p1822o4293n8614n3264m7828m2974l9067
60375A506436l6133l4352l3340l1793k8983k5771k3170k0970j8891j7702j7807
60364A217524j7907j6647j4598j2991j1548r338o907n604n353m928l991l147k297
60351A102268p07J356K729L107L329L833M085L678K945K378K267K873M136N383
60337A143660O029O290O511O431N913N829P044Q975J0170R963Q667O703M697L806
60323A240688M619N968O014M413K412J091M92K58Q4l67j113j669j824k137k910
60308A256019l357k773j780j337j141l27R17J773K401L603N206O197O251N865
$$ plain form
60294 1277517 1282818 1287538 1292529 1299295 1308237 1317937 1326969 1335676 1345286 1356104 1367629 1379771 1392668
60281 1392668 1405628 1417572 1428535 1439626 1451184 1461854 1470014 1475657 1480372 1485526 1490765 1494430
60269 1494430 1495374 1494141 1492339 1491235 1491365 1493039 1496431 1501248 1506982 1513519 1520759 1527756 1533096 1536239
60255 1536239 1537609 1537213 1534176 1527935 1519011 1508312 1496654 1485255 1475577 1468015 1461583 1455332 1449135
60242 1449135 1442693 1435193 1426853 1419509 1414354 1410028 1404437 1397798 1392290 1389040 1387069 1385318 1384187 1384477
60228 1384477 1385848 1387137 1387785 1388372 1389844 1392470 1395546 1398085 1399888 1401830 1404995 1409600 1414909 1420160
60214 1420160 1425555 1432319 1441632 1453345 1466154 1479275 1493296 1508630 1523959 1537690 1550813 1566556
60202 1566556 1586695 1609618 1632757 1655634 1679611 1705831 1734629 1766138 1800324 1836945 1876485
$$ packed form
60294A277517N301M720M991O766Q942R700R032Q707R610J0818J1525J2142J2897
60281A392668J2960J1944J0963J1091J1558J0670Q160N643M715N154N239L665
60269A494430R44j233j802j104J30J674L392M817N734O537P240O997N340L143
60255A536239J370l96l037o241q924j0699j1658j1399r678p562o432o251o197
60242A449135o442p500q340p344n155m326n591o639n508l250j971j751j131K90
60228A384477J371J289O48N87J472K626L076K539J803J942L165M605N309N251
60214A420160N395O764R313J1713J2809J3121J4021J5334J5329J3731J3123J5743
60202A566556K0139K2923K3139K2877K3977K6220K8798L1509L4186L6621L9540
$$ plain form
60191 1876485 1920558 1970410 2025492 2084416 2146853 2213580 2285211 2361943 2444287 2533044 2628806
60180 2628806 2732178 2844029 2964609 3092820 3227335 3367909 3514412 3665029 3816940
60171 3816940 3968758 4120753 4272255 4420121 4560474 4690935 4810441 4917748 5011224 5089796
60161 5089796 5153158 5200867 5232066 5246657 5246558 5235225 5215739 5189661 5158052 5123117 5088218 5056301
60149 5056301 5028933 5006960 4991600 4984847 4989287 5007411 5040386 5087560 5147956 5222064 5311108 5414705
60137 5414705 5530727 5657647 5795109 5941435 6092331 6243246 6391427 6534265 6667253
60128 6667253 6785656 6887172 6970928 7034792 7076159 7094987 7093465 7072424 7030463 6967377 6886456
60117 6886456 6792347 6688425 6577658 6464823 6356187 6257058 6170317 6096907 6037087 5991539
$$ packed form
60191A876485M4073M9852N5082N8924O2437O6727P1631P6732Q2344Q8757R5762
60180B628806J03372J11851J20580J28211J34515J40574J46503J50617J51911
60171C816940J51818J51995J51502J47866J40353J30461J19506J07307R3476P8572
60161E089796O3362M7709L1199J4591r9j1333j9486k6078l1609l4935l4899l1917
60149E056301k7368k1973j5360o753M440J8124L2975M7174O0396P4108Q9044J03597
60137E414705J16022J26920J37462J46326J50896J50915J48181J42838J32988
60128F667253J18403J01516Q3756O3864M1367J8828j522k1041m1961o3086q0921
60117F886456r4109j03922j10767j12835j08636r9129q6741p3410n9820m5548
$$ plain form
60107 5991539 5961780 5949349 5954458 5975962 6012875 6065358 6133968 6218354 6316704 6425600 6540060
60096 6540060 6654457 6764107 6865849 6957205 7035777 7099906 7149300 7184573 7206712 7217477 7219757
60085 7219757 7216885 7211984 7208536 7211127 7224695 7252928 7297960 7361731 7446993 7556606 7692208 7854182
60073 7854182 8042923 8259742 8506425 8784381 9094486 9437241 9812388 10218404 10653084
60064 10653084 11114568 11600994 12108772 12631710 13162066 13691706 14212000 14713608 15187308
60055 15187308 15624665 16017383 16356772 16634763 16845164 16983307 17045189 17028133 16932062 16759257
60045 16759257 16513390 16200196 15829235 15413801 14968486 14507126 14042456 13586012 13147249
60036 13147249 12733056 12348553 11998237 11686384 11416657 11191241 11009971 10870521 10769980
$$ packed form
60107E991539k9759j2431N109K1504L6913N2483O8610Q4386R8350J08896J14460
60096F540060J14397J09650J01742R1356P8572O4129M9394L5273K2139J0765K280
60085G219757k872m901l448K591J3568K8233M5032O3771Q5262J09613J35602J61974
60073G854182J88741K16819K46683K77956L10105L42755L75147M06016M34680
60064A0653084M61484M86426N07778N22938N30356N29640N20294N01608M73700
60055A5187308M37357L92718L39389K77991K10401J38143O1882j7056r6071j72805
60045A6759257k45867l13194l70961m15434m45315m61360m64670m56444m38763
60036A3147249m14193l84503l50316l11853k69727k25416j81270j39450j00541
$$ plain form
60027 10769980 10706000 10676055 10676328 10702291 10749683 10813455 10885949 10957852 11021417 11071672 11104565
60016 11104565 11116001 11103853 11069621 11016493 10946096 10857971 10751657 10628291 10490354 10340585
60006 10340585 10181014 10012471 9835155 9649952 9458889 9264043 9066719 8868373 8671896
59997 8671896 8481151 8299425 8128911 7971540 7829496 7704874 7599399 7514565 7451505 7410506
59987 7410506 7391120 7393145 7417305 7464611 7534929 7626343 7736076 7861864 8002038 8154042 8313244
59976 8313244 8473840 8630931 8781149 8921083 9045706 9149018 9226232 9275048 9294911 9285507
59966 9285507 9246208 9176884 9079007 8955784 8811206 8649175 8473688 8289602 8102737 7918977
59956 7918977 7743246 7579250 7429850 7297413 7183782 7090036 7016564 6963687 6932253 6923314
$$ packed form
60027A0769980o3980k9945K73K5963M7392O3772P2494P1903O3565N0255L2893
60016A1104565J1436j2148l4232n3128p0397q8125j06314j23366j37937j49769
60006A0340585j59571j68543j77316j85203j91063j94846j97324j98346j96477
59997H671896j90745j81726j70514j57371j42044j24622j05475q4834o3060m0999
59987G410506j9386K025K4160M7306P0318R1414J09733J25788J40174J52004J59202
59976H313244J60596J57091J50218J39934J24623J03312P7214M8816J9863r404
59966I285507l9299o9324r7877j23223j44578j62031j75487j84086j86865j83760
59956G918977j75731j63996j49400j32437j13631r3746p3472n2877l1434q939
$$ plain form
59946 6923314 6937206 6973365 7031304 7111342 7213870 7338191 7482665 7645911 7827324 8026239
59936 8026239 8240706 8466715 8697987 8926547 9144262 9344479 9522430 9674511 9797749
59927 9797749 9890019 9950211 9977817 9972506 9934393 9864744 9766318 9642908 9498432 9336754 9162770
59916 9162770 8983474 8806984 8639843 8485604 8346326 8224747 8124272 8047505 7995773 7969751
59906 7969751 7969398 7993351 8039544 8106792 8194877 8302847 8428204 8568261 8721434 8886431 9060632
59895 9060632 9239885 9419511 9595117 9763120 9921522 10070132 10209359 10338888 10458282
59886 10458282 10568846 10673939 10776987 10879995 10984826 11095543 11218483 11359889 11524160
59877 11524160 11714423 11933685 12184597 12468612 12786280 13138125 13524288 13943059 14389990
$$ packed form
59946F923314J3892L6159N7939Q0038J02528J24321J44474J63246J81413J98915
59936H026239K14467K26009K31272K28560K17715K00217J77951J52081J23238
59927I797749R2270O0192K7606n311l8113o9649r8426j23410j44476j61678j73984
59916I162770j79296j76490j67141j54239j39278j21579j00475p6767n1732k6022
59906G969751l53K3953M6193O7248Q8085J07970J25357J40057J53173J64997J74201
59895I060632J79253J79626J75606J68003J58402J48610J39227J29529J19394
59886A0458282J10564J05093J03048J03008J04831J10717J22940J41406J64271
59877A1524160J90263K19262K50912K84015L17668L51845L86163M18771M46931
$$ plain form
59868 14389990 14857890 15336686 15813338 16272778 16699120 17075510 17383656 17605842 17728945
59859 17728945 17746532 17657611 17465340 17177977 16809561 16377622 15899867 15392947 14872676 14353207
59849 14353207 13845641 13358181 12897600 12469994 12080525 11733096 11430026 11171658 10957054
59840 10957054 10785899 10659019 10576302 10534986 10531172 10562339 10627137 10723346 10847398 10995217
59830 10995217 11161622 11338845 11517167 11687261 11840662 11967998 12058423 12101679 12090209 12019563
59820 12019563 11888227 11697704 11452090 11157419 10821898 10456117 10071178 9675967 9277018
59811 9277018 8880829 8494646 8124343 7772780 7441026 7130295 6842036 6576957 6334790
59802 6334790 6114739 5915845 5737332 5578790 5439617 5318471 5213981 5125775 5053800 4996667
$$ packed form
59868A4389990M67900M78796M76652M59440M26342L76390L08146K22186J23103
59859A7728945J7587q8921j92271k87363l68416m31939m77755n06920n20271n19469
59849A4353207n07566m87460m60581m27606l89469l47429l03070k58368k14604
59840A0957054j71155j26880q2717m1316l814L1167O4798R6209J24052J47819
59830A0995217J66405J77223J78322J70094J53401J27336R0425M3256j1470p0646
59820A2019563j31336j90523k45614k94671l35521l65781l84939l95211l98949
59811I277018l96189l86183l70303l51563l31754l10731k88259k65079k42167
59802F334790k20051j98894j78513j58542j39173j21146j04490q8206p1975n7133
$$ plain form
59792 4996667 4951725 4916679 4889878 4868957 4850762 4833213 4816094 4799400 4782106 4763233 4743088
59781 4743088 4722645 4702520 4683126 4664724 4646350 4625413 4599308 4567110 4529230 4486209 4438620
59770 4438620 4387531 4334121 4279144 4223417 4168581 4116818 4070005 4029494 3996351 3971231 3954131
59759 3954131 3944667 3942756 3948984 3964154 3987878 4017333 4048236 4078157 4108778 4144094 4186770 4237196
59747 4237196 4295331 4361423 4434505 4511814 4590600 4669591 4748311 4826039 4901864 4974606 5042225
59736 5042225 5102563 5155326 5202307 5245082 5283618 5317729 5348611 5378126 5407838 5439819 5477331
59725 5477331 5523371 5579132 5644834 5721541 5811277 5915920 6036825 6175154 6332031 6508843
59715 6508843 6707697 6930854 7179426 7453605 7754509 8084408 8444413 8833235 9248927
$$ packed form
59792D996667m4942l5046k6801k0921j8195j7549j7119j6694j7294j8873k0145
59781D743088k0443k0125j9394j8402j8374k0937k6105l2198l7880m3021m7589
59770D438620n1089n3410n4977n5727n4836n1763m6813m0511l3143k5120j7100
59759C954131r464j911O228J5170K3724K9455L0903K9921L0621L5316M2676N0426
59747D237196N8135O6092P3082P7309P8786P8991P8720P7728P5825P2742O7619
59736E042225O0338N2763M6981M2775L8536L4111L0882K9515K9712L1981L7512
59725E477331M6040N5761O5702P6707Q9736J04643J20905J38329J56877J76812
59715F508843J98854K23157K48572K74179L00904L29899L60005L88822M15692
$$ plain form
59706 9248927 9689807 10151041 10619792 11074030 11485506 11824390 12064832 12190942 12199997 12100689
59696 12100689 11909278 11647378 11340160 11012267 10683373 10367323 10074069 9810551 9580381
59687 9580381 9385149 9226762 9107342 9026840 8982478 8971188 8991469 9042467 9122681 9230609
59677 9230609 9365986 9529534 9721867 9943253 10194182 10475661 10788865 11134589 11513002
59668 11513002 11924101 12368764 12849330 13368901 13930178 14535235 15186173 15885394 16634921
59659 16634921 17435516 18286330 19185166 20128892 21113414 22132988 23179557 24242811 25310577
59650 25310577 26369036 27403879 28403491 29362168 30280148 31160915 32009556 32833203 33640515
59641 33640515 34438775 35231660 36019584 36799935 37565046 38300782 38988988 39611535 40151837
$$ packed form
59706I248927M40880M61234M68751M54238M11476L38884K40442J26110R055r9308
59696A2100689j91411k61900l07218l27893l28894l16050k93254k63518k30170
59687I580381j95232j58387j19420q0502m4362j1290K0281N0998Q0214J07928
59677I230609J35377J63548J92333K21386K50929K81479L13204L45724L78413
59668A1513002M11099M44663M80566N19571N61277O05057O50938O99221P49527
59659A6634921Q00595Q50814Q98836R43726R84522J019574J046569J063254J067766
59650B5310577J058459J034843R99612R58677R17980Q80767Q48641Q23647Q07312
59641C3640515P98260P92885P87924P80351P65111P35736O88206O22547N40302
$$ plain form
59632 40151837 40594443 40926220 41139321 41232929 41212881 41090838 40883520 40611076 40295037 39957357
59622 39957357 39620149 39304535 39028920 38808487 38655991 38582314 38596319 38704870 38913377 39226315
59612 39226315 39647470 40179535 40822611 41572447 42420185 43353409 44355797 45404558 46468600
59603 46468600 47509565 48483952 49344280 50040841 50525943 50759030 50710526 50365181 49725681
59594 49725681 48813612 47665317 46325463 44842782 43267482 41647291 40022996 38427126
59586 38427126 36885659 35418915 34040456 32756551 31567327 30467502 29445438 28482159
59578 28482159 27552245 26627129 25680649 24695488 23667266 22603735 21520590 20437218 19373395
59569 19373395 18346108 17367255 16443884 15580168 14778579 14039714 13362180 12743142 12179071
$$ packed form
59632D0151837M42606L31777K13101R3608k0048j22043k07318k72444l16039l37680
59622C9957357l37208l15614k75615k20433j52496p3677J4005J08551K08507L12938
59612C9226315M21155N32065O43076P49836Q47738R33224J002388J048761J064042
59603D6468600J040965R74387Q60328O96561M85102K33087m8504l45345o39500
59594D9725681r12069j148295j339854j482681j575300j620191j624295j595870
59586C8427126j541467j466744j378459j283905j189224j099825j022064r63279
59578B8482159r29914r25116r46480r85161j028222j063531j083145j083372j063823
59569A9373395j027287r78853r23371q63716q01589p38865o77534o19038n64071
$$ plain form
59560 12179071 11666596 11203117 10785893 10410076 10068865 9756905 9472807 9217141 8988599
59551 8988599 8783484 8598102 8429711 8275262 8131125 7994402 7863108 7734860 7606818
59542 7606818 7477290 7346161 7213388 7078289 6940777 6802160 6664004 6527015 6391579
59533 6391579 6258705 6129948 6007027 5891918 5786611 5692079 5607667 5531982 5464456 5406004
59523 5406004 5358225 5321946 5296536 5280866 5274815 5279136 5293694 5316613 5345727 5380208 5420174 5465357
59511 5465357 5514848 5567693 5623176 5681098 5742255 5807927 5878417 5952910 6031214 6114519 6203905
59500 6203905 6299640 6402946 6516825 6643630 6783052 6934080 7097606 7275431 7468152 7676199
59490 7676199 7901780 8147225 8412208 8695018 8995752 9315381 9652065 10001586 10361609
$$ packed form
59560A2179071n12475m63479m17224l75817l41211l11960k84098k55666k28542
59551H988599k05115j85382j68391j54449j44137j36723j31294j28248j28042
59542G606818j29528j31129j32773j35099j37512j38617j38156j36989j35436
59533F391579j32874j28757j22921j15109j05307r4532q4412p5685o7526n8452
59523E406004m7779l6279k5410j5670o051M321J4558K2919K9114L4481L9966M5183
59511E465357M9491N2845N5483N7922O1157O5672P0490P4493P8304Q3305Q9386
59500F203905R5735J03306J13879J26805J39422J51028J63526J77825J92721K08047
59490G676199K25581K45445K64983K82810L00734L19629L36684L49521L60023
$$ plain form
59481 10361609 10732371 11112384 11496132 11876941 12249578 12608980 12949110 13265239 13556081
59472 13556081 13822232 14063442 14277994 14463137 14615203 14730987 14810645 14858550 14880769 14882966
59462 14882966 14871272 14853228 14836199 14825801 14826973 14845500 14887068 14955404 15052071 15176946 15327415
59451 15327415 15497399 15677912 15858048 16024870 16163549 16259216 16299197 16273723 16175804 16001584
59441 16001584 15750679 15425888 15033237 14582619 14087354 13561955 13020112 12474349 11936226
59432 11936226 11415859 10921422 10459179 10033119 9644439 9292511 8977091 8698969 8458204
59423 8458204 8252724 8079312 7935321 7819042 7729409 7666180 7629782 7620272 7636696 7677763 7742710
59412 7742710 7831338 7943792 8080479 8241506 8425837 8631506 8856659 9099720 9358518 9630018
$$ packed form
59481A0361609L70762L80013L83748L80809L72637L59402L40130L16129K90842
59472A3556081K66151K41210K14552J85143J52066J15784P9658M7905K2219K197
59462A4882966j1694j8044j7029j0398J172J8527M1568O8336R6667J24875J50469
59451A5327415J69984J80513J80136J66822J38679R5667L9981k5474r7919j74220
59441A6001584k50905l24791l92651m50618m95265n25399n41843n45763n38123
59432A1936226n20367m94437m62243m26060l88680l51928l15420k78122k40765
59423H458204k05480j73412j43991j16279q9633o3229l6398r510J6424M1067O4947
59412G742710Q8628J12454J36687J61027J84331K05669K25153K43061K58798K71500
$$ plain form
59402 9630018 9910846 10196914 10482038 10757692 11014557 11243851 11437083 11585441 11680258 11714434
59392 11714434 11684098 11589584 11434624 11224224 10963872 10661019 10325698 9968036 9595789 9215464
59382 9215464 8834485 8460003 8096259 7745336 7409979 7093322 6796252 6517838 6258592
59373 6258592 6020647 5804281 5606847 5425850 5260833 5111585 4976973 4856429 4750283
59364 4750283 4657633 4576122 4504787 4444931 4397170 4359922 4331845 4313328 4304261 4302834 4308041 4321026
59352 4321026 4342301 4370035 4402939 4442510 4490474 4546272 4608993 4678945 4754347 4828739 4895449
59341 4895449 4953915 5009164 5066421 5128952 5199658 5281186 5374774 5481681 5604911 5746203 5901402
59330 5901402 6062162 6223060 6385244 6553510 6732676 6927153 7141063 7377241 7637500
$$ packed form
59402I630018K80828K86068K85124K75654K56865K29294J93232J48358R4817L4176
59392A1714434l0336r4514j54960k10400k60352l02853l35321l57662l72247l80325
59382I215464l80979l74482l63744l50923l35357l16657k97070k78414k59246
59373F258592k37945k16366j97434j80997j65017j49248j34612j20544j06146
59364D750283r2650q1511p1335n9856m7761l7248k8077j8517r067j427N207J2985
59352D321026K1275K7734L2904L9571M7964N5798O2721O9952P5402P4392O6710
59341D895449N8466N5249N7257O2531P0706Q1528R3588J06907J23230J41292J55199
59330E901402J60760J60898J62184J68266J79166J94477K13910K36178K60259
$$ plain form
59321 7637500 7924413 8241361 8590545 8972735 9389402 9843463 10337476 10872689 11450213
59312 11450213 12071226 12735035 13438041 14174936 14939291 15722014 16510515 17290545 18048533
59303 18048533 18772268 19451095 20076924 20644817 21152307 21598997 21987276 22322075 22608224
59294 22608224 22847715 23039904 23183812 23278976 23323574 23312522 23238553 23095524 22880459 22592729
59284 22592729 22232851 21803404 21310475 20762597 20168128 19534706 18870749 18185303 17485781
59275 17485781 16777641 16067136 15362607 14671915 14000204 13351602 12731512 12145179 11594933
59266 11594933 11080807 10603292 10163662 9761987 9396636 9065956 8769180 8505726 8274615
59257 8274615 8074398 7902604 7755467 7629331 7522355 7434292 7365055 7314235 7281415 7265921
$$ packed form
59321G637500K86913L16948L49184L82190M16667M54061M94013N35213N77524
59312A1450213O21013O63809P03006P36895P64355P82723P88501P80030P57988
59303A8048533P23735O78827O25829N67893N07490M46690L88279L34799K86149
59294B2608224K39491J92189J43908R5164M4598j1052p3969j43029k15065k87730
59284B2592729l59878m29447m92929n47878n94469o33422o63957o85446o99522
59275A7485781p08140p10505p04529o90692o71711o48602o20090n86333n50246
59266A1594933n14126m77515m39630m01675l65351l30680k96776k63454k31111
59257H274615k00217j71794j47137j26136j06976q8063o9237n0820l2820j5494
$$ plain form
59247 7265921 7266493 7281785 7310664 7351499 7402160 7461633 7530746 7610245 7698902 7794359 7894690
59236 7894690 7997949 8101254 8201729 8297537 8386768 8466591 8535253 8594066 8645589 8690342 8726868
59225 8726868 8754352 8773678 8786754 8796673 8807934 8824596 8848494 8880637 8923427 8979513 9049217
59214 9049217 9131321 9225887 9333998 9454930 9585869 9724271 9868078 10013509 10154955 10287275
59204 10287275 10405753 10503289 10570471 10600320 10592041 10549633 10478519 10384272 10272732 10149509 10019683
59193 10019683 9888436 9761162 9642252 9534335 9438853 9356655 9287920 9232325 9189294 9157277
59183 9157277 9133100 9113248 9095807 9080268 9065837 9051221 9035707 9018969 9000129 8978666 8956166
59172 8956166 8935628 8919298 8909051 8908639 8923302 8956756 9010528 9086454 9187499 9315516 9470803
$$ packed form
59247G265921N72J5292K8879M0835N0661N9473O9113P9499Q8657R5457J00331
59236G894690J03259J03305J00475R5808Q9231P9823O8662N8813N1523M4753L6526
59225H726868K7484J9326J3076R919J1261J6662K3898L2143M2790N6086O9704
59214I049217Q2104R4566J08111J20932J30939J38402J43807J45431J41446J32320
59204A0287275J18478R7536O7182K9849q279m2408p1114r4247j11540j23223j29826
59193A0019683j31247j27274j18910j07917r5482q2198o8735n5595m3031l2017
59183I157277k4177j9852j7441j5539j4431j4616j5514j6738j8840k1463k2500
59172H956166k0538j6330j0247m12J4663L3454N3772P5926J01045J28017J55287
$$ plain form
59161 9470803 9655228 9873613 10130110 10424377 10752676 11111385 11497666 11907460 12334126
59152 12334126 12768129 13196236 13601310 13964639 14269429 14502188 14651666 14708032 14664058 14517250
59142 14517250 14270879 13933007 13514707 13029405 12493335 11924733 11340823 10755369 10179294
59133 10179294 9622228 9091774 8591936 8124252 7690522 7292806 6930823 6601403 6301174
59124 6301174 6028459 5782108 5560161 5360485 5181554 5021793 4879171 4752178 4640323
59115 4640323 4542952 4458261 4384064 4319091 4263202 4216788 4180009 4152059 4131347 4117016 4109871
59104 4109871 4110850 4119075 4132773 4151701 4177103 4209464 4248090 4292843 4344337 4402051 4464226 4530327
59092 4530327 4601899 4680241 4764893 4855281 4952178 5056270 5166526 5281251 5399757 5521899
$$ packed form
59161I470803J84425K18385K56497K94267L28299L58709L86281M09794M26666
59152A2334126M34003M28107M05074L63329L04790K32759J49478N6366m3974j46808
59142A4517250k46371l37872m18300m85302n36070n68602n83910n85454n76075
59133A0179294n57066n30454m99838m67684m33730l97716l61983l29420l00229
59124F301174k72715k46351k21947j99676j78931j59761j42622j26993j11855
59115D640323r7371q4691p4197o4973n5889m6414l6779k7950k0712j4331p145
59104D109871R79Q225J3698J8928K5402L2361L8626M4753N1494N7714O2175O6101
59092D530327P1572P8342Q4652R0388R6897J04092J10256J14725J18506J22142
$$ plain form
59082 5521899 5646851 5773470 5901088 6028840 6154651 6275795 6390058 6495550 6589838 6670210
59072 6670210 6735011 6784541 6820725 6845881 6861518 6868317 6867408 6861147 6852106 6841945 6832273 6826115 6827292
59059 6827292 6838676 6862141 6899669 6952780 7021053 7103003 7198666 7309857 7437771 7581920 7741634
59048 7741634 7916951 8107644 8312895 8532339 8765818 9011576 9266081 9526039 9788925
59039 9788925 10050949 10305977 10547065 10767463 10959513 11114332 11224061 11283916 11291955 11248519
59029 11248519 11156723 11022072 10850409 10646869 10416979 10167133 9902908 9627749 9343771
59020 9343771 9052760 8756123 8455415 8153601 7854532 7560478 7271422 6987238 6709167
59011 6709167 6438614 6176049 5921828 5676735 5441092 5214810 4998833 4794808 4602701
$$ packed form
59082E521899J24952J26619J27618J27752J25811J21144J14263J05492R4288Q0372
59072F670210O4801M9530L6184K5156J5637O799r09o261r041j0161r672o158J177
59059F827292J1384K3465L7528N3111O8273Q1950R5663J11191J27914J44149J59714
59048G741634J75317J90693K05251K19444K33479K45758K54505K59958K62886
59039I788925K62024K55028K41088K20398J92050J54819J09729N9855Q039m3436
59029A1248519r1796j34651j71663k03540k29890k49846k64225k75159k83978
59020I343771k91011k96637l00708l01814k99069k94054k89056k84184k78071
59011F709167k70553k62565k54221k45093k35643k26282k15977k04025j92107
$$ plain form
59002 4602701 4420618 4247766 4085513 3934409 3792512 3658410 3533841 3421014 3318632
58993 3318632 3222915 3131702 3045469 2964873 2889452 2818703 2752614 2690835 2632567 2577578 2526539
58982 2526539 2479988 2437298 2396725 2356576 2316778 2279244 2245978 2216833 2190034 2164779 2142073
58971 2142073 2123005 2107756 2096521 2089626 2086131 2084047 2082797 2083987 2088842 2096333 2104642 2112923 2120694
58958 2120694 2127143 2132240 2137150 2142345 2146635 2149148 2150893 2153171 2155885 2158688 2162352 2167522 2173328 2178731
58944 2178731 2184210 2190827 2198683 2207456 2217242 2227497 2236307 2242264 2246094 2249193 2251609 2252824 2253426 2254572
58930 2254572 2256776 2260434 2266345 2274304 2282505 2290045 2298883 2311506 2327601 2344857 2362270 2380753 2401119
58917 2401119 2423348 2447497 2473653 2501227 2529717 2559860 2592684 2627754 2663627 2699686 2736378
$$ packed form
59002D602701j82083j72852j62253j51104j41897j34102j24569j12827j02382
58993C318632r5717r1213q6233q0596p5421p0749o6089o1779n8268n4989n1039
58982B526539m6551m2690m0573m0149l9798l7534l3266k9145k6799k5255k2706
58971B142073j9068j5249j1235o895l495k084j250J190M855P491Q309Q281P771
58958B120694O449N097M910N195M290K513J745K278K714K803L664N170N806N403
58944B178731N479O617P856Q773R786J0255Q810N957L830L099K416J215O02J146
58930B254572K204L658N911P959Q201P540Q838J2623J6095J7256J7413J8483K0366
58917B401119K2229K4149K6156K7574K8490L0143L2824L5070L5873L6059L6692
$$ plain form
58906 2736378 2774174 2813486 2855175 2899795 2946647 2994579 3043411 3093662 3145434 3198507 3253027
58895 3253027 3309205 3366880 3426109 3487534 3551572 3618250 3688580 3764911 3848864 3939899 4036879
58884 4036879 4140004 4250256 4368151 4494134 4629013 4772923 4925144 5086039 5257638
58875 5257638 5441046 5634990 5838576 6053889 6283909 6529283 6789212 7064267 7356233
58866 7356233 7666327 7995957 8348275 8726510 9131312 9562163 10020961 10511898 11037913
58857 11037913 11599472 12196831 12831484 13505095 14218631 14972610 15766595 16598175 17463326
58848 17463326 18357154 19272616 20198525 21120021 22020639 22882456 23684639 24403635 25015469
58839 25015469 25497809 25831427 26002194 26002872 25833286 25500053 25017051 24404606 23685875 22883322
$$ packed form
58906B736378L7796L9312M1689M4620M6852M7932M8832N0251N1772N3073N4520
58895C253027N6178N7675N9229O1425O4038O6678P0330P6331Q3953R1035R6980
58884D036879J03125J10252J17895J25983J34879J43910J52221J60895J71599
58875E257638J83408J93944K03586K15313K30020K45374K59929K75055K91966
58866G356233L10094L29630L52318L78235M04802M30851M58798M90937N26015
58857A1037913N61559N97359O34653O73611P13536P53979P93985Q31580Q65151
58848A7463326Q93828R15462R25909R21496R00618Q61817Q02183P18996O11834
58839B5015469M82340L33618J70767O78j69586l33233m83002o12445p18731q02553
$$ plain form
58829 22883322 22018326 21111904 20183578 19249933 18325285 17422419 16551127 15717195 14924491
58820 14924491 14177027 13477502 12825385 12218604 11656054 11136471 10656187 10210530 9796669
58811 9796669 9412729 9055088 8719319 8403498 8108236 7833804 7579419 7344817 7129829
58802 7129829 6932371 6749200 6578859 6422058 6279254 6149657 6032366 5926593 5831074 5745021
58792 5745021 5669182 5604264 5549167 5502815 5466553 5442053 5427769 5420655 5420997 5432286 5456299 5491556
58780 5491556 5536975 5593633 5661965 5740365 5828073 5927006 6039203 6164390 6301505 6450925
58770 6450925 6613828 6790775 6982207 7189320 7413357 7654724 7913480 8190065 8485381
58761 8485381 8800914 9138791 9500811 9887552 10299372 10738048 11206406 11706834 12241299
$$ packed form
58829B2883322q64996r06422r28326r33645r24648r02866q71292q33932p92704
58820A4924491p47464o99525o52117o06781n62550n19583m80284m45657m13861
58811I796669l83940l57641l35769l15821k95262k74432k54385k34602k14988
58802G129829j97458j83171j70341j56801j42804j29597j17291j05773r5519q6053
58792E745021p5839o4918n5097m6352l6262k4500j4284p114L42J1289K4013L5257
58780E491556M5419N6658O8332P8400Q7708R8933J12197J25187J37115J49420
58770F450925J62903J76947J91432K07113K24037K41367K58756K76585K95316
58761H485381L15533L37877L62020L86741M11820M38676M68358N00428N34465
$$ plain form
58752 12241299 12812082 13420863 14067549 14751567 15473738 16234826 17032326 17860173 18711062
58743 18711062 19577020 20447469 21307960 22140368 22922944 23631008 24239730 24726636 25071594
58734 25071594 25257322 25273344 25119150 24801786 24331954 23724800 23002228 22189746 21310627
58725 21310627 20385496 19435834 18482810 17541758 16621299 15728409 14870953 14054822 13282459
58716 13282459 12555486 11875600 11241720 10649390 10094666 9576337 9093445 8643382 8223546
58707 8223546 7832236 7466739 7123253 6800028 6498116 6217651 5955755 5709514 5478723
58698 5478723 5264066 5064529 4878090 4703413 4539705 4386505 4244421 4114448 3995885
58689 3995885 3886691 3786207 3695345 3613694 3538921 3469647 3406282 3348214 3293001 3239618 3189877
$$ packed form
58752A2241299N70783O08781O46686O84018P22171P61088P97500Q27847Q50889
58743A8711062Q65958Q70449Q60491Q32408P82576P08064O08722M86906L44958
58734B5071594J85728J6022j54194l17364m69832o07154p22572q12482q79119
58725B1310627r25131r49662r53024r41052r20459q92890q57456q16131p72363
58716A3282459p26973o79886o33880n92330n54724n18329m82892m50063m19836
58707H223546l91310l65497l43486l23225l01912k80465k61896k46241k30791
58698E478723k14657j99537j86439j74677j63708j53200j42084j29973j18563
58689C995885j09194j00484r0862q1651p4773o9274o3365n8068n5213n3383m9741
$$ plain form
58678 3189877 3145065 3103467 3062729 3022609 2984017 2947309 2912788 2880865 2850409 2818927 2785609
58667 2785609 2752309 2720443 2689084 2657303 2626045 2596075 2566003 2533966 2499633 2463236 2424369
58656 2424369 2383066 2340458 2297211 2252812 2207290 2161846 2117062 2072528 2029091 1989161 1953546
58645 1953546 1920103 1886725 1853714 1822160 1792192 1764036 1738591 1715535 1692752 1668796 1644055
58634 1644055 1618717 1591991 1564390 1538204 1514393 1491470 1468702 1447696 1429255 1411390 1392387
58623 1392387 1373542 1357021 1343333 1332616 1325908 1323120 1321928 1320605 1319859 1320304 1320786 1321206 1324243 1331723
58609 1331723 1341611 1351012 1359852 1368964 1376939 1381907 1384661 1387048 1388764 1388503 1386803 1384883 1381853 1375846
58595 1375846 1367185 1358158 1350532 1345177 1342770 1342688 1342508 1340959 1340376 1344206 1353184 1365887 1381553 1400069
$$ packed form
58678C189877m4812m1598m0738m0120l8592l6708l4521l1923l0456l1482l3318
58667B785609l3300l1866l1359l1781l1258k9970l0072l2037l4333l6397l8867
58656B424369m1303m2608m3247m4399m5522m5444m4784m4534m3437l9930l5615
58645A953546l3443l3378l3011l1554k9968k8156k5445k3056k2783k3956k4741
58634A644055k5338k6726k7601k6186k3811k2923k2768k1006j8441j7865j9003
58623A392387j8845j6521j3688j0717o708k788j192j323p46M45M82M20L037P480
58609A331723R888R401Q840R112P975M968K754K387J716k61j700j920l030o007
58595A375846q661r027p626n355k407q2j80j549n83L830Q978J2703J5666J8516
$$ plain form
58581 1400069 1420491 1441994 1465443 1492015 1521447 1553575 1590097 1632358 1678627 1726139 1775030
58570 1775030 1827803 1885661 1947717 2013295 2082728 2156139 2233420 2315330 2403225 2498139 2601298
58559 2601298 2714848 2840831 2980103 3132996 3299768 3479494 3670294 3872029 4087077
58550 4087077 4317001 4560134 4813824 5076760 5346782 5618027 5882340 6132040 6359330
58541 6359330 6554766 6708956 6814934 6867434 6862035 6797964 6680828 6520243 6325407 6104379
58531 6104379 5865717 5617949 5367808 5120559 4880842 4651583 4433652 4228408 4038962
58522 4038962 3867060 3710651 3566891 3435743 3318189 3212808 3117103 3030721 2954300 2886176
58512 2886176 2823286 2764540 2710489 2660257 2611527 2563270 2516210 2470953 2427570 2386374 2347248
$$ packed form
58581A400069K0422K1503K3449K6572K9432L2128L6522M2261M6269M7512M8891
58570A775030N2773N7858O2056O5578O9433P3411P7281Q1910Q7895R4914J03159
58559B601298J13550J25983J39272J52893J66772J79726J90800K01735K15048
58550D087077K29924K43133K53690K62936K70022K71245K64313K49700K27290
58541F359330J95436J54190J05978N2500n399o4071j17136j60585j94836k21028
58531F104379k38662k47768k50141k47249k39717k29259k17931k05244j89446
58522D038962j71902j56409j43760j31148j17554j05381r5705q6382p6421o8124
58512B886176o2890n8746n4051n0232m8730m8257m7060m5257m3383m1196l9126
$$ plain form
58501 2347248 2308941 2270784 2234156 2200485 2169021 2138341 2108578 2079945 2050418 2017409 1980885
58490 1980885 1942742 1904195 1865766 1828604 1793527 1759805 1726899 1696096 1668348 1642018 1615162
58479 1615162 1588789 1565449 1545721 1528336 1512489 1497689 1482583 1466384 1450459 1436356 1423506
58468 1423506 1410927 1399622 1390860 1383496 1375535 1367092 1359444 1352442 1345147 1337617 1329772 1319997 1307237
58455 1307237 1292933 1278698 1263904 1247835 1232142 1218419 1205382 1191324 1177371 1165366 1154560
58444 1154560 1143517 1133318 1125612 1119455 1113413 1108700 1106687 1105390 1102305 1098752 1097330 1096936 1094723 1091468
58430 1091468 1090336 1091465 1092399 1093042 1095492 1099306 1101384 1100677 1099216 1098582 1098842 1100528 1103992 1107113 1107226
58415 1107226 1105065 1103591 1103482 1103071 1101864 1100547 1098292 1093880 1088959 1086543 1086685 1087018 1086867 1087326 1088119 1088143
$$ packed form
58501B347248l8307l8157l6628l3671l1464l0680k9763k8633k9527l3009l6524
58490A980885l8143l8547l8429l7162l5077l3722l2906l0803k7748k6330k6856
58479A615162k6373k3340j9728j7385j5847j4800j5106j6199j5925j4103j2850
58468A423506j2579j1305q762p364p961q443p648p002p295p530p845r775j2760
58455A307237j4304j4235j4794j6069j5693j3723j3037j4058j3953j2005j0806
58444A154560j1043j0199p706o157o042m713k013j297l085l553j422l94k213l255
58430A091468j132J129R34O43K450L814K078p07j461o34K60J686L464L121J13
58415A107226k161j474j09m11j207j317k255m412m921k416J42L33j51M59P93K4
$$ plain form
58399 1088143 1088555 1091655 1097118 1102583 1107186 1111291 1113952 1114167 1113442 1113565 1113260 1110709 1107543 1106066 1104438
58384 1104438 1099371 1091968 1085791 1080691 1074191 1067869 1066206 1069140 1071472 1070074 1066639 1063143 1059676 1057133
58370 1057133 1057150 1058805 1059650 1059993 1061833 1064041 1063491 1060556 1058369 1057019 1053997 1050264 1050026 1053980 1058301
58355 1058301 1061070 1064335 1069120 1073739 1078034 1084236 1092711 1101737 1112000 1126204 1143597 1160156 1174954
58342 1174954 1191061 1209390 1227132 1243293 1260134 1277708 1292343 1302177 1309346 1315277 1318700 1319591
58330 1319591 1320180 1320719 1319035 1315435 1313158 1312820 1311280 1307140 1302483 1298223 1292878 1287008 1283727 1283568 1283964
58315 1283964 1284772 1289049 1297266 1306133 1314297 1323764 1334616 1344119 1352439 1363457 1378206 1392969 1405494
58302 1405494 1417620 1430349 1442030 1453028 1466419 1482244 1496650 1508528 1521393 1537017 1552829
$$ packed form
58399A088143M12L100N463N465M603M105K661K15p25J23l05k551l166j477j628
58384A104438n067p403o177n100o500o322j663K934K332j398l435l496l467k543
58370A057133J7J655Q45L43J840K208n50k935k187j350l022l733k38L954M321
58355A058301K769L265M785M619M295O202Q475R026J0263J4204J7393J6559J4798
58342A174954J6107J8329J7742J6161J6841J7574J4635R834P169N931L423Q91
58330A319591N89N39j684l600k277l38j540m140m657m260n345n870l281j59L96
58315A283964Q08M277Q217Q867Q164R467J0852R503Q320J1018J4749J4763J2525
58302A405494J2126J2729J1681J0998J3391J5825J4406J1878J2865J5624J5812
$$ plain form
58291 1552829 1567440 1583029 1600360 1616920 1631753 1646780 1661865 1674136 1683411 1692473 1701004 1705626
58279 1705626 1707132 1710822 1718174 1725110 1730302 1737982 1750317 1764177 1777985 1794737 1815385 1835994
58267 1835994 1854370 1873170 1893925 1914451 1934523 1957478 1983813 2009822 2034707 2062080 2092446
58256 2092446 2121516 2148168 2176512 2207827 2238335 2267333 2299391 2335688 2371314 2403977 2437144
58245 2437144 2471765 2503623 2532121 2562965 2598604 2634603 2668828 2705249 2745147 2783850 2820085
58234 2820085 2859271 2903509 2947791 2990288 3036582 3089108 3142258 3192884 3245855 3304138 3363237
58223 3363237 3420643 3480868 3545853 3610500 3673132 3739967 3813618 3887766 3959168 4034141 4116909
58212 4116909 4202407 4287086 4375902 4471983 4570530 4669750 4776440 4893699 5014761 5136288
$$ packed form
58291A552829J4611J5589J7331J6560J4833J5027J5085J2271R275R062Q531M622
58279A705626J506L690P352O936N192P680J2335J3860J3808J6752K0648K0609
58267A835994J8376J8800K0755K0526K0072K2955K6335K6009K4885K7373L0366
58256B092446K9070K6652K8344L1315L0508K8998L2058L6297L5626L2663L3167
58245B437144L4621L1858K8498L0844L5639L5999L4225L6421L9898L8703L6235
58234B820085L9186M4238M4282M2497M6294N2526N3150N0626N2971N8283N9099
58223C363237N7406O0225O4985O4647O2632O6835P3651P4148P1402P4973Q2768
58212D116909Q5498Q4679Q8816R6081R8547R9220J06690J17259J21062J21527
$$ plain form
58202 5136288 5265795 5408091 5556485 5705486 5860221 6025085 6195447 6369051 6553159
58193 6553159 6751947 6959682 7174926 7407953 7665271 7940997 8232799 8551291 8903205
58184 8903205 9280478 9677074 10101276 10559661 11044533 11549666 12083194 12652497 13252046
58175 13252046 13878810 14543400 15253081 16000669 16783434 17615074 18505498 19447890 20440338
58166 20440338 21499950 22639591 23851034 25127314 26479971 27917396 29430345 31018968
58158 31018968 32711090 34534212 36494211 38601453 40889260 43382521 46076102 48968850
58150 48968850 52089215 55462766 59090106 62988563 67222421 71861609 76949601 82547537
58142 82547537 88768844 95731691 103522334 112248802 122083719 133210844 145785171 159988519
$$ packed form
58202E136288J29507J42296J48394J49001J54735J64864J70362J73604J84108
58193F553159J98788K07735K15244K33027K57318K75726K91802L18492L51914
58184H903205L77273L96596M24202M58385M84872N05133N33528N69303N99549
58175A3252046O26764O64590P09681P47588P82765Q31640Q90424R42392R92448
58166B0440338J059612J139641J211443J276280J352657J437425J512949J588623
58158C1018968J692122J823122J959999K107242K287807K493261K693581K892748
58150D8968850L120365L373551L627340L898457M233858M639188N087992N597936
58142H2547537O221307O962847P790643Q726468R834917J1127125J2574327J4203348
$$ plain form
58134 159988519 176044107 194111011 214258774 236652974 261723430 290136841 322766663
58127 322766663 360623644 404050249 450933325 495428017 529283669 545638060 542361213
58120 542361213 522277129 490685563 452753408 412415268 372389296 334375372 299237027
58113 299237027 267310198 238687027 213291972 190891266 171200820 153982832 139011157
58106 139011157 126022485 114767090 105058853 96731270 89596575 83489987 78306740 73960548
58098 73960548 70351446 67401361 65070325 63312649 62073574 61359529 61262789 61897329 63355337
58089 63355337 65688101 68753958 71975852 74366406 74996194 73525721 70291360 65944281
58081 65944281 61074305 56089999 51252957 46707459 42507000 38667235 35197777 32090174
$$ packed form
58134A59988519J6055588J8066904K0147763K2394200K5070456K8413411L2629822
58127C22766663L7856981M3426605M6883076M4494692L3855652J6354391l276847
58120E42361213k0084084l1591566l7932155m0338140m0025972l8013924l5138345
58113B99237027l1926829k8623171k5395055k2400706j9690446j7217988j4971675
58106A39011157j2988672j1255395r708237q327583p134695o106588n183247m346192
58098G3960548l609102k950085k331036j757676j239075p14045r6740O34540J458008
58089F3355337K332764L065857L221894K390554O29788j470473l234361m347079
58081F5944281m869976m984306m837042m545498m200459l839765l469458l107603
$$ plain form
58073 32090174 29313535 26838970 24648946 22718949 21013680 19506227 18180502 17012485
58065 17012485 15969071 15027178 14176035 13401192 12684393 12018056 11401962 10826982 10279152
58056 10279152 9757510 9270591 8817521 8389502 7987131 7618507 7281633 6965434 6666878
58047 6666878 6391059 6135531 5890125 5651484 5423213 5203014 4984083 4768250 4563900
58038 4563900 4371767 4185582 4005088 3835372 3675147 3518859 3368943 3233126 3110798
58029 3110798 2994362 2882665 2780861 2688446 2599628 2514418 2437403 2366464 2294283 2220198 2149717
58018 2149717 2083596 2018289 1955528 1900069 1849270 1796197 1742107 1694775 1655388 1618117 1581789
58007 1581789 1550756 1524579 1497804 1470023 1445790 1424652 1401499 1376753 1356080 1339846 1322697
$$ packed form
58073C2090174k776639k474565k190024j929997j705269j507453j325725j168017
58065A7012485j043414r41893q51143p74843p16799o66337o16094n74980n47830
58056A0279152n21642m86919m53070m28019m02371l68624l36874l16199k98556
58047F666878k75819k55528k45406k38641k28271k20199k18931k15833k04350
58038D563900j92133j86185j80494j69716j60225j56288j49916j35817j22328
58029C110798j16436j11697j01804r2415q8818q5210p7015p0939p2181p4085p0481
58018B149717o6121o5307o2761n5459n0799n3073n4090m7332l9387l7271l6328
58007A581789l1033k6177k6775k7781k4233k1138k3153k4746k0673j6234j7149
$$ plain form
57996 1322697 1303647 1286746 1271570 1252940 1230720 1210440 1193619 1176722 1160136 1148666 1141992
57985 1141992 1133835 1122057 1111185 1103571 1096229 1087753 1080553 1074829 1067538 1058455 1050546 1044017 1036730
57972 1036730 1030167 1027677 1027246 1023775 1018055 1015399 1015690 1013423 1007753 1003560 1001790 997796 990912 987016
57958 987016 989264 993905 997450 1000731 1003893 1004534 1003024 1003063 1005081 1005324 1002841 1000778 999451 994972 986399
57943 986399 977578 970273 962042 952503 944982 940110 934460 927460 923054 922332 921059 916887 912627 909728
57929 909728 904596 894367 880975 866947 852359 838231 827636 820916 814657 807470 802013 799586 797994
57916 797994 796506 797438 800782 802783 802142 802264 805016 807600 808250 809640 813564 817088 817228 815175 812961
57901 812961 810030 805961 802683 801145 799261 795490 791015 786413 779984 771399 763172 756362 748493 737909
$$ packed form
57996A322697j9050j6901j5176j8630k2220k0280j6821j6897j6586j1470o674
57985A141992q157j1778j0872p614p342q476p200n724p291r083p909o529p287
57972A036730o563k490m31l471n720k656K91k267n670m193j770l994o884l896
57958I87016K248M641L545L281L162O41j510L9K018K43k483k063j327m479q573
57943I86399q821p305q231r539p521m872n650p000m406p22j273m172m260k899
57929I09728n132j0229j3392j4028j4588j4128j0595o720o259p187n457k427j592
57916G97994j488R32L344K001o41J22K752K584O50J390L924L524J40k053k214
57901H12961k931m069l278j538j884l771m475m602o429q585q227o810p869j0584
$$ plain form
57887 737909 726740 717635 710948 706636 705279 705512 704177 700694 697886 697307 697653 698781 702678 708772 712862
57872 712862 712788 711035 709792 707762 703796 699232 694323 686737 676140 666037 658430 650719 640550 629673
57858 629673 620223 611215 601835 594384 590594 588385 585548 583501 584187 586308 588016 590650 596386 604356
57844 604356 612132 619191 626258 633155 639754 647177 655850 664211 671259 678368 686858 695901 704470 713019
57830 713019 721466 727850 730729 730783 728666 723705 716172 708226 701103 693861 686159 679450 674097 668347 661601
57815 661601 655628 651046 645973 639774 634671 631660 628443 623615 619371 617570 616739 615867 617732 624934 635264
57800 635264 644462 651598 658768 667342 677215 687899 697877 704664 707708 709385 711282 711923 710135 707830
57786 707830 706759 705094 700213 692840 685574 679108 672565 665878 659273 651905 643243 634241 625280 615014
$$ packed form
57887G37909j1169r105o687m312j357K33j335l483k808n79L46J128L897O094M090
57872G12862p4j753j243k030l966m564m909p586j0597j0103p607p711j0169j0877
57858F29673r450r008r380p451l790k209k837k047O86K121J708K634N736P970
57844F04356P776P059P067O897O599P423Q673Q361P048P109Q490R043Q569Q549
57830G13019Q447O384K879N4k117m961p533p946p123p242p702o709n353n750o746
57815F61601n973m582n073o199n103l011l217m828m244j801q31q72J865P202J0330
57800F35264R198P136P170Q574R873J0684R978O787L044J677J897O41j788k305
57786G07830j071j665m881p373p266o466o543o687o605p368q662r002q961j0266
$$ plain form
57772 615014 603349 593299 587444 584471 581499 577700 573222 566876 557976 548765 541960 536947 530865 522370
57758 522370 512171 501183 490241 480366 471411 461739 450780 440186 430990 421875 412102 403595 397774
57745 397774 392720 386231 379618 375584 374125 373364 372828 373135 373909 374774 377111 382125 388405 393934 399379
57730 399379 407041 417588 429866 442492 453541 460460 462863 464015 467196 472111 477011 482168 488300
57717 488300 493447 494962 493498 491826 490587 488229 484288 479658 474218 467177 459337 452299 445777 438206
57703 438206 429614 421512 414453 408070 402973 400109 398629 396910 395557 397079 402537 410408 418675 426305
57689 426305 432967 438949 445230 452282 459283 465564 471855 478805 485493 490945 495802 500890 505531 509187
57675 509187 513275 519309 526617 533948 541798 550759 559099 564685 568224 572013 576681 581852 588839 599555
$$ packed form
57772F15014j1665j0050n855k973k972l799m478o346q900r211o805n013o082q495
57758E22370j0199j0988j0942r875q955r672j0959j0594r196r115r773q507n821
57745C97774n054o489o613m034j459p61n36L07P74Q65K337N014O280N529N445
57730C99379P662J0547J2278J2626J1049O919K403J152L181M915M900N157O132
57717D88300N147J515j464j672j239k358l941m630n440p041p840p038o522p571
57703D38206q592q102p059o383n097k864j480j719j353J522N458P871Q267P630
57689D26305O662N982O281P052P001O281O291O950O688N452M857N088M641L656
57675E09187M088O034P308P331P850Q961Q340N586L539L789M668N171O987J0716
$$ plain form
57661 599555 613371 627900 642338 657302 671995 684645 695698 707845 722730 739843 758421
57650 758421 778186 798436 818723 840219 864201 889576 914132 937963 963395 991929 1023517
57639 1023517 1058456 1097494 1140225 1185757 1234712 1288236 1345240 1403164 1461570 1522733 1588790
57628 1588790 1660553 1738938 1824954 1918078 2017103 2122982 2238733 2366213 2505061 2655074
57618 2655074 2817526 2993744 3184156 3389147 3609132 3843428 4090208 4347174 4610677
57609 4610677 4874644 5132140 5377466 5604908 5806547 5974097 6102286 6187139 6220929 6192589
57599 6192589 6095108 5931331 5712629 5454424 5173096 4883543 4596688 4319488 4057322 3814802
57589 3814802 3594079 3394497 3214905 3055022 2914302 2791257 2684440 2592603 2513567 2444663
$$ packed form
57661E99555J3816J4529J4438J4964J4693J2650J1053J2147J4885J7113J8578
57650G58421J9765K0250K0287K1496K3982K5375K4556K3831K5432K8534L1588
57639A023517L4939L9038M2731M5532M8955N3524N7004N7924N8406O1163O6057
57628A588790P1763P8385Q6016R3124R9025J05879J15751J27480J38848J50013
57618B655074J62452J76218J90412K04991K19985K34296K46780K56966K63503
57609D610677K63967K57496K45326K27442K01639J67550J28189Q4853L3790k8340
57599F192589r7481j63777k18702k58205k81328k89553k86855k77200k62166k42520
57589C814802k20723j99582j79592j59883j40720j23045j06817r1837p9036o8904
$$ plain form
57579 2444663 2384775 2334410 2293474 2260719 2235676 2219129 2210980 2209499 2213589 2224296 2243115 2270000
57567 2270000 2303801 2343671 2389555 2442359 2503998 2576181 2658764 2750235 2849940 2958770 3077696
57556 3077696 3206856 3346031 3494679 3651415 3814668 3983658 4157086 4330745 4497670
57547 4497670 4650494 4782185 4885038 4951529 4977131 4961099 4904414 4808779 4678094 4519128
57537 4519128 4339705 4146855 3946595 3743996 3542969 3346876 3159225 2982506 2816771
57528 2816771 2660940 2515355 2381322 2258391 2144279 2037747 1939586 1850326 1768861 1693908
57518 1693908 1625225 1562830 1506507 1456384 1412385 1372836 1335257 1299019 1265706 1236560 1211136
57507 1211136 1188626 1168585 1149956 1131416 1113395 1098045 1086434 1077370 1069543 1063028 1058009 1053945
$$ packed form
57579B444663n9888n0365m0936l2755k5043j6547q149j481M090J0707J8819K6885
57567B270000L3801L9870M5884N2804O1639P2183Q2583R1471R9705J08830J18926
57556C077696J29160J39175J48648J56736J63253J68990J73428J73659J66925
57547D497670J52824J31691J02853O6491K5602j6032n6685r5635j30685j58966
57537D519128j79423j92850k00260k02599k01027j96093j87651j76719j65735
57528B816771j55831j45585j34033j22931j14112j06532r8161q9260q1465p4953
57518A693908o8683o2395n6323n0123m3999l9549l7579l6238l3313k9146k5424
57507A211136k2510k0041j8629j8540j8021j5350j1611r064p827o515n019m064
$$ plain form
57495 1053945 1051087 1051181 1055522 1063510 1073968 1086455 1100360 1114210 1127202 1140505 1156004 1174485
57483 1174485 1195744 1219630 1246189 1275443 1307509 1342315 1379171 1417600 1458577 1503786 1553668
57472 1553668 1607627 1666039 1730213 1799995 1873429 1949613 2030224 2117292 2210952 2310428 2415868
57461 2415868 2527900 2646183 2769215 2894999 3021427 3146714 3269490 3387375 3495440
57452 3495440 3587424 3658615 3706176 3726967 3717463 3676698 3607455 3513846 3399532 3269021 3128457
57441 3128457 2983444 2837433 2693306 2554791 2424795 2303757 2191190 2087683 1993950 1909182
57431 1909182 1832140 1763161 1703441 1652787 1609411 1571565 1538359 1509580 1485808 1468234 1457301
57420 1457301 1451912 1450743 1453683 1461110 1472560 1487273 1505590 1528652 1557047 1590775 1630226 1676089
$$ packed form
57495A053945k858R4M341P988J0458J2487J3905J3850J2992J3303J5499J8481
57483A174485K1259K3886K6559K9254L2066L4806L6856L8429M0977M5209M9882
57472A553668N3959N8412O4174O9782P3434P6184Q0611Q7068R3660R9476J05440
57461B415868J12032J18283J23032J25784J26428J25287J22776J17885J08065
57452C495440R1984P1191M7561K0791r504m0765o9243r3609j14314j30511j40564
57441C128457j45013j46011j44127j38515j29996j21038j12567j03507r3733q4768
57431A909182p7042o8979n9720n0654m3376l7846l3206k8779k3772j7574j0933
57420A457301n389j169K940P427J1450J4713J8317K3062K8395L3728L9451M5863
$$ plain form
57408 1676089 1728325 1786198 1849443 1918648 1994270 2075934 2163137 2256395 2357174 2466315 2582583
57397 2582583 2703152 2825619 2948858 3071503 3190225 3300154 3396324 3473739 3526807 3550296
57387 3550296 3541058 3498274 3422919 3318701 3193027 3054709 2909811 2760657 2608784 2457099
57377 2457099 2308769 2165809 2029733 1902346 1784843 1676928 1577553 1486019 1402068 1325651
57367 1325651 1256872 1195348 1139532 1087533 1038754 993822 952902 915048 879206 845008 812801
57356 812801 783852 759883 740897 723965 706008 687476 671327 658657 647693 637084 627451 618990
57344 618990 610124 599793 588986 578830 569046 559449 551098 544606 538994 533552 529300 527231 526542 525955
57330 525955 525491 525626 526062 526740 528823 533103 538345 542626 545654 548585 552245 556522 560882 564707 567757
$$ packed form
57408A676089N2236N7873O3245O9205P5622Q1664Q7203R3258J00779J09141J16268
57397B582583J20569J22467J23239J22645J18722J09929R6170P7415N3068K3489
57387C550296r238m2784p5355j04218j25674j38318j44898j49154j51873j51685
57377B457099j48330j42960j36076j27387j17503j07915r9375r1534q3951p6417
57367A325651o8779o1524n5816n1999m8779m4932m0920l7854l5842l4198l2207
57356H12801k8949k3969j8986j6932j7957j8532j6149j2670j0964j0609r633q461
57344F18990q866j0331j0807j0156r784r597q351o492n612n442m252k069o89n87
57330E25955m64J35M36O78K083M280N242M281L028K931L660M277M360L825L050
$$ plain form
57315 567757 570776 574780 579491 583784 587805 592898 598869 603522 605961 608232 612135 616370 618772 619775
57301 619775 621574 625038 629553 634974 641569 648624 655118 661525 669268 678644 688730 698944 709233
57288 709233 719015 727550 735340 743801 753378 763040 771723 779447 786953 794964 803866 813565 823625 833769
57274 833769 843962 853889 862999 871404 880129 890167 901828 915155 929979 945325 959830 973319
57262 973319 986988 1001603 1016599 1031509 1047087 1064251 1082882 1102405 1122698 1143824 1165722
57251 1165722 1188588 1212622 1237166 1261312 1285581 1311365 1338304 1364019 1387294 1409727 1433364
57240 1433364 1458636 1485777 1516190 1550453 1586515 1621942 1656991 1693769 1733296 1775108 1818937
57229 1818937 1865004 1913183 1963405 2016327 2072265 2129994 2187928 2246081 2305684 2367448 2431365
$$ packed form
57315E67757L019M004M711M293M021N093N971M653K439K271L903M235K402J003
57301F19775J799L464M515N421O595P055O494O407P743R376J0086J0214J0289
57288G09233R782Q535P790Q461R577R662Q683P724P506Q011Q902R699J0060J0144
57274H33769J0193R927R110Q405Q725J0038J1661J3327J4824J5346J4505J3489
57262I73319J3669J4615J4996J4910J5578J7164J8631J9523K0293K1126K1898
57251A165722K2866K4034K4544K4146K4269K5784K6939K5715K3275K2433K3637
57240A433364K5272K7141L0413L4263L6062L5427L5049L6778L9527M1812M3829
57229A818937M6067M8179N0222N2922N5938N7729N7934N8153N9603O1764O3917
$$ plain form
57218 2431365 2497657 2566638 2637890 2710456 2783354 2855156 2923780 2987646 3046498 3100331 3148247
57207 3148247 3189085 3222364 3247824 3264991 3274087 3276525 3273899 3267427 3258816 3250052 3241533 3232171 3222579
57194 3222579 3216287 3215977 3219988 3224607 3228675 3233818 3240995 3249115 3256791 3263415 3268549 3272080 3275279 3280367
57180 3280367 3288739 3300426 3315173 3333148 3354693 3380068 3409333 3442115 3477882 3516748 3559114
57169 3559114 3604090 3649336 3693156 3735601 3776768 3815257 3849387 3878813 3903785 3923879 3938792
57158 3938792 3949480 3957217 3962192 3964171 3963759 3961889 3958838 3954947 3951733 3951374 3955721 3966484 3985215 4011908
57144 4011908 4044408 4080345 4119035 4160703 4204855 4250516 4297269 4344996 4393307 4442177 4492400
57133 4492400 4544503 4597803 4651189 4703952 4755187 4803310 4846954 4885795 4920243 4951385 4981409
$$ packed form
57218B431365O6292O8981P1252P2566P2898P1802O8624O3866N8852N3833M7916
57207C148247M0838L3279K5460J7167R096K438k626o472q611q764q519r362r592
57194C222579o292l10M011M619M068N143P177Q120P676O624N134L531L199N088
57180C280367Q372J1687J4747J7975K1545K5375K9265L2782L5767L8866M2366
57169C559114M4976M5246M3820M2445M1167L8489L4130K9426K4972K0094J4913
57158C938792J0688P737M975J979m12j870l051l891l214l59M347J0763J8731K6693
57144D011908L2500L5937L8690M1668M4152M5661M6753M7727M8311M8870N0223
57133D492400N2103N3300N3386N2763N1235M8123M3644L8841L4448L1142L0024
$$ plain form
57122 4981409 5012702 5046029 5080674 5116218 5152339 5186680 5215328 5236358 5251105 5261330 5267187
57111 5267187 5268701 5266661 5260646 5248211 5227400 5198436 5162133 5119010 5071053 5021738 4972505 4921352
57099 4921352 4866551 4809497 4752085 4693498 4631799 4566923 4499923 4430730 4358746 4284611 4209783
57088 4209783 4135345 4062250 3991465 3923049 3856806 3794644 3740310 3695711 3659089 3627210 3596879
57077 3596879 3563535 3521056 3464213 3389337 3292320 3168936 3017975 2841157 2639264 2411355
57067 2411355 2158037 1881563 1581588 1254330 896551 506262 78588 -394849 -921656 -1508170
57057 -1508170 -2163874 -2900855 -3727497 -4647695 -5667647 -6798588 -8052756 -9443604 -10991943
57048 -10991943 -12726174 -14675845 -16872070 -19355468 -22176798 -25390030 -29054066 -33242003
$$ packed form
57122D981409L1293L3327L4645L5544L6121L4341K8648K1030J4747J0225N857
57111E267187J514k040o015j2435k0811k8964l6303m3123m7957m9315m9233n1153
57099D921352n4801n7054n7412n8587o1699o4876o7000o9193p1984p4135p4828
57088D209783p4438p3095p0785o8416o6243o2162n4334m4599l6622l1879l0331
57077C596879l3344m2479n6843p4876r7017j23384j50961j76818k01893k27909
57067B411355k53318k76474k99975l27258l57779l90289G8588c94849n26807n86514
57057a508170o55704p36981q26642r20198j019952j130941j254168j390848j548339
57048a0991943j734231j949671k196225k483398k821330l213232l664036m187937
$$ plain form
57040 -33242003 -38038809 -43529205 -49799036 -56948994 -65093043 -74338877 -84777146 -96481927
57032 -96481927 -109501747 -123854709 -139553189 -156611677 -174973249 -194437729 -214775711
57025 -214775711 -236003008 -258476055 -282546891 -307998544 -333762350 -358125548 -379180485
57018 -379180485 -395209466 -404956883 -407840041 -404022297 -394258273 -379612354 -361246739
57011 -361246739 -340327895 -317953592 -295053299 -272319656 -250208041 -228969521 -208692813
57004 -208692813 -189371706 -170988018 -153560274 -137140982 -121798273 -107605799 -94627267
56997 -94627267 -82892447 -72388321 -63070980 -54874526 -47708675 -41464263 -36031335 -31309215
56989 -31309215 -27202302 -23620147 -20487285 -17745115 -15341249 -13224734 -11353261 -9695662
$$ packed form
57040c3242003m796806n490396o269831p149958q144049r245834j0438269j1704781
57032i6481927j3019820j4352962j5698480j7058488j8361572j9464480k0337982
57025b14775711k1227297k2473047k4070836k5451653k5763806k4363198k1054937
57018c79180485j6028981r747417k883158L817744R764024J4645919J8365615
57011c61246739K0918844K2374303K2900293K2733643K2111615K1238520K0276708
57004b08692813J9321107J8383688J7427744J6419292J5342709J4192474J2978532
56997i4627267J1734820J0504126R317341Q196454P165851O244412N432928M722120
56989c1309215M106913L582155L132862K742170K403866K116515J871473J657599
$$ plain form
56981 -9695662 -8223536 -6907570 -5724526 -4660123 -3701734 -2834548 -2047161 -1333880 -688121
56972 -688121 -99049 442711 941277 1399319 1820549 2206518 2556096 2870027 3151657 3402267
56962 3402267 3620605 3807975 3968797 4105408 4217423 4307056 4379788 4438829 4484006 4516822
56952 4516822 4541178 4558059 4564809 4560692 4548121 4527525 4496487 4454974 4406022 4350166 4284804 4210630
56940 4210630 4133384 4057630 3984007 3914325 3854591 3811567 3790221 3793013 3812969 3824925 3792206
56929 3792206 3689150 3515821 3290425 3033687 2763028 2493705 2237180 1999145 1782341
56920 1782341 1589001 1418174 1264389 1122704 992933 876591 772759 679678 597484 526394
56910 526394 464575 410432 364784 328376 299483 276127 258532 247477 242534 243817 253037 270784
$$ packed form
56981i695662J472126J315966J183044J064403R58389Q67186P87387P13281O45759
56972f88121i9049D42711M98566M58042M21230L85969L49578L13931K81630K50610
56962C402267K18338J87370J60822J36611J12015Q9633P2732N9041M5177L2816
56952D516822K4356J6881O750m117j2571k0596l1038m1513m8952n5856o5362p4174
56940D210630p7246p5754p3623o9682n9734m3024k1346K792J9956J1956l2719
56929C792206j03056j73329k25396k56738k70659k69323k56525k38035k16804
56920A782341j93340j70827j53785j41685j29771j16342j03832r3081q2194p1090
56910E26394o1819n4143m5648l6408k8893k3356j7595j1055m943J283R220J7747
$$ plain form
56898 270784 294757 322217 351938 382326 410161 432994 450577 462694 468158 467423 463572 459116
56886 459116 454210 449112 445497 443870 442704 441789 443521 449180 457056 466142 478527 495841 516380 538470
56872 538470 563967 595422 631551 667940 700409 725445 739401 740218 729134 708984 681973 650356
56860 650356 617399 585757 556095 528545 503958 482535 463035 444611 427894 413247 399914
56849 399914 387910 378644 372569 368293 365100 364115 365843 368829 371957 375803 380647 385599 390858 398155
56835 398155 407641 417114 425785 435888 448915 463186 477132 492007 508996 526423 542377 557579
56823 557579 572746 585315 591803 591946 587931 581006 571300 559695 547530 535471 524487 516655 513161
56810 513161 512834 514290 518019 524772 533646 543693 555886 571615 590726 612811 638812 669291 702238
$$ packed form
56898B70784K3973K7460K9721L0388K7835K2833J7583J2117N464p35l851m456
56886D59116m906n098l615j627j166r15J732N659P876R086J2385J7314K0539K2090
56872E38470K5497L1455L6129L6389L2469K5036J3956Q17j1084k0150k7011l1617
56860F50356l2957l1642k9662k7550k4587k1423j9500j8424j6717j4647j3333
56849C99914j2004r266o075m276l193r85J728K986L128L846M844M952N259P297
56835C98155R486R473Q671J0103J3027J4271J3946J4875J6989J7427J5954J5202
56823E57579J5167J2569O488J43m015o925r706j1605j2165j2059j0984p832l494
56810E13161l27J456L729O753Q874J0047J2193J5729J9111K2085K6001L0479L2947
$$ plain form
56797 702238 734067 761450 780990 789300 785637 773195 756166 736836 716605 697624 681365 667401
56785 667401 655572 647735 645589 648458 655053 665758 681425 701728 726544 757104 793868 835126
56773 835126 879518 927572 978038 1024439 1058099 1073804 1071187 1052738 1023035 987988 951793 915243
56761 915243 878697 844801 816062 791850 770677 753791 743448 739179 739078 743635 754822 772056
56749 772056 792563 815712 843796 877962 915560 951562 980372 996382 995693 978660 949684 914045
56737 914045 875574 836676 798928 763446 731545 704702 683164 665426 650094 637463 628431 623058
56725 623058 621256 623578 630088 639861 652816 670258 691768 713041 728801 736710 736841 729052 713461
56712 713461 692387 669216 645702 622120 599279 578387 559568 542357 527131 514451 503677
$$ packed form
56797G02238L1829K7383J9540Q310l663j2442j7029j9330k0231j8981j6259j3964
56785F67401j1829p837k146K869O595J0705J5667K0303K4816L0560L6764M1258
56773H35126M4392M8054N0466M6401L3660J5705k617j8449k9703l5047l6195l6550
56761I15243l6546l3896k8739k4212k1173j6886j0343m269j01M557J1187J7234
56749G72056K0507K3149K8084L4166L7598L6002K8810J6010o89j7033k8976l5639
56737I14045l8471l8898l7748l5482l1901k6843k1538j7738j5332j2631r032n373
56725F23058j802K322O510R773J2955J7442K1510K1273J5760P909J31p789j5591
56712G13461k1074k3171k3514k3582k2841k0892j8819j7211j5226j2680j0774
$$ plain form
56701 503677 493843 485206 478491 473475 469709 467545 466863 465935 463254 459530 456313 453671 450850 448129 446361
56686 446361 445671 445970 447474 449347 449367 446654 443230 441273 440499 439838 439697 440463 440831 440030 439717 441069 441972
56669 441972 440128 437106 435962 436243 434804 430543 424907 418637 411591 405230 401570 399703 396637 391689
56655 391689 386983 383650 380646 377660 376062 376228 376548 375867 374693 373381 371214 367992 364753 362415 361123
56640 361123 361115 362720 365379 367962 369968 371286 371460 370684 370661 372643 375311 376551 376704 378049 381576 386228
56624 386228 390782 394613 397175 398632 400332 402875 404703 404490 403657 404197 405394 405530 405718 408657 414175
56609 414175 419295 422615 425421 428391 430287 430461 429915 429248 427823 425497 423088 420691 417401 413018 408478
56594 408478 404685 402304 402131 403790 404745 402618 397893 392498 386746 379969 372904 366672 360293 352175 343218
$$ packed form
56701E03677r834q637o715n016l766k164o82r28k681l724l217k642k821k721j768
56686D46361o90K99J504J873K0k713l424j957p74o61j41P66L68q01l13J352R03
56669D41972j844l022j144K81j439m261n636o270p046o361l660j867l066m948
56655C91689m706l333l004k986j598J66L20o81j174j312k167l222l239k338j292
56640C61123qJ605K659K583K006J318J74p76k3J982K668J240J53J345L527M652
56624C86228M554L831K562J457J700K543J828k13q33N40J197J36J88K939N518
56609D14175N120L320K806K970J896J74n46o67j425k326k409k397l290m383m540
56594D08478l793k381j73J659R55k127m725n395n752o777p065o232o379q118q957
$$ plain form
56579 343218 335500 328800 321798 315835 313580 314244 314105 312068 310960 312748 316032 318990 321426 323066 323012
56564 323012 321822 321228 321079 319452 316431 314685 315501 317273 318669 320138 321402 320810 318581 317633 319632
56549 319632 322872 325455 327911 331117 334149 335893 336758 337440 338004 339264 342813 348428 353512 356283 357576
56534 357576 358513 358624 357528 356517 357227 360206 365367 371975 377853 380870 381795 383367 386236 388533 389907
56519 389907 392647 397732 403032 407005 411080 416377 420944 422697 422915 424472 428230 433218 438800 444818
56505 444818 451015 457956 467131 478669 490381 500556 510384 522327 537440 555422 575597 596369
56493 596369 615166 630628 644047 657507 671479 685021 697275 707990 717532 726802 736136 744236
56481 744236 749610 752877 755664 757283 754992 747970 738555 728789 718128 705435 690901 674949 657482
$$ packed form
56579C43218p718o700p002n963k255O64j39k037j108J788L284K958K436J640n4
56564C23012j190n94j49j627l021j746Q16J772J396J469J264n92k229r48J999
56549C19632L240K583K456L206L032J744Q65O82N64J260L549N615N084K771J293
56534C57576R37J11j096j011P10K979N161O608N878L017R25J572K869K297J374
56519C89907K740N085N300L973M075N297M567J753K18J557L758M988N582O018
56505D44818O197O941R175J1538J1712J0175R828J1943J5113J7982K0175K0772
56493E96369J8797J5462J3419J3460J3972J3542J2254J0715R542R270R334Q100
56481G44236N374L267K787J619k291p022r415r766j0661j2693j4534j5952j7467
$$ plain form
56468 657482 639271 622038 606188 590424 574418 559659 546918 535219 524178 514856 507303 499808
56456 499808 491687 484208 477493 469337 458813 448391 440506 434337 428078 422244 418431 416449 414824 412978
56442 412978 411222 409694 408679 408731 409373 408965 406812 404030 401643 399571 398083 398147 399405 399882 398686 397108
56426 397108 396313 396133 396775 399093 402190 403522 402650 402270 404263 407504 410895 415443 421438 426537 429054
56411 429054 430783 434271 439386 444620 449595 454223 457542 459520 462060 466248 470671 474378 479220 487021
56397 487021 496478 505235 513158 521274 529180 535793 541221 545958 549694 552657 556360 561234 565198 566258
56383 566258 564742 561639 557053 552077 549599 550878 553276 553597 551680 548794 544836 539576 534511 530801
56369 530801 527048 521572 515252 509799 504896 499410 493950 489980 487655 486352 485825 485290 483291 480153 478415
$$ packed form
56468F57482j8211j7233j5850j5764j6006j4759j2741j1699j1041r322p553p495
56456D99808q121p479o715q156j0524j0422p885o169o259n834l813j982j625j846
56442D12978j756j528j015N2O42m08k153k782k387k072j488O4J258M77j196j578
56426C97108p95j80O42K318L097J332q72l80J993L241L391M548N995N099K517
56411D29054J729L488N115N234M975M628L319J978K540M188M423L707M842P801
56397D87021R457Q757P923Q116P906O613N428M737L736K963L703M874L964J060
56383E66258j516l103m586m976k478J279K398L21j917k886l958n260n065l710
56369E30801l753n476o320n453m903n486n460l970k325j303n27n35j999l138j738
$$ plain form
56354 478415 479088 479765 478244 475434 472711 469249 464455 460253 458084 456237 453040 450124 449340 448875 446036
56339 446036 441847 439341 438896 438646 438025 437570 436504 433671 429864 426527 423444 420215 418432 419661 422808
56324 422808 425909 428749 431222 431471 428814 426482 428203 433756 440837 449032 458529 467163 472843 477238
56310 477238 483158 489745 494204 496911 500652 505827 510443 514139 518238 522302 524504 525281 527220 531316
56296 531316 536195 540745 544882 548266 550808 553717 557674 561120 562766 564368 568322 574081 579738 585341
56282 585341 591576 596984 599898 601489 603597 605407 605750 606651 610525 615725 619068 621061 624173 627662 629101
56267 629101 629805 633517 640261 646509 651227 656897 664548 672424 679947 688591 698289 706914 713928 721079
56253 721079 729278 738069 747964 759814 772095 782400 791406 801927 814480 827313 840132 854042
$$ packed form
56354D78415O73O77j521k810k723l462m794m202k169j847l197k916p84m65k839
56339D46036m189k506m45k50o21m55j066k833l807l337l083l229j783J229L147
56324D22808L101K840K473K49k657k332J721N553P081Q195R497Q634N680M395
56310D77238N920O587M459K707L741N175M616L696M099M064K202P77J939M096
56296E31316M879M550M137L384K542K909L957L446J646J602L954N759N657N603
56282E85341O235N408K914J591K108J810L43R01L874N200L343J993L112L489J439
56267F29101P04L712O744O248M718N670P651P876P523Q644R698Q625P014P151
56253G21079Q199Q791R895J1850J2281J0305R006J0521J2553J2833J2819J3910
$$ plain form
56241 854042 868483 882161 896178 912006 927170 937619 943918 950355 958197 964916 970113 976863 986321
56228 986321 995926 1004323 1013689 1025701 1038976 1051925 1065008 1079343 1096043 1117066 1143352 1172090
56216 1172090 1199364 1225482 1254080 1286406 1320767 1357455 1399408 1447415 1498952 1552452 1608796
56205 1608796 1668357 1730948 1799051 1876510 1963224 2055463 2152155 2256556 2370955 2494237 2625710
56194 2625710 2766937 2918551 3079408 3250090 3433139 3628529 3832647 4042698 4258213
56185 4258213 4477246 4695119 4908014 5113961 5309274 5487855 5645024 5778483 5885097
56176 5885097 5961077 6006274 6024125 6016544 5983108 5926126 5851872 5765308 5667545 5559604 5444532
56165 5444532 5324560 5200145 5073057 4946522 4821215 4694752 4565831 4435064 4301631
$$ packed form
56241H54042J4441J3678J4017J5828J5164J0449O299O437P842O719N197O750R458
56228I86321R605Q397R366J2012J3275J2949J3083J4335J6700K1023K6286K8738
56216A172090K7274K6118K8598L2326L4361L6688M1953M8007N1537N3500N6344
56205A608796N9561O2591O8103P7459Q6714R2239R6692J04401J14399J23282J31473
56194B625710J41227J51614J60857J70682J83049J95390K04118K10051K15515
56185D258213K19033K17873K12895K05947J95313J78581J57169J33459J06614
56176E885097P5980M5197J7851p581l3436n6982p4254q6564r7763j07941j15072
56165E444532j19972j24415j27088j26535j25307j26463j28921j30767j33433
$$ plain form
56156 4301631 4163661 4022434 3881462 3740828 3597405 3451424 3307607 3168643 3032677
56147 3032677 2898596 2768731 2644858 2526488 2414499 2311390 2216517 2126144 2039683 1960710
56137 1960710 1890471 1825855 1765342 1711199 1663868 1619944 1578050 1541047 1510041 1481772 1454473
56126 1454473 1430665 1411322 1392887 1373262 1355377 1341616 1329912 1318689 1310484 1306999 1305313 1302644
56114 1302644 1300497 1300745 1302092 1303731 1308084 1316581 1326900 1337540 1350904 1368757 1388856 1409022 1430303
56101 1430303 1453387 1476392 1498954 1523811 1551517 1578399 1602653 1627383 1654574 1681319 1705389
56090 1705389 1729331 1755345 1781202 1805045 1829371 1856421 1884509 1912698 1944198 1981157 2021024
56079 2021024 2062319 2109317 2166807 2234784 2312479 2402953 2509308 2630576 2765444 2915566
$$ packed form
56156D301631j37970j41227j40972j40634j43423j45981j43817j38964j35966
56147C032677j34081j29865j23873j18370j11989j03109r4873r0373q6461p8973
56137A960710p0239o4616o0513n4143m7331m3924m1894l7003l1006k8269k7299
56126A454473k3808j9343j8435j9625j7885j3761j1704j1223q205l485j686k669
56114A302644k147K48J347J639M353Q497J0319J0640J3364J7853K0099K0166K1281
56101A430303K3084K3005K2562K4857K7706K6882K4254K4730K7191K6745K4070
56090A705389K3942K6014K5857K3843K4326K7050K8088K8189L1500L6959L9867
56079B021024M1295M6998N7490O7977P7695R0474J06355J21268J34868J50122
$$ plain form
56069 2915566 3080859 3255614 3433183 3610252 3783025 3944355 4089344 4219734 4338945
56060 4338945 4447224 4545053 4635614 4718800 4787328 4833438 4855592 4855312 4833009 4791500 4738255
56049 4738255 4678818 4611807 4533966 4444848 4342528 4221133 4078553 3921951 3760677 3598563
56039 3598563 3437824 3284687 3145035 3018924 2904703 2804183 2718852 2645899 2583009 2532377
56029 2532377 2495172 2467062 2443893 2426461 2414975 2404663 2392019 2379682 2370083 2360406 2349013 2340311
56017 2340311 2337398 2336341 2333580 2332279 2335168 2338154 2337939 2339281 2347462 2360115 2373660 2390933 2414644
56004 2414644 2439933 2461788 2483814 2511477 2542582 2572532 2603073 2637606 2673546 2707404 2741758
55993 2741758 2779490 2817398 2853336 2892856 2940352 2990600 3037745 3085521 3139280 3195183 3247297
$$ packed form
56069B915566J65293J74755J77569J77069J72773J61330J44989J30390J19211
56060D338945J08279R7829R0561Q3186O8528M6110K2154k80k2303m1509n3245
56049D738255n9437o7011p7841q9118j02320j21395j42580j56602j61274j62114
56039C598563j60739j53137j39652j26111j14221j00520q5331p2953o2890n0632
56029B532377l7205k8110k3169j7432j1486j0312j2644j2337r599r677j1393q702
56017B340311k913j057k761j301K889K986k15J342Q181J2653J3545J7273K3711
56004B414644K5289K1855K2026K7663L1105K9950L0541L4533L5940L3858L4354
55993B741758L7732L7908L5938L9520M7496N0248M7145M7776N3759N5903N2114
$$ plain form
55982 3247297 3298633 3355027 3414633 3473548 3535131 3603350 3673554 3740311 3807746 3881628 3958402
55971 3958402 4033050 4110509 4197634 4290918 4384057 4480728 4587797 4703034 4821935 4949371
55961 4949371 5091439 5242799 5395201 5551583 5718612 5892852 6068269 6249964 6446104
55952 6446104 6653660 6866731 7091506 7337928 7604064 7883936 8182836 8509017 8858391
55943 8858391 9223942 9612062 10032652 10481486 10949777 11442361 11968471 12524071 13102421
55934 13102421 13712421 14366549 15060744 15787127 16555894 17382231 18262511 19187400 20167573
55925 20167573 21220931 22344842 23527328 24775094 26103217 27508941 28985744 30552752
55917 30552752 32239944 34055884 36001915 38104801 40399589 42892375 45576899 48474611
$$ packed form
55982C247297N1336N6394N9606N8915O1583O8219P0204O6757O7435P3882P6774
55971C958402P4648P7459Q7125R3284R3139R6671J07069J15237J18901J27436
55961D949371J42068J51360J52402J56382J67029J74240J75417J81695J96140
55952F446104K07556K13071K24775K46422K66136K79872K98900L26181L49374
55943H858391L65551L88120M20590M48834M68291M92584N26110N55600N78350
55934A3102421O10000O54128O94195P26383P68767Q26337Q80280R24889R80173
55925B0167573J053358J123911J182486J247766J328123J405724J476803J567008
55917C0552752J687192J815940J946031K102886K294788K492786K684524K897712
$$ plain form
55909 48474611 51619300 55018491 58676540 62643993 66998549 71793108 77074517 82938765
55901 82938765 89512625 96897840 105193927 114556324 125164648 137158070 150682129 165976550
55893 165976550 183336877 203041622 225442585 251080630 280552260 314292536 352597876
55886 352597876 395493030 441672655 486988759 524442474 546799273 550147382 535432647
55879 535432647 507014440 470065137 428944417 386878479 346085840 307887557 272930690
55872 272930690 241502029 213679463 189321661 168122428 149749080 133890709 120211553
55865 120211553 108364175 98066377 89106971 81281360 74383764 68261124 62817096 57960335
55857 57960335 53595664 49662042 46128916 42951149 40066847 37437537 35049832 32877128
$$ packed form
55909D8474611L144689L399191L658049L967453M354556M794559N281409N864248
55901H2938765O573860P385215Q296087R362397J0608324J1993422J3524059J5294421
55893A65976550J7360327J9704745K2400963K5638045K9471630L3740276L8305340
55886C52597876M2895154M6179625M5316104L7453715K2356799L348109j4714735
55879E35432647k8418207l6949303m1120720m2065938m0792639l8198283l4956867
55872B72930690l1428661k7822566k4357802k1199233j8373348j5858371j3679156
55865A20211553j1847378j0297798q959406p825611o897596o122640n444028m856761
55857E7960335m364671l933622l533126l177767k884302k629310k387705k172704
$$ plain form
55849 32877128 30876924 29026220 27324081 25758058 24300655 22939615 21680202 20515938
55841 20515938 19426132 18403375 17455409 16578259 15753997 14976529 14254094 13584603 12952995
55832 12952995 12354894 11799266 11285055 10797378 10329558 9888057 9473169 9074928 8690755
55823 8690755 8328047 7986677 7657068 7337947 7038382 6759896 6493444 6236290 5995457
55814 5995457 5772070 5557976 5350174 5153696 4968355 4787265 4610244 4444501 4290549
55805 4290549 4141337 3996436 3862821 3740166 3619343 3497213 3379380 3266792 3153388
55796 3153388 3039103 2931830 2834093 2740458 2650409 2571102 2504516 2443617 2383707 2326305 2269917
55785 2269917 2208721 2142856 2078875 2017983 1954939 1890488 1833207 1786287 1743596 1701530 1663878
$$ packed form
55849C2877128k000204j850704j702139j566023j457403j361040j259413j164264
55841B0515938j089806j022757r47966q77150q24262p77468p22435o69491o31608
55832A2952995n98101n55628n14211m87677m67820m41501m14888l98241l84173
55823H690755l62708l41370l29609l19121k99565k78486k66452k57154k40833
55814E995457k23387k14094k07802j96478j85341j81090j77021j65743j53952
55805D290549j49212j44901j33615j22655j20823j22130j17833j12588j13404
55796C153388j14285j07273r7737r3635r0049p9307o6586o0899n9910n7402n6388
55785B269917o1196o5865o3981o0892o3044o4451n7281m6920m2691m2066l7652
$$ plain form
55774 1663878 1631999 1601111 1569928 1543967 1525714 1510776 1496739 1486573 1480282 1472397 1460729 1448779
55762 1448779 1436805 1419548 1395597 1370060 1345054 1316509 1283538 1251987 1225108 1198959 1170494
55751 1170494 1142211 1115503 1087498 1058106 1032636 1013885 998660 984977 975273 969594 963250 954682
55739 954682 948495 947527 948886 950685 955095 961395 963698 959730 954976 953957 953778 950282 944224 937206 927493
55724 927493 914269 900814 889514 878430 866032 854431 845056 836320 828323 824330 824612 824341 820716
55711 820716 816651 814187 809918 800760 789076 778254 767893 757053 747784 741698 737159 733330 733048
55698 733048 738354 746690 754194 758988 758879 750244 732441 709648 685562 659670 631027 601793 574561
55685 574561 549654 527171 508061 491326 474063 456096 440627 428828 418143 407505 399337 394391
$$ packed form
55774A663878l1879l0888l1183k5961j8253j4938j4037j0166o291p885j1668j1950
55762A448779j1974j7257k3951k5537k5006k8545l2971l1551k6879k6149k8465
55751A170494k8283k6708k8005k9392k5470j8751j5225j3683r704n679o344q568
55739I54682o187r68J359J799M410O300K303l968m754j019j79l496o058p018r713
55724I27493j3224j3455j1300j1084j2398j1601r375q736p997l993K82k71l625
55711H20716m065k464m269r158j1684j0822j0361j0840r269o086m539l829k82
55698G33048N306Q336P504M794j09q635j7803k2793k4086k5892k8643k9234k7232
55685E74561k4907k2483j9110j6735j7263j7967j5469j1799j0685j0638q168m946
$$ plain form
55673 394391 389618 383566 379027 377696 376974 374901 373620 374849 376251 375485 373865 372955 371362 367855 363951
55658 363951 360632 356232 350298 345703 344081 342808 339281 334579 330237 325200 318913 313841 311920 311725
55644 311725 311722 313085 316840 321698 327108 334856 345113 354434 360150 363263 364799 363302 358568 353846 351461
55629 351461 349988 348412 349111 353647 359522 364312 369398 376443 383899 390336 397591 407097 416452 423148
55615 423148 428434 434034 438291 439123 437766 436014 432749 426792 420396 416340 414116 412236 411569 413067 414931
55600 414931 415436 416005 418291 420940 422387 423996 427118 429879 430363 430184 431346 432382 431269 429514 429472 430067
55584 430067 428869 426094 422894 418199 411059 403750 398518 393489 385721 376213 367769 359964 350501 339906
55570 339906 330654 322876 314891 306776 299742 293030 284919 275699 266505 256679 245565 235297 228370 223887
$$ packed form
55673C94391m773o052m539j331p22k073j281J229J402p66j620r10j593l507l904
55658C63951l319m400n934m595j622j273l527m702m342n037o287n072j921j95
55644C11725lJ363L755M858N410P748J0257R321N716L113J536j497m734m722k385
55629C51461j473j576O99M536N875M790N086P045P456O437P255R506R355O696
55615D23148N286N600M257Q32j357j752l265n957o396m056k224j880o67J498J864
55600D14931N05N69K286K649J447J609L122K761M84j79J162J036j113j755m2N95
55584D30067j198k775l200m695p140p309n232n029p768r508q444p805r463j0595
55570C39906r252p778p985q115p034o712q111r220r194r826j1114j0268o927m483
$$ plain form
55556 223887 219524 215508 213125 211025 206777 200712 194650 188448 181470 175781 173681 173521 172116 169969
55542 169969 169708 170586 169400 166225 164266 164023 162433 158419 154898 154127 154735 154627 153791 153099 152850 153321 154627
55525 154627 155690 155429 154945 156280 159139 161239 161750 161988 162862 163960 164992 165740 164843 161083 155743 151449
55509 151449 148913 147041 145609 145244 145180 143956 142288 142622 145645 149612 153159 156439 159385 161232 161976
55494 161976 162304 161973 160118 157064 154051 151414 148885 147209 147453 149093 150733 152119 153407 153304 150537
55479 150537 146672 144851 145849 147725 149144 150591 152441 154293 156337 159214 162403 164746 166514 169103
55465 169103 172830 177022 181904 188336 195824 202774 208415 212643 214609 213781 211959 211798 213433 214688 214431
55450 214431 213583 213098 213114 213811 214991 215081 212597 208199 203324 197580 189874 181361 174445 169226 163751 157503
$$ packed form
55556B23887m363m016k383k100m248o065o062o202o978n689k100j60j405k147
55542A69969k61Q78j186l175j959k43j590m014l521p71O08j08q36o92k49M71J306
55525A54627J063k61m84J335K859K100N11K38Q74J098J032P48q97l760n340m294
55509A51449k536j872j432l65o4j224j668L34L023L967L547L280K946J847P44
55494A61976L28l31j855l054l013k637k529j676K44J640J640J386J288j03k767
55479A50537l865j821R98J876J419J447J850J852K044K877L189K343J768K589
55465A69103L727M192M882O432P488O950N641M228J966q28j822j61J635J255k57
55450B14431q48m85J6O97J180R0k484m398m875n744p706q513o916n219n475o248
$$ plain form
55434 157503 151817 146878 141216 134408 127687 121586 115441 109381 104383 100303 96233 92771 91321 91193
55420 91193 90196 88137 86781 86134 84021 80012 76666 75749 75965 75530 74415 72834 69989 65905 62580 61843
55404 61843 63458 66139 68852 70525 70363 69234 69041 70072 70637 69740 68174 66568 64484 62089 60592
55389 60592 60193 59631 58533 58166 58976 59497 58798 58081 58681 60225 61897 63842 66143 68009 69165 70585
55373 70585 72710 74287 74211 73326 73284 74560 76509 78530 80381 82165 84466 87704 91110 93335 94138 94329
55357 94329 94202 93507 92838 93151 93751 92827 90372 88498 88177 87744 85603 82622 80729 80667 82136 84739 87799
55340 87799 90398 92348 94015 94900 94009 92057 91374 92793 94420 94431 93322 92288 91141 89339 87618 86941
55324 86941 86683 85350 82541 79257 76767 75765 75958 75908 74037 70222 65762 61800 58821 57484 58141 59289
$$ packed form
55434A57503n686m939n662o808o721o101o145o060m998m080m070l462j450j28
55420I1193r97k059j356o47k113m009l346r17K16m35j115j581k845m084l325p37
55404F1843J615K681K713J673j62j129j93J031N65q97j566j606k084k395j497
55389F0592l99n62j098l67Q10N21o99p17O00J544J672J945K301J866J156J420
55373G0585K125J577p6q85m2J276J949K021J851J784K301L238L406K225Q03J91
55357I4329j27o95o69L13O00r24k455j874l21m33k141k981j893o2J469K603L060
55340H7799K599J950J667Q85q91j952o83J419J627J1j109j034j147j802j721o77
55324H6941k58j333k809l284k490j002J93n0j871l815m460l962k979j337O57J148
$$ plain form
55308 59289 58453 55406 52786 52616 53873 54561 54606 55209 56546 57628 57810 57267 56446 55784 55424 54668 52523
55291 52523 49291 46806 46501 47912 49510 50284 50199 49888 50091 50746 50707 49215 47236 46127 45525 44240 42791
55274 42791 42818 44049 44335 43160 42616 44026 45927 46567 46258 45945 45538 45164 46210 49291 52579 53841 53041
55257 53041 51495 49612 47038 44112 41653 39960 39177 39929 42422 45446 47185 46719 44439 41765 40600
55242 40600 41859 44236 45705 46364 48023 50783 52357 51575 50133 49576 49018 47614 47024 48960 51926 53005
55226 53005 51951 51102 51767 52841 52768 51174 48719 46618 45985 46657 47211 47007 47190 48611 50047 50036 49287
55209 49287 49497 50704 51701 52286 53095 53708 52987 51115 49397 48048 45990 43062 40750 40216 40838 41196 40575
55192 40575 39169 37592 36482 36122 36319 36914 38076 39702 41047 41548 41494 41221 40320 38414 36264 35249
$$ packed form
55308E9289q36l047k620j70J257O88M5O03J337J082J82n43q21o62l60p56k145
55291E2523l232k485l05J411J598P74q5l11K03O55l9j492j979j109o02j285j449
55274D2791K7J231K86j175n44J410J901O40l09l13m07l74J046L081L288J262q00
55257E3041j546j883k574k926k459j693p83P52K493L024J739m66k280k674j165
55242D0600J259K377J469O59J659K760J574p82j442n57n58j404n90J936K966J079
55226E3005j054q49O65J074p3j594k455k101o33O72N54k04J83J421J436j1p49
55209D9287K10J207R97N85Q09O13p21j872j718j349k058k928k312n34O22L58o21
55192D0575j406j577j110l60J97N95J162J626J345N01n4k73r01j906k150j015
$$ plain form
55176 35249 36075 38545 41956 45042 46290 45286 43378 42335 42863 44804 47780 50806 52342 51955 51200
55161 51200 51734 53277 54455 54771 54442 53094 50321 47187 45635 46408 48568 50844 52370 52468 51039 49152
55145 49152 48206 48484 49210 49715 49724 49004 47840 47443 48682 50617 51444 50798 50020 50243 51337 52750 54220 55418
55127 55418 55874 55711 55751 56536 57625 58075 57282 55282 52542 49607 46941 45109 44788 46043 47728 48390 47876
55110 47876 47236 46999 46703 46304 46598 47606 48038 47343 46945 48139 49900 50243 48898 47119 45622 44343 43756
55093 43756 44692 46875 49086 50871 52965 55898 59077 61417 62242 61668 60526 59615 58593 56273 52563
55078 52563 49280 48182 49035 50560 52298 54341 56137 57172 58244 60400 62935 64018 63249 62192 62362
55063 62362 64020 66940 71022 75752 80057 83077 84579 84828 84637 85141 86612 87894 87920 87410 88084 90609
$$ packed form
55176C5249Q26K470L411L086J248j004j908j043N28J941K976L026J536l87p55
55161E1200N34J543J178L16l29j348k773l134j552P73K160K276J526R8j429j887
55145D9152r46K78P26N05Rp20j164l97J239J935Q27o46p78K23J094J413J470J198
55127E5418M56j63M0P85J089M50p93k000k740k935k666j832l21J255J685O62n14
55110D7876o40k37k96l99K94J008M32o95l98J194J761L43j345j779j497j279n87
55093D3756R36K183K211J785K094K933L179K340Q25n74j142r11j022k320l710
55078E2563l283j098Q53J525J738K043J796J035J072K156K535J083p69j057J70
55063F2362J658K920M082M730M305L020J502K49j91N04J471J282K6n10O74K525
$$ plain form
55047 90609 94226 97794 100049 99627 96489 92954 91559 91980 91714 89740 87707 87166 87424 86882 85107 82741
55031 82741 80429 78630 77654 77236 76675 75894 75703 76681 78531 80916 84140 88423 92983 96408 97809 97491
55015 97491 96810 97408 99992 103573 106144 106271 104078 100999 98937 99181 101491 104363 106606 108377 110217
55000 110217 111723 112082 111570 111424 112198 113148 113426 113043 112412 111454 109565 106297 102044 98092 95728 95197 95820
54983 95820 97062 98763 100315 100805 100479 100914 102927 105381 107045 108407 110380 112304 112904 112572 112903 114322
54967 114322 115763 116459 116494 115718 113801 111527 110633 111932 114561 117060 118203 117052 113686 109935 108027
54952 108027 108244 108915 108725 107835 106778 105771 105375 106472 108973 111541 113076 113669 113894 114056 114410 115240 116342
54935 116342 117098 117196 116788 116103 115559 115806 116701 116653 114278 110435 107304 105712 104792 104091 104134 104644 104092 101782
$$ packed form
55047I0609L617L568K255m22l138l535j395M21k66j974k033n41K58n42j775k366
55031H2741k312j799r76m18n61p81j91R78J850K385L224M283M560L425J401l18
55015I7491o81N98K584L581K571J27k193l079k062K44K310K872K243J771J840
55000A10217J506L59n12j46P74R50K78l83o31r58j889l268m253l952k364n31O23
54983I5820J242J701J552M90l26M35K013K454J664J362J973J924O00l32L31J419
54967A14322J441O96L5p76j917k274q94J299K629K499J143j151l366l751j908
54952A08027K17O71j90q90j057j007l96J097K501K568J535N93K25J62L54Q30J102
54935A16342P56R8m08o85n44K47Q95m8k375l843l131j592r20p01M3N10n52k310
$$ plain form
54917 101782 99051 97633 97851 98938 100096 100793 101158 102457 106032 111242 115650 117753 118407 119039 119769 120137
54901 120137 120497 121581 123429 125775 128919 133342 138744 144121 148595 151920 154552 157506 161685 167256
54887 167256 174035 182155 191433 200281 206626 210320 213528 218294 224736 232143 240718 251407 264667 280033
54873 280033 296248 311340 323172 330518 333223 331348 324981 315017 303111 290359 276859 262874
54861 262874 249296 236400 223194 208861 194174 180720 169440 160645 154789 152236 152431 153965 155411
54848 155411 155894 155283 154213 153716 154573 157114 161447 167266 173501 179044 184079 190162 198724 209966 223131
54833 223131 237170 251078 264277 276739 288184 297401 303175 305637 305647 303102 297123 287841 276516
54820 276516 263836 249635 234582 220467 208150 196715 185404 174968 166272 159016 152942 148942
$$ packed form
54917A01782k731j418K18J087J158O97L65J299L575N210M408K103O54O32P30L68
54901A20137L60J084J848K346L144M423N402N377M474L325K632K954M179N571
54887A67256O779Q120R278Q848O345L694L208M766O442P407Q575J0689J3260J5366
54873B80033J6215J5092J1832P346K705j875o367r964j1906j2752j3500j3985
54861B62874j3578j2896j3206j4333j4687j3454j1280q795n856k553J95J534J446
54848A55411M83o11j070m97Q57K541M333N819O235N543N035O083Q562J1242J3165
54833B23131J4039J3908J3199J2462J1445R217N774K462J0k545n979r282j1325
54820B76516j2680j4201j5053j4115j2317j1435j1311j0436q696p256o074m000
$$ plain form
54808 148942 147503 146949 144776 140315 134965 130180 126342 123399 121545 121038 121800 123263 124534 125058 125157 125422
54792 125422 125576 124680 122543 120054 117878 115803 113652 111804 110445 109216 107965 106880 105661 103779 101802
54777 101802 101019 101198 100382 97760 95122 94236 94255 93296 91420 90338 90911 92519 94361 95905 96485 95940 95438
54760 95438 96297 98090 99104 98523 97106 95904 95428 96039 98063 101304 105181 109385 113795 117900 121013
54745 121013 122954 123992 124353 124461 125318 127809 131697 135993 140155 144284 148355 152113 155781 160147 165716
54730 165716 172236 179188 186436 194272 203020 212684 223012 234000 246170 259884 274502 288741 301794
54717 301794 313402 323011 329895 334225 336729 336875 332740 323671 312026 301113 291992 283393 274239 265033
54703 265033 256942 250454 245038 239561 233173 226174 219891 215445 212981 212245 213245 215830 219193 222368
$$ packed form
54808A48942j439n54k173m461n350m785l838k943j854n07P62J463J271N24R9K65
54792A25422J54q96k137k489k176k075k151j848j359j229j251j085j219j882j977
54777A01802p83J79q16k622k638q86J9r59j876j082N73J608J842J544N80n45n02
54760I5438Q59J793J014n81j417j202m76O11K024L241L877M204M410M105L113
54745A21013J941J038L61J08Q57K491L888M296M162M129M071L758L668M366N569
54730A65716O520O952P248P836Q748R664J0328J0988J2170J3714J4618J4239J3053
54717C01794J1608R609O884M330K504J46m135r069j1645j0913r121q599r154r206
54703B65033q091o488n416n477o388o999o283m446k464p36J000K585L363L175
$$ plain form
54689 222368 225007 227460 230554 235384 242577 251499 260888 270465 281050 292945 305285 317356 329391
54676 329391 341518 352990 362932 370746 375353 375400 370828 362948 352393 338702 322657 306962 293130
54663 293130 279487 264160 248519 235572 226021 218008 209925 201442 192398 182800 173609 165840 159291
54650 159291 153744 150554 150972 153461 154957 154584 154035 154414 154906 154649 153805 152476 150611 149315 150209 152899
54634 152899 154993 155301 155213 156200 157752 158798 159549 160698 161975 162650 162629 162176 161357 160512 160464 161484 162709
54617 162709 163170 162734 161705 160362 159330 159451 160719 162168 163347 164954 167404 169738 170828 170974 171445
54602 171445 172877 174950 177374 180529 185132 191438 198608 204864 208813 210769 212261 214160 215884 216545
54588 216545 216136 215312 214653 214510 215114 216484 218495 221029 223731 225901 227279 228688 231018 233808 235928
$$ packed form
54689B22368K639K453L094M830P193Q922R389R577J0585J1895J2340J2071J2035
54676C29391J2127J1472R942P814M607M7m572p880j0555j3691j6045j5695j3832
54663B93130j3643j5327j5641j2947r551q013q083q483r044r598r191p769o549
54650A59291n547l190M18K489J496l73n49L79M92k57q44j329j865j296Q94K690
54634A52899K094L08q8R87J552J046P51J149J277O75k1m53q19q45m8J020J225
54617A62709M61m36j029j343j032J21J268J449J179J607K450K334J090J46M71
54602A71445J432K073K424L155M603O306P170O256L949J956J492J899J724O61
54588B16545m09q24o59j43O04J370K011K534K702K170J378J409K330K790K120
$$ plain form
54573 235928 237628 240569 245528 251358 256792 262066 267879 273528 277101 277161 273624 267410 259859 252340 245859
54558 245859 240828 237033 233557 229168 223534 217935 213956 211526 209158 206077 203034 200893 199637 199130
54544 199130 199664 201135 202665 203728 204723 205847 206307 205444 203766 202051 200163 197597 194451 190934 186544
54529 186544 180851 174642 169207 164746 160531 156520 153627 152137 150805 148069 143745 139131 135725 134052
54515 134052 133512 133105 132271 131266 130808 131286 132062 131546 128445 123406 119031 117565 118615 119837 119761 119018 118638
54498 118638 118251 116738 113965 111072 109318 109282 110940 113785 116835 119013 119723 119033 117521 116119 115822 117126
54482 117126 119711 122778 125571 127502 128119 127430 126275 126027 127587 130584 133645 135652 136794 138242 140774
54467 140774 144024 147179 149945 152447 154554 155851 156184 155766 154846 153667 152632 152111 152127 152510 153175 153979
$$ packed form
54573B35928J700K941M959N830N434N274N813N649L573O0l537o214p551p519o481
54558B45859n031l795l476m389n634n599l979k430k368l081l043k141j256n07
54544A99130N34J471J530J063R95J124M60q63j678j715j888k566l146l517m390
54529A86544n693o209n435m461m215m011k893j490j332k736m324m614l406j673
54515A34052n40m07q34j005m58M78P76n16l101n039m375j466J050J222p6p43l80
54498A18638l87j513k773k893j754l6J658K845L050K178P10o90j512j402k97J304
54482A17126K585L067K793J931O17o89j155k48J560K997L061K007J142J448K532
54467A40774L250L155K766K502K107J297L33m18r20j179j035n21J6L83O65Q04
$$ plain form
54451 153979 154568 154663 154177 152817 150183 146654 143446 141080 138547 134924 131136 128825 127995 127243 126110 125639
54435 125639 126375 127211 126690 124407 120845 116891 113868 112945 114006 115879 118002 120920 124829 128690 131288
54420 131288 132372 132296 131427 130356 129840 130069 130702 131883 134195 137228 139332 139513 138596 137799 137186 136461 136385
54403 136385 138104 141422 144802 147006 148108 149072 150884 153831 157110 159287 159608 158766 158224 159026 161261
54388 161261 164078 166073 166280 165123 163881 163121 162296 160992 159720 159050 158725 158037 156489 153835 150166 146234
54372 146234 142958 140394 138055 136270 136044 137190 137977 137284 135952 135267 135353 135994 137701 140614 143307 144219
54356 144219 143798 143883 145268 147010 148011 148255 148514 149568 151650 154232 156596 158819 161513 164330 165919
54341 165919 166145 167155 170938 176600 181490 184514 186960 190306 194589 198959 202795 206083 209362 213238
$$ packed form
54451A53979N89R5m86j360k634l529l208k366k533l623l788k311q30p52j133m71
54435A25639P36Q36n21k283l562l954l023r23J061J873K123K918L909L861K598
54420A31288J084p6q69j071n16K29O33J181K312L033K104J81r17p97o13p25p6
54403A36385J719L318L380K204J102R64J812K947L279K177L21q42n42Q02K235
54388A61261K817J995K07j157j242p60q25j304j272o70l25o88j548k654l669l932
54372A46234l276k564k339j785k26J146P87o93j332o85Q6O41J707K913K693R12
54356A44219m21Q5J385J742J001K44K59J054K082K582K364K223K694K817J589
54341A65919K26J010L783N662M890L024K446L346M283M370L836L288L279L876
$$ plain form
54327 213238 217461 220867 222801 224034 225550 227054 227584 227009 225810 223870 220648 216274 211484 206819 202742
54312 202742 199920 198244 196137 192228 187303 183361 181154 180026 179676 180227 180773 179831 177579 175838 175406
54297 175406 174924 173061 170362 168203 167221 167592 169615 172930 175945 177114 176502 175600 175949 178146 181510 184373
54281 184373 185343 184633 183640 183250 183387 184149 186100 189056 191783 193497 194641 195747 196680 197602 199267 201373
54265 201373 201923 199649 196142 194013 193532 192600 189703 185279 180149 174306 167836 161796 157248 153950 150667
54250 150667 146513 141690 137130 133702 131593 130380 129753 129943 131059 132280 132325 130729 128116 125212 122291
54235 122291 119715 118108 117508 116940 115558 113889 113282 114281 116095 117578 118152 117819 116872 115762 114763 113691
54219 113691 112416 111602 112184 113875 115004 114416 112896 112041 112324 113061 113758 114414 114733 114272 113525 113796 115663
$$ packed form
54327B13238M223L406J934J233J516J504N30n75j199j940l222m374m790m665m077
54312B02742k822j676k107l909m925l942k207j128l50N51N46r42k252j741m32
54297A75406m82j863k699k159r82L71K023L315L015J169o12r02L49K197L364K863
54281A84373R70p10r93l90J37P62J951K956K727J714J144J106R33R22J665K106
54265B01373N50k274l507k129m81r32k897m424n130n843o470o040m548l298l283
54250A50667m154m823m560l428k109j213o27J90J116J221M5j596k613k904k921
54235A22291k576j607o00n68j382j669o07R99J814J483N74l33r47j110r99j072
54219A13691j275q14N82J691J129n88j520q55K83P37O97O56L19m61p47K71J867
$$ plain form
54202 115663 118329 120775 122802 124686 126696 129194 132310 135043 135657 133532 129954 126613 124234 123139
54188 123139 123856 126024 127652 126934 124395 122138 121390 121812 122651 123203 122481 120007 116975 115311 115352 115679 115423
54171 115423 115392 116535 118535 120547 122294 123646 124055 123344 122536 123006 125019 127649 129923 131525 132548 133073
54155 133073 133076 132661 132347 132937 134720 136881 138224 138465 138257 137897 136846 134912 133189 133141 135006 137606 139623
54138 139623 140721 141558 142931 144892 146662 147485 147421 146999 146320 145079 143404 141925 140820 139520 137703 135956
54122 135956 134968 134634 134543 134935 136404 138760 140850 141629 140986 139392 137104 134058 130421 126956 124582 123621
54106 123621 123674 124300 125501 127311 129263 130733 131756 132963 134666 136398 137516 137904 137978 138228 138814 139373
54090 139373 139228 137994 135912 133363 130412 127334 125288 125536 127856 130480 131883 132037 131702 131291 130856 130474
$$ packed form
54202A15663K666K446K027J884K010K498L116K733O14k125l578l341k379j095
54188A23139P17K168J628p18k539k257p48M22Q39N52p22k474l032j664M1L27k56
54171A15423l1J143K000K012J747J352M09p11q08M70K013K630K274J602J023N25
54155A33073Lm15l14N90J783K161J343K41k08l60j051j934j723m8J865K600K017
54138A39623J098Q37J373J961J770Q23o4m22o79j241j675j479j105j300j817j747
54122A35956r88l34r1L92J469K356K090P79o43j594k288l046l637l465k374r61
54106A23621N3O26J201J810J952J470J023J207J703J732J118L88P4K50N86N59
54090A39373j45j234k082k549k951l078k046K48K320K624J403J54l35m11m35l82
$$ plain form
54074 130474 130008 128983 127306 125711 124858 124379 123565 122644 122453 122892 122703 121180 119418 119312 121630 125431
54058 125431 129034 131061 130809 128384 124797 121567 119738 119178 118863 117824 115831 113396 111351 110296 110241
54043 110241 110723 111435 112623 114667 117354 119811 121196 121192 119904 117592 114652 111646 109326 108513 109550 111540
54027 111540 112665 112095 111195 111840 113676 114497 113567 112992 114889 118513 121379 122288 121939 121377 121347 122680 125655
54010 125655 129071 131374 132706 134495 136996 138759 138896 138469 138980 140566 142397 143955 145192 146130 146989
53995 146989 148186 149772 151290 152532 153834 155361 156761 157882 159175 160933 162764 164203 165295 166269
53981 166269 167348 169314 173402 179907 187374 193924 199122 204008 209589 215838 221933 227087 231241 235246
53967 235246 240131 246198 253139 260969 270169 280775 292075 303440 314735 325629 335400 343877 351651
$$ packed form
54074A30474m66j025j677j595q53m79q14r21j91M39j89j523j762j06K318L801
54058A25431L603K027k52k425l587l230j829n60l15j039j993k435k045j055n5
54043A10241M82P12J188K044K687K457J385mj288k312k940l006k320q13J037J990
54027A11540J125n70r00O45J836Q21r30n75J897L624K866R09l49n62l0J333K975
54010A25655L416K303J332J789K501J763J37m27N11J586J831J558J237R38Q59
53995A46989J197J586J518J242J302J527J400J121J293J758J831J439J092R74
53981A66269J079J966M088O505P467O550N198M886N581O249O095N154M154M005
53967B35246M885O067O941P830R200J0606J1300J1365J1295J0894R771Q477P774
$$ plain form
53954 351651 358789 364254 367388 369142 370914 372901 374569 376030 377563 378222 376384 371868 366412 361847
53940 361847 358637 356222 353739 350092 344357 336823 329162 322998 318501 314573 310073 304599 298440 292163
53926 292163 286280 281192 277298 274820 273260 271369 268242 264359 261116 259288 258380 257369 255591 253001
53912 253001 250235 248507 248707 250256 251432 251210 250259 249852 250427 251744 253740 256222 258131 258378 257611 258000
53896 258000 260698 264444 267371 269342 271350 273228 273491 271612 269083 267635 267439 267745 268386 269704 271643
53881 271643 273954 276887 280749 284984 288681 291794 294970 298324 301413 304398 308101 312721 317546 322355
53867 322355 328068 335463 343996 352449 360038 366381 371173 374611 377586 380677 383360 384940 385938 387763
53853 387763 391164 395617 400255 404856 409827 415541 421795 427778 432781 437090 442031 448872 457757 467694
$$ packed form
53954C51651P138N465L134J754J772J987J668J461J533O59j838m516n456m565
53940C61847l210k415k483l647n735p534p661o164m497l928m500n474o159o277
53926B92163n883n088l894k478j560j891l127l883l243j828r08j011j778k590
53912B53001k766j728K00J549J176k22r51m07N75J317J996K482J909K47p67L89
53896B58000K698L746K927J971K008J878K63j879k529j448j96L06O41J318J939
53881B71643K311K933L862M235L697L113L176L354L089K985L703M620M825M809
53867C22355N713P395Q533Q453P589O343M792L438K975L091K683J580R98J825
53853C87763L401M453M638M601M971N714O254N983N003M309M941O841Q885R937
$$ plain form
53839 467694 477348 485785 492790 498605 503144 505574 505169 502566 499413 496633 493752 490260 486754 483991
53825 483991 481410 477462 471262 463325 454848 446721 439046 431134 422050 411482 399946 388033 375866
53812 375866 363551 351676 340900 331456 323412 317007 312212 308339 304538 300413 295765 290208 283606
53799 283606 276441 269202 261779 254087 246873 241056 236491 232201 227759 223635 220215 217229 214363 211809
53785 211809 209833 208223 206450 204251 201869 199771 198135 196657 195050 193618 192909 192664 191710 189292 186046
53770 186046 183224 181402 180531 180707 182116 184299 186189 186975 186624 185715 185087 185352 186270 186854 186563 186067 186301
53753 186301 187124 187699 187958 188866 191215 194878 199304 204030 208566 212421 215608 218700 222161 225916 229788
53738 229788 234046 239189 245160 250972 255453 258626 262114 267624 275082 283030 290871 299569 309530 318971
$$ packed form
53839D67694R654Q437P005N815M539K430m05k603l153k780k881l492l506k763
53825D83991k581l948o200p937q477q127p675p912r084j0568j1536j1913j2167
53812C75866j2315j1875j0776r444q044o405m795l873l801m125m648n557o602
53799B83606p165p239p423p692p214n817m565m290m442m124l420k986k866k554
53785B11809j976j610j773k199k382k098j636j478j607j432p09k45r54k418l246
53770A86046k822j822q71J76J409K183J890P86l51r09o28K65R18N84k91m96K34
53753A86301Q23N75K59R08K349L663M426M726M536L855L187L092L461L755L872
53738B29788M258N143N971N812M481L173L488N510P458P948P841Q698R961R441
$$ plain form
53724 318971 325578 329154 331498 334113 337238 340739 344537 348116 350824 352823 354702 356070 355813 354030
53710 354030 352448 352296 352883 353057 353088 353973 355338 355214 352037 346310 340192 335744 333562 332824 332457 332040 331504
53693 331504 330453 328494 326157 324612 324246 324209 323682 322900 322433 322137 321477 320406 319110 317143 313646 308525
53677 308525 302699 296982 291264 285203 279361 275009 272724 271558 269911 267060 263544 260162 257138 254478
53663 254478 252646 252246 253093 254085 254245 253666 253238 253491 253886 253322 251389 248986 247503 247529 248631 250257 252258
53646 252258 254422 256197 257409 258834 261545 265908 271512 277728 283936 289599 294692 299753 305061 310129
53632 310129 314626 319411 325806 333892 342250 349497 355494 361014 366686 372471 377814 382179 385535 388192
53618 388192 390106 390791 390256 389511 389609 390491 391238 391087 389747 387369 384913 383968 385086 386592 385998 382557 377669
$$ packed form
53724C18971O607L576K344K615L125L501L798L579K708J999J879J368k57j783
53710C54030j582j52N87J74L1Q85J365j24l177n727o118m448k182p38l67m17n36
53693C31504j051j959k337j545l66l7n27p82m67k96o60j071j296j967l497n121
53677C08525n826n717n718o061n842m352k285j166j647k851l516l382l024k660
53663B54478j832m00Q47R92J60n79m28K53L95n64j933k403j483K6J102J626K001
53646B52258K164J775J212J425K711M363N604O216O208N663N093N061N308N068
53632C10129M497M785O395Q086Q358P247N997N520N672N785N343M365L356K657
53618C88192J914O85n35p45R8Q82P47j51j340k378k456r45J118J506n94l441m888
$$ plain form
53601 377669 373155 369999 368334 367365 365393 361199 355555 350396 346585 343648 341536 341082 342400 344359 346270
53586 346270 348796 352424 356207 358979 360933 363020 365355 367065 367336 366046 363790 361740 360958 361485 362554
53571 362554 363835 365694 368090 370267 371992 373986 376484 378445 379063 379165 380203 382660 386325 391271 397393
53556 397393 403655 408975 413372 417224 420180 422132 424684 429881 437449 444835 450296 454662 459676 465828
53542 465828 472402 478644 484064 488409 492237 497134 504501 514124 524440 534148 543189 552130 561124 569777
53528 569777 577885 585801 593834 601553 608160 613532 618406 623388 628268 632519 635932 638418 639790 640332
53514 640332 641169 643312 646517 649641 651983 653708 655174 656517 657939 659809 662379 665807 670319 675784
53500 675784 681146 684931 686476 686290 685314 684412 684470 686040 688542 690563 691573 692816 695955 701139 706893
$$ packed form
53601C77669m514l156j665r69j972m194n644n159l811k937k112m54J318J959J911
53586C46270K526L628L783K772J954K087K335J710K71j290k256k050p82N27J069
53571C62554J281J859K396K177J725J994K498J961O18J02J038K457L665M946O122
53556C97393O262N320M397L852K956J952K552N197P568P386N461M366N014O152
53542D65828O574O242N420M345L828M897P367R623J0316R708R041Q941Q994Q653
53528E69777Q108P916Q033P719O607N372M874M982M880M251L413K486J372N42
53514F40332Q37K143L205L124K342J725J466J343J422J870K570L428M512N465
53500F75784N362L785J545j86r76r02N8J570K502K021J010J243L139N184N754
$$ plain form
53485 706893 711645 714835 716830 718511 720986 725036 730444 736213 741714 747390 754116 762086 770621 778944
53471 778944 786807 794426 802195 810557 819854 830022 840556 851026 861708 873604 887675 903949
53459 903949 921337 938542 955402 973187 993209 1015159 1037264 1058240 1078708 1100507 1124996
53448 1124996 1152179 1180894 1209524 1237214 1265056 1295566 1330194 1367656 1405570 1443399 1482674
53437 1482674 1524470 1568061 1612495 1658213 1706122 1755856 1806028 1855885 1905703 1955548 2004538
53426 2004538 2051690 2096995 2141208 2184736 2227213 2268264 2308407 2348752 2389838 2431208 2472287
53415 2472287 2513084 2553488 2592391 2628504 2662183 2695587 2730512 2766393 2800812 2831854 2859752
53404 2859752 2886287 2912648 2938028 2960543 2979333 2995069 3008275 3018299 3024732 3028799 3031829 3032875
$$ packed form
53485G06893M752L190J995J681K475M050N408N769N501N676O726P970Q535Q323
53471G78944P863P619P769Q362R297J0168J0534J0470J0682J1896J4071J6274
53459I03949J7388J7205J6860J7785K0022K1950K2105K0976K0468K1799K4489
53448A124996K7183K8715K8630K7690K7842L0510L4628L7462L7914L7829L9275
53437A482674M1796M3591M4434M5718M7909M9734N0172M9857M9818M9845M8990
53426B004538M7152M5305M4213M3528M2477M1051M0143M0345M1086M1370M1079
53415B472287M0797M0404L8903L6113L3679L3404L4925L5881L4419L1042K7898
53404B859752K6535K6361K5380K2515J8790J5736J3206J0024O433M067L030J046
$$ plain form
53392 3032875 3029432 3020422 3006859 2989498 2967837 2942223 2915204 2889297 2864313 2838126 2809428 2778547
53380 2778547 2745966 2711380 2674424 2635649 2596537 2558573 2522053 2485797 2448535 2410732 2374458
53369 2374458 2341354 2311495 2284179 2258674 2233876 2208781 2184209 2162766 2145878 2131897 2118470
53358 2118470 2105873 2096369 2090814 2087628 2085138 2083479 2083937 2087521 2094521 2104610 2117123 2131735 2148820
53345 2148820 2168670 2190728 2214473 2240740 2271057 2305607 2342791 2380897 2419485 2459197 2501195
53334 2501195 2546876 2597075 2651091 2707204 2764519 2823765 2886064 2951587 3019738 3090076 3162633
53323 3162633 3237683 3315598 3396650 3480721 3567280 3655708 3745480 3836012 3926518 4016091 4103907
53312 4103907 4189667 4273919 4357428 4439825 4519300 4594105 4663908 4729034 4788880 4842041 4887914
$$ packed form
53392C032875l443r010j3563j7361k1661k5614k7019k5907k4984k6187k8698l0881
53380B778547l2581l4586l6956l8775l9112l7964l6520l6256l7262l7803l6274
53369B374458l3104k9859k7316k5505k4798k5095k4572k1443j6888j3981j3427
53358B118470j2597r504n555l186k490j659M58L584P000J0089J2513J4612J7085
53345B148820J9850K2058K3745K6267L0317L4550L7184L8106L8588L9712M1998
53334B501195M5681N0199N4016N6113N7315N9246O2299O5523O8151P0338P2557
53323C162633P5050P7915Q1052Q4071Q6559Q8428Q9772R0532R0506Q9573Q7816
53312D103907Q5760Q4252Q3509Q2397P9475P4805O9803O5126N9846N3161M5873
$$ plain form
53301 4887914 4927264 4961068 4989465 5012040 5028535 5038904 5042810 5039203 5026514 5003736 4971724 4933019
53289 4933019 4889986 4843373 4792932 4738713 4680983 4619451 4553564 4483450 4409967 4334135 4257172
53278 4257172 4180537 4104965 4029790 3954133 3878454 3804032 3731377 3660329 3591294 3524936 3460718
53267 3460718 3397160 3333625 3270652 3208679 3148072 3090496 3038296 2991712 2948329 2906224 2866130
53256 2866130 2829291 2794684 2760184 2725775 2693627 2664983 2638481 2612001 2585098 2558942 2534491
53245 2534491 2511504 2489363 2468370 2449682 2433941 2420407 2407965 2396697 2387819 2382133 2379286 2378611
53233 2378611 2379898 2383117 2388204 2395519 2405853 2419446 2435533 2453327 2472952 2494895 2518972 2544463
53221 2544463 2571089 2599432 2630408 2664479 2701098 2738795 2776134 2812759 2849194 2885584 2921199
$$ packed form
53301D887914L9350L3804K8397K2575J6495J0369L906l607j2689k2778l2012l8705
53289D933019m3033m6613n0441n4219n7730o1532o5887p0114p3483p5832p6963
53278D257172p6635p5572p5175p5657p5679p4422p2655p1048o9035o6358o4218
53267C460718o3558o3535o2973o1973o0607n7576n2200m6584m3383m2105m0094
53256B866130l6839l4607l4500l4409l2148k8644k6502k6480k6903k6156k4451
53245B534491k2987k2141k0993j8688j5741j3534j2442j1268q878n686k847o75
53233B378611J287L219N087P315J0334J3593J6087J7794J9625K1943K4077K5491
53221B544463K6626K8343L0976L4071L6619L7697L7339L6625L6435L6390L5615
$$ plain form
53210 2921199 2955363 2988210 3020019 3050040 3076420 3097329 3112257 3122566 3130656 3138005 3143865 3146274
53198 3146274 3144258 3138469 3129858 3118707 3105117 3089390 3071370 3050263 3025713 2998451 2969381 2938653
53186 2938653 2906117 2871949 2836186 2798409 2758750 2718687 2679860 2642373 2605035 2567049 2528647
53175 2528647 2490224 2451784 2413481 2376111 2340786 2308209 2278116 2249137 2219414 2187893 2155134
53164 2155134 2122750 2092194 2064166 2038591 2014650 1991081 1967136 1943287 1920598 1899484 1879534
53153 1879534 1860431 1842409 1825516 1808914 1791504 1773268 1755382 1738524 1721329 1701236 1677191
53142 1677191 1650912 1624978 1600206 1575578 1550210 1524263 1498084 1471766 1445918 1421667 1399097
53131 1399097 1376450 1351717 1324709 1297044 1270454 1245569 1221921 1198483 1174246 1148712 1121930
$$ packed form
53210B921199L4164L2847L1809L0021K6380K0909J4928J0309Q090P349N860K409
53198C146274k016n789q611j1151j3590j5727j8020k1107k4550k7262k9070l0728
53186B938653l2536l4168l5763l7777l9659m0063l8827l7487l7338l7986l8402
53175B528647l8423l8440l8303l7370l5325l2577l0093k8979k9723l1521l2759
53164B155134l2384l0556k8028k5575k3941k3569k3945k3849k2689k1114j9950
53153A879534j9103j8022j6893j6602j7410j8236j7886j6858j7195k0093k4045
53142A677191k6279k5934k4772k4628k5368k5947k6179k6318k5848k4251k2570
53131A399097k2647k4733k7008k7665k6590k4885k3648k3438k4237k5534k6782
$$ plain form
53120 1121930 1094210 1066126 1038579 1012222 986744 961285 935620 910280 885640 861853 839642
53109 839642 819930 802278 784919 767009 749698 734260 720243 706422 692449 678404 663658
53098 663658 647615 631110 615760 602244 590298 579886 571112 563255 555248 547082 539541 532575 525105
53085 525105 516683 508276 501104 495459 490825 486397 481357 475411 469313 464254 460564 457439 453888 449419
53071 449419 443950 437772 431554 425713 419900 413911 408944 406878 407977 410115 410620 408451 404467 400150
53057 400150 396298 392542 388094 383216 379549 378247 378209 377208 374634 371937 370233 368781 366396 363242 360431
53042 360431 358556 357411 356672 356130 355537 354745 353927 353432 353667 355150 358206 362414 366786 370589 373605 375676
53026 375676 376782 377629 379235 381472 382843 382256 380381 378684 377653 376630 374908 372308 368964 365068 360733
$$ packed form
53120A121930k7720k8084k7547k6357k5478k5459k5665k5340k4640k3787k2211
53109H39642j9712j7652j7359j7910j7311j5438j4017j3821j3973j4045j4746
53098F63658j6043j6505j5350j3516j1946j0412q774p857q007q166p541o966p470
53085E25105q422q407p172n645m634m428n040n946o098n059l690l125l551m469
53071D49419n469o178o218n841n813n989m967k066J099K138N05k169l984m317
53057D00150l852l756m448m878l667j302l8j001k574k697j704j452k385l154k811
53042C60431j875j145p39n42n93p92q18m95K35J483L056M208M372L803L016K071
53026C75676J106Q47J606K237J371n87j875j697j031j023j722k600l344l896m335
$$ plain form
53011 360733 355866 350499 345357 341420 338674 336050 333073 330567 328980 326951 322872 317337 312610 309735
52997 309735 307516 304479 300585 296579 292853 289671 287680 287306 288018 288747 288704 287378 284385 280001 275406
52982 275406 271560 268103 264148 259983 257013 255861 255454 254403 252581 250880 249969 249893 250359 250747 250122 248117
52966 248117 245711 244433 244673 245302 245026 243542 241355 239195 237888 238054 239337 240274 239500 237016 234039 231880
52950 231880 231115 231433 231984 232125 232094 232664 234028 235596 237102 239064 241530 243220 242994 241716 241497 243110
52934 243110 245243 246350 246230 245537 244772 244364 244962 246902 249682 252516 255070 257208 258382 257973 256280 254670
52918 254670 254417 255544 256971 257642 257304 256238 254774 253438 253188 254628 256955 258517 258779 258916 260003 261536
52902 261536 262575 263478 265312 268162 271407 275356 280941 287669 293356 296503 297823 299039 301248 304829
$$ packed form
53011C60733m867n367n142l937k746k624k977k506j587k029m079n535m727k875
52997C09735k219l037l894m006l726l182j991l74P12P29m3j326k993m384m595
52982B75406l846l457l955m165k970j152m07j051j822j701r11p6M66L88o25k005
52966B48117k406j278K40O29k76j484k187k160j307J66J283R37p74k484k977k159
52950B31880p65L18N51J41l1N70J364J568J506J962K466J690k26j278k19J613
52934B43110K133J107j20o93p65m08N98J940K780K834K554K138J174m09j693j610
52918B54670k53J127J427O71l38j066j464j336k50J440K327J562K62J37J087J533
52902B61536J039R03J834K850L245L949N585O728N687L147J320J216K209L581
$$ plain form
52888 304829 309594 314311 317340 318783 321049 326220 333647 341166 347763 353742 359009 363032 366359 370491
52874 370491 375792 380744 383765 384818 384706 383746 381972 380046 378990 378965 378858 377312 374008 369949 366578
52859 366578 364598 363621 362794 361618 360101 358480 357066 356183 355908 355930 355942 355988 356200 356405 356375 356312 356637 357270 357615
52840 357615 357307 356692 356344 356222 355420 352895 348757 344825 343320 344564 346458 346836 345900 345573 346815 348737
52824 348737 350355 351778 353085 353264 351482 348867 347743 349072 351576 353535 354664 355843 357661 359781
52810 359781 361494 362438 362888 363642 365488 368469 371682 373974 374765 374087 372114 369205 366299 364599 364552 365488
52794 365488 366487 367176 367403 366751 365107 363353 362636 363052 363903 365231 368060 372714 377844 381771 384123 385474
52778 385474 386068 385865 385440 385719 386806 387905 388498 388934 389807 391342 393454 395798 397791 399213 400724 403043
$$ packed form
52888C04829M765M717L029J443K266N171P427P519O597N979N267M023L327M132
52874C70491N301M952L021J053j12r60j774j926j056k5j07j546l304m059l371
52859C66578j980r77q27j176j517j621j414q83k75K2J2M6K12K05l0o3L25O33L45
52840C57615l08o15l48j22q02k525m138l932j505J244J894L78r36l27J242J922
52824C48737J618J423J307J79j782k615j124J329K504J959J129J179J818K120
52810C59781J713R44M50P54J846K981L213K292P91o78j973k909k906j700m7R36
52794C65488R99O89K27o52j644j754p17M16Q51J328K829M654N130L927K352J351
52778C85474N94k03m25K79J087J099N93M36Q73J535K112K344J993J422J511K319
$$ plain form
52762 403043 405665 407341 407906 408495 409696 410790 411461 412856 415632 418000 417452 414119 410684 408869 407525
52747 407525 404696 400162 395019 389734 383879 377455 371422 366699 363238 360267 357123 353578 349480 344328
52733 344328 337669 330103 323520 319474 317292 314538 309784 304191 299861 297266 295193 292773 290369 288353
52719 288353 286136 283060 279549 276567 274204 271579 268277 265208 263615 263500 263479 262213 259586 256410 253376
52704 253376 250636 248133 245808 243447 240780 237893 235239 233082 231127 228766 225506 221266 216669 212963
52690 212963 211008 210205 209115 207338 205983 205795 205784 204584 202412 200500 198956 196555 192606 187862 183318
52675 183318 179223 175564 172542 170054 167602 165259 163926 164041 164723 164881 164483 164013 163321 162067 160928 161147
52659 161147 162803 164514 165214 165400 166000 166602 165761 163167 160732 160774 163288 165798 166115 164531 162732 161346
$$ packed form
52762D03043K622J676N65N89J201J094O71J395K776K368n48l333l435j815j344
52747D07525k829m534n143n285n855o424o033m723l461k971l144l545m098n152
52733C44328o659p566o583m046k182k754m754n593m330k595k073k420k404k016
52719B88353k217l076l511k982k363k625l302l069j593j15k1j266k627l176l034
52704B53376k740k503k325k361k667k887k654k157j955k361l260m240m597l706
52690B12963j955q03j090j777j355j88j1j200k172j912j544k401l949m744m544
52675A83318m095l659l022k488k452k343j333J15O82J58l98m70o92j254j139K19
52659A61147J656J711P00J86O00O02q41k594k435M2K514K510L17j584j799j386
$$ plain form
52643 161346 159658 157384 155334 154131 153501 153232 153655 154525 154564 153191 151853 152449 154898 157373 158635 159010
52627 159010 159263 159671 160399 161787 163889 166280 168594 170767 172686 174091 174982 175792 177019 178931 181593
52612 181593 184866 188458 192154 195855 199222 201745 203515 205442 208172 211219 213725 215525 216718 216850
52598 216850 215500 213251 210884 207909 203238 197242 191732 187727 184574 181614 179258 177722 176007 173297
52584 173297 170407 168674 167879 166424 163494 160122 157938 157367 157162 155583 152098 148101 145780 146175 148533
52569 148533 151452 154047 155936 156838 156761 156225 155973 156658 158791 162305 165934 167851 167490 166195 165514 165474 165208
52552 165208 164673 164723 165664 166766 167362 167725 168546 170015 171762 173296 174210 174131 172920 171143 170096 170911 173357
52535 173357 175838 176976 177047 177449 178974 181223 183583 185914 188046 189509 190301 191239 192889 194573 195108 194334
$$ packed form
52643A61346j688k274k050j203o30k69M23Q70L9j373j338N96K449K475J262L75
52627A59010K53M08P28J388K102K391K314K173J919J405Q91Q10J227J912K662
52612A81593L273L592L696L701L367K523J770J927K730L047K506J800J193J32
52598B16850j350k249k367k975m671n996n510m005l153k960k356j536j715k710
52584A73297k890j733p95j455k930l372k184n71k05j579l485l997k321L95K358
52569A48533K919K595J889R02p7n36k52O85K133L514L629J917l61j295o81m0k66
52552A65208n35N0R41J102N96L63Q21J469J747J534R14p9j211j777j047Q15K446
52535A73357K481J138P1M02J525K249K360K331K132J463P92R38J650J684N35p74
$$ plain form
52519 194334 193372 193540 195312 198129 200859 202712 203981 205589 207731 209474 210159 210643 212436 215855 219721
52504 219721 222657 224176 224663 225036 226335 228974 232231 234995 237127 239675 243592 248554 253169 256104 257103
52489 257103 257278 258379 261347 265376 268654 270083 270024 269425 268782 268232 268112 268745 269739 270187 269880 269869 271350
52472 271350 274184 277115 279356 281219 282989 284096 284121 284040 285504 289054 293804 298656 302920 305870 306862
52457 306862 306208 304956 303450 301010 297499 294211 292528 292487 293422 295205 297745 299804 299692 297280 294413
52442 294413 292996 293263 294142 294778 295170 295418 294864 292528 288561 284820 283391 284552 286712 288217 288582 288139
52426 288139 287544 287788 289558 292157 294090 295144 296704 299383 301783 302756 303577 306150 309874 312159 311716
52411 311716 309625 307260 304894 302535 300519 298873 297496 297407 300314 306210 312622 317026 318943 319038 317569
$$ packed form
52519A94334r62J68J772K817K730J853J269J608K142J743O85M84J793L419L866
52504B19721K936J519M87L73J299K639L257K764K132K548L917M962M615K935R99
52489B57103J75J101K968M029L278J429n9n99o43n50j20O33R94M48l07j1J481
52472B71350K834K931K241J863J770J107K5q1J464L550M750M852M264K950R92
52457C06862o54j252j506k440l511l288j683m1R35J783K540K059j12k412k867
52442B94413j417K67Q79O36L92K48n54k336l967l741j429J161K160J505L65m43
52426B88139n95K44J770K599J933J054J560K679K400R73Q21K573L724K285m43
52411C11716k091k365k366k359k016j646j377q9K907N896O412M404J917R5j469
$$ plain form
52396 317569 315087 313608 315234 319697 324573 327995 330140 331988 333771 335119 335811 335721 334577 332488 330448
52381 330448 329612 330012 330461 329839 328212 326575 325876 326426 327964 330083 332769 336577 341791 347126 349933 348556
52365 348556 344350 340496 338817 338541 338270 338080 339017 341290 343838 345430 345683 345232 345379 347221 350678 354552
52349 354552 357805 360394 362600 364241 365217 366332 368678 372386 376639 380752 384456 387223 388171 386960 384325
52334 384325 381455 378974 376671 374180 371863 370786 371455 372724 372763 371308 370206 371263 374216 377258 378885
$$ packed form
52396C17569k482j479J626M463M876L422K145J848J783J348O92r0j144k089k040
52381C30448q36M00M49o22j627j637o99N50J538K119K686L808N214N335K807j377
52365C48556m206l854j679k76k71j90R37K273K548J592K53m51J47J842L457L874
52349C54552L253K589K206J641R76J115K346L708M253M113L704K767R48j211k635
52334C84325k870k481k303k491k317j077O69J269L9j455j102J057K953L042J627
$$ [...]
##END NTUPLES=NMR SPECTRUM
##END=
