
##TITLE=AC1081_MACI02_5818930_ALTKwGDv5L
##JCAMPDX= 6.0         $$ Bruker NMR JCAMP-DX V2.0
##DATA TYPE= NMR SPECTRUM
##DATA CLASS= NTUPLES
##ORIGIN= BRUKER
##OWNER= Administrator
$$ 1.72 TOPSPIN		Version 2.1
$$ 2012-03-24 22:53:41.281 -0500  Administrator@TOPSPIN
$$ Compression mode = diff/dup
##.OBSERVE FREQUENCY= 400.13188235
##.OBSERVE NUCLEUS= ^1H
##.ACQUISITION MODE= SIMULTANEOUS (DQD)
##.ACQUISITION SCHEME= undefined
##.AVERAGES= 8
##.DIGITISER RES= 22
##SPECTROMETER/DATA SYSTEM= spect
##.PULSE SEQUENCE= zg30
##.SOLVENT NAME= COFFEE_meoh
##.SHIFT REFERENCE= INTERNAL, COFFEE_meoh, 1, 14.98061
##AUDIT TRAIL= $$ (NUMBER, WHEN, WHO, WHERE, PROCESS, VERSION, WHAT)
$$ ##TITLE= Audit trail, TOPSPIN		Version 2.1
$$ ##JCAMPDX= 5.01
$$ ##ORIGIN= Bruker BioSpin GmbH
$$ ##OWNER= Administrator
$$ $$ C:\Bruker\TOPSPIN/data/COFFEE/nmr/AC1081_MACI02_5818930_ALTKwGDv5L/10/pdata/1/auditp.txt
$$ ##AUDIT TRAIL=  $$ (NUMBER, WHEN, WHO, WHERE, PROCESS, VERSION, WHAT)
(   1,<2012-03-24 22:53:27.218 -0500>,<Administrator>,<TOPSPIN>,<go>,<TOPSPIN 2.1>,
      <created by zg
	started at 2012-03-24 22:52:19.031 -0500,
	POWCHK enabled, PULCHK disabled,
       configuration hash MD5:
       1A 1E CE 29 27 FD 77 03 67 4E F0 E3 C4 B2 CB 90
       data hash MD5: 64K
       C0 39 86 64 F2 EF 2A 82 CD 1F 44 5F AA A9 B5 7E>)
(   2,<2012-03-24 22:53:35.671 -0500>,<Administrator>,<TOPSPIN>,<proc1d>,<TOPSPIN 2.1>,
      <Start of raw data processing
       efp LB = 0 FT_mod = 6 PKNL = 1 PHC0 = 0 PHC1 = 0 SI = 32K 
       data hash MD5: 32K
       BF FB 3C 48 77 50 60 A5 9F F0 95 1E B0 4E 7D 24>)
(   3,<2012-03-24 22:53:36.468 -0500>,<Administrator>,<TOPSPIN>,<proc1d>,<TOPSPIN 2.1>,
      <pk PHC0 = 216.167 PHC1 = 0 
       data hash MD5: 32K
       5F 0A F7 66 EF 08 A2 31 FA 9A 28 16 D5 57 D1 F3>)
(   4,<2012-03-24 22:53:36.906 -0500>,<Administrator>,<TOPSPIN>,<proc1d>,<TOPSPIN 2.1>,
      <abs ABSG = 1 
       data hash MD5: 32K
       13 A8 93 F4 30 72 26 76 B8 C4 D1 BD 0C FE AD 45>)
(   5,<2012-03-24 22:53:37.046 -0500>,<Administrator>,<TOPSPIN>,<proc1d>,<TOPSPIN 2.1>,
      <abs ABSG = 2 
       data hash MD5: 32K
       AB 7F 09 D2 79 C7 6B 5D F1 7C C4 A1 CC F4 A9 B9>)
(   6,<2012-03-24 22:53:37.078 -0500>,<Administrator>,<TOPSPIN>,<proc1d>,<TOPSPIN 2.1>,
      <abs ABSG = 3 
       data hash MD5: 32K
       22 F2 AB 05 F1 6C 22 B2 4A 1B 15 2A 62 74 BE 21>)
(   7,<2012-03-24 22:53:37.109 -0500>,<Administrator>,<TOPSPIN>,<proc1d>,<TOPSPIN 2.1>,
      <abs ABSG = 4 
       data hash MD5: 32K
       6D 87 6A BE 46 E2 6C FB 3B 51 F4 19 27 BD BD 68>)
(   8,<2012-03-24 22:53:37.140 -0500>,<Administrator>,<TOPSPIN>,<proc1d>,<TOPSPIN 2.1>,
      <abs ABSG = 5 
       data hash MD5: 32K
       7B 44 CD DC E2 25 D0 04 DD 70 3A 33 E5 08 F7 F9>)
$$ ##END=
$$ 
$$ $$ hash MD5
$$ $$ A1 BD F4 C2 6D 67 C9 4A AD E7 CB 50 94 53 E9 B6
##$RELAX= 
##$RELAX= 
##$RELAX= 
##$RELAX= 
##$RELAX= 
##$RELAX= 
##$RELAX= 
$$ Bruker specific parameters
$$ --------------------------
$$ [...]
##$TP= (0..7)
150 150 150 150 150 150 150 150
##$TP07= 0
##$TPNAME0= <>
##$TPNAME1= <>
##$TPNAME2= <>
##$TPNAME3= <>
##$TPNAME4= <>
##$TPNAME5= <>
##$TPNAME6= <>
##$TPNAME7= <>
##$TPOAL= (0..7)
0.5 0.5 0.5 0.5 0.5 0.5 0.5 0.5
##$TPOFFS= (0..7)
0 0 0 0 0 0 0 0
##$TUNHIN= 0
##$TUNHOUT= 0
##$TUNXOUT= 0
##$USERA1= <user>
##$USERA2= <user>
##$USERA3= <user>
##$USERA4= <user>
##$USERA5= <user>
##$V9= 5
##$VALIST= <valist>
##$VCLIST= <CCCCCCCCCCCCCCC>
##$VD= 0
##$VDLIST= <DDDDDDDDDDDDDDD>
##$VPLIST= <PPPPPPPPPPPPPPP>
##$VTLIST= <TTTTTTTTTTTTTTT>
##$WBST= 2048
##$WBSW= 25
##$XGAIN= (0..3)
0 0 0 0
##$XL= 0
##$YL= 0
##$YMAX_a= 511581
##$YMIN_a= -609608
##$ZGOPTNS= <>
##$ZL1= 120
##$ZL2= 120
##$ZL3= 120
##$ZL4= 120
##$ABSF1= 14.98061
##$ABSF2= -5.57192
##$ABSG= 5
##$ABSL= 3
##$ALPHA= 0
##$AQORDER= 0
##$ASSFAC= 0
##$ASSFACI= 0
##$ASSFACX= 0
##$ASSWID= 0
##$AUNMP= <proc_prof1d_extract_pilot.lims>
##$AXLEFT= 0
##$AXNAME= <>
##$AXNUC= <1H>
##$AXRIGHT= 0
##$AXTYPE= 0
##$AXUNIT= <>
##$AZFE= 0.1
##$AZFW= 0.1
##$BCFW= 0
##$BC_mod= 0
##$BYTORDP= 0
##$COROFFS= 0
##$CY= 15
##$DATMOD= 1
##$DC= 0
##$DFILT= <>
##$DTYPP= 0
##$F1P= 0
##$F2P= 0
##$FCOR= 0.5
##$FTSIZE= 32768
##$FT_mod= 6
##$GAMMA= 0
##$GB= 0
##$INTBC= 1
##$INTSCL= 1
##$ISEN= 128
##$LB= 0
##$LEV0= 0
##$LPBIN= 0
##$MAXI= 10000
##$MC2= 0
##$MEAN= 0
##$ME_mod= 0
##$MI= 0
##$NCOEF= 0
##$NC_proc= -8
##$NLEV= 6
##$NOISF1= 0
##$NOISF2= 0
##$NSP= 0
##$NTH_PI= 0
##$NZP= 0
##$OFFSET= 14.98061
##$PC= 1
##$PHC0= 216.167
##$PHC1= 0
##$PH_mod= 1
##$PKNL= yes
##$PPARMOD= 0
##$PPDIAG= 0
##$PPIPTYP= 0
##$PPMPNUM= 2147483647
##$PPRESOL= 1
##$PSCAL= 4
##$PSIGN= 0
##$PYNMP= <proc.py>
##$REVERSE= no
##$SF= 400.13
##$SI= 32768
##$SIGF1= 0
##$SIGF2= 0
##$SINO= 400
##$SIOLD= 32768
##$SPECTYP= <>
##$SREGLST= <1H.CDCl3>
##$SSB= 0
##$STSI= 32768
##$STSR= 0
##$SW_p= 8223.68421052632
##$SYMM= 0
##$S_DEV= 0
##$TDeff= 65536
##$TDoff= 0
##$TI= <>
##$TILT= no
##$TM1= 0
##$TM2= 0
##$TOPLEV= 0
##$USERP1= <user>
##$USERP2= <user>
##$USERP3= <user>
##$USERP4= <user>
##$USERP5= <user>
##$WDW= 1
##$XDIM= 32768
##$YMAX_p= 444988329
##$YMIN_p= -794557
##$CURPLOT= <Network HP LaserJet P1505>
##$CURPRIN= <$Network HP LaserJet P1505>
##$DFORMAT= <normdp>
##$LAYOUT= <+/1D_H.xwp>
##$LFORMAT= <normlp>
##$PFORMAT= <normpl>
##$SURQMSG= 1
$$ End of Bruker specific parameters
$$ ---------------------------------
##NTUPLES= NMR SPECTRUM
##VAR_NAME=  FREQUENCY,     SPECTRUM/REAL,   SPECTRUM/IMAG
##SYMBOL=    X,             R,               I
##VAR_TYPE=  INDEPENDENT,   DEPENDENT,       DEPENDENT
##VAR_FORM=  AFFN,          ASDF,            ASDF
##VAR_DIM=   32768,         32768,           32768
##UNITS=     HZ,            ARBITRARY UNITS, ARBITRARY UNITS
##FACTOR=    0.250966925370066, 1,           1
##FIRST=     8223.43324360095, 94168,        -25736
##LAST=      0,             -81309,          158728
##MIN=       0,             -794557,         0
##MAX=       8223.43324360095, 444988329,    0
$$ Real data points
##PAGE= N=1
##DATA TABLE= (X++(R..R)), XYDATA
$$ [...]
$$ plain form
19475 125097 -103434 262473 174615 -5273 -112835 231828 -143492 -22749 47867 4326 137532
19464 137532 47393 73777 78912 -40538 -12967 -154334 -124489 -150225 47308 -268090 -104587
19452 198039 117903 -428954 -37093 107638 -113578 53952 -138515 51271 -253950 181742
19441 -18087 32734 135847 13704 70907 358336 -92835 -64668 -250949 -102895 65473 -216319
19429 -9456 103430 235972 18904 85907 -49785 -116682 -191445 -50437 112756 33815 -25853
19417 244619 82791 82758 139733 -136004 174738 -191184 -672511 -329895 219459 -301797 -131081
19405 -141250 226220 -285415 -224603 -60938 -236700 -172104 -100535 -169716 70860 -173775 144337
19393 -130137 -191828 -188406 -189253 -337791 -138220 -11803 -517964 188348 -107376 -106105 -558069
$$ packed form
19475A25097a03434B62473q7858e273j07562B31828a43492b2749D7867D326J33206
19464A37532D7393K6384N135d0538a2967j41367K9845k5736D7308b68090a04587
19452A98039q0136d28954c7093A07638a13578E3952a38515E1271b53950A81742
19441a8087C2734J03113A3704N7203K87429i2835K8167j86281a02895F5473b16319
19429i456A03430J32542A8904O7003d9785o6897p4763e0437A12756C3815b5853
19417B44619H2791l3N6975a36004A74738a91184m81327c29895B19459c01797a31081
19405a41250B26220b85415O0812f0938j75762O4596P1569o9181G0860a73775A44337
19393a30137o1691L422q47j48538a38220a1803n06161A88348a07376J271m51964
$$ plain form
19382 -558069 -114275 -28728 -106454 30075 169146 263675 -57697 -101884 133967 -172186 -121520
19371 -121520 -202972 12265 192450 -98017 -47846 -220411 -261001 -315613 -158808 -243186 -561599
19360 -561599 -152696 -125788 -83517 -780 -146963 -199868 208600 57501 -167056 86082 399332
19349 399332 -213744 -89746 4919 54833 -302754 -340272 -281508 -177397 81977 -78543 -62025
19338 -62025 -185815 -160520 85686 51822 -20122 -96144 -277396 -23885 27692 36517 172811
19327 172811 -269448 25406 -92670 -248209 -35269 -169135 -113558 -425350 -162383 -96172
19317 -96172 -382224 -25922 -165709 84575 -423040 227404 -42994 -15095 58112 166059 97784
19306 97784 -219508 -31366 302766 160611 -211008 155647 11706 -143623 -20601 -56879
$$ packed form
19382e58069a14275b8728p7726C0075J39071R4529e7697m4187A33967a72186N0666
19371a21520q1452A2265J80185i8017d7846j72565m0590n4612J56805q4378l18413
19360e61599a52696K6908M2271g80j46183n2905B08600E7501a67056H6082L13250
19349C99332b13744h9746D919M9914c02754l7518N8764J04111H1977g8543J6518
19338f2025j23790K5295H5686l3864b0122p6022j81252b3885B7692Q825J36294
19327A72811b69448B5406i2670j55539c5269j33866N5577l11792a62383O6211
19317i6172k86052b5922j39787H4575d23040B27404d2994a5095E8112J07947o8275
19306I7784b19508c1366C02766j42155b11008A55647A1706a43623b0601l6278
$$ plain form
19296 -56879 78322 189140 -201997 60302 -229328 -200950 211221 -301360 -118798 221841
19285 -403889 -310322 -162409 -91361 -225042 -272327 -117475 -99864 96911 -298815 95583 -220671
19273 -192992 -227424 -300337 -24056 -144590 -29409 33055 220217 84947 -51111 139965 154209
19262 154209 -260424 -17712 -203589 -249235 13944 -405863 -172304 -87707 1732 16512 -86810
19250 141946 95647 120172 184044 -245611 -143146 -97386 -285592 62362 6389 -105092 -63773
19239 -63773 18101 -122742 69221 9857 -480140 -252957 187022 -31709 -23534 45335 -34648
19227 27451 -59267 -434309 20569 -168265 50622 -41577 -121733 -57411 -11485 -26886 -69230
19216 -69230 -253669 -36322 53931 -122387 305068 -338105 -162104 -107218 32810 -148250
$$ packed form
19296e6879G8322J10818b01997F0302b29328K8378B11221c01360a18798B21841
19285d03889R3567J47913P1048j33681m7285a17475J7611I6911b98815I5583b20671
19273a92992l4432p2913b4056j20534b9409C3055J87162H4947e1111A39965J4244
19262A54209b60424a7712j85877m5646A3944d05863a72304Q4597A732J4780h6810
19250A41946m6299K4525O3872b45611J02465M5760j88206F2362F389a05092M1319
19239f3773A8101a22742F9221I857d80140K27183A87022c1709Q175D5335c4648
19227B7451e9267l75042B0569a68265E0622d1577q0156e7411a1485j5401m2344
19216f9230j84439c6322E3931a22387C05068c38105a62104N4886C2810a48250
$$ plain form
19205 -130642 -102404 -189217 218309 -317711 -289258 13919 10856 -269915 -256300 91547 199165
19194 199165 23629 -27516 -192446 22181 99150 -29566 -56564 -172514 -55331 397874 296768
19183 296768 -21619 230054 -117314 -102541 93087 1192 110003 -152310 -116159 -378025 28417
19171 -160685 77516 -77684 -448558 -45026 40538 -183925 -92045 227339 -92381 278205 250223
19160 250223 61454 84375 -102762 -20670 230695 54040 59469 -306088 18026 -36227 -141861
19149 -141861 -260825 -133079 -261371 -149664 -20458 -113707 -160733 -50378 -107525 128130
19138 89487 -30836 48978 -302004 54222 219965 145966 41736 70640 -235262 -33256 49817
19126 145015 43445 -138660 -124516 -62751 -104745 -253049 111861 43339 87525 27187 -165263
$$ packed form
19205a30642K8238q6813B18309c17711K8453A3919l063b69915J3615I1547J07618
19194A99165B3629b7516j64930B2181P6969b9566k6998j15950e5331C97874j01106
19183B96768b1619B30054a17314J4773I3087A192J08811a52310L6151k61866B8417
19171a60685G7516g7684l70874d5026D0538a83925R1880B27339i2381B78205k7982
19160B50223F1454K2921a02762b0670B30695E4040N429c06088A8026c6227j05634
19149a41861j18964J27746j28292J11707b0458r3249m7026e0378n7147A28130
19138H9487c0836D8978c02004E4222J65743p3999D1736K8904b35262c3256D9817
19126A45015D3445a38660J4144O1765m1994j48304A11861D3339M4186B7187a65263
$$ plain form
19114 12797 287278 23826 -210259 13743 189049 9550 -86951 -95990 -149512 38948 -164541
19102 -138156 -301117 -170217 52882 -287415 316383 -59168 -51773 -172789 15716 -83651 -287784
19091 -287784 -58993 -341236 -324665 92706 -234597 -34266 5862 -231806 24623 -114058 97642
19079 18103 77562 -295582 -38117 114884 -427906 -231564 83816 -144546 -263231 -115673
19068 -149521 -21466 -146855 67140 -47331 76733 -133126 -199247 -219754 -117814 -182522 -57665
19056 -9673 28256 -157912 45149 -85119 -107817 328362 146539 -47645 -252569 -82657 -53881
19045 -53881 -90372 237951 -95020 78232 341961 -240181 -84661 -31655 -102134 -54750 -200944
19034 -200944 77290 -280246 2889 168470 -155579 296449 83864 -1159 11142 -436007 44441
$$ packed form
19114A2797K74481B3826b10259A3743J75306I550h6951r039n3522C8948a64541
19102a38156j62961J30900E2882b87415C16383e9168P395j21016A5716h3651k04133
19091b87784e8993k82243J6571I2706b34597c4266E862b31806B4623a14058I7642
19079A8103N9459b95582c8117A14884d27906J96342H3816a44546j18685a15673
19068a49521b1466j25389F7140d7331G6733a33126o6121k0507J01940o4708e7665
19056i673B8256a57912D5149h5119k2698C28362A46539d7645k04924h2657K8776
19045e3881l6491B37951i5020G8232K63729b40181h4661c1655p0479M7384j46194
19034b00944G7290b80246B889J65581a55579B96449H3864a159A1142d36007D4441
$$ plain form
19022 -215385 -299111 -96466 -172101 -83021 -243538 -110116 -30438 195898 -254615 310819
19011 213006 172285 203232 -28997 -40572 351021 23344 -29941 -285776 41733 170647 80486
18999 -72817 11305 -3729 180463 -274582 -464247 234640 -153125 -234102 206757 -59137 -12791
18987 -184290 147531 -78706 -331332 214045 -271416 14427 -425892 70853 7321 -85552 -55710
18976 -55710 -154505 -266061 -31720 -294033 -25990 -143019 253199 52880 -151828 -100137 -225627
18965 -225627 40669 25583 66029 19679 -148702 -45688 1395 245784 39950 164418 -27408
18953 215031 116311 -241458 -206234 54266 192647 -44819 186103 -40698 -351092 -163194
18942 -31973 -3169 -213744 -420235 221065 -406078 -8982 -145602 -249186 -128485 185148
$$ packed form
19022b15385q3726i6466p5635h3021j60517a10116c0438A95898b54615C10819
19011B13006m0721L0947b8997j1575C51021B3344b9941k55835D1733J28914H0486
18999g2817A1305c729A80463b74582j89665B34640a53125q0977B06757e9137a2791
18987a84290A47531g8706k52626B14045b71416A4427d25892G0853G321h5552K9842
18976e5710r8795j11556c1720k62313b5990j17029B53199E2880a51828N1691j25490
18965b25627D0669j5086M0446A9679a48702d5688A395K44389C9950J24468b7408
18953B15031r8720b41458L5224E4266J38381d4819A86103d0698l10394a63194
18942c1973c169k10575k06491B21065d06078h982j36620j03584J20701A85148
$$ plain form
18931 77103 -235766 171369 52054 85770 164230 332403 -281990 -96794 -235475 -141617 -12382
18919 272791 -158939 6671 65094 -138594 -176355 -195192 -12507 -349619 352585 22054 -26593
18907 -96996 -210861 -286041 46129 -129764 160973 328086 278748 153892 60898 -303631
18896 32800 248531 448212 231190 379859 191513 379780 -221952 -201578 -107708 -232334
18886 -232334 -201757 3304 118495 80056 22608 -115799 -228609 -5255 141634 120910 -172259
18874 -35293 120443 126196 -176739 36652 75058 -207723 -107330 -44691 7199 -44155 -94114
18863 -94114 -198838 -306823 22568 -320437 -106033 204431 95434 -284859 -39409 -254746
18853 -254746 -113631 -105352 128603 -64419 3036 138345 -157433 -26166 -265150 26431 -169004
$$ packed form
18931G7103b35766A71369E2054L3716P8460J68173b81990i6794j38681R3858a2382
18919B72791a58939F671N8423a38594l7761j8837a2507l37112C52585B2054b6593
18907i6996j13865p5180D6129a29764A60973J67113m9338j24856F0898c03631
18896C2800K15731J99681k17022J48669j88346J88267b21952K0374R3870j24626
18886b32334L0577C304J15191l8439B2608a15799j12810e255A41634k0724a72259
18874c5293A20443N753a76739C6652L8406b07723J00393d4691G199d4155m9959
18863i4114j04724j07985B2568c20437a06033B04431I5434b84859c9409k15337
18853b54746a13631Q279A28603f4419C036J35309a57433b6166k38984B6431a69004
$$ plain form
18841 -49033 -349463 46586 60907 -95061 -91556 -89173 -161293 -148165 -84211 -93706 -16433 62344
18828 177006 1353 -57108 -42768 -220075 -16468 -181523 10956 114691 138562 -391818 -247779
18817 -247779 151718 -548495 -44695 -174563 -47796 147130 49480 -486601 325424 193377
18807 193377 206131 -187236 -64524 43908 229456 -144205 61410 47025 163400 -96649 102554
18795 18486 -83395 152182 -58109 262126 -81345 -31101 -181338 234777 -85336 -192092 -90832
18783 19050 87182 -32675 20664 -522775 -88903 -94066 76518 147497 -167285 -284909 92031
18771 15891 -147332 -127543 -123467 27594 -35446 -221651 150839 157139 -10725 -439537 -11123
18759 56544 -352989 -417826 -80785 -235540 158861 11496 -31510 -23270 -224678 -517502 423195
$$ packed form
18841d9033l00430D6586J4321i5061L505K383p2120J3128O3954r495a6433F2344
18828A77006A353e7108J4340j77307a6468j65055A0956J03735K3871c91818J44039
18817b47779A51718e48495d4695j29868d7796A47130D9480d86601C25424j32047
18807A93377J2754a87236f4524D3908J85548a44205F1410j4385J16375i6649A02554
18795A8486h3395A52182e8109B62126h1345c1101j50237B34777h5336j06756i0832
18783A9050O8132c2675B0664e22775h8903n163G6518P0979a67285j17624I2031
18771A5891a47332J9789M076B7594c5446j86205A50839O300a0725m28812a1123
18759E6544c52989o4837h0785j54755A58861A1496c1510Q240k01408k92824D23195
$$ plain form
18747 -322122 -31740 339279 -22637 -357021 38279 -454325 -20853 -138969 -128402 -47881 174928
18735 1831 -46834 -124687 -160949 117129 -164133 -291621 -320895 111908 -153131 120763 5918
18723 -60853 -70998 -221904 -53335 -203634 -277985 153877 -161440 -69429 84806 -191516 -149530
18712 -149530 121206 -247086 -98439 4324 -125786 -89498 8723 -123036 53052 -27967 -447556
18701 -447556 -145835 -88351 -44214 150623 61160 -176490 90436 34803 -245160 239513
18690 -101858 21144 -81866 -203976 304105 84725 -179459 -102571 17438 17589 116463 -126793
18678 -350119 20050 -336853 160369 -198815 -181261 -131978 78102 37719 -192546 29469 83130
18667 83130 188139 -67216 -397304 159661 142150 340688 110745 68032 -122358 -232343
$$ packed form
18747c22122c1740C39279b2637l34384C8279d54325b0853j18116J0567d7881A74928
18735A831d6834p7853l6262A17129a64133j27488k9274A11908a53131A20763E918
18723f0853j0145j50906e3335j50299p4351A53877a61440f9429H4806a91516M1986
18712a49530A21206b47086i8439D324a25786L6288H723a23036E3052b7967m19589
18701d47556a45835N7484M4137A50623F1160a76490I0436C4803b45160B39513
18690a01858B1144h1866j22110C04105H4725a79459P6888A7438J51R8874a26793
18678c50119B0050c36853A60369a98815J7554M9283G8102C7719a92546B9469N3661
18667H3130J05009f7216l30088A59661j7511J98538A10745m2713a22358j09985
$$ plain form
18657 -232343 27765 109709 -61185 -318813 18823 -176388 -32321 -179455 108151 123598 64499
18646 64499 276551 254411 -20054 -388520 -284807 -376774 85562 574985 141213 50651 82334
18635 82334 -57031 26112 -217566 -218449 -80688 124772 -204684 340089 19462 71041 -25464
18623 -29839 452410 -322620 -26864 -141903 19364 136310 -52038 225294 164082 -364626
18612 244854 260017 149774 -34749 -260406 -340630 -327157 -398948 48518 -149133 -210893 19298
18600 -255331 -196869 -368619 -314421 285813 37162 15016 75714 6040 -96354 -244237 102734
18588 -37170 -46298 81983 391924 138638 40095 42763 -51001 -145339 18034 -140081 -155842
18577 -155842 231437 108903 -42284 -125912 -45712 -87266 43560 84010 -273608 -245465 -335318
$$ packed form
18657b32343B7765Q1944f1185k57628A8823a76388c2321j47134A08151J5447n9099
18646F4499K12052k2140b0054l68466J03713r1967H5562M89423A41213E0651L1683
18635H2334e7031B6112b17566q83h0688A24772b04684C40089A9462N1579b5464
18623b9839D52410c22620b6864j15039A9364J16946e2038B25294o1212c64626
18612B44854J5163j10243c4749k25657q0224J3473p1791D8518a49133o1760A9298
18600b55331N8462j71750N4198B85813C7162A5016O0698F040i6354j47883A02734
18588c7170r128H1983L09941A38638D0095K668e1001r4338A8034a40081j5761
18577a55842B31437A08903d2284q3628d5712m1554D3560M0450b73608K8143q9853
$$ plain form
18566 -335318 -472663 95935 55794 -412893 -328198 -100815 254864 -172706 -18759 -44873
18556 -44873 -102135 -91597 -92181 281363 -132279 -243853 161971 22234 -3490 -259074 91243
18544 -150494 158117 -335067 -228207 -167696 88363 25623 -104006 -196182 -27237 -178035
18534 -178035 245012 132346 -13632 -45528 -416002 -297133 14978 -165400 -291270 -137251
18523 49411 -304691 -308348 -78486 -105300 -147216 -161381 96129 -189127 36548 128418 921 -13198
18510 109118 -205760 164796 -282915 -179173 -248318 18803 -230662 115609 118434 -124680
18499 -207802 -28248 -363369 -265670 16890 1675 -46175 14807 -359985 -124165 138454 -8245
18487 -94846 -22254 -254585 -184163 -307062 -213225 -58146 -74336 234095 -61410 131477 -13375
$$ packed form
18566c35318j37345I5935m0141d12893Q4695a00815B54864a72706a8759k6114
18556d4873n7262J0538n84B81363a32279j11574A61971B2234c490k55584I1243
18544a50494A58117c35067J06860O0511H8363B5623a04006r2176b7237j50798
18534a78035B45012j12666a3632l1896l70474J18869A4978a65400j25870a37251
18523D9411c04691l657g8486k6814m1916j4165I6129a89127C6548R1870I21a3198
18510A09118b05760A64796b82915J03742o9145A8803b30662A15609K825a24680
18499b07802b8248l35121R7699A6890A675d6175A4807c59985a24165A38454h245
18487i4846b2254k32331P0422j22899R3837e8146j6190B34095f1410A31477a3375
$$ plain form
18475 -343863 -67443 174002 -201866 130569 -142635 33106 115985 105012 166584 24261 -68485
18463 -3369 -57909 -401952 -32000 -180748 -89173 113669 -245871 116274 12109 13011 97388
18452 97388 10996 191924 352446 -78813 180469 -144431 -61043 -109843 -149936 -69031 -67431
18441 -67431 -59186 -241213 -265761 -103642 194499 -133612 -202622 204798 40202 -318518 -217911
18430 -217911 -426013 -199255 -215147 153212 -160665 -96546 -31387 -67498 2837 117004 -57967
18418 -300880 79261 137627 354644 -34476 -428597 -251412 -74051 98294 294753 6169 -65855
18406 87404 108871 180200 -110946 -151368 -256036 49783 -264035 168515 -92340 -109838 164978
18394 -48667 -246010 118537 -112287 216331 27468 244937 -227246 -65671 -39155 -32602 -294292
$$ packed form
18475c43863f7443A74002b01866A30569a42635C3106Q2879j0973O1572B4261f8485
18463c369n4540l44043c2000j48748h9173A13669b45871A16274A2109R02Q4377
18452I7388A0996J80928J60522g8813A80469a44431f1043m8800m0093f9031J600
18441f7431Q245j82027k4548a03642A94499a33612o9010B04798D0202c18518J00607
18430b17911k08102a99255j5892A53212a60665O4119c1387l6111B837J14167e7967
18418c00880G9261N8366K17017c4476l94121J77185g4051I8294J96459F169f5855
18406H7404K1467P1329a10946m0422j04668D9783b64035A68515i2340j7498A64978
18394d8667j97343A18537a12287B16331B7468K17469b27246f5671K6516O553k61690
$$ plain form
18383 -294292 195690 -12071 184640 -1552 52092 131577 -195912 -273504 190310 170578 383114
18372 383114 -1631 -36871 35329 -291384 177728 -69150 -202383 126930 -127096 213311
18361 -36693 148612 -173547 -372403 52323 -80157 162564 -302397 170572 13499 -152608
18350 -74376 -145196 134990 -152092 -11591 107640 62333 4055 -169975 11119 -143022 3348
18338 -181348 183993 -96243 -264075 185041 -66173 -210202 -510056 -43878 -64333 89875
18327 129135 -66009 -222272 22639 -75568 -143064 14656 88600 -115321 131698 63955 109306
18316 109306 -183897 72067 198532 -29194 -153097 -75899 -470411 -385656 -166303 73113
18305 -86848 519415 1330 -26094 4522 -242415 -164352 -173280 53157 47824 -179751 20638 -160600
$$ packed form
18383b94292A95690a2071A84640a552E2092P9485a95912p7592A90310j9732K12536
18372C83114a631l5240C5329b91384A77728f9150j33233A26930a27096B13311
18361c6693A48612a73547j98856E2323h0157A62564c02397A70572A3499a52608
18350g4376p0820A34990a52092a1591A07640m5307D055a69975A1119a43022C348
18338a81348A83993i6243j67832A85041f6173j44029k99854d3878k0455H9875
18327A29135f6009j56263B2639g5568o7496A4656P3944a15321A31698F3955M5351
18316A09306a83897G2067J26465b9194j23903g5899l94512Q4755a66303G3113
18305h6848E19415A330b6094D522b42415P8063q928E3157n333a79751B0638a60600
$$ plain form
18292 -285263 154742 50529 2813 45456 262915 -150454 -400435 -102915 -226638 187254
18281 -58411 174988 143993 33357 -193386 27696 133750 -126474 -73266 205202 -71433 -301910
18270 -301910 -278995 -61021 76743 189666 -335461 -135686 100867 313102 98721 -360949
18259 73645 -36728 -51972 -157056 204794 -180150 -139379 36707 -116413 -18682 217946 97495
18247 -315334 -94737 -254593 -30902 7899 -66912 435289 -57807 176989 -52420 -245190 -78761
18235 386418 -162864 -104958 136629 141262 109510 148422 -9143 -51516 124721 -250698 3946
18223 133947 23451 -246610 103847 21848 19210 256549 114686 -110596 16105 -129149
18212 -63653 -246728 35641 183714 77069 -323482 -117279 -259442 -157383 122363 -141745
$$ packed form
18292b85263A54742E0529B813M2643K17459a50454k49981a02915j23723A87254
18281e8411A74988l0995C3357a93386B7696J06054a26474N3208B05202g1433k30477
18270c01910K2915f1021G6743J12923c35461a35686A00867K12235I8721c60949
18259G3645c6728j5244j05084B04794a80150M0771C6707a16413a8682B17946I7495
18247c15334i4737j59856c0902G899f6912D35289e7807A76989e2420j92770g8761
18235C86418a62864N7906A36629M633l1752L8912i143m2373A24721b50698C946
18223A33947B3451b46610A03847B1848k638K37339A14686a10596A6105a29149
18212f3653j83075C5641J48073G7069c23482a17279j42163J02059A22363a41745
$$ plain form
18201 85345 -76139 3102 -46355 326689 -8395 -429731 -166892 79375 -44987 -278744 -103629
18189 112286 9249 70221 -89139 -315058 113791 -20459 136403 60350 -294991 52121 -399765
18177 170059 -160151 115011 -212601 -106556 141440 -171706 -120242 -119748 -254372 -57297
18166 242376 452497 -315403 -336686 -62900 -146396 189771 588 -359357 -214390 -189180 -207726
18155 -207726 -270527 -112438 -67363 -111563 -119247 37961 164643 -32651 -149600 -65684 -43028
18144 -43028 -89371 -17830 110944 -62329 -97221 -220931 70563 -143845 -34145 -323073 119400
18132 396565 -33774 72833 -116089 -349693 3407 -316933 11503 183625 -508099 -281070
18122 -281070 7887 132731 -73462 -45316 -183971 64667 -178103 146308 -55403 -87036 56057
$$ packed form
18201H5345g6139C102d6355C26689h395m21336a66892G9375d4987k33757a03629
18189A12286I249O0972h9139k25919A13791b0459A36403F0350b94991E2121c99765
18177A70059a60151A15011b12601J06045A41440a71706N1464M94j34624e7297
18166B42376K10121c15403k1283f2900q3496A89771E88c59357J44967K5210j8546
18155b07726o2801a12438M5075m4200p684C7961J26682c2651j16949f5684K2656
18144d3028m6343a7830A10944f2329l4892j23710G0563a43845c4145k88928A19400
18132C96565c3774G2833a16089k33604C407c16933A1503J72122e08099K27029
18122b81070G887J24844g3462K8146j38655F4667a78103A46308e5403l1633E6057
$$ plain form
18110 -232354 -65466 -103395 198685 -380506 520498 -21863 -106816 45386 -110784 147939
18099 120143 -103341 -163214 80938 -163317 65359 -382927 -153580 -27598 91536 -148217
18088 5667 209639 21679 300430 39412 132417 118732 -104656 168438 -57905 113518 -57904
18076 -258438 -67042 -394579 233340 -8455 180748 157638 -62591 232199 -194048 -278208 -243210
18065 -243210 -291411 -162999 -31019 92507 140923 -312138 -887 -253666 204647 -34812 -195535
18054 -195535 -14746 322787 -100928 283246 114171 115901 9343 38627 162266 -139269 -85033
18043 -85033 25981 560823 119089 -43374 224178 70045 206470 3497 -89023 -151398 -128343
18032 -128343 -62680 -274620 110219 102224 100144 53255 109055 -408887 15581 -114090 263217
$$ packed form
18110b32354f5466l7929A98685c80506E20498b1863q4953D5386a10784A47939
18099A20143a03341n9873H0938a63317F5359c82927a53580b7598I1536a48217
18088E667K03972B1679K78751C9412R3005j3685a04656A68438e7905A13518e7904
18076b58438f7042l27537B33340h455A80748k3110f2591B32199a94048q4160L4998
18065b43210m8201J28412c1019I2507M8416c12138h87k52779B04647c4812j60723
18054a95535a4746C22787a00928B83246A14171J730I343K9284J23639a39269N4236
18043h5033B5981N34842A19089d3374B24178G0045J36425C497h9023o2375K3055
18032a28343f2680k11940A10219p995k080m6889N5800d08887A5581a14090B63217
$$ plain form
18020 -44113 -169921 178845 -398099 319863 266732 40175 104343 -16131 -138556 207364
18009 220774 378206 -56002 -150351 66703 10342 237478 271007 26641 -332622 16521 47932
17998 47932 111553 173325 3742 -14143 -43938 -330719 -1602 -150909 320610 150500 -257482
17986 154304 5851 228801 -373194 134581 364258 -192541 -71174 97464 -31870 -332580
17976 -332580 90043 -109607 -304583 -40860 40361 -1539 115007 -68767 -42258 26123 -147689
17964 -240513 329584 -555634 -220968 50551 340965 181230 -177623 99035 111518 -62607
17953 -308414 -88997 290018 -76402 155310 236271 101923 29746 206114 120573 -153899
17942 172807 -353493 158203 64731 412752 -90262 -80325 -336381 236180 111662 -57835
$$ packed form
18020d4113j25808A78845c98099C19863n3131D0175O4168a6131j22425B07364
18009B20774J57432e6002r4349F6703A0342K27136L3529B6641c32622A6521L1411
17998D7932O3621O1772C742a4143k9795k86781a602j49307C20610A50500b57482
17986A54304E851K22950c73194A34581K29677a92541g1174I7464c1870l00710
17976c32580I0043a09607j94976d0860D0361a539A15007f8767K6509B6123a47689
17964b40513C29584e55634b20968E0551K90414j59735a77623I9035J2483f2607
17953c08414h8997B90018g6402A55310Q0961A01923B9746J76368q5541a53899
17942A72807c53493A58203F4731L48021i0262R937k56056B36180A11662e7835
$$ plain form
17931 -117373 254138 -43151 -468717 -140719 172270 469603 5505 -15942 51755 -27882 49405
17919 286238 -90724 -88725 -83737 56400 -214479 89902 -68547 -239301 138349 81909 26179
17907 101390 13572 108452 -199778 -42436 -67672 284899 100560 -132370 -265045 104157
17896 -498952 -141562 260947 23804 46305 -33549 -29210 137909 -144765 40868 58710 93375
17885 93375 -147966 94418 -38299 -84013 -104154 -207724 -222047 31453 -138647 -121257 -233108
17874 -233108 224516 -79192 345398 221633 90926 78359 50292 -165315 31036 -112204
17863 127173 -210990 -128191 161492 -290122 121334 90220 228894 223789 192805 -161832
17852 -284443 -186490 -101447 155253 -273239 -71719 260200 -171803 39292 -369094 143845
$$ packed form
17931a17373B54138d3151m25566a40719A72270K97333E505a5942E1755b7882D9405
17919B86238i0724J999M988E6400b14479H9902f8547j70754A38349n6440B6179
17907A01390A3572R4880a99778d2436k5236B84899A00560a32370j32675A04157
17896d98952a41562B60947B3804K2501c3549M339A37909a44765D0868J7842L4665
17885I3375a47966I4418c8299m5714k0141j03570j4323C1453a38647J7390j11851
17874b33108B24516g9192C45398j23765I0926j2567k8067a65315C1036a12204
17863A27173b10990Q2799A61492b90122A21334l1114J38674n105l0984a61832
17852b84443R7953Q5043A55253b73239g1719B60200a71803C9292c69094A43845
$$ plain form
17841 379187 -145420 93807 467440 101641 209035 99946 -72738 -273062 103001 126458
17831 126458 5336 -39759 -60031 146681 -13256 -128292 28681 -120764 -56533 112336 -221530
17819 -206078 -67884 -14983 14967 -223751 -63367 222845 -128424 -453875 -229305 328248
17808 201752 201529 81351 -114739 -3427 121054 -79629 346676 132628 -159015 36632 164930
17797 164930 127602 50031 193654 -32229 -235736 -80636 211144 7801 -98487 -245663 91089
17785 -28114 235332 -44259 -477696 59867 122005 -95880 189837 -65111 157910 -3960 273538
17773 -191484 -234095 312396 62449 -51460 -167399 -125485 -57132 454934 220825 -56650 114887
17761 117615 11479 -99943 -95173 116689 -87663 -291477 -103271 148810 60708 112056 30589
$$ packed form
17841C79187a45420I3807L73633A01641J07394I9946g2738k00324A03001K3457
17831A26458E336c9759k0272A46681a3256j15036B8681a20764e6533A12336b21530
17819b06078f7884a4983A4967b23751f3367B22845a28424l25451K24570C28248
17808B01752k23H1351a14739c427A21054g9629C46676A32628a59015C6632J28298
17797A64930l7328E0031J43623c2229k03507h0636B11144G801i8487j47176I1089
17785b8114B35332d4259m33437E9867O2138i5880A89837f5111A57910c960B73538
17773a91484m2611C12396F2449e1460j15939M1914e7132D54934B20825e6650A14887
17761A17615A1479i9943M770A16689h7663k03814a03271A48810F0708N1348C0589
$$ plain form
17749 292152 172142 93162 159605 336575 165647 -29271 354430 -225906 273389 386117
17739 386117 -49006 53503 131050 -421680 255890 96289 -106323 142258 46887 30284 -233634
17727 5038 35828 192411 170503 -143776 283017 509471 -5413 67156 -58763 224931 310015
17716 310015 84986 66063 72669 454864 -183022 20428 178863 159101 13571 -19790 30618
17704 -102083 128282 -8519 -15522 -16596 -132332 198291 -34691 119154 -165975 96477 184085
17693 184085 365594 54972 200940 288076 174787 83324 143800 119112 18409 269268 -262708
17681 146946 212084 142925 208813 73076 124663 -143719 -25140 59067 250142 -82302 52906
17669 -5797 162461 441709 -14415 357499 95530 231361 235226 190161 295830 -144447 58794
$$ packed form
17749B92152j20010p8980O6443J76970A65647b9271C54430b25906B73389J12728
17739C86117d9006E3503P7547d21680B55890I6289a06323A42258D6887j6603b33634
17727E038L0790J56583k1908a43776B83017K26454e413F7156e8763B24931Q5084
17716C10015H4986j8923O606L82195a83022B0428J58435j9762A3571a9790C0618
17704a02083A28282h519p003j074j15736A98291c4691A19154a65975I6477Q7608
17693A84085J81509E4972J45968Q7136j13289H3324O0476k4688A8409K50859b62708
17681A46946O5138o9159O5888G3076N1587a43719b5140E9067J91075h2302E2906
17669e797A62461K79248a4415C57499I5530J35831L865m5065J05669a44447E8794
$$ plain form
17657 -100330 8490 -3249 -25754 513164 64295 75058 -55176 -106544 224530 44685 239264
17646 239264 166574 -230461 56874 126108 127069 -185745 -5411 85764 260963 182596 357743
17635 357743 -55009 25122 -1686 62394 178923 301314 408523 152658 -95504 -18857 281287
17623 -84717 -77927 290645 -244335 25498 -252130 -141204 216321 237432 205517 270872 25659
17611 39662 -180874 -186226 -103596 -78193 209423 14968 -190065 93089 106522 -125407 5622
17599 -20734 166853 139408 42125 -21657 19686 27556 383660 -170544 -109381 -438916 -180547
17587 189662 103117 219900 175202 204207 -101580 446025 64170 423088 -99058 354111
17576 126983 60088 8592 326571 -45292 19743 -21072 62404 -18001 256939 118753 142188
$$ packed form
17657a00330H490c249k2505E13164F4295J0763e5176n1368B24530D4685J94579
17646B39264p2690b30461E6874O9234R61a85745e411H5764J75199p8367J75147
17635C57743e5009B5122a686F2394J16529J22391J07209A52658i5504a8857B81287
17623h4717O790B90645b44335B5498b52130J10926B16321K1111l1915O5355B5659
17611C9662a80874n352Q2630K5403B09423A4968a90065I3089J3433a25407E622
17599b0734A66853k7445D2125b1657A9686P870L56104a70544O1163l29535a80547
17587A89662q6545J16783m4698K9005a01580D46025F4170L58918i9058C54111
17576A26983F0088H592L17979d5292A9743b1072F2404a8001B56939A18753K3435
$$ plain form
17565 142188 -204523 93036 77453 355577 -140582 99290 307964 311625 486314 27892 -2915
17553 132402 -30063 169280 -236937 128995 -212542 184492 268497 -66290 142645 159699
17543 159699 165903 60026 200220 130051 186855 112246 -127457 296895 80986 -69472 243531
17531 14061 101558 437078 294217 115220 226137 394882 118397 188511 88665 209072
17521 209072 175770 -69545 304568 680079 -3158 27046 109777 464453 355577 39084 535520
17510 535520 218636 597660 543855 458005 717047 293449 418189 150544 223773 299083
17500 299083 385187 300364 382397 190964 632395 757859 782902 830073 642487 640653 329816
17489 329816 771805 560803 198425 195950 119608 245651 146549 261764 344481 187237
$$ packed form
17565A42188b04523I3036j5583K78124a40582I9290K08674L661J74689B7892b915
17553A32402c0063A69280b36937A28995b12542A84492Q4005f6290A42645J7054
17543A59699O204F0026J40194p0169N6804p4609a27457B96895H0986f9472B43531
17531A4061Q7497L35520j42861A15220J10917J68745A18397P0114H8665J20407
17521B09072l3302f9545C04568L75511c158B7046Q2731L54676j08876C9084M96436
17510E35520B18636L79024n3805q5850K59042B93449J24740A50544P3229P5310
17500B99083Q6104q4823Q2033A90964M41431J25464K5043M7171j87586j834l10837
17489C29816M41989k11002A98425k475p6342J26043r9102J15215Q2717j57244
$$ plain form
17479 187237 622075 98741 164578 150524 461904 82316 291607 122086 430575 -22961
17468 373827 185794 551278 184825 -13714 388654 11598 310194 520012 410663 265700
17458 265700 158798 314328 158584 -52083 222195 138704 484221 97620 460228 337194
17448 337194 267865 115573 291720 147953 -71910 299197 196978 -49353 310675 274482
17438 274482 366912 400541 371110 397310 341318 292753 389813 182490 369254 195552 194636
17427 194636 359364 800731 332969 609310 452027 237425 414744 162624 468873 563350
17417 563350 190897 192189 212251 49394 584984 370659 292999 115175 261909 577020
17407 577020 100319 382702 377436 68226 -6516 755244 267941 456039 145683 104652 132928
$$ packed form
17479A87237M34838I8741O5837j4054L11380H2316K09291A22086L08489b2961
17468C73827A85794L65484A84825a3714C88654A1598K98596K09818j09349j44963
17458B65700j06902J55530j55744e2083B22195q3491L45517I7620L62608j23034
17448C37194o9329A15573J76147j43767g1910B99197j02219d9353C10675l6193
17438B74482R2430L3629k9431K6200n5992m8565R7060A82490J86764j73702r16
17427A94636J64728M41367C32969K76341j57283k14602J77319A62624L06249R4477
17417E63350A90897J292K0062D9394N35590k14325p7660A15175J46734L15111
17407E77020A00319K82383n266F8226f516G55244B67941J88098A45683m1031K8276
$$ plain form
17396 132928 305392 80174 87870 -121055 68264 97849 417291 243826 303156 -53791 403763
17384 229985 12160 -129346 -584 215334 192863 423133 114480 139382 289547 61714 -68271
17372 306215 358125 502075 187394 408239 471941 377634 -56268 151678 189822 -79631 348090
17360 13859 165165 265260 132528 123967 40171 140941 279887 192117 652731 360999
17350 360999 200538 322610 314188 174558 202993 97616 155872 431882 112881 79268 421600
17339 421600 758073 197837 38339 317576 -199265 145003 300275 204845 -115576 205133
17328 338329 359995 -15799 182503 238455 -215036 225875 137519 -161736 137724 260120
17318 260120 54914 260192 99651 155951 201995 50826 121913 268330 369366 294519 384373
$$ packed form
17396A32928J72464H0174P696a21055F8264K9585L19442j73465N9330e3791D03763
17384B29985A2160a29346e84B15334k2471K30270A14480K4902J50165F1714f8271
17372C06215N1910J43950A87394K20845O3702r4307e6268A51678L8144g9631C48090
17360A3859J51306J00095A32528q561D0171J00770J38946q7770M60614k91732
17350C60999j60461J22072q422j39630K8435I7616N8256K76010A12881l3613L42332
17339D21600L36473A97837C8339K79237a99265A45003J55272r5430a15576B05133
17328C38329K1666a5799A82503N5952b15036B25875q8356a61736A37724J22396
17318B60120E4914K05278I9651N6300M6044E0826P1087J46417J01036p4847Q9854
$$ plain form
17307 384373 131500 260283 248671 197595 397787 367065 384463 512973 500358 189779
17296 171083 29724 98139 189535 136748 66501 103893 62043 12461 359930 648827 431762
17285 431762 -124256 127231 233254 44081 445175 517760 239190 -109432 298921 545580
17275 545580 -48302 551030 48699 -55385 229511 15083 203233 54600 274209 350211 381972
17264 381972 6053 507026 451081 414706 349169 183040 156113 347409 186890 -4506 258615
17252 279241 456911 86161 315470 232592 565057 259110 151634 270966 518404 513816
17242 513816 188260 465860 116557 278387 371309 287461 204863 570896 195228 240884
17232 240884 284944 310470 273715 357173 20064 312859 71247 341167 753975 369977 -143007
$$ packed form
17307C84373A31500J28783j1612n1076K00192l0722J7398J28510j2615A89779
17296A71083B9724O8415R1396n2787F6501L7392m1850A2461L47469K88897k17065
17285D31762a24256A27231J06023D4081M01094P2585B39190a09432B98921K46659
17275E45580d8302E51030D8699e5385B29511A5083J88150E4600K19609P6002L1761
17264C81972F053N00973n5945l6375o5537j66129k6927J91296j60519d506B58615
17252B79241J77670H6161K29309q2878L32465B59110j07476J19332K47438m588
17242E13816A88260K77600A16557J61830R2922q3848q2598L66033A95228M5656
17232B40884M4060K5526l6755Q3458B0064K92795G1247K69920M12808C69977a43007
$$ plain form
17220 126751 565086 267971 183523 354656 461160 -74057 183844 234965 417986 223536
17210 223536 210351 224202 130637 317577 380296 484313 631207 615309 303714 629546
17200 629546 187516 258716 310864 616608 247063 331460 338599 -33421 427465 107614 193626
17189 193626 380235 422136 -12856 302830 424188 195929 9197 58981 141983 283332 546528
17178 546528 512095 598824 238110 106135 595417 324615 336704 336402 507775 488901 343149
17167 343149 158462 218976 224769 254105 418706 167333 201850 340075 321648 243338 371549
17156 371549 328163 373280 284174 316262 353300 439444 437776 244080 251598 898935 417770
17144 270468 235426 436038 546372 237502 333459 267316 219126 335380 279514 245050 274571
$$ packed form
17220A26751M38335B67971q4448J71133J06504g4057A83844N1121J83021j94450
17210B23536j3185J3851r3565J86940O2719J04017J46894j5898C03714L25832
17200F29546A87516P1200N2148L05744B47063Q4397P139c3421D27465A07614Q6012
17189A93626J86609M1901a2856C02830J21358A95929I197M9784Q3002J41349K63196
17178E46528l4433Q6729B38110A06135M89282k70802J2089l02J71373j8874j45752
17167C43149A58462O0514N793K9336J64601A67333L4517J38225j8427p8310J28211
17156C71549m3386M5117q9106L2088L7038Q6144j668j93696P518O47337D17770
17144B70468l5042K00612J10334B37502R5957o6143m8190J16254n5866l4464K9521
$$ plain form
17133 274571 399858 791789 623613 530859 348848 440682 790334 394527 561471 275456
17122 656575 511935 115362 580347 498050 421389 633087 414782 495308 211880 842127
17112 842127 392568 734480 349534 866303 314592 570890 436228 715625 499224 548102
17102 548102 608988 441577 299215 817139 442332 594315 504440 336099 391203 389416
17092 389416 190131 685846 561777 759845 649760 584704 1049018 538755 851660 246012
17081 591988 616893 292539 290196 512762 717936 638584 376970 572891 569536 777642 490827
17070 490827 597059 532917 441813 490865 582180 965002 420766 606887 467290 827924
17060 827924 435836 712303 552071 798124 548278 698995 623692 848456 654638 244549
$$ packed form
17133B74571J25287L91931j68176r2754j82011R1834L49652C94527J66944B75456
17122F56575j44640A15362M64985q2297p6661K11698k18305Q0526B11880O30247
17112H42127C92568L41912C49534N16769C14592K56298j34662K79397k16401M8878
17102E48102O0886j67411j42362N17924l74807J51983q9875j68341N5104j787
17092C89416A90131M95715j24069J98068j10085o5056M64314n10263L12905B46012
17081E91988K4905B92539k343K22566K05174p9352k61614J95921l355K08106k86815
17070D90827J06232o4142r1104M9052R1315L82822D20766J86121j39597L60634
17060H27924l92088K76467j60232K46053k49846J50717p5303K24764j93818B44549
$$ plain form
17049 618476 637948 561581 1077253 685240 613690 525807 626551 767279 600002 819692
17039 819692 721912 795703 822353 808377 568784 715526 804191 916419 719561 836980
17029 836980 871452 472143 880947 838188 854810 651692 671456 669062 261086 903348 1246444
17018 1246444 1025281 707381 787029 766008 919147 596901 981499 1043982 978204 1117000
17008 1117000 964847 961606 1190294 979074 786154 945450 846314 606811 1186001 982600
16998 982600 1086200 952865 1191380 890278 1079367 850586 1070287 915409 1413805 1086024
16988 1086024 1140045 855606 1202953 1084846 1138835 1121250 1195921 974275 1004838 1239482
16978 1239482 1067878 1229352 1093203 917967 1092126 775402 1330408 1499617 1373120
$$ packed form
17049F18476J9472p6367N15672l92013p1550q7883J00744J40728j67277K19690
17039H19692r7780P3791K6650j3976k39593J46742Q8665J12228j96858J17419
17029H36980L4472l99309M08804m2759J6622k03118J9764k394B61086O42262L43096
17018A246444k21163l17900P9648k1021J53139l22246L84598O2483o5778J38796
17008A117000j52153l241K28688k11220j92920J59296r9136k39503N79190k03401
16998I82600J03600j33335K38515l01102J89089k28781K19701j54878M98396l27781
16988A086024N4021k84439L47347j18107N3989j7585P4671k21646L0563K34644
16978A239482j71604J61474j36149j75236J74159l16724N55006J69209j26497
$$ plain form
16969 1373120 1263219 1093645 1218602 1246763 1312182 910053 1352959 1001103 1171112 939184
16959 939184 1456591 1425847 1177815 1388321 1014808 1335572 926623 1249443 1175020 1542511
16949 1542511 1250262 1169015 1174591 1217393 1468543 1593478 1322567 1819333 1360401 1654326
16939 1654326 1677407 1394278 1690250 1714369 1470644 1289521 1491745 1237346 1509604 1733718
16929 1733718 1784296 1711153 1909355 1377528 1981027 1609209 1488528 1505015 1808774 1810399
16919 1810399 1839945 1584805 1609204 1589420 1780252 1818395 1885217 1883290 1927413 1887193 1818564
16908 1818564 1981350 1972340 2175881 1876665 2269677 2042094 1664300 2190275 2038489 1955490
16898 1955490 1707318 2312026 2160877 2348205 2362128 2073879 1859134 2382359 2411135 2033434
$$ packed form
16969A373120j09901j69574J24957K8161O5419m02129M42906l51856J70009k31928
16959I39184N17407l0744k48032K10506l73513L20764m08949L22820p4423L67491
16949A542511k92249q1247N576M2802K51150J24935k70911M96766m58932K93925
16939A654326K3081k83129K95972K4119k43725j81123K02224k54399K72258K24114
16929A733718N0578p3143J98202n31827O03499l71818j20681J6487L03759J625
16919A810399K9546k55140K4399j9784J90832L8143O6822j927M4123m0220o8629
16908A818564J62786r010K03541k99216L93012k27583l77794N25975j51786q2999
16898A955490k48172O04708j51149J87328J3923k88249k14745N23225K8776l77701
$$ plain form
16888 2033434 2217060 2189645 2335025 2343602 2430806 2403838 2533702 2363696 2618046 2348316
16878 2348316 2331074 2671295 2517165 2478487 2586736 2863602 2632397 2836620 2740239 3133075
16868 3133075 2713347 3005094 3184207 3020836 3229012 3152306 2993251 3189703 3525777 3301980
16858 3301980 3603088 3119406 3326643 3272202 3336301 3473740 3544150 3319379 3530335 3682859
16848 3682859 3792594 3732551 3888702 4049063 3722172 3858017 4175795 4154541 4303012 4271025
16838 4271025 3975908 4442933 4296293 4485234 4599098 4608065 4733945 4614842 4887286 5037723
16828 5037723 4957151 5304508 5056171 5207119 5340868 5439405 5613858 5529798 5561312 5980616
16818 5980616 5754559 6121281 5799665 6261851 6564995 6461222 6709581 6726508 7071705 6722526
$$ packed form
16888B033434J83626k7415J45380Q577Q7204k6968J29864j70006K54350k69730
16878B348316j7242L40221j54130l8678J08249K76866k31205K04223r6381L92836
16868C133075m19728K91747J79113j63371K08176p6706j59055J96452L36074k23797
16858C301980L01108m83682K07237n4441O4099J37439P0410k24771K10956J52524
16848C682859J09735o0043J56151J60361l26891J35845L17778k1254J48471l1987
16838D271025k95117M67025j46640J88941J13864Q967J25880j19103K72444J50437
16828E037723q0572L47357k48337J50948J33749R8537J74453q4060L1514M19304
16818E980616k26057L66722l21616M62186L03144j03773K48359J6927L45197l49179
$$ plain form
16808 6722526 7159757 6977287 7312693 7557428 7557776 7718710 7897265 8278097 8100483 8193786
16798 8193786 8772944 9035419 8977451 9163958 9225078 9450716 9650415 9958151 10204340 10571039
16788 10571039 10577106 10798654 11385697 11366947 11721511 11991060 12549353 12426436 12802028 12929641
16778 12929641 13142868 13816821 14317155 14349385 14878665 15384333 15739739 16210347 16854397
16769 16854397 17210935 17603594 18041096 18636016 19335087 19809964 20265630 21075953 21732395
16760 21732395 22186855 22870889 23729968 24416157 25092259 26037340 26920780 27806020 28981549
16751 28981549 30343265 30886571 32119357 33408991 34497248 35858352 37206008 38696648
16743 38696648 40150344 41584893 43078893 45126606 47165972 48832472 50467698 52811996
$$ packed form
16808F722526M37231j82470L35406K44735L48J60934J78555L80832j77614R3303
16798H193786N79158K62475n7968J86507O1120K25638J99699L07736K46189L66699
16788A0571039O067K21548N87043j8750L54564K69549N58293j22917L75592J27613
16778A2929641K13227O73953N00334L2230N29280N05668L55406M70608O44050
16769A6854397L56538L92659M37502N94920O99071M74877M55666Q10323O56442
16760B1732395M54460O84034Q59079O86189O76102R45081Q83440Q85240J175529
16751B8981549J361716N43306J232786J289634J088257J361104J347656J490640
16743C8696648J453696J434549J494000K047713K039366J666500J635226K344298
$$ plain form
16735 52811996 55576308 57507653 60021281 62453767 65277658 67971935 71026510 73526794
16727 73526794 77112438 80278256 83526145 86823457 90841393 94256585 97918759 101807553
16719 101807553 105616231 109150795 112623073 115780314 119626392 122913253 126162076 129070015
16711 129070015 131159280 133372688 135110564 136701977 137416063 138393080 138007786 137705628
16703 137705628 136832201 135463410 133736037 131414519 129149141 126285360 123013627 119633700
16695 119633700 116091042 112407517 108767673 104857666 101230918 97284401 93803220 90113871
16687 90113871 86284027 82454091 79466848 76228308 72931443 69853101 66959158 63964684
16679 63964684 61155766 58613146 55726113 53683621 51461628 49370104 47236345 45067856
$$ packed form
16735E2811996K764312J931345K513628K432486K823891K694277L054575K500284
16727G3526794L585644L165818L247889L297312M017936L415192L662174L888794
16719A01807553L808678L534564L472278L157241L846078L286861L248823K907939
16711A29070015K089265K213408J737876J591413P14086R77017l85294l02158
16703A37705628q73427j368791j727373k321518k265378k863781l271733l379927
16695A19633700l542658l683525l639844l910007l626748l946517l481181l689349
16687I0113871l829844l829936k987243l238540l296865l078342k893943k994474
16679F3964684k808918k542620k887033k042492k221993k091524k133759k168489
$$ plain form
16671 45067856 43596213 41888968 40165770 38401494 37106247 35549103 34493074 32694094
16663 32694094 31826753 30796233 29414626 28400216 27588534 26562429 25887414 25034926 23789083
16654 23789083 23249192 22791115 21515123 20990908 20393302 19788701 18897872 18666144 18246291
16645 18246291 17956173 16821714 16254455 16001599 15490965 15214630 14704403 14270079 13936668
16636 13936668 13873011 13250337 12815627 12958236 12314050 12069117 11571045 11184751 10739226
16627 10739226 10845360 10601254 10588970 9892430 10112286 9653130 9625403 9067609 9055216 8636046
16617 8636046 8527464 8488736 8298255 7940613 7688041 7588550 7409288 7551865 6996309 6983945
16607 6983945 7026703 6835056 6892167 6505286 6599928 6635550 6689211 6096450 6075959 5909625
$$ packed form
16671D5067856j471643j707245j723198j764276j295247j557144j056029j798980
16663C2694094q67341j030520j381607j014410q11682j026105o75015q52488j245843
16654B3789083n39891m58077j275992n24215n97606o04601q90829k31728m19853
16645A8246291k90118j134459n67259k52856n10634k76335n10227m34324l33411
16636A3936668o3657o22674m34710J42609o44186k44933m98072l86294m45525
16627A0739226J06134k44106j2284o96540K19856m59156k7727n57794j2393m19170
16617H636046j08582l8728j90481l57642k52572r9491j79262J42577n55556j2364
16607F983945M2758j91647N7111l86881R4642L5622N3661n92761k0491j66334
$$ plain form
16597 5909625 5650249 5694736 5569428 5619222 5268211 5162218 5375548 5220272 5100077 4994985
16587 4994985 4765491 4683034 4828886 4554853 4577662 4349526 4524350 4214565 4406713 4371893
16577 4371893 4359554 4145315 4278030 4164930 3991664 3870482 3582491 3963728 3575212 3779194
16567 3779194 3633334 3673284 3414209 3599778 3323721 3295611 3229190 3341846 3078168 3318099
16557 3318099 3146174 3120495 3155725 2716440 2555360 2783467 3058456 2754597 2779072 2658018
16547 2658018 2501134 2649860 2742868 2582781 2365393 2580878 2541998 2478425 2202330 2690534
16537 2690534 2440836 2440818 2396138 1970644 2117918 2428488 2355666 2247245 2224074 2095710 1912101
16526 1912101 1869428 2116862 2185353 2373444 2033370 1980406 2000645 1819239 2147165 1928318
$$ packed form
16597E909625k59376M4487j25308M9794l51011j05993K13330j55276j20195j05092
16587D994985k29494q2457J45852k74033K2809k28136J74824l09785J92148l4820
16577D371893j2339k14239J32715j13100j73266j21182k87991L81237l88516K03982
16567C779194j45860L9950k59075J85569k76057k8110o6421J12656k63678K39931
16557C318099j71925k5679L5230m39285j61080K28107K74989l03859K4475j21054
16547B658018j56884J48726R3008j60087k17388K15485l8880o3573k76095M88204
16537B690534k49698j8m4680m25494J47274L10570p2822j08421k3171j28364j83609
16526A912101m2673K47434O8491J88091l40074n2964K0239j81406L27926k18847
$$ plain form
16516 1928318 1943480 1907803 1659429 1799087 1682336 1563389 1723141 2061867 1702368 2031517
16506 2031517 1346475 1860869 1861199 1690480 1652737 1982202 1788142 1613713 1550254 1665310
16496 1665310 1397554 1621130 1404533 1516197 1288004 1292903 1417498 1284801 1481489 1505545
16486 1505545 1535804 1359616 1390511 1510925 1055669 1488580 1332981 1215310 1327209 1325773
16476 1325773 1103507 1202989 1227791 1222902 1551901 1260318 1159543 1061634 1101951 1213373
16466 1213373 1492213 1131633 1051726 1471570 989890 1060998 1067039 1039829 1160903 1536911
16456 1536911 1090290 1121131 1147405 1068362 1334044 1259321 835267 977354 832062 1126024
16446 1126024 1152455 641739 826483 818721 999651 916445 883290 1043420 930005 1135560
$$ packed form
16516A928318J5162l5677k48374J39658j16751j18947J59752L38726l59499L29149
16506B031517o85042N14394L30j70719l7743L29465j94060j74429o3459J15056
16496A665310k67756K23576k16597J11664k28193M899J24595j32697J96688K4056
16486A505545L0259j76188L0895J20414m55256M32911j55599j17671J11899j436
16476A325773k22266R9482K4802m889L28999k91583j00775r7909M0317J11422
16466A213373K78840l60580p9907M19844m81680P1108O041k7210J21074L76008
16456A536911m46621L0841K6274p9043K65682p4723m24054J42087j45292K93962
16446A126024K6431n10716J84744p762J80930q3206l3155J60130j13415K05555
$$ plain form
16436 1135560 1146385 723862 925544 879743 934851 693583 987368 801567 726391 1053064
16426 1053064 1008654 856666 739945 616747 673980 624844 1060127 1007022 795869 870641
16416 870641 754664 646285 857493 778706 422081 746163 388411 523136 576031 839276
16406 839276 778168 657438 655772 805041 751775 650221 938476 677220 1098357 531585
16395 792928 752968 351272 878074 631567 710783 843380 507478 698877 578190 683566
16385 683566 495452 762013 626638 847193 352431 591907 678127 422734 867787 756769
16375 756769 518238 623519 685470 599806 661395 918349 633101 635720 668259 784037 195737
16363 689550 860366 491135 735558 585355 788538 345938 541152 347491 393520 482679
$$ packed form
16436A135560J0825m22523K01682m5801N5108k41268K93785j85801p5176L26673
16426A053064m4410j51988j16721j23198N7233m9136M35283n3105k11153P4772
16416H70641j15977j08379K11208p8787l56625L24082l57752J34725N2895K63245
16406H39276o1108j20730j666J49269n3266j01554K88255k61256M21137E31585
16395G92928l9960C51272N26802k46507P9216J32597l35902J91399j20687J05376
16385F83566j88114K66561j35375K20555C52431K39476Q6220k55393M45053j11018
16375G56769k38531J05281O1951q5664O1589K56954k85248K619L2539J15778A95737
16363F89550J70816l69231K44423j50203K03183C45938J95214j93661M6029Q9159
$$ plain form
16353 482679 457760 612777 645628 669502 489099 500797 223526 427814 389060 928279
16343 928279 409345 840877 433466 386918 387136 240167 205733 205989 746151 250836 469527
16332 469527 267824 297815 343432 350622 385431 722006 639748 584862 597106 443060 683490
16321 683490 498076 539415 214906 737897 -16985 462363 228162 512531 553531 213853
16310 242599 209797 272192 465309 334965 689794 276655 144174 -48208 414349 214203
16300 214203 234753 109425 287168 622673 382293 360262 570718 453929 491544 515717
16290 515717 362351 668165 233556 508118 392250 185849 386837 251739 675001 359830
16280 359830 45469 337111 393123 649524 350258 455009 144939 427754 414764 446604
$$ packed form
16353D82679k4919J55017L2851K3874j80403J1698B23526K04288l8754N39219
16343I28279D09345M31532m07411m6548K18j46969l4434K56N40162B50836K18691
16332D69527k01703K9991M5617P190L4809L36575q2258n4886J2244j54046K40430
16321F83490j85414M1339B14906N22991a6985D62363B28162K84369M1000B13853
16310B42599l2802O2395J93117j30344L54829B76655j32481d8208D14349k00146
16300B14203K0550A09425J77743L35505k40380k2031K10456j16789L7615K4173
16290E15717j53366L05814B33556K74562j15868A85849K00988j35098M23262l15171
16280C59830D5469K91642N6012K56401k99266J04751A44939K82815j2990L1840
$$ plain form
16270 446604 393366 261805 339036 337780 249025 517847 21315 130507 296931 422435 166676
16258 183935 8056 47181 377402 319132 381169 38639 546801 296550 408782 91266 595228
16247 595228 418832 205791 257478 45659 551008 302168 224020 245143 172369 605138
16237 605138 359580 223483 237742 584475 222246 633326 255969 98123 314620 428500
16227 428500 280768 270870 423420 266578 484606 424464 561675 323825 268999 340100
16217 340100 80081 308030 -105617 45905 -85281 331122 101633 243632 150441 249810
16207 249810 22471 436806 447969 235124 396611 128364 273108 229711 94595 -18247
16196 139210 332283 -63476 8431 231656 3355 169769 79786 -43418 -90128 -21542 199801
$$ packed form
16270D46604n3238j31561P7231j256q8755K68822B1315J09192J66424J25504A66676
16258A83935H056L9125L30221n8270O2037C8639N08162k50251J12232I1266N03962
16247E95228j76396B05791N1687D5659N05349k48840p8148K1123p2774M32769
16237F05138k45558j36097J4259L46733B22246M11080B55969I8123K16497J13880
16227D28500j47732r898J52550j56842K18028o0142J37211k37850n4826P1101
16217C40100H0081K27949a05617D5905h5281C31122A01633J41999r3191R9369
16207B49810B2471M14335J1163k12845J61487A28364J44744m3397I4595a8247
16196A39210J93073f3476H431K23225C355J66414G9786d3418m6710b1542A99801
$$ plain form
16184 170398 122103 339094 213823 29245 368770 382051 456606 339599 536487 318790
16174 318790 130349 26040 -80822 212955 195659 -177164 53260 51280 232104 -66105 -175659
16163 -175659 130391 318436 201509 354409 444645 32406 342434 547079 -35647 122851
16152 229795 -32021 176855 428693 -127935 130874 201454 275412 75046 98350 113335 200476
16141 200476 234160 137923 83033 692148 -56984 59467 -170036 255587 95211 33611 55668
16130 55668 -7969 257741 386343 362870 191888 231617 217656 266020 208631 148369 144493
16119 144493 -130143 48420 61195 197023 343733 -9003 131539 -180931 118952 -92044
16108 -254228 395382 126888 -77280 -288318 50708 49413 -250270 115627 -44753 680558
$$ packed form
16184A70398m8295K16991j25271B9245L39525J3281P4555j17007J96888k17697
16174C18790A30349B6040h0822B12955j7296a77164E3260j980J80824f6105j09554
16163a75659A30391J88045j16927J52900R0236C2406L10028K04645c5647A22851
16152B29795c2021A76855K51838a27935A30874P0580P3958G5046K3304J4985Q7141
16141B00476L3684r6237n4890O09115e6984E9467a70036B55587I5211C3611K2057
16130E5668g969B57741J28602k3473j70982L9729j3961M8364n7389o0262l876
16119A44493a30143D8420J2775J35828J46710i003A31539a80931A18952i2044
16108b54228C95382A26888g7280k11038E0708j295b50270A15627d4753F80558
$$ plain form
16097 240818 -29618 68027 -96117 10031 238702 -112022 267014 195478 -166641 -155783 49947
16085 339865 136704 -100470 -100242 24195 -42992 -56466 -41181 -86832 267785 176200 696 -360572
16072 -5351 106007 21346 -40048 26100 60771 -7573 -111580 125982 -16227 319174 -50256
16060 -50822 75267 251 -108437 -110801 218439 321828 -34825 -214872 122250 -290293 80358
16048 -92907 167578 353359 72314 38920 102987 155324 -225358 -106596 -93994 279861 7455
16036 48873 218949 -235721 71628 101673 -99752 12222 146558 -77398 335009 -340053 2718
16024 -318401 230315 -130647 83726 -315859 -30119 384139 15892 92309 -169519 252533
16013 426631 -232018 8136 -391991 -193991 -181928 192805 -162969 -38546 11915 60284 103767
$$ packed form
16097B40818b9618F8027i6117A0031K28671a12022B67014p1536a66641J0858D9947
16085C39865A36704a00470K28B4195d2992j3474J5285m5651B67785r1585F96c60572
16072e351A06007B1346d0048B6100L4671g573j04007A25982a6227C19174e0256
16060e0822G5267B51a08437k364B18439J03389c4825j80047A22250b90293H0358
16048i2907A67578J85781G2314l3394O4067N2337b25358a06596J2602B79861G455
16036D8873J70076b35721G1628L0045i9752A2222J34336g7398C35009c40053B718
16024c18401B30315a30647H3726c15859c0119C84139A5892P6417a69519B52533
16013D26631b32018H136c91991a93991J2063A92805a62969c8546A1915M8369M3483
$$ plain form
16002 103767 37945 65819 -100202 -321812 -537554 -81305 -21362 -281727 182879 67444
15991 220889 -23924 -5319 322987 226119 125665 -8618 106577 117462 163162 28508 195746
15980 195746 327693 -59 -26134 379163 269059 280838 223773 -51702 -41340 383453 562868
15969 562868 589311 638726 1169994 656420 535245 -133636 7759 418098 112405 -3517 -49220
15958 -49220 -90479 -45089 38811 -99336 209198 -157247 114184 -165440 -200343 -112144 2147
15946 -160478 -10737 1073 -63392 138075 -156704 -234978 -125007 570382 -171681 -79143 -278519
15935 -278519 -246636 -49197 147287 -140899 -119945 4314 -178124 -160708 -73243 -28491 -5832
15923 -120236 -177314 -72934 6628 -239821 -40200 -210096 -192913 -156690 -67459 -111449 -267858
$$ packed form
16002A03767C7945K7874a00202k21610k15742h1305b1362k60365A82879F7444
15991B20889b3924e319C22987r6868j00454h618A06577J0885M5700B8508J67238
15980A95746J31947e9k6075C79163j10104J1779n7065e1702J0362C83453J79415
15969E62868K6443M9415N31268n13574j21175a33636G759M10339A12405c517m5703
15958d9220m1259d5089C8811i9336B09198a57247A14184a65440l4903Q8199B147
15946a60478a0737A073f3392A38075a56704p8274J09971E70382a71681g9143j99376
15935b78519L1883d9197A47287a40899K0954D314a78124J7416g3243b8491e832
15923a20236n7078g2934F628b39821d0200j69896J7183L6223f7459m3990j56409
$$ plain form
15912 -267858 -375279 113223 156289 -118910 -255540 -270606 44882 -185172 -340980 -72855
15901 259390 116242 -149041 7741 151707 111763 -234233 -123017 -332238 -42217 -75215
15891 -75215 31648 55183 173597 -109196 180649 33772 -104513 110789 -93319 -21623 -2117
15879 63882 158871 106638 177497 -206888 -18938 -395301 -277420 139938 208099 200982 104381
15868 104381 -125757 43660 493400 -209782 304323 -103202 -106270 -36534 320399 -39391
15857 131587 -46814 -141018 -213108 -27134 -8143 -145827 -169161 -24880 -79485 1919 -66916 -35501
15845 -35501 56468 296871 -121575 -155109 145623 331347 -38076 51874 207496 142740 297424
15834 297424 -240557 -15049 51715 -81657 -64827 -235136 -158106 -182800 134875 -126114 -19460
$$ packed form
15912b67858j07421A13223M3066a18910j36630j5066D4882a85172j55808g2855
15901B59390A16242a49041G741J43966l9944b34233J11216k09221d2217l2998
15891g5215C1648K3535J18414a09196A80649C3772a04513A10789i3319b1623b117
15879F3882R4989n2233P0859b06888a8938l76363J17881A39938O8161p117r6601
15868A04381a25757D3660M49740b09782C04323a03202l068c6534C20399c9391
15857A31587d6814r4204p2090b7134h143j37684k3334b4880n4605A919f6916L1415
15845c5501E6468K40403a21575l3534A45623J85724c8076E1874J55622o4756J54684
15834B97424b40557a5049E1715h1657J6830j70309P7030k4694A34875a26114a9460
$$ plain form
15822 291364 85485 -2645 111079 108516 -325387 -320546 29100 335193 -257143 -84797 -35465
15810 -62687 213619 -79690 -294421 -4444 139219 69464 27943 283464 -72335 117812 -159809
15798 -16891 -250538 -134065 20314 182688 -159982 -195725 -80592 94922 -276312 -230940 -39668
15786 -14563 -107216 365856 -67581 55740 347323 -22336 -129280 -70997 186166 -108749 172867
15774 -145426 -46225 304114 62944 288154 282222 -54094 -148015 71193 56422 -101896 -291030
15763 -291030 -227571 -64655 -85280 -237855 39144 -37802 36272 -207625 -351007 -68110 109287
15751 46965 8187 -144450 -170626 -29098 -68461 51571 -68766 134595 442674 -4397 -37612
15740 -37612 -13758 -199427 -128305 112721 221287 -73060 -56032 -38574 -170659 -281479 112330
$$ packed form
15822B91364H5485b645A11079k563c25387M841B9100L06093b57143h4797c5465
15810f2687B13619g9690k14731d444A39219F9464B7943K55521g2335A17812a59809
15798a6891k33647J16473B0314J62374a59982l5743h0592I4922b76312M5372c9668
15786a4563r2653C65856f7581E5740K91583b2336j06944N8283A86166a08749A72867
15774a45426d6225C04114F2944K25210n932e4094r3921G1193j4771a01896j89134
15763b91030O3459f4655k0625j52575C9144c7802C6272b07625j43382f8110A09287
15751D6965H187a44450k6176b9098l9363E1571f8766A34595L08079d397l3215
15740c7612a3758j85669P1122A12721J08566g3060J7028J7458j32085j10820A12330
$$ plain form
15728 -185483 26866 -127895 33327 292833 -179555 190117 -135762 371161 -66590 -257188
15718 -257188 113808 -230529 105779 -137510 22888 44489 119975 14718 -42093 162047
15707 -43908 61788 -23656 -233626 111783 157176 -194937 138254 -269013 -182637 -312752
15697 -312752 -153974 9786 -171321 54804 88575 70647 -275182 85234 -414818 -258899 -176426
15686 -176426 -256076 -48894 43041 26884 -101469 117906 -114973 -80018 170818 143164 170165
15675 170165 110621 177512 113929 200571 328547 159371 -27923 -106671 -98000 -121244 -80079
15664 -80079 -89249 311327 279038 -109736 -186186 -314650 -34846 -156036 1784 85119 -276201
15652 -223195 396720 -506243 -160191 -245574 275891 -139095 52505 -73339 142817 -348888
$$ packed form
15728a85483B6866a27895C3327K59506a79555A90117a35762C71161f6590j90598
15718b57188A13808b30529A05779a37510B2888K1601P5486A4718d2093A62047
15707d3908F1788b3656k09970A11783M5393a94937A38254b69013Q6376j30115
15697c12752a53974I786a71321E4804L3771j7928b75182H5234d14818J55919Q2473
15686a76426p9650d8894D3041j6157a01469A17906a14973L4955A70818k7654K7001
15675A70165n9544O6891o3583Q6642J27976A59371b7923p8748Q671k3244M1165
15664h0079r170C11327l2289a09736p6450j28464c4846j21190A784Q3335b76201
15652b23195C96720e06243a60191q5383B75891a39095E2505g3339A42817c48888
$$ plain form
15641 -164130 69546 -301120 -61401 -13657 62877 -64177 -32364 -259277 -355157 54930 21580
15629 -3045 -46169 -84990 321078 -144967 -69103 -119108 -70259 -60432 -101004 -54947 150649
15617 11923 -45328 -132546 -362500 98081 14804 -39919 -63330 265916 75307 143244 -210482
15605 -53598 -229653 25179 93087 -179245 59702 72812 -33213 -97660 9115 282278 -65192
15593 -88763 -214692 -201383 -109492 -42618 206369 138514 -47824 308931 109315 6852 221863
15582 221863 -54393 -159064 60424 -120577 3666 235676 -156285 -310148 -26593 30802 -98624
15570 23897 384119 -9754 131615 -216955 -100597 201486 -211150 -379014 -439839 98663
15559 -105939 -223252 156969 -253608 -12116 -222048 -378878 -194725 67932 -122245 -157576
$$ packed form
15641a64130F9546c01120f1401a3657F2877f4177L1813k26913r5880E4930B1580
15629c045m3124l8821C21078a44967f9103n0005M8849R827m0572M6057A50649
15617A1923d5328q7218k29954I8081A4804c9919k3411B65916G5307O7937b10482
15605e3598j76055B5179O7908a79245E9702J3110c3213o4447I115K73163f5192
15593h8763j25929J3309R1891d2618B06369o7855d7824C08931A09315F852K15011
15582B21863e4393j04671F0424a20577C666K32010a56285j53863b6593C0802i8624
15570B3897L60222i754A31615b16955a00597B01486b11150j67864o0825I8663
15559a05939j17313A56969b53608a2116k09932j56830J84153F7932a22245l5331
$$ plain form
15549 -157576 17832 -73542 -198428 139470 412012 -386657 65247 -77253 256909 -248331
15538 100301 -69976 -32704 -68356 99476 -339814 -190315 -139764 -19282 -163904 -211530 -85480
15526 81481 331159 243629 48591 259649 -7506 369698 201584 81387 260187 185663 -369803
15514 -89675 82843 177025 -31491 -8638 319276 -235800 17217 -148899 361594 3937 163850
15503 163850 171362 475612 -12712 444946 229495 31731 385993 210092 161700 296831
15493 296831 -127080 96402 113193 35208 -85372 260537 199247 11184 174004 28276 42011
15482 42011 -272085 -105360 -152115 37295 133709 137980 265127 -196062 289576 271796 -217636
15470 106317 140519 207052 -114836 48379 104666 181020 -19329 283998 234891 -172202 218403
$$ packed form
15549a57576A7832g3542j24886A39470K72542c86657F5247g7253B56909b48331
15538A00301f9976c2704l5652I9476c39814J49499N0551a9282j44622m7626h5480
15526H1481K49678q7530D8591K11058g506C69698j68114H1387J78800p4524c69803
15514h9675H2843R4182c1491h638C19276b35800A7217a48899C61594C937J59913
15503A63850P512L04250a2712D44946k15451C1731L54262j75901m8392J35131
15493B96831a27080I6402J6791C5208h5372B60537o1290A1184J62820B8276J3735
15482D2011b72085a05360m6755C7295R6414M271J27147a96062B89576j7780b17636
15470A06317L4202O6533a14836D8379N6287P6354a9329B83998m9107a72202B18403
$$ plain form
15458 10384 -54998 526524 299104 74578 137887 305456 -209441 -211820 -21788 64201 -42546
15446 -147775 -92361 312074 -1633 -189234 330825 39126 188923 -37616 -161454 54784 -30034
15434 107457 99763 349935 408502 101073 206872 276326 186323 12137 496804 397945 953413
15423 953413 574474 218607 511327 94058 117728 349996 316991 339294 218837 -213935
15412 478056 157447 26000 -100960 254641 62317 39637 -176557 -290252 51527 114436
15402 114436 282742 -38544 46883 -161705 -339304 -158670 -16284 -154312 -312359 78488
15391 327516 818 70596 85220 164593 70692 125601 -87668 305984 42591 -8241 537602 -109415
15378 -7965 217029 -63922 -41594 51893 318852 -42740 35583 -149145 424953 124792 25225
$$ packed form
15458A0384e4998E26524k27420G4578O3309J67569b09441k379b1788F4201d2546
15446a47775N5414C12074a633j87601C30825C9126J49797c7616j23838E4784c0034
15434A07457p694K50172N8567A01073J05799O9454r0003A2137M84667r8859N55468
15423I53413l78939B18607K92720I4058K3670K32268l3005K2303j20457b13935
15412D78056A57447B6000a00960B54641F2317k2680a76557j13695E1527O2909
15402A14436J68306c8544D6883a61705j77599a58670a6284j38028j58047G8488
15391C27516H18O9778J4624P9373G0692N4909h7668C05984D2591h241E37602a09415
15378g965B17029f3922K2328E1893K66959d2740C5583a49145D24953A24792B5225
$$ plain form
15366 -96665 -45688 32204 5598 172 264304 82143 80999 6658 109263 181085 104561 -116065
15353 337923 -153125 -178676 176845 312938 -78220 223797 367808 235793 73487 111748
15343 111748 420127 -66987 -50990 280352 31626 -125990 111911 -67492 73792 24197 616042
15332 616042 190267 244608 4151 180588 78262 376645 300294 366234 289746 -63720 -70847
15321 -70847 278914 -9166 408503 -54095 31539 96509 -74347 361577 205992 297815 125764
15309 -82546 -6372 23498 436202 191800 100002 231398 -25479 -25259 -331 241272 164311 145800
15297 145800 156317 -354848 -104959 -51985 35972 508365 33918 -251511 59079 68253 400316
15286 400316 -39062 -128753 275497 -134399 -132026 -135352 -131826 -243041 16793 117977 447302
$$ packed form
15366i6665d5688C2204E598A72K64132H2143j144F658J02605P1822p6524a16065
15353C37923a53125k5551A76845J36093g8220B23797J44011j32015G3487L8261
15343A11748L08379f6987J5997B80352C1626a25990A11911f7492G3792B4197N91845
15332F16042A90267N4341D151J76437G8262K98383p6351O5940p6488f3720p127
15321g0847B78914i166D08503e4095C1539O4970g4347C61577j55585R1823A25764
15309h2546f372B3498M12704A91800r1798J31396b5479K20c31B41272p6961j8511
15297A45800J0517c54848a04959e1985C5972M72393C3918b51511E9079R174L32063
15286D00316c9062q9691B75497a34399K373l326L526j11215A6793J01184L29325
$$ plain form
15275 447302 -13416 27562 47977 -155086 -51330 -50983 178880 316864 -156749 115920 26169
15263 151028 42856 -269146 81051 44835 75909 239029 12350 -107549 -57020 164528 -1115
15251 116831 135464 -116651 -200549 -167324 240872 69209 -26539 -268072 369312 366477 -327660
15239 154139 79192 -80093 -207743 -352520 60976 6293 -130887 302229 333409 339623 680145
15228 680145 1309117 1305726 1110151 1324496 703270 540368 167437 81576 -24536 123177
15217 180517 164571 -46279 158928 36936 261743 92847 -96398 35167 -146443 75688 67804
15206 67804 -87950 -309733 -239000 -270347 109218 456043 -23080 318185 -11331 -172322 229958
15194 142909 113845 -239592 3319 138319 -67858 -197388 160381 20813 21547 241548 29460
$$ packed form
15275D47302a3416B7562K0415a55086e1330L47A78880J37984a56749A15920B6169
15263A51028D2856b69146H1051l6216L1074J63120A2350a07549N0529A64528a115
15251A16831J8633a16651q3898L3225B40872F9209b6539k41533C69312k835c27660
15239A54139p4947h0093j27650j44777F0976F293a30887C02229L1180O214L40522
15228F80145O28972l391j95575K14345o21226j62902A67437H1576b4536A23177
15217A80517j5946d6279A58928C6936K24807I2847i6398C5167a46443G5688p884
15206F7804h7950k21783P0733l1347A09218L46825b3080C18185a1331j60991B29958
15194A42909k9064b39592C319J35000f7858j29530A60381B0813P34K20001B9460
$$ plain form
15182 76012 33007 -18619 -128797 72415 199563 173784 -53118 -88738 195195 -33336 128945
15170 213475 411579 181798 -10740 26613 34473 -169022 47911 -193901 -3048 98001 84927
15159 84927 -50763 70312 -212092 -26700 209860 -132953 41517 -237016 -155340 -170877 109342
15147 -63477 -42689 216677 147013 180559 -75381 85981 85254 596811 -139119 232363 442493
15136 442493 243559 -102625 212581 228362 29173 358697 75470 161047 404331 60222
15125 433451 22083 -26805 -64281 259585 -66575 176735 -82456 377038 53532 99096 353017
15114 353017 425141 207727 183908 -47648 -26718 301346 301443 401113 105880 217565 197183
15103 197183 503970 315233 295244 347239 271816 88751 311261 -110805 17033 262800
$$ packed form
15182G6012C3007a8619j10178G2415J27148k5779e3118l5620A95195c3336A28945
15170B13475J98104A81798a0740B6613P860a69022D7911a93901c048I8001j3074
15159H4927e0763G0312b12092b6700B09860a32953D1517b37016Q1676j5537A09342
15147f3477K0788B16677o9664L3546g5381H5981p27N11557a39119B32363K10130
15136D42493j98934a02625B12581J5781B9173L29524G5470Q5577K43284F0222
15125D33451B2083b6805l7476B59585f6575A76735h2456C77038E3532M5564K53921
15114C53017P2124B07727k3819d7648K0930C01346R7R9670A05880J11685k0382
15103A97183L06787j88737j9989N1995p5423H8751K22510a10805A7033K45767
$$ plain form
15093 262800 196269 345109 294159 345870 154482 -133887 508880 396067 143840 326840
15083 326840 66539 312184 141297 107935 90272 153458 123728 180533 270977 -63311 140297
15071 -6678 355932 337816 286649 -71424 -107605 352788 -207861 206320 85667 -206859 405798
15059 302914 199922 -46663 499913 -212851 391756 270654 224516 68447 135245 175764
15049 175764 168876 146803 419046 213783 397888 62939 277208 222525 520182 297728
15039 297728 389207 478281 284495 -112702 -94437 80416 351767 413332 500808 332633 444982
15028 444982 336993 95101 584521 165659 144677 577960 173625 214522 121077 54935
15017 40698 419488 295550 195865 442090 202706 613330 787204 607571 403853 466331
$$ packed form
15093B62800o6531J48840n0950N1711A54482a33887E08880j12813A43840J83000
15083C26840F6539K45645A41297l3362j7663O3186k9730N6805R0444f3311A40297
15071f678C55932j8116n1167g1424l6181C52788b07861B06320H5667b06859D05798
15059C02914j02992d6663D99913b12851C91756j21102m6138F8447O6798M0519
15049A75764o888k2073K72243k05263J84105F2939K14269n4683K97657k22454
15039B97728R1479Q9074j93786a12702J8265H0416K71351O1565Q7476j68175J12349
15028D44982j07989I5101M89420A65659k0982M33283A73625M0897r3445E4935
15017D0698L78790j23938r9685K46225B02706M10624J73874j79633k03718O2478
$$ plain form
15007 466331 611254 149543 416543 254676 392697 328399 595075 94855 611936 193130
14996 270747 325326 426538 466586 270181 672616 329920 754898 423802 311234 401435
14986 401435 345505 28921 291906 316130 594790 12459 107805 277219 284773 529231 539404
14975 539404 249359 496415 341666 616576 144906 458374 509344 572251 751836 673016
14965 673016 465019 218238 867531 593914 658960 316296 648965 243791 193369 477739
14955 477739 530560 120012 323776 489192 205956 348588 156367 177389 140568 598267
14945 598267 277461 426019 344471 304538 541651 234941 447360 189861 265024 463104
14935 463104 204734 309240 285774 279416 244973 188801 333207 338778 444599 569150 944426
$$ packed form
15007D66331J44923A49543K67000j61867J38021o4298K66676I4855N17081A93130
14996B70747N4579J01212M0048j96405M02435C29920M24978l31096j12568R0201
14986D01435n5930B8921K62985K4224K78660A2459R5346J69414P554K44458J0173
14975E39404B49359K47056j54749K74910A44906L13468N0970O2907J79585p8820
14965F73016k07997B18238O49293k73617O5046C16296L32669B43791n0422K84370
14955D77739N2821A20012K03764J65416B05956J42632A56367K1022l6821M57699
14945E98267B77461J48558q1548l9933K37113B34941K12419A89861P5163J98080
14935D63104B04734J04506k3466o358l4443n6172J44406N571J05821J24551L75276
$$ plain form
14924 944426 441609 653798 614936 543953 -76295 411746 597448 578632 532957 392205
14914 392205 984428 1081011 1327101 857410 1289705 1330920 1062577 1400023 1154661 1173749
14904 1173749 1216727 1309069 1438531 1174342 1621636 1392732 1419092 1093233 1058541 710782
14894 710782 869996 617121 443760 216180 866006 217094 560088 468248 146698 570081
14884 570081 494825 644714 717997 578000 345780 633714 191126 514774 473954 396381
14874 396381 426242 458122 752538 234391 381008 784054 413479 931614 566612 625547
14864 625547 696624 739105 650504 684778 745965 533169 815055 330873 311795 527575 189087
14852 599543 648355 508707 669321 611622 847688 699083 818581 745164 514156 622167
$$ packed form
14924I44426D41609K12189l8862p0983g6295D11746J85702j8816m5675j40752
14914C92205N92223R6583K46090m69691M32295M1215k68343L37446k45362J9088
14904A173749M2978R2342J29462k64189M47294k28904K6360l25859l4692l47759
14894G10782J59214k52875j73361B16180O49826B17094L42994r1840A46698M23383
14884E70081p5256J49889P3283j39997k32220K87934A91126L23648m0820p7573
14874C96381K9861L1880K94416B34391J46617M03046l70575N18135l65002N8935
14864F25547P1077M2481q8601L4274O1187k12796K81886C30873j9078K15780A89087
14852E99543M8812j39648J60614n7699K36066j48605J19498p3417k31008J08011
$$ plain form
14842 622167 356983 250505 338967 562871 233137 822393 205022 204848 557842 222852
14831 490260 509223 539743 450945 1037818 632218 724485 794532 820781 1167308 1146022 863947
14820 863947 995209 878538 696547 850799 474051 842282 324941 677268 628503 293632
14809 593059 506671 1035618 508651 658148 642132 395006 402736 362024 682530 746405 715275
14798 715275 548057 610562 682609 531905 748431 172710 647623 623561 300431 650131
14788 650131 784685 1130074 782577 777370 899816 536902 652726 549301 887009 815775
14778 815775 546669 308768 278283 893567 325216 745116 836338 613925 384253 711217
14768 711217 544001 618864 884013 765003 677891 208739 741304 708069 541038 693168
$$ packed form
14842F22167k65184j06478Q8462K23904B33137N89256B05022j74L52994B22852
14831D90260J8963L0520q8798N86873m05600R2267P0047K6249L46527k1286k82075
14820H63947J31262j16671j81991J54252l76748L68231C24941L52327m8765B93632
14809E93059q6388N28947E08651J49497j6016k47126P730m0712L20506O3875l1130
14798G15275j67218O2505P2047j50704K16526A72710M74913k4062C00431L49700
14788F50131J34554L45389l47497n207J22446l62914J15824j03425L37708p1234
14778H15775k69106k37901l0485O15284C25216M19900R1222k22413k29672L26964
14768G11217j67216P4863K65149j19010q7112B08739N32565l3235j67031J52130
$$ plain form
14758 693168 954562 905337 868129 770087 781522 677330 698242 617435 766376 486949 638941
14747 638941 114684 714377 522940 937872 403796 624622 315122 489782 515686 744753
14737 744753 557769 432243 617402 774555 790192 601973 808579 288929 716831 589857
14727 589857 897545 523252 543367 524220 664631 552695 925297 865504 651526 795197
14717 795197 739123 811762 1163873 640011 918006 1006864 1296382 1061274 1452743 1215563
14707 1215563 1320023 1251711 1119649 918667 1187249 670401 504046 834975 943959 849909
14697 849909 825375 1067476 949205 988610 1058045 842984 587733 1187062 1116229 985829
14687 985829 1089853 1283552 1633536 1575933 1542201 1603590 1614307 1115868 1130527 721381
$$ packed form
14758F93168K61394m9225l7208r8042J1435j04192K0912q0807J48941k79427J51992
14747F38941A14684N99693j91437M14932D03796K20826l09500J74660K5904K29067
14737G44753j86984j25526J85159J57153J5637j88219K06606B88929M27902j26974
14727E89857L07688l74293K0115j9147J40411j11936L72602n9793k13978J43671
14717G95197n6074P2639L52111n23862K77995Q8858K89518k35108L91469k37180
14707A215563J04460o8312j32062k00982K68582n16848j66355L30929J08984r4050
14697H49909k4534K42101j18271L9405O9435k15061k55251N99329p0833j30400
14687I85829J04024J93699L49984n7603l3732O1389J0717m98439J4659m09146
$$ plain form
14677 721381 889121 991822 1034467 1043370 1017191 815032 889753 692053 951359 1072518
14667 1072518 1056850 601613 927461 817127 941486 977331 865309 675788 1128298 1047793
14657 1047793 897346 1072715 1182665 942231 903672 847032 1108813 1063206 1154598 1263671
14647 1263671 1044180 1047048 849563 881071 1027266 796080 1054435 1123625 1143800 1303927
14637 1303927 1408161 1037834 1636911 1298750 1257011 1033816 1578177 1542231 1403418 1349928
14627 1349928 1120816 1236843 1327288 1278473 1262268 1022067 1311510 1164678 1014560 1435217
14617 1435217 1183365 1357943 1165061 1181875 1344992 1142142 1238121 1331651 1228429 1090983
14607 1090983 1311132 1539686 1035458 1282835 1892740 1559562 1544656 1320664 1226578 1509368
$$ packed form
14677G21381J67740J02701M2645Q903k6179k02159P4721j97700K59306J21159
14667A072518j5668m55237L25848j10334J24359L5845j12022j89521M52510q0505
14657A047793j50447J75369J09950k40434l8559n6640K61781m5607R1392J09073
14647A263671k19491K868j97485L1508J46195k31186K58355O9190K0175J60127
14637A303927J04234l70327N99077l38161m1739k23195N44361l5946j38813n3490
14627A349928k29112J16027R0445m8815j6205k40201K89443j46832j50118M20657
14617A435217k51852J74578j92882J6814J63117k02850R5979R3530j03222j37446
14607A090983K20149K28554n04228K47377O09905l33178j4906k23992r4086K82790
$$ plain form
14597 1509368 1206075 1420625 1164920 1263354 1424247 1692270 1294623 1599394 1511824 1729179
14587 1729179 1484445 1674687 1508553 1750695 1746683 1414701 1906006 1278638 1583630 1832471
14577 1832471 1410945 1770351 1668162 1581848 1702207 1768429 1576506 1657099 1624342 1989299
14567 1989299 1775438 1794076 2058867 1786844 1803578 2181371 1603729 1916885 2177841 1997098
14557 1997098 2308689 1806233 2389387 2311549 2465331 2395448 2328879 2533234 2318764 2865419
14547 2865419 2956447 2695132 2852404 3049105 3122682 2962683 3688363 3944525 4245093 4705449
14537 4705449 5245112 6149986 7300283 9099737 12917457 19680499 29852093 31277871
14529 31277871 17765214 10396819 7014565 5226295 4496263 4299480 4988448 3486866
$$ packed form
14597A509368l03293K14550k55705R8434J60893K68023l97647L04771q7570K17355
14587A729179k44734J90242j66134K42142m012l31982M91305o27368L04992K48841
14577A832471m21526L59406j02189q6314J20359O6222j91923Q0593l2757L64957
14567A989299k13861J8638K64791k72023J6734L77793n77642L13156K60956j80743
14557A997098L11591n02456N83154p7838J53782o9883o6569K04355k14470N46655
14547B865419R1028k61315J57272J96701P3577j59999P25680K56162L00568M60356
14537D705449N39663R04874J150297J799454L817720O763042J0171594J425778
14529C1277871j3512657p368395l382254j788270p30032j96783O88968j501582
$$ plain form
14521 3486866 2624223 2797665 2476960 2151196 2048512 2138150 2469602 1870631 2259227 2439508
14511 2439508 2357392 2154060 2480156 2499272 2304502 2564898 2166723 2478587 2127054 2404725
14501 2404725 2393190 2554112 2461149 2763443 2706058 2697160 2414833 2619061 2763698 2811656
14491 2811656 2879131 3223729 3131199 2723807 3013277 2688467 3094899 2999322 2867036 3377600
14481 3377600 3369178 3251380 3323951 3554992 3512626 3401689 3374179 3418694 3326621 3625027 3574486
14470 3574486 3720408 3784748 3882943 3770884 3556007 3785741 3846782 3865117 4024661 3942444
14460 3942444 4283804 4187867 4318424 4059629 4489434 4038853 4484502 4218492 4160867 4442250
14450 4442250 4424151 4778574 4687295 4924273 4873064 4927483 4742852 5013073 5026596 5219410
$$ packed form
14521C486866q62643J73442l20705l25764j02684Q9638L31452n98971L88596J80281
14511B439508q2116k03332L26096J9116j94770K60396l98175L11864l51533K77671
14501B404725j1535J60922r2963L02294n7385q898k82327K04228J44637M7958
14491B811656O7475L44598r2530m07392K89470l24810M06432r5577j32286N10564
14481C377600q422j17798P2571K31041m2366j10937k7510M4515r2073K98406n0541
14470C574486J45922O4340R8195j12059k14877K29734O1041J8335J59544q2217
14460C942444L41360r5937J30557k58795M29805m50581M45649k66010n7625K81383
14450D442250j8099L54423r1279K36978n1209N4419j84631K70221J3523J92814
$$ plain form
14440 5219410 5040285 4985228 5113644 5027523 5156146 5507619 5254292 5522978 5401968 5507459
14430 5507459 5720777 5776132 5736820 5821268 5822422 6183625 6197583 5983558 6283073 5942385
14420 5942385 6371379 6360292 6275449 6397309 6713591 6773547 6871504 6928462 6820189 7268737
14410 7268737 7421427 7787687 7542464 7667813 7727765 7852720 8116155 8391058 8585364 8517137
14400 8517137 8849426 8432798 8965882 8737148 8721510 9280105 9159737 9476813 9204778 9552089
14390 9552089 9608622 9729598 10407328 10087788 10813029 10385559 10755384 10945009 10867332 11567138
14380 11567138 11412180 11448926 11639035 11511397 12268112 12252865 12657913 12819941 12981754 13061146
14370 13061146 13812631 13623499 14054045 14393620 14507679 14714760 15578467 15560758 15621159 15852393
$$ packed form
14440E219410j79125n5057J28416q6121J28623L51473k53327K68686j21010J05491
14430E507459K13318N5355l9312Q4448J154L61203J3958k14025K99515l40688
14420E942385M28994j1087q4843J21860L16282N9956R7957N6958j08273M48548
14410G268737J52690L66260k45223J25349N9952J24955K63435K74903J94306o8227
14400H517137L32289m16628N33084k28734j5638N58595j20368L17076k72035L47311
14390I552089N6533J20976O77730l19540P25241m27470L69825J89625p7677O99806
14380A1567138j54958L6746J90109j27638P56715j5247M05048J62028J61813P9392
14370A3061146P51485j89132M30546L39575J14059K07081Q63707j7709O0401K31234
$$ plain form
14360 15852393 16217225 16549545 16991996 17190441 17483327 17788847 18555382 18793280 19221877
14351 19221877 19728827 19922562 20352963 20813695 21299357 21720821 22464592 22654289 23340844
14342 23340844 23582690 24267158 24820330 25249077 25736252 26466745 27028391 27432904 28449894
14333 28449894 29203487 29948470 30519177 31338735 32020516 33181654 34211387 35181721 35542974
14324 35542974 37192159 37977781 39011482 40089693 41265303 42561736 43804932 44920885
14316 44920885 46325237 48133107 49485163 51109139 52792209 54886513 56042109 58515501
14308 58515501 60187619 62371852 64302341 67009651 69415033 71902295 74351877 77686213
14300 77686213 80348330 83056252 86812335 90042724 93441615 97521890 101735351 105854893
$$ packed form
14360A5852393L64832L32320M42451J98445K92886L05520P66535K37898M28597
14351A9221877N06950J93735M30401M60732M85662M21464P43771J89697O86555
14342B3340844K41846O84468N53172M28747M87175P30493N61646M04513J016990
14333B8449894P53593P44983N70707Q19558O81781J161138J029733R70334L61253
14324C5542974J649185P85622J033701J078211J175610J296433J243196J115953
14316D4920885J404352J807870J352056J623976J683070K094304J155596K473392
14308E8515501J672118K184233J930489K707310K405382K487262K449582L334336
14300G7686213K662117K707922L756083L230389L398891M080275M213461M119542
$$ plain form
14292 105854893 110577359 115534966 120655492 126420330 131802652 138038876 144237944 151402645
14284 151402645 158700725 165916592 174306003 182777229 191755987 201032216 211334385 221627336
14276 221627336 232758865 244529322 256642247 269324480 282479272 295595134 308800451
14269 308800451 322102332 335463099 348114679 360314562 372156174 383349676 394199516
14262 394199516 404106246 413176960 421766684 429712116 436150125 440248237 442292210 444487264
14254 444487264 444988329 439561287 434195462 429052767 420497038 412177281 401951935 390023936
14246 390023936 377040661 364087444 350960851 337696844 323728366 310028597 296933589
14239 296933589 283715484 271185448 258600868 246676698 235098225 224178999 212544024
$$ packed form
14292A05854893M722466M957607N120526N764838N382322O236224O199068P164701
14284A51402645P298080P215867Q389411Q471226Q978758R276229J0302169J0292951
14276B21627336J1131529J1770457J2112925J2682233J3154792J3115862J3205317
14269C08800451J3301881J3360767J2651580J2199883J1841612J1193502J0849840
14262C94199516R906730R070714Q589724P945432O438009M098112K043973K195054
14254D44487264N01065n427042n365825n142695q555729q319757j0225346j1927999
14246C90023936j2983275j2953217j3126593j3264007j3968478j3699769j3095008
14239B96933589j3218105j2530036j2584580j1924170j1578473j0919226j1634975
$$ plain form
14232 212544024 201859161 191298595 181741927 172979488 164591998 156660339 149150458 142225507
14224 142225507 135709010 129632129 124030992 118547968 113342198 108646730 104059636 99789927
14216 99789927 96310615 91955758 88402462 84673573 81287118 78281385 75472397 72830323
14208 72830323 70219748 67923197 65379733 63156060 61066404 58826468 56981725 54939720
14200 54939720 53242338 51940794 50537211 49070749 47124579 45815674 44686086 43505735
14192 43505735 42359879 41075189 40144145 38828866 37807736 36610889 35934215 34919448
14184 34919448 33788603 32945359 31816905 31269273 30292244 29861183 29065086 28216142 27621880
14175 27621880 27151776 26615307 25783395 24919516 24491409 24183332 23713481 22952243 22267610
$$ packed form
14232B12544024j0684863j0560566r556668q762439q387490p931659p509881o924951
14224A42225507o516497o076881n601137n483024n205770m695468m587094m269709
14216I9789927l479312m354857l553296l728889l386455l005733k808988k642074
14208G2830323k610575k296551k543464k223673k089656k239936j844743k042005
14200E4939720j697382j301544j403583j466462j946170j308905j129588j180351
14192D3505735j145856j284690r31044j315279j021130j196847o76674j014767
14184C4919448j130845q43244j128454n47632r77029m31061p96097q48944n94262
14175B7621880m70104n36469q31912q63879m28107l08077m69851p61238o84633
$$ plain form
14166 22267610 21788593 21582146 21019047 20800095 19953257 19594518 19361876 18857265 18569975
14157 18569975 18439791 17956862 17485246 16927818 17113076 16505832 16380012 16094579 16012812
14148 16012812 15509493 15595496 14810660 14641370 14621212 14208088 13791026 13679191 13355960 13532313
14138 13532313 13197696 12904554 12600456 12502071 12193467 12186750 11706460 11454065 11453483 11232557
14128 11232557 11437908 10926060 10605161 10522527 10267057 10098882 10346022 9905807 9776014
14119 9776014 9658750 9846583 9367829 8924402 8895596 8949288 8620851 8671382 8996089 8726265
14109 8726265 8425035 8422777 8506504 8399093 7755134 7617647 7630206 7739790 7425545 7265871
14099 7265871 7486981 6918688 6990590 7314872 7128773 7077471 7067243 6515048 6384558 6550934
$$ packed form
14166B2267610m79017k06447n63099k18952q46838l58739k32642n04611k87290
14157A8569975j30184m82929m71616n57428J85258o07244j25820k85433q1767
14148A6012812n03319Q6003p84836j69290k0158m13124m17062j11835l23231J76353
14138A3532313l34617k93142l04098r8385l08604o717m80290k52395n82k20926
14128A1232557K05351n11848l20899q2634k55470j68175K47140m40215j29793
14119I776014j17264J87833m78754m43427k8806N3692l28437N0531L24707k69824
14109H726265l01230k258Q3727j07411o43959j37487J2559J09584l14245j59674
14099G265871K21110n68293P1902L24282j86099n1302j0228n52195j30490J66376
$$ plain form
14089 6550934 6422187 6658210 6254565 6476859 6303820 5913435 6154665 5963660 5954990 5641897
14079 5641897 5460767 5887351 5613791 5717029 5781384 5627114 5236513 5320374 5356399 5184577
14069 5184577 5156137 5114270 5145226 4712295 4898887 5089551 4629645 4721797 4758138 4612491
14059 4612491 4714829 4616232 4817954 4236139 4432095 4391286 4508018 4208464 4535207 4463106
14049 4463106 4504541 3996355 4119009 4015274 4358916 4092627 4164897 4098622 4046212 3745085
14039 3745085 4057855 3888717 3727316 3816042 3502198 3561000 3581196 3269274 3891806 3559813
14029 3559813 3257519 3469307 3136286 3317145 3549220 3405087 3168449 3530389 3464840 3433216
14019 3433216 3228878 3523895 3269704 3268874 3270101 3023249 2735206 3003664 3464671 3013385
$$ packed form
14089F550934j28747K36023m03645K22294j73039l90385K41230j91005q670l13093
14079E641897j81130M26584k73560J03238O4355j54270l90601Q3861L6025j71822
14069E184577k8440m1867L0956m32931J86592J90664m59906R2152L6341j45647
14059D612491J02338r8597K01722n81815J95956m0809J16732k99554L26743p2101
14049D463106M1435n08186J22654j03735L43642k66289P2270o6275n2410l01127
14039C745085L12770j69138j61401Q8726l13844N8802K0196l11922O22532l31993
14029C559813l02294K11788l33021J80859K32075j44133k36638L61940o5549l1624
14019C433216k04338K95017k54191q30J227k46852k88043K68458M61007m51286
$$ plain form
14009 3013385 2792453 2906091 2583953 3046166 2695686 2941271 2752433 2601810 2856397
14000 2856397 2418100 2326950 2302855 2438483 2884720 2342545 2306514 2419708 2666994 2349132
13990 2349132 2326930 2558810 2456374 2479219 2384711 2359169 2483085 2514679 2418822 2436467 2186982
13979 2186982 2952510 3277684 3507667 3927012 4531650 5943543 9245212 14995513 25176233
13970 25176233 33260199 22221519 14669999 9939735 7530488 5895392 5002121 3998798
13962 3998798 3923166 3580804 3148656 3392212 2894593 2860616 2673488 2397422 2694936 2474441
13952 2474441 2286953 2387854 2472608 2201982 2413944 2576798 2084407 2180008 1970569 2165884
13942 2165884 1942978 2011478 2020816 1821073 1797139 1630445 2100235 1895718 1657402 1869100
$$ packed form
14009C013385k20932J13638l22138M62213l50480K45585j88838j50623K54587
14000B856397m38297r1150k4095J35628M46237n42175l6031J13194K47286l17862
13990B349132k2202K31880j02436K2845r4508k5542J23916L1594r5857J7645k49485
13979B186982P65528L25174K29983M19345O04638J411893L301669N750301J0180720
13970B5176233Q083966j1038680p551520m730264k409247j635096q93271j003323
13962C998798p5632l42362m32148K43556m97619l3977j87128k76066K97514k20495
13952B474441j87488J00901Q4754k70626K11962J62854m92391R5601k09439J95315
13942B165884k22906O8500R338j99743k3934j66694M69790k04517k38316K11698
$$ plain form
13932 1869100 1918386 1697533 1782514 1952832 2290822 1932127 1826326 1881327 2016866 2023731
13922 2023731 1827990 1961683 1898875 1915642 1635023 1757967 1644965 1884109 1620490 1591038
13912 1591038 1826793 1646895 1739818 1938831 1888409 1719863 1620848 1407111 1476203 1361204
13902 1361204 1603662 1443095 1472095 1580846 1764481 1476280 1270669 1368776 1314482 1455557
13892 1455557 1569282 1481614 1616440 1410565 1235819 1335733 1249625 1621348 953922 1263593
13882 1263593 1422674 1279521 1266429 1410655 1351526 1343323 1112292 981538 1588960 1201326
13872 1201326 1423014 1439847 1499579 1330091 1245600 1188202 1385342 1209656 1173725 1138412
13862 1138412 1019886 1629348 1345588 1230380 1046053 1218764 1251753 761504 809191 1173828
$$ packed form
13932A869100M9286k20853Q4981J70318L37990l58695j05801N5001J35539O865
13922B023731j95741J33693o2808J6767k80619J22944j13002K39144k63619k9452
13912A591038K35755j79898R2923J99013n0422j68546r9015k13737O9092j14999
13902A361204K42458j60567K9000J08751J83635k88201k05611R8107n4294J41075
13892A455557J13725q7668J34826k05875j74746R9914q6108L71723o67426L09671
13882A263593J59081j43153j3092J44226n9129q203k31031j30754O07422l87634
13872A201326K21688J6833N9732j69488q4491n7398J97140j75686l5931l5313
13862A138412j18526O09462k83760j15208j84327J72711L2989m90249M7687L64637
$$ plain form
13852 1173828 1125740 966967 1444408 1189223 1045517 1117157 1060397 1180655 1308602 1167384
13842 1167384 1359151 1217369 1055898 1314804 1058954 881844 784763 976980 1127478 1306722
13832 1306722 1096502 1193443 1439826 897099 1043421 865324 1102769 1443102 868287 1016420
13822 1016420 735445 933388 825113 717278 707576 982418 999604 1180138 1017922 816506
13812 816506 817410 1030080 730891 685124 1032247 905161 812756 812772 828271 740033 881093
13801 881093 472666 689678 1154340 1029831 639315 855182 796694 397157 575927 725495
13791 725495 544283 1057433 966803 770261 411404 980065 671433 639641 993739 779773
13781 779773 908358 952228 929757 818186 812859 776574 652270 839929 713252 687992 692078
$$ packed form
13852A173828m8088j58773M77441k55185j43706P1640n6760J20258J27947j41218
13842A167384J91767j41782j61471K58906k55850j77110r7081J92217J50498J79244
13832A306722k10220R6941K46383n42727J46322j78097K37445L40333n74815J48133
13822A016420k80975J97943j08275j07835r702K74842J7186J80534j62216k01416
13812H16506R04K12670k99189m5767L47123j27086r2405J6J5499q8238J41060
13801H81093m08427K17012M64662j24509l90516K15867n8488C97157J78770J49568
13791G25495j81212N13150r0630j96542l58857N68661l08632l1792L54098k13966
13781G79773J28585M3870k2471j11571n327l6285j24304J87659j26677k5260M086
$$ plain form
13770 692078 638668 711856 733667 816055 772181 624270 717057 415301 899408 855302 642788
13759 642788 832779 995238 630220 734928 634790 829967 852996 811036 810773 285251
13748 179762 786573 733001 756039 856562 617648 709155 797666 726693 584067 569095 796282
13737 796282 684616 642285 801671 748632 543151 580740 848601 718607 531957 515438
13727 515438 525756 473258 818410 732449 849870 815321 984284 684479 614163 538323 564308
13716 564308 598331 541906 469277 486766 288151 775329 298296 465314 600796 743635
13706 743635 440854 649642 464808 317395 525741 474918 386493 601025 623916 893551
13696 893551 398036 415612 589963 861951 759222 771471 363068 587284 520876 637331
$$ packed form
13770F92078n3410P3188K1811Q2388m3874j47911R2787l01756M84107m4106k12514
13759F42788J89991J62459l65018J04708j00138J95177K3029m1960k63B85251
13748A79762O06811n3572K3038J00523k38914R1507Q8511p0973j42626j4972K27187
13737G96282j11666m2331J59386n3039k05481L7589K67861j29994j86650j6519
13727E15438J0318n2498L45152q5961J17421l4549J68963k99805p0316p5840K5985
13716E64308L4023n6425p2629J7489j98615M87178B98296J67018J35482J42839
13706G43635l02781K08788j84834j47413K08346n0823q8425K14532K2891K69635
13696H93551C98036J7576J74351K71988j02729J2249C63068K24216o6408J16455
$$ plain form
13686 637331 674348 636468 546290 833302 630814 554567 601665 458244 495874 682388 577138
13675 577138 417818 224894 495772 745369 402789 434058 162612 509946 420084 652803
13665 652803 447162 590056 467008 79875 340614 664059 601278 125178 613248 119741
13654 593387 638859 393435 547118 620233 334578 288782 249165 280346 473446 410074 293286
13643 293286 468290 153460 590681 672018 373275 368322 362162 532287 215238 479133
13633 479133 598510 484414 186357 713658 588207 369744 486627 279141 652882 467771
13623 467771 511366 386246 368514 450125 231351 455296 241352 611914 435504 215279
13612 396929 358929 466821 275157 233255 370828 81655 498947 299364 444242 393649
$$ packed form
13686F37331L7017l7880r0178K87012k02488p6247M7098j43421L7630J86514j05250
13675E77138j59320j92924K70878K49597l42580L1269A62612L47334q9862K32719
13665F52803k05641J42894j23048G9875K60739L23445o2781A25178M88070A19741
13654E93387M5472k45424J53683P3115k85655m5796l9617L1181J93100o3372j16788
13643B93286J75004A53460M37221Q1337k98743m953o160J70125B15238K63895
13633D79133J19377j14096A86357N27301j25451k18463J16883k07486L73741j85111
13623D67771M3595j25120j7732Q1611k18774K23945k13944L70562j76410B15279
13612C96929l8000J07892j91664m1902J37573H1655M17292j99583J44878n0593
$$ plain form
13602 393649 393366 101261 544731 111406 378611 655323 231499 25790 387292 550742
13592 550742 304209 113444 184065 296462 476132 481063 516741 559218 431197 333307 382043
13581 382043 451765 177607 -2256 528577 238742 345038 333854 351289 276799 284108 496610
13570 496610 557886 440424 259793 233457 326677 186823 230550 148878 268183 247634 226853
13559 226853 300008 177170 633594 494415 143013 384985 503536 522410 506656 389005
13549 389005 261804 196413 336858 282266 506776 322891 182907 399601 278093 231137
13539 231137 80231 244152 288916 158705 229829 345355 460580 245943 -219960 353145
13528 274029 340400 205973 529018 293036 769754 281462 248959 393721 102789 490162
$$ packed form
13602C93649k83A01261M43470A11406K67205K76712B31499B5790L61502J63450
13592E50742k46533A13444P0621J12397J79670M931L5678M2477j28021r7890M8736
13581C82043O9722A77607b256E28577B38742J06296j1184J7435p4490P309K12502
13570D96610O1276j17462j80631k6336R3220j39854M3727q1672J19305k0549k0781
13559B26853P3155j22838M56424j39179A43013K41972J18551J8874j5754j17651
13549C89005j27201o5391J40445n4592K24510j83885j39984K16694j21508m6956
13539B31137H0231J63921M4764j30211P1124J15526J15225k14637b19960C53145
13528B74029O6371j34427L23045k35982M76718B81462l2503J44762A02789L87373
$$ plain form
13518 490162 186449 -4779 219887 150319 456029 -15003 326601 435294 397370 444775 379345
13507 379345 689275 344628 429895 310647 549824 -18097 70397 171882 443353 562946
13497 562946 542965 197241 -50971 337417 716955 -103087 387964 425804 140487 -36856
13486 205842 337459 242343 -111548 228221 -104156 82182 204096 269501 116160 199595
13476 199595 361601 261885 305759 478973 148673 604649 209106 719841 304655 56218
13465 62038 212615 295786 319551 234249 103003 93186 347654 270257 114606 82147 145113
13454 145113 547595 249287 236087 289338 127074 88653 438905 288695 160678 -3236
13443 246021 235049 342338 -24043 219925 453236 314260 191314 -32204 409654 191733
$$ packed form
13518D90162A86449d779B19887o9568L05710a5003C26601J08693l7924M7405o5430
13507C79345L09930C44628Q5267j19248K39177a8097G0397J01485K71471J19593
13497E62946j9981A97241e0971C37417L79538a03087C87964L7840A40487c6856
13486B05842J31617r5116a11548B28221a04156H2182J21914O5405A16160Q3435
13476A99595J62006r9716M3874J73214A48673M55976B09106N10735C04655E6218
13465F2038J50577Q3171K3765q5302A03003r817K54468p7397A14606l2459O2966
13454A45113M02482B49287j3200N3251A27074l8421L50252j50210j28017c236
13443B46021j0972J07289b4043B19925K33311j38976j22946c2204D09654A91733
$$ plain form
13432 388546 308718 363141 125119 235891 232071 579567 286815 300879 346697 170437 402230
13421 402230 164308 65523 216059 16276 306070 180655 -137161 146966 314023 397601
13411 397601 144765 192396 329306 404483 193937 184865 180719 378662 157111 345975 79702
13399 150562 -184712 319878 -21622 356776 262727 59660 97076 11682 -77456 -40799 337881
13387 58671 -15542 230947 154569 36377 155491 -215589 252411 47402 172165 350953
13377 350953 -3680 199177 144766 148705 30842 -13175 -175486 68360 51080 139133 57039
13365 291584 208424 107192 343865 -205044 281733 367920 140846 -17687 149853 513444
13355 513444 134468 127673 255220 171806 161420 401806 133840 91747 164125 118858 -149851
$$ packed form
13432C88546p9828N4423A25119J10772l820L47496B86815J4064M5818A70437K31793
13421D02230A64308F5523J50536A6276K89794j25415a37161A46966J67057Q3578
13411C97601A44765M7631J36910P5177A93937r072m146J97943A57111J88864G9702
13399A50562a84712C19878b1622C56776r4049E9660L7416A1682g7456L6657C37881
13387E8671a5542B30947p6378C6377J19114b15589B52411D7402J24763J78788
13377C50953c680A99177n4411L939C0842a3175j62311F8360j7280Q8053E7039
13365B91584q3160j01232K36673b05044B81733Q6187A40846a7687A49853L63591
13355E13444A34468o795J27547q3414j0386K40386A33840m2093P2378m5267a49851
$$ plain form
13343 424101 302103 181084 312963 227445 128209 203757 125060 185530 302330 130353
13332 276578 99474 517008 293041 -53151 -89109 -108187 126168 398944 47470 182137
13322 182137 -71345 609182 63738 219479 401824 140506 406975 95123 208522 325920
13312 325920 327093 81916 260798 182638 267185 94688 126190 261532 641313 399099 -26088
13300 458496 278146 296937 222002 93931 -9643 -88479 528021 261410 162064 569230 143629
13288 145931 127907 84426 4020 170898 209611 116416 -39110 319549 57949 209763 239320
13277 239320 -248317 231273 194309 -155580 79059 -147203 162608 -144111 28125 2975
13266 140522 -43074 406822 -196005 118626 38879 143424 236973 -16307 402645 496041
$$ packed form
13343D24101j21998j21019J31879q5518r9236P5548p8697O0470J16800A30353
13332B76578I9474M17534k23967e3151l5958j9078A26168K72776D7470J34667
13322A82137g1345F09182F3738J55741J82345A40506K66469I5123J13399J17398
13312C25920J173H1916J78882p8160Q4547I4688L1502J35342L79781k42214b6088
13300D58496j80350J8791p4935I3931i643p8836E28021B61410r9346M07166A43629
13288A45931j8024m3481D020J66878L8713r3195c9110C19549E7949J51814K9557
13277B39320b48317B31273l6964a55580G9059a47203A62608a44111B8125B975
13266A40522d3074D06822a96005A18626C8879J04545R3549a6307D02645R3396
$$ plain form
13256 496041 118226 72287 28696 203664 157240 234464 -48883 180247 -77128 115619 324968
13245 324968 -133609 229558 195731 255817 -221329 139121 160330 -74011 -39055 -10533 62557
13233 10577 74469 110199 11972 285997 -74052 236718 478977 96175 -42237 216423 -83809
13221 297039 113917 269609 13320 159226 261072 154190 -282665 142960 282884 54720
13210 253017 319550 -8158 232806 119626 349549 154371 -131479 281679 -73532 549706
13199 258752 361038 12103 -132889 182819 133855 116754 128257 -76123 -21844 173082 137139
13188 137139 -130146 110542 43716 286917 132287 303649 -18285 193490 105063 -10138
13177 -88201 327995 -54230 135737 253333 244227 71668 -43457 -166923 303376 62921 128174
$$ packed form
13256D96041A18226m5939B8696J74968m6424P7224d8883A80247g7128A15619K09349
13245C24968a33609B29558l3827O0086b21329A39121K1209g4011L4956a0533F2557
13233A0577O3892L5730A1972K74025g4052B36718K42259I6175d2237B16423h3809
13221B97039A13917J55692A3320J45906J01846j06882b82665A42960J39924E4720
13210B53017O6533h158B32806j13180K29923A54371a31479B81679g3532E49706
13199B58752J02286A2103a32889A82819m8964j7101J1503g6123b1844A73082l5943
13188A37139a30146A10542D3716K43201A32287J71362a8285A93490q8427a0138
13177h8201C27995e4230A35737J17596r106G1668d3457j23466C03376F2921O5253
$$ plain form
13166 128174 -147916 225962 131841 221398 19672 -314270 -17068 -115272 146453 -140479
13155 140952 214190 70249 71711 -7110 -43766 -24684 158117 90378 69760 -28305 388763
13143 387837 140684 -95133 -18762 4900 -93707 306318 129203 -99674 -7658 13296 -157123
13131 39335 250716 -29399 324435 -138157 49410 144605 256279 -68956 -65455 -62171 -153858
13120 -153858 228145 -136170 54720 203397 2129 111370 -181608 191027 -204307 250422
13109 -114723 -203099 -248858 -24990 -53901 85696 -48953 -65317 196255 6817 -11112 -4860 10385
13096 52619 147415 404954 -184336 -7345 19778 -190977 86918 128201 183039 67558 -200384
13084 155727 -156742 45460 176983 -330739 -332892 85692 125174 -102891 11725 73158 110748
$$ packed form
13166A28174a47916B25962r4121Q9557A9672c14270a7068r8204A46453a40479
13155A40952P3238G0249J462g110l6656J9082A58117o7739k0618b8305C88763
13143C87837A40684i5133a8762D900i3707C06318A29203i9674g658A3296a57123
13131C9335K11381b9399C24435a38157D9410R5195J11674f8956L501L284r1687
13120a53858B28145a36170E4720J48677B129J09241a81608A91027b04307B50422
13109a14723q8376m5759b4990k8911H5696d8953j6364A96255F817a1112d860A0385
13096E2619R4796K57539a84336g345A9778a90977H6918M1283N4838F7558b00384
13084A55727a56742D5460J31523c30739k153H5692L9482a02891A1725O1433L7590
$$ plain form
13073 110748 -180470 -10216 -65833 178874 96933 436005 136127 -110049 -564022 143866
13062 125752 9488 156291 210423 232501 212224 261888 92276 -168504 118210 54668 294760
13051 294760 10075 -119965 -66111 -10255 229567 104237 235084 365651 -203463 146358
13040 381218 78741 -119377 -23458 -269516 -106357 106567 27597 106226 430295 162030
13029 85477 276628 360630 322224 23205 341052 269495 532 266125 106567 365732 94734
13017 147153 234854 141763 44534 13906 144151 113818 -320639 21724 304117 60779 -11998
13005 199007 497183 230565 244648 34449 50286 225288 40332 72399 77372 257275 -172356
12993 389205 78261 154186 342583 -139802 163489 156303 123186 387840 6175 -155392 -54528
$$ packed form
13073A10748a80470a0216n5617A78874q1941L39072A36127a10049m53973A43866
13062A25752I488J46803N4132K2078k0277M9664I2276a68504A18210E4668K40092
13051B94760A0075a19965N3854a0255B29567A04237J30847J30567b03463A46358
13040C81218G8741a19377b3458k46058a06357A06567B7597P8629L24069A62030
13029H5477J91151Q4002l8406B3205L17847p1557E32K65593A06567K59165I4734
13017A47153Q7701r3091D4534A3906J30245l0333c20639B1724K82393F0779a1998
13005A99007K98176B30565J4083C4449J5837J75002D0332L2067M973J79903a72356
12993C89205G8261P5925J88397a39802A63489p186l3117K64654F175a55392e4528
$$ plain form
12981 -407369 144182 353479 -16419 227389 26207 277213 -37555 -62571 124187 -53863
12970 91264 216103 434994 43694 -136120 8024 404947 149166 -28464 167589 278870
12960 278870 -171125 31085 203227 -169282 -236021 -56802 321899 -117184 -246298 16742
12949 -12284 -108435 -54555 366794 -196249 -167778 243575 173620 -762 -209910 -44758 36776
12937 -159981 -214460 40712 -130063 46679 1236 104919 -54128 -171249 88697 133164 284020
12926 284020 -19517 -43585 -124607 -210111 202372 135955 133936 132397 -203312 16839 161517
12915 161517 -32689 22248 22231 -52581 44510 -45324 93318 -80347 87698 86003 67489 -144915
12902 -172382 -67380 -101264 56532 250875 205345 53861 201784 -281317 -127818 67211 -195798
$$ packed form
12981d07369A44182K09297a6419B27389B6207K51006c7555k5016A24187e3863
12970I1264J24839K18891D3694a36120H024L96923A49166b8464A67589J11281
12960B78870a71125C1085J72142a69282o6739e6802C21899a17184j29114A6742
12949a2284r6151N3880C66794a96249K8471B43575o9955g62k09148d4758C6776
12937a59981n4479D0712a30063D6679A236J03683e4128j17121H8697M4467J50856
12926B84020a9517k4068q1022q5504B02372o6417k019j539b03312A6839J44678
12915A61517c2689B2248j7e2581D4510d5324I3318h0347H7698j695j8514a44915
12902a72382f7380l3884E6532J94343m5530E3861J47923b81317a27818F7211a95798
$$ plain form
12890 -26679 -119109 -50126 16685 -172982 -142574 -51543 111007 73023 318215 -111594 30072
12878 -16214 177527 37170 129274 -96526 -165581 -48560 1673 91609 -314640 -292653 -61546
12866 -225102 -219156 16757 -34951 319997 -198942 -211064 -8141 -13222 118837 -108381 -155437
12855 -155437 320279 214509 -144548 304632 163645 314067 -15599 -262426 -146847 -115182
12845 -115182 201925 -151819 -32601 -52571 -348676 66139 69104 -224874 -121069 -39016 -89400
12834 -89400 -115 -67387 -89205 -39047 240154 438030 -118646 -34503 -36712 -35420 -137209 156411
12821 3807 -103511 50117 54248 -168563 121456 -156773 -6843 -28543 -45361 296523 123880
12809 -47052 125840 -114198 70952 322737 41684 -226532 246341 29107 -106712 57354
$$ packed form
12890b6679r2430e0126A6685a72982L0408e1543A11007l7984K45192a11594C0072
12878a6214A77527C7170R2104i6526o9055d8560A673Q9936c14640K1987f1546
12866b25102N946A6757c4951C19997a98942j2122h141n081A18837a08381m7056
12855a55437C20279j05770a44548C04632j40987J50422a5599k46827J15579L1665
12845a15182B01925a51819c2601j9970k96105F6139K965b24874J03805c9016n0384
12834h9400a15o7272k1818c9047B40154J97876a18646c4503k209J292j01789A56411
12821C807a03511E0117M131a68563A21456a56773f843k1700j6818B96523A23880
12809d7052A25840a14198G0952K51785D1684b26532B46341B9107a06712E7354
$$ plain form
12798 -59107 15383 262454 -3967 -84723 -179174 43168 -81834 -118696 49814 -235908 -3973 -322116
12786 -322116 246818 74237 101430 -23555 257153 -61803 -11542 86108 -47191 -140656 -132705
12775 -132705 -111154 214773 20672 -39326 -151270 -331624 -221541 -7432 -8204 4215 -40324
12763 289759 143269 135535 -207176 -55571 115036 16506 87995 -1866 -30308 64604 121926
12752 121926 207278 -34679 -104485 -195291 -119671 112154 -18679 272105 224979 -43912 -54647
12741 -54647 39281 -49214 14050 -237477 42131 427001 73880 148665 105598 -120461 86511
12729 -17809 48660 234645 6734 58973 -214077 45701 146225 187334 120774 46879 267163
12718 267163 327110 -17086 5174 96811 98090 -27278 -60100 -31014 -253699 80944 15046 -157943
$$ packed form
12798e9107A5383K47071c967q0756r4451D3168h1834l6862D9814b35908c973l18143
12786c22116B46818G4237K7193b3555B57153f1803a1542H6108d7191r3465P951
12775a32705K1551B14773B0672c9326j11944j80354J10083g432p72D215d0324
12763B89759A43269p734b07176e5571A15036A6506P1489a866k8442F4604N7322
12752A21926Q5352c4679o9806r0806P5620A12154a8679B72105m7126d3912j0735
12741e4647C9281d9214A4050b37477D2131L84870G3880P4785m3067a20461H6511
12729a7809D8660J85985F734N2239b14077D5701J00524M1109o6560D6879K20284
12718B67163N9947a7086E174R1637J279b7278l2822K9086k22685H0944A5046a57943
$$ plain form
12705 -34858 50975 36181 254135 120681 -147761 109530 -56301 -52762 237136 -86036 -28874
12693 115759 -54366 303863 172021 -13091 102318 -137063 297105 -28063 21955 -191387
12682 109848 239431 -109489 184573 237812 -59711 -28920 -187282 -42883 -44645 65725 117486
12671 117486 -4532 -50153 -94921 54967 160524 -150939 234895 -73031 301636 152741 26545
12659 -32323 24571 -304406 -129843 116184 82385 74296 -67904 4732 78728 120491 -284393
12647 -23736 -171041 -33503 -140583 54096 -30841 223707 593268 485374 -164751 147234
12636 -135757 299476 263680 128396 -39124 -267182 -100838 95158 156521 -290280 -29829
12625 -117900 4293 429585 -21853 180592 93123 141497 -175125 -52477 48085 84705 -110623
$$ packed form
12705c4858E0975j4794K17954A20681a47761A09530e6301L539B37136h6036b8874
12693A15759e4366C03863j31842a3091A02318a37063B97105b8063B1955a91387
12682A09848J29583a09489A84573N3239e9711b8920j58362d2883j762F5725N1761
12671A17486d532m5621m4768E4967J05557a50939B34895g3031C01636j48895B6545
12659c2323B4571c04406a29843A16184l3799q089f7904D732P3996M1763b84393
12647b3736j47305c3503j07080E4096c0841B23707L69561j07894a64751A47234
12636a35757B99476l5796A28396c9124k28058a00838I5158O1363b90280b9829
12625a17900D293M25292b1853A80592q7469M8374a75125e2477D8085L6620a10623
$$ plain form
12613 203017 294574 -70079 404319 99470 144665 289002 158209 -50555 -72747 174948 29287
12601 229754 -282062 258420 -103277 74177 167055 -19005 215309 242534 111522 130869
12591 130869 88108 -8115 -276624 -284515 350275 47190 34736 132922 -9671 -17365 -56240 60173
12578 418785 36790 232871 44431 62481 136186 40114 -120743 198666 5002 -146558 10301
12566 233517 75283 -174938 44024 4204 -56635 143167 106354 -38260 -249260 148685 -128274
12554 350 325195 -50505 -168299 -165772 -188863 -124491 -98998 -69979 -27841 75847 131527 286382
12542 286382 -115400 -372219 271460 -155226 -247855 -78507 469414 63328 -79368 113322
12531 43742 -312125 -85407 -40815 241460 15710 227622 -354575 155115 167995 166516 -60057
$$ packed form
12613B03017R1557g0079D04319I9470M5195J44337j30793e0555k2192A74948B9287
12601B29754b82062B58420a03277G4177R2878a9005B15309K7225A11522J9347
12591A30869m2761h115k68509p891C50275D7190j2454R8186i671p694l8875F0173
12578D18785C6790J96081D4431J8050P3705D0114a20743A98666E002a46558A0301
12566B33517G5283a74938D4024D204e6635A43167l6813c8260k11000A48685a28274
12554C50L24845e0505j17794K527k3091O4372K5493K9019b7841G5847N5680J54855
12542B86382a15400k56819B71460a55226r2629g8507D69414F3328g9368A13322
12531D3742c12125h5407d0815B41460A5710K11912c54575A55115J2880j479f0057
$$ plain form
12519 -547 -123192 132502 139755 -306331 56606 127191 221541 5013 253078 85163 -55878 -95369
12507 -95369 282920 -13779 56257 -88360 63092 -122175 51750 -121161 -86254 374822 82919
12495 -89229 15281 -336623 -426938 -83626 -268271 103349 136819 172160 16824 -238750 104992
12483 7230 14762 270178 248655 109792 -15915 -170876 -23542 120518 80447 52949 -20188
12471 -307499 212846 -73404 -1904 103591 -358823 -373971 164687 -87767 76842 -135805 -152658
12460 -152658 19841 15345 15279 -82961 -102642 130987 88280 307653 164905 -193854 145994
12448 -3145 129562 -264415 -17086 -81707 -63801 84574 -154376 -206246 -9362 -27114 106662
12436 -249690 -35294 -97300 -93712 -62618 -121241 15078 -212926 -220124 -96105 -162838 -356840
$$ packed form
12519e47j22645A32502P253c06331E6606P0585R4350E013K48065H5163e5878l9491
12507i5369B82920a3779E6257h8360F3092a22175E1750a21161L4907C74822H2919
12495h9229A5281c36623r0315h3626j84645A03349L3470L5341A6824b38750A04992
12483G230P532K55416k1523A09792a5915j54961b3542A20518m0071k7498b0188
12471c07499B12846g3404a904A03591c58823j5148A64687h7767G6842a35805j6853
12460a52658A9841m496o6h2961j9681A30987m2707K19373j42748a93854A45994
12448c145A29562b64415a7086o4621J7906H4574a54376n1870i362j7752A06662
12436b49690c5294o2006L588L1094n8623A5078b12926p198i6105o6733j94002
$$ plain form
12425 -356840 35677 -53478 -4207 117881 336040 -22045 -115330 29573 33564 -55560 19833
12413 99799 43691 348690 213975 -81709 -361977 188195 113650 130655 -105047 -121010 -19791
12401 387098 215065 81697 297038 369033 -29871 19762 -210889 -162007 -31875 -255529 -295555
12390 -295555 60880 50518 -97645 265260 -33741 -145043 -51567 58237 -428034 5358 -441972
12378 -459916 -190409 108090 3332 -29343 -27604 48134 85917 -19016 329568 -67027 130216
12366 141628 91713 -121517 288984 20083 143499 30252 -71884 86032 -177381 99264 -9414
12354 -6777 -62381 19906 148512 230392 90657 -96719 -496171 50187 -189493 56512 72628
12343 72628 336903 -27978 216740 -124034 319825 -117727 24143 155630 263720 -128414
$$ packed form
12425c56840C5677e3478d207A17881K18159b2045r3285B9573L991e5560A9833
12413I9799D3691L04999j34715h1709k80268A88195p4545J7005a05047j5963a9791
12401C87098j72033H1697K15341P1995b9871A9762b10889M8882c1875k23654m0026
12390b95555F0880j0362i7645B65260c3741j11302e1567E8237d28034E358d41972
12378d59916a90409A08090C332b9343J739D8134L7783a9016C29568f7027A30216
12366A41628m9915a21517B88984B0083J23416C0252g1884H6032a77381I9264i414
12354f777n5604A9906J28606Q1880I0657i6719l99452E0187a89493E6512J6116
12343G2628K64275b7978B16740a24034C19825a17727B4143J31487J08090a28414
$$ plain form
12332 28528 -110638 351982 144874 -105834 258310 -2547 200511 79934 267152 -59665
12321 78523 324970 -36392 -94811 -2212 -113069 37291 77529 -51052 72445 -47851 29351
12309 -53982 299998 419438 -154484 207683 -70347 -77374 307716 205844 223828 -177906
12298 159315 129748 362355 -121781 375026 350644 -85123 60429 -338886 77137 -66521 -247215
12287 -247215 -327656 357451 261962 -115465 -20521 -189837 -372723 25115 16137 -189424 263513
12275 265948 376135 267218 -164774 16008 286390 -89105 22548 -242710 152979 141619
12265 141619 381807 310332 70105 387461 191524 84165 49715 166863 -24857 84712 215849
12254 215849 69096 38036 240468 120671 -40780 168409 49162 103772 107394 169723 172917
$$ packed form
12332B8528a10638C51982A44874a05834B58310b547B00511G9934J87218e9665
12321G8523K46447c6392n8419b212j10857C7291M0238e1052G2445d7851B9351
12309e3982B99998J19440a54484B07683g0347p027C07716j01872J7984a77906
12298A59315k9567K32607a21781C75026k4382h5123F0429c38886G7137f6521j80694
12287b47215q0441C57451r5489a15465b0521j69316j82886B5115q978a89424B63513
12275B65948J10187j08917a64774A6008K70382h9105B2548b42710A52979j1360
12265A41619K40188p1475G0105L17356A91524H4165l4450J17148b4857H4712J31137
12254B15849F9096l1060K02432j19797d0780A68409D9162N4610L622O2329L194
$$ plain form
12243 172917 -132540 90330 24193 114888 83514 -103790 311584 251581 184707 115623 4473
12231 -26433 347167 171255 78808 44887 157169 230585 3664 -22744 300955 7620 4468
12220 4468 324301 263378 -10527 -152049 -131913 -180681 65088 254572 141636 140308 357910
12209 357910 358994 14490 195465 -77224 -64923 280650 -266592 -70272 142766 183595 -63112
12197 -15318 57467 392091 -50112 111827 67747 207003 60391 233575 3207 75555 196882
12186 196882 -69212 329363 -41573 -178151 412957 113161 209564 189605 97569 -101759
12175 201090 289042 336390 135156 -375696 56615 25187 -160335 98159 -10055 10620 229827
12164 229827 -244907 235848 493763 17151 69653 131375 72571 295270 318096 -94134 193379
$$ packed form
12243A72917a32540I0330B4193R0695l1374a03790C11584o0003o6874o9084D473
12231b6433C47167A71255G8808l3921J12282P3416C664b2744C00955G620l152
12220D468L19833o0923a0527j41522K0136m8768F5088J89484j12936j328K17602
12209C57910J084A4490J80975g7224J2301B80650b66592g0272A42766M0829f3112
12197a5318E7467L34624e0112A11827m4080J39256F0391J73184C207P2348J21327
12186A96882f9212C29363d1573j36578D12957A13161R6403j9959r2036a01759
12175B01090Q7952M7348A35156c75696E6615B5187a60335I8159a0055A0620K19207
12164B29827b44907B35848K57915A7151N2502O1722n8804K22699K2826i4134A93379
$$ plain form
12152 39127 52360 244030 67968 108981 127696 242654 222063 -24985 77930 69031 210333
12141 210333 -8790 -86867 245133 252887 130679 -64712 441513 -98448 540546 102474 364741
12130 364741 -207729 219868 19503 113808 -380162 110205 70766 168485 43886 -5230 126177
12118 102498 -88970 -89778 -118924 24639 195040 -33915 219660 -148128 36219 -96322 124697
12106 424805 180430 -152589 359529 137853 332133 77152 141920 -58412 -105429 -103376 304629
12094 193800 209634 168657 49708 9117 210053 347060 278217 84798 119021 -73520 -240922
12083 -240922 -19283 -90246 85577 56571 48056 65723 186845 133541 10393 364656 164342
12071 -191141 -183387 25706 238399 -68440 343136 43733 371594 -94253 385877 77845 381157
$$ packed form
12152C9127J3233J91670F7968M1013J8715J14958k0591b4985G7930q899J41302
12141B10333h790p8077B45133P754j22208f4712D41513i8448E40546A02474K62267
12130C64741b07729B19868A9503R4305c80162A10205l9439R7719D3886e230A26177
12118A02498h8970q08k9146B4639J70401c3915B19660a48128C6219i6322A24697
12106D24805A80430a52589C59529A37853J94280G7152O4768e8412m7017K053C04629
12094A93800J5834m0977D9708I117K00936J37007o8843H4798L4223g3520j67402
12083b40922a9283p0963H5577k9006q515J7667J21122n3304A0393L54263A64342
12071a91141P754B5706K12693f8440C43136D3733L27861i4253C85877G7845L03312
$$ plain form
12060 381157 60583 -292004 20212 -128801 146566 50872 -67970 -153625 198686 -37981 104488
12048 195072 -119498 13179 -19674 -86184 287813 73986 158390 45084 149340 -16240 -43657
12037 -43657 -91966 -93354 -96433 236135 129647 -68361 -211538 -54903 -9306 30699 -65593 111687
12024 -169579 90286 195810 -17453 190259 -194942 -22932 217576 173069 -205263 -27494
12013 -59052 -189776 1487 -273570 -273110 54143 32811 59291 29203 71719 -61831 100677 -111491
12000 -224964 -64508 -32621 55005 441058 28075 129919 48965 247696 269176 14740 215222
11989 215222 77802 -131423 289490 150738 -148049 -8087 41751 -267146 334038 -15125
11978 175536 45204 193400 -30459 60803 -566039 -216884 88417 42106 -234599 135761
$$ packed form
12060C81157F0583b92004B0212a28801A46566E0872f7970q5655A98686c7981A04488
12048A95072a19498A3179a9674o6510B87813G3986Q4404D5084J04256a6240k7417
12037d3657m8309j388l079B36135j06488f8361j43177e4903i306C0699f5593A11687
12024a69579I0286J05524a7453A90259a94942b2932B17576m4507b05263b7494
12013e9052j30724A487b73570M60E4143k1332K6480B9203M2516f1831A00677a11491
12000b24964f4508L1887E5005L86053B8075J01844D8965J98731K1480A4740K00482
11989B15222G7802a31423B89490j38752a48049h087D1751b67146C34038a5125
11978A75536D5204J48196c0459F0803e66039b16884H8417D2106b34599A35761
$$ plain form
11967 -285352 88030 24038 -256781 53458 -55875 -302864 9480 143230 153881 20756 -91411
11955 257346 -56981 24838 -29449 -203506 -34819 -84377 -186040 52656 -59191 -183322 -40787
11943 -153763 -426944 74700 -74366 -153382 22394 70313 12883 357444 57093 94498 383931
11932 383931 -63745 125116 -115448 -182013 114784 -405268 216279 413455 22798 71443
11922 71443 63878 -318584 241047 -6600 229446 -88876 -38293 -41759 61100 -104287 -294861
11911 -294861 -131577 -388522 -36196 166365 -132244 -28039 17971 -159604 -36233 -126716
11901 -126716 -27753 -46035 -115099 47910 -31005 63310 316410 -79236 -228114 154785 22448
11889 138920 20046 -113527 -172636 90714 -182327 194080 -169904 -43163 -133176 306951
$$ packed form
11967b85352H8030B4038b56781E3458e5875k46989I480J33750J0651B0756i1411
11955B57346e6981B4838b9449j74057c4819m9558j01663E2656e9191j24131d0787
11943a53763k73181G4700g4366p9016B2394M7919A2883L44561E7093L7405K89433
11932C83931f3745A25116a15448o6565A14784d05268B16279J97176B2798M8645
11922G1443p565c18584B41047f600B29446h8876c8293l466F1100a04287j90574
11911b94861a31577k56945c6196A66365a32244b8039A7971a59604c6233r0483
11901a26716b7753j8282o9064D7910c1005F3310K53100g9236j48878A54785B2448
11889A38920B0046a13527n9109I0714a82327A94080a69904d3163r0013C06951
$$ plain form
11878 -88665 124197 9280 149429 -64065 198080 -130851 -197239 -256102 -202032 -148483 174830
11866 -174314 -235278 -143813 -182589 -8293 -144672 -108287 -116871 39563 308508 158671 122715
11855 122715 -241508 -50713 88254 65933 -69967 144050 -164667 -137016 -155385 -411984 -78205
11843 -303422 -185936 5548 -321677 116175 -13599 24384 160251 -87301 162406 -383980
11832 -51880 -351491 -654 -101378 22915 88633 140147 -36400 92671 54134 -9236 155766 32816
11819 -252766 77634 23705 -229726 96025 -20967 8892 100606 113502 104395 109283 209138 13789
11806 -309670 79368 -91742 -320321 -145726 258458 -327042 79274 5092 -91013 67886 -158925
11794 67765 85583 121474 -70600 38827 259809 -89520 -204723 240158 -138772 -394056 -70906
$$ packed form
11878h8665A24197I280J40149f4065A98080a30851o6388n8863N4070N3549A74830
11866a74314o0964R1465l8776h293j36379L6385q584C9563K68945j49837l5956
11855A22715b41508e0713H8254k2321f9967A44050a64667K7651j8369k56599g8205
11843c03422J17486E548c21677A16175a3599B4384J35867h7301A62406c83980
11832e1880k99611f54j00724B2915O5718N1514c6400I2671l8537i236A55766C2816
11819b52766G7634B3705b29726I6025b0967H892R1714J2896r107M888R9855A3789
11806c09670G9368i1742k28579a45726B58458c27042G9274E092i1013F7886a58925
11794F7765J7818L5891g0600C8827K20982h9520j15203B40158a38772k55284g0906
$$ plain form
11782 -108429 -270600 79936 1476 224070 -40309 89854 133282 64500 100225 -51411 -119619
11771 -119619 -72067 -193429 -46754 -74431 79250 65235 -148470 -266743 -5909 -42613 -42553 171543
11758 2334 -136041 -79324 195533 -245318 -16691 -7274 97808 -184116 38593 549191 -140888
11746 106431 -71053 -3147 96544 -91455 -38544 216263 -84724 83157 -67619 -133102 -5146 -170086
11734 -170086 -110490 118560 -439137 77381 34912 -117519 255458 -431707 103216 -195554
11723 175578 -92179 -192981 -212998 -306955 168471 101359 128917 -134921 310232 -60071 100259
11711 -268959 -3712 -108656 98948 -98399 161310 -68533 131522 186924 -223931 176825 140127
11700 140127 71272 78486 66467 75822 -180584 37827 -32597 -242250 -42772 -140837 -225863
$$ packed form
11782a08429j62171G9936A476K22594d0309H9854M3428F4500L5725e1411o8208
11771a19619M7552j21362d6754k7677G9250j4015a48470j18273e909l6704O0A71543
11758B334a36041N6717A95533b45318a6691g274I7808a84116C8593N10598a40888
11746A06431g1053c147I6544i1455c8544B16263h4724H3157f7619o5483e146j64940
11734a70086N9596A18560d39137G7381C4912a17519B55458d31707A03216a95554
11723A75578i2179j00802k0017r3957A68471o7112K7558a34921C10232f0071A00259
11711b68959c712j04944I8948i8399A61310f8533A31522N5402b23931A76825l6698
11700A40127o8855P214j2019R355a80584C7827c2597k09653d2772r8065q5026
$$ plain form
11689 -225863 -119570 29848 -189462 -210790 -232781 480626 186411 -175458 -36972 -62856
11679 -62856 160906 18622 39451 403904 262244 59903 -148753 118220 103784 36959 63344
11668 63344 -90429 68897 -455520 -100782 72346 14375 -135900 159557 -46079 101816 38237
11656 -112764 -34307 47540 -50816 -103373 -23720 25337 17192 28291 -10414 122355 95191
11645 95191 181176 23099 -36620 114560 20242 -126577 72393 -198321 -190504 -23698 -14483
11634 -14483 21568 -101214 -176351 -192105 88658 113665 131526 -8131 116394 -103850 -209370
11623 -209370 32504 217169 -9876 49491 -119067 -206789 43106 -113347 -107211 -15590 -43647
11612 -43647 24127 326460 -306961 -9841 54707 261507 78167 180536 166368 267913 8416
$$ packed form
11689b25863J06293B9848a89462k1328k1991D80626A86411a75458c6972k5884
11679f2856A60906A8622K0829L64453j41660E9903a48753A18220j4436C6959K6385
11668F3344i0429F8897d55520a00782G2346A4375a35900A59557d6079A01816C8237
11656a12764c4307D7540e0816n2557b3720B5337q145J1099a0414A22355k7164
11645I5191Q5985B3099c6620A14560B0242a26577G2393a98321P817b3698R215
11634a4483B1568a01214p5137j5754H8658K5007J7861h131A16394a03850j05520
11623b09370C2504J84665i876D9491a19067q7722D3106a13347O136a5590k8057
11612d3647B4127L02333c06961i841E4707K06800G8167J02369j4168J01545H416
$$ plain form
11600 -123296 -251247 196558 266156 60814 76333 202391 363228 80916 -79926 156262
11589 127245 -30832 2626 -63002 123187 -286523 -119525 -67121 -228603 21400 144958 27380
11577 -67677 150341 344754 217843 121417 -75551 46311 114861 149549 -64732 91371 -81724
11565 279192 84657 180116 -33463 187740 -305410 236417 -209730 -357487 234061 133099
11555 133099 -289193 218131 114178 149314 85977 -161812 -53638 -73791 175528 -243523
11544 -73784 52825 63379 14431 212279 -38172 66917 175478 37727 91928 -287521 -101116
11532 -159302 -175208 143411 -139087 29169 316486 -121833 91106 231920 45916 -224890
11521 72076 -129136 113595 -9482 412569 -32660 -58226 107723 162146 -83731 9584 190241
$$ packed form
11600a23296j27951A96558O9598F0814J5519J26058J60837H0916g9926A56262
11589A27245c0832B626f3002A23187b86523a19525N2404j61482B1400J23558B7380
11577f7677A50341J94413j26911r6426g5551D6311O8550L4688f4732I1371h1724
11565B79192H4657R5459c3463A87740c05410B36417b09730j47757B34061j00962
11555A33099b89193B18131j03953L5136o3337a61812e3638k0153A75528b43523
11544g3784E2825J0554A4431J97848c8172F6917J08561C7727N4201b87521a01116
11532a59302j5906A43411a39087B9169K87317a21833I1106J40814D5916b24890
11521G2076a29136A13595i482D12569c2660k5566A07723N4423h3731I584J80657
$$ plain form
11510 190241 258515 470327 -11391 121763 178110 188625 45073 22804 -39338 -239572 -274827
11499 -274827 147363 74440 309794 -17577 32017 422281 396925 51603 99624 181834 -266530
11487 415022 74168 27350 144507 -67120 176619 130219 83843 81800 -235848 77100 98040
11476 98040 299650 48349 252495 -41463 -100293 -165526 -8676 108976 244305 10993 12630
11465 12630 -57237 601523 221815 -68960 353026 -86806 -230851 -214313 35680 80239 327173
11454 327173 124335 198909 366450 324085 -26433 -131893 206334 -39036 -199255 45463
11443 426790 31437 -302200 -98534 -44122 248480 -140506 255823 252266 -133576 200772
11432 65477 -166304 -155852 -23269 -91390 138191 83851 121679 -33392 56037 184595 195721
$$ packed form
11510A90241O8274K11812a1391A21763N6347J0515D5073k2269c9338k00234l5255
11499b74827A47363p2923K35354a7577C2017L90264k5356E1603M8021Q2210b66530
11487D15022G4168B7350J17157f7120A76619m6400m6376k043b35848G7100K0940
11476I8040K01610D8349K04146d1463n8830o5233h676A08976J35329A0993J637
11465A2630e7237F01523B21815f8960C53026h6806j44045J6538C5680M4559K46934
11454C27173A24335P4574J67541m2365b6433j05460B06334c9036j60219D5463
11443D26790C1437c02200i8534d4122B48480a40506B55823l557a33576B00772
11432F5477a66304J0452b3269o8121A38191n4340L7828c3392E6037J28558J1126
$$ plain form
11421 195721 -18234 -2991 32436 202074 19938 4538 143946 -64064 -135102 -54379 338510
11409 -271630 16996 179296 -49136 -51979 33571 635 -203788 -104323 31601 127991 -15945 -200785
11397 -200785 -148013 -224081 -11605 57945 -113722 9098 108106 111833 97904 -134507 5697 137095
11385 137095 -76435 303466 -77944 295624 80715 129725 -67348 -296333 249670 -2403 -46025
11374 -46025 -104023 -226291 12144 -62720 -82767 -27575 -454399 -230090 -129466 -42 225976
11362 -9005 -7474 67102 107276 -174181 119499 -50020 7780 61259 -40633 -141766 234781
11350 130356 17150 -34689 -33688 226960 36443 -39992 -405327 62931 253871 25146 322684
11339 322684 108594 50490 272196 -112509 50860 345897 -85010 -85706 -36588 48094 -29796
$$ packed form
11421A95721a8234b991C2436J69638A9938D538J39408f4064p1038e4379C38510
11409b71630A6996J62300d9136k843C3571F35b03788R9465C1601R6390a5945j84840
11397b00785N2772p6068a1605E7945a13722I098R9008L727j3929a34507E697J31398
11385A37095g6435C03466g7944B95624H0715M9010f7348k28985B49670b403m3622
11374d6025n7998j22268A2144f2720k0047b7575m26824K24309J00624d2B25976
11362i005J531F7102M0174a74181A19499e0020G780N3479d0633j01133B34781
11350A30356A7150c4689J001B26960C6443c9992l65335F2931J90940B5146K97538
11339C22684A08594E0490K21706a12509E0860K95037h5010o96c6588D8094b9796
$$ plain form
11327 68332 112199 -92110 -49438 -96453 157635 111715 -201031 78673 -208747 -2408 -70676
11316 -70676 -405561 -178318 72083 176051 -198856 -272480 -36004 -351730 -30531 -152112
11306 -152112 56740 -377628 355699 -142100 158084 143353 -37408 173059 47272 15886
11295 -219309 -39810 -122479 -261274 143204 -30614 382062 -34657 -533113 -123660 27648
11284 437239 -326123 -38111 105861 109975 -112835 68030 -307802 -57292 158399 199321 22854
11272 109245 7605 172434 -133877 -46997 -138662 -32099 1566 -104106 246805 64954 156521
11261 156521 -171361 -228058 29477 3166 -271278 -136091 -359415 121273 300524 237365
11251 237365 -90695 121752 -199147 -265776 141143 1816 252481 -83661 62418 -303680 -295240
$$ packed form
11327F8332M3867i2110M2672m7015A57635m5920b01031G8673b08747b408o8268
11316g0676l34885a78318G2083J03968a98856p3624c6004l15726c0531j21581
11306a52112E6740c77628C55699a42100A58084j4731c7408A73059D7272A5886
11295b19309c9810q2669j38795A43204c0614C82062c4657m98456a23660B7648
11284D37239c26123c8111A05861M114a12835F8030c07802e7292A58399M0922B2854
11272A09245G605J64829a33877d6997r1665c2099A566a04106B46805F4954R1567
11261A56521a71361n6697B9477C166b71278J35187k23324A21273J79251o3159
11251B37365i0695A21752a99147o6629A41143A816K50665h3661F2418c03680Q440
$$ plain form
11240 -295240 178498 -74101 -71095 -31595 266448 14852 -233517 -173175 103142 -229139 -73079
11228 159543 217673 10655 70868 -214467 -84704 -120866 193348 219556 -316893 -143609 -308914
11217 -308914 -266701 135974 164685 -9056 -123676 212257 -222305 -235092 -225191 -14823 -191070
11206 -191070 -246023 -141971 -52150 342252 -98267 -15195 101633 -384251 204437 -418313
11195 -2024 143108 33827 -272367 -158108 59799 -64119 253185 37185 -103710 112252 -184357
11183 -34146 209957 -335722 -148475 95194 45319 161750 19072 39135 -73646 222602 -118635
11171 -345704 -319999 232316 -113981 -147817 66408 -71217 38898 -288467 -297022 94118 -180246
11159 13977 -237370 -133023 -325803 -75995 -138522 -256082 4434 -252131 -426392 -64193 90779
$$ packed form
11240b95240A78498g4101L006c1595B66448A4852b33517O0342A03142b29139g3079
11228A59543N8130A0655O0213b14467h4704l6162A93348K6208c16893a43609j65305
11217c08914M2213A35974K8711i056j14620B12257b22305j2787R901a4823j76247
11206a91070n4953J04052e2150C42252i8267a5195A01633c84251B04437d18313
11195b024A43108C3827b72367J14259E9799f4119B53185C7185a03710A12252a84357
11183c4146B09957c35722a48475I5194D5319J16431A9072K0063g3646B22602a18635
11171c45704K5705B32316a13981l3836F6408g1217C8898b88467q555I4118a80246
11159A3977b37370J04347j92780g5995o2527j17560D434b52131j74261f4193I0779
$$ plain form
11147 -138422 -157085 -27107 177560 -282992 133080 -203252 239915 -208817 -199942 -77019
11136 77365 -126039 355081 -52243 61540 -69118 -313371 88500 -22307 -123642 95161 -203207
11124 -110337 44714 -79008 275985 198040 39478 44320 -316899 -32750 -44646 69577 56484
11113 56484 45653 127643 -201786 149634 178324 20322 31393 202905 -12837 76284 120770
11102 120770 319022 -76722 226997 69336 101015 311362 -527376 163438 110002 -27732
11091 89076 117878 119271 391046 425041 138116 103948 -10278 97169 -1513 -61214 60376 691146
11079 691146 264096 29483 146288 29748 454791 29190 -21793 78616 54581 317263 158558
11067 224637 452774 -95582 15300 185613 17732 -101821 537009 362768 63016 -17263
$$ packed form
11147a38422j8663b7107A77560b82992A33080b03252B39915b08817Q875g7019
11136G7365a26039C55081e2243F1540f9118k44253H8500b2307j01335I5161b03207
11124a10337D4714g9008B75985p7945C9478M842c16899c2750j1896F9577j3093
11113E6484j0831Q1990b01786A49634K8690B0322J1071J71512a2837G6284M4486
11102A20770J98252g6722B26997F9336L1679K10347e27376A63438n3436b7732
11091H9076K8802J393K71775L3995A38116l4168a0278I7169a513n9701F0376O30770
11079F91146B64096B9483J16805B9748M25043B9190b1793G8616k4035K62682A58558
11067B24637K28137i5582A5300J70313A7732a01821E37009j74241F3016a7263
$$ plain form
11056 -56868 66458 294033 462085 193016 21394 476292 313032 486220 329476 500783
11046 500783 543310 357295 514944 230846 656790 364219 256265 217792 114753 634562
11036 634562 396442 590278 431170 471512 724090 634189 349053 845334 865142 309807
11025 741675 767296 499019 472379 818392 426712 1102794 719202 336885 718860 390898
11015 390898 217552 754964 650420 285928 846951 467364 640289 451994 226721 659472
11005 659472 482947 87309 375709 646521 267816 554503 555493 446492 781668 480933
10995 480933 340797 401297 325579 674943 327672 456691 576216 630509 372420 878783
10985 878783 436494 240370 434881 516408 794116 716421 499544 309231 243738 502387
$$ packed form
11056e6868F6458K27575J68052A93016B1394M54898j63260J73188j56744J71307
11046E00783M2527j86015J57649B30846M25944k92571j07954l8473j03039N19809
11036F34562k38120J93836j59108M0342K52578q9901k85136M96281J9808C09807
11025G41675K5621k68277k6640L46013l91680O76082l83592C36885L81975l27962
11015C90898j73346N37412j04544B85928N61023l79587J72925j88295k25273M32751
11005F59472j76525H7309K88400K70812B67816K86687R90j09001L35176l00735
10995D80933j40136O0500p5718L49364C27672J29019J19525N4293k58089N06363
10985H78783D36494j96124J94511Q1527K77708p7695k16877j90313o5493K58649
$$ plain form
10975 502387 653344 891405 484134 729188 629162 758765 672488 726606 697988 975206
10965 975206 739781 922634 993575 946734 972525 1175431 1359472 1471642 1903980 1815740
10955 1815740 1951436 2014735 1950153 2126605 2174557 2160964 1904420 1870090 2087227 1479716
10945 1479716 1696427 1785078 1603160 1938736 1554897 1259135 1738484 1627951 1594311 1440628
10935 1440628 1489900 964795 1192106 946025 717875 841511 770927 275292 -35263 360809
10924 601419 350148 -119119 708139 202085 357086 -7865 66989 -17434 75281 217358
10914 217358 109996 19895 56918 -70557 -143463 294721 -100312 -121702 113252 -156325
10903 -138213 85806 -176492 151214 -109575 259209 -285872 188780 -92150 -106606 158154
$$ packed form
10975E02387J50957K38061m07271K45054j00026J29603q6277N4118k8618K77218
10965I75206k35425J82853P0941m6841K5791K02906J84041J12170M32338q8240
10955A815740J35696O3299o4582J76452M7952j3593k56544l4330K17137o07511
10945A479716K16711Q8651j81918L35576l83839k95762M79349j10533l3640j53683
10935A440628M9272n25105K27311k46081k28150J23636p0584B75292c5263C60809
10924F01419k51271a19119G08139B02085J55001g865F6989a7434G5281J42077
10914B17358j07362A9895L7023g0557p2906B94721a00312k1390A13252a56325
10903a38213H5806a76492A51214a09575B59209b85872A88780i2150j4456A58154
$$ plain form
10892 16818 81321 -282240 23862 -22435 -127118 454352 44810 -145864 138576 206199 -60015
10880 173825 103575 -223567 -1144 -219447 209257 -114529 -12285 -371824 -154670 42972
10869 -412178 281976 -28278 -384023 -61449 175153 -118727 -447984 -250918 -129820 19323
10858 -57718 272880 -209848 -56590 165073 96740 220524 -76976 -154448 -137660 -48876 89727
10846 -192312 -397722 -43888 -1172 -168504 -358056 168756 39215 -81270 -331517 45798 317361
10835 317361 49202 57083 -255974 142153 -139595 -5696 -152398 82195 -9555 -254398 -2518
10823 -75393 -156375 -28188 -213725 27374 37837 156469 184909 159308 -67338 212509 -4863
10811 161063 -177619 -168925 26305 -190215 98800 -389387 -255273 -186880 271684 -10712 126411
$$ packed form
10892A6818O4503b82240B3862b2435j04683D54352D4810a45864A38576O7623f0015
10880A73825p0250b23567a144k18303B09257a14529a2285l59539a54670D2972
10869d12178B81976b8278l55745f1449A75153a18727l29257J97066J21098A9323
10858e7718B72880b09848e6590A65073o8333J23784g6976p7472J6788d8876H9727
10846a92312k05410d3888a172j67332j89552A68756C9215h1270k50247D5798K71563
10835C17361D9202P881b55974A42153a39595e696j46702H2195i555k44843b518
10823g5393q0982b8188j85537B7374J0463J18632K8440k5601f7338B12509d863
10811A61063a77619Q694B6305a90215I8800c89387J34114O8393B71684a0712A26411
$$ plain form
10799 140647 -187355 -292494 -177098 -63726 -159513 -225326 -442416 24189 -230662 92648
10788 10887 88049 161600 52560 -14230 -103398 -236220 -25421 -4256 33802 99582 -141231
10776 36446 146665 -221839 39380 -356411 -124686 49365 -43484 -219068 -257076 282201
10765 -93144 102340 -347820 -45050 259524 -5788 -6790 -280044 -286296 296399 109565 -10126
10753 -302244 -93303 251410 44281 -121542 -316907 -257627 -243696 -34673 -58695 -141442 -112822
10742 -112822 -108686 -76513 -154447 -381384 -689999 -170853 22687 -28771 94602 -217353 -91269
10730 -373964 -417746 -375483 113566 -226735 229905 -222585 -184984 -63207 3749 23279 155914
10719 155914 -94259 40224 -251260 -305313 -316954 247828 -147950 101357 76538 -207285
$$ packed form
10799A40647a87355j05139J15396f3726r5787o5813k17090B4189b30662I2648
10788A0887P7162P3551E2560a4230q9168j32822b5421d256C3802O5780a41231
10776C6446J10219b21839C9380c56411a24686D9365d3484j75584l8008B82201
10765i3144A02340c47820d5050B59524e788j002k73254o252B96399A09565a0126
10753c02244i3303B51410D4281a21542j95365N9280J3931c4673k4022q2747K8620
10742a12822M136L2173p7934k26937l08615a70853B2687b8771I4602b17353i1269
10730c73964m3782M2263A13566b26735B29905b22585L7601f3207C749J9530J32635
10719A55914i4259D0224b51260n4053j1641B47828a47950A01357k4819b07285
$$ plain form
10708 -278386 101295 246708 -120029 -204226 368863 -286569 -181949 -205078 120948 -75610
10697 -84365 50086 -228977 -34233 87192 -268739 265747 -243565 -65306 108783 -120839
10686 20507 -150096 145456 106494 -200692 -128331 -18138 -138300 -2668 -186664 269624 21604
10674 153965 -130143 -495193 54262 -178529 -168369 148076 -9846 -38096 -215641 -134122 -26464
10662 -92736 -36662 -6361 -285712 -79342 95408 -354358 -44580 47405 -106199 -185412 -289029
10651 -289029 15287 -343606 82456 -197911 208748 42352 -196220 -89623 -101575 -136145 39689
10639 175729 -77628 159343 67846 -202515 -172309 -1823 312763 -254156 58784 -189754 -132593
10628 -132593 405254 21360 -225975 30744 20145 -123836 81275 156595 -186552 -20946 5860
$$ packed form
10708b78386A01295J45413a20029q4197C68863b86569J04620k3129A20948g5610
10697h4365E0086b28977c4233H7192b68739B65747b43565f5306A08783a20839
10686B0507a50096A45456l8962b00692P2361a8138j20162b668j83996B69624B1604
10674A53965a30143l65050E4262a78529J0160A48076i846k8250j77545Q1519b6464
10662i2736c6662f361k79351g9342I5408c54358d4580D7405a06199p9213j03617
10651b89029A5287c43606H2456a97911B08748D2352a96220h9623j1952l4570C9689
10639A75729g7628A59343F7846b02515L0206a823C12763b54156E8784a89754N7161
10628a32593D05254B1360b25975C0744j0599a23836H1275P5320a86552b0946E860
$$ plain form
10616 75502 -145713 127753 -115771 119580 -92490 -212714 -263904 86158 -168774 -26153
10605 -245103 -257128 -48569 -13650 -48650 -238829 -287428 -36738 159488 85492 -300598 49824
10593 -160751 -277692 -41903 -140030 -210913 -69848 135926 -53300 110508 -214969 66364 322682
10582 322682 -84965 -202526 -238915 1954 -234413 187711 71324 -55825 89132 285199 -208673
10570 19026 -10820 -294287 95628 -38857 108027 -343967 -103337 -364099 -81883 280131
10559 -169640 6493 -190670 232768 93274 -307618 -234405 159525 193721 52023 104102 232058
10548 232058 -384310 -112365 -34912 87387 -141769 -112408 -145629 108130 394049 28519
10537 151577 325562 161361 -89408 -43434 -51224 108126 94754 -58577 100420 -45582 -359645
$$ packed form
10616G5502a45713A27753a15771A19580i2490j20224n1190H6158a68774b6153
10605b45103j2025d8569a3650l5000j90179m8599c6738A59488p3996c00598D9824
10593a60751j16941d1903r8127p0883f9848A35926e3300A10508b14969F6364K56318
10582C22682h4965j17561l6389A954b34413A87711G1324e5825H9132J96067b08673
10570A9026a0820k83467I5628c8857A08027c43967a03337k60762h1883B80131
10559a69640F493a90670B32768I3274c07618P3213A59525L4196E2023N2079J27956
10548B32058c84310a12365c4912H7387a41769K9361l3221A08130K85919B8519
10537A51577J73985A61361h9408d3434p790A08126j3372e8577A00420d5582l14063
$$ plain form
10526 -359645 -18814 -216542 -244140 211213 126648 -239070 -173834 -39217 -113248 60934 132668
10515 132668 -30296 -88078 -219349 53292 23015 146608 -1044 -373588 326457 -292911 2229
10503 -322754 -1687 -119681 -41451 -116267 -115815 -208503 177430 -183900 54276 -26805 33824
10491 -279550 371260 131818 1406 -175781 243663 -89381 258881 285401 -236379 -1442 -198232
10480 -198232 14569 -88583 107797 -56791 -193651 -122818 10981 -56323 -255648 -102481 147833
10468 -145899 318830 -153010 56690 -174019 36417 -86164 209172 80108 265543 208493
10458 208493 317204 297979 90324 -269964 154514 59297 -69431 -59483 81161 228565 153567
10447 153567 -46124 -50648 -218508 -113658 -174183 -124993 8575 -11544 91514 -53263 -326126
$$ packed form
10526c59645a8814j97728k7598B11213q4565b39070O5236c9217p4031F0934P1734
10515A32668c0296n7782j31271E3292B3015J23593a044l72544C26457b92911B229
10503c22754a687j17994d1451p4816M52r2688A77430a83900E4276b6805C3824
10491b79550C71260A31818A406a75781B43663h9381B58881K6520b36379a442j96790
10480a98232A4569h8583A07797e6791j36860P0833A0981e6323j99325a02481A47833
10468a45899C18830a53010E6690a74019C6417h6164B09172H0108J85435n7050
10458B08493J08711j9225I0324b69964A54514E9297f9431R948H1161J47404p4998
10447A53567d6124m524j67860J04850o0525M9190H575a1544I1514e3263k72863
$$ plain form
10436 -326126 -262809 -24671 -41695 101479 -150974 -31827 -20379 -42031 -206239 -41140 7141
10424 -73839 28315 -504889 32947 -161021 203351 3656 -430879 103202 116752 -214012 -150185
10413 -150185 -136382 -161039 282456 -169899 -297473 -161697 -144639 129415 -91605 -284569
10403 -284569 -167700 -12295 219862 169649 -143641 -111447 -427873 -197688 -338204 -620753
10393 -620753 -19202 264691 59896 13277 229197 162280 -383077 -107203 -126853 -178155 -54039
10381 -170919 -157483 -174296 -26958 -118660 -21540 139981 -118051 62535 223383 -25255 357838
10369 -58490 487816 246678 -138414 184981 510831 -108328 158842 121363 121643 336248
10359 336248 113025 168801 75100 246193 -9662 372457 99933 209833 294614 401234 477895
$$ packed form
10436c26126O3317b4671j7024A01479a50974c1827J1448k1652j64208d1140G141
10424g3839B8315e04889C2947a61021B03351C656d30879A03202J3550b14012O3827
10413a50185J3803k4657B82456a69899j27574J35776J7058A29415i1605j92964
10403b84569J16869a2295B19862n0213a43641L2194l16426a97688j40516k82549
10393f20753a9202B64691E9896A3277K15920o6917c83077a07203j9650n1302e4039
10381a70919J3436j6813b6958r1702b1540A39981a18051F2535J60848b5255C57838
10369e8490D87816k41138a38414A84981L25850a08328A58842l7479K80K14605
10359C36248A13025N5776G5100J71093i662C72457I9933J09900Q4781J06620P6661
$$ plain form
10348 477895 288494 173824 484523 140284 425657 295782 234419 127208 421981 7363
10337 481394 -212950 246789 70901 179244 125273 354786 257405 463471 -249677 60951
10326 246698 370362 195853 353604 258839 63232 287059 328437 -16142 233090 340194
10316 340194 60138 41817 140392 184880 150849 -252095 39191 317890 264820 3971 152118
10305 152118 365707 -33730 356814 106085 253209 36297 112401 20089 -168358 85248
10294 -311197 -187119 370526 -102525 137975 64208 -20302 408340 95074 -101753 -176978
10284 -176978 106713 -35013 129901 -190551 -114732 -201479 -13119 81106 82094 328165 69525
10272 -446906 -297566 -80448 173331 -18411 -76043 -158073 209800 132956 229866 -176240 30778
$$ packed form
10348D77895j89401j14670L10699A40284K85373j29875o1363j07211K94773G363
10337D81394b12950B46789G0901J08343n3971K29513r7381K06066b49677F0951
10326B46698J23664j74509J57751r4765F3232K23827M1378a6142B33090J07104
10316C40194F0138j8321R8575M4488l4031b52095C9191K78699n3070C971J48147
10305A52118K13589c3730C56814A06085J47124C6297P6104B0089a68358H5248
10294c11197J24078C70526a02525A37975F4208b0302D08340I5074a01753p5225
10284a76978A06713c5013A29901a90551P5819q6747a3119H1106R88K46071F9525
10272d46906J49340h0448A73331a8411n7632q2030B09800p6844R6910a76240C0778
$$ plain form
10260 -58213 -347950 101671 45955 -57564 -92592 121608 -72188 -19301 43504 -88948 -335617
10249 -335617 78607 -342753 171596 -55321 289901 167727 122533 -59915 -40999 214410
10238 75554 116493 377143 86957 367024 -135041 183123 175740 25784 158287 -5526 -266458
10227 -266458 -166318 340195 -247461 185330 -85003 148739 148275 125342 114117 -436880 -107139
10215 -34043 -136813 -351459 440418 -105129 -266100 -133866 -65552 23639 -203352 33023
10204 121577 -99463 -233372 -460882 114152 65708 23112 -2522 -161878 295003 -332003
10193 -45398 -137783 -87190 81471 -215706 16677 164780 -98870 -151179 -84134 -301301 32664
10181 -50195 -104309 -191297 275882 -308545 -50777 -193538 -95844 18301 -31348 141807 -261023
$$ packed form
10260e8213k89737A01671D5955e7564l5028A21608g2188a9301D3504h8948k46669
10249c35617G8607c42753A71596e5321B89901j22174m5194e9915J8916B14410
10238G5554M0939K60650H6957K80067a35041A83123p383B5784J32503e526k60932
10227b66458J00140C40195b47461A85330h5003A48739m64k2933j1225d36880a07139
10215c4043j02770k14646D40418a05129j60971J32234f5552B3639b03352C3023
10204A21577i9463j33909k27510A14152m8444B3112b522j59356B95003c32003
10193d5398r2385N0593H1471b15706A6677J48103i8870n2309O7045k17167C2664
10181e0195n4114q6988B75882c08545e0777j42761i5844A8301c1348A41807b61023
$$ plain form
10169 -186954 -306143 124179 33009 172798 -46045 -97246 -93572 -237532 -165653 271580 86134
10157 -101395 -198732 -187441 156806 -229703 -106014 -437398 148839 -216394 -454546 -144972
10146 -231771 -95515 77974 265581 68692 53253 -66371 -264616 -155636 -19381 167380 59374
10134 -82321 4938 -241886 -113836 1042 -124868 127419 33867 -407429 -217350 -362812 -338251
10123 -338251 -253552 10791 191766 114555 303011 90815 -38117 157830 176276 5439 77995
10112 77995 -229420 -409205 -94518 -105816 -197715 -3639 -112734 243326 -104950 -136621 7370
10100 -80323 120929 164467 44730 -182161 -97839 -209112 -231154 -222171 -292955 -56381 -53201
10089 -53201 -225856 -1098 -52341 239043 -167065 -56229 -46389 -211074 -145893 48802 -194951
$$ packed form
10169a86954j19189A24179C3009J39789d6045n1201L674j43960P1879B71580H6134
10157a01395r7337J1291A56806b29703a06014l31384A48839b16394k38152a44972
10146b31771i5515G7974J87607F8692j5439f6371j98245J08980a9381A67380E9374
10134h2321D938b41886a13836A042a24868A27419C3867d07429J90079j45462K4561
10123c38251Q4699A0791J80975p7211J88456I0815c8117A57830J8446E439P2556
10112G7995b29420j79785i4518j1298r1899c639j09095B43326a04950l1671G370
10100h0323A20929M3538D4730a82161Q4322j11273k2042Q983p0784e6381L180
10089e3201j72655a098n1243B39043a67065e6229R840j64685O5181D8802a94951
$$ plain form
10077 -184030 -85083 171994 -63135 -7885 -608498 62210 49276 67307 -127680 162962 -14253
10065 -162890 -376287 -85456 210933 -278257 -122856 -108116 -11668 -30042 -241180 -37263
10054 76338 283581 -28154 -174505 -142376 -215800 -299787 -260757 -303666 -22564 15957 -68382
10042 6157 -105601 -38300 258159 20180 -110020 -17866 -222440 -39629 -102620 -13144 115498
10030 -106047 -389235 57587 -98966 266760 -77424 -194162 62150 -120469 -256333 -189930
10020 -189930 119781 132290 -79424 -138728 247795 -33719 82806 67814 282393 154805 -189518
10008 -23497 -78310 -10584 84782 377926 -367561 -164189 156148 131736 -295500 109310
9997 -267624 106655 -309620 86574 -263927 365312 -81142 -264653 -211689 -380975 -36916
$$ packed form
10077a84030h5083A71994f3135g885o00613F2210j2934J8031a27680A62962a4253
10065a62890k13397h5456B10933b78257a22856J4740a1668j8374k11138c7263
10054G6338K07243b8154j46351L2129p3424q3987L9030m2909b2564A5957f8382
10042F157a05601c8300B58159B0180a10020a7866k04574c9629o2991a3144A15498
10030a06047k83188E7587i8966B66760g7424j16738F2150a20469j35864O6403
10020a89930A19781J2509g9424n9304B47795c3719H2806j4992K14579j27588a89518
10008b3497n4813a0584H4782K93144c67561a64189A56148k4412b95500A09310
9997b67624A06655c09620H6574b63927C65312h1142j83511N2964j69286c6916
$$ plain form
9986 -247744 -47469 -31808 -119555 -115197 27498 -301106 -338733 -319944 -75730 -240243 -96233
9974 143388 2256 93243 -320252 -529532 -230567 -174687 -331566 322035 -413722 132769
9963 -202190 -102831 147995 -227060 -170071 -237038 -304506 -11815 230923 -243495 6498 -29176
9951 -138422 43893 99246 231197 -393981 -73981 57207 75800 195335 -39061 -252670 -13066
9939 -52518 23315 52228 -32706 -81612 -143492 -466802 -42088 -394472 189021 -444849 60378
9927 -2443 -24497 -116249 -56344 -243504 -72614 -40966 64093 18885 -38527 221476 -190148
9915 -186681 -168072 -26544 93103 149528 -75124 -163221 80722 -152449 369388 -371958 23215
9903 120662 -157676 124495 201894 -163207 -207632 103288 -190105 -110193 53007 -71438 -103744
$$ packed form
9986b47744d7469J5661q7747M358B7498c01106l7627J8789g5730j64513i6233
9974A43388B256R0987c20252k09280b30567N5880j56879C22035d13722A32769
9963b02190R9359A47995b27060N6989o6967o7468a1815B30923b43495F498b9176
9951a38422D3893N5353J31951c93981g3981E7207J8593J19535c9061k13609a3066
9939e2518B3315K8913c2706m8906o1880l23310d2088l52384A89021d44849F0378
9927b443k2054r1752e6344j87160g2614L1648F4093A8885c8527B21476a90148
9915a86681J8609b6544I3103N6425g5124q8097H0722a52449C69388c71958B3215
9903A20662a57676A24495P7399a63207m4425A03288a90105P9912E3007g1438l2306
$$ plain form
9892 -103744 94232 -432374 216353 -132023 132501 94243 270862 248614 -138559 -36078
9881 -147800 -227918 -179178 -103171 -64093 -240423 74459 189927 -207859 12146 110264 -211113
9869 -185284 -36 69546 -103311 200800 -288488 186104 -116755 -260099 -18291 -11660 -75349
9858 -75349 -116483 -37493 -34685 134068 -19629 -161342 -94215 218128 -148036 63015 -195415
9846 -51049 265166 -31633 42758 195045 -190296 -238543 119180 33272 126115 -57971 392385
9834 -193517 -347966 -530607 141695 149685 36013 -288468 -59030 17494 28392 -115524 -230034
9823 -230034 -133400 -459547 100047 -110820 123119 31569 -256325 -75083 276700 -288008
9812 -64638 29674 -164321 -663433 177288 -268812 12241 85953 136442 -253373 -4509 205586
$$ packed form
9892a03744I4232d32374B16353a32023A32501l8258J76619k2248a38559c6078
9881a47800q0118M8740P6007L9078j76330G4459J15468b07859A2146R8118b11113
9869a85284c6F9546a03311B00800b88488A86104a16755j43344a8291O631o3689
9858g5349m1134c7493K808A34068a9629j41713O7127B18128a48036F3015a95415
9846e1049B65166c1633D2758J52287a90296m8247A19180C3272R2843e7971C92385
9834a93517j54449j82641A41695P990C6013b88468e9030A7494J0898a15524j14510
9823b30034R6634l26147A00047a10820A23119C1569b56325g5083B76700b88008
9812f4638B9674a64321m99112A77288b68812A2241P3712N0489b53373d509B05586
$$ plain form
9800 69117 231630 19017 159216 -136806 -7114 197495 -288001 -237740 -56371 443386 33034
9788 339233 -155586 -49535 67971 -15396 -3004 -49700 -122118 -57440 -263165 426835 -93694
9776 -75835 -192800 15279 -274628 155901 -105693 58973 -143856 -366937 58360 -159408
9765 191902 -48392 -237497 -17566 -45547 115258 -169170 -138536 -561373 131213 64966 217341
9754 217341 186921 44846 -142940 -184991 -47745 -100812 -181152 60340 -146708 -67039 201429
9742 205070 29338 -100720 -196155 -71314 -184049 -65497 -59650 -102807 -3353 181520 168900
9731 168900 65039 12793 -290979 -223950 -223636 221213 -453644 -135696 -100140 46500 6430
9719 15595 94565 175338 -293747 -186906 -36017 -317293 -15553 11356 124252 -41626 59715
$$ packed form
9800F9117J62513A9017J40199a36806g114A97495b88001N0261e6371D43386C3034
9788C39233a55586d9535F7971a5396c004m6696p2418e7440k05725D26835i3694
9776g5835j16965A5279b74628A55901a05693E8973a43856k23081E8360a59408
9765A91902d8392j89105a7566k7981A15258a69170L0634m22837A31213F4966J52375
9754B17341l0420D4846a42940m2051d7745n3067q0340F0340a46708f7039B01429
9742B05070B9338a00720r5435g1314j12735f5497N847m3157c353A81520j2620
9731A68900F5039A2793b90979O7029L14B21213d53644a35696L5556D6500F430
9719A5595P8970Q0773b93747J06841c6017k81276a5553A1356J12896d1626E9715
$$ plain form
9707 91860 93854 -8334 -354984 195602 -275191 -25189 159425 -117525 87542 -22859 -190694
9696 -190694 -80710 -252253 -380401 -254939 -344637 -219063 -27220 -58828 -147722 -364269 -235695
9685 -235695 -106588 20767 -75 76560 -240669 -181799 -128509 -126416 -337492 -146846 -48336 25114
9672 -462907 -179399 384400 -334802 -31673 137754 -50718 222947 17029 -124427 -270446
9662 -270446 208523 6777 -226975 -152630 89042 318676 -25916 -68133 77736 7707 196445
9651 196445 -164356 98477 -272989 45990 -125685 5693 -195807 -22918 134373 -247782 -11359
9639 -63454 109832 -173220 -109612 2237 238588 -407793 94927 -178124 111445 112561 -241095
9627 -277880 -2331 -242236 -66273 -86345 -436352 -415188 -45062 -276103 202956 807 -239205
$$ packed form
9707I1860J994h334l46650A95602b75191b5189A59425a17525H7542b2859j67835
9696a90694h0710j71543j28148J25462q9698J25574b7220l1608q8894k16547J28574
9685b35695a06588B0767g5G6560b40669N8870N3290K093k11076a46846d8336B5114
9672d62907a79399C84400c34802c1673A37754e0718B22947A7029a24427j46019
9662b70446B08523F777b26975P4345H9042K29634b5916m2217G7736G707J88738
9651A96445a64356I8477b72989D5990a25685E693a95807b2918A34373b47782a1359
9639f3454A09832a73220O3608B237K36351d07793I4927a78124A11445J116b41095
9627b77880b331k39905f6273k0072l50007K1164d5062k31041B02956H07b39205
$$ plain form
9615 -102497 -92761 -142130 176162 -108961 -211470 206063 254965 85357 -77243 -18866 14017
9603 -117425 112407 -171986 159565 -57704 30715 32586 -125101 134056 -157983 9568 161626
9592 161626 -207479 -205577 -60952 -62537 -295697 54575 2889 -46256 -235833 1383 25734 -175759
9579 -6325 72288 132246 -92168 -28779 15931 -225933 95894 93705 38304 -42212 9685 -216569
9566 -106483 38908 -157173 -36772 51016 -36687 125003 103965 -121374 83494 248742 -53864
9554 -8638 -243937 147048 -224150 -147070 -166388 -64690 -196325 -284902 -137848 -228618 354531
9542 -66823 51799 -28764 -269780 -231814 -33066 -191392 -244406 -26089 -26087 -129734 125658 1526
9529 -16119 -240461 92982 -131373 -124881 -191337 -25248 -28296 -431103 15078 246513 -134232
$$ packed form
9615a02497R736m9369A76162a08961j02509B06063M8902H5357g7243a8866A4017
9603a17425A12407a71986A59565e7704C0715J871a25101A34056a57983I568J52058
9592A61626b07479J902f0952j585k33160E4575B889d6256j89577A383K4351a75759
9579f325G2288N9958i2168b8779A5931b25933I5894k189C8304d2212I685b16569
9566a06483C8908a57173c6772E1016c6687A25003k1038a21374H3494J65248e3864
9554h638k35299A47048b24150P7080j9318f4690j31635q8577a37848r0770C54531
9542f6823E1799b8764k41016L7966c3066j58326n3014b6089Kj03647A25658A526
9529a6119k24342I2982a31373O492o6456b5248l048m02807A5078K31435a34232
$$ plain form
9517 -113443 28519 115920 -246514 83877 146195 19067 265566 77164 -129938 -111857 252265
9505 122592 270501 -125009 -219035 -143658 -175743 -495933 -234860 -194570 -258000 -153989 82873
9493 -114325 -266944 -127537 -89534 40969 -170510 55532 -421946 -397900 -307931 -95694 -229515
9482 -229515 79656 -154803 -31945 -24704 -79601 34937 -209202 -204169 -157738 39255 237749
9471 237749 -121174 -121547 -44034 -105849 -151795 197499 -1406 -164385 -84363 -144858 -18670 -271
9458 249856 -30466 39757 -58159 75010 122047 120735 -42548 112053 -273272 137225 -408377
9446 141930 -7904 -231636 -93139 -358830 128367 -95205 -205278 9207 -102854 -426774 132816
9434 81969 106246 -323637 -132089 -51706 291490 -238449 49115 159665 27734 180253 230937
$$ packed form
9517a13443B8519Q7401b46514H3877O2318A9067K46499G7164a29938J8081B52265
9505A22592J47909a25009r4026P5377l2085l20190b34860M0290o3430J04011H2873
9493a14325j52619a27537L8003D0969a70510E5532d21946K4046Q9969i5694j33821
9482b29515G9656a54803c1945P241n4897C4937b09202N033M6431C9255J98494
9471B37749a21174l73d4034o1815m5946A97499a406j62979Q0022o0495a8670b71
9458B49856c0466C9757e8159G5010M7037j312d2548A12053b73272A37225d08377
9446A41930g904k23732i3139k65691A28367i5205j10073I207a02854l23920A32816
9434H1969K4277c23637a32089e1706B91490b38449D9115J10550B7734J52519N0684
$$ plain form
9423 230937 -330590 307177 13709 -178753 109024 21945 92293 309044 -234372 -355022
9413 -355022 -326332 71734 -107251 -153599 92322 -54719 -320846 36592 83218 3474 -152171
9401 -175675 -183181 -94826 -211114 -410792 -233039 -340254 76611 -247880 -335924 -63995 -182707
9390 -182707 -209733 68734 -191119 -109040 36349 -145349 32395 177301 -52392 -168187 -142596
9379 -142596 195047 195479 -208712 34832 -52094 45698 -58373 -281637 275119 132834 -131827
9367 -181966 -383591 303903 -113716 -263577 166630 -28147 -192943 178865 -91932 251968
9356 -92499 -102581 120304 -95237 -71514 -327891 -67315 -232675 -179662 -222630 22727 -239295
9344 -323754 304687 175975 -120104 -190907 -173554 -82807 -197638 -251652 -169144 -154792 -154685
$$ packed form
9423B30937c30590C07177A3709a78753A09024B1945P0348K16751b34372j20650
9413c55022K8690G1734a07251m6348I2322e4719k66127C6592M6626C474a52171
9401a75675p506Q8355j16288j99678J77753j07215G6611b47880q8044f3995j18712
9390a82707k7026F8734a91119Q2079C6349a45349C2395J44906e2392j15795K5591
9379a42596A95047M32b08712C4832e2094D5698e8373k23264B75119A32834a31827
9367a81966k01625C03903a13716j49861A66630b8147j64796A78865i1932B51968
9356i2499j0082A20304i5237K3723k56377f7315j65360N3013m2968B2727b39295
9344c23754C04687j28712a20104p0803J7353h2807j14831n4014Q2508J4352J07
$$ plain form
9333 -154685 -96861 -233140 -61579 -22065 253191 -311473 611 59668 25530 -179588 -231581
9322 -231581 30302 -9042 16693 119804 -211897 -239209 217917 73676 -279570 38063 -153103
9310 -170537 90012 55455 -18221 -1827 -138170 -133218 35250 154246 22291 75961 2153 72598
9298 72598 37213 -149024 -265937 -228978 97114 57626 -39559 -216241 -168361 141210 72407
9287 72407 19022 -163901 67456 -231035 -86709 426532 -220473 -169040 75217 -124585 -60071
9275 71270 -171455 61095 10222 28339 -81579 -122746 -247375 -217611 -366926 -48015 -163921
9264 -163921 71417 -204036 -191304 -276750 232874 -30598 -107872 -191269 -147918 -147250 -363433
9253 -363433 -160956 32097 -53367 -96952 -103920 -284182 -293942 33001 45950 -104823 -74952
$$ packed form
9333a54685N7824j36279f1579b2065B53191c11473F11N9057B5530a79588n1993
9322b31581C0302i042A6693J03111b11897k7312B17917G3676b79570C8063a53103
9310a70537I0012l4557a8221a827j36343M952C5250J18996B2291N3670B153P0445
9298G2598l5385a49024j16913L6959I7114l9488c9559j76682M7880A41210o8803
9287G2407A9022a63901F7456b31035h6709D26532b20473N1433G5217a24585f0071
9275G1270a71455F1095A0222J8117h1579m1167j24629K9764j49315d8015j15906
9264a63921G1417b04036J2732q5446B32874c0598p7274q3397M3351O68k16183
9253c63433a60956C2097e3367m3585o968j80262r760C3001J2949a04823K9871
$$ plain form
9242 -74952 164784 136895 -257661 47981 -68117 -242061 -98517 73834 19974 -44175 3277
9230 66993 -111353 -177464 -455645 -2979 -80476 -131267 122420 -261423 -45945 -1050 323028
9218 -186573 -264636 20661 -71866 -87029 -32526 -163595 -224205 -5127 272313 -251616 -246101
9207 -246101 -51446 -170024 64068 10567 -100302 80511 -282994 -13820 -213269 -30496 239579
9195 -141728 -62831 -95355 41105 43507 316945 -36268 39215 -171471 -69541 247302 -110201
9183 -230371 -50445 -430820 69639 -207024 -184839 -83728 -11237 -79768 -70688 -340712 -244440
9172 -244440 -47467 154144 -247356 81599 48601 64528 -269906 -202054 257973 -143178 15119
9160 -24060 178925 95851 -323205 -91026 -167187 -238693 92414 -118476 232778 -142529 95530
$$ packed form
9242g4952A64784k7889b57661D7981f8117j73944i8517G3834A9974d4175C277
9230F6993a11353o6111k78181b979p7497n0791A22420b61423d5945a050C23028
9218a86573p8063B0661g1866j5163c2526j31069o0610e127B72313b51616N515
9207b46101e1446j18578F4068A0567a00302H0511b82994a3820j99449c0496B39579
9195a41728f2831l2524D1105K402K73438c6268C9215a71471f9541B47302a10201
9183b30371e0445l80375F9639b07024K2185h3728a1237o8531R080k70024R6272
9172b44440d7467A54144b47356H1599l2998J5927b69906O7852B57973a43178A5119
9160b4060A78925q3074c23205i1026p6161p1506I2414a18476B32778a42529I5530
$$ plain form
9148 152274 -72640 89494 -271861 -271620 -298648 -152965 144275 -118144 -135975 54946 48779
9137 48779 -74768 -63013 202681 75057 -367513 60745 -498222 -67432 -211175 -289251 172
9125 107804 85393 107470 -85942 226376 331794 129101 11371 -192028 36479 -51195 261194
9113 106069 96502 -183214 -83144 323762 81513 -348399 -134799 -7753 79867 42233 -115375
9101 80841 -114812 145563 -201974 -162263 121604 -50101 -39575 -46655 -6221 -3009 114821
9089 -48916 -302883 -99361 -64413 262768 -185843 -334215 -271983 116212 101021 -212580 91556
9077 29038 -55154 -140676 21078 -25841 -155914 138417 70766 -95992 -71274 191087 -188602
9065 -93319 17395 176439 194914 -134530 21223 107646 -298009 67801 -67300 27626 -215585
$$ packed form
9148A52274g2640H9494b71861K41k7028J45683A44275a18144j7831E4946o167
9137D8779g4768J1755B02681G5057c67513F0745d98222f7432j43743p8076A72
9125A07804k2411K2077h5942B26376J05418A29101A1371a92028C6479e1195B61194
9113A06069r567a83214h3144C23762H1513c48399a34799g753G9867l7634a15375
9101H0841a14812A45563b01974L9711A21604e0101J0526p080f221c009A14821
9089d8916k53967i9361L4948B62768a85843j48372O2232A16212j5191b12580I1556
9077B9038e5154q5522B1078b5841j30073A38417o7651i5992K4718A91087a88602
9065i3319A7395J59044J8475a34530B1223Q6423b98009F7801f7300B7626b15585
$$ plain form
9053 269220 -35872 28543 -345307 -6985 -262029 91336 143628 -111646 -99598 85586 3592
9041 27680 245840 -18062 41929 -83534 6137 36510 230626 -199479 -81023 -93807 -325972
9030 -325972 -222773 -194463 -289158 -74038 -11918 -334374 220787 -116080 -384539 274973
9019 -201108 -278745 -242863 -225398 3503 -207992 -235288 -116250 -170190 -115620 320739 -13193
9007 -253108 -33506 -176588 46584 -223133 -284188 -153582 25310 -10551 171296 -187428 -316427
8996 -316427 50754 398353 12128 41543 -254362 -127684 343304 43118 41999 23855 -139850
8984 -192329 -291365 22990 -178696 -120658 -249464 -12394 -40806 -184150 156134 -162989 23269
8972 -78805 -76708 84533 207543 10924 -333385 17731 153074 -53348 236125 -588043 157564
$$ packed form
9053B69220c5872B8543c45307f985k55044I1336N2292a11646J2048H5586C592
9041B7680K18160a8062D1929h3534F137L0373J94116a99479h1023j2784k32165
9030c25972J03199K8310r4695g4038a1918l22456B20787a16080k68459B74973
9019b01108p7637L5882J7465C503b07992k7296a16250n3940N4570C20739a3193
9007b53108c3506j43082D6584b23133o1055J30606B5310a0551A71296a87428j28999
8996c16427E0754L47599A2128K9415b54362J26678C43304D3118j119j8144a39850
8984a92329r9036B2990a78696N8038j28806a2394k8412j43344A56134a62989B3269
8972g8805K097H4533J23010A0924c33385A7731J35343e3348B36125e88043A57564
$$ plain form
8960 -147913 -230885 96082 -202753 91844 -232694 5971 -197385 157702 -142943 -12038 -288311
8949 -288311 -205677 138497 -22277 269048 -532330 -68819 43247 65231 -42990 126856 12621
8937 -57094 104 3617 325973 -241424 212850 -2638 -236453 92571 -66115 -315650 109413
8925 -308053 332978 -219358 30757 83050 -65649 -100559 -378218 148949 263311 57401 421285
8914 421285 -142439 -74960 226033 119232 354807 360888 394520 631177 1251444 2346433
8904 2346433 5022932 9533175 4540382 2160020 1305432 861491 357118 207914 332200
8895 332200 135170 122299 120592 278055 -45390 -21826 -301820 93834 308645 48914 52033
8884 52033 52858 -219592 -220960 -88840 69031 -44708 69221 154260 -454312 -193930 104153 -111152
$$ packed form
8960a47913q2972I6082b02753I1844b32694E971a97385A57702a42943a2038k76273
8949b88311Q2634A38497b2277B69048e32330f8819D3247K1984d2990A26856A2621
8937e7094A04L513L22356b41424B12850b638k33815I2571f6115k49535A09413
8925c08053C32978b19358C0757N2293f5649l4910k77659A48949J14362E7401L63884
8914D21285a42439O7479B26033j06801K35575O081L3632K36657O20267J094989
8904B346433K676499M510243D540382B160020q54588m43941C57118j49204J24286
8895C32200A35170j2871j707J57463d5390b1826k79994I3834K14811D8914L119
8884E2033Q25b19592j368h8840F9031d4708F9221Q5039d54312a93930A04153a11152
$$ plain form
8871 -149268 -4437 292350 -326775 100487 -162653 -31746 -127945 -60236 -179417 -174349 -145213
8860 -145213 158463 -101484 -92790 130994 -55433 48597 -133452 -116314 -240554 50159 -41967
8848 -189753 43031 -4694 3219 273491 -176741 44844 64101 14027 -20948 -18364 -100929 -130410
8836 -130410 -313564 31771 -163048 120123 82927 -96792 176670 -170893 -142350 -20235 -49930
$$ packed form
8871a49268d437B92350c26775A00487a62653c1746r6199f0236j19181N068K9136
8860a45213A58463a01484Q694A30994e5433D8597a33452J7138j24240E0159d1967
8848a89753D3031d694C219K70272a76741D4844J9257A4027b0948K584q2565k9481
8836a30410j83154C1771a63048A20123l7196i6792A76670a70893K8543b0235k9695
$$ [...]
##END NTUPLES=NMR SPECTRUM
##END=
