
##TITLE=AC1081_MACI02_5818930_ALTKwGDv5L
##JCAMPDX= 6.0         $$ Bruker NMR JCAMP-DX V2.0
##DATA TYPE= NMR SPECTRUM
##DATA CLASS= NTUPLES
##ORIGIN= BRUKER
##OWNER= Administrator
$$ 1.72 TOPSPIN		Version 2.1
$$ 2012-03-24 23:07:15.312 -0500  Administrator@TOPSPIN
$$ Compression mode = diff/dup
##.OBSERVE FREQUENCY= 400.13188235
##.OBSERVE NUCLEUS= ^1H
##.ACQUISITION MODE= SIMULTANEOUS (DQD)
##.ACQUISITION SCHEME= undefined
##.AVERAGES= 64
##.DIGITISER RES= 22
##SPECTROMETER/DATA SYSTEM= spect
##.PULSE SEQUENCE= noesygpps1d.comp
##.SOLVENT NAME= COFFEE_meoh
##.SHIFT REFERENCE= INTERNAL, COFFEE_meoh, 1, 14.96836
##AUDIT TRAIL= $$ (NUMBER, WHEN, WHO, WHERE, PROCESS, VERSION, WHAT)
$$ ##TITLE= Audit trail, TOPSPIN		Version 2.1
$$ ##JCAMPDX= 5.01
$$ ##ORIGIN= Bruker BioSpin GmbH
$$ ##OWNER= Administrator
$$ $$ C:\Bruker\TOPSPIN/data/COFFEE/nmr/AC1081_MACI02_5818930_ALTKwGDv5L/12/pdata/1/auditp.txt
$$ ##AUDIT TRAIL=  $$ (NUMBER, WHEN, WHO, WHERE, PROCESS, VERSION, WHAT)
(   1,<2012-03-24 23:07:10.359 -0500>,<Administrator>,<TOPSPIN>,<go>,<TOPSPIN 2.1>,
      <created by zg
	started at 2012-03-24 22:55:38.453 -0500,
	POWCHK enabled, PULCHK disabled,
       configuration hash MD5:
       1A 1E CE 29 27 FD 77 03 67 4E F0 E3 C4 B2 CB 90
       data hash MD5: 64K
       56 3D 00 81 20 E2 53 19 2C 44 D6 F3 0C 80 7F F8>)
(   2,<2012-03-24 23:07:13.250 -0500>,<Administrator>,<TOPSPIN>,<proc1d>,<TOPSPIN 2.1>,
      <Start of raw data processing
       efp LB = 0.3 FT_mod = 6 PKNL = 1 PHC0 = 0 PHC1 = 0 SI = 128K 
       data hash MD5: 128K
       E4 F1 D9 23 3D A6 19 EE 4B 03 5E C6 D0 D3 75 CD>)
(   3,<2012-03-24 23:07:14.453 -0500>,<Administrator>,<TOPSPIN>,<proc1d>,<TOPSPIN 2.1>,
      <pk PHC0 = 39.24316 PHC1 = 0 
       data hash MD5: 128K
       F0 95 A9 74 69 D5 09 69 B0 55 F8 A2 29 95 BF 4C>)
(   4,<2012-03-24 23:07:15.000 -0500>,<Administrator>,<TOPSPIN>,<proc1d>,<TOPSPIN 2.1>,
      <abs ABSG = 1 
       data hash MD5: 128K
       D8 07 0F 1C 32 39 BE A3 9E CB 4F 2F A2 A3 0F 65>)
(   5,<2012-03-24 23:07:15.078 -0500>,<Administrator>,<TOPSPIN>,<proc1d>,<TOPSPIN 2.1>,
      <abs ABSG = 2 
       data hash MD5: 128K
       7E 57 F1 DE 58 93 67 1D 23 20 93 8F 39 5D E6 8D>)
(   6,<2012-03-24 23:07:15.125 -0500>,<Administrator>,<TOPSPIN>,<proc1d>,<TOPSPIN 2.1>,
      <abs ABSG = 3 
       data hash MD5: 128K
       C3 85 BB 79 4C 63 CE F7 6A 9B A5 FA 9C B1 BE 67>)
(   7,<2012-03-24 23:07:15.187 -0500>,<Administrator>,<TOPSPIN>,<proc1d>,<TOPSPIN 2.1>,
      <abs ABSG = 4 
       data hash MD5: 128K
       2A 55 53 48 87 F7 7B BD 96 96 07 F1 81 A4 CF 7E>)
(   8,<2012-03-24 23:07:15.234 -0500>,<Administrator>,<TOPSPIN>,<proc1d>,<TOPSPIN 2.1>,
      <abs ABSG = 5 
       data hash MD5: 128K
       EF 5B BE C4 01 7C 3A 44 9A A4 B7 9F 02 73 C2 D4>)
$$ ##END=
$$ 
$$ $$ hash MD5
$$ $$ 54 38 23 C0 81 F7 ED 74 BA 58 F7 08 BF 77 81 5A
##$RELAX= 
##$RELAX= 
##$RELAX= 
##$RELAX= 
##$RELAX= 
##$RELAX= 
##$RELAX= 
##$RELAX= 
$$ Bruker specific parameters
$$ [...]
##$TP07= 0
##$TPNAME0= <>
##$TPNAME1= <>
##$TPNAME2= <>
##$TPNAME3= <>
##$TPNAME4= <>
##$TPNAME5= <>
##$TPNAME6= <>
##$TPNAME7= <>
##$TPOAL= (0..7)
0.5 0.5 0.5 0.5 0.5 0.5 0.5 0.5
##$TPOFFS= (0..7)
0 0 0 0 0 0 0 0
##$TUNHIN= 0
##$TUNHOUT= 0
##$TUNXOUT= 0
##$USERA1= <user>
##$USERA2= <user>
##$USERA3= <user>
##$USERA4= <user>
##$USERA5= <user>
##$V9= 5
##$VALIST= <valist>
##$VCLIST= <CCCCCCCCCCCCCCC>
##$VD= 0
##$VDLIST= <DDDDDDDDDDDDDDD>
##$VPLIST= <PPPPPPPPPPPPPPP>
##$VTLIST= <TTTTTTTTTTTTTTT>
##$WBST= 2048
##$WBSW= 25
##$XGAIN= (0..3)
0 0 0 0
##$XL= 0
##$YL= 0
##$YMAX_a= 14500527
##$YMIN_a= -6268541
##$ZGOPTNS= <>
##$ZL1= 120
##$ZL2= 120
##$ZL3= 120
##$ZL4= 120
##$ABSF1= 14.96836
##$ABSF2= -5.58417
##$ABSG= 5
##$ABSL= 3
##$ALPHA= 0
##$AQORDER= 0
##$ASSFAC= 0
##$ASSFACI= 0
##$ASSFACX= 0
##$ASSWID= 0
##$AUNMP= <proc_prof1d_extract.lims>
##$AXLEFT= 0
##$AXNAME= <>
##$AXNUC= <1H>
##$AXRIGHT= 0
##$AXTYPE= 0
##$AXUNIT= <>
##$AZFE= 0.1
##$AZFW= 0.1
##$BCFW= 0
##$BC_mod= 0
##$BYTORDP= 0
##$COROFFS= 0
##$CY= 15
##$DATMOD= 1
##$DC= 0
##$DFILT= <>
##$DTYPP= 0
##$F1P= 0
##$F2P= 0
##$FCOR= 0.5
##$FTSIZE= 131072
##$FT_mod= 6
##$GAMMA= 0
##$GB= 0
##$INTBC= 1
##$INTSCL= 1
##$ISEN= 128
##$LB= 0.3
##$LEV0= 0
##$LPBIN= 0
##$MAXI= 10000
##$MC2= 0
##$MEAN= 0
##$ME_mod= 0
##$MI= 0
##$NCOEF= 0
##$NC_proc= -3
##$NLEV= 6
##$NOISF1= 0
##$NOISF2= 0
##$NSP= 0
##$NTH_PI= 0
##$NZP= 0
##$OFFSET= 14.96836
##$PC= 1
##$PHC0= 39.24316
##$PHC1= 0
##$PH_mod= 1
##$PKNL= yes
##$PPARMOD= 0
##$PPDIAG= 0
##$PPIPTYP= 0
##$PPMPNUM= 2147483647
##$PPRESOL= 1
##$PSCAL= 4
##$PSIGN= 0
##$PYNMP= <proc.py>
##$REVERSE= no
##$SF= 400.130004902308
##$SI= 131072
##$SIGF1= 0
##$SIGF2= 0
##$SINO= 400
##$SIOLD= 131072
##$SPECTYP= <>
##$SREGLST= <1H.CDCl3>
##$SSB= 0
##$STSI= 131072
##$STSR= 0
##$SW_p= 8223.68421052632
##$SYMM= 0
##$S_DEV= 0
##$TDeff= 65536
##$TDoff= 0
##$TI= <>
##$TILT= no
##$TM1= 0
##$TM2= 0
##$TOPLEV= 0
##$USERP1= <user>
##$USERP2= <user>
##$USERP3= <user>
##$USERP4= <user>
##$USERP5= <user>
##$WDW= 1
##$XDIM= 131072
##$YMAX_p= 525007424
##$YMIN_p= -101471087
##$CURPLOT= <Network HP LaserJet P1505>
##$CURPRIN= <$Network HP LaserJet P1505>
##$DFORMAT= <normdp>
##$LAYOUT= <+/1D_H.xwp>
##$LFORMAT= <normlp>
##$PFORMAT= <normpl>
##$SURQMSG= 1
$$ End of Bruker specific parameters
$$ ---------------------------------
##NTUPLES= NMR SPECTRUM
##VAR_NAME=  FREQUENCY,     SPECTRUM/REAL,   SPECTRUM/IMAG
##SYMBOL=    X,             R,               I
##VAR_TYPE=  INDEPENDENT,   DEPENDENT,       DEPENDENT
##VAR_FORM=  AFFN,          ASDF,            ASDF
##VAR_DIM=   131072,        131072,          131072
##UNITS=     HZ,            ARBITRARY UNITS, ARBITRARY UNITS
##FACTOR=    0.0627417313425165, 1,          1
##FIRST=     8223.62146879498, 4638,         -115187
##LAST=      0,             8972,            -114402
##MIN=       0,             -101471087,      0
##MAX=       8223.62146879498, 525007424,    0
$$ Real data points
##PAGE= N=1
##DATA TABLE= (X++(R..R)), XYDATA
$$ [...]
66894 2265782 2292779 2321783 2351086 2380390 2410902 2443204 2476357 2509234 2541620 2573643 2605211
66883 2605211 2636604 2668809 2702533 2737412 2772592 2807523 2841862 2875346 2908331 2941762 2975989
66872 2975989 3010235 3043882 3077617 3112594 3149019 3186368 3224362 3262746 3300542 3336691 3371280
66861 3371280 3405171 3438563 3470973 3502620 3534736 3568250 3602966 3638216 3673477 3708138 3741540
66850 3741540 3773672 3805193 3836437 3867037 3896879 3926774 3957641 3989361 4020712 4050120 4076381
66839 4076381 4099261 4119804 4139687 4159986 4180720 4201404 4221314 4239268 4254305 4267109 4279854
66828 4279854 4293806 4307604 4318574 4325272 4328146 4328452 4327561 4326898 4327179 4327424 4325485 4319920 4310938 4299540
66814 4299540 4286388 4271643 4255367 4237760 4219276 4200500 4181594 4161922 4140682 4117934 4094502
66803 4094502 4070798 4046245 4019898 3991154 3959872 3926520 3892437 3859259 3827632 3796873 3766077
66792 3766077 3734818 3702332 3667040 3628095 3587057 3546763 3508349 3470313 3430764 3389670 3348397
66781 3348397 3307845 3267881 3228196 3188855 3150052 3111939 3074718 3038417 3002503 2966090 2928587
66770 2928587 2889893 2850213 2810207 2771255 2734759 2700785 2667789 2633940 2598431 2561513 2523981
66759 2523981 2487059 2452070 2419365 2387770 2355756 2323060 2290597 2258927 2227600 2196113 2164733
66748 2164733 2133981 2103845 2074015 2044618 2016161 1988683 1961327 1932953 1903228 1873109 1844228
66737 1844228 1817736 1793636 1771109 1749263 1727567 1705859 1684171 1662429 1640180 1616887 1592743
66726 1592743 1568928 1546681 1526228 1506807 1487457 1467519 1446818 1426032 1406566 1389369 1373909
66715 1373909 1358846 1343457 1327740 1311453 1294151 1276145 1258313 1240727 1222562 1203765 1185757
66704 1185757 1169869 1156009 1143461 1131992 1121223 1109820 1096537 1081727 1066845 1052697 1039041
66693 1039041 1025596 1012420 999432 986521 974140 962955 952795 942662 931831 920393 908821
66682 908821 897713 887876 879748 872532 864631 855236 844995 835022 825873 817607 810061 802598 794132 783949
66668 783949 772384 760554 749658 740566 733574 728174 723224 717531 710421 701990 693152 685158 678632
66655 678632 673150 668076 663429 659324 654993 649376 642667 636261 630995 626413 621965 617877 614285 610408
66641 610408 605387 599366 593039 586605 579815 572744 565842 559475 553860 549175 545213 541160 536272 530666
66627 530666 525101 520132 515717 511403 506646 501224 495637 490759 486819 483085 478845 474236 469772 465600
66613 465600 461759 458618 456319 454118 451170 447873 445654 445244 445662 445072 442350 437806 432746 428384 424983
66598 424983 422016 419109 416415 413870 410701 406272 401131 396558 393215 390782 388757 386961 385208 383090
66584 383090 380294 376883 373251 369969 367507 365767 364054 361919 359761 358070 356341 353453 349216 344928
66570 344928 342184 341444 341797 341788 340479 338052 335471 333346 331344 328866 325877 322572 318708 314120 309716
66555 309716 307070 306923 308677 311300 313930 315684 315900 314857 313473 311912 309342 305563 302025 300434 300745
66540 300745 301315 300880 299733 298839 298253 296742 293125 287966 283588 281940 282545 283059 281843 279412 277324 276337
66524 276337 275941 275148 273310 270542 267702 265667 264454 263375 262078 260955 260327 259849 259008 257747 256239
66509 256239 254553 252894 251769 251553 252166 253380 254948 256202 256115 254268 251461 248996 247618 247251 247193 246369
66493 246369 244080 240941 238441 237087 235630 232715 228643 224846 222251 220943 220857 221758 222768 222860 221812
66478 221812 220030 217696 214795 211741 209160 207137 205479 204556 204940 206149 206594 205174 202414 199859 198715
66463 198715 199014 199676 199468 198339 197618 198366 199811 200157 198606 195743 192213 188303 184906 183521 184648 187077
66447 187077 189344 191145 192767 193942 194093 193261 192001 190643 189226 187879 186651 185059 182363 178358 173760
66432 173760 169832 167654 167375 168018 168352 168141 168100 168465 168234 166356 163214 160263 158419 157515 157321 158322 161015
66415 161015 164737 167681 168366 166984 165132 164158 164008 163869 163527 163467 163784 163798 163056 162158 162050 162790 163465 163291
66397 163291 162503 162165 163114 164970 166266 165847 164130 162635 162313 162887 163815 165092 166693 167887 167760 166209
66381 166209 164017 162135 161109 160791 160265 158518 155697 153354 152947 154399 156510 158312 159375 159246 157654
66366 157654 155317 153728 153778 154951 155989 156004 155003 153826 153621 154926 157068 158731 159106 158262 156597 154467
66350 154467 152250 150122 147730 144752 141863 140378 140559 141063 140745 140358 141451 143814 145109 143357 139119
66335 139119 134756 132114 131386 131770 132399 132650 132284 131653 131362 131477 131373 130562 129229 127677 125794 123631 122080
66318 122080 122152 123717 125664 127190 128157 128351 127517 126288 125871 126253 125864 123799 121315 120095 120068 120331 121311
66301 121311 124018 127275 127836 124020 117812 112614 110060 109772 110881 112499 113635 114134 115351 118565 122896
66286 122896 125958 126571 125623 124188 122229 119730 117890 118044 120004 122420 124432 126027 127041 126901 125531
66271 125531 123635 121754 119799 117900 116958 117625 119177 120084 119489 117577 114853 111862 109411 108056 107162
66256 107162 105376 102413 99625 98373 98637 99877 102358 106434 110922 113576 113537 112264 111560 111466 110788 109167
66240 109167 107625 107113 107385 107636 107750 108280 109379 110418 110898 111197 111841 112277 111236 108498 105691 104779 106069
66223 106069 108088 109178 108845 107811 107305 108195 110301 112484 113702 113885 113607 113246 112978 113233 114290 115433
66207 115433 115337 113548 110926 108457 106333 104546 103489 103194 102577 100472 97378 95291 95580 97600 99667
66192 99667 100933 101913 103417 105394 106908 107014 105559 103258 101138 99892 99608 99988 100786 102012 103699 105557
66176 105557 107103 108188 109103 109955 110222 109317 107425 105298 103253 100968 98452 96596 96290 97238 98193 98304
66160 98304 97823 97423 97264 97077 96911 97269 98238 98823 97762 95058 92239 90748 90495 90491 90570 91652 94238 97334
66142 97334 99187 98715 96093 92523 89746 89153 90655 92585 93244 92528 91751 92049 93421 95196 96880 98357
66126 98357 99648 100743 101542 101844 101507 100689 99821 99249 99013 99016 99271 99806 100324 100250 99365 98328 98139 98912 99527
66107 99527 98950 97543 96456 95848 94649 92377 90273 89897 91132 92465 93000 93291 94235 95970 98071 100093
66091 100093 101487 101624 100447 98800 97676 97338 97447 97756 98205 98552 98469 97951 97209 96180 94647 92937 91948
66074 91948 92212 93243 94127 94526 94775 95114 95156 94083 91272 86988 82625 79932 79544 80401 80991 81016 81381 82741
66056 82741 84739 86680 88173 88907 88583 87563 86930 87325 88190 88708 88963 89447 89977 90093 90185 91024 92214 92380
66038 92380 91216 90194 90584 91726 92147 91598 90973 90675 90236 89488 89059 89340 89717 89297 88028 86707 86079
66021 86079 86160 86355 86093 85398 84859 84926 85353 85535 85234 84602 83528 81580 78885 76652 76205 77632 79849 81978
66003 81978 84110 86529 88745 89912 89994 89858 90108 90341 89844 88575 87126 86055 85783 86862 89644 93537
65987 93537 97124 99347 100263 100513 100399 99826 98860 97876 97132 96528 95860 95140 94561 94329 94635 95651 97259 98870
65969 98870 99813 100080 100283 100556 99938 97596 94475 92676 92871 93328 92241 90213 89386 90609 92686 94274
65953 94274 95213 95746 95644 94794 93892 93863 94962 96771 98624 99737 99578 98584 97976 98306 98655 97835 95941 94058
65935 94058 92666 91071 88480 85174 82567 82313 85146 90127 95041 97930 98447 97758 97287 97642 98482 99041
65919 99041 98694 97196 94651 91609 89237 88788 90218 91645 91038 88481 86034 85375 86418 88305 90596
65904 90596 92934 94597 95171 95049 94653 93851 92768 92347 93230 94667 95383 95034 94035 92660 91325 91137 92888
65887 92888 95778 98241 99840 101235 102573 103197 103048 103096 104027 105419 106482 106801 106183 104637 102772 101452
65871 101452 100831 100378 99889 99659 99561 98953 97794 96897 96737 96917 97301 98733 101834 105704 108619 109748 109653
65854 109653 109305 109053 108441 106817 104246 101844 100937 101866 103995 106575 108910 109820 108123 104091 99638 96530
65838 96530 94926 93977 93079 91979 90353 88127 86010 85128 86101 88610 91636 94030 95318 96124 97443 99429
65822 99429 101322 102407 102414 101149 98810 96702 96352 97423 97758 96123 93705 92034 90694 88426 85543 83633
65806 83633 83298 83721 84320 85403 87087 88721 89709 90047 89907 89539 89671 91123 93772 96570 98746 100315
65790 100315 101299 101265 99996 98054 96229 94835 93756 92878 92336 92608 94280 97261 100278 101761 101286 99713
65774 99713 98029 96775 96545 97958 100676 103256 104602 105003 105249 105415 105393 106097 108913 113721 118363 120623
65758 120623 120404 119537 119607 120354 120268 118538 116182 115059 115837 117221 117476 116530 116073 117499 120211 122336 122771
65741 122771 121935 120705 119381 117993 116968 116860 117626 118640 119262 119062 117702 115091 111592 107748 104004
65726 104004 100975 99490 99690 100526 101027 101760 103854 106731 108192 107167 105053 103671 103066 102190 100805 99643
65710 99643 99303 99901 101301 102898 103774 103835 104121 105160 105915 105455 104705 105014 105653 104678 102021 99738 98933 98387
65692 98387 96933 95405 95112 95735 96124 96235 96895 98023 98429 97431 95816 94990 95623 97178 98397 98257 96718
65675 96718 94602 92705 91151 89511 87285 84353 81350 79499 79559 81007 82782 84617 86761 88568 88660
65660 88660 86873 84821 83919 83948 84335 85581 88114 90658 91409 90468 89500 89107 88234 86577 85896 87858 91486
65643 91486 93867 93027 89369 84748 80978 79097 79146 80369 82016 83997 86501 89063 90630 90694 89926 89444
65627 89444 89740 90494 91012 90570 88831 86431 84850 85111 86745 88625 90526 92986 95679 97118 96525 95081
65611 95081 94553 95315 96615 98201 100581 103763 106701 108106 107116 103321 97081 90112 84959 83280 84746
65596 84746 87592 89862 90337 88957 86588 84015 81260 78354 76421 76924 79711 82685 83847 83052 81577
65581 81577 80700 80963 82055 82936 82579 80947 78955 77524 77268 78799 82119 85668 87372 87198 87287 88919
65565 88919 90708 90797 89514 88525 88399 88583 88970 89837 90632 90482 89759 89693 90460 91014 90721 89795 88204 85747
65547 85747 83439 83152 85232 87755 88879 88813 88729 88915 88973 88946 89081 88957 87843 85721 83308 81346 80536 81781
65529 81781 85623 91282 96751 100008 100196 97990 95096 93073 92198 91554 90302 88621 87287 86777 86911 86807
65513 86807 85033 80637 74746 70516 70547 74415 79330 82929 84676 84918 83880 82103 80914 81502 83711
65498 83711 86278 88188 89344 90038 90352 90308 90157 90115 90059 89900 90086 91202 93036 94615 95402 95919 96801 97713
65480 97713 97806 96896 95536 94102 92532 91020 90322 91128 93422 96465 99143 100505 100420 99558 98261 95864
65464 95864 91867 87443 84569 83684 83422 82880 82788 83865 85320 85994 86018 86211 86591 86662 86671 87331 88511 89348 89648
65445 89648 90185 91606 93938 97202 101455 105875 108675 108579 106093 102999 100811 99859 99629 99692 100244 101656
65429 101656 103603 105089 105527 105349 105250 105365 105591 106072 106798 107366 107875 109351 112267 115280 116737 117020 117904
65412 117904 119842 121597 122641 124077 126523 128775 129586 129491 129750 130511 131157 131561 131703 130745 127934 124143
65396 124143 121273 120076 119574 118567 116831 114753 112653 110723 109079 107688 106527 105737 105291 104779 103989
65381 103989 103428 103669 104409 104716 104070 102664 100963 99625 99489 100801 102480 102950 101714 99482 96967 94463
65365 94463 92562 92139 93169 94338 94378 93354 92377 92471 93885 95988 97627 98137 98126 98684 99699 99736 97918
65348 97918 95205 93393 93453 95268 98223 101325 103237 103021 100814 97492 94108 91990 92609 96364 101623
65333 101623 105759 107185 106145 103928 102002 101601 103126 105767 108332 110640 113538 117471 121699 125210
65319 125210 127887 130305 132791 135251 137793 140942 144979 149364 153210 156402 159915 164710 170547 176380
65305 176380 181909 188092 195798 204560 213214 221354 229456 237805 246089 254068 261806 268893 274043 276052
65291 276052 275005 272201 268921 265407 260878 254411 245838 235951 225865 216311 207549 199640 192430 185504
65277 185504 178698 172701 168540 166265 164611 162287 159220 156170 153517 151047 148772 147198 146394 145232
65263 145232 142150 136796 130519 125015 120685 116670 112457 108914 107395 108069 109519 109995 108759 106328 103894
65248 103894 102668 103321 105485 107703 108279 106615 103841 101887 101666 102204 101777 99763 97024 94538 92370
65233 92370 90275 88629 88060 88434 88868 88619 87494 85646 83645 82502 82807 83893 84685 85309 86840 89316
65217 89316 91264 91745 91738 92556 93842 94258 93538 92520 91460 89770 87566 86204 86683 88407 90043 90944 91237
65200 91237 91215 91344 92359 94482 96672 97366 96136 94188 93094 93311 94031 94205 93456 92134 90719 89444
65184 89444 88468 88129 88658 89756 90844 91768 92844 94166 95362 96186 96753 96866 95949 94369 94106 96744 100932
65167 100932 103246 101988 98952 96852 96164 95542 94344 93094 91807 89614 86527 84245 84299 86108 87665
65152 87665 87633 86113 83823 81409 79450 78292 77701 77125 76419 75936 75885 76073 76432 77397 79377 82039 84470
65135 84470 86066 86884 86964 85696 82528 78363 75410 74981 75874 75872 74578 73595 73883 74356 73832 73026 73346 74574
65117 74574 75309 75293 75670 76889 77891 77850 77452 77684 78361 78756 79038 80119 82341 84960 86894 87546 87081 86223
65099 86223 85659 85503 85556 86107 87869 90758 93290 93712 91631 88338 85880 85941 88963 93739 98128 100630
65083 100630 101220 100660 99623 98720 98547 98961 98842 97376 95264 93906 93676 93726 93300 92422 91440 90727 90852 92197
65065 92197 94196 95568 95535 94401 92924 91682 91075 91282 92016 92860 93995 96037 98957 101724 103289 103487
65049 103487 102809 101878 101431 102191 104200 106649 108836 111008 113803 117173 120435 123368 126778 131783 138646
65034 138646 146293 153003 157811 161351 165118 169878 175154 180368 185803 191902 198061 202994 206340 209208
65020 209208 212806 216954 220329 221918 221814 220697 219074 217325 216125 216083 216749 216455 213772 208930 203288
65005 203288 197472 190820 182879 174558 167108 160536 153953 147259 141455 137102 133350 129028 124193 120014
64991 120014 117349 115871 114481 112318 109480 106931 105476 104649 103030 100013 96789 94995 94765 94897 94680
64976 94680 94477 94404 93653 91719 89390 87779 87083 87051 87810 89074 89259 86968 83254 80903 81243 83071 84981
64959 84981 87045 89340 90524 89576 87971 88273 90747 92891 92475 89777 86681 84747 84512 85593 86944
64944 86944 87696 88130 89199 90931 92199 92402 92395 93146 94327 94970 94668 93240 90014 84792 79209 75723 75078
64927 75078 75844 76681 77858 80049 82768 84961 86454 87721 88555 88256 87223 87174 89127 91888 93322 92692
64911 92692 90972 89113 87081 84820 83193 83184 84569 86111 86970 87334 87721 88286 88905 89390 89383 88483 86800 85031
64893 85031 83634 82267 80525 79001 79008 81107 84338 87076 88366 88267 87300 86017 84945 84402 84163 83640 82675
64876 82675 81975 82369 83682 84702 84389 82858 80964 79184 77318 75280 73728 73569 74999 77377 80165
64861 80165 83638 88245 93324 96958 97567 95540 92922 91437 91056 90502 88840 86397 84387 83813 84668 86112
64845 86112 87454 88815 90586 92417 93334 92971 92086 91491 90945 89625 87359 84844 82809 81422 80471 79668
64829 79668 78888 78503 79376 81966 85314 87428 86995 84606 82165 81205 81714 82441 82253 81277 80640 81176 82735
64812 82735 84866 87541 90633 93125 93769 92567 90911 90091 90170 90439 90359 89816 89021 88542 89037 90579 92489
64795 92489 94068 95138 95668 95320 93916 92113 91037 91224 92242 93309 93898 93728 92659 90912 89152 87967
64779 87967 87254 86420 85219 84010 83025 81847 80121 78554 78471 80282 82984 85363 87024 87961 87939 87079 86518
64762 86518 87504 89861 92048 92739 91764 89608 86748 83712 81222 79917 80093 81724 84490 87838 91270
64747 91270 94529 97303 99124 99906 100228 100525 100319 98961 96854 95202 94722 95357 96962 99212 100830 100072
64731 100072 96402 91036 85693 81569 79565 80309 83309 86850 89387 90745 91684 92851 94351 95781 96449
64716 96449 96134 95742 96470 98171 99349 98937 97267 95155 93102 91667 91359 91545 90705 88651 87327 88352
64700 88352 90708 92115 92021 91888 92954 94991 97166 98991 100325 101285 102313 103780 105487 106940 107925 108440
64684 108440 108401 107883 107300 106881 106346 105458 104473 103604 102694 101884 101914 103075 104512 105282 105491 105681 105814 105743 105897
64665 105897 106553 107121 107175 107414 108344 108769 107143 103972 101282 99941 99142 98340 97963 97977 97433 96099 95228 96043
64647 96043 98342 101015 103058 103795 103095 101814 101267 101940 103283 104702 105926 106529 106141 105094 103800 101627
64631 101627 97839 93656 91753 93223 96517 99789 102782 105746 108246 110046 111746 113331 113421 111359 108899
64616 108899 108260 109291 110153 110192 110482 111742 113306 114308 114721 114997 115518 116512 117739 118255 117256 115220 113576
64599 113576 113204 113849 114854 115762 116111 115449 113832 111896 110258 109108 108343 107768 107162 106542 106338 107004 108433
64582 108433 110011 111142 111523 111090 110046 108904 108196 108143 108632 109340 109770 109521 108750 108120 108082 108462 108771 108550
64564 108550 107425 105508 103901 103929 105440 106700 106621 106189 106748 107737 107482 105880 104759 105396 106950 107834 107579
64547 107579 106712 105541 103970 102313 101540 102546 105355 109057 112476 114943 116502 117477 118091 118544 119108 119787
64531 119787 120123 119771 119165 119148 119969 121002 121440 120963 119767 118382 117522 117676 118615 119442 119290 118015 116292
64514 116292 115191 115492 117079 118928 119829 119257 117601 115681 114108 112978 112136 111778 112574 114790 117379 118627
64498 118627 117945 116470 115568 115361 115283 115413 116297 117708 118614 118538 118165 118275 118769 119201 119757 120990 122690 123680
64480 123680 123037 121095 118841 116572 113862 111004 109603 110936 114093 116675 117301 116612 115755 114984 114169 113707
64464 113707 114065 114953 115693 116111 116523 117100 117678 117951 117544 116342 114990 114432 114526 113985 112320 110940 111242 112327
64446 112327 112018 109879 107801 107397 108118 108428 107897 107348 107465 108006 108518 109350 111446 114800 117532 117476 114806
64429 114806 112059 111070 111054 110575 110053 110722 112028 112174 110993 110268 110970 112061 112648 113569 115886 119099 121840
64412 121840 123315 123216 121284 118067 115338 114607 115522 116463 116298 114993 113063 111307 110624 111374 113057 115040
64396 115040 117131 119041 120064 120027 119925 120683 121774 122094 121856 122458 124385 126306 126630 125313 123648 122638
64380 122638 122049 121060 119587 118601 118910 119919 120280 119812 119928 121741 124529 126754 128011 129044 130182 130705
64364 130705 129790 127442 124591 122699 123024 125456 128160 129128 128235 127183 127443 128872 130450 131593 132406 133087
64348 133087 133485 133095 131457 128902 126774 126319 127226 127842 127095 125646 124818 124931 125244 125172 124817 124345 123527 122261
64330 122261 121158 121146 122441 124129 124874 123979 121725 118943 116513 115225 115671 117935 121418 125117 128136
64315 128136 129982 130615 130416 130045 130168 131213 133181 135492 137182 137703 137639 138152 139516 140704 140781 140280 140572
64298 140572 142053 143635 144061 143247 142158 141743 142240 143230 144100 144450 144213 143489 142487 141643 141502 142174 143049
64281 143049 143388 143145 142961 143433 144657 146378 148133 149183 148769 146885 144651 143607 144465 146668 149190 151581
64265 151581 153944 156022 156945 156318 155186 155184 156800 159189 161739 164820 168580 171958 173785 174317 174708 175330
64249 175330 175610 175388 175369 176049 177090 178052 178956 179718 179667 178264 176031 174378 174514 176582 179608 182254 183939
64232 183939 185264 187151 189777 192817 196353 200630 204903 207682 208590 209098 210787 213637 216749 220030 224148
64217 224148 229206 234458 239183 243009 245518 246469 246489 246653 247112 246942 245687 244285 243821 243825 242501 238583 232534
64200 232534 226026 220706 217393 215898 215184 213850 210980 206844 202799 200302 199880 200984 202606 203808 203873
64185 203873 202604 200747 199712 200395 202506 205288 208473 212048 215568 218582 221562 225518 230516 235390
64171 235390 239139 241938 244509 247265 250532 254843 260330 266274 271839 276764 280874 283613 284841 285445
64157 285445 286090 285830 283250 278828 274876 273001 272813 273172 273283 272211 268984 264174 260067 258031 256790
64142 256790 254613 252138 251218 251723 251837 251555 253415 258725 264952 268557 269446 270894 275284 281291 285509
64127 285509 286013 284016 282409 282928 284688 285554 284794 283733 283679 284156 283944 283167 283233 284920 287542 290035 292007
64110 292007 293598 295080 296882 299388 302444 305547 308713 312619 317644 323241 328532 333178 337508 342168
64096 342168 347822 354792 362871 371838 382123 394317 407939 421463 434003 446373 460023 475497
64084 475497 492376 510183 528771 548237 568909 590812 612540 631356 645356 655140 662429 667428
64072 667428 668663 665217 657831 647718 635459 621446 606345 590589 574274 558001 542958 529619
64060 529619 517127 504635 492586 481971 473067 465699 460102 456447 453936 451470 449095 447849 448213
64047 448213 449591 451292 453073 454630 455609 456446 458308 461685 465724 469510 473387 478457 485263 493588 503219
64032 503219 514184 526370 539442 553103 567053 580802 593880 606102 617288 626999 635055 642089
64020 642089 648843 654789 658122 657421 652950 646049 637703 628096 617215 605452 593771 583546 575830
64007 575830 570232 564884 558367 551604 546883 544793 543205 539978 535740 532886 532527 533888 536500 541188
63993 541188 548305 556440 563907 570646 577714 585798 595377 607487 622677 639502 655773 671540 689247
63980 689247 710362 733263 755407 776363 797408 818870 839505 858461 876477 894589 912504
63969 912504 928932 943118 955396 966349 976064 984458 992006 999767 1008755 1019612 1032887 1049106
63957 1049106 1068239 1089463 1111820 1134858 1158386 1182058 1205683 1229408 1252810 1274199 1291825
63946 1291825 1305712 1317438 1328315 1338837 1349732 1362005 1375645 1389768 1404695 1422544 1444816
63935 1444816 1470584 1498132 1527401 1559663 1595753 1635964 1680907 1730980 1785405 1843278 1905338
63924 1905338 1973427 2048347 2129489 2216339 2309038 2407555 2511728 2622247 2740324 2866268
63914 2866268 2999679 3141240 3292982 3456270 3630762 3815869 4012297 4221788 4446567
63905 4446567 4689662 4954801 5245276 5563662 5913038 6297514 6721179 7187944 7703366
63896 7703366 8275518 8912872 9621992 10408041 11276145 12230183 13270017 14390787 15584614
63887 15584614 16841967 18151658 19500799 20874916 22257012 23625933 24955869 26217366
63879 26217366 27378871 28409186 29281779 29978927 30491626 30814766 30942461 30868150 30588412
63870 30588412 30105863 29429071 28571771 27553610 26400966 25144722 23815198 22438443
63862 22438443 21036826 19631709 18243828 16891081 15587361 14344215 13172611 12081994
63854 12081994 11077840 10160685 9327331 8572742 7891522 7278651 6729259 6237819 5798046
63845 5798046 5403837 5049930 4731565 4444317 4184791 3950710 3739444 3546837 3368349
63836 3368349 3201148 3044581 2898979 2764627 2641200 2526992 2418844 2313953 2211901
63827 2211901 2114023 2020828 1931179 1844170 1760483 1681106 1605658 1533044 1463237 1397393 1336279
63816 1336279 1279558 1226711 1177816 1132882 1090960 1050641 1011449 974192 939914 908939 881100
63805 881100 856259 834015 813309 793107 773438 755134 738553 723256 708925 695734 683600
63794 683600 672013 661123 652162 646069 642245 639290 636428 633557 630648 628050 626851 627708 629437 629832
63780 629832 627946 624603 620513 614864 606313 594740 581479 568031 554872 541322 526434 510046
63768 510046 492963 476163 460166 445306 432005 420235 409137 397907 386817 376668 367404 358095
63756 358095 348267 338531 329769 322275 315748 309605 303293 296821 290963 286432 282979 279910 277264 275586
63742 275586 274520 272633 268994 264197 259499 255635 252844 251342 251146 251753 252514 253119 253432 253120 251754 249264
63726 249264 246157 243375 241694 240963 240128 238417 236413 235453 236069 237544 238797 239017 237606 234487 230762
63711 230762 228251 227928 229169 230636 231308 230647 228598 225818 223317 221600 220659 220741 222128 223864 223845 221053
63695 221053 217074 214578 214721 216661 219169 221826 224729 227738 230236 231496 231369 230622 230233 230217 229628 227981
63679 227981 226132 225395 226275 228410 231218 234060 236286 237829 239498 242057 245226 248202 251000 254675 260093
63664 260093 266957 274206 281110 287722 294289 300427 305188 308115 309845 311244 312281 312528 312601 313980 316970
63649 316970 319811 320567 319395 318239 318615 320257 321711 321761 320373 318511 316973 315519 313563 311514 310438
63634 310438 310136 308721 304818 299316 294060 289559 285019 280133 275665 272436 270762 270919 273188 277094 281045
63619 281045 283082 282128 279008 276437 277300 282237 289310 296433 303403 311011 319199 327396 335912 345339 354693
63604 354693 361656 364862 364734 361978 356695 349447 341880 335420 330130 325501 321575 318582 316122 313555
63590 313555 310934 308959 308186 308647 309981 311684 313505 315804 319166 323579 328499 333784 339790 346243 351882
63575 351882 355933 359384 364069 370963 380042 391301 404783 419656 434261 447585 460251 473793
63563 473793 489318 507000 526508 547582 570267 594792 621246 649450 679226 710630 743791
63552 743791 778691 815349 853957 894300 935030 974061 1009910 1042265 1071000 1095118 1113251
63541 1113251 1125024 1131408 1133758 1133041 1130139 1126265 1122538 1119298 1116126 1112303 1106839 1098317 1085407 1067769
63527 1067769 1046168 1021634 994884 966717 938539 911983 887946 866108 845447 825330 806204
63516 806204 789140 774500 761232 747848 733937 720392 708347 698572 691675 687861 686191 685095
63504 685095 684295 685481 690315 698465 708519 720313 735113 753561 774670 797239 821459 848616
63492 848616 879682 914492 951889 990370 1028811 1066807 1104171 1140186 1173614 1203347 1228589
63481 1228589 1248543 1262631 1271281 1276004 1278277 1278642 1277090 1274019 1270447 1267286 1264429 1260337 1252536 1238894
63467 1238894 1218742 1192734 1161798 1126569 1087779 1046523 1003777 960024 915813 872438 831516
63456 831516 793750 758426 724424 691680 661507 635329 613187 593715 575568 558557 543253
63445 543253 529884 518057 507400 497898 489582 482341 476165 471192 467274 463801 460191 456371 452541
63432 452541 448702 444800 441386 439755 441050 445159 450757 456560 462333 468454 474880 481131 487206 493799
63418 493799 501354 509428 517189 523970 529055 531701 531932 530709 528633 525064 519393 512664 506811 502469
63404 502469 498672 494762 491474 489772 489554 490054 490884 492223 494380 497533 501516 505740 509832 514491 520989
63389 520989 529436 538072 544801 549073 551964 554900 558894 564679 572839 583599 596705 611604 627746
63376 627746 644881 663184 682993 704507 727872 753438 781633 812650 846536 883356 922873
63365 922873 964370 1007480 1052972 1101928 1154123 1208070 1262711 1318017 1373645 1428041 1479383
63354 1479383 1526417 1567722 1601222 1625551 1641389 1650520 1654045 1652444 1646863 1639058 1629972 1619290
63342 1619290 1606398 1590851 1571782 1547862 1518353 1483747 1445110 1403293 1359004 1313074 1266278
63331 1266278 1219228 1172783 1128190 1086518 1048135 1013053 981501 953834 930033 909760 892993
63320 892993 880257 871996 867807 866530 867096 869190 873134 879486 888895 901911 918396 937295 957590
63307 957590 979502 1004239 1032529 1064148 1099040 1137894 1180896 1226599 1272988 1319346 1366173
63296 1366173 1413498 1460132 1504460 1544850 1579231 1605455 1622769 1632287 1635543 1633278 1626168 1615911
63284 1615911 1604583 1593192 1581592 1569376 1555894 1539579 1518539 1492278 1462100 1429431 1394424
63273 1394424 1356649 1316395 1274585 1231940 1189093 1147146 1107200 1069305 1032701 997239 963888
63262 963888 933649 906684 882789 862008 844205 828448 813359 798005 782319 767051 753595
63251 753595 743311 736406 731613 727305 722773 718284 714451 711900 711001 711231 711240 710214 708873 708414 708820 709031
63235 709031 708446 707177 704965 701135 695942 690874 686945 683480 679291 674536 670709 669064 669561 671213 672978
63220 672978 674363 675522 676906 678844 681502 685070 689607 694780 700076 705302 710557 715884 721383 727549
63206 727549 734843 742866 750469 756758 761542 765023 767813 771264 776810 784634 793598 802660 811688 820778
63192 820778 829751 838705 848138 857973 867354 876061 885416 897053 911401 928057 946969 968316 991674
63179 991674 1016341 1042378 1070547 1101155 1133461 1166216 1198551 1230633 1263742 1299321 1337547
63168 1337547 1377164 1416969 1456934 1497531 1538683 1579991 1621290 1662237 1701961 1740087 1777695
63157 1777695 1816284 1855922 1895188 1932767 1968321 2001834 2032714 2059487 2080052 2092677 2097202
63146 2097202 2094711 2085453 2067930 2041066 2006535 1967621 1926182 1882230 1836286 1790450 1746799 1706109
63134 1706109 1668724 1635528 1607346 1584196 1565817 1552313 1543866 1540434 1542160 1549533 1562649 1580690
63122 1580690 1602378 1626555 1652360 1679481 1708432 1739895 1773617 1808524 1843982 1880131 1916812
63111 1916812 1953131 1988458 2022967 2056696 2088899 2118920 2146855 2172490 2194158 2209521 2217133
63100 2217133 2216559 2207438 2189287 2162142 2126748 2084286 2036442 1985492 1933554 1881644 1829849 1778260
63088 1778260 1727317 1677542 1629656 1584879 1544307 1507786 1473962 1441808 1411709 1384777 1361461
63077 1361461 1341290 1323723 1308710 1296219 1285629 1276014 1267090 1259590 1254520 1252194 1252159 1253836 1256837
63064 1256837 1260595 1264047 1266111 1266536 1266141 1266045 1266602 1267290 1267828 1269097 1272400 1277757 1283604 1288361 1291737 1294207
63048 1294207 1296090 1297868 1300628 1305089 1310545 1315800 1320734 1325766 1330177 1332660 1333668 1335417 1338968 1342965
63034 1342965 1346266 1350203 1356654 1364969 1372685 1378819 1384688 1391507 1398887 1406117 1413508 1421756 1430981 1441173
63020 1441173 1452838 1466378 1481216 1496308 1511437 1527397 1544853 1563465 1582384 1601532 1622242
63009 1622242 1646427 1674933 1706723 1739834 1773228 1807569 1844299 1884205 1926910 1971459 2017199
62998 2017199 2064217 2113165 2164693 2218950 2275525 2333828 2393676 2455668 2520985 2590575 2664320
62987 2664320 2741023 2819209 2897800 2976148 3053884 3131040 3207993 3285011 3362018 3439029 3516526
62976 3516526 3595058 3674713 3755211 3836025 3915828 3992328 4063693 4130071 4192628 4250682 4300729
62965 4300729 4338746 4362559 4371329 4363867 4339071 4297833 4243065 4177494 4102446 4019165 3930202 3838655
62953 3838655 3746775 3656307 3569734 3490048 3419122 3357006 3303053 3257283 3220556 3193847 3177550
62942 3177550 3171165 3173579 3183841 3201633 3226690 3258011 3294160 3334282 3378281 3426026 3476957 3530462
62930 3530462 3585869 3641927 3697024 3750257 3801523 3850227 3894633 3932987 3964558 3988863 4004485
62919 4004485 4009294 4001348 3979003 3941008 3887571 3820788 3742849 3654094 3553947 3443420 3325417
62908 3325417 3202740 3077415 2952087 2830201 2713781 2602335 2495113 2393398 2299172 2212243
62898 2212243 2130408 2052458 1979575 1913360 1853712 1799371 1749576 1704086 1662084 1622351 1584759
62887 1584759 1550522 1520452 1493607 1468333 1444000 1420848 1398593 1376400 1354215 1332910 1312752
62876 1312752 1292815 1272447 1252295 1233212 1215078 1197532 1180878 1165239 1149749 1133884 1118831
62865 1118831 1105956 1094406 1082025 1068562 1056240 1046795 1039539 1032773 1025737 1018564 1011514 1004976 999290
62852 999290 994076 988663 983507 980081 978934 978995 979373 980448 982381 983792 983111 980460 977349 975269 975278 977828
62836 977828 981929 985471 987582 989754 993350 996952 997940 996178 994313 994333 995400 995395 993404 990254 987447 985888
62820 985888 985017 983093 978860 972835 966416 960140 953708 947375 942041 937891 934019 929721 925307 921317
62806 921317 917684 913937 909709 904798 899152 892865 885918 878198 870236 863340 858031 852820 845806 837416
62792 837416 830216 825813 823188 820441 816967 813388 810476 808900 809102 810653 812401 813981 816513 821052
62778 821052 826968 832574 836905 840157 842898 845680 849104 853461 858379 863442 868911 875184 881757 887528
62764 887528 892167 896569 901783 907967 914496 920737 926600 932647 939738 948326 958112 968524 979284 990128
62750 990128 1000272 1009023 1017073 1026385 1038215 1051733 1065278 1078584 1092937 1109133 1126278 1143107
62738 1143107 1159773 1177583 1197341 1218797 1241586 1265788 1291470 1318556 1347605 1379916 1416249
62727 1416249 1455942 1497919 1542202 1589778 1641370 1697106 1757277 1822628 1893854 1971287 2055059
62716 2055059 2145116 2241171 2343140 2451456 2566428 2687417 2813179 2942602 3074113 3204459
62706 3204459 3329196 3444723 3549058 3640569 3716945 3775740 3814855 3831947 3824654 3792606 3738584
62695 3738584 3666620 3579263 3477601 3363520 3240637 3112823 2982664 2851651 2721112 2592497
62685 2592497 2467165 2346259 2230714 2121368 2019153 1924966 1838980 1760209 1687272 1619586
62675 1619586 1557472 1501239 1450702 1405554 1365494 1329763 1297247 1267426 1240720 1217462 1197024
62664 1197024 1178629 1162751 1150891 1143776 1140298 1138521 1137450 1137623 1140249 1146066 1154873 1165762 1177742
62651 1177742 1190399 1204205 1220252 1239569 1262558 1289050 1318904 1352418 1389962 1431325 1475948
62640 1475948 1524118 1577530 1638062 1706085 1780498 1860378 1945867 2037334 2134605 2237485 2346223
62629 2346223 2460435 2577930 2695523 2810912 2922741 3028756 3124895 3206766 3271570 3318325
62619 3318325 3346776 3356425 3346206 3314810 3261926 3189618 3102117 3003671 2896743 2782444 2662263
62608 2662263 2538783 2414881 2292754 2173737 2058665 1948219 1842979 1743300 1649432 1561978
62598 1561978 1481932 1409686 1344158 1283616 1227409 1176087 1129667 1086717 1045677 1006273 969041
62587 969041 934186 901696 872015 845636 822253 801005 781385 763424 747247 732900 720151
62576 720151 708029 695196 681599 669166 659969 653945 649234 644298 638778 632729 626293 620132 615045
62563 615045 610994 607285 603778 601098 599743 599900 602170 607331 615060 623604 631114 636847 641254 645630
62549 645630 651595 659908 669611 679257 689108 701133 716608 734747 754121 774574 797119 822597
62537 822597 850983 881645 914104 948927 987842 1032241 1081591 1134070 1188742 1246073 1306277
62526 1306277 1368530 1432195 1497455 1563844 1629117 1690445 1746018 1794713 1834929 1864712 1882714
62515 1882714 1888525 1882525 1865812 1839636 1804484 1760443 1708846 1652542 1593906 1533633 1472355 1412242
62503 1412242 1355571 1302330 1250757 1200074 1151434 1106227 1064665 1026310 991098 959472 931927
62492 931927 908543 888548 870424 852888 835750 819555 804623 790743 777424 764074 750358
62481 750358 736919 725243 716157 708683 701021 692518 684347 678545 676617 678418 681921 684774 686712 689778
62467 689778 695582 703377 711853 721707 734751 751037 768686 786580 805562 826703 849925 874866
62455 874866 901897 931690 964757 1001868 1044005 1091355 1143155 1198901 1258727 1322066 1386943
62444 1386943 1451462 1515330 1578986 1641600 1700604 1752879 1795926 1828416 1850376 1862672 1865754
62433 1865754 1858996 1841634 1814060 1777803 1734533 1685635 1632398 1576010 1517472 1458146 1400267
62422 1400267 1346150 1296552 1250311 1205912 1163191 1123239 1086994 1054382 1024810 998051 974337
62411 974337 953750 935807 919718 904953 891508 879710 869760 861397 854051 847383 841541 836751 832899
62398 832899 829944 828561 829678 833230 838071 843479 850094 858755 868987 879491 889871 900971 913464
62385 913464 926878 940194 952804 964643 975817 986270 995319 1001445 1003150 1000384 994585 986875 976683
62372 976683 962727 945031 925196 904763 884133 863384 843348 825028 808279 792010 775899
62361 775899 761132 748980 739252 730770 722987 716375 711447 708147 706152 705053 704380 704179 705483 709169
62347 709169 714293 718717 721772 725173 730696 738057 745922 754010 763055 773365 784528 796185 808143
62334 808143 820097 831994 844192 856400 867107 875108 881063 886429 891396 895229 898228 901704 905998
62321 905998 909991 912718 914156 914311 913163 912059 913801 920471 931944 946919 964477 984266 1006270
62308 1006270 1030995 1059091 1090452 1124697 1162867 1207217 1258566 1315159 1375271 1439861 1511253
62297 1511253 1589854 1673459 1759377 1846019 1932583 2018250 2101686 2180585 2251816 2312738 2362306
62286 2362306 2400387 2426454 2439772 2440509 2429678 2408111 2376356 2335510 2287140 2232157 2170729 2103683
62274 2103683 2033234 1961757 1890317 1819001 1748492 1680696 1617620 1559892 1506590 1456516 1409334
62263 1409334 1365269 1324033 1284685 1246716 1210697 1177558 1147592 1120577 1096467 1075564 1058219
62252 1058219 1044622 1034455 1026466 1018936 1011224 1004457 1000017 997628 995748 993647 992129 992077 993113 994080
62238 994080 994162 993086 990741 987294 983621 981154 980988 983013 985883 988040 989084 990197 992995 997997 1004391
62223 1004391 1011228 1018452 1026722 1036574 1047994 1060604 1074087 1088423 1103660 1119452 1135058 1150133
62211 1150133 1165409 1182164 1201096 1222086 1245055 1270482 1298895 1330456 1365397 1404406 1448056
62200 1448056 1496196 1548454 1605148 1667160 1734948 1808198 1886215 1967898 2051189 2133345 2212059
62189 2212059 2285620 2351602 2406383 2447020 2473263 2486783 2488710 2478999 2458116 2427857 2389779 2343718
62177 2343718 2288756 2225235 2155272 2081721 2007267 1934019 1863173 1795072 1730042 1669013 1612973
62166 1612973 1562251 1516845 1477042 1442919 1413511 1387351 1363919 1343951 1328178 1316156 1306345
62155 1306345 1297058 1287675 1279339 1274076 1272641 1273631 1275376 1278074 1282959 1289773 1296568 1302084 1306904 1311923
62141 1311923 1317121 1322640 1329909 1340448 1353965 1368518 1382482 1395865 1409919 1425821 1443689 1462767
62129 1462767 1482665 1504075 1527750 1553216 1579475 1606728 1636004 1666902 1697190 1725306 1751964
62118 1751964 1778515 1805017 1831182 1858201 1888036 1921295 1957045 1994566 2034279 2077109 2123940
62107 2123940 2175696 2233003 2295485 2361681 2429589 2497170 2563008 2627019 2689767 2750164 2804430
62096 2804430 2848459 2881043 2903938 2919223 2927862 2930532 2928143 2920933 2908189 2889571 2865944 2838284
62084 2838284 2806593 2770914 2733105 2696500 2663453 2633827 2606492 2581933 2562420 2549275 2540855
62073 2540855 2534205 2528239 2524105 2522570 2522693 2523647 2526321 2531956 2540240 2550072 2561402 2574895 2590332 2607038
62059 2607038 2625818 2648700 2676233 2706225 2735895 2764584 2793825 2825339 2859599 2896008 2933928
62048 2933928 2973339 3014541 3057437 3101526 3146691 3193401 3241872 3291713 3342908 3396375 3452738
62037 3452738 3511208 3570687 3631430 3694413 3759275 3824024 3886711 3946514 4003434 4058146 4112249
62026 4112249 4167670 4225498 4285707 4347539 4409311 4468549 4523796 4576223 4628403 4681744 4736245
62015 4736245 4792143 4849999 4909413 4969708 5031955 5098295 5168880 5241760 5316503 5395565 5480684
62004 5480684 5569912 5659974 5749953 5840584 5931019 6018526 6101101 6178567 6251048 6317556 6376199
61993 6376199 6425093 6463482 6492641 6515053 6531855 6541721 6543059 6536338 6523079 6503629 6477645 6446287
61981 6446287 6412144 6377034 6341232 6304749 6267919 6230771 6193260 6156355 6121635 6089578 6059355
61970 6059355 6030412 6003078 5977449 5952965 5929461 5907518 5887347 5868333 5849981 5832253 5814682
61959 5814682 5796362 5777411 5759253 5742733 5726986 5710983 5695275 5681283 5669617 5660073 5652564 5646876
61947 5646876 5641923 5636364 5629908 5623270 5617001 5611086 5605448 5600008 5594339 5587981 5581024 5573583 5564699 5552602
61933 5552602 5536349 5516663 5494899 5471599 5446203 5417757 5385661 5349959 5310974 5268604 5222319
61922 5222319 5172318 5120332 5068521 5017654 4967169 4916913 4867607 4819265 4770449 4720143 4669653
61911 4669653 4621632 4577525 4536758 4497940 4459850 4421592 4383111 4345645 4310552 4277425 4244443
61900 4244443 4210914 4178349 4148337 4120467 4093367 4067045 4042909 4021666 4002318 3983386 3964380
61889 3964380 3945962 3929279 3915246 3903913 3894326 3885409 3877165 3870840 3867922 3869071 3873671 3880029 3886406
61876 3886406 3892539 3900012 3910591 3924453 3940739 3959494 3981922 4008681 4039057 4072343 4109155 4150745
61864 4150745 4197568 4249149 4305119 4365962 4433018 4508004 4592254 4686252 4790171 4904929 5032217
61853 5032217 5173457 5329269 5500221 5687582 5893181 6119152 6368159 6643465 6948508
61844 6948508 7286724 7661672 8076573 8533637 9034569 9581766 10177896 10823679 11516458
61835 11516458 12250590 13017175 13801909 14583577 15335125 16025366 16619700 17082235 17381619
61826 17381619 17497740 17424706 17169884 16751854 16197807 15539289 14807484 14030678 13233703
61817 13233703 12437306 11657622 10907092 10195504 9529039 8909027 8333817 7802452 7315354
61808 7315354 6871488 6466880 6096998 5759357 5452809 5175313 4923628 4694770 4486820
61799 4486820 4298426 4128102 3974046 3834508 3708421 3595438 3494766 3404208 3321271 3245268
61789 3245268 3177383 3118462 3067686 3023547 2984871 2950373 2918435 2888351 2860978 2837172 2816104
61778 2816104 2796007 2776184 2757489 2741118 2727594 2716679 2707719 2700313 2695034 2693093 2694918 2699542
61766 2699542 2705886 2714053 2724718 2737826 2752595 2768308 2784294 2799617 2813830 2827900 2843505 2861439
61754 2861439 2881429 2903406 2928072 2956130 2987745 3023030 3062497 3106760 3156232 3211344 3272732
61743 3272732 3340989 3416402 3499034 3588885 3685890 3789875 3900701 4018714 4145280 4282530
61733 4282530 4431860 4592670 4763468 4944522 5138512 5347906 5572605 5811119 6063555
61724 6063555 6332432 6621060 6932385 7269288 7634675 8030922 8460118 8925323 9431125
61715 9431125 9982864 10585991 11246361 11970497 12765069 13636146 14588544 15625209 16746927
61706 16746927 17952528 19238118 20594096 22001729 23432256 24848138 26203365 27442546
61698 27442546 28502735 29320691 29843177 30035726 29887489 29411861 28643188 27630667 26431450
61689 26431450 25104099 23702621 22272172 20848149 19458012 18122730 16856665 15668051
61681 15668051 14561178 13538070 12597891 11736276 10946999 10224458 9564107 8961373 8411580
61672 8411580 7910844 7455838 7042579 6666354 6322971 6009216 5722054 5458416 5216155
61663 5216155 4994260 4791412 4604884 4431466 4269227 4117842 3977474 3847739 3727556
61654 3727556 3615495 3510221 3410949 3317533 3229977 3147783 3069856 2995159 2923547 2855999 2793876
61643 2793876 2737732 2686800 2639717 2595560 2553988 2514584 2476608 2439522 2403288 2367933 2333193
61632 2333193 2298928 2265532 2233433 2202361 2171649 2141259 2111967 2084350 2058073 2032507 2007651
61621 2007651 1983976 1961641 1940414 1920250 1901271 1883139 1865088 1846804 1828701 1811149 1794152
61610 1794152 1778146 1764219 1752603 1741523 1728671 1713633 1697839 1682283 1666509 1650117 1634055
61599 1634055 1619809 1608042 1598528 1590688 1583673 1576623 1569499 1563120 1557928 1553400 1549247 1546346 1545607 1546552
61585 1546552 1547967 1549459 1551348 1553429 1555049 1556302 1558116 1561015 1564669 1568626 1572690 1576602 1580228 1584071
61571 1584071 1588623 1593144 1596209 1597695 1599101 1601414 1603684 1604346 1603095 1600696 1597697 1594204 1590371 1586081
61557 1586081 1580444 1572525 1562605 1551969 1541414 1530582 1518949 1506839 1495068 1483868 1472616 1460750
61545 1460750 1448597 1436980 1426044 1414978 1403169 1391249 1380458 1371312 1363639 1357766 1354650 1354434
61533 1354434 1355646 1356480 1356536 1357000 1359456 1364752 1372553 1381621 1390886 1400501 1411394 1423633 1435967 1447444
61519 1447444 1458853 1471881 1487356 1505028 1524642 1546379 1570410 1596787 1625742 1657496 1691735
61508 1691735 1727718 1764835 1802716 1841129 1880389 1921555 1965393 2011050 2056450 2100025 2141451
61497 2141451 2180729 2217552 2251977 2285017 2317826 2350535 2382287 2412124 2439346 2463243 2483084
61486 2483084 2498559 2509914 2517507 2521584 2522645 2521727 2519731 2516470 2510859 2502327 2491600 2479778 2467247
61473 2467247 2454234 2441970 2432049 2424561 2418146 2412504 2409814 2412755 2421826 2435575 2452878 2473932 2499386
61460 2499386 2529853 2566408 2610350 2661977 2720225 2784094 2854099 2932098 3020054 3119111 3229495
61449 3229495 3351011 3483811 3628856 3787623 3961502 4151606 4358944 4584431 4828664
61440 4828664 5091609 5371869 5665863 5968171 6273166 6575690 6869352 7144698 7390304
61431 7390304 7595906 7754086 7859840 7910502 7906862 7853297 7755867 7620655 7454147 7264149
61421 7264149 7059135 6846628 6632470 6421246 6216768 6022151 5839777 5671347 5518001
61412 5518001 5380501 5259278 5154249 5064911 4991009 4932875 4890670 4863567 4850310 4850398 4863982
61401 4863982 4890771 4929796 4980055 5040369 5108560 5182000 5259309 5340541 5425252 5511409 5596758
61390 5596758 5680333 5761964 5841253 5917925 5992396 6064917 6134672 6200656 6263076 6322978 6380791
61379 6380791 6436093 6488499 6537702 6582682 6622015 6655340 6683860 6708926 6730586 6747901 6760315
61368 6760315 6768187 6771993 6771445 6765771 6754797 6739400 6720726 6699338 6675392 6649304 6621681 6593006
61356 6593006 6564025 6536111 6510296 6486113 6462462 6439506 6418400 6399116 6380155 6360956 6342905
61345 6342905 6326806 6310745 6291909 6269620 6245109 6219039 6190936 6160843 6130192 6101142 6076130
61334 6076130 6057879 6048678 6049703 6061850 6086803 6126267 6180748 6250704 6338627 6448319 6581761
61323 6581761 6738086 6915882 7115165 7336664 7580515 7846240 8132750 8437391 8755606
61314 8755606 9081918 9410330 9733160 10040437 10321245 10565353 10763735 10909158 10997598 11028696
61304 11028696 11004273 10927022 10801138 10632861 10428833 10193999 9931977 9647088 9345061 9031935
61294 9031935 8713163 8393569 8077067 7766223 7462849 7169258 6888348 6622361 6372311
61285 6372311 6138986 5923798 5727912 5550796 5390436 5245334 5115978 5004054 4910364 4833914
61275 4833914 4772965 4726373 4693592 4673999 4666900 4671863 4688145 4713950 4747257 4787496 4835342 4890444
61263 4890444 4950517 5013529 5079740 5150179 5223379 5295003 5360994 5420323 5474482 5525197 5573050
61252 5573050 5617474 5657198 5690824 5717615 5737967 5752889 5762877 5767191 5764133 5752063 5730515 5700667
61240 5700667 5664696 5624297 5579584 5529503 5473505 5412767 5349511 5285195 5219756 5152785 5084955
61229 5084955 5017744 4952045 4887853 4825424 4766011 4710934 4660345 4613493 4570114 4531047 4497271
61218 4497271 4468471 4442775 4417976 4393045 4368303 4344046 4319362 4292791 4264044 4234428 4205484
61207 4205484 4177937 4152420 4130490 4113963 4103245 4097048 4093962 4093952 4098222 4108176 4124834 4148881 4180673
61194 4180673 4220215 4267745 4324707 4393690 4476679 4573201 4680677 4796801 4920953 5052818
61184 5052818 5190194 5328973 5464893 5593996 5710938 5807923 5876428 5910108 5906005 5863869
61174 5863869 5785417 5674294 5535796 5375913 5200411 5014647 4823809 4633028 4447082 4269723
61164 4269723 4103001 3947244 3801878 3666376 3540536 3424301 3317740 3221140 3134669 3057760
61154 3057760 2989045 2927148 2871446 2821894 2778236 2739803 2706276 2678332 2656950 2642070 2632491
61143 2632491 2627382 2627345 2633445 2645575 2662442 2682908 2706348 2731589 2756482 2779108 2798746 2815144
61131 2815144 2827532 2835225 2838879 2840142 2839928 2837658 2832327 2823708 2812273 2798537 2783026 2766544 2749706
61118 2749706 2732072 2712288 2689530 2664588 2639075 2613565 2587041 2558332 2527557 2495653 2462870
61107 2462870 2428491 2392007 2353878 2314890 2275258 2234657 2192744 2149389 2104808 2059942 2016446
61096 2016446 1975773 1938166 1902767 1868724 1835993 1805016 1775684 1746774 1716539 1683984 1649484
61085 1649484 1614120 1578669 1543498 1509049 1475875 1444355 1415026 1389084 1367655 1350297 1335053
61074 1335053 1320689 1308324 1300112 1296523 1295644 1295138 1294371 1294490 1296871 1301746 1308289 1315844 1324837 1336308
61060 1336308 1350581 1366777 1383646 1400520 1417259 1433692 1449577 1465059 1480836 1497775 1516346
61049 1516346 1536433 1557676 1579871 1602600 1624228 1641995 1654117 1661732 1667781 1673805 1678730 1681044
61037 1681044 1681043 1680090 1678493 1675261 1669766 1662727 1655363 1648115 1640417 1631624 1622061 1613060 1605787 1600220 1595713
61022 1595713 1592131 1589516 1586785 1582199 1575614 1569069 1564355 1560952 1557151 1552092 1545657 1537445 1527420 1516985
61008 1516985 1507800 1499727 1491200 1481481 1471285 1461407 1452170 1444268 1438584 1434668 1430585 1424983 1418610 1413353
60994 1413353 1410367 1409402 1409286 1408839 1407879 1407531 1409239 1413606 1420684 1430786 1444020 1459428 1475933 1493979
60980 1493979 1514735 1537675 1560640 1582746 1605596 1630850 1658081 1685976 1714314 1743543 1773603
60969 1773603 1804668 1838360 1876785 1920517 1968475 2019527 2073450 2130668 2191969 2258213 2329638
60958 2329638 2405603 2485511 2569547 2658102 2751178 2849025 2952782 3063697 3182223 3308473
60948 3308473 3442890 3585788 3737002 3896788 4066163 4245552 4434302 4632804 4843908
60939 4843908 5070640 5313828 5574343 5856802 6168097 6512013 6887784 7294452 7734508
60930 7734508 8213443 8739220 9323961 9983883 10736059 11597361 12587845 13732377 15056699
60921 15056699 16583739 18334562 20328640 22581712 25110989 27945022 31103969 34524839
60913 34524839 37979474 41088754 43475192 44955629 45617541 45730299 45596273 45465491 45516367
60904 45516367 45818490 46257181 46513699 46185482 44991146 42905833 40134863 36978828 33709056
60895 33709056 30516013 27511751 24748017 22236803 19972620 17947915 16154475 14578331
60887 14578331 13199820 11998366 10954086 10045554 9250038 8547588 7923616 7367221 6868867
60878 6868867 6420381 6015563 5649329 5316706 5013401 4736803 4485381 4256933 4047849
60869 4047849 3854200 3673206 3503350 3343193 3190762 3044739 2905790 2775464 2653549
60860 2653549 2537754 2426722 2322027 2225845 2137566 2054428 1975060 1900493 1831509 1766915 1705237
60849 1705237 1646694 1592499 1543083 1497959 1456644 1418878 1384297 1352516 1323190 1295796 1269958
60838 1269958 1246203 1225475 1207406 1190098 1172445 1155886 1142943 1134611 1129993 1127867 1127560 1128683
60826 1128683 1131006 1134552 1139180 1144433 1150316 1157642 1166713 1176176 1184209 1190503 1196093 1201535 1206334 1210018
60812 1210018 1212615 1213984 1213602 1211079 1206126 1198215 1187283 1174722 1162618 1151843 1141774 1131868 1122381
60799 1122381 1113442 1104670 1096172 1088931 1083663 1080107 1077871 1077132 1078149 1080977 1086153 1094735 1106976 1121692
60785 1121692 1137696 1155225 1175166 1197244 1219691 1240567 1259136 1276217 1293389 1311444 1329481
60774 1329481 1346059 1361313 1376987 1394043 1411153 1426125 1438043 1447368 1454780 1460805 1465974 1470472
60762 1470472 1473936 1476333 1478641 1481915 1485999 1489809 1492614 1494441 1495480 1495575 1494060 1489813 1482109 1471819
60748 1471819 1460941 1450248 1438141 1422636 1403650 1382406 1359520 1335221 1310826 1288222 1267846
60737 1267846 1248498 1229207 1209956 1190751 1171595 1153721 1139236 1128835 1121032 1114207 1108257 1103657
60725 1103657 1100287 1098133 1097964 1100146 1103599 1107127 1111109 1116801 1124638 1134464 1146786 1162136 1179284
60712 1179284 1195824 1211047 1227031 1246215 1268692 1292499 1315866 1338517 1361228 1384693 1408627
60701 1408627 1431707 1452797 1472384 1492218 1513099 1533715 1552290 1568711 1584127 1598942 1612402
60690 1612402 1624010 1634105 1642850 1649818 1655018 1659188 1662404 1663433 1661353 1656922 1651235 1643858 1633714
60677 1633714 1621313 1608428 1595646 1581905 1566738 1551243 1536131 1520403 1503132 1485275 1468246
60666 1468246 1451479 1433048 1412526 1391766 1372769 1355873 1340324 1325734 1312594 1301850 1294205
60655 1294205 1289419 1286307 1283814 1282037 1281780 1283377 1286492 1290781 1295930 1301151 1305552 1309142 1312738 1316725
60641 1316725 1320638 1324080 1327363 1331001 1335211 1339996 1345039 1349313 1351581 1351576 1350038 1347481 1343788 1339198 1334465
60626 1334465 1329301 1321744 1310210 1295504 1279697 1263459 1245717 1225761 1204393 1182756 1161162 1139587
60614 1139587 1118551 1098784 1080406 1063014 1046464 1031178 1017853 1007269 1000213 996926 996323 996176
60602 996176 994783 992607 991732 993399 996445 998606 999003 998658 998878 1000122 1002625 1006938 1013070 1019736 1025387
60587 1025387 1029871 1034524 1040764 1049004 1058615 1068338 1076821 1083270 1087659 1090296 1091662 1092956 1096007 1101794
60573 1101794 1109448 1117617 1126360 1136637 1148262 1159895 1171303 1184205 1200157 1218723 1238522 1259082
60561 1259082 1280620 1302835 1325210 1348113 1372304 1397332 1421540 1443787 1464300 1483667 1501964
60550 1501964 1519134 1535238 1549740 1561328 1569192 1573939 1576463 1576393 1572594 1564970 1554694 1542454 1527476
60537 1527476 1508847 1487078 1463668 1439619 1415315 1391644 1370213 1352091 1337071 1324610 1314849
60526 1314849 1308006 1303240 1299107 1295234 1292780 1292949 1295607 1299619 1303925 1307861 1310973 1313227 1315208 1317563
60512 1317563 1320314 1323121 1325939 1328824 1331328 1332929 1334119 1336203 1339682 1343551 1346767 1349826 1354273 1361042
60498 1361042 1369921 1380403 1392245 1405187 1418786 1432828 1447446 1462691 1478325 1494225 1510592
60487 1510592 1527581 1545055 1563084 1582540 1604822 1630983 1661327 1695956 1735427 1780593 1831643
60476 1831643 1887606 1947084 2009324 2073794 2138278 2197976 2247297 2282606 2302819 2307797 2297428
60465 2297428 2272747 2237070 2195125 2151223 2108566 2069567 2035803 2007642 1984717 1967001 1954926
60454 1954926 1948430 1946632 1948849 1955419 1966993 1983272 2003026 2025264 2049962 2077751 2109545 2146813
60442 2146813 2191653 2245807 2309490 2381608 2461409 2549741 2648647 2760160 2885716 3026220 3181726
60431 3181726 3350865 3531275 3721204 3920650 4130839 4353062 4588588 4839503 5108958
60422 5108958 5400179 5715031 6052598 6407381 6767472 7114380 7425471 7677656 7850241
60413 7850241 7926799 7897454 7761577 7528805 7216877 6847543 6442976 6023445 5605590 5201267
60403 5201267 4817827 4459629 4129204 3827326 3553113 3304941 3081274 2880407 2700016
60394 2700016 2537652 2391454 2259804 2140593 2031739 1932456 1843139 1763722 1692776 1628551
60384 1628551 1570236 1517747 1470803 1428755 1390954 1356766 1325458 1296454 1269497 1244256 1220138
60373 1220138 1196906 1175134 1155488 1137775 1121189 1105335 1090580 1077569 1066838 1058517 1051771 1044829
60361 1044829 1036470 1027599 1020533 1016531 1014645 1013185 1011595 1010532 1010718 1012335 1015148 1018712 1022631 1026888
60347 1026888 1031654 1036512 1040353 1042548 1043930 1046100 1049911 1055112 1061189 1067915 1075100 1082566 1090498 1099209
60333 1099209 1108238 1116294 1122726 1128742 1136509 1146839 1158099 1167518 1173423 1176274 1177920 1180081 1183236
60320 1183236 1186535 1188740 1189462 1189607 1190442 1192219 1193853 1194004 1192283 1189326 1186000 1182722 1179413 1175834 1172117
60305 1172117 1169137 1168099 1169259 1171238 1172234 1172096 1172578 1175261 1179772 1184474 1188411 1191899 1195598 1199964 1205601
60290 1205601 1213218 1222790 1233355 1244047 1254906 1266311 1278116 1289872 1301466 1312855 1323335 1331790
60278 1331790 1337771 1341842 1344872 1347377 1349571 1351481 1352876 1353564 1353966 1354999 1357179 1360164 1363352 1366501
60264 1366501 1369554 1372242 1374296 1375723 1376464 1375972 1373556 1369175 1363691 1358283 1353682 1349768 1345924 1342014
60250 1342014 1338935 1337760 1338233 1338712 1337833 1335649 1332801 1329350 1325108 1320556 1316503 1313157 1310354 1308414 1307841
60235 1307841 1308259 1308572 1308287 1307816 1307391 1306457 1304491 1301722 1298794 1296302 1294897 1295212 1297272 1300422 1304115 1308416
60219 1308416 1313646 1320012 1327749 1337072 1347838 1359744 1372999 1388135 1404923 1422149 1438810 1455031
60207 1455031 1471586 1489112 1508115 1529052 1551872 1575891 1600410 1625102 1649803 1674849 1701953
60196 1701953 1733678 1771099 1812599 1855674 1899477 1945044 1993817 2047009 2105907 2171501 2243675
60185 2243675 2321530 2404678 2493714 2589570 2692993 2804557 2924567 3052837 3188927 3332561
60175 3332561 3483423 3640585 3802370 3966662 4131160 4293647 4452322 4605541 4750937
60166 4750937 4885259 5005548 5110172 5198398 5269538 5323150 5359642 5380016 5385287 5376720 5356302
60155 5356302 5326393 5289231 5247411 5204504 5164494 5130653 5105250 5089750 5084685 5089981 5106411 5136387
60143 5136387 5182340 5244492 5321075 5410546 5512696 5627766 5755515 5895216 6045422 6203251
60133 6203251 6364408 6524309 6679077 6825556 6960641 7080519 7180613 7257104 7309045 7338137
60123 7338137 7345679 7330610 7291581 7230033 7149843 7054672 6947507 6832413 6714642 6598585 6487100
60112 6487100 6383188 6290753 6213135 6152007 6108131 6082051 6073742 6082933 6110241 6156704 6221612
60101 6221612 6301905 6394221 6496274 6605653 6718648 6831121 6939432 7039827 7128218 7201728
60091 7201728 7259646 7302154 7329341 7342425 7344584 7339062 7327467 7311572 7296174 7288430 7294420 7317567
60079 7317567 7359959 7423440 7509139 7617509 7749654 7907931 8094808 8311768 8559663 8839489
60069 8839489 9152210 9497969 9875841 10284423 10722547 11189122 11681712 12194970 12720911
60060 12720911 13251132 13778490 14296294 14796467 15269430 15705873 16098079 16439459 16723399
60051 16723399 16942974 17091902 17165909 17163532 17085775 16935025 16714426 16428503 16084476 15692889
60041 15692889 15266727 14819382 14362875 13907574 13462996 13038121 12640610 12276419 11950550
60032 11950550 11667349 11429177 11235419 11084000 10973602 10903351 10870690 10870986 10899166 10950429
60022 10950429 11019339 11099755 11185914 11272176 11351536 11416308 11461215 11484519 11485587 11463065 11416389
60011 11416389 11347250 11257902 11149161 11021381 10876044 10714692 10537438 10344572 10139014 9925210
60001 9925210 9706053 9483000 9259147 9040000 8830388 8632183 8445897 8273468 8118438
59992 8118438 7983924 7871299 7780823 7713061 7669313 7650637 7656871 7687241 7741750 7820949 7924077
59981 7924077 8048316 8190221 8346649 8513661 8685769 8857291 9023342 9178515 9315934
59972 9315934 9429383 9515648 9573455 9601075 9596837 9561221 9496311 9403464 9283606 9139738 8977050
59961 8977050 8800225 8612543 8418107 8223038 8033593 7854442 7689218 7541010 7411310
59952 7411310 7299913 7207110 7135063 7086201 7061298 7060235 7083753 7133106 7208380 7308254 7431325
59941 7431325 7576883 7744393 7932763 8140044 8363231 8598057 8838897 9078888 9310463
59932 9310463 9526533 9721477 9891055 10031694 10140489 10215695 10256345 10261176 10228672 10158621
59922 10158621 10053384 9917616 9757116 9577965 9386222 9188142 8990592 8800643 8624078
59913 8624078 8464569 8324842 8208055 8116993 8052343 8013122 7998830 8009957 8046325 8106392 8188718
59902 8188718 8292766 8417364 8559191 8713642 8876706 9045474 9217436 9389958 9560037
59893 9560037 9724029 9878055 10019330 10147183 10262718 10367715 10463758 10551852 10632779 10708343
59883 10708343 10782401 10860274 10947140 11047448 11165546 11305870 11472381 11668652 11898615 12166217
59873 12166217 12473895 12822028 13209906 13636126 14097247 14586533 15094223 15608315 16114790
59864 16114790 16597926 17041109 17427308 17739245 17960887 18080355 18091987 17996078 17797678 17505981
59854 17505981 17133873 16697026 16212885 15699577 15174101 14650420 14139231 13649216 13187712
59845 13187712 12760304 12370870 12022369 11716767 11454348 11234523 11057823 10925959 10839477
59836 10839477 10796580 10794813 10832592 10908111 11017789 11156638 11319174 11498938 11687877 11877041
59826 11877041 12057073 12217300 12345634 12430948 12465330 12443539 12361598 12217701 12014095 11756694
59816 11756694 11452977 11111146 10740556 10351016 9951180 9548317 9149317 8760564 8386581
59807 8386581 8029887 7692581 7377283 7086234 6820127 6578237 6359379 6162702 5987996
59798 5987996 5835404 5704615 5594370 5502782 5427608 5365867 5313835 5268365 5228091 5192703 5161171
59787 5161171 5131378 5101463 5070939 5040469 5010966 4982907 4956190 4930642 4906623 4884555 4863438
59776 4863438 4840480 4812927 4779970 4742220 4699840 4652196 4599286 4542718 4485216 4429763 4378982
59765 4378982 4334385 4295830 4262249 4232999 4208145 4187508 4170345 4156417 4146968 4144138 4149363 4162437
59753 4162437 4182022 4206984 4237135 4272706 4313428 4358644 4408361 4463592 4525394 4593990 4668995
59742 4668995 4749761 4834975 4922444 5009835 5095323 5177066 5252712 5320218 5378991 5429722 5473526
59731 5473526 5511891 5547048 5581411 5616761 5654718 5697904 5749614 5812098 5885835 5970942 6068879
59720 6068879 6182440 6314406 6466655 6640602 6838177 7062063 7314943 7598861 7915512
59711 7915512 8266495 8652327 9071229 9519500 9992458 10482765 10976189 11449466 11873414
59702 11873414 12218884 12461582 12585545 12586615 12474196 12268580 11994956 11678306 11341050 11001993
59692 11001993 10675504 10371590 10096951 9855814 9650145 9480124 9345225 9245114 9179784
59683 9179784 9149113 9152283 9187654 9253471 9348634 9472303 9623048 9799518 10002305 10233981
59673 10233981 10496666 10790513 11115256 11472114 11863112 12289678 12753277 13256608 13802681
59664 13802681 14393303 15029911 15715274 16452664 17243525 18087316 18983051 19928888 20919974
59655 20919974 21948314 23004867 24080060 25162075 26236801 27290777 28313581 29297822
59647 29297822 30239450 31139727 32005537 32846063 33669251 34481481 35288339 36093004 36893413
59638 36893413 37681689 38446057 39172598 39845811 40449154 40966256 41382595 41687565 41876534
59629 41876534 41951558 41920376 41795224 41592546 41332463 41036805 40726880 40422641 40142814 39904690
59619 39904690 39723735 39613832 39587539 39655285 39824248 40098753 40482287 40978872 41591842 42320697
59609 42320697 43158874 44094192 45110521 46187475 47297733 48405419 49468060 50439862
59601 50439862 51272895 51917663 52327204 52464461 52307725 51851574 51106279 50098100 48867833
59592 48867833 47465090 45941123 44344586 42720057 41106222 39533615 38024344 36593762
59584 36593762 35251278 33999313 32832513 31738405 30698039 29686180 28673555 27633262
59576 27633262 26548860 25418768 24254286 23073671 21896931 20743349 19630310 18571565
59568 18571565 17575433 16644750 15778913 14976417 14236310 13558074 12940307 12379237 11868847
59559 11868847 11403225 10979005 10594975 10249351 9938271 9657183 9402693 9172349 8963451
59550 8963451 8773126 8599210 8439871 8292288 8152651 8017817 7886177 7756430 7626214
59541 7626214 7492896 7355523 7215139 7072990 6929191 6783690 6637954 6494772 6356428
59532 6356428 6223843 6097666 5979342 5870501 5771720 5682559 5602664 5532421 5472694 5424270
59522 5424270 5387324 5361053 5344081 5335631 5336005 5345438 5362894 5386720 5416328 5452497 5495966 5546226
59510 5546226 5601592 5659972 5719852 5781305 5846069 5916121 5992236 6074400 6163031 6258751 6361299
59499 6361299 6470146 6586449 6713192 6852984 7006891 7175766 7361271 7564553 7785052
59490 7785052 8021973 8276286 8549927 8843394 9155497 9485384 9833310 10198766 10578678
59481 10578678 10968136 11362266 11756690 12146591 12526539 12891777 13239167 13566058 13868087
59472 13868087 14138698 14371399 14562661 14712833 14825001 14903499 14952877 14977088 14979304 14963071
59462 14963071 14933789 14898541 14864360 14837323 14823534 14830084 14864097 14930721 15032127 15167846 15335358
59451 15335358 15530116 15745086 15970152 16192057 16395498 16564974 16686162 16746385 16735042 16644474
59441 16644474 16470676 16213484 15876861 15469350 15003592 14494407 13956658 13404298 12850180
59432 12850180 12305542 11779315 11278238 10807705 10372150 9974401 9615032 9293029 9007437
59423 9007437 8758132 8544716 8365139 8216321 8096317 8005149 7943255 7909997 7904453 7926845
59413 7926845 7978016 8057766 8164784 8298167 8457897 8643611 8853838 9086685 9340338 9612230
59403 9612230 9898197 10192823 10490083 10783172 11063956 11322984 11550120 11735544 11870954
59394 11870954 11950389 11970093 11928012 11823879 11659635 11439339 11168954 10856591 10512270 10146134
59384 10146134 9766638 9380803 8995536 8617241 8250089 7895855 7555730 7231486 6925015
59375 6925015 6638044 6372396 6129098 5906860 5702823 5515366 5344899 5191433 5053077
59366 5053077 4927973 4816290 4718872 4635076 4563480 4503891 4456894 4421710 4396064 4378289 4368438
59355 4368438 4367260 4375023 4391376 4415501 4446420 4483949 4529216 4582966 4642649 4701806 4753280 4793727
59343 4793727 4825687 4855826 4890980 4935063 4988895 5052299 5125891 5210904 5307817 5415188 5529401
59332 5529401 5645779 5761243 5876871 5997629 6129265 6275726 6439450 6622827 6828353
59323 6828353 7057844 7312434 7593228 7901513 8238768 8607115 9009521 9449040 9928147
59314 9928147 10449144 11014587 11626452 12284931 12988366 13733762 14516410 15328671 16159303
59305 16159303 16994018 17817176 18614283 19374053 20088483 20751397 21357949 21905761 22395401
59296 22395401 22828836 23207892 23534419 23810587 24037495 24213609 24335130 24397287 24394617 24320912
59286 24320912 24170342 23938794 23623971 23225401 22745830 22192342 21574941 20904010 20189611
59277 20189611 19442253 18672699 17890909 17106052 16327184 15562703 14819312 14102636 13418609
59268 13418609 12772743 12167785 11603323 11078156 10592209 10146006 9739430 9371520 9040668
59259 9040668 8744565 8480611 8246811 8041727 7863408 7709138 7576639 7464850 7373181 7300497
59249 7300497 7245198 7205773 7181020 7170202 7173223 7190039 7219497 7259286 7307568 7364289 7430210
59238 7430210 7504692 7584883 7667148 7748869 7828599 7904726 7974847 8037033 8091392 8139512 8182254
59227 8182254 8218877 8248719 8273010 8294443 8315680 8339029 8367054 8402418 8447202 8503130 8572306
59216 8572306 8656898 8757863 8874410 9004454 9144887 9291391 9438684 9581398 9714928 9835993
59206 9835993 9942820 10034231 10107854 10159592 10185590 10184484 10157159 10105028 10029942 9935622 9827691
59195 9827691 9711554 9590852 9468280 9347084 9231153 9123944 9027671 8943198 8870290 8807921
59185 8807921 8754438 8707729 8665850 8627855 8593671 8562855 8533937 8505445 8476950 8448464 8419513
59174 8419513 8389915 8361277 8336751 8319365 8311306 8314644 8331700 8364710 8416012 8488745 8586584 8712626
59162 8712626 8869103 9058169 9282287 9543659 9843553 10181852 10556607 10964204 11400410
59153 11400410 11860505 12337200 12818599 13289122 13732124 14130782 14467580 14725573 14891529
59144 14891529 14957281 14918410 14773413 14524995 14181089 13753864 13258379 12712002 12133072 11538279
59134 11538279 10941154 10352886 9783227 9239716 8726844 8246835 7800842 7389097 7010920
59125 7010920 6665355 6351271 6066432 5807564 5572184 5359647 5169552 4999911 4847847
59116 4847847 4711430 4589839 4482340 4388287 4307628 4240088 4183916 4136652 4097138 4065580 4041513
59105 4041513 4023046 4008823 3999772 3998044 4004697 4019184 4040700 4069051 4104123 4145280 4191624 4242479
59093 4242479 4297422 4356280 4419491 4488180 4563438 4645597 4734416 4829581 4930461 5035573 5143031
59082 5143031 5251603 5360729 5469467 5576091 5678786 5775993 5865954 5946931 6018287 6080336
59072 6080336 6132636 6173527 6202215 6220291 6230188 6233173 6230148 6223396 6215750 6208602 6202610 6200100 6204695
59059 6204695 6218396 6241010 6273006 6316953 6375115 6447151 6531538 6628192 6738428 6863090 7002052
59048 7002052 7155173 7322721 7504971 7702058 7913998 8140365 8380213 8632534 8895998
59039 8895998 9167614 9442342 9714760 9980217 10233075 10464291 10662552 10818503 10927120
59030 10927120 10985828 10991757 10942281 10838018 10684140 10488409 10258449 10000842 9721583 9426044
59020 9426044 9118529 8802632 8482086 8160585 7840675 7523728 7211366 6906203 6610640
59011 6610640 6325571 6050878 5786738 5533874 5293020 5064705 4849157 4645841 4453642
59002 4453642 4272061 4101683 3942744 3793839 3652882 3518963 3392513 3274171 3164300
58993 3164300 3062990 2969530 2882266 2799975 2722988 2652065 2586735 2525791 2468767 2415706 2365984
58982 2365984 2318773 2274206 2232677 2193473 2155618 2119690 2087088 2057839 2030960 2006851 1987235
58971 1987235 1972528 1961190 1952081 1945590 1941966 1940342 1940111 1941543 1944294 1946980 1949171 1952430 1958439 1967134
58957 1967134 1977188 1987006 1994949 2000287 2004646 2010785 2019053 2026767 2032078 2036590 2042774 2050494 2057824 2064146
58943 2064146 2070624 2078342 2087430 2097419 2107351 2116231 2124415 2133707 2144985 2156633 2166414 2174054 2180853
58930 2180853 2187854 2195841 2206187 2219895 2236041 2252602 2268701 2284971 2302038 2319743 2337832 2356511
58918 2356511 2376366 2398078 2421702 2445924 2468966 2490891 2514027 2540366 2569636 2600709 2633516
58907 2633516 2668257 2704002 2739940 2777188 2817578 2861038 2905741 2950444 2995141 3039835 3084430
58896 3084430 3129875 3177900 3229339 3283797 3341057 3401786 3466765 3536310 3610519 3689367 3772702
58885 3772702 3860840 3954959 4056204 4164737 4280294 4403086 4533325 4670684 4815339 4968834
58875 4968834 5132598 5306177 5488335 5679471 5881462 6095638 6322765 6564866 6824885
58866 6824885 7103968 7400838 7714866 8048552 8405990 8789810 9200676 9639214 10107310
58857 10107310 10607459 11141616 11711105 12317554 12963437 13651291 14382433 15156797 15973636
58848 15973636 16831218 17725325 18648834 19593060 20548255 21501626 22435416 23327815 24155294
58839 24155294 24893824 25519663 26011454 26352366 26530373 26538192 26375210 26049461 25576254 24974425
58829 24974425 24264144 23466913 22605094 21700256 20772078 19838063 18912788 18007300 17130203
58820 17130203 16289201 15490590 14737645 14030832 13369579 12752665 12177316 11639727 11137025
58811 11137025 10667669 10229912 9821230 9439514 9083439 8751267 8440647 8150257 7880438
58802 7880438 7631354 7401360 7187977 6989797 6806760 6639125 6486914 6349918 6227433
58793 6227433 6118018 6019951 5931941 5853358 5784055 5724326 5674956 5636897 5610532 5595165 5589587
58782 5589587 5593541 5608371 5635464 5674198 5722510 5779762 5847941 5929313 6023889 6129997 6246449
58771 6246449 6373226 6510892 6660539 6823704 7001241 7192770 7398271 7619633 7859404
58762 7859404 8118454 8396048 8691950 9007448 9344787 9706668 10095917 10514500 10963259
58753 10963259 11443612 11958869 12512653 13106637 13741175 14417396 15136790 15898965 16701307
58744 16701307 17540322 18411100 19305165 20210459 21113378 21998795 22847567 23635833 24337851
58735 24337851 24929147 25387797 25695641 25840399 25816689 25625365 25273309 24773998 24146324
58726 24146324 23411455 22590846 21706514 20780694 19833505 18881322 17937522 17013624 16118976
58717 16118976 15260230 14441675 13665477 12931699 12239485 11588748 10979711 10410670 9877824
58708 9877824 9378038 8910448 8474519 8067897 7687428 7331388 6999454 6690882 6403637
58699 6403637 6135079 5882904 5645827 5423889 5217651 5026626 4848886 4682504 4526779
58690 4526779 4381723 4247073 4122365 4007297 3901277 3802921 3710681 3623932 3543140 3469061
58680 3469061 3401796 3340375 3283169 3228899 3177150 3127711 3079878 3033093 2987938 2945626 2906409
58669 2906409 2869231 2832996 2797547 2763394 2731092 2700790 2671731 2642223 2610742 2576957 2541142
58658 2541142 2503028 2462113 2418778 2374021 2328220 2281226 2233593 2186561 2140731 2095766 2051519
58647 2051519 2008460 1966873 1926608 1887909 1851710 1818844 1789340 1762289 1735855 1708015 1678360
58636 1678360 1648874 1621983 1598123 1576070 1554932 1534412 1513760 1492280 1470604 1449783 1429273
58625 1429273 1407764 1385996 1366621 1350812 1336886 1322976 1309340 1297237 1287176 1279254 1273922 1271367
58613 1271367 1271091 1272869 1277218 1284258 1293057 1302692 1313085 1324272 1335693 1346739 1357131 1366364 1373536
58600 1373536 1378066 1379867 1378763 1374640 1368238 1360807 1352952 1344879 1337614 1332630 1330298 1330134 1332533 1338554
58586 1338554 1347820 1358500 1369880 1383252 1399628 1418299 1438477 1460830 1486341 1514952 1546238
58575 1546238 1580301 1617083 1655827 1696056 1738313 1783420 1831893 1884319 1941104 2001416 2063660
58564 2063660 2127605 2195044 2268069 2347931 2435806 2533089 2640311 2757172 2884309 3023818
58554 3023818 3177529 3346033 3529702 3729071 3943614 4171776 4412832 4667058 4933110
58545 4933110 5206749 5482859 5756993 6023602 6274110 6498124 6685827 6828653 6919309 6953034
58535 6953034 6928916 6849663 6720815 6550299 6347384 6120937 5878757 5628063 5375286 5125330
58525 5125330 4882291 4650559 4433440 4230872 4040721 3862708 3699123 3551492 3418864
58516 3418864 3299966 3194685 3102480 3021333 2949084 2883933 2823244 2764208 2706391 2651278 2598676
58505 2598676 2546256 2493380 2442258 2394045 2346954 2299935 2255108 2214240 2175602 2136893 2098914
58494 2098914 2063736 2031257 2000039 1969603 1939418 1907501 1872662 1836525 1801038 1765838 1730509
58483 1730509 1697220 1667959 1640815 1612358 1582442 1553473 1526145 1499510 1474539 1453823 1437466
58472 1437466 1422478 1406799 1391368 1377611 1365084 1352336 1338554 1323944 1309685 1297437 1287670
58461 1287670 1278735 1268756 1257923 1247726 1238767 1230825 1224235 1219339 1215079 1209787 1202980 1195007 1185644
58448 1185644 1174707 1163407 1153298 1144167 1134457 1123495 1112045 1101192 1091813 1084519 1078950 1073764
58436 1073764 1068332 1063573 1060242 1057655 1055205 1053626 1053335 1053038 1051568 1049691 1048396 1046894 1044133 1040958
58422 1040958 1038850 1037784 1037059 1036781 1036703 1035262 1031896 1028680 1027341 1026346 1023487 1019732 1017583 1017007 1016166 1015097
58406 1015097 1015349 1016544 1016531 1014784 1012833 1011500 1010294 1009437 1009940 1011731 1013906 1016616 1020543 1024878 1028106
58391 1028106 1030540 1033842 1038284 1042609 1046294 1049799 1052807 1054209 1053691 1051704 1048444 1044413 1040983 1038552
58377 1038552 1035292 1029789 1023696 1019530 1017261 1015577 1014891 1015880 1016391 1013513 1008197 1004237 1002848 1001527 998306
58362 998306 993964 989913 986851 985776 987463 990502 992302 992410 992767 994815 998538 1004068 1011717 1020525 1028997
58347 1028997 1037126 1045691 1054353 1062755 1072455 1084873 1098165 1109380 1119177 1131050 1146038 1161569
58335 1161569 1175690 1189176 1203029 1216705 1229362 1240516 1249348 1255547 1260648 1266226 1271224 1273554
58323 1273554 1273707 1274033 1275078 1275488 1274991 1274495 1273881 1272789 1272841 1275755 1279855 1281995 1282367 1283789 1286826 1289634
58307 1289634 1292356 1297338 1304706 1311875 1318071 1325484 1335209 1345698 1356092 1367683 1381119 1395149 1408780
58294 1408780 1421891 1433515 1442550 1450403 1459857 1471135 1482068 1491977 1502172 1512941 1523602 1535318
58282 1535318 1550043 1566584 1581482 1593915 1606108 1618889 1630679 1641007 1651338 1662309 1673703
58271 1673703 1686832 1703107 1720756 1737025 1752946 1771334 1790836 1807316 1820995 1836681 1856530
58260 1856530 1878018 1899664 1923231 1949330 1976184 2003843 2034458 2067317 2098812 2128422 2159469
58249 2159469 2192873 2225746 2257529 2291855 2330369 2369927 2407819 2444833 2481541 2516763 2551514
58238 2551514 2589325 2630722 2672381 2713386 2757067 2804809 2853580 2901816 2952481 3007770 3065617
58227 3065617 3123814 3183065 3243977 3305542 3368404 3435070 3505396 3576399 3647516 3721058 3796992
58216 3796992 3873080 3950999 4035996 4129230 4226830 4327697 4435457 4551144 4670971 4793289
58206 4793289 4920927 5054828 5192356 5333840 5483597 5642588 5807346 5977993 6159566
58197 6159566 6353483 6555833 6766288 6990455 7231174 7486076 7755867 8045643 8355202
58188 8355202 8677454 9009472 9355793 9718267 10093082 10481211 10891088 11327165 11786584
58179 11786584 12270865 12789229 13345805 13935228 14555598 15213710 15912602 16646958 17416576
58170 17416576 18231349 19096754 20007929 20964593 21977790 23054844 24192479 25392876 26671490
58161 26671490 28040348 29498725 31049233 32707414 34486305 36388294 38422087 40609888
58153 40609888 42966788 45491394 48188790 51084596 54205867 57570067 61206241 65164704
58145 65164704 69492175 74222736 79410516 85147854 91539103 98690925 106750453 115922023
58137 115922023 126428281 138497729 152419131 168560369 187283681 208852612 233413881
58130 233413881 261004895 291598263 325282604 362351001 402687569 444381695 482777702
58123 482777702 511455847 525007424 521563738 503181613 474209633 439266141 402070010
58116 402070010 365154691 329995579 297304243 267384169 240370658 216276590 194983240
58109 194983240 176298127 160018466 145927787 133786721 123376749 114538947 107154626
58102 107154626 101115996 96328011 92701018 90116582 88419743 87438383 86944662 86558748
58094 86558748 85746572 84002557 81080441 77067882 72278576 67093479 61849815 56784228
58086 56784228 52022083 47612139 43573550 39913289 36620420 33669897 31035238 28688807
58078 28688807 26595642 24719967 23035896 21523847 20161604 18927540 17807363 16789378
58070 16789378 15857942 14998475 14202820 13462868 12765942 12104079 11481061 10902408 10364570
58061 10364570 9860773 9390037 8952334 8541829 8153582 7790728 7456212 7142610 6838436
58052 6838436 6539841 6248670 5964437 5686408 5418994 5166777 4927700 4698192 4480961
58043 4480961 4280598 4095326 3920188 3754863 3601628 3459201 3325232 3201528 3090155
58034 3090155 2987469 2888271 2792900 2704247 2620985 2539900 2462026 2390301 2323591 2258638 2195468
58023 2195468 2135570 2077416 2018988 1962154 1909486 1859578 1810357 1763880 1722549 1683684 1643370
58012 1643370 1602921 1566085 1532578 1499940 1469291 1443532 1421949 1401901 1383638 1368241 1353122
58001 1353122 1335154 1316180 1299977 1285766 1270314 1254407 1241225 1229692 1215608 1198679 1182657
57990 1182657 1168850 1154921 1140008 1125999 1113480 1101020 1088643 1077896 1068442 1058528 1048788 1041717
57978 1041717 1037355 1033117 1027881 1022922 1018948 1015453 1012771 1011634 1010973 1009060 1006344 1004332 1002435 998945
57964 998945 994351 990601 987803 984715 981708 980117 979301 977368 974104 970295 965148 957707 950007 945394
57950 945394 944045 943069 940551 936510 930643 922361 912693 903231 893630 882826 871872 862494 853781 843690
57936 843690 833176 825238 820192 815479 810142 805980 804043 803333 803496 805576 809325 812583 814286 815734
57922 815734 818045 820416 821721 822059 822134 822465 823458 825065 826459 827141 827837 829130 830242 830637 831440 833259
57906 833259 833980 831234 825969 820915 816467 810888 803841 796694 789748 782138 774379 768059 762877 756653
57892 756653 748572 740036 732182 724890 718378 713395 709483 705178 700191 695563 691732 688480 686570 687201
57878 687201 689779 692287 693844 694890 695049 693183 689605 685876 682132 676758 668922 659434 648895 637160
57864 637160 624882 613459 603082 592741 582470 573621 566660 560682 555492 552245 551471 552228 553754
57851 553754 556383 560386 565391 571313 578455 586473 594565 602719 611398 620166 628218 636073 644898 654132
57837 654132 661734 667010 671352 675879 680182 683819 687241 690577 692966 693759 693214 691549 688396 683527 677204
57822 677204 669759 661710 653961 646748 638806 629084 618877 610609 604734 599578 594133 589152 585426 582820
57808 582820 581297 581185 582089 583194 585036 589511 597490 607570 617535 626069 632961 638749 644406 650484
57794 650484 656481 661636 665790 668565 668681 665597 661089 657402 654349 650123 644517 639227 635067 630999
57780 630999 626124 620727 615136 609181 603053 597117 590868 583605 576073 569696 564213 557938 550434 542988
57766 542988 536185 528882 520110 510390 500737 491709 483584 476108 467946 457866 446431 435054 423750
57753 423750 411646 399519 389545 382333 376352 370699 366297 363762 362081 360253 358626 357870 358092 359473
57739 359473 362311 365990 369436 372926 377859 384328 390605 395463 399459 403449 407426 411219 414741 417244
57725 417244 418027 418234 420202 424559 429738 434641 439695 444717 447906 448044 445919 442584 437929 431961 425807
57710 425807 420275 414800 408841 402974 397681 392421 386892 381957 378347 375578 373001 371004 370455 371889
57696 371889 375555 381044 386658 390615 393268 396527 400751 404045 405199 405343 405903 406841 407945 409924 412990
57681 412990 416016 418358 420926 424230 427017 428425 429999 433909 440189 447316 454649 462850 472498 483392
57667 483392 494726 505297 514403 523177 533901 547287 561551 574895 587549 600600 614308 628621
57655 628621 643900 659910 675479 690382 706241 724245 743320 762009 780879 801417 823652
57644 823652 846652 870614 896745 925565 956748 990190 1025903 1063338 1102104 1142957 1187039
57633 1187039 1234595 1285371 1339485 1396896 1456849 1519229 1585863 1659201 1740189 1828629 1925049
57622 1925049 2030849 2146990 2273924 2412728 2565257 2733264 2918157 3121231 3343156
57613 3343156 3583422 3840956 4114627 4402026 4698147 4996315 5289893 5571277 5828437
57604 5828437 6043451 6195928 6269693 6258607 6168169 6012291 5807794 5570316 5313034 5046644
57594 5046644 4779355 4517260 4265145 4026569 3803476 3596818 3407825 3237597 3085304
57585 3085304 2948139 2823712 2711587 2612147 2525184 2450168 2386605 2333412 2288989 2252535 2224215
57574 2224215 2203534 2188841 2179052 2174542 2175771 2182601 2195700 2216819 2246546 2283439 2326659 2377798
57562 2377798 2438676 2508941 2587631 2675594 2774399 2884050 3003878 3134734 3278068 3433359
57552 3433359 3598269 3770759 3949056 4129859 4308335 4479511 4637892 4776084 4885747
57543 4885747 4960207 4995129 4987568 4936618 4845168 4719261 4565393 4389553 4198437 3999277
57533 3999277 3797611 3596395 3397790 3204761 3020503 2847138 2685267 2534149 2392364
57524 2392364 2259205 2135553 2022623 1919934 1825341 1737158 1655459 1581200 1514622 1454635
57514 1454635 1399499 1348227 1301348 1259678 1222369 1187322 1153793 1123176 1096533 1073048 1051984
57503 1051984 1034193 1019858 1006476 991572 976327 963948 955212 948380 943035 940898 942462 945627
57491 945627 948579 951806 956345 962124 969039 977906 989242 1002661 1018428 1038055 1062084 1088633 1115423
57478 1115423 1142291 1170645 1201512 1235359 1272945 1314831 1360276 1407796 1456843 1508327 1563579
57467 1563579 1623276 1687277 1755217 1827407 1905113 1989446 2079983 2175163 2274164 2377657 2486417
57456 2486417 2599984 2716888 2835228 2952233 3063779 3164934 3250725 3316213 3356748 3369161
57446 3369161 3352844 3309471 3241899 3153455 3047738 2928547 2800047 2667027 2534508 2406508
57436 2406508 2285141 2170865 2063449 1962739 1868916 1782374 1703415 1632101 1568481 1512676
57426 1512676 1464597 1423875 1390221 1363316 1341915 1323819 1307781 1295140 1288450 1288410 1293169 1300899
57414 1300899 1312077 1328561 1351145 1378862 1410471 1445844 1485682 1530432 1580081 1635073 1696828
57403 1696828 1766766 1845032 1930824 2023941 2125255 2235455 2354022 2479542 2610082 2742827
57393 2742827 2874262 3001188 3120444 3226799 3312331 3369416 3394181 3386545 3347896 3280097 3186085
57382 3186085 3069846 2935749 2788675 2634117 2476796 2319497 2164363 2014636 1873448
57373 1873448 1741296 1616658 1499211 1390639 1291967 1201958 1118934 1042612 973143 909508
57363 909508 850110 794417 743213 697487 657412 621980 589409 558375 529001 502140 477860
57352 477860 455453 434680 415811 398288 380598 361954 343156 325458 309563 296024 285309
57341 285309 276680 268020 257785 246580 236177 227559 220551 214672 209550 204929 200896 197854 195881
57328 195881 194636 194185 195185 197591 199848 200263 198850 197115 196390 197161 199783 204778 212134 220915 230053
57313 230053 239301 249206 260312 272600 285624 298855 311757 323665 333925 342175 348280 352079
57301 352079 353753 354644 356992 362218 369728 377987 386481 395921 406651 417710 427785 436663 445441 455263
57287 455263 465836 475260 481801 486005 490510 497419 506398 515708 524258 531988 539221 546826 556416 568871
57273 568871 582844 595967 607485 618525 629904 641183 652199 664152 678406 694960 712631
57262 712631 730126 746692 762471 778548 795970 814334 831939 847560 861519 874899 888439
57251 888439 902392 916774 931483 946744 963505 982695 1003887 1025517 1046598 1067485 1088740
57240 1088740 1110218 1131798 1154283 1178854 1206007 1235365 1266278 1298413 1332062 1367856 1405672
57229 1405672 1443964 1481025 1516971 1553668 1592564 1633510 1675812 1719239 1763435 1807516 1851216
57218 1851216 1895671 1942095 1990242 2039176 2089033 2140742 2193954 2246418 2295794 2341201 2382428
57207 2382428 2418447 2447822 2470446 2487753 2500815 2509147 2512246 2511689 2510525 2510660 2511884 2513494 2515700
57194 2515700 2519049 2523704 2529957 2538422 2548858 2559632 2569209 2577483 2584967 2591762 2598489 2607339 2620790
57181 2620790 2639657 2663493 2692329 2726865 2767490 2814333 2867814 2928004 2994026 3065274 3142389
57170 3142389 3225422 3311655 3397158 3480129 3560839 3638669 3711500 3778335 3840452 3899372 3955396
57159 3955396 4008621 4059708 4108963 4156217 4202355 4249554 4299325 4351538 4406006 4463644 4525314
57148 4525314 4590783 4659608 4731913 4807335 4884099 4959914 5033174 5102898 5168546 5230580 5290411
57137 5290411 5349267 5407824 5467197 5529184 5594942 5664180 5735902 5808872 5881002 5949557 6012762
57126 6012762 6070402 6122532 6168802 6209873 6248400 6287552 6328832 6371724 6414708 6456158 6495122
57115 6495122 6532007 6568218 6604893 6642389 6680884 6720455 6760259 6798542 6834003 6866694 6897573
57104 6897573 6927951 6959498 6993774 7031280 7071369 7113004 7154919 7195274 7232264 7265248 7294523
57093 7294523 7320223 7342480 7362557 7382645 7404419 7428723 7456449 7488359 7523677 7559621 7592350
57082 7592350 7617806 7632310 7633735 7622115 7598294 7562538 7515544 7460020 7399643 7336794 7272396
57071 7272396 7206852 7139061 7065039 6979642 6879704 6764080 6631294 6479037 6305489 6109281
57061 6109281 5888660 5642488 5371187 5074558 4749310 4390693 3995442 3560600 3080395
57052 3080395 2546912 1952890 1291282 553409 -268861 -1179524 -2179554 -3270747 -4455926
57043 -4455926 -5737164 -7117057 -8599916 -10187898 -11877469 -13663015 -15541790 -17512332
57035 -17512332 -19572744 -21727389 -23993834 -26398608 -28968717 -31731204 -34717277 -37964482
57027 -37964482 -41519199 -45426428 -49684096 -54202655 -58877668 -63781607 -69254999 -75660275
57019 -75660275 -82910261 -90220075 -96377812 -100311435 -101471087 -99827283 -95687613 -89572890
57011 -89572890 -82155199 -74149929 -66168033 -58626248 -51748761 -45609881 -40178976 -35368743
57003 -35368743 -31079960 -27222954 -23720375 -20512811 -17566629 -14867585 -12404647 -10164016
56995 -10164016 -8134271 -6306977 -4671104 -3212982 -1921176 -785269 209941 1083578
56987 1083578 1852005 2527372 3121468 3645850 4108405 4514297 4870360 5184973 5463951
56978 5463951 5709861 5924730 6110489 6267799 6397722 6503973 6591118 6661899 6718751 6765828
56968 6765828 6806238 6838857 6861122 6873702 6879566 6880202 6875881 6867717 6855830 6836904 6807207 6767002
56956 6767002 6718901 6663245 6598535 6525184 6445410 6360484 6271432 6181380 6093681 6008214 5922021
56945 5922021 5832214 5736193 5632510 5525900 5427689 5343021 5256796 5138697 4965281 4735105
56935 4735105 4463622 4169819 3869789 3576695 3300156 3045250 2813970 2607099 2424118
56926 2424118 2263179 2122403 2000131 1893580 1798938 1713223 1634408 1559763 1486471 1414442
56916 1414442 1346150 1282665 1221870 1161648 1102923 1048260 999040 955394 917697 886655 862416
56905 862416 844506 832332 825448 823783 827695 837324 852144 871852 897000 927309 959529 988331
56893 988331 1009470 1021274 1023747 1017956 1006269 991487 975202 957857 940230 923707 909158 896724
56881 896724 886606 879100 874166 872078 873961 880407 890110 901391 914499 930672 949351 968172 985370
56868 985370 1000134 1010658 1014034 1008596 994818 973828 946777 915886 884188 853571 824409 797283
56856 797283 773409 753025 734987 718481 703706 690464 677708 665140 653825 644505 636442 628607
56844 628607 620980 614206 608988 606128 606031 607678 609159 609778 610842 614126 620448 629769 641521 654597
56830 654597 668185 683027 700872 722360 746336 771391 796946 822379 846075 865943 880445
56819 880445 889136 892925 893745 893135 891133 887211 882000 877249 874473 874553 878050 884697 893083 902342 913774
56804 913774 929308 948871 971068 996140 1026064 1061345 1099352 1135896 1166685 1187375 1194843 1189593
56792 1189593 1175380 1155601 1131440 1103992 1076163 1051170 1030380 1013803 1001821 995445 995522 1002239
56780 1002239 1014917 1032219 1053495 1079920 1113278 1153839 1200677 1253373 1310844 1368020 1416099
56769 1416099 1447429 1458927 1450649 1423870 1382198 1332350 1281196 1232320 1186472 1144245 1106963
56758 1106963 1075891 1051943 1035484 1025464 1019774 1017660 1020887 1031388 1048737 1071219 1098287 1130072
56746 1130072 1164777 1198061 1224960 1241464 1244819 1234056 1210705 1178124 1139773 1098576 1057511
56735 1057511 1019616 986755 958627 933375 909468 887383 869481 857760 851675 848768 847574 849130
56723 849130 855248 866042 879683 893809 906446 915958 920948 920396 913849 901647 884933 865018 842775
56710 842775 819108 795668 774078 754393 735368 716565 699173 684287 671418 659385 647978
56699 647978 637970 629792 622690 615099 605876 595694 587031 581988 580002 578531 575957 572837 570356 568869
56685 568869 568304 568729 569801 570601 570650 570289 569602 567868 564705 560957 557720 555079 552344 549049 545362 542033
56669 542033 540028 539537 539239 537430 533994 530404 527721 525695 523846 522128 520222 517565 514593 512559 511534
56654 511534 509961 506949 503727 501898 501342 500872 499929 498573 496642 494031 491256 488784 486255 483117 479571
56639 479571 476295 473651 471620 470025 468516 466861 465434 464717 464257 463002 460856 458947 458252 458949 461022
56624 461022 464126 466836 467642 467004 466758 467255 467042 465894 465807 467724 469394 468268 465011 462369 461628 461885
56608 461885 461954 461420 460357 459217 458565 458222 457460 456628 457348 460191 463486 465444 466170 466607 467009 467725 469900
56591 469900 473761 477575 480011 482451 487184 494349 502397 510680 519755 529787 540294 550876 560830
56578 560830 568921 575046 581119 588620 596145 601108 602990 603072 601850 598771 593992 588432 582470 576263 570623
56563 570623 565777 560101 552272 544000 538233 535079 532035 528016 524427 522011 519362 515413 511091 507497
56549 507497 504321 501162 498751 497707 497279 496431 495286 494653 494860 495669 496645 497100 496211 493656 489921 486086
56533 486086 483645 483900 486672 490030 492295 493822 495822 498117 499612 500406 501568 502964 503196 501989 500883
56518 500883 501115 502308 503723 505422 507654 510307 513455 517321 521346 524541 527216 531135 537348 544996
56504 544996 552890 561182 570732 581712 593687 606459 620003 633939 647722 661238 674899 689252
56492 689252 704508 720117 734782 747193 756868 764239 770128 775215 779526 782258 782660 781303 779569
56479 779569 777544 773512 766289 756902 747029 736924 726048 714618 703014 690647 677048 663438
56467 663438 651586 641650 632585 623977 615848 607389 597775 587806 578956 571186 563427 555670 548696 542286
56453 542286 535728 529652 525100 521147 515845 509446 504202 500767 497279 492438 487160 482643 478995 476293
56439 476293 474807 473532 470723 466661 463785 463273 463575 463180 462552 462208 461202 459158 457916 459265 462342
56424 462342 464897 466140 466914 467991 469473 471273 473203 475122 477369 480182 482519 482994 482439 483793 488494
56409 488494 494590 499455 502796 505680 508118 509386 509889 511193 514532 520278 528322 538065 548475 558760
56395 558760 568514 577024 583450 588044 591979 595405 596958 595904 593553 591744 591014 590939 591027 590350 587607 582725
56379 582725 577552 573971 572021 570599 568990 566866 563771 559713 555669 552657 550620 548642 545685 541062
56365 541062 535072 529301 525208 522408 519561 516784 515338 514915 513550 510967 509545 510714 512603 512912 512183
56350 512183 512133 512375 511198 508727 506980 507042 508033 508835 509353 509901 510422 510635 510456 510233 510645 511901 513107 513282
56332 513282 513017 513919 516146 517892 517803 516459 514943 513452 512137 511743 512348 512785 512406 512287 513605 515872
56316 515872 517732 518481 518024 516558 515119 515296 517481 520476 523319 526130 528709 530112 530590 532180 536263
56301 536263 541998 548013 553860 558945 562226 564258 567322 571936 575387 575702 575029 576802 581180 585529 588069
56286 588069 588883 588644 588597 590601 595020 599633 602572 605104 609454 615268 620607 625130 629723 634063 637325
56271 637325 640545 645479 651569 656737 660823 665577 671397 676836 681622 687671 696338 706526 716215 724546
56257 724546 732125 740438 750958 763585 776173 786790 796144 806478 818582 831371 843993 856765
56245 856765 870212 884501 899561 914561 927781 938296 947385 957110 968099 979695 991220 1001825
56233 1001825 1010321 1016871 1023837 1033244 1044409 1055783 1067900 1082352 1098867 1115733 1132503 1150130
56221 1150130 1169103 1189528 1212428 1238779 1267868 1298618 1331888 1369274 1410405 1453700 1499171
56210 1499171 1548114 1600709 1656411 1716170 1781674 1852878 1928811 2010434 2100026 2198173 2304196
56199 2304196 2419252 2545939 2684680 2833459 2991491 3160434 3341493 3534009 3737297
56190 3737297 3951099 4173473 4400724 4630132 4860255 5087602 5305429 5507085 5688819
56181 5688819 5848450 5983197 6090011 6166822 6212724 6228143 6215134 6176360 6113750 6029466 5927746
56170 5927746 5813863 5691265 5561406 5425919 5286878 5145157 5000790 4854883 4708943
56161 4708943 4562505 4413804 4262748 4110909 3958846 3806231 3654528 3506441 3362330
56152 3362330 3220162 3079579 2943132 2812682 2687542 2567131 2452722 2345311 2244302
56143 2244302 2149606 2062697 1984245 1912857 1847378 1788348 1735905 1688194 1643232 1600816 1561551
56132 1561551 1525462 1492290 1461611 1432194 1403045 1375468 1352161 1333848 1318850 1306051 1295656
56121 1295656 1286587 1276328 1264666 1254894 1249670 1247922 1247286 1247394 1249103 1252376 1256683 1262135 1268900 1276740
56107 1276740 1285990 1297513 1311001 1325061 1339702 1356839 1377455 1400151 1423396 1447362 1472527
56096 1472527 1498296 1524037 1549905 1575815 1601176 1626298 1652490 1680308 1709357 1739967 1773064
56085 1773064 1808273 1844598 1883391 1928122 1980660 2040289 2107004 2183077 2270559 2369800 2481130
56074 2481130 2605245 2740929 2884989 3035104 3189676 3343930 3489710 3621271 3738885
56065 3738885 3845518 3942906 4032444 4116467 4195500 4265785 4321561 4358631 4374915 4370064 4346468
56054 4346468 4308815 4260842 4203349 4135569 4056226 3962727 3852295 3725564 3587307 3442966
56044 3442966 3296608 3152426 3014959 2886577 2767453 2658854 2563528 2481918 2411251 2349443
56034 2349443 2296832 2253169 2216577 2186761 2165399 2151655 2141051 2130835 2122810 2118701 2116283 2112675
56022 2112675 2108326 2105209 2103701 2103325 2103903 2104213 2102474 2099845 2100351 2105764 2113849 2123005 2134696 2149526
56008 2149526 2165251 2181020 2199471 2222026 2246122 2269795 2294941 2323197 2352598 2381472 2411838
55997 2411838 2445658 2481307 2516908 2553695 2592964 2633128 2672887 2713934 2757743 2803176 2849798
55986 2849798 2899651 2953069 3006913 3059678 3113974 3171251 3228981 3286257 3346987 3413918 3484526
55975 3484526 3556606 3632688 3714831 3800481 3887968 3980693 4081004 4185327 4290649 4400480
55965 4400480 4518881 4643840 4772539 4907990 5053892 5207437 5363934 5524681 5694084
55956 5694084 5872885 6060394 6259651 6474266 6703647 6946636 7205697 7482117 7771776
55947 7771776 8071250 8383214 8710311 9049408 9398179 9761623 10145472 10549054 10971627
55938 10971627 11419560 11899561 12410529 12949552 13519892 14125499 14764282 15434748 16142472
55929 16142472 16891916 17679554 18503841 19373757 20297940 21274303 22301288 23390413 24555725
55920 24555725 25799530 27121138 28530956 30042815 31661581 33392580 35253891 37264007
55912 37264007 39426419 41742184 44228532 46909800 49801939 52924510 56316695 60022504
55904 60022504 64073611 68509433 73403074 78848033 84938526 91791338 99570826 108464244
55896 108464244 118655322 130361046 143875976 159539611 177677003 198600534 222619195
55889 222619195 249981149 280841481 315276389 352991744 392439751 429935924 460010583
55882 460010583 477400982 479415117 466872782 443145849 412399205 378306510 343573473
55875 343573473 309930508 278319219 249183815 222731519 199029925 177999641 159445655
55868 159445655 143133144 128820475 116250806 105170401 95368163 86679140 78960228
55861 78960228 72088454 65973426 60542109 55711606 51394750 47525149 44056139 40940453
55853 40940453 38130038 35590693 33297457 31217550 29313393 27559415 25941835 24445645
55845 24445645 23055360 21764268 20568826 19456591 18411783 17429156 16510454 15651025
55837 15651025 14841956 14081867 13374304 12715908 12098282 11518964 10979701 10476211 10000216
55828 10000216 9549567 9126386 8727216 8344863 7978246 7630977 7301823 6985716 6682661
55819 6682661 6396674 6127054 5869222 5623116 5392469 5176616 4970778 4773473 4586269
55810 4586269 4407442 4233506 4066117 3910132 3765470 3627638 3495288 3370494 3252792
55801 3252792 3140127 3035022 2942682 2862898 2789835 2719300 2650323 2580588 2507013 2430818 2356106
55790 2356106 2283526 2210756 2138642 2071060 2008957 1949928 1893386 1840957 1792295 1745785 1702877
55779 1702877 1666501 1635666 1606716 1579276 1555756 1535687 1515965 1496368 1479566 1466021 1454051
55768 1454051 1444373 1439113 1436490 1432070 1425331 1419595 1415152 1407901 1395407 1379061 1359401 1334604 1305170
55755 1305170 1275654 1249829 1227263 1205594 1183036 1158287 1131353 1104929 1081964 1061940 1042552
55744 1042552 1024257 1009443 997725 986220 974333 964138 956161 948793 941915 937030 933743 929953
55732 929953 925646 922688 920935 918382 915007 912491 910330 906360 900927 896263 891988 885884 879051 875199
55718 875199 874389 872607 868446 864990 863554 860494 852243 839234 822890 803103 781105 760922 745080
55705 745080 731690 717976 704033 691231 679627 668902 659284 649835 638325 624481 611001 599735
55693 599735 589167 577143 563834 550538 537770 525988 516177 508346 501273 494672 489598 485842 481255
55680 481255 474687 467375 460365 452895 444615 437285 432771 430956 430642 430874 430540 428474 424937 421501 418754
55665 418754 415535 410722 404150 395640 385130 374038 364505 356996 350551 345331 342609 342161 342134 341764 341794
55650 341794 342062 341263 339438 338137 337781 337408 337218 338594 341298 343589 345378 348109 351028 350976 346847 341130
55634 341130 336225 332401 330214 331301 335261 339043 341065 342895 345501 347291 347870 350423 357866 369164
55620 369164 381593 394081 406190 416447 424227 431196 438631 445263 449637 452357 453970 453107 449154
55607 449154 444606 442204 441603 441277 441718 443908 446314 446441 444472 442813 442754 443785 445459 447785 450380 452998
55591 452998 456330 460840 465611 469548 472592 474595 474457 471947 468818 466414 463573 458649 452147 445338
55577 445338 437689 428003 417238 407922 401193 396031 390878 384568 376458 367117 358150 350068 341255 330287
55563 330287 318093 306442 295612 285204 275898 268416 261735 254292 246260 238935 232739 227581 224211
55550 224211 223237 223422 222882 221522 220723 221150 222536 224959 228484 231883 233374 232480 229916 226176 221618 217385
55534 217385 214675 213389 212682 212266 211890 210414 207022 202788 199447 197152 195039 193359 193062 193587 193109 191217
55518 191217 189558 189335 189587 188585 185954 182899 180947 180864 182462 185261 189229 194434 199998 204366 207010
55503 207010 208916 210831 212129 212082 211093 209708 207561 204483 201647 200374 200533 201159 201787 202163 201657 200219
55487 200219 198904 198255 197241 195155 193370 193512 194885 195585 195496 196200 198345 200852 202539 203007 202299 201171
55471 201171 201346 203863 207490 210232 212114 214811 218876 223151 226879 230576 234570 238328 241708 245474
55457 245474 250006 254534 258163 260784 262658 263829 264241 263850 262427 259677 255390 249108 240017 227868
55443 227868 213785 199516 186116 173795 162543 152321 143078 135110 128799 123561 117883 111052 103966
55430 103966 97669 92206 87642 84846 84033 83756 82709 81441 80944 80681 79653 78305 77575 76987 75562 73777
55414 73777 72632 71517 69150 66021 63756 62535 61482 61229 63411 67457 70486 71019 70626 71137 72290
55399 72290 72998 73110 72802 71752 70072 68951 69383 71072 73217 75493 77756 79654 81113 82436 83538
55384 83538 83846 83191 82047 80777 79532 78928 79738 81626 83150 83256 81988 79780 77083 74726 73453 72912
55368 72912 72149 71215 71116 72029 72868 72917 72662 72633 72592 72288 71931 71526 70862 70542 71761 74543 77327 79039 80468
55349 80468 82851 86023 88795 90431 90974 90717 90071 89408 88465 86551 83947 82429 83521 86508 88942 89061
55333 89061 87198 84941 83501 83045 83149 83332 83070 81786 79469 77156 76085 76269 76712 77123 78232 79949
55317 79949 80629 79281 77292 76468 76390 75458 73766 72807 72630 71509 68722 65668 63660 62303 60778 59308
55301 59308 58525 58562 59463 61436 64071 66297 67694 68970 70640 72201 73120 73677 74243 74591 74477 74103 73571
55284 73571 72700 71796 71580 71809 71082 68846 66719 66805 69185 71921 73141 72327 69889 66356 62197 58079
55268 58079 54918 53392 53232 53326 52976 52708 53314 54587 55812 57066 58826 60583 61238 60959 61193 62572 64167
55251 64167 65275 66525 68479 70324 70917 70291 69357 68891 69452 71370 73911 75218 74107 71484 69150 67632
55235 67632 66101 64108 62453 62254 63799 66438 69187 71322 72592 73182 73594 74546 76491 78880 80310
55220 80310 79988 78776 78158 78507 79156 79799 80650 81291 80695 78779 76939 76480 77298 78436 79232 79433 78881 77559
55202 77559 75703 73703 72146 71644 71900 71257 68256 63756 60443 60013 61617 63164 63292 62073 60899 61782
55186 61782 65613 70804 74623 75979 75866 75191 73819 72008 70936 70947 70799 69655 68482 68451 69201 69908 70922
55169 70922 72885 75076 76087 75709 74923 74356 73849 73226 72462 71266 69479 67810 67342 68314 69921 71152
55153 71152 71300 69994 67538 65248 64786 66861 70626 74211 75842 74960 72646 70745 70342 71179 72502 74007
55137 74007 75884 78387 81431 84235 85497 84657 82953 82474 83986 86293 87722 87522 85904 83770 82400
55122 82400 82404 82916 82882 83082 85276 89044 91245 89607 85523 82167 80935 80853 80626 79895 78954 78303 78361 78962
55104 78962 79368 79115 78389 77391 76075 74776 74201 74333 74190 73078 71283 69351 67820 67826 70310 73989 75804
55087 75804 74537 72537 72629 74711 76769 77798 77894 76622 73585 70209 68821 69829 71407 72104 72329 72979
55071 72979 73921 74398 74245 74295 75840 79526 84387 88337 90092 90236 90003 89751 89309 88930 88796 88187 86401
55054 86401 84283 83654 85238 88001 90488 92143 93393 95068 97599 100329 101909 101677 100186 98125 95609
55039 95609 93090 91869 92673 94509 95945 96839 97823 98861 99598 100525 102427 104907 106602 106709 105502 103786
55023 103786 102675 103339 105886 108951 111213 112699 113719 113584 111851 109972 109963 111820 113921 115641 117847
55008 117847 120870 123616 124863 124192 121680 117983 114631 112884 112271 111479 110441 110124 110594 110989 111344 112489
54992 112489 113908 113596 110737 107012 104608 104250 105568 107895 110008 110555 109632 108706 108319 107155 104198 100543
54976 100543 98034 97232 97737 99448 102228 105097 107065 108315 109573 110840 111782 112855 114679 116490 116541
54961 116541 114344 111566 110209 110558 111373 111590 111193 110630 110086 109686 109985 111652 114638 118120 121418 124500
54945 124500 127388 129678 131113 132136 133226 134102 134325 134450 135789 138920 142947 146221 147460 146337 143599
54930 143599 140605 138446 137510 137788 138925 139662 138242 134263 129508 126065 124196 122856 121570 120540 119565
54915 119565 118332 117456 117751 118664 118970 118991 120484 124031 128000 130553 131486 131688 131969 132847 134384 135873 136717
54898 136717 137720 140211 143609 145556 145150 144456 145751 148750 151887 155186 160078 166946 174514 181705 188839
54883 188839 196786 205882 215985 226893 238218 249168 258859 267085 274880 284027 295354 307241 316302
54870 316302 320031 318624 314046 307749 299771 289838 278601 267347 256623 245671 233553 220570 208037
54857 208037 196861 187183 179420 174417 172017 170619 169090 168093 168406 169008 168391 167017 166662 167797 169512
54842 169512 171864 176186 182804 190386 198103 206656 216460 226473 235780 244957 254921 265622 276656
54829 276656 287898 298475 306218 309275 307631 302368 294325 284107 272362 259133 243953 227464
54817 227464 212018 199679 190404 182964 176597 170822 164794 158271 152453 148461 145599 142424 138968 136399
54803 136399 134867 133275 131193 129642 129661 131143 133356 135666 137401 137844 136913 135490 134645 134653 134875 134503 133353
54786 133353 131947 130815 129900 128897 127851 126770 124862 121177 116243 112090 110117 109773 109777 109798 110253 111308
54770 111308 112789 114503 115883 116005 114641 112812 111670 111490 112342 114749 118676 122673 125284 126822 128534
54755 128534 130417 131239 130669 130051 130728 132473 133954 134163 133198 132133 132306 134367 137855 141797 145489 148605
54739 148605 151049 153137 155543 158598 161985 165582 170143 176642 185147 194708 203945 211596 217259 222223
54725 222223 228891 238725 251230 265242 280167 295233 308798 319740 328686 336420 341816 343017 340195
54712 340195 335308 329309 321551 312178 303059 295500 288643 281198 273563 266959 261449 256183 251123 247139
54698 247139 244493 242366 240289 239134 240105 243149 246999 250634 254124 257921 261970 266126 271132 278419
54684 278419 288771 301712 316262 331694 347392 362741 377645 392573 407511 421258 432099
54673 432099 438665 439858 434905 424382 410544 395676 380415 364373 347790 331533 315965 301033
54661 301033 287276 275485 265379 255849 246657 238678 232093 225564 217994 210310 204595 201772 200791 199870
54647 199870 198062 195645 193427 191967 191409 191734 192690 193470 193121 191775 190887 191609 193282 194327 194241 193750 193220
54630 193220 192156 190558 189652 190583 192948 195114 195540 193576 189651 185406 183234 184791 189606 195334 199470
54615 199470 201049 201030 201308 203129 206136 208824 210010 209939 210048 211671 214937 218912 222822 226885 231755 237501
54599 237501 243726 250469 257961 265223 270006 271051 269787 268910 269633 271173 272586 273937 275524 276877 277079
54584 277079 275811 273855 272777 274034 278018 283951 290805 298196 306306 315423 325881 337925 351171
54571 351171 364662 377928 391335 404639 415831 422562 424449 423030 419639 414465 407536 399314 389923
54558 389923 378900 366212 352817 339843 327957 317790 309934 303879 297784 290352 282599 276867 274092
54545 274092 272809 270987 268189 265400 263154 260661 257061 252909 249717 248144 247355 246188 244262 241659
54531 241659 238341 234468 230676 227371 224104 220187 215492 210147 204060 197552 191982 188680 187326 186173
54517 186173 183784 179893 174830 169048 163338 158792 156211 155689 156482 157057 155932 153182 150612 149635 149530
54502 149530 148795 147598 147552 149243 151424 152744 153004 152409 150791 148107 144971 142288 140891 141367 143398 145416
54486 145416 146035 145889 146874 149516 152462 154781 157181 160201 162703 163378 162775 162549 163297 164382 165641 168041
54470 168041 172480 178599 185102 190985 196378 202124 208490 214457 218754 221388 223498 225725 227632 228954
54456 228954 230468 232888 235513 236599 234853 230156 223267 215410 207861 201347 195702 190354 185090 180274
54442 180274 176275 172794 168880 163929 158639 154477 151989 150349 148936 148427 149441 150983 151538 151239 151476
54427 151476 152610 153568 153606 152946 151605 149244 146571 145228 145705 146773 147601 148897 151137 153134 153625 153150
54411 153150 153172 154142 155553 157211 159290 161604 163747 165631 167266 168534 169666 171238 173200 174859 176408
54396 176408 179323 184255 189519 192866 193986 194064 193623 192196 189711 186844 184132 181807 180262 179617 178911
54381 178911 176787 173096 169186 166709 166588 168663 171565 173338 173107 171852 170912 170271 169311 168633 169676 172579
54365 172579 175737 177706 178509 178722 178272 176761 174445 172255 170867 169997 168762 166924 165583 166166 168707
54350 168707 171849 174674 177530 180632 183149 184642 186381 189904 194939 200129 205244 211174 217937 224251
54336 224251 229185 233048 236544 240172 244587 250390 257200 263755 269113 273085 275636 276821 277262 277599 277398
54321 277398 275632 272240 268109 263464 257685 251057 245234 241198 237817 233353 227565 221434 215575 209966
54307 209966 204883 201062 198816 197493 195947 193425 190192 187338 185706 185015 184391 183680 183547 184239 185092 185583
54291 185583 186100 187114 188295 189158 190161 192367 196125 200717 205214 209141 212222 214090 214805 215555 218244
54276 218244 223878 231370 238379 243379 246427 247906 247474 244939 241356 238084 235136 231581 227385 223531
54262 223531 220224 216321 211116 205576 201114 197855 194789 190962 185984 180058 174195 169781 167124 164802
54248 164802 161188 156314 151658 148392 146451 144991 143101 140235 136681 133617 132138 132081 132177 131382 129815
54233 129815 128441 128142 128969 130029 130203 129233 127953 127246 127078 126911 126630 126406 125893 124465 122471 121436 122448
54216 122448 124746 126413 126254 124607 122644 121579 122480 125918 131193 136395 139979 142171 144226 146367 147320
54201 147320 146178 143879 142179 141667 141564 141185 140669 140252 139651 138501 136917 135372 134378 134331 135238 136491 137437
54184 137437 138259 139692 141700 143151 143185 142246 141228 140272 139238 138819 139910 141831 142349 140125 136501 134240
54168 134240 134865 137778 141515 144971 147456 148637 149029 149859 151692 153535 154119 153868 154555 156810 159036 159424
54152 159424 158330 157774 159082 161886 165145 168162 170598 172426 174098 175986 177386 176743 173305 168123 163057
54137 163057 159217 156558 154401 151956 148817 145531 143359 143011 143860 144789 145346 145516 144841 142814 140092 138247
54121 138247 137835 137544 135949 133481 131742 131239 130956 130314 130293 131827 133971 134913 134516 134629 136741 140391 144223
54104 144223 147531 150119 151570 151624 150805 149780 148429 146364 143991 142155 140846 139184 136557 133055 129008
54089 129008 125039 122296 121399 121146 119621 116825 114847 114894 115643 115408 114604 114695 115685 116300 116154 116087 116413 116432
54071 116432 116084 116686 119228 122779 125357 125948 125082 123781 122602 121643 121017 121073 122042 123358 123560 121479 117736
54054 117736 114522 113512 114220 114833 114412 113759 114159 115782 117618 118652 118765 118528 118533 119168 120702 122913 124483
54037 124483 123454 119125 113357 109170 107788 107778 107432 107221 109043 113499 118951 123302 125847 127293 128785
54022 128785 131180 134352 136792 136766 134545 132705 133315 135545 137115 137442 137825 138850 139561 139622 140428 142920
54006 142920 145692 146776 146427 146576 147963 149486 150423 151632 153967 156809 159058 160823 163093 166049 168688
53991 168688 170183 170916 171882 173548 175807 178749 182730 187395 191311 193340 194243 196130 200195 205742 211661
53976 211661 217976 225350 233724 242327 250699 259002 267486 276291 285599 295439 305547 315851 326750
53963 326750 338343 349899 360847 371733 383188 394305 403352 410078 415991 422154 427848 431769 433391
53950 433391 432677 429621 424902 420066 416100 412281 407218 400586 393206 385835 378585 371204 363250 354299
53936 354299 344567 335118 326934 319968 313619 307778 302781 298535 294437 290216 286303 283163 280617 277977
53922 277977 274699 270860 267115 264157 262168 260974 260673 261709 264077 266814 268680 269191 268858 268689 269705
53907 269705 272446 276415 280188 282605 283847 285009 286630 288095 288560 288145 287846 288290 288819 288119 285837 283114
53891 283114 281139 279565 277186 274075 271940 271912 272949 273335 273137 274073 277073 281092 284654 287695 291278
53876 291278 295937 301012 305682 310163 315535 322497 330593 338747 346270 353148 359606 365797 371788 377370
53862 377370 381915 384942 386949 389186 392401 396277 400290 404600 409695 415661 422259 429416 437128 445044
53848 445044 452610 459578 466262 473445 482075 492472 503448 512676 518513 521236 522166 522000 520626 518152
53834 518152 515248 512446 509858 507654 506070 504659 502114 497349 490426 482067 472528 461514 449236 437049
53820 437049 426601 418315 410988 402973 393666 383792 374478 366289 358991 351898 344508 337046 330345 324894
53806 324894 320129 315000 309036 302379 295029 286807 278092 269754 262158 255027 248545 243646 240635 238407
53792 238407 235807 233175 231615 231079 230104 227378 222972 218118 214226 211933 210618 209083 207001 205229 204331
53777 204331 203629 202569 202220 204029 207374 209794 209774 207971 205410 201977 197556 193495 191609 192075 193343
53762 193343 194008 194037 194087 194441 194957 195648 196770 198367 200055 201497 202978 205190 208396 212098 215649 218802
53746 218802 221510 223734 226033 229814 236095 243984 251275 256780 261532 267498 275745 286052 297491 308754
53732 308754 318437 325817 331391 336222 340759 344607 347377 349395 351517 354406 358032 361770 364952 367314
53718 367314 368936 369993 370770 371620 372347 371712 368372 362709 357063 353558 352058 350854 348896 346459 343847
53703 343847 340590 336353 331777 327812 324705 322223 320443 319652 319703 320091 320593 321300 322152 323034 324200 325920
53687 325920 327678 328548 328543 328704 329446 329630 327971 324785 321622 319544 318403 317396 315641 312554 308437 304494
53671 304494 301561 299177 296576 294053 292266 290572 287460 282716 277768 273655 269986 266438 263889 263113
53657 263113 263248 262599 260574 258221 257316 259303 264356 270930 276805 281046 284300 287010 288647 289354 290807
53642 290807 294032 297494 299089 299413 301268 306178 313103 320621 328489 336584 343981 350166 356116 363066
53628 363066 370679 377311 381891 384922 387640 390623 393365 395102 395809 396059 395940 394765 392303 389648 388032
53613 388032 387084 385194 381546 376997 372930 370044 368351 367580 367234 366740 365817 364415 362425 359865 357134
53598 357134 354583 352127 349920 348914 349650 350706 349775 346513 343083 341447 341234 340852 339578 337739 335821
53583 335821 334365 334076 335024 336143 336415 336119 336060 336062 335379 334280 333881 334242 334008 332668 332166 335153 342044 350703
53565 350703 358755 365205 369846 372443 373381 374291 376841 381017 385454 389397 393433 398227 403493 408616 413481
53550 413481 418212 422749 427128 431547 435802 439461 443024 447925 454661 461941 468676 475772 484564 494300
53536 494300 502868 509594 515643 521825 527747 533259 538944 544770 549845 554062 558524 563630 568192 571310
53522 571310 573857 576984 580247 582474 583718 585170 587615 590935 594732 598470 601264 602335 601683 600009
53508 600009 598358 598002 599749 602808 605268 606476 607963 610960 614049 614977 614300 615281 619899 626620 632736
53493 632736 637519 642067 647058 651990 656441 660968 666449 673061 680230 687371 694446 701874 710040 718883
53479 718883 727887 736434 744314 751984 760227 769370 778878 787914 796288 804692 814046 824845 837077 850418
53465 850418 864381 878532 892763 907328 922640 938994 956270 973802 991004 1008468 1027932
53454 1027932 1050510 1075234 1100163 1124740 1150263 1178074 1208164 1239524 1270973 1301635 1331756
53443 1331756 1363394 1399203 1439897 1483567 1527786 1571525 1614710 1657172 1698934 1740617 1782637
53432 1782637 1824651 1866574 1909283 1953363 1997881 2041535 2084429 2127420 2170173 2211369 2250829
53421 2250829 2290077 2330463 2371888 2413762 2456208 2499538 2543173 2585771 2626209 2664036 2699232
53410 2699232 2732011 2762853 2792307 2820542 2847127 2871405 2893103 2912407 2929289 2943096 2953187
53399 2953187 2959684 2963023 2962896 2958555 2950193 2938992 2925407 2908409 2887189 2862804 2837218 2811275
53387 2811275 2784492 2756357 2726786 2695662 2662970 2629303 2595322 2560801 2525041 2488168 2451077
53376 2451077 2414094 2376720 2338925 2301750 2266162 2232044 2198955 2167327 2138344 2112922 2091290
53365 2091290 2073320 2058590 2046076 2034443 2023143 2013064 2005630 2001172 1998745 1997802 1999322 2004454 2012487
53352 2012487 2021452 2030787 2042165 2057226 2075771 2097000 2121363 2149866 2182195 2216845 2252757 2289743
53340 2289743 2327745 2366997 2408825 2454840 2505074 2557916 2612218 2668470 2727607 2789684 2854312
53329 2854312 2921659 2992262 3066143 3142506 3220177 3298306 3377062 3457648 3541039 3626536 3712070
53318 3712070 3796033 3878204 3958896 4038085 4115765 4192270 4267417 4339749 4407431 4469723 4526963
53307 4526963 4579166 4625308 4664150 4695395 4719805 4738360 4751426 4758606 4759238 4752968 4739848 4719812
53295 4719812 4692152 4655844 4610772 4558637 4502202 4443213 4381223 4314842 4244065 4170879 4097594
53284 4097594 4025078 3952732 3879654 3805561 3731019 3657194 3585154 3515219 3447070 3380323 3314479
53273 3314479 3248526 3181614 3114415 3048922 2986363 2926204 2867822 2812225 2761046 2714300 2670161
53262 2670161 2626823 2584007 2543050 2506101 2474660 2448013 2423452 2398741 2373825 2349352 2324468
53251 2324468 2297671 2269502 2242795 2220000 2201426 2186116 2173132 2161631 2151055 2141937 2135659 2132837
53239 2132837 2132706 2134479 2138422 2144956 2153592 2163662 2175629 2190709 2209316 2230558 2253396 2277774
53227 2277774 2304348 2333387 2364396 2396986 2431761 2469854 2511538 2555704 2600757 2645492 2689053
53216 2689053 2730835 2770841 2809279 2845293 2876883 2902905 2924432 2943323 2960099 2974106 2984963
53205 2984963 2992631 2996711 2996884 2993625 2987283 2977118 2962698 2945563 2927708 2908725 2886381 2859964
53193 2859964 2831005 2800454 2767322 2730929 2692638 2654325 2616430 2578457 2540196 2501508 2461915
53182 2461915 2421253 2380051 2338717 2297297 2256371 2217111 2179970 2144336 2109860 2076912 2045381
53171 2045381 2014479 1984268 1955871 1929441 1903477 1877076 1851339 1827523 1805278 1783995 1764414
53160 1764414 1747398 1732248 1717752 1703939 1691308 1679309 1667205 1655666 1645875 1637553 1629216 1619839
53148 1619839 1609025 1596263 1581517 1565931 1550485 1534455 1516652 1497655 1479338 1462617 1447091
53137 1447091 1432320 1417851 1402531 1385597 1368150 1351687 1335469 1317280 1296756 1275907 1256130
53126 1256130 1236748 1216979 1197316 1178101 1158404 1137379 1115404 1092925 1069402 1044489 1019284
53115 1019284 995398 973334 952524 932419 912927 894285 876843 860450 844022 826616 808929
53104 808929 792542 777455 761815 744671 727461 711794 697141 682045 666537 651886 638632
53093 638632 626287 614479 603051 591352 578876 566543 556053 547837 540697 533607 526749 520535
53081 520535 514651 508568 502257 495877 489337 482582 475837 469273 463075 458097 455510 454994 453976 449891
53067 449891 443139 436745 432924 430954 428712 425212 420902 416356 411951 408469 406621 405794 404258 401027
53053 401027 396738 392324 387793 382950 378479 375263 373033 370732 368080 365866 364531 363213 360582 356316
53039 356316 351516 347816 346075 345750 345614 345193 345207 346375 348221 349642 350429 351591 354197 358328 363222 367992
53023 367992 372234 376188 380318 384624 388647 392270 395878 399276 401124 400389 398026 396222 396081 396857 397283
53008 397283 396593 394177 389459 382763 375602 369472 364587 359965 354411 347387 339489 332185 326550 322144
52994 322144 317626 312515 307606 303520 299694 295163 289740 283975 278552 274210 271737 271318 271964 272102 270868
52979 270868 268835 267439 267539 268317 267918 265516 262360 260131 258653 256276 252350 248117 244959 242966 241694
52964 241694 241114 241081 240835 240010 239440 239985 241111 241609 241272 240925 241039 241274 241311 241240 241110 240834 240621 240760 240806 239664
52944 239664 236893 233497 231061 230253 230524 231065 231678 232548 233477 233847 233501 233166 233553 234304 234490 234101 234276 235818
52926 235818 238140 240031 240974 241337 241723 242524 243750 244895 245338 245217 245541 247104 249591 252026 253708 254465
52910 254465 254497 254417 255040 256665 258739 260409 261014 260017 257339 254190 252623 253458 255242 256087 255978 256473 258686
52893 258686 262498 267220 271918 275518 277869 280532 285125 290866 295134 296832 297979 301411 307951 316430
52879 316430 325493 334435 342881 350654 357879 364684 370869 376168 380592 384256 387200 389659 392115 394673
52865 394673 396681 397349 396606 395087 393489 392185 391254 390600 390113 389735 389165 387589 384304 379805 375669 372924
52849 372924 370921 368354 365039 362146 360788 360901 361458 361361 360067 357770 355232 353271 352254 351992 351973 351672
52833 351672 350811 349513 348132 346947 346128 345974 346814 348503 350292 351443 351793 351559 350835 349496 347499 345205
52817 345205 343575 343924 346951 351824 356681 360303 362797 364441 364673 362914 359823 356837 354767 353669 353672
52802 353672 354834 356243 356507 355554 354957 355993 358189 360341 362100 363813 365442 366658 367745 369485 372070
52787 372070 374799 376907 378222 378966 379427 379934 380751 381795 382603 382696 381855 380203 378241 376701 376082 376368 377338
52770 377338 378900 380792 382228 382294 380668 377700 374051 370581 368186 367115 366756 366746 367931 371213 375687
52755 375687 379170 380848 382071 384048 386060 386917 387091 388099 390341 392847 394892 396515 397394 396434 392917
52740 392917 387303 380631 373720 367142 361220 355687 349903 343751 337932 333155 329536 326893 325005 323267
52726 323267 320777 317336 313786 310731 307364 302459 296409 291354 288844 287852 285609 280359 273097 266590
52712 266590 262809 261373 260350 258405 255904 253988 252935 251751 249259 245253 240476 235743 231410 227724
52698 227724 225260 224576 225336 226169 225666 223492 220321 216871 213279 209379 205317 201675 198980 197047 194922
52683 194922 191714 187580 183586 180442 177807 175041 172107 169178 165889 161833 157603 154350 152237 150310
52669 150310 148140 146689 146959 148494 149847 150078 149229 147797 146463 145990 146638 147714 148347 148688 149741 151901
52653 151901 154220 155380 154974 153516 151439 148590 144829 140906 138360 138426 141057 145013 148652 150570 150066
52638 150066 147812 146012 146962 150909 155710 159019 160425 161117 162019 163037 163901 164867 166256 167803 168873
52623 168873 169241 169429 170253 172088 174575 177046 179108 180719 181928 182940 184349 186721 189752 192367 193925
52608 193925 194926 196220 198078 200561 204190 209393 215401 220531 223773 225654 227435 229821 232559 235006
52594 235006 236869 238360 239518 239573 237461 233295 228677 225008 221892 217868 212432 206540 201308 197042 193535
52579 193535 190499 187537 184467 181847 180446 180021 179403 178153 177331 178052 179975 181867 183167 184173 184937
52564 184937 184837 183393 180989 178583 177004 176530 176890 177569 178171 178514 178371 177446 175873 174627 174998 177465
52548 177465 181064 183929 184658 183408 181726 181082 181590 182403 183223 184755 187478 190647 193079 194472 195346 195928
52532 195928 195992 195818 196506 198844 202253 205265 206923 207419 207536 207842 208541 209762 211557 213574 215093 215749
52516 215749 216062 216913 218543 220480 222409 224493 226696 228486 229677 230901 232558 233813 233612 232391 231746
52501 231746 232324 233127 233208 233108 233979 236035 238634 241454 244813 248992 253797 258653 262769 265502 266979 268024
52485 268024 268975 269093 267905 266601 266944 268855 270391 270503 270605 272589 276156 279277 280906 282179 284801
52470 284801 289024 293419 296205 296719 296027 296307 299144 304078 308982 312101 313586 314781 316199 316806 315694
52455 315694 313990 314151 317080 320763 322542 322041 320785 319446 317209 314092 312002 312281 313570 313617 312276
52440 312276 311076 310461 309406 307607 306166 305791 306018 306638 308168 310226 311160 310470 310045 311631 314297 315992
52424 315992 316522 317047 317400 316210 313672 312014 312651 314655 316875 319899 324621 329995 333798 335288 335866
52409 335866 337142 339271 341322 342549 342962 343033 343182 343573 344335 345734 347828 349982 351231 351247 350563 349701 348734
52392 348734 348063 348910 352164 356986 361382 364234 366075 367707 368787 368348 366450 364737 365177 368310 372742
52377 372742 376318 377793 377423 376097 374288 372132 370202 369524 370511 372200 372967 372005 369990 368344 367977 368674
52361 368674 369474 369568 368929 368248 368341 369670 372184 375321 378128 379782 380320 380722 381957 383987 386003 387524
52345 387524 388847 390411 392338 394910 398924 404841 411700 417660 421879 425307 429192 433124 435253 434549
52331 434549 432378 431423 433107 436327 438719 438863 437109 434597 432010 429404 426845 424803 423840 423998 424534
52316 424534 424442 423430 422217 421516 420910 419366 416865 414729 413972 414159 414562 415696 418730 423703 429316 434262
52300 434262 437910 439959 440688 441647 444890 451051 458862 466663 473458 478471 481208 482601 484815 488947 493877
52285 493877 498312 502930 509199 516834 523899 529200 533310 537433 542399 548705 556291 564115 570956 576836
52271 576836 582766 588972 594341 598004 600661 603914 608862 615636 623779 632732 642235 652455 663452 674728
52257 674728 685787 696956 709019 722209 736333 751705 768884 787416 805934 823831 841952
52246 841952 861293 881978 903877 927205 951867 977194 1003114 1030733 1060777 1092187 1123293
52235 1123293 1153883 1185006 1217128 1249638 1282090 1314694 1347411 1379626 1411128 1442561 1474302
52224 1474302 1505485 1534747 1561570 1586303 1609136 1629752 1648171 1665338 1682430 1699687 1716215
52213 1716215 1730918 1743251 1752976 1759643 1762946 1763509 1762744 1761667 1760213 1757925 1755017 1752354 1750487 1749082
52199 1749082 1747407 1745271 1743419 1742937 1744267 1746996 1750800 1756346 1764746 1776143 1789269 1802615 1815663
52186 1815663 1828963 1843485 1860238 1879958 1902616 1927319 1953016 1979231 2005923 2032836 2059310
52175 2059310 2084565 2107957 2129100 2147991 2164888 2179759 2191974 2200796 2206161 2208819 2209782 2209728 2208780
52162 2208780 2206586 2202624 2196562 2188430 2178459 2166853 2153657 2138885 2122837 2106352 2090403 2075191
52150 2075191 2059858 2043495 2026173 2008517 1990612 1972123 1953406 1935605 1919517 1905174 1892721
52139 1892721 1882731 1875178 1868883 1862653 1856448 1851080 1847298 1845460 1845213 1845021 1842999 1839067 1835445 1834114
52125 1834114 1834582 1835115 1835185 1835317 1835355 1834698 1833960 1834350 1835233 1834208 1830223 1824949 1820298 1816102 1811402 1806554 1802539
52108 1802539 1799010 1794699 1789410 1784165 1779440 1774491 1768561 1761696 1754216 1746303 1738393 1731130 1724550 1717913
52094 1717913 1710741 1703496 1696973 1691507 1686948 1682849 1678420 1672963 1666763 1660897 1655648 1649865 1642673 1635138
52080 1635138 1629103 1624630 1619971 1614167 1608396 1604232 1601649 1599596 1597754 1596655 1596436 1596447 1596060 1595214 1594171
52065 1594171 1593275 1592818 1592643 1592002 1590398 1588407 1587050 1586573 1586612 1587466 1590217 1595346 1602065 1609386 1617239 1626164
52049 1626164 1636463 1648017 1660587 1674039 1688713 1705582 1725457 1748007 1772254 1798094 1826416
52038 1826416 1857581 1890949 1926348 1964667 2006102 2048843 2090589 2130615 2169327 2206610 2241910
52027 2241910 2275293 2306995 2336248 2361966 2384466 2405144 2424443 2441458 2455590 2467267 2476670
52016 2476670 2483071 2485945 2485820 2483540 2479493 2473907 2466984 2458308 2447043 2433192 2417858 2401830 2384933
52003 2384933 2367379 2350748 2336621 2324945 2314736 2305941 2299562 2296134 2294958 2294787 2294612 2293899 2292804
51990 2292804 2292335 2293915 2298567 2306437 2316707 2327865 2338637 2349153 2360717 2373856 2387081 2398308
51978 2398308 2407121 2414736 2421941 2428124 2432462 2435126 2436881 2438002 2438059 2436348 2432235 2425380 2415933 2404411
51964 2404411 2391240 2376579 2360519 2343041 2323728 2302006 2277860 2251908 2224532 2195475 2164827
51953 2164827 2133913 2104349 2076127 2047335 2016075 1982138 1946501 1909789 1871992 1833489 1795492
51942 1795492 1759106 1724354 1690279 1655628 1619287 1580755 1540833 1501490 1464312 1429009 1393863
51931 1393863 1357543 1320033 1282042 1244282 1207477 1172269 1138559 1105389 1071879 1038166 1005177
51920 1005177 973782 944350 916761 890532 865181 840682 817341 795097 773459 752388 732734
51909 732734 715196 699245 683701 668264 653924 641908 632548 625034 617831 609569 600138 590892 583309
51896 583309 577432 571965 565613 557764 548148 536875 524988 514049 504728 496440 488712 482045 476732
51883 476732 471630 465234 457819 451446 447665 445970 444731 442927 440447 437182 432629 426584 419845 413811
51869 413811 409195 405307 400984 396233 392369 390102 388099 384318 378535 372529 367661 363462 359103 355080
51855 355080 352321 350371 347901 344796 342312 340869 339017 335347 330547 326611 324471 323301 321885 319903
51841 319903 317826 316290 315789 316382 317308 317163 314884 310636 305602 300980 297279 294445 292305 290583 288662
51826 288662 285935 282660 280045 279029 279279 279876 280644 281995 283598 284272 283438 281757 279907 277696 275018
51811 275018 272780 271930 272118 272283 272077 271837 271647 271563 272350 274664 277576 279193 278884 277722 276663 275744 275484
51794 275484 277430 282264 288475 294070 298761 303328 307609 310698 312856 315573 319384 322849 324348 323949
51780 323949 322808 321378 319219 316380 314037 313301 313910 314540 314296 313480 312970 313418 315159 318269 322151 325497
51764 325497 327377 328224 329118 330271 331052 331411 332240 333967 335879 337409 339163 341702 343945 344005 341502 338113
51748 338113 335629 334245 332985 331127 328748 326247 323850 321771 320557 320897 322800 325143 326506 326511 325846
51733 325846 324959 323435 321078 318874 318100 318795 319822 320203 319756 318698 317455 316853 317776 320410 324178 328317
51717 328317 332074 334628 335687 336243 337916 341185 344840 347513 349247 351147 353894 357025 359511 360731
51703 360731 360945 360937 361167 361426 361638 362743 366089 371752 378058 383105 386443 389072 392324 397027 403181 409827
51687 409827 415541 419655 423003 427015 432192 437870 443414 449194 456166 464808 474667 484755 494231 502680
51673 502680 509845 515315 518759 520627 522286 525076 529201 533772 537987 541932 546045 550067 553040 554478
51659 554478 555218 556684 559337 562326 564807 567134 570247 574136 577666 580062 581956 584606 588474 592982
51645 592982 597363 601196 604228 606352 608022 610324 614178 619403 624624 628134 629049 627977 626671 626723 628285
51630 628285 630137 631170 631708 633096 636116 640199 644299 648157 652363 657392 663055 668931 674952 681251
51616 681251 687511 692750 695898 696591 695372 693116 690426 687683 685421 684115 683469 682447 680403 677853 675641
51601 675641 673588 670563 665786 659517 652543 645649 639476 634040 628235 620695 611563 602579 594900 587724
51587 587724 579804 571505 564173 557937 551416 543639 535128 526877 519205 512139 506260 502434 500812 500246
51573 500246 498709 494616 488223 481591 476615 473196 469949 466417 463488 461477 458963 454319 447723 441015
51559 441015 435924 432971 431639 430961 430102 428864 427546 426147 424066 420848 416829 412749 409208 406868 406525
51544 406525 408194 410440 411471 410885 409862 409702 410702 412264 413458 413461 412076 410058 408662 408721 410264 412705
51528 412705 415123 416809 418192 420865 425962 432644 439043 444537 450042 455969 461083 463926 464476 463779 462809
51513 462809 462380 463232 465066 465991 464110 459602 454314 449480 444837 439994 435538 432400 430915 430828 431617 432531
51497 432531 433126 434091 436768 441274 445857 448730 449948 450856 452467 455250 459619 465210 470075 472220 472082
51482 472082 472104 473649 475702 476945 477432 477357 475863 472635 469510 468569 469156 468722 466526 464648 464953 466799
51466 466799 468539 469880 471658 474291 477541 481221 485141 488849 492260 495994 500163 503354 503986 502412
51452 502412 500432 498817 496638 493320 489891 487332 484730 480317 473990 467719 463419 461227 459934 458344
51438 458344 455868 452506 448886 446063 444652 444060 442986 440808 438197 436283 435468 435209 434704 433518 431891
51423 431891 430796 431538 434763 439817 445441 451058 456941 463172 469132 474275 478872 483570 488708 494479
51409 494479 501379 509819 519430 529177 538098 545743 552279 558564 565725 574059 582669 590726 598683 607369
51395 607369 616303 624059 630240 635715 640578 643258 642599 639938 637973 638012 639301 640696 641901 643030 643937
51380 643937 644553 645449 647626 651768 657714 664557 671272 677269 682207 685414 686059 684199 681107 678086 675234
51365 675234 671798 667344 662084 656489 651286 647424 645088 642909 639062 633234 626681 620380 614197 608178
51351 608178 603450 600957 599988 598929 597213 595767 595629 596777 598384 599717 600505 600732 600459 599991 599988 601042
51335 601042 602960 604847 606140 607051 607493 606168 601770 594836 587257 579877 571863 562681 553285 544561 535978
51320 535978 526852 517889 510074 502780 494474 484947 475449 466845 458953 451555 444611 437387 428919 419718
51306 419718 411656 405486 399640 392389 384218 377070 371858 367682 363178 357761 351664 345530 340122 336027
51292 336027 333359 331735 330464 328866 326734 324477 322469 320434 318017 315748 314566 314318 313809 312681 312133
51277 312133 313025 314259 314098 312465 310733 309630 308560 306945 305069 303339 301799 300865 301647 304662 308652
51262 308652 311648 313358 315803 321104 328846 336198 340737 342714 344266 346940 350639 354739 359194 364097
51248 364097 368838 372280 373563 372460 369336 365065 360653 356569 352674 348930 345625 342569 338690 333114
51234 333114 326290 319485 313417 307946 302766 297727 292609 287300 282204 277938 274638 272073 270411 270128
51220 270128 270950 271397 269916 266405 262283 258939 256289 253252 249659 247045 246914 248711 250522 251604 252864
51205 252864 254642 255650 255034 254038 254177 254744 253952 252053 251421 253363 256380 258062 257602 256030 254924 255216
51189 255216 256494 257162 256005 253745 252207 251935 251610 250101 247919 246166 245065 244277 243820 243882 244184 244253 243997
51172 243997 243536 242866 242153 241911 242362 242927 242863 242233 241954 243047 245992 250413 255080 258490 259791 259143 257319
51155 257319 255335 254237 254483 255293 255237 253807 252003 251261 252259 254757 257913 260617 262268 263475 265373 268100
51139 268100 270786 273124 275804 278948 281317 281852 281012 279605 277336 273863 270571 269636 271272 273315 273902
51124 273902 273559 274055 275905 277755 278156 277341 276912 277747 278709 277919 275120 272001 270118 269352 268772 268065 267421
51107 267421 266750 265874 264979 264051 262352 259417 256269 254536 254441 254546 253565 251605 249483 247607 245807 243676
51091 243676 240793 237042 233044 230005 228879 229650 231406 233050 234085 234856 235881 236951 237291 236683 235863
51076 235863 235500 235414 235283 235538 236798 238827 240804 242394 243864 245259 246184 246519 246927 248550 252191 257391
51060 257391 262154 264221 263152 260658 258494 256756 254822 252929 251610 250305 247957 244784 242051 240158
51046 240158 238317 236220 234705 234305 234297 233833 233250 233668 235756 239243 243191 246515 248735 250460 252827 256442
51030 256442 261084 266161 270867 274212 275804 276499 277506 279041 280679 282634 285468 288664 290929 292055
51016 292055 293050 294124 294096 292506 290878 290903 292478 294528 296749 299307 301646 302932 303376 303933 304818 305194
51000 305194 304341 302481 300548 299581 300128 301759 303328 304057 304110 304011 304090 304844 307001 310524 314069 316180 316639
50983 316639 316117 315098 313925 313410 314448 317111 320704 324400 327351 328769 328806 328990 330882 334421 338274
50968 338274 341420 343498 344021 342570 339854 337407 335951 334900 333854 333693 335669 339911 345228 350042 353428
50953 353428 355767 358608 363323 369678 376139 381670 386575 391362 395733 399448 403562 409719 418099 426890
50939 426890 434243 440294 446876 455443 465859 477192 489017 501358 513868 526000 538120 551586
50927 551586 567222 584337 601789 619460 637939 657285 677090 697701 720339 745800 773744
50916 773744 803494 834802 867580 901654 937457 976539 1020646 1070177 1123883 1180164 1238646
50905 1238646 1300644 1368192 1442510 1523275 1609360 1700107 1795579 1895706 1999691 2106431 2215023
50894 2215023 2324454 2433056 2538756 2639926 2735681 2825254 2907404 2980694 3044328 3098421
50884 3098421 3143406 3179474 3206834 3226193 3238410 3243696 3241913 3233952 3222291 3209651 3197393 3185512
50872 3185512 3173576 3160940 3146466 3129003 3108258 3084435 3056817 3023363 2981960 2931690 2872802
50861 2872802 2806076 2732415 2652510 2566464 2474144 2376282 2275068 2173434 2073895 1978026 1886551
50850 1886551 1799630 1717296 1639845 1567648 1500670 1438551 1381166 1328648 1280820 1237287 1198319
50839 1198319 1164886 1137299 1114259 1093803 1074899 1057678 1042595 1030013 1020340 1013864 1010366 1009259
50827 1009259 1009987 1011934 1014285 1016619 1019542 1024071 1030361 1037560 1045029 1053158 1062849 1074696 1088920 1105686
50813 1105686 1125003 1146378 1168816 1191362 1213899 1237692 1264842 1296617 1332231 1369698 1407975
50802 1407975 1447855 1490747 1537290 1587518 1641841 1701272 1766897 1839518 1919564 2007005 2101649
50791 2101649 2203978 2315445 2437397 2569891 2712287 2864951 3029650 3207929 3399583
50782 3399583 3602950 3816167 4037762 4266464 4501000 4739747 4979973 5217393 5447059
50773 5447059 5664710 5866871 6049713 6208746 6340409 6443893 6520911 6573677 6603502 6611652
50763 6611652 6601183 6577376 6545968 6511068 6474989 6439774 6408076 6381964 6361261 6343780 6327009
50752 6327009 6308616 6284971 6250335 6198913 6127719 6036658 5925798 5793718 5639127 5463203
50742 5463203 5269297 5060676 4839781 4609897 4376389 4145225 3920489 3703939 3496769
50733 3496769 3300897 3118252 2949477 2793987 2651180 2521102 2403937 2299238 2205904 2122807
50723 2122807 2049297 1985114 1929770 1881960 1839709 1801387 1766607 1735921 1709517 1686432 1665122
50712 1665122 1644539 1624464 1605075 1586614 1569390 1553636 1539177 1525479 1512151 1499211 1486866
50701 1486866 1475347 1465136 1456922 1450888 1446194 1441659 1437059 1433412 1431913 1432988 1436613 1443146 1453255
50688 1453255 1467042 1483699 1502398 1523375 1547964 1577497 1612354 1652085 1696355 1745445 1799655
50677 1799655 1858380 1920235 1984290 2051055 2122021 2198468 2281012 2370097 2466398 2570487 2682229
50666 2682229 2800588 2923941 3050749 3180199 3312102 3445760 3579036 3709057 3833797
50657 3833797 3952221 4062540 4161164 4244227 4309686 4357024 4385323 4393132 4380881 4352415 4313164
50646 4313164 4267069 4216033 4162124 4109193 4061756 4022562 3991619 3967354 3948209 3933053 3920483
50635 3920483 3908163 3892942 3871385 3840246 3796780 3739055 3666229 3578640 3477774 3366145 3246841
50624 3246841 3122743 2995987 2868233 2741343 2617624 2499369 2388291 2285544 2192093 2108784
50614 2108784 2035822 1972255 1916415 1867206 1824860 1790175 1763247 1743521 1730856 1725592 1727191 1733677
50602 1733677 1743153 1755335 1770780 1789041 1808586 1828476 1849150 1871482 1895825 1922153 1950329
50591 1950329 1979937 2010513 2042312 2076245 2112903 2152347 2195198 2243030 2296912 2356124 2419109
50580 2419109 2485445 2556147 2632142 2713124 2797908 2885420 2975124 3066752 3159734 3252852 3344461
50569 3344461 3432911 3516530 3593327 3661393 3719882 3769146 3809662 3841321 3863958 3877831 3883046
50558 3883046 3879226 3866666 3847513 3824866 3800733 3775498 3749362 3723684 3700763 3682751 3670718
50547 3670718 3664418 3662837 3665163 3670938 3679087 3687447 3693963 3697877 3698792 3694764 3682345 3658644 3622659
50534 3622659 3574693 3515489 3446119 3367710 3280874 3186195 3085692 2982902 2880721 2779628
50524 2779628 2678660 2577783 2478853 2384540 2296785 2215920 2140786 2069929 2003104 1941467 1886097
50513 1886097 1836839 1793026 1754880 1723461 1699271 1681403 1668059 1657604 1649381 1643989 1642705 1646249
50501 1646249 1654115 1665342 1679689 1697685 1719789 1746018 1776241 1810196 1847174 1886332 1927539
50490 1927539 1971485 2018759 2069190 2122187 2177289 2234086 2292010 2350623 2409963 2470272 2531543
50479 2531543 2593532 2656051 2718992 2782252 2846135 2911833 2981099 3055304 3135177 3221512 3315534
50468 3315534 3418035 3528544 3646209 3771665 3907202 4054550 4212780 4379019 4551021
50459 4551021 4728390 4911179 5097807 5284735 5467976 5644705 5813471 5972954 6120625
50450 6120625 6252756 6365835 6457521 6525858 6568222 6582315 6568359 6529143 6467208 6383024 6277002
50439 6277002 6152581 6015907 5872634 5726423 5580773 5440688 5311396 5196172 5096494 5013926
50429 5013926 4950653 4907984 4885122 4879690 4888818 4909209 4936553 4965492 4990293 5005235 5004412 4981999
50417 4981999 4933740 4858610 4758779 4637715 4498622 4344862 4180943 4011710 3840379 3668341
50407 3668341 3497263 3330404 3171090 3020656 2878875 2745908 2622678 2509573 2406119
50398 2406119 2312185 2228410 2154919 2090466 2033424 1983029 1939224 1902038 1871743 1848847 1833057
50387 1833057 1822754 1816434 1814275 1817201 1824594 1834142 1844275 1855760 1870396 1888981 1911241 1937141
50375 1937141 1967214 2001523 2038982 2078088 2118081 2159099 2201211 2243716 2285738 2327428 2369938
50364 2369938 2413829 2457840 2499723 2538149 2573396 2606384 2637723 2667759 2696938 2725804 2754984
50353 2754984 2785319 2817689 2852646 2890607 2932520 2979812 3033349 3092788 3157235 3226206 3299625
50342 3299625 3377061 3457295 3538657 3619600 3698932 3775396 3846999 3911047 3965220 4008502 4040620
50331 4040620 4060668 4066847 4057534 4032091 3990546 3933131 3860475 3773934 3675639 3568546 3456288
50320 3456288 3342316 3229153 3119009 3014857 2919811 2835356 2761479 2698997 2650368 2617144
50310 2617144 2597557 2587852 2585405 2589332 2598445 2610067 2621078 2629088 2632117 2627680 2612717 2584657 2542935
50297 2542935 2489648 2428287 2361375 2289699 2213965 2136341 2059617 1985541 1914857 1848367 1786822
50286 1786822 1730010 1677028 1627421 1581292 1538536 1498857 1462342 1429030 1398082 1368537 1341000
50275 1341000 1317546 1299593 1286612 1277103 1270052 1265201 1262633 1262419 1264302 1267684 1272403 1279321 1289448
50262 1289448 1302637 1318007 1335402 1355344 1377515 1400523 1423465 1446716 1470801 1495524 1520669
50251 1520669 1546622 1573700 1601540 1629629 1657795 1685774 1712942 1738835 1763287 1785770 1805434
50240 1805434 1822275 1837532 1852392 1866785 1879762 1890315 1897547 1900935 1900998 1898936 1894972 1887799 1876387
50227 1876387 1861741 1846173 1831278 1817051 1802389 1785887 1766750 1745573 1723863 1702497 1681266
50216 1681266 1660222 1640415 1622556 1605909 1589396 1573077 1557591 1542827 1528210 1513850 1500383
50205 1500383 1488063 1476913 1467377 1459864 1454058 1449604 1447022 1446826 1448065 1448945 1448778 1448323 1448383 1449197 1451035
50190 1451035 1454081 1457564 1460165 1461469 1461886 1461001 1457398 1450723 1442722 1435350 1428719 1421829 1414543 1407677
50176 1407677 1401346 1394348 1385458 1374762 1363555 1353291 1344832 1338359 1333648 1330310 1327820 1325488 1322625
50163 1322625 1318933 1314793 1311128 1308920 1308696 1310356 1313319 1316756 1319712 1321471 1322196 1323008 1324978 1328065 1331503
50148 1331503 1334860 1337855 1339211 1337060 1331134 1323510 1316126 1308261 1297586 1283233 1266630 1249466 1232179
50135 1232179 1214692 1197512 1181307 1165895 1150358 1134112 1117531 1101446 1086238 1071624 1057388
50124 1057388 1044009 1032148 1021777 1012523 1004730 999027 994592 989212 981895 974265 968146 962786 956143
50111 956143 948209 941021 935317 929208 920935 911532 903672 898657 895362 891639 886067 878605 870060 860984
50097 860984 851183 840552 829964 820419 811394 801105 788826 776065 764914 755906 748073 740606 733708
50084 733708 727971 723409 719340 715158 711137 708093 706089 703976 700736 696781 693233 690516 688674 688469
50070 688469 690579 693787 695662 695471 695023 696185 699169 703856 711020 720810 731402 740883 749679 759474
50056 759474 770284 780449 789351 798441 809183 821421 834236 847255 860344 872951 884653 895994
50044 895994 908040 921181 934782 947819 959611 970045 979485 988508 997567 1006902 1016721 1027357
50032 1027357 1039044 1051557 1064226 1076398 1087943 1099147 1110090 1120264 1129033 1136429 1143333 1150770
50020 1150770 1159149 1168091 1176866 1185123 1193441 1203099 1215045 1229145 1244687 1261383 1279411 1298642
50008 1298642 1318558 1339086 1360973 1385083 1411793 1441177 1473128 1506816 1540499 1572526 1602519
49997 1602519 1631369 1660159 1689202 1717907 1745365 1771091 1795068 1816952 1835617 1850063 1860600
49986 1860600 1868482 1874426 1878290 1880176 1880755 1880020 1876594 1868997 1857276 1843098 1828752 1816030 1804983
49973 1804983 1793345 1778453 1760656 1743747 1730950 1721449 1712287 1702735 1694925 1690552 1689142 1689941 1693633
49960 1693633 1701253 1712751 1727563 1745503 1766111 1788217 1811561 1838043 1869653 1905124 1940016
49949 1940016 1970549 1996273 2018570 2037778 2052889 2063441 2070283 2074292 2075275 2072697 2066874 2058969 2050156
49936 2050156 2041092 2031681 2020623 2005542 1984409 1956892 1923836 1885678 1842357 1794741 1744901 1694344
49924 1694344 1642933 1590396 1538199 1488890 1443788 1402227 1362915 1325254 1289301 1255287 1223494
49913 1223494 1194197 1167514 1143465 1122008 1102679 1084503 1066924 1050657 1036828 1025239 1014273
49902 1014273 1002640 990414 978062 965383 952087 938771 926313 914540 902346 889169 875690
49891 875690 862935 851310 840715 831033 822008 813031 803583 793890 784831 777222 771373 767144 764003
49878 764003 761095 757834 754606 752397 751385 750310 747825 744330 741911 742385 745717 750367 754756 758298
49864 758298 761415 764873 769106 774066 779764 786791 795906 807110 819439 831775 843675 855415 867677
49851 867677 881374 897408 916151 937092 959146 981417 1003760 1026708 1050828 1076203 1102736
49840 1102736 1130955 1161954 1196185 1232861 1271275 1312159 1356627 1403770 1450379 1493382 1531823
49829 1531823 1566300 1597647 1626776 1654861 1682686 1710165 1737156 1764238 1791940 1819447 1844752
49818 1844752 1865859 1881317 1889974 1891000 1884102 1869209 1846167 1815349 1778357 1737384 1693816 1647963
49806 1647963 1600104 1551218 1502564 1454969 1408641 1363343 1318760 1275030 1232980 1193595 1157226
49795 1157226 1123505 1091894 1062073 1033955 1007683 983556 961644 941536 922771 905519 890522
49784 890522 878288 868403 859651 850803 841451 832069 823125 814281 804837 794809 784993 775968 767692 760180
49770 760180 753680 747918 742095 736176 731338 728370 726363 723742 719983 715509 710625 705637 701476 698939
49756 698939 697446 695657 693284 691397 691034 692466 695701 700675 706751 712856 718306 723019 727125 731089
49742 731089 735880 742001 748467 753754 757733 761640 766262 771321 776717 782980 790165 797534 804834 812745
49728 812745 821512 830292 838619 847528 858360 871269 885713 901608 919097 937881 957846 979907
49716 979907 1005192 1033563 1063798 1095142 1127847 1162110 1197073 1231035 1262340 1290021 1313897
49705 1313897 1334196 1351126 1365053 1376975 1388284 1399821 1411585 1423523 1435946 1448702 1460344
49694 1460344 1468589 1471399 1467542 1456717 1439568 1417176 1390154 1358671 1323539 1286660 1249933 1214263
49682 1214263 1180079 1148069 1118689 1091414 1065352 1040415 1017410 997324 980960 968698 959883
49671 959883 952924 946700 941500 937889 935273 932618 930076 928583 928016 927097 925313 923699 923323 924039 925170
49656 925170 926425 927449 927344 925542 922782 920533 919643 919932 920693 921137 920757 919890 919673 920895 923005 924684
49640 924684 925331 925556 926362 928261 931188 934808 938753 942757 946713 950531 953954 956649 958488 959757 961243
49625 961243 964055 968887 975158 981151 985396 987824 989332 990581 991643 992498 993155 993277 992449 991058 990222
49610 990222 990360 990288 988347 984382 980126 977627 977493 978617 979354 978870 977448 975609 973278 970170 966771 964107
49594 964107 962417 960905 959214 958158 958123 957611 954710 949683 944621 940640 936919 932744 928900 926217 924056
49579 924056 921358 918270 915576 913243 910749 908321 906631 905512 904136 902375 900906 899921 898723 896759
49565 896759 894298 891854 889612 887531 885493 883393 881628 881215 882696 885176 887423 889783 893824 900015
49551 900015 906957 913230 918818 924266 929654 935187 941744 949802 958486 966695 974678 983573 993776 1004828
49537 1004828 1016631 1029751 1044332 1059552 1074496 1089038 1103574 1118254 1132886 1147602 1163417
49526 1163417 1181904 1203954 1228785 1254500 1279848 1305256 1331993 1360718 1391102 1422509 1454543
49515 1454543 1487075 1520336 1555095 1592371 1632651 1675439 1719703 1764734 1810552 1857584 1906251
49504 1906251 1957064 2010876 2068433 2129378 2192190 2255484 2319157 2383928 2450317 2518606 2589304
49493 2589304 2662676 2737969 2814006 2890491 2967836 3045716 3122913 3198807 3273926 3348342 3420300
49482 3420300 3487213 3547634 3601790 3650536 3694146 3731774 3761833 3783287 3796705 3803564 3804471 3798837
49470 3798837 3786434 3768444 3746588 3722100 3696023 3669682 3644121 3619573 3596090 3574301 3555136
49459 3555136 3539354 3527652 3520560 3517812 3518487 3522252 3529777 3541550 3557113 3575943 3598130 3623582
49447 3623582 3651472 3681193 3712914 3746441 3780588 3814545 3848814 3883661 3917765 3949739 3980012
49436 3980012 4009559 4037447 4061440 4080567 4095312 4105316 4108526 4102767 4086933 4060846 4025332 3982304
49424 3982304 3933222 3877363 3812988 3740218 3661330 3578249 3491385 3401084 3308466 3214389 3119214
49413 3119214 3024194 2931449 2841852 2754451 2668883 2586828 2509974 2437853 2368859 2302248 2237874
49402 2237874 2175112 2113707 2055017 2000811 1951081 1904370 1860156 1819604 1783777 1752110 1722974
49391 1722974 1695191 1668745 1644397 1622710 1603250 1584849 1566821 1549640 1534212 1520855 1509332
49380 1509332 1499482 1491423 1485381 1481450 1479130 1476914 1473175 1467890 1462897 1459895 1458848 1458985 1460487 1464129
49366 1464129 1469673 1475861 1481989 1488576 1496459 1506105 1517911 1532196 1548501 1565644 1583099 1601905
49354 1601905 1623523 1647688 1671759 1692555 1708849 1722018 1734250 1746496 1758501 1770458 1783683
49343 1783683 1799316 1817032 1835705 1855060 1876078 1899750 1925787 1952536 1978101 2001737 2024375
49332 2024375 2047621 2072231 2097825 2123862 2150040 2175564 2199125 2220485 2241379 2263702 2287008
49321 2287008 2308866 2327756 2344730 2361924 2380237 2398942 2417131 2434925 2453278 2472873 2493360
49310 2493360 2513714 2533385 2552967 2573661 2596242 2620689 2646559 2673288 2700168 2726461 2751842
49299 2751842 2776782 2802357 2829486 2858244 2888034 2918574 2950451 2984318 3019824 3055989 3092518
49288 3092518 3130011 3168871 3208962 3250592 3294753 3341780 3390763 3441182 3494301 3551818 3613638
49277 3613638 3678167 3744531 3813425 3885824 3961983 4041761 4124967 4211131 4299760 4391107 4486013
49266 4486013 4584851 4687260 4792952 4901896 5013509 5126498 5239965 5354114 5469566 5586625
49256 5586625 5705493 5826407 5948922 6071409 6191772 6308436 6420372 6526621 6626101 6717590
49246 6717590 6799630 6870882 6930808 6979543 7016811 7041696 7054008 7055262 7047530 7031675 7007509 6975512
49234 6975512 6937614 6896171 6852737 6807894 6761848 6715102 6668909 6625076 6584978 6548852 6516532
49223 6516532 6488809 6467442 6453557 6446537 6444788 6447275 6453969 6465172 6480975 6501459 6526914 6557432
49211 6557432 6592274 6629886 6668758 6708249 6748424 6789023 6828748 6865689 6898272 6925670 6947486
49200 6947486 6963350 6972719 6974676 6967904 6951285 6924723 6889158 6845483 6793581 6732631 6662397 6584109
49188 6584109 6500099 6412493 6321971 6227657 6128442 6024710 5918731 5813260 5709934 5609105
49178 5609105 5510712 5414699 5320837 5229094 5140523 5057028 4979445 4906153 4834333 4762679 4692396
49167 4692396 4625526 4562904 4503907 4447560 4393286 4340879 4290316 4241698 4195147 4150760 4108836
49156 4108836 4069943 4034457 4002087 3972176 3944448 3919103 3896175 3875141 3855381 3836734 3819452
49145 3819452 3803791 3789815 3777464 3766696 3757763 3751324 3747913 3747084 3747544 3748590 3751080 3756399 3764584
49132 3764584 3774099 3783598 3793423 3805320 3821170 3841869 3866596 3892836 3917996 3941677 3965780 3991828
49120 3991828 4018963 4045531 4071934 4100325 4131640 4164628 4198297 4233720 4272284 4313255 4354596
49109 4354596 4395745 4438160 4483023 4529592 4576327 4622898 4670543 4720670 4773434 4827599 4881698
49098 4881698 4935321 4989141 5043582 5097954 5151379 5204278 5258240 5314358 5372211 5430545 5488463
49087 5488463 5545739 5602369 5658195 5712935 5766557 5819553 5872532 5925347 5976927 6026255 6073089
49076 6073089 6117335 6158362 6195922 6231427 6267222 6304464 6342522 6380443 6417878 6454328 6488737
49065 6488737 6520720 6551481 6582695 6614879 6647392 6679498 6710664 6740286 6767980 6794018 6818729
49054 6818729 6841563 6861463 6878340 6893580 6908735 6923952 6938077 6950327 6961553 6973504 6986854
49043 6986854 7000457 7012882 7024172 7035400 7046879 7057815 7067698 7077017 7086445 7096346 7107343 7120191
49031 7120191 7134483 7148547 7161375 7173756 7186671 7199692 7212114 7224764 7239073 7254733 7269840
49020 7269840 7283459 7296821 7311802 7329120 7348036 7366885 7383843 7398294 7411666 7426043 7441701
49009 7441701 7456842 7469886 7480997 7490958 7499432 7505046 7506740 7504568 7499497 7492603 7484041 7472618 7456846
48996 7456846 7436478 7412486 7385551 7355478 7322360 7287388 7251735 7215067 7175800 7132761 7086450
48985 7086450 7038833 6992003 6946675 6901938 6856750 6811449 6767196 6724227 6681809 6640012 6600227
48974 6600227 6563310 6528296 6493908 6460554 6429775 6402236 6377276 6354228 6333171 6314359 6297725
48963 6297725 6283207 6270978 6261057 6252890 6245522 6238211 6231101 6225322 6222198 6222205 6224839 6229275 6234544 6239206
48949 6239206 6241895 6242659 6242906 6243498 6243630 6242317 6240049 6237877 6235426 6231104 6224202 6215719 6206966 6198211 6188748
48934 6188748 6177531 6163638 6146812 6127766 6107504 6086322 6063851 6039840 6014284 5987039 5957959
48923 5957959 5927277 5895096 5860747 5823564 5784142 5743853 5703202 5661757 5619611 5577526 5535427
48912 5535427 5492227 5447773 5403617 5360963 5319121 5277143 5235974 5197574 5162540 5129999 5099550
48901 5099550 5071983 5048167 5028389 5012820 5001608 4994341 4990350 4989677 4992933 5000129 5010494 5023628
$$ [...]
##END NTUPLES=NMR SPECTRUM
##END=
