
##TITLE=AC1081_MACI02_5867994_ldfmXdodMP
##JCAMPDX= 6.0         $$ Bruker NMR JCAMP-DX V2.0
##DATA TYPE= NMR SPECTRUM
##DATA CLASS= NTUPLES
##ORIGIN= BRUKER
##OWNER= Administrator
$$ 1.72 TOPSPIN		Version 2.1
$$ 2012-03-31 01:38:56.843 -0500  Administrator@TOPSPIN
$$ Compression mode = diff/dup
##.OBSERVE FREQUENCY= 400.13188235
##.OBSERVE NUCLEUS= ^1H
##.ACQUISITION MODE= SIMULTANEOUS (DQD)
##.ACQUISITION SCHEME= undefined
##.AVERAGES= 8
##.DIGITISER RES= 22
##SPECTROMETER/DATA SYSTEM= spect
##.PULSE SEQUENCE= zg30
##.SOLVENT NAME= COFFEE_meoh
##.SHIFT REFERENCE= INTERNAL, COFFEE_meoh, 1, 14.98061
##AUDIT TRAIL= $$ (NUMBER, WHEN, WHO, WHERE, PROCESS, VERSION, WHAT)
$$ ##TITLE= Audit trail, TOPSPIN		Version 2.1
$$ ##JCAMPDX= 5.01
$$ ##ORIGIN= Bruker BioSpin GmbH
$$ ##OWNER= Administrator
$$ $$ C:\Bruker\TOPSPIN/data/COFFEE/nmr/AC1081_MACI02_5867994_ldfmXdodMP/10/pdata/1/auditp.txt
$$ ##AUDIT TRAIL=  $$ (NUMBER, WHEN, WHO, WHERE, PROCESS, VERSION, WHAT)
(   1,<2012-03-31 01:38:49.562 -0500>,<Administrator>,<TOPSPIN>,<go>,<TOPSPIN 2.1>,
      <created by zg
	started at 2012-03-31 01:37:43.078 -0500,
	POWCHK enabled, PULCHK disabled,
       configuration hash MD5:
       1A 1E CE 29 27 FD 77 03 67 4E F0 E3 C4 B2 CB 90
       data hash MD5: 64K
       B2 EC 0E BE B6 0E 4B FC 86 AC 81 1A 36 2B EA C8>)
(   2,<2012-03-31 01:38:52.718 -0500>,<Administrator>,<TOPSPIN>,<proc1d>,<TOPSPIN 2.1>,
      <Start of raw data processing
       efp LB = 0 FT_mod = 6 PKNL = 1 PHC0 = 0 PHC1 = 0 SI = 32K 
       data hash MD5: 32K
       1A 4F EC D7 8B 68 07 28 43 C3 57 DE 25 93 CC 73>)
(   3,<2012-03-31 01:38:53.046 -0500>,<Administrator>,<TOPSPIN>,<proc1d>,<TOPSPIN 2.1>,
      <pk PHC0 = 211.2341 PHC1 = 0 
       data hash MD5: 32K
       A9 C3 39 49 4C D6 0B E8 99 14 8C AB 6F AA D5 8D>)
(   4,<2012-03-31 01:38:53.125 -0500>,<Administrator>,<TOPSPIN>,<proc1d>,<TOPSPIN 2.1>,
      <abs ABSG = 1 
       data hash MD5: 32K
       50 C4 1A 3B 25 FC D0 2A FA 83 25 31 54 7D 1C C9>)
(   5,<2012-03-31 01:38:53.156 -0500>,<Administrator>,<TOPSPIN>,<proc1d>,<TOPSPIN 2.1>,
      <abs ABSG = 2 
       data hash MD5: 32K
       0D A6 88 FA 6D 77 A2 F9 A6 A3 08 E5 BE 17 95 57>)
(   6,<2012-03-31 01:38:53.187 -0500>,<Administrator>,<TOPSPIN>,<proc1d>,<TOPSPIN 2.1>,
      <abs ABSG = 3 
       data hash MD5: 32K
       C0 3C 91 C8 07 52 9F C0 B3 35 B4 2E 30 A5 30 D1>)
(   7,<2012-03-31 01:38:53.218 -0500>,<Administrator>,<TOPSPIN>,<proc1d>,<TOPSPIN 2.1>,
      <abs ABSG = 4 
       data hash MD5: 32K
       9C AE 03 76 E5 B1 94 F7 BF 3C 59 49 4F 3C 48 09>)
(   8,<2012-03-31 01:38:53.234 -0500>,<Administrator>,<TOPSPIN>,<proc1d>,<TOPSPIN 2.1>,
      <abs ABSG = 5 
       data hash MD5: 32K
       3D 66 EC F3 8E 2F 24 FC 28 BF 15 23 98 00 92 3C>)
$$ ##END=
$$ 
$$ $$ hash MD5
$$ $$ BC 46 BC 2B 84 31 67 81 AC D8 7F 59 48 17 87 04
##$RELAX= 
##$RELAX= 
##$RELAX= 
##$RELAX= 
##$RELAX= 
##$RELAX= 
##$RELAX= 
$$ Bruker specific parameters
$$ --------------------------
$$ [...]
150 150 150 150 150 150 150 150
##$TP07= 0
##$TPNAME0= <>
##$TPNAME1= <>
##$TPNAME2= <>
##$TPNAME3= <>
##$TPNAME4= <>
##$TPNAME5= <>
##$TPNAME6= <>
##$TPNAME7= <>
##$TPOAL= (0..7)
0.5 0.5 0.5 0.5 0.5 0.5 0.5 0.5
##$TPOFFS= (0..7)
0 0 0 0 0 0 0 0
##$TUNHIN= 0
##$TUNHOUT= 0
##$TUNXOUT= 0
##$USERA1= <user>
##$USERA2= <user>
##$USERA3= <user>
##$USERA4= <user>
##$USERA5= <user>
##$V9= 5
##$VALIST= <valist>
##$VCLIST= <CCCCCCCCCCCCCCC>
##$VD= 0
##$VDLIST= <DDDDDDDDDDDDDDD>
##$VPLIST= <PPPPPPPPPPPPPPP>
##$VTLIST= <TTTTTTTTTTTTTTT>
##$WBST= 2048
##$WBSW= 25
##$XGAIN= (0..3)
0 0 0 0
##$XL= 0
##$YL= 0
##$YMAX_a= 556741
##$YMIN_a= -670775
##$ZGOPTNS= <>
##$ZL1= 120
##$ZL2= 120
##$ZL3= 120
##$ZL4= 120
##$ABSF1= 14.98061
##$ABSF2= -5.57192
##$ABSG= 5
##$ABSL= 3
##$ALPHA= 0
##$AQORDER= 0
##$ASSFAC= 0
##$ASSFACI= 0
##$ASSFACX= 0
##$ASSWID= 0
##$AUNMP= <proc_prof1d_extract_pilot.lims>
##$AXLEFT= 0
##$AXNAME= <>
##$AXNUC= <1H>
##$AXRIGHT= 0
##$AXTYPE= 0
##$AXUNIT= <>
##$AZFE= 0.1
##$AZFW= 0.1
##$BCFW= 0
##$BC_mod= 0
##$BYTORDP= 0
##$COROFFS= 0
##$CY= 15
##$DATMOD= 1
##$DC= 0
##$DFILT= <>
##$DTYPP= 0
##$F1P= 0
##$F2P= 0
##$FCOR= 0.5
##$FTSIZE= 32768
##$FT_mod= 6
##$GAMMA= 0
##$GB= 0
##$INTBC= 1
##$INTSCL= 1
##$ISEN= 128
##$LB= 0
##$LEV0= 0
##$LPBIN= 0
##$MAXI= 10000
##$MC2= 0
##$MEAN= 0
##$ME_mod= 0
##$MI= 0
##$NCOEF= 0
##$NC_proc= -8
##$NLEV= 6
##$NOISF1= 0
##$NOISF2= 0
##$NSP= 0
##$NTH_PI= 0
##$NZP= 0
##$OFFSET= 14.98061
##$PC= 1
##$PHC0= 211.2341
##$PHC1= 0
##$PH_mod= 1
##$PKNL= yes
##$PPARMOD= 0
##$PPDIAG= 0
##$PPIPTYP= 0
##$PPMPNUM= 2147483647
##$PPRESOL= 1
##$PSCAL= 4
##$PSIGN= 0
##$PYNMP= <proc.py>
##$REVERSE= no
##$SF= 400.13
##$SI= 32768
##$SIGF1= 0
##$SIGF2= 0
##$SINO= 400
##$SIOLD= 32768
##$SPECTYP= <>
##$SREGLST= <1H.CDCl3>
##$SSB= 0
##$STSI= 32768
##$STSR= 0
##$SW_p= 8223.68421052632
##$SYMM= 0
##$S_DEV= 0
##$TDeff= 65536
##$TDoff= 0
##$TI= <>
##$TILT= no
##$TM1= 0
##$TM2= 0
##$TOPLEV= 0
##$USERP1= <user>
##$USERP2= <user>
##$USERP3= <user>
##$USERP4= <user>
##$USERP5= <user>
##$WDW= 1
##$XDIM= 32768
##$YMAX_p= 469277739
##$YMIN_p= -624741
##$CURPLOT= <Network HP LaserJet P1505>
##$CURPRIN= <$Network HP LaserJet P1505>
##$DFORMAT= <normdp>
##$LAYOUT= <+/1D_H.xwp>
##$LFORMAT= <normlp>
##$PFORMAT= <normpl>
##$SURQMSG= 1
$$ End of Bruker specific parameters
$$ ---------------------------------
##NTUPLES= NMR SPECTRUM
##VAR_NAME=  FREQUENCY,     SPECTRUM/REAL,   SPECTRUM/IMAG
##SYMBOL=    X,             R,               I
##VAR_TYPE=  INDEPENDENT,   DEPENDENT,       DEPENDENT
##VAR_FORM=  AFFN,          ASDF,            ASDF
##VAR_DIM=   32768,         32768,           32768
##UNITS=     HZ,            ARBITRARY UNITS, ARBITRARY UNITS
##FACTOR=    0.250966925370066, 1,           1
##FIRST=     8223.43324360095, -48738,       -151941
##LAST=      0,             -101767,         -100292
##MIN=       0,             -624741,         0
##MAX=       8223.43324360095, 469277739,    0
$$ Real data points
##PAGE= N=1
##DATA TABLE= (X++(R..R)), XYDATA
$$ [...]
19559I3544a16501A0481c09643a07237J9754L9382H2254f4475j24560D1233a9454
$$ 93544 -116501 10481 -309643 -107237 -87483 -48101 82254 -64475 -189035 41233 -19454
19547d9935k43897A0297L1447h4017H9161b82469J3367l4341a47926r2917G6488
$$ -49935 -293832 10297 41744 -84017 89161 -282469 -269102 -303443 -147926 -240843 76488
19535f6507J7212m4565k10486g9981f862m19255A22443d7206k15657L5096A21819
$$ -66507 -49295 -93860 -304346 -79981 -6862 -426117 122443 -47206 -262863 -227767 121819
19523d7133D3659b71489B6027F857M3033A0674e2948k42315H4538a82972d4747
$$ -47133 43659 -271489 26027 6857 49890 10674 -52948 -295263 84538 -182972 -44747
19511b49963d801B24400f0766p6014d7984J7568k00961B444a94612k5555A71017
$$ -249963 -4801 224400 -60766 -136780 -47984 -30416 -231377 2444 -194612 -220167 171017
19499a34675e3796k4894k00127B35007G8250a17480j02898O2220e7780l63673
$$ -134675 -53796 -78690 -278817 235007 78250 -117480 -220378 -158158 -57780 -421453
19489d21453L7618a37896j24947f6652F7186o845b73548f2501A52465c42135J01223
$$ -421453 -383835 -137896 -262843 -66652 67186 60341 -273548 -62501 152465 -342135 -240912
19478b40912A88027c5193l38357G0378a00319A96578B6441c4196j92395J01108
$$ -240912 188027 -35193 -373550 70378 -100319 196578 26441 -34196 -226591 -125483
19468a25483k59429a11555B3348K3134a88837e0j92873f6323k62755q933A08974
$$ -125483 -384912 -111555 23348 46482 -188837 -50 -192923 -66323 -329078 -338011 108974
19456A1000a1958F3902a84594b026j45296L4216L6545J9483C17781b90004J35903
$$ 11000 -11958 63902 -184594 -2026 -147322 -113106 -76561 -57078 317781 -290004 -154101
19445a54101L0274B21978J6935a50241D0217h2357A36040h5154j23762g4079j15825
$$ -154101 -123827 221978 238913 -150241 40217 -82357 136040 -85154 -208916 -74079 -189904
19434a89904h6411p9341K5516A43682e1110m6478k16907J27538B1524J40519e206
$$ -189904 -86411 -165752 -140236 143682 -51110 -97588 -314495 -186957 21524 162043 -5206
19422b97825a15971M1996k61118B110N0715J35920a3042j7416B81980r1454N696
$$ -297825 -115971 -73975 -335093 2110 52825 188745 -13042 -30458 281980 190526 196222
19411A96222p8196d58285K01889a5771G8108B5332f7649k03475B42602F610N5146
$$ 196222 118026 -458285 -256396 -15771 78108 25332 -67649 -271124 242602 6610 61756
19400F1756a53632A21827c8220Q197N452l0779j48942k18846a48416A29386e9188
$$ 61756 -153632 121827 -38220 -30023 -24571 -55350 -204292 -423138 -148416 129386 -59188
19388B69230i5642A48827a85582n9343L1178f058n588o1460A95601e6966k96082
$$ 269230 -95642 148827 -185582 -244925 -213747 -6058 -11646 -73106 195601 -56966 -353048
19377c53048R9904A08521a2308B14065b23558m2249E5777c75042I3006g4309A8853
$$ -353048 -253144 108521 -12308 214065 -223558 -265807 55777 -375042 93006 -74309 18853
19365A21681n1565i1832B42690J17076c60382r40J43009m6549J02382C3996b69222
$$ 121681 70116 -91832 242690 359766 -360382 -361322 -218313 -264862 -162480 33996 -269222
19353D4455i3552j6353B72149a62013N3664F8340a14218j69821b7894B0232c16073
$$ 44455 -93552 -109905 272149 -162013 -108349 68340 -114218 -284039 -27894 20232 -316073
19341b25959b2518G2280a08317C28735c38910A14514b89960j42854i2616D6335
$$ -225959 -22518 72280 -108317 328735 -338910 114514 -289960 -432814 -92616 46335
19330A45997E9759d00782B60426g4125L0207l3094A19815n6361i1952E1089a18457
$$ 145997 59759 -400782 260426 -74125 -43918 -77012 119815 63454 -91952 51089 -118457
19318d40352K02259o7554b6769A53137a47173c4132j31316M3753N5014I2996b7276
$$ -440352 -238093 -305647 -26769 153137 -147173 -34132 -165448 -121695 -66681 92996 -27276
19306B24716r9983a28115n1456N1754k32988g6617b1487j82898R4689M5634I8476
$$ 224716 124733 -128115 -179571 -127817 -360805 -76617 -21487 -204385 -109696 -64062 98476
19294D4988h9993m00401E624h8476A9204J17017a79039j53510a37905B9815d5459
$$ 44988 -89993 -490394 5624 -88476 19204 136221 -179039 -332549 -137905 29815 -45459
19282a18796A46036i5519B36311a1719j76202A55814b75917a16697C11126c00154
$$ -118796 146036 -95519 236311 -11719 -187921 155814 -275917 -116697 311126 -300154
19271B21744G1666i2362A7681e3256m7175D0339K6114h3613j44456d8651H2162
$$ 221744 71666 -92362 17681 -53256 -100431 40339 66453 -83613 -228069 -48651 82162
19259a2794D6113a9450k6675a6297A27209b09644P0160N1071a9830C7154J81249
$$ -12794 46113 -19450 -46125 -16297 127209 -209644 -139484 -88413 -19830 37154 218403
19248B18403a13615C5450P8687h3881j53963B50789E2358b06734q0537a14352
$$ 218403 -113615 35450 114137 -83881 -237844 250789 52358 -206734 -287271 -114352
19237H8672D1397a74921B799R3465d2993A14647a43266f499C7703K5794B4896
$$ 88672 41397 -174921 2799 96264 -42993 114647 -143266 -6499 37703 63497 24896
19225g0010p1991A05312k0256b32754H8770K20139E3899A8734f4811n803r480
$$ -70010 -142001 105312 85056 -232754 88770 308909 53899 18734 -64811 -70614 -80094
19214h0094a4676D8722a81124j5046j52439a5064j17036A26285g730j14245e3141
$$ -80094 -14676 48722 -181124 -196170 -348609 -15064 -132100 126285 -7730 -121975 -53141
19202b25150j41103g704k29330j1065A07076g2244A26489I186J6150D973b68309
$$ -225150 -366253 -7704 -237034 -248099 107076 -72244 126489 9186 25336 4973 -268309
19190B8567B510i3296M5194j10488b0614A13327A5725P9584B380K1467h5741r2139
$$ 28567 2510 -93296 -48102 -158590 -20614 113327 15725 95309 2380 23847 -85741 -177880
19178a77880m3532A77055c55897a66379b1720B0550J87559b16033C04194b01053
$$ -177880 -221412 177055 -355897 -166379 -21720 20550 208109 -216033 304194 -201053
19167G4671a45703J4496A48121E027K5986a42059b550A06523b87446A26528a24175
$$ 74671 -145703 -131207 148121 5027 31013 -142059 -2550 106523 -287446 126528 -124175
19155B36110F5519a9299k5957B05982B4307c94585h3348k7748d1271C1530L9832
$$ 236110 65519 -19299 -45256 205982 24307 -394585 -83348 -111096 -41271 31530 71362
19144G1362d09734a18744d0452l35317j31092a92039D8298h5856n077q002p8967
$$ 71362 -409734 -118744 -40452 -375769 -506861 -192039 48298 -85856 -90933 -98935 -177902
19133a77902B9313L32601e8954A33875B0707c5359j2397k48721L8571A13051K8257
$$ -177902 29313 361914 -58954 133875 20707 -35359 -47756 -296477 -257906 113051 141308
19122A41308Q2835a97255M8705A52959g7236A81900d4508B244L3224P0642c12579
$$ 141308 224143 -197255 -148550 152959 -77236 181900 -44508 2244 35468 106110 -312579
19110b69244A30308E2771K87859H7409a37162N7421l02485J51377E3202a75757
$$ -269244 130308 52771 340630 87409 -137162 -79741 -382226 -230849 53202 -175757
19099A81086H7606J3811L8474N3877e8858j58664g0411j16644R2212k36214A26272
$$ 181086 87606 101417 139891 193768 -58858 -217522 -70411 -187055 -94843 -331057 126272
19087F7435c2573k3185J7842F3327c44280f8486B63513H6674b1283D4388B0789
$$ 67435 -32573 -55758 -37916 63327 -344280 -68486 263513 86674 -21283 44388 20789
19075c88016j59574a55240g6631F0290J4943J7949b65831b5572k05017e1473E0270
$$ -388016 -547590 -155240 -76631 60290 75233 93182 -265831 -25572 -230589 -51473 50270
19063a43948A17700B9704h261m7177k3924c064j81388A14907K65644b38462m0270
$$ -143948 117700 29704 -8261 -55438 -79362 -3064 -184452 114907 380551 -238462 -278732
19052b78732D2833b7950l27819e2989o9985n7169j44384a46769c9193k36553b369
$$ -278732 42833 -27950 -355769 -52989 -122974 -180143 -324527 -146769 -39193 -275746 -2369
19040h9846l05674a49686M0785N0303A42921L67225h9287H3028J8189l5397a49781
$$ -89846 -395520 -149686 -108901 -58598 142921 510146 -89287 83028 101217 65820 -149781
19028F8826a36456A57876M0885b65318d0242l0820G077J93140l118J88853c2006
$$ 68826 -136456 157876 198761 -265318 -40242 -71062 7077 200217 197099 385952 -32006
19016E103L2930K99290j17888c03027D8338J06747A2529a19134p7443j664B32769
$$ 5103 38033 337323 219435 -303027 48338 155085 12529 -119134 -196577 -198241 232769
19004A66355C4750a48137J2519A06645a82133E2906b50557G1262O9597a36317
$$ 166355 34750 -148137 -135618 106645 -182133 52906 -250557 71262 140859 -136317
18993a11033A02280K91529C8095j1560a02216m196j3818F2884b85169J35326o296
$$ -111033 102280 393809 38095 26535 -102216 -106412 -120230 62884 -285169 -149843 -156139
18982a56139A95007p180D9702b63624j02546B32261k6369A7425Q3999a57152k94891
$$ -156139 195007 187827 49702 -263624 -366170 232261 205892 17425 101424 -157152 -452043
18971d52043f1547c0028n8431b6746o3975M490l5247D9675h7806q3881g2870m0442
$$ -452043 -61547 -30028 -88459 -26746 -90721 -86231 -121478 49675 -87806 -171687 -72870 -113312
18959a13312m6470r1053i4258L4023k52937a8195I2972e5626o7911A6341c4282
$$ -113312 -159782 -250835 -94258 -60235 -313172 -18195 92972 -55626 -123537 16341 -34282
18947a19509q6721h3338D7817B3593a06180J0318j16716a05092b8594F7849L9478
$$ -119509 -206230 -83338 47817 23593 -106180 -95862 -212578 -105092 -28594 67849 107327
18936A07327a15942l486o2017h2253G5535b23194A20152a68330L4929k642e2A12125
$$ 107327 -115942 -119428 -181445 -82253 75535 -223194 120152 -168330 -133401 -136043 -52 112125
18923a7030I5023b38662J4731I861g4803q055d0755r490l1429n733b7368H3250
$$ -17030 95023 -238662 -223931 9861 -74803 -82858 -40755 -50245 -81674 -87407 -27368 83250
18910b27253g5608l56965a76173B1907C749a3455A2974b2964H1568L5950c05971
$$ -227253 -75608 -432573 -176173 21907 3749 -13455 12974 -22964 81568 117518 -305971
18898a09458n7334A74810L2668a42166e5937A34111a54456j7315k4713d6359A79957
$$ -109458 -166792 174810 207478 -142166 -55937 134111 -154456 -171771 -196484 -46359 179957
18886C27063F1817Q6482c7580A22256A9615J7940b33840i7091j60990A85692a21189
$$ 327063 61817 148299 -37580 122256 19615 37555 -233840 -97091 -258081 185692 -121189
18874h197p6497J0905G4561a96387k60806J23102a20074k34567c3779j59256Q5317
$$ -8197 -84694 -73789 74561 -196387 -457193 -334091 -120074 -354641 -33779 -193035 -107718
18863a07718q0016h2339B85202F4389B574b01019A62638c3736H0186c36334A81201
$$ -107718 -187734 -82339 285202 64389 2574 -201019 162638 -33736 80186 -336334 181201
18851c38843J29553e6068G7084c35353a2160H1315b3407k0468L16A1222P9655
$$ -338843 -209290 -56068 77084 -335353 -12160 81315 -23407 -43875 -43559 11222 90877
18840I0877Q7119c31889a0016I9164a94834P9852d015l72859J06015a08197c2200
$$ 90877 177996 -331889 -10016 99164 -194834 -114982 -4015 -376874 -270859 -108197 -32200
18828e2528l33713A26173F1944N8899a39343a9212B70220b26335C36833b4493
$$ -52528 -386241 126173 61944 120843 -139343 -19212 270220 -226335 336833 -24493
18817a44025K7925m065j94900b492l94562i0780A89434D2899a53995B1981d4587
$$ -144025 -116100 -120165 -315065 -2492 -397054 -90780 189434 42899 -153995 21981 -44587
18805A70977e0273F102J21415a69868I3031C4331a30508C13578j35997k1299a25011
$$ 170977 -50273 6102 127517 -169868 93031 34331 -130508 313578 177581 156282 -125011
18793a90704B72587I7329a02360B63844a95882A29895e8342l667l52027A85797
$$ -190704 272587 97329 -102360 263844 -195882 129895 -58342 -62009 -414036 185797
18782b40612H3556g7612r4446n6639e3686j5520A41929I595c7548B92411h8260
$$ -240612 83556 -77612 -172058 -228697 -53686 -69206 141929 9595 -37548 292411 -88260
18770A97945k5719n3320a90464a867A37531c73938i312k06349B5239b05248d7305
$$ 197945 172226 118906 -190464 -1867 137531 -373938 -9312 -215661 25239 -205248 -47305
18758E675e2389k2578A3815h2472l3847j45677A61918i2876j90596a03820k4172
$$ 5675 -52389 -74967 13815 -82472 -116319 -261996 161918 -92876 -283472 -103820 -127992
18747a27992f1840r1605j65734D9359b90391I0694k3519a03360p282n282p0596
$$ -127992 -61840 -153445 -319179 49359 -290391 90694 67175 -103360 -110642 -115924 -186520
18736a86520p686p2915C5404h7582A06064D6325b50008k9713J14720H1652h53
$$ -186520 -194206 -267121 35404 -87582 106064 46325 -250008 -279721 -165001 81652 -853
18724C04269a97603j44369f0970j68841l2917J08583C6907A1428R8028f2759n176
$$ 304269 -197603 -341972 -60970 -229811 -262728 -154145 36907 11428 109456 -62759 -67935
18713f7935A42354a8945M641j17559b1097k36925R7867j72387J25491A01896h3636
$$ -67935 142354 -18945 -14304 -131863 -21097 -258022 -160155 -332542 -207051 101896 -83636
18701a73589N6518C828c11151h3474l58322B95399N9976a88759N7732J1706e6743
$$ -173589 -117071 3828 -311151 -83474 -441796 295399 355375 -188759 -131027 -119321 -56743
18689I1240a45814b9874J444G6619K0046O1041a37679G4707j0230b22909B42113
$$ 91240 -145814 -29874 -28430 76619 96665 157706 -137679 74707 64477 -222909 242113
18677d02952B3723e5415k35467a716A38950i6686f170k67700O7592E950d1163
$$ -402952 23723 -55415 -290882 -1716 138950 -96686 -6170 -273870 -206278 5950 -41163
18665c10532c9059r3552A07315c2784C9789j748a56953E4897a55566k72718A8909
$$ -310532 -39059 -132611 107315 -32784 39789 38041 -156953 54897 -155566 -428284 18909
18653a86392E907O8892a58542k00685C07555B5310b1603q1186l0040F1193i0033
$$ -186392 5907 74799 -158542 -359227 307555 25310 -21603 -102789 -132829 61193 -90033
18641c18174j4941J28285O2529A89448b72653n6203e1775p5417a1713F966c51872
$$ -318174 -333115 -204830 -142301 189448 -272653 -328856 -51775 -127192 -11713 6966 -351872
18629G2112O0250L5811f0229j68905N7273E0891b46180J5044H1922a48080A98028
$$ 72112 132362 168173 -60229 -229134 -171861 50891 -246180 -231136 81922 -148080 198028
18617D4045a23185C69866c0231A86248g9867j04732L3311j3168g6655K9812p7485
$$ 44045 -123185 369866 -30231 186248 -79867 -184599 -151288 -164456 -76655 -46843 -124328
18606a24328f892m0172j78867a07924k71396g2340K9859j4528A05933g5028A93392
$$ -124328 -6892 -47064 -225931 -107924 -379320 -72340 -42481 -57009 105933 -75028 193392
18594a2974A45896d0011C3999d52291c3151I9614Q4593J07774F8016c44935b9746
$$ -12974 145896 -40011 33999 -452291 -33151 99614 184207 291981 68016 -344935 -29746
18582A26532i3350A11138a19886p919k3224A07608a480n0588k10683L6468n6206
$$ 126532 -93350 111138 -119886 -127805 -151029 107608 -1480 -52068 -262751 -226283 -282489
18571b82489C17934i1904A51214h6830M2417j4303F282K01269a1852A42086h7631
$$ -282489 317934 -91904 151214 -86830 -44413 -58716 6282 207551 -11852 142086 -87631
18559b05591P2220j2699B2302a80113h9097d2743l6882n0703A00488a61837A91181
$$ -205591 -133371 -146070 22302 -180113 -89097 -42743 -79625 -130328 100488 -161837 191181
18547b24382i1650l76957b07917h1979B01653E1998M8304B6508Q3518J4065J6857
$$ -224382 -91650 -468607 -207917 -81979 201653 51998 100302 26508 110026 124091 140948
18536A40948m5603a56763b4227j56538Q8397B257g968k1241j36339g0729q3093
$$ 140948 95345 -156763 -24227 -180765 -92368 2257 -7968 -29209 -165548 -70729 -153822
18525a53822d9640m1925j24686J06521Q047c5791E5897J2604b8836A85755d25823
$$ -153822 -49640 -91565 -216251 -109730 -101683 -35791 55897 68501 -28836 185755 -425823
18513B2538b94553E5301i4534o1849A51295a01649E3129h8796A02165a59731k7055
$$ 22538 -294553 55301 -94534 -156383 151295 -101649 53129 -88796 102165 -159731 -186786
18502a86786A71663N8761c41099m0542F7426a17143p3961I5893B3900N8640a8467
$$ -186786 171663 230424 -341099 -381641 67426 -117143 -191104 95893 23900 82540 -18467
18490d934A13866a7525j28290F4023i7860n8032A80837c9409H4296a66130B44971
$$ -4934 113866 -17525 -145815 64023 -97860 -155892 180837 -39409 84296 -166130 244971
18478a00595A37879b28335R8862K8308B36506i8121E3766a18464B41945a86651
$$ -100595 137879 -228335 -129473 -101165 236506 -98121 53766 -118464 241945 -186651
18467A73556B3293n088K908d14964a17491B22283a86076j72403a37741l6189P7444
$$ 173556 23293 18205 21113 -414964 -117491 222283 -186076 -358479 -137741 -173930 -96486
18456i6486b6769l15067A65670B3354a89295h6001A25545i2077l88643b1654P317
$$ -96486 -26769 -341836 165670 23354 -189295 -86001 125545 -92077 -480720 -21654 -14337
18445a4337I6018b32604A11146b04242e1101K3306N913I8311g99A26088B3867
$$ -14337 96018 -232604 111146 -204242 -51101 -27795 -21882 98311 -799 126088 23867
18433a24915M8337I5226b11441D1493R0009B292O9616b10784B61525j09861c07415
$$ -124915 -76578 95226 -211441 41493 131502 2292 71908 -210784 261525 151664 -307415
18421d1409l42228H9152R3781b18519A53274b1493j70735D9739a93772F0036P4945
$$ -41409 -383637 89152 182933 -218519 153274 -21493 -192228 49739 -193772 60036 134981
18410A34981a72069q421k44709A00676a39190f9528k2466k77238F1257J62060
$$ 134981 -172069 -180490 -425199 100676 -139190 -69528 -91994 -369232 61257 223317
18400B23317c58198d5556A41179b88025A69726a71869B25251g5468F203R9943
$$ 223317 -358198 -45556 141179 -288025 169726 -171869 225251 -75468 6203 106146
18390A06146j9417a05736d1083B20228a29334k40917R3623a08421A75302F2445
$$ 106146 86729 -105736 -41083 220228 -129334 -370251 -276628 -108421 175302 62445
18379D0208a19322B58935a987C4978b24055d8891j35129f5628F9606c61459h9263
$$ 40208 -119322 258935 -1987 34978 -224055 -48891 -184020 -65628 69606 -361459 -89263
18367A61328a06797p3474d8073k13719K0528e2498H1026c58684c4225r2777I8755
$$ 161328 -106797 -180271 -48073 -261792 -241264 -52498 81026 -358684 -34225 -127002 98755
18355B2647h9142D2430Q2598a56755j35590Q2219h395q0056J3842l05393g7784
$$ 22647 -89142 42430 125028 -156755 -292345 -210126 -8395 -88451 -74609 -380002 -77784
18343I83K18674a84835C41795a57425A23419a91701r1310A1077f3061j82282B81921
$$ 983 219657 -184835 341795 -157425 123419 -191701 -283011 11077 -63061 -245343 281921
18331b6365C894L42152m4865B4886a63300R262f3379J1571A84855Q7419b53357
$$ -26365 3894 346046 301181 24886 -163300 -154038 -63379 -51808 184855 272274 -253357
18319a10847A49418b75377J5156Q8199e3219G3351a00845K3463o4096j94990A62161
$$ -110847 149418 -275377 -260221 -172022 -53219 73351 -100845 -77382 -141478 -336468 162161
18307a97919d4118a6278A05340A2286a4899I075J61852l0755B0000c52425C01519
$$ -197919 -44118 -16278 105340 12286 -14899 9075 170927 140172 20000 -352425 301519
18295A86036h0259k87626A11004d1515F7624a54485l897c6308j69739a9206C1029
$$ 186036 -80259 -367885 111004 -41515 67624 -154485 -158382 -36308 -206047 -19206 31029
18283B94702A27691N2299E4060N844c48523a70905j68346C5589d16716a98748
$$ 294702 127691 179990 54060 59904 -348523 -170905 -339251 35589 -416716 -198748
18272B5238J7928L0750b31049a01532D3510c9829F06a86599O8322C2885K11866
$$ 25238 43166 73916 -231049 -101532 43510 -39829 606 -186599 -118277 32885 244751
18261B44751G0101a83176h640l6941k04818b2737B4321e3062G9708J2150b56153
$$ 244751 70101 -183176 -8640 -45581 -250399 -22737 24321 -53062 79708 91858 -256153
18249F0541a27735B39212n0270b2475o780k08970C0632L6981b64365O7633I5004
$$ 60541 -127735 239212 188942 -22475 -29255 -238225 30632 67613 -264365 -196732 95004
18237B1464K4924c6752j91412F407N4363B70f4629q7224n0324g7593b703j8765
$$ 21464 46388 -36752 -228164 6407 60770 270 -64629 -151853 -202177 -77593 -2703 -21468
18225b1468H9743B1542a03092d0218p950A89556a13155b6699j77826Q8363I3478
$$ -21468 89743 21542 -103092 -40218 -48168 189556 -113155 -26699 -204525 -116162 93478
18213G7497K7435a22511F5817a56039K6079B28348j02520h418k72586r716A99862
$$ 77497 104932 -122511 65817 -156039 -129960 228348 125828 -8418 -281004 -290720 199862
18201C54387b26273j58921C0021d89322H8900d05459a74302b6944o2065F5153
$$ 354387 -226273 -385194 30021 -489322 88900 -405459 -174302 -26944 -89009 65153
18190G8665i700A30851d8836B41726a15703h332m20378A09953a63906A34883a26320
$$ 78665 -9700 130851 -48836 241726 -115703 -8332 -428710 109953 -163906 134883 -126320
18178A29000a50445F1214a43229k323A58374g5289j60565k7460D5645R0839c91224
$$ 129000 -150445 61214 -143229 -145552 158374 -75289 -235854 -263314 45645 136484 -391224
18166b64668M4805A43351n5059P3953G3440L5312a42266G0944D466e47465G3565
$$ -264668 -219863 143351 88292 162245 73440 108752 -142266 70944 4466 -547465 73565
18154D3979c99822f7417E8510J03450a81606p773l02653b34671B35041b94430
$$ 43979 -399822 -67417 58510 161960 -181606 -189379 -492032 -234671 235041 -294430
18143A09881E3968R031b14407r190D47051a59021C4964A0098a35282B9924a61594
$$ 109881 53968 62999 -214407 -223597 447051 -159021 34964 10098 -135282 29924 -161594
18131A96971d5375o706F6711B3708J12555f9399K1095j45689l6057N3882A81563
$$ 196971 -45375 -52081 66711 23708 136263 -69399 -48304 -193993 -230050 -176168 181563
18119d8040H5051a36689O7389A73220d55957e4130F1338L7978b67363c4397p5811
$$ -48040 85051 -136689 -69300 173220 -455957 -54130 61338 99316 -267363 -34397 -110208
18108a10208A71803G8832e116A41705J86292a03975j77371B34453a51289C1076
$$ -110208 171803 78832 -5116 141705 327997 -103975 -281346 234453 -151289 31076
18097a87541I4387a50365A84895b71694a21215H9305b44037O7579j96588a14891
$$ -187541 94387 -150365 184895 -271694 -121215 89305 -244037 -176458 -373046 -114891
18086A08688c97156D1031e4262j06143F5431K85941b15581k8022R1833B8039a84946
$$ 108688 -397156 41031 -54262 -160405 65431 351372 -215581 -243603 -151770 28039 -184946
18074b04031J8612q1316d3834k4122o468B76220a75462b366r1336n8831k82198
$$ -204031 -185419 -266735 -43834 -67956 -74424 276220 -175462 -2366 -93702 -152533 -434731
18063d34731A20085J6925g216l81913A86060B1276b3841A80440a4716n0068n2048
$$ -434731 120085 137010 -7216 -389129 186060 21276 -23841 180440 -14716 -64784 -116832
18052a16832h477j72120j45674J42507o6216O5629E9960a58184F030b29697A70837
$$ -116832 -8477 -180597 -326271 -183764 -249980 -184351 59960 -158184 6030 -229697 170837
18040e7591A56187b63300B21123F985a34541B02788n7819a62427D4219d3319B37923
$$ -57591 156187 -263300 221123 6985 -134541 202788 144969 -162427 44219 -43319 237923
18028f2668N356B9798J72724a21466N4450a3885D9464b00888f2335o6379H0021
$$ -62668 -57312 29798 202522 -121466 -67016 -13885 49464 -200888 -62335 -128714 80021
18016F2854h4580J6054D8044J18273b26357H645K09990A8694b1977O422P751C01611
$$ 62854 -84580 -68526 48044 166317 -226357 8645 218635 18694 -21977 -15555 -7804 301611
18003A74011o4377M04740A17071e8090H1733b23057C5214d2886h125j66675h3885
$$ 174011 109634 514374 117071 -58090 81733 -223057 35214 -42886 -8125 -174800 -83885
17991A80109E7235d5943B947b58953A09239a27102D9082a29501h728l9410l969
$$ 180109 57235 -45943 2947 -258953 109239 -127102 49082 -129501 -8728 -48138 -52107
17980e2107C8884a96775A2241a89882i1365B87024b63323A78917D8535K37528
$$ -52107 38884 -196775 12241 -189882 -91365 287024 -263323 178917 48535 286063
17970B86063B2030J87861f5729C37247g3997I3578Q8192b30678d2965K308A1199
$$ 286063 22030 209891 -65729 337247 -73997 93578 181770 -230678 -42965 -40657 11199
17958B37775C4469M5969I334a90004A74781c23962G8533A6960d39569c5282o4657
$$ 237775 34469 80438 9334 -190004 174781 -323962 78533 16960 -439569 -35282 -99939
17947i9939n8778k2538j02933r4205I9434a83890a5129E3642J74376a75363j05021
$$ -99939 -158717 -181255 -284188 -378393 99434 -183890 -15129 53642 228018 -175363 -280384
17936b80384F480c7488j60386j40658A35840D4064a28605C230e1038j85233k01772
$$ -280384 6480 -37488 -197874 -338532 135840 44064 -128605 3230 -51038 -236271 -438043
17925d38043d7498q8505J8775k00459D7616b86747B0227J8447O3471L9540e3082
$$ -438043 -47498 -136003 -117228 -317687 47616 -286747 20227 38674 102145 141685 -53082
17913C86352C5834P389J49951J35132D9428L94445H3895K40396a82734Q1749J6133
$$ 386352 35834 43223 193174 328306 49428 443873 83895 324291 -182734 -100985 -84852
17902h4852j82834A63803a82282O15E1158a2784A09013J1690K821a27741C04917
$$ -84852 -267686 163803 -182282 -181667 51158 -12784 109013 120703 123524 -127741 304917
17890D6091P9898f1360B8447g5559c5452C80941b14277A00367a38675G6126d3148
$$ 46091 125989 -61360 28447 -75559 -35452 380941 -214277 100367 -138675 76126 -43148
17878f9152A81309c44198R5353k9344a30112j7701j02825l9000A25870c14609
$$ -69152 181309 -344198 -248845 -278189 -130112 -147813 -250638 -289638 125870 -314609
17867A19354b26635f940n5565A76676Q7917h4781B15734b41175a4790k71379B90819
$$ 119354 -226635 -6940 -62505 176676 264593 -84781 215734 -241175 -14790 -286169 290819
17855c4828B5718f5814A9257K53300j22182J96375I2103f2044B89930i5055l69018
$$ -34828 25718 -65814 19257 272557 150375 346750 92103 -62044 289930 -95055 -464073
17844d64073a5077C446a01997B54784f3017j77888b1373I0081i5347j68422C9190
$$ -464073 -15077 3446 -101997 254784 -63017 -240905 -21373 90081 -95347 -263769 39190
17832a84034j2472B47093c380j06153M0196m1249g240n044n6855J1369I0625g2062
$$ -184034 -196506 247093 -3380 -109533 -69337 -110586 -7240 -12284 -69139 -57770 90625 -72062
17819B84834E8460c47235c2220G0032h5415k55017A06282a75059r2453a29604
$$ 284834 58460 -347235 -32220 70032 -85415 -340432 106282 -175059 -267512 -129604
17808A00371a7735G2231L2560a90189i733j09498A9938K20401b5432A83846O09
$$ 100371 -17735 72231 104791 -190189 -9733 -119231 19938 240339 -25432 183846 184455
17797A84455f7944c3479j06157F4141k8251a46404a1236k03462a2453l2873l57755
$$ 184455 -67944 -33479 -139636 64141 35890 -146404 -11236 -214698 -12453 -45326 -403081
17786d03081g2929c1859D16629j44144F7148a15627q3012g7167q1098N0806j10781
$$ -403081 -72929 -31859 416629 272485 67148 -115627 -198639 -77167 -158265 -107459 -218240
17775b18240B05286M1411b2158D1881d1877k00938a6702l28107e6533A68653G4364
$$ -218240 205286 246697 -22158 41881 -41877 -242815 -16702 -344809 -56533 168653 74364
17763a09013k97164C5036J70729b08617f3139H0553b86719e9422j17409a2062
$$ -109013 -406177 35036 205765 -208617 -63139 80553 -286719 -59422 -176831 -12062
17752b36381A92157C7668O4040m0266P7011M212d7958D3691h8309D7806N9343
$$ -236381 192157 37668 101708 61442 138453 142665 -47958 43691 -88309 47806 107149
17741A07149a76307p2286R4760A85836E1272a05749d1829p0685A37438a85920
$$ 107149 -176307 -248593 -153833 185836 51272 -105749 -41829 -112514 137438 -185920
17730a79321j01613a08629q5793a4561A74788g3566k84913f1199a0539F4186c11288
$$ -179321 -280934 -108629 -194422 -14561 174788 -73566 -358479 -61199 -10539 64186 -311288
17718H0264d31578I6222P4744G7194a50036b1938B00204A4983a29601d1627m2202
$$ 80264 -431578 96222 170966 77194 -150036 -21938 200204 14983 -129601 -41627 -83829
17707h3829D8594a72124k9356B42457c18559F7803i7692a6314j34475A2139c6625
$$ -83829 48594 -172124 -201480 242457 -318559 67803 -97692 -16314 -150789 12139 -36625
17695a2938p4346k21779A64569a38457c3586k89662c6613F7409Q176K7124B4629
$$ -12938 -87284 -309063 164569 -138457 -33586 -323248 -36613 67409 75585 102709 24629
17683h7810B8868c13385B37007D1608K38296m2968I9699b40768H3128h2842j36557
$$ -87810 28868 -313385 237007 41608 279904 236936 99699 -240768 83128 -82842 -219399
17672b19399A68796M4660A305c11329E1967f6270q8442A04639a66271L3901F6498
$$ -219399 168796 213456 1305 -311329 51967 -66270 -154712 104639 -166271 -132370 66498
17660A19415b5438E4962k3595M5592d3622n7811q2472A05566b0902A56659k0603
$$ 119415 -25438 54962 31367 76959 -43622 -101433 -183905 105566 -20902 156659 136056
17649A36056a5458A20974a49960A57149L63219f102A31557j4195P8235D2826K48268
$$ 136056 -15458 120974 -149960 157149 520368 -6102 131557 117362 195597 42826 291094
17638B91094j43397o8574a31031A12178q024N8237C3705A3690L67038D9289b5923
$$ 291094 147697 79123 -131031 112178 104154 162391 33705 13690 380728 49289 -25923
17626d2726p6358L8834c6360B72525b5991B58300a19021B53040D8728a74061A56729
$$ -42726 -119084 -80250 -36360 272525 -25991 258300 -119021 253040 48728 -174061 156729
17614B40647k3942q2745B3171a34277F133a64376j46144e6828H471b42126A52167
$$ 240647 216705 133960 23171 -134277 6133 -164376 -310520 -56828 8471 -242126 152167
17602f165C74420j72020d7805k11209B14045h8060A46701O2463i8363C3825c40847
$$ -6165 374420 202400 -47805 -259014 214045 -88060 146701 209164 -98363 33825 -340847
17590B76392h4157d1491j00113c8863A91580L6851I6457q893a2319j38355M6965
$$ 276392 -84157 -41491 -141604 -38863 191580 228431 96457 87564 -12319 -150674 -103709
17579a03709A60648b72810E4001a21130A3904K11535a06639k2710A33854C0652
$$ -103709 160648 -272810 54001 -121130 13904 225439 -106639 -129349 133854 30652
17568A77541a7280j50721e2750j89620C82458c74404a36199I4014L2293k1152
$$ 177541 -17280 -168001 -52750 -242370 382458 -374404 -136199 94014 126307 105155
17558A05155i2596A5534g4781B58670I8025a36411j11412C6096a45759F4563K58957
$$ 105155 -92596 15534 -74781 258670 98025 -136411 -247823 36096 -145759 64563 323520
17547C23520N5547J42242e7232m4016n288c3739K027D42028b47248B33987a76762
$$ 323520 379067 521309 -57232 -101248 -106536 -33739 -31712 442028 -247248 233987 -176762
17535h7529j9451m2343A81241b61355b7026j08596D45858A85228A2233L48134
$$ -87529 -106980 -149323 181241 -261355 -27026 -135622 445858 185228 12233 360367
17525C60367E4661b40526D58253H3201j5482b44372B16647J43908b44503e8495
$$ 360367 54661 -240526 458253 83201 67719 -244372 216647 360555 -244503 -58495
17514b18122B71663a80777P7948A20444J49488j12574a97303B8662L1083b14991
$$ -218122 271663 -180777 -102829 120444 269932 157358 -197303 28662 59745 -214991
17503G7364K89466j22529a6093C06872f2593A57840i7901K8286j58087i8344j50093
$$ 77364 366830 244301 -16093 306872 -62593 157840 -97901 -69615 -227702 -98344 -248437
17492b48437A78461J39445a2923l0858G3808b63688A28080A1806O21665B5956
$$ -248437 178461 317906 -12923 -43781 73808 -263688 128080 11806 633471 25956
17481b23271h270A9559C700J49221C7005b5889E3154J06972D7448a2165I0201
$$ -223271 -8270 19559 3700 152921 37005 -25889 53154 160126 47448 -12165 90201
17469C66754c53942J73110A48715p0790b60682C81488H5031e8539D9496a6530
$$ 366754 -353942 -180832 148715 77925 -260682 381488 85031 -58539 49496 -16530
17458a62327B75004g1505A67854L26508A51122c12604C9545c3438E53070i8393
$$ -162327 275004 -71505 167854 494362 151122 -312604 39545 -33438 553070 -98393
17447B94402b6290J2179B11323G7933R3662Q0331n349P1811J05727f1888C82913
$$ 294402 -26290 -14111 211323 77933 171595 251926 246577 318388 424115 -61888 382913
17435C51503M580F037L43063F3473K52455i9934E51728k35687g728A55649B1570
$$ 351503 356083 6037 349100 63473 315928 -99934 551728 316041 -7728 155649 21570
17423D50150n2985A4918J33006a4753C52404p9224A02310c2963A73924R5318I7345
$$ 450150 397165 14918 147924 -14753 352404 273180 102310 -32963 173924 269242 97345
17411B88588A01757K59100O3931J86100A15414P9448o9161J61411C4368L59649
$$ 288588 101757 360857 424788 610888 115414 194862 125701 287112 34368 394017
17401C94017D9473M18965D5477K39376N1304b4602F986J24998e9934B27565a25534
$$ 394017 49473 468438 45477 284853 336157 -24602 6986 131984 -59934 227565 -125534
17389G2392L65478A84546J20137H4703a1349B6979J18910a62060a052A91624e3101
$$ 72392 437870 184546 304683 84703 -11349 26979 145889 -162060 -1052 191624 -53101
17377i6194B63400A24726J1229A1240K35761A7968K04114G9516N5643n0069k4569
$$ -96194 263400 124726 135955 11240 247001 17968 222082 79516 135159 85090 60521
17366F0521Q2063A1166L7793J655R6444J06342Q717J01263j80350n7242K00024
$$ 60521 142584 11166 48959 50614 147058 253400 262117 363380 183030 125788 325812
17355C25812B559i4050A13202a29810A94116e8634A3461b52193A24365b05674
$$ 325812 2559 -94050 113202 -129810 194116 -58634 13461 -252193 124365 -205674
17344B39579a99340H8611P2K30390H5679K22629r0826a39883C10729P7995A13760
$$ 239579 -199340 88611 88683 319073 85679 308308 217482 -139883 310729 388724 113760
17332I3202J46656K07941M405I8018J00249J67144d0390B53734Q8924B3467J44345
$$ 93202 239858 447799 452204 98018 198267 365411 -40390 253734 342658 23467 167812
17321A67812F9605a12532A05383b2626A24868o0065B3882K15754a75806B20490
$$ 167812 69605 -112532 105383 -22626 124868 64803 23882 239636 -175806 220490
17310a44477L2257B74015K64073A35940J02568j03031N5966a12100C86008j31521
$$ -144477 -112220 274015 538088 135940 238508 135477 191443 -112100 386008 254487
17300B54487I3704C8950j5408a41801A92463G8254J37618I5260B3569c06368d6565
$$ 254487 93704 38950 23542 -141801 192463 78254 215872 95260 23569 -306368 -46565
17288C80654A54844M2622K4064j08437e2267K1868B62541J7714J17623h2090B48908
$$ 380654 154844 197466 221530 113093 -52267 -30399 262541 280255 397878 -82090 248908
17276g0478C05822h66D70227B1146L34211l1135G1205R3798l8091K44237j71340
$$ -70478 305822 -866 470227 21146 355357 324222 71205 165003 126912 371149 199809
17265A99809d0566o3596d4818A04495d0126A62340b33366A26078j2916n5716j9733
$$ 199809 -40566 -104162 -44818 104495 -40126 162340 -233366 126078 113162 57446 37713
17254C7713J84084h4321r968A73029A4895M10387G7662a83159D19616I7892J58963
$$ 37713 221797 -84321 -94289 173029 14895 425282 77662 -183159 419616 97892 256855
17243B56855r594f2898j41979A96168I1791K95711j82091N4050r8759E5226K65144
$$ 256855 247261 -62898 -204877 196168 91791 387502 205411 259461 160702 55226 320370
17232C20370f0003A58910J31324F7738g295j90462B64460a47147A69077a67083
$$ 320370 -60003 158910 290234 67738 -7295 -197757 264460 -147147 169077 -167083
17221B6922R9396L02550J91850B27783K09312k8101e0140m7612B92397i3113d0471
$$ 26922 126318 428868 620718 227783 437095 408994 -50140 -97752 292397 -93113 -40471
17209i7963B6145K97723j51648K77373a03873k8837C2903p243M07690A23715e38
$$ -97963 26145 323868 172220 449593 -103873 -132710 32903 25660 433350 123715 -538
17197B40015i0575C32029L0234o7354q9584N5251B4741J87c7255D1063K69625
$$ 240015 -90575 332029 362263 294909 205325 260576 24741 24928 -37255 41063 310688
17186C10688m9026O5416G314N77997j26284A34453J42175O9106B4798J46607G3237
$$ 310688 261662 327078 7314 585311 459027 134453 276628 345734 24798 171405 73237
17174E6006a08481B06299i87B17993L9265a022B24197J10086j2059r3855Q3166
$$ 56006 -108481 206299 -987 217993 257258 -1022 224197 334283 322224 228369 311535
17163C11535k0804l3561A17172F739M385L32880A06627L4920C2196K28936A28476
$$ 311535 290731 257170 117172 6739 11124 344004 106627 141547 32196 261132 128476
17151A99823K0670j06463d9360K3957A12965K54862l065k5226d9370B73114n3652
$$ 199823 220493 114030 -49360 -25403 112965 367827 364762 339536 -49370 273114 219462
17140B19462N0540j32823F1602J43091C761J17088m7128L0889K51483J70988b41384
$$ 219462 270002 137179 61602 204693 3761 120849 73721 104610 356093 527081 -241384
17128B23501m8488K84306b5793A29271J74266K08124k15787A00484J42400m311
$$ 223501 175013 459319 -25793 129271 303537 511661 295874 100484 242884 238573
17118B38573J15233j17620k4763R355J79429A35158J65731j12238j1451n1136
$$ 238573 353806 236186 211423 220778 400207 135158 300889 188651 177200 126064
17108A26064K24740d4577F58663k04285k02713K51280a59688H1975J52684j5140
$$ 126064 350804 -44577 658663 454378 251665 502945 -159688 81975 234659 219519
17098B19519J828j9622J37997j17772A10568L61442A97561J30101J1541I7175
$$ 219519 221347 201725 339722 221950 110568 472010 197561 327662 339203 97175
17087A90167M44166B71583L42566o9181B30266L11329q6964A98100K54651L92606
$$ 190167 634333 271583 614149 544968 230266 541595 454631 198100 452751 845357
17077H45357k59479o8436j02436P8132B45147p012k4779P6524p740L42575C01444
$$ 845357 585878 517442 415006 493138 245147 238135 213356 289880 282140 624715 301444
17065B17440P2263K86918B74845J4190m3222J43803j41433l7579n0286F6334J20763
$$ 217440 289703 576621 274845 289035 245813 389616 248183 210604 160318 66334 187097
17054A87097K15316R897F4762K13840p1997L15533J43148B79315J52695r7429
$$ 187097 402413 412310 64762 278602 206605 522138 665286 279315 432010 334581
17044C34581N1958P5734K34985J9772C24295K95029k66096L464j20957J52916
$$ 334581 386539 462273 697258 717030 324295 619324 353228 356692 235735 388651
17034C88651R1653r3008L74645k97560K53512p6113r548k45301M5291o9967q8276
$$ 388651 480304 387296 761941 464381 717893 641780 632232 386931 432222 362255 273979
17023B73979L33910k04209A27636M32588K06249k78671A55261M11680k37233K8225
$$ 273979 607889 403680 127636 560224 766473 487802 155261 566941 329708 357933
17013C57933O4577k06597P75729m61321A98880M16642J00224j45763r4402L81348
$$ 357933 422510 215913 991642 530321 198880 615522 715746 569983 475581 856929
17003H56929j3757j35046j59452J94407q982j92724J16960J14562l83720M10891
$$ 856929 843172 708126 548674 743081 734099 541375 658335 772897 389177 800068
16993H00068l17763J11798j88982L05081j53040j1582R1697J78707j87832j83938
$$ 800068 482305 594103 405121 710202 557162 545580 637277 815984 628152 444214
16983D44214L00268k14829L68080n8627j77711j0410j20018P2776J56801K02267
$$ 444214 744482 529653 897733 839106 661395 650985 530967 603743 760544 962811
16973I62811k89179J33093k69317P6376K14013j97816k04989M96366l27710L78273
$$ 962811 673632 806725 537408 613784 827797 629981 424992 921358 593648 971921
16963I71921C92280M02635k75196K03505K65236l43670P8617K47556J27196m07598
$$ 971921 392280 794915 519719 723224 988460 644790 723407 970963 1098159 690561
16953F90561K10579L89255n34351L3583J63072m40814L23358k86392K72466M95139
$$ 690561 901140 1290395 756044 789627 952699 511885 835243 548851 821317 1316456
16943A316456F26799J05405J90123m0438J05392R9166l64424J50808J82837m823
$$ 1316456 626799 732204 922327 881889 987281 1086447 722023 872831 1055668 1050845
16933A050845j53120j5164J41677o1849J52348k42208K98607m26578J57236K26251
$$ 1050845 897725 882561 1024238 962389 1114737 872529 1171136 744558 901794 1128045
16923A128045j25821k22772k9862J80399N16897l14070k46001j6095J7009M06090
$$ 1128045 1002224 779452 749590 929989 1446886 1132816 886815 870720 887729 1293819
16913A293819k72007M18673k62586q4981M27215k62344j82275L63918k65917L7976
$$ 1293819 1021812 1440485 1177899 1092918 1520133 1257789 1075514 1439432 1173515 1211491
16903A211491L8837k01270L90476j55583K21495l03483J37051K72758k13827l0790
$$ 1211491 1250328 1049058 1439534 1283951 1505446 1201963 1339014 1611772 1397945 1367155
16893A367155m7551L94684k84089o8720M47148m43236N7323o1166K61396L2751
$$ 1367155 1319604 1714288 1430199 1361479 1808627 1365391 1422714 1361548 1622944 1655695
16883A655695k00702M26262n7056n35446N71429j34799j57867J89898J42195k32418
$$ 1655695 1454993 1881255 1824199 1288753 1860182 1725383 1567516 1757414 1899609 1667191
16873A667191J12090L29610m14497K79027l2392p3497r5187K04705L92125l75355
$$ 1667191 1779281 2108891 1694394 1973421 1941029 1867532 1772345 1977050 2369175 1993820
16863A993820J07531k21667L58967j91228J30878j58240L26221j85790j36049
$$ 1993820 2101351 1879684 2238651 2047423 2178301 2020061 2346282 2160492 2024443
16854B024443K73119k70384M18750j41627R7513j70692O0041K65290J51325Q7834
$$ 2024443 2297562 2027178 2445928 2304301 2401814 2231122 2291163 2556453 2707778 2795612
16844B795612j50616J04257p9571J86485j17846j85423L32015k1103Q7591J52920
$$ 2795612 2644996 2749253 2669682 2856167 2738321 2552898 2884913 2863810 2951401 3104321
16834C104321m91783O56158l91923K25626J19058l71300N84517P0961o3694J10328
$$ 3104321 2612538 3268696 2876773 3102399 3221457 2850157 3434674 3505635 3441941 3552269
16824C552269Q5136l5262O5078L49687O9928r0425K60668l96337O69577k00724
$$ 3552269 3637405 3602143 3667221 4016908 4086836 3996411 4257079 3860742 4530319 4329595
16814D329595k59595M27056K52759l5091p1193L15662L0218J8924J892L93363
$$ 4329595 4070000 4497056 4749815 4714724 4643531 4959193 4989411 5008335 5010227 5403590
16804E403590l50888K84948K07583R107N1374J72388N90384m25150J94677K69162
$$ 5403590 5052702 5337650 5545233 5554340 5605714 5778102 6368486 5943336 6138013 6407175
16794F407175P0966J59726J77342K01122P1151J54489J64720M56929K66413k21980
$$ 6407175 6478141 6637867 6815209 7016331 7087482 7241971 7406691 7863620 8130033 7908053
16784G908053K30742M30754K27454J91926J4097N61846o3798N39941j08524K99842
$$ 7908053 8138795 8569549 8797003 8988929 9003026 9564872 9501074 10041015 9932491 10232333
16774A0232333L38623K99096Q17133k40122K65992R46800K8531M28471J85781
$$ 10232333 10570956 10870052 11687185 11447063 11713055 12659855 12688386 13116857 13302638
16765A3302638N77883P28208L87716M99583M66563L74284N32626Q33450M36211
$$ 13302638 13880521 14608729 14996445 15496028 15962591 16336875 16869501 17702951 18139162
16756A8139162P67282Q27878O20670O18853Q78750Q92176P51254J291406Q33310
$$ 18139162 18906444 19734322 20354992 20973845 21852595 22744771 23496025 24787431 25620741
16747B5620741J176527J499013P83156J377745J461308J337347J388812J656226
$$ 25620741 26797268 28296281 29079437 30457182 31918490 33255837 34644649 36300875
16739C6300875J796182K252840K014575J812549K370655K720494K562404K911820
$$ 36300875 38097057 40349897 42364472 44177021 46547676 49268170 51830574 54742394
16731E4742394L223972L080563L864807L789050M102245M491138M650006N186884
$$ 54742394 57966366 61046929 64911736 68700786 72803031 77294169 81944175 87131059
16723H7131059N772306N756433O574218O834484O991749P110098P918705Q628606
$$ 87131059 92903365 98659798 105234016 112068500 119060249 126170347 134089052 142717658
16715A42717658Q089129Q796707Q919593Q552053Q207798P471992P364984O129890
$$ 142717658 150806787 159603494 168523087 177075140 185282938 192754930 200119914 206249804
16707B06249804N042354M034650K532494J082519q48586k122242l755392m911426
$$ 206249804 211292158 215326808 217859302 218941821 218093235 215970993 212215601 207304175
16699B07304175o302184p475937p971701q143812r070409q867640q249476q993080
$$ 207304175 201001991 193526054 185554353 177410541 168340132 159472492 151223016 142229936
16691A42229936q438011p951904p477624p356204o938343o442412o316122n243790
$$ 142229936 133791925 125840021 118362397 111006193 104067850 97625438 91309316 86065526
16683H6065526n404291n292362m477470m213899l682150l683457l285594l158762
$$ 86065526 80661235 75368873 70891403 66677504 62995354 59311897 56026303 52867541
16675E2867541l012117k723690k406308k552408k177631k054990j911029j431936
$$ 52867541 49855424 47131734 44725426 42173018 39995387 37940397 36029368 34597432
16667C4597432j718025j384113j622094j353261p97261j649966j125214q40926
$$ 34597432 32879407 31495294 29873200 28519939 27722678 26072712 24947498 24106572
16659B4106572j207357n67321j062571q94563p80866p93940o27580n68566p91271
$$ 24106572 22899215 22331894 21269323 20374760 19593894 18799954 18172374 17603808 16812537
16650A6812537n08247m89492o22918l34926o33708p07097m08971l54764k35777
$$ 16812537 16304290 15814798 15191880 14856954 14223246 13516149 13107178 12752414 12516637
16641A2516637l31935n69174p4751o18360L0322o37297m88934J48798n75400p9986
$$ 12516637 12184702 11615528 11540777 10922417 10952739 10315442 9826508 9975306 9399906 9319920
16631I319920m04817k82532j82942j93729l02668L5551l08328k17750j14741k64961
$$ 9319920 8915103 8632571 8449629 8255900 7953232 7988783 7680455 7462705 7347964 7083003
16621G083003j23742o4906J79662q76750j00981J4847k11134m394n08138O714
$$ 7083003 6959261 6894355 7074017 6197267 6096286 6111133 5899999 5895605 5387467 5394181
16611E394181K13155m04817l03815J70133k22699m7165o4806n6428K18343n69241
$$ 5394181 5607336 5202519 4898704 5068837 4846138 4798973 4734167 4677739 4896082 4326841
16601D326841P9396k63350K11273j47042j58884j53248k18174q2400J86759P2389
$$ 4326841 4406237 4142887 4354160 4207118 4048234 3894986 3676812 3594412 3781171 3853560
16591C853560k98572J07811l70103L114L34606n51555k06909j82342M20861O5571
$$ 3853560 3554988 3662799 3292696 3295810 3630416 3078861 2871952 2689610 3110471 3176042
16581C176042r3837j299j71755J71610m27885K31718L6803l30869Q4977K48824
$$ 3176042 3082205 3080906 2909151 3080761 2652876 2884594 2921397 2590528 2675505 2924329
16571B924329m70032K35538o62558J54747L80206j80165J98472r0472n27316K31760
$$ 2924329 2454297 2689835 2027277 2182024 2562230 2382065 2580537 2490065 1962749 2194509
16561B194509K93803n26928L21766o95101L70394L49781n15179K03980K30210
$$ 2194509 2488312 1961384 2283150 1588049 1958443 2308224 1793045 1997025 2227235
16552B227235l51560M7158J79981j53611M751q4743k62517m3638L86768j71560
$$ 2227235 1875675 1922833 2102814 1949203 1953954 1869211 1606694 1563056 1949824 1778264
16542A778264J65598k12344j63894j13J25509o12616N77763n3393m14757K51938
$$ 1778264 1943862 1731518 1567624 1567511 1693020 1080404 1658167 1604774 1190017 1441955
16532A441955o0976R6242m09383L33331n3198j86082K03255r2412J46284j57357
$$ 1441955 1380979 1477221 1067838 1401169 1347971 1161889 1365144 1272732 1419016 1261659
16522A261659Q2636l54114Q9908J11707K44768k20018j19287J78922k41548j60329
$$ 1261659 1344295 990181 1080089 1191796 1436564 1216546 1097259 1276181 1034633 874304
16512H74304M45907M9893J16086o64721K78457j40385j6k62200K59200j31555
$$ 874304 1320211 1370104 1486190 821469 1099926 959541 959525 697325 956525 824970
16502H24970J10188J67992k8629k18789M29686m28056K71784l97913K37510l07972
$$ 824970 935158 1103150 1074521 855732 1285418 857362 1129146 731233 968743 660771
16492F60771o1558J71075L04482k44131C88225M00042j75345M56191j52236K8911
$$ 660771 599213 770288 1074770 830639 388225 788267 612922 1069113 916877 945788
16482I45788M4445k10241j90817K02878P1690J88988k05685r6939j859q273J53271
$$ 945788 990233 779992 589175 792053 863743 1052731 847046 750107 748248 739975 893246
16471H93246k30867j11547L05958K996p6797j71526L2580k29744K80372k35663
$$ 893246 662379 550832 856790 859786 782989 611463 644043 414299 694671 459008
16461D59008J99401k13387J13895L89p736J07148l8194n5292M54307D28993j31232
$$ 459008 658409 445022 558917 559306 551570 658718 620524 565232 1019539 428993 297761
16450B97761L00023j26642J60220L36359l56531m4796K55747k53379L4038K01926
$$ 297761 597784 471142 631362 967721 611190 566394 822141 568762 602800 804726
16440H04726l63682K32342j26378N9769j6639l0214J13977k44695L86296k28291
$$ 804726 441044 673386 547008 606777 590138 559924 673901 429206 815502 587211
16430E87211q6087j4682L08689B99158L46217k73761m4686J58204J0740K76936
$$ 587211 501124 486442 795131 299158 645375 371614 326928 485132 495872 772808
16420G72808j65882J86952C07764Q149M0542J02497j32685K24964m9454L42989
$$ 772808 606926 793878 307764 315913 356455 458952 326267 551231 501777 844766
16410H44766k52342j12649l5721B8385L95576K43794l8306K0298k15576p3815
$$ 844766 592424 479775 444054 28385 423961 667755 629449 649747 434171 360356
16400C60356p9806L03740B45879L00207j7581p9891K88761k33360L3528j95021
$$ 360356 280550 584290 245879 546086 528505 448614 737375 504015 537543 342522
16390C42522J00773I7184K73914Q5946j11344M3657K16125k14446L5006G3984
$$ 342522 443295 97184 371098 457044 345700 389357 605482 391036 426042 73984
16379C10207N1912l024j28340J74950J27767j75971p7874A18551K51727j07810
$$ 310207 362119 359095 230755 405705 533472 357501 279627 118551 370278 262468
16369B62468L58776l01248J70816k26528M5206n1451J36500p5728K50576f1552
$$ 262468 621244 319996 490812 264284 309490 258039 394539 318811 569387 -61552
16358D65430A54636M3748p3574J58923L4289R6033M7853M5680P5399m5160A31483
$$ 465430 154636 198384 124810 283733 318022 414055 461908 507588 582987 537827 131483
16346F23205b9352B96936J60679A03451J60399Q9062e6371B01790Q5380A01556
$$ 623205 -29352 296936 457615 103451 263850 352912 -56371 201790 287170 101556
16335B56804o5505P4K20770p1096J1374j08431P867N2386p5417n6070o7916k9052
$$ 256804 191299 191373 412143 341047 352421 243990 251857 304243 228826 172756 104840 75788
16323G5788N4930K28014G6202M5668R8514L09258j32528j29993N5182A56803J96004
$$ 75788 130718 358732 76202 121870 220384 529642 397114 267121 322303 156803 352807
16312C52807j54136C347L08874A17157P4322Q3113A02256K54925A54351J84339
$$ 352807 198671 3347 312221 117157 191479 274592 102256 357181 154351 338690
16302C38690g7901C34271n7647A20124K56793c0989B89026H5528A988J17957J65786
$$ 338690 -77901 334271 276624 120124 376917 -30989 289026 85528 1988 119945 285731
16291B85731G6476a06594K8498E34167A95045a513B41457J58634R2030D780K56338
$$ 285731 76476 -106594 -78096 534167 195045 -1513 241457 400091 492121 4780 261118
16280B61118d921B99073f5932A06071L06800b62606f9251B02011D2671J46186
$$ 261118 -4921 299073 -65932 106071 412871 -262606 -69251 202011 42671 188857
16270A88857N8105K44279C1816L42996A81581o0604b02546A39975b43658A34089
$$ 188857 246962 491241 31816 374812 181581 120977 -202546 139975 -243658 134089
16259B61255o0643L0477o9129K48366j69441g5574B50963a82992B61099f1090
$$ 261255 200612 231089 161960 410326 240885 -75574 250963 -182992 261099 -61090
16248h5398C27341R2529b2680k34558B70152j18348J42907D5574K32236g9980
$$ -85398 327341 419870 -22680 -257238 270152 151804 294711 45574 277810 -79980
16237F9522J79229j24095J7142J15971a00872q187c0523B76857a08031E7501i7606
$$ 69522 248751 124656 141798 257769 -100872 -109059 -30523 276857 -108031 57501 -97606
16225a13389n3756g5862L13A06066K15590r4568L5693r007j24053F0465r252J4298
$$ -113389 -167145 -75862 -75549 106066 321656 227088 262781 253774 129721 60465 51213 65511
16213F5511P5639b38907C12284B6756J19287E5350P1303L60825A71068m6122l4073
$$ 65511 141150 -238907 312284 26756 146043 55350 126653 487478 171068 124946 90873
16202I0873J09995n9883a64278A67593l7425N6375o389J37673E6260J36914d1705
$$ 90873 200868 140985 -164278 167593 130168 186543 180154 317827 56260 193174 -41705
16190C86997j31954b62369B14220J19970n6034A20867d258A30669a52364B27312
$$ 386997 255043 -262369 214220 334190 278156 120867 -4258 130669 -152364 227312
16179a14947L4790C62820b19395A56072o6011K3877Q6356b37826c4606B21530
$$ -114947 -80157 362820 -219395 156072 90061 113938 200294 -237826 -34606 221530
16168A42126n7155g9472K888A09669c375F1789J10650a38616D26681k04236J04587
$$ 142126 84971 -79472 -76584 109669 -3375 61789 172439 -138616 426681 222445 327032
16157C27032A42712D5262d789D16485g6923n0846B08660f7399E7774K17798n2880
$$ 327032 142712 45262 -4789 416485 -76923 -127769 208660 -67399 57774 275572 222692
16146B22692D7365a23522A39145l2444J19148a45723N9785f134j32275E8830j1931
$$ 222692 47365 -123522 139145 106701 225849 -145723 -85938 -6134 -138409 58830 46899
16135D6899a22237H2444k149a29552B34909q8219a63467B90333b25352C23703
$$ 46899 -122237 82444 80295 -129552 234909 146690 -163467 290333 -225352 323703
16124C54505Q9197A37864B0290O3950b21178p594A54651J19806K5268b28998N5204
$$ 354505 443702 137864 20290 84240 -221178 -228772 154651 274457 299725 -228998 -173794
16113a73794N0213a6926m9453I6012b73383I150L3918J87799k529a9502j5569
$$ -173794 -123581 -16926 -66379 96012 -273383 9150 43068 230867 228338 -19502 -35071
16102c5071A16023L0889M6954a76992I5487f6547I0249b0229B18474h586E4754
$$ -35071 116023 146912 193866 -176992 95487 -66547 90249 -20229 218474 -8586 54754
16090B35879p3004n23L65142B47680A02222O7089g5211A28969D8263A124L4595
$$ 235879 162875 162352 527494 247680 102222 169311 -75211 128969 48263 1124 35719
16079C5719J75453J5970i4263e496D06083a85850f3567A68917d0914C0732a3057
$$ 35719 211172 227142 -94263 -5496 406083 -185850 -63567 168917 -40914 30732 -13057
16067h4500A23555m6914j3512a2349k24828g1175C28211A05284K456l083d29351
$$ -84500 123555 76641 63129 -12349 -237177 -71175 328211 105284 107740 104657 -429351
16055A18547e6118k5346C34813Q7020A53049b11278B8517b86026D2276b44306
$$ 118547 -56118 -81464 334813 421833 153049 -211278 28517 -286026 42276 -244306
16044a33387A80466e486k4555j04190b5121j12927j19051d3894F2503a16993k9604
$$ -133387 180466 -5486 -30041 -134231 -25121 -138048 -257099 -43894 62503 -116993 -146597
16033a46597F770b37581B62433I732L24269j54750b32465A60242C9081c23534
$$ -146597 6770 -237581 262433 9732 334001 179251 -232465 160242 39081 -323534
16022a67188A04187c96464A52123a76575r9621J36389d9024r7882G6138j1655
$$ -167188 104187 -396464 152123 -176575 -276196 -139807 -49024 -146906 76138 64483
16012F4483b77802J07821L6494M2680K4330B52543d2384j1044B40242l203b2861
$$ 64483 -277802 -169981 -133487 -90807 -66477 252543 -42384 -53428 240242 237039 -22861
16000h1755H1931A6913a61785I9354m7425a23771A8361a81204j78301a23307A43912
$$ -81755 81931 16913 -161785 99354 51929 -123771 18361 -181204 -359505 -123307 143912
15988B32994b44827J03838C2066a77863i328l03187e0426A11778L2151A6728a271
$$ 232994 -244827 -140989 32066 -177863 -9328 -312515 -50426 111778 143929 16728 -1271
15976b36993f9199j32312H3962a2272n9993B99716a61226C32172D7989e8478J7405
$$ -236993 -69199 -201511 83962 -12272 -72265 299716 -161226 332172 47989 -58478 -41073
15965d1073G4061b67553a21248p1194I4247b50876C2136J29061b4163p3392o1661
$$ -41073 74061 -267553 -121248 -192442 94247 -250876 32136 161197 -24163 -97555 -159216
15954a59216p6110I0066a2714j13580m0536A31046f5580j37015B2397J7092b78490
$$ -159216 -235326 90066 -12714 -126294 -166830 131046 -65580 -202595 22397 39489 -278490
15942a54181G2130k9021J02351d64057E9044a08919b7481j59430l5164M3472K33
$$ -154181 72130 43109 145460 -464057 59044 -108919 -27481 -186911 -222075 -178603 -178370
15931a78370E7701J5770D145a8655C5770a77601G1497b93159a20690A44383A9474
$$ -178370 57701 73471 4145 -18655 35770 -177601 71497 -293159 -120690 144383 19474
15919A38030b80872d3761K1759k49188H8664a43667M0496B6394d4382q5380j2793
$$ 138030 -280872 -43761 -22002 -271190 88664 -143667 -103171 26394 -44382 -129762 -142555
15908a42555r156J3206A02455i389I1277b49004a11361A39900o492a29178H3438
$$ -142555 -151711 -138505 102455 -9389 91277 -249004 -111361 139900 133408 -129178 83438
15896a45782j15874e0074o8493B85987g9520j4707p9022g7901B12741i0410F0334
$$ -145782 -261656 -50074 -118567 285987 -79520 -94227 -173249 -77901 212741 -90410 60334
15884C9010j5940a32428o4622H3785G251a16979n3537M7169A47620K7029e0584
$$ 39010 23070 -132428 -197050 83785 7251 -116979 -170516 -123347 147620 174649 -50584
15872a4756l4220A2825c27939J21315e7692C96991A30490b73118j6793E7765j0105
$$ -14756 -48976 12825 -327939 -206624 -57692 396991 130490 -273118 -289911 57765 47660
15861D7660a45271m56M5866k20615K0628r4508J19235P5535N2107M5529A8246
$$ 47660 -145271 -145727 -99861 -320476 -299848 -394356 -275121 -199586 -147479 -101950 18246
15849a29407p0167j0036G2870l3692a13464B5401c68412O6065B50020b8553j645
$$ -129407 -199574 -209610 72870 39178 -113464 25401 -368412 -302347 250020 -28553 -30198
15838c0198b882A57443p7216a02360c8013o4401j3384L8197p3064M5650J1065
$$ -30198 -2882 157443 80227 -102360 -38013 -102414 -115798 -77601 -150665 -105015 -93950
15827i3950A22993J91661f4719H189K71732A5883h7404l5585J3977b5114j0288
$$ -93950 122993 314654 -64719 8189 279921 15883 -87404 -122989 -109012 -25114 -35402
15816c5402k14827I1644J2480J67303c18339G1492M0552a41710k47548J11465
$$ -35402 -250229 91644 104124 271427 -318339 71492 112044 -141710 -389258 -277793
15806b77793J6891D2602K9643a75381m8200N2763m3861B45919a6875D6274A911
$$ -277793 -260902 42602 72245 -175381 -223581 -170818 -214679 245919 -16875 46274 1911
15794A36342F1730J15003d6575H7793h1753o840l7525j04617B0166a46078k78905
$$ 136342 61730 176733 -46575 87793 -81753 -88593 -126118 -230735 20166 -146078 -424983
15783d24983a23219F7153a6848k5053j10526I6060C682a5200j34640C7513a43918
$$ -424983 -123219 67153 -16848 -41901 -152427 96060 3682 -15200 -149840 37513 -143918
15771a63156j17443A53993B6234J3406J00086b49262J6801A00744b14125Q5265
$$ -163156 -280599 153993 26234 39640 139726 -249262 -232461 100744 -214125 -128860
15761a28860E5696B7471J80652d9872k42350a07689p4142L5084f1791A6575J38141
$$ -128860 55696 27471 208123 -49872 -292222 -107689 -181831 -146747 -61791 16575 154716
15750A54716a52416K0630p8540J01007H896g627A43117b72489a22586C9379C289
$$ 154716 -152416 -131786 -210326 -109319 8896 -7627 143117 -272489 -122586 39379 3289
15738D5254j2099Q311g2696j38949B00941R6431c4194C7470a16096j21704M0963
$$ 45254 33155 41466 -72696 -211645 200941 297372 -34194 37470 -116096 -237800 -196837
15727a96837H4759g8392B78181h8731K484H5488O8923L2901G5481b39122J14536
$$ -196837 84759 -78392 278181 -88731 -86247 85488 154411 187312 75481 -239122 -124586
15716a24586I9844b23409l3148C6096K04641a34372D909c76078a59347J9040B04790
$$ -124586 99844 -223409 -256557 36096 240737 -134372 4909 -376078 -159347 -140307 204790
15704A95921G4489h722q4047A25848D6904g862o0683b3221D0426a90533d5715
$$ 195921 74489 -8722 -92769 125848 46904 -7862 -68545 -23221 40426 -190533 -45715
15692a22076A64956b26738n2894A13026f9253j2913A16805d4413J3271k7149A41570
$$ -122076 164956 -226738 -279632 113026 -69253 -82166 116805 -44413 -31142 -58291 141570
15680c64113i8963r2456C3953K70964g7342B05636e7587j56190G6605j0758a23773
$$ -364113 -98963 -191419 33953 304917 -77342 205636 -57587 -213777 76605 65847 -123773
15668a19520j57399a20992B05224M1792i4682j32958B62761d468A35808M4271
$$ -119520 -276919 -120992 205224 247016 -94682 -227640 262761 -4468 135808 180079
15658A80079d8403G0015C403i0940B28090J04101B8486a7007E7940i1439l0216
$$ 180079 -48403 70015 3403 -90940 228090 332191 28486 -17007 57940 -91439 -121655
15647a21655J5121g696j90625j44646f4418k51178a53077r6490a7753A33771J55294
$$ -121655 -106534 -7696 -198321 -342967 -64418 -315596 -153077 -249567 -17753 133771 289065
15636B89065F540c30061D4392L7014J04211f6476o901A39406J728b38952c8083
$$ 289065 6540 -330061 44392 81406 185617 -66476 -73377 139406 141134 -238952 -38083
15624b44144P4406M0919B46694j19912C7724c56367B05311a89519C5505e6682
$$ -244144 -169738 -128819 246694 126782 37724 -356367 205311 -189519 35505 -56682
15613b18585h1332a4203A32033a84667L2152C85100j8955a47283A1755J75287
$$ -218585 -81332 -14203 132033 -184667 -152515 385100 366145 -147283 11755 187042
15603A87042c00582g0359B20142A05041J01592G342a26648G9143L0641a0513j24693
$$ 187042 -300582 -70359 220142 105041 206633 7342 -126648 79143 109784 -10513 -135206
15592a35206j31524g3972j18030B61266o1550b48154B00077a11785c2802A40458
$$ -135206 -266730 -73972 -192002 261266 199716 -248154 200077 -111785 -32802 140458
15581B28883b99469J20987R225l719A54644c5630j38010Q0382K3414r6728H4071
$$ 228883 -299469 -178482 -169257 -172976 154644 -35630 -173640 -93258 -69844 -166572 84071
15569a70402B97846e7551A39042b32700a4845k83291h7823o9810D0002a25817
$$ -170402 297846 -57551 139042 -232700 -14845 -298136 -87823 -157633 40002 -125817
15558A93236A785d1524k24306k2114D83a15210i961k81198A18137b7131j62874
$$ 193236 1785 -41524 -265830 -287944 483 -115210 -9961 -291159 118137 -27131 -190005
15547a90005G5842a60500C3393M37107a82995g3886A60066f356o8401A675K1472
$$ -190005 75842 -160500 33393 470500 -182995 -73886 160066 -6356 -74757 1675 23147
15536B3147N9965i9452d2624A21073h9712H6662c53145A02362O3659O7273p1718
$$ 23147 83112 -99452 -42624 121073 -89712 86662 -353145 102362 166021 233294 161576
15525A61576a00863F4086M3916d6205a3804B10874C3542J35346a78491I9615l8637
$$ 161576 -100863 64086 108002 -46205 -13804 210874 33542 168888 -178491 99615 60978
15514F0978J93241d100A14439i8715B84932a38410O0672m7501K9728C798K39699
$$ 60978 254219 -4100 114439 -98715 284932 -138410 -77738 -125239 -95511 3798 243497
15503B43497b60481i549A34127k6383i969I5579N3276m776o5991l2633g0621A14913
$$ 243497 -260481 -9549 134127 107744 -9969 95579 148855 144079 78088 45455 -70621 114913
15490I0631a53794D4906d5009B91799j18875l1536a20125A981J68431n7176k1211
$$ 90631 -153794 44906 -45009 291799 172924 141388 -120125 1981 170412 113236 92025
15479I2025a24799r7920I4713O604c25751a28091j13312C08119a95291A04743
$$ 92025 -124799 -222719 94713 101317 -325751 -128091 -241403 308119 -195291 104743
15468E8303a98829A22098a73133d8528j7758q7354e4616j93276J09682j18899
$$ 58303 -198829 122098 -173133 -48528 -66286 -153640 -54616 -247892 -138210 -257109
15458b57109a23524b607j67095j60105a25355A70019n1269m1066L5626b82391
$$ -257109 -123524 -2607 -169702 -329807 -125355 170019 118750 77684 113310 -282391
15447d18177J16416P3274g3441B25279H7640c97373q862a56577L2041I2965J9105
$$ -418177 -301761 -228487 -73441 225279 87640 -397373 -406235 -156577 -124536 92965 112070
15436A12070b47637k63480A87737a6464j95286f6228b2132C48189d471j77896
$$ 112070 -247637 -511117 187737 -16464 -211750 -66228 -22132 348189 -4471 -182367
15426a82367j6545l8192B83166E6980c71649d5564j59705c1497n941E4694b1317
$$ -182367 -198912 -237104 283166 56980 -371649 -45564 -205269 -31497 -37438 54694 -21317
15414B3560K5726f3396C06859f1696B12034I0394d87531a97956E4110b40722A94731
$$ 23560 49286 -63396 306859 -61696 212034 90394 -487531 -197956 54110 -240722 194731
15402A09553b11796o4768A4941c06000C4817a30121j11360m28A17351a85622B11342
$$ 109553 -211796 -276564 14941 -306000 34817 -130121 -241481 -241909 117351 -185622 211342
15390b80243Q643p2814a39333j25316a02925M637D2418Q5120a13282d8825B94834
$$ -280243 -271600 -344414 -139333 -264649 -102925 -98288 42418 127538 -113282 -48825 294834
15378C737P7936f4706l04236a0550B84405C2313b56764A98175b04190A24621E0352
$$ 3737 81673 -64706 -368942 -10550 284405 32313 -256764 198175 -204190 124621 50352
15366G3800d1186j51758A35210a04720A35061f3066n1037m7326c0001A78441f4019
$$ 73800 -41186 -192944 135210 -104720 135061 -63066 -114103 -161429 -30001 178441 -64019
15354a09456E478b12266B15992a40368I171b08837j27116A19566J8989b0786j5912
$$ -109456 5478 -212266 215992 -140368 9171 -208837 -335953 119566 138555 -20786 -36698
15343c6698k02675B52684a5580l05368g2556G8796J20156a36851B15675d60397
$$ -36698 -239373 252684 -15580 -320948 -72556 78796 198952 -136851 215675 -460397
15332b01367I6243J13541a53052b7586o5720G7660h7978I5366C9931E569K49160
$$ -201367 96243 209784 -153052 -27586 -93306 77660 -87978 95366 39931 5569 254729
15321B54729A16076J8037a66804A78018c75488a49713l0693A21336Q8637l3467
$$ 254729 116076 134113 -166804 178018 -375488 -149713 -180406 121336 209973 176506
15311A76506c79680A36353m7494d5834C7058g9187L8584B81522I0242b28613B67112
$$ 176506 -379680 136353 88859 -45834 37058 -79187 -40603 281522 90242 -228613 267112
15299a47851B4237J8778g2881A74803a09376k3118d1743A34536d4978B94188j33973
$$ -147851 24237 43015 -72881 174803 -109376 -132494 -41743 134536 -44978 294188 160215
15288A60215b1066C56448e9807B27968A9397a70321J8846C2099d7043A91795O7780
$$ 160215 -21066 356448 -59807 227968 19397 -170321 -151475 32099 -47043 191795 259575
15277B59575A25210d5060m2505L0400D3503e6854k54423a19404A38610d7878B57153
$$ 259575 125210 -45060 -87565 -57165 43503 -56854 -311277 -119404 138610 -47878 257153
15265A56370f6113j9296m9008A00368K1664K6228b65751a0355B9433a81786c9136
$$ 156370 -66113 -85409 -134417 100368 122032 148260 -265751 -10355 29433 -181786 -39136
15253a07879J4527B79492o6945c9388E2899N1704K08174b5529C17209A00944R7956
$$ -107879 -93352 279492 212547 -39388 52899 104603 312777 -25529 317209 100944 198900
15242A98900a2230A40323B5674J89528j02539M86750r807J73531K59077j22933
$$ 198900 -12230 140323 25674 215202 112663 599413 589606 763137 1022214 899281
15232H99281L19855n45655k30820n0488O9679A37905L3048C7774J48087e3493
$$ 899281 1219136 673481 442661 392173 461852 137905 170953 37774 185861 -53493
15221A12982B4519G933a2540B00976a08384c7051G5463L22047I1337K11435m2303
$$ 112982 24519 7933 -12540 200976 -108384 -37051 75463 397510 91337 302772 260469
15210B60469a03013A09691R0693O5851G8714M7136a12042F2243a2090A38966N4810
$$ 260469 -103013 109691 200384 266235 78714 125850 -112042 62243 -12090 138966 193776
15199A93776J4923b17021C03179b22548B16722r8499K06621A35667L9698C885
$$ 193776 208699 -217021 303179 -222548 216722 118223 324844 135667 175365 3885
15188A67562B0725M7671N10945a85201H0765a33088A66025n0303a8781m7067A48650
$$ 167562 20725 68396 579341 -185201 80765 -133088 166025 115722 -18781 -65848 148650
15176c6868k10334P9571P1874L656J5626B2406N6323P6435H402a93133D1306a57138
$$ -36868 -247202 -167631 -95757 -92101 -76475 22406 78729 155164 8402 -193133 41306 -157138
15163i5966A84901a39421j9307B45912j01571b65626B03142c21973A42792b1311
$$ -95966 184901 -139421 -158728 245912 144341 -265626 203142 -321973 142792 -21311
15152a89291a4042k20552F4191J08725H4554d7178A99824E6651K19705A5522b14658
$$ -189291 -14042 -234594 64191 172916 84554 -47178 199824 56651 276356 15522 -214658
15140B50460I8786B8487R9929b1330C88316g799p7869A97980F6675M4987M4545
$$ 250460 98786 28487 128416 -21330 388316 -7799 -85668 197980 66675 111662 156207
15129A56207m9013K26438A00892J05867m7909J20648p1571c1377m9563A06563
$$ 156207 107194 333632 100892 206759 158850 279498 207927 -31377 -80940 106563
15118A24898E9401J71505J75611q8206c54146D01593o8009j42295n4345a77234
$$ 124898 59401 230906 406517 318311 -354146 401593 333584 191289 136944 -177234
15107e5000B06629J38025a57718l0206C69432A61493J90915j47886q9949K4091
$$ -55000 206629 344654 -157718 -187924 369432 161493 352408 204522 114573 138664
15097A38664a15287p762B14978a15196b7134B6197J75393I6292K4849F724K52403
$$ 138664 -115287 -123049 214978 -115196 -27134 26197 201590 96292 121141 6724 259127
15086B59127j14873k9393n0918j6116O9085K710d9155A31616c9354B35585J14111
$$ 259127 144254 114861 63943 47827 116912 119622 -49155 131616 -39354 235585 349696
15075C49696J64493a2691D3987N1904L06360A59843C7793J05551e5150J6563J3435
$$ 349696 514189 -12691 43987 95891 402251 159843 37793 143344 -55150 -38587 -25152
15064b5152q5406F2570R3509n7225f2452B33752H7750L50057j88113j19236h1175
$$ -25152 -110558 62570 156079 98854 -62452 233752 87750 437807 249694 130458 -81175
15052A46212n7905b4523j04376C46493i025B87820j17593J43105A21365b42352
$$ 146212 88307 -24523 -128899 346493 -9025 287820 170227 313332 121365 -242352
15041C51783a62732A68121E4728J07755M8022R0890f9811B28889m8292j0801L22342
$$ 351783 -162732 168121 54728 162483 210505 301395 -69811 228889 180597 169796 492138
15030D92138E6372c5337A21160J20807K36359A63411J28118o6392n6146L5839
$$ 492138 56372 -35337 121160 241967 478326 163411 291529 225137 168991 204830
15020B04830L29971a35460B62371b25014B9702e0908A47967l6260a50062C66804
$$ 204830 534801 -135460 262371 -225014 29702 -50908 147967 111707 -150062 366804
15009C67832j22350I9075K95500A17374O2783M4851a78175B17681p7786b0678
$$ 367832 245482 99075 394575 117374 180157 225008 -178175 217681 139895 -20678
14998F7891K55726D2489K51377M5283k9299E7695N2923a63772A75014J3437m1865
$$ 67891 323617 42489 293866 339149 309850 57695 110618 -163772 175014 188451 146586
14987A46586k0859a20536A80872J60992N3651a94990A99617K20608A13093C7219
$$ 146586 125727 -120536 180872 341864 395515 -194990 199617 420225 113093 37219
14976C59183I4422K26271A20967N3621g345A27591a4183A65796M32908q1090A95566
$$ 359183 94422 320693 120967 174588 -7345 127591 -14183 165796 598704 517614 195566
14964B08660b54673D1321J61633c773A81367d0C26557j11107a39629D69754A13877
$$ 208660 -254673 41321 202954 -3773 181367 -40 326557 215450 -139629 469754 113877
14952C8037K9417R7925K1907c3244B61283A17490J8607J52388j08703k6587J38502
$$ 38037 67454 165379 187286 -33244 261283 117490 136097 288485 179782 153195 291697
14941B91697l53j12245b5080A71409M85706B95021Q9693J06041O9668A99368J62096
$$ 291697 291344 179099 -25080 171409 657115 295021 384714 490755 560423 199368 361464
14930C61464j72872k9234J07158B9344J21070K49011Q4548k00524J1348j15290
$$ 361464 188592 159358 266516 29344 150414 399425 483973 283449 294797 179507
14920A79507J44186j08302K70066A82337J92016J7579j07162Q8118J07840a13471
$$ 179507 323693 215391 485457 182337 374353 391932 284770 372888 480728 -113471
14909A03231N7875B3696d4747B28330k873J10451J64869M214m0867j61403G7006
$$ 103231 161106 23696 -44747 228330 225457 335908 500777 504991 464124 302721 77006
14897C81902j72412L59165A85650L34829k54455a01802B40345j5835H2769M36578
$$ 381902 209490 568655 185650 520479 266024 -101802 240345 224510 82769 519347
14887E19347K45872B37977I9768L21499j70644J5481J98086k22434R7986a0622
$$ 519347 765219 237977 99768 421267 250623 266104 464190 241756 339742 -10622
14876A86488K29790K41826B96626L63061A77280R4821r7646J82683q3264J44813
$$ 186488 416278 658104 296626 659687 177280 272101 174455 357138 273874 418687
14866D18687l6763R8376k37864J95965I266K86094N35906A3804L45533J21079
$$ 418687 381924 480300 242436 438401 9266 295360 831266 13804 359337 480416
14856D80416j27470r6008J08014J01160Q1053A49371K96163M5138J60458B11976
$$ 480416 352946 256938 364952 466112 547165 149371 445534 490672 651130 211976
14845B01636J90241r0674j06201K66533j5175j04842M2815A91962L62946j03995
$$ 201636 391877 301203 195002 461535 446360 341518 384333 191962 554908 450913
14835D50913q9110M87402D05150J41460J12366r7001B39496J49948R1613d5033
$$ 450913 361803 849205 405150 546610 658976 561975 239496 389444 481057 -45033
14824D79010n7219J05370A78305L96609k26626K53378j57285j00716Q1577P2895
$$ 479010 421791 527161 178305 574914 348288 601666 444381 343665 425242 498137
14814D98137j2671J16268k36396D8049J33892L75933J97846B75021N59209B93634
$$ 498137 485466 601734 365338 48049 181941 557874 755720 275021 834230 293634
14803F01838N4812C10422l3220J50641K07654j28409R2524j76634B03288N29442
$$ 601838 656650 310422 277202 427843 635497 507088 599612 422978 203288 732730
14793G32730l19919A93956L28500N6082n1775J44209r5846k1134J49870P0594
$$ 732730 412811 193956 522456 578538 526763 670972 575126 553992 703862 774456
14783G74456C44595J03871J97171K41656k23922B91569M6830Q9416n6170R3767
$$ 774456 344595 448466 645637 887293 663371 291569 338399 427815 371645 465412
14773D65412J83129j3999J20473j99547K9047P3341n4298j79644J23567B40258
$$ 465412 648541 634542 755015 555468 584515 657856 603558 423914 547481 240258
14762D49457J05089L21068l00756A89299M79192O0695j5285k39244K29091o3689
$$ 449457 554546 875614 574858 189299 668491 729186 713901 474657 703748 640059
14752F40059J10105l31520L44757L0426J71449m54758R7723M3218q2847j43903
$$ 640059 750164 418644 763401 793827 965276 510518 608241 651459 568612 424709
14742D24709J42261J75692j59229J46155k06044L45311k84827N9167K8600j75678
$$ 424709 566970 742662 583433 729588 523544 868855 584028 643195 671795 496117
14732D96117M85188k92932P2431k20770J83356M7676j92160P9513J69287K03440
$$ 496117 981305 688373 760804 540034 723390 771066 578906 658419 827706 1031146
14722A031146k45909k49230J65927N62035m65170k22830J26127m2397K57141K4501
$$ 1031146 785237 536007 701934 1263969 798799 575969 702096 659699 916840 941341
14712I41341K1058j49686q8781J03842j78771J21018K81206m04760r3849L14450
$$ 941341 962399 812713 723932 827774 649003 770021 1051227 646467 552618 867068
14702H67068k28473j24505L28977J67220K4704k99330N1561o1409m3229K00J48133
$$ 867068 638595 514090 843067 1010287 1034991 735661 787222 725813 682584 682784 830917
14691H30917N7654J28572p0538q3662m0100q8631K12363j27298L60568n3410j32412
$$ 830917 888571 1017143 946605 862943 822843 734212 946575 819277 1179845 1126435 994023
14680I94023M7658r1077l3990J67493n3306l1050k34891K0688j82160J40557J52100
$$ 994023 1041681 950604 916614 1084107 1030801 999751 764860 785548 603388 743945 896045
14669H96045K56863j97482K889j16414Q5210o9127M1428m0521q3911K49250j69440
$$ 896045 1152908 955426 958315 841901 927111 857984 899412 858891 774980 1024230 854790
14658H54790M421N89005m03459L8391j45037Q4797k2027n3725j03005N95128p0001
$$ 854790 859211 1448216 1044757 1083148 938111 1022908 1000881 947156 844151 1439279 1369278
14647A369278k79006n4102p4267L02535l2860l4697M8600k08986K18942m9571
$$ 1369278 1090272 1036170 961903 1264438 1231578 1196881 1245481 1036495 1255437 1205866
14637A205866o0630o9381m9250L56822m6511j96751m3903M05954j97290k5053
$$ 1205866 1145236 1075855 1026605 1383427 1336916 1140165 1096262 1502216 1304926 1279873
14627A279873j93961M06707j44163L1119l18905J89247K61217l49584J99399P2238
$$ 1279873 1085912 1492619 1348456 1379575 1060670 1249917 1511134 1161550 1360949 1433187
14617A433187R0199l85324p8334J60193l7844L46335j11329m87248M36615J5637
$$ 1433187 1523386 1138062 1059728 1219921 1182077 1528412 1417083 929835 1366450 1382087
14607A382087l20411N48861o8760j00583N02593n79575J9467j67821N48415L28603
$$ 1382087 1061676 1610537 1541777 1441194 1943787 1364212 1383679 1215858 1764273 2092876
14597B092876o97319K77051l84825O93550l69876N7731r5815M4855o8558K75702
$$ 2092876 1395557 1672608 1287783 1981333 1611457 1669188 1573373 1618228 1549670 1825372
14587A825372L907k7732N6765k12929P0969Q8573K23318O125m26807J64076n4777
$$ 1825372 1829279 1801547 1858312 1645383 1716352 1804925 2028243 2034368 1607561 1771637 1716860
14576A716860r487M82256k37802n1715N3763N034j62096P7792j59767L03059J24345
$$ 1716860 1707373 2189629 1951827 1900112 1953875 1958909 1796813 1874605 1714838 2017897 2142242
14565B142242k18148J92497K31790n071J39003m35687K30620m38667N88771l26008
$$ 2142242 1924094 2116591 2348381 2343310 2482313 2046626 2277246 1838579 2427350 2101342
14555B101342Q3190J06147R2422K08530K29268j19157P2028j75245M23377M8763
$$ 2101342 2184532 2290679 2383101 2591631 2820899 2701742 2773770 2598525 3021902 3070665
14545C070665r1552J92276N85608j2215K80438O15908l2620O10857P27936J115398
$$ 3070665 2979113 3171389 3756997 3744782 4025220 4641128 4608508 5219365 5947301 7062699
14535G062699J717135K735682M268117O617856R757411j540141j1525793p662613
$$ 7062699 8779834 11515516 15783633 22401489 32158900 30618759 19092966 11430353
14527A1430353m709378j624595j268561l29529m39498k04268J5551k68521J77844
$$ 11430353 6720975 5096380 3827819 3498290 3058792 2854524 2870075 2601554 2779398
14518B779398n88881K44159R1948J41088Q0232L3724k05442p9835R0826j16914
$$ 2779398 2190517 2434676 2526624 2667712 2747944 2781668 2576226 2496391 2587217 2470303
14508B470303o7041J38663K98075o5616j674k6760j74695L45487Q4397k14310
$$ 2470303 2403262 2541925 2840000 2774384 2772710 2745950 2571255 2916742 3001139 2786829
14498B786829K28682n951l1407J71219o393J8654q6166J00459k53115K82775p9655
$$ 2786829 3015511 3009560 2978153 3149372 3142979 3161633 3075467 3175926 2922811 3205586 3125931
14487C125931J21854j34187L39474k02776J53868q4420K63882j62765L45799l13073
$$ 3125931 3247785 3113598 3453072 3250296 3404164 3319744 3583626 3420861 3766660 3453587
14477C453587J86179L2422k23147P3006J55627J70170J52723p2342J60883k04607
$$ 3453587 3639766 3672188 3449041 3522047 3677674 3847844 4000567 3928225 4089108 3884501
14467C884501K14796K27461J79240m26895j60584P31377n09427K80255p5888L32204
$$ 3884501 4099297 4326758 4505998 4079103 3918519 4649896 4140469 4420724 4344836 4677040
14457D677040j09207j67261L77646l9720l30940K34550K26472N1655K44687j08578
$$ 4677040 4567833 4400572 4778218 4738498 4407558 4642108 4868580 4920235 5164922 5056344
14447E056344q63J98176J22941k05474K19120L4790m31628N79321J09246N5049
$$ 5056344 5055481 5253657 5376598 5171124 5390244 5425034 4993406 5572727 5681973 5737022
14437E737022J82617j54017J42768L7320M7284K01095K24411J19298m11581L77010
$$ 5737022 5919639 5765622 5908390 5945710 5992994 6194089 6418500 6537798 6126217 6503227
14427F503227j8164M0435j50718L72036j52301Q19090k62035j72944L67521J36755
$$ 6503227 6485063 6525498 6374780 6746816 6594515 7413605 7151570 6978626 7346147 7482902
14417G482902k1506K36009j05970Q9273j29025M24986K84053k10171K1388Q9841
$$ 7482902 7461396 7697405 7591435 7680708 7551683 7976669 8260722 8050551 8071939 8161780
14407H161780K81283k28400M76513K64141k66634L53022K11006N13988o48396
$$ 8161780 8443063 8214663 8691176 8955317 8688683 9041705 9252711 9766699 9118303
14398I118303N05441M64135j68178j46730N24922j84365K1389O01635L093M39443
$$ 9118303 9623744 10087879 9919701 9772971 10297893 10113528 10134917 10736552 10739645 11179088
14388A1179088m87746P71056K18701j6679L23490J38746J38332N48444m06693
$$ 11179088 10691342 11462398 11681099 11664420 11987910 12126656 12264988 12813432 12406739
14379A2406739L91035M16485K3856N55561K56660j60923N11288K54665M59863
$$ 12406739 12797774 13214259 13238115 13793676 14050336 13889413 14400701 14655366 15115229
14370A5115229L0921M36880j46091N24845K95906L51948K12484L1474M75440L71945
$$ 15115229 15146150 15583030 15436939 15961784 16257690 16609638 16822122 16853596 17329036 17700981
14360A7700981M08074P43581L5870N0514P04203J94203P35815N18729N15372L75175
$$ 17700981 18109055 18852636 18888506 18939020 19643223 19837426 20573241 21091970 21607342 21982517
14350B1982517K36332N98901L81829N82997N91102L93026L97397P78001O15266
$$ 21982517 22218849 22817750 23199579 23782576 24373678 24766704 25164101 25942102 26557368
14341B6557368O37359N62876R45847L13403O10925Q67307R19186P76884O53912
$$ 26557368 27194727 27757603 28703450 29016853 29627778 30495085 31414271 32191155 32845067
14332C2845067R53314Q21660Q55384J155676Q44231J182009Q58352J143667Q66292
$$ 32845067 33798381 34620041 35475425 36631101 37475332 38657341 39515693 40659360 41525652
14323D1525652J614570J436422J122816J340038J443052J659334J511862J663907
$$ 41525652 43140222 44576644 45699460 47039498 48482550 50141884 51653746 53317653
14315E3317653J579405J884219K038835K065203J566939K306583J761079K773412
$$ 53317653 54897058 56781277 58820112 60885315 62452254 64758837 66519916 69293328
14307F9293328K252472K831381K771937K462859L338948K772688L077564L468175
$$ 69293328 71545800 74377181 77149118 79611977 82950925 85723613 88801177 92269352
14299I2269352L976828L391837M477554M216194M223451M967164N182989N282885
$$ 92269352 96246180 99638017 104115571 108331765 112555216 117522380 122705369 127988254
14291A27988254N463742O360855O224310O528914P038478P248612Q103716P992996
$$ 127988254 133451996 139812851 146037161 152566075 159604553 166853165 174956881 182949877
14283A82949877Q527421R544848R753536J0196301J0853018J1518949J1712109
$$ 182949877 191477298 201022146 210775682 220971983 231825001 243343950 255056059
14276B55056059J2560340J2983010J3706774J3361750J4878443J5029115J4222910
$$ 255056059 267616399 280599409 294306183 307667933 322546376 337575491 351798401
14269C51798401J4807933J4097071J3103851J2245627J1163585J0460444R371616
$$ 351798401 366606334 380703405 393807256 406052883 417216468 427676912 437048528
14262D37048528Q486268Q304927P069849N250238K248946Q68148Q35l47050l537629
$$ 437048528 445534796 453839723 460909572 466159810 468408756 469276904 469277739 468930689 465393060
14253D65393060n776648p445735r216144j1491208j2963313j2586346j2849746
$$ 465393060 459616412 452170677 442954533 431463325 418500012 405913666 393063920
14246C93063920j3324505j3669817j3577623j3697929j3387312j2722498j3128517
$$ 393063920 379739415 366069598 352491975 338794046 325406734 312684236 299555719
14239B99555719j3390619j2238460j2164841j2294127j2180158j2091954j1325750
$$ 299555719 286165100 273926640 261761799 249467672 237287514 225195560 213869810
14232B13869810j0689173j0248645r201470q502013q373507p866256p142669o834754
$$ 213869810 203180637 192931992 183730522 175228509 166855002 158988746 151846077 145011323
14224A45011323o379728o162009n421612n273766n168094m998107m614933m007579
$$ 145011323 138631595 132469586 127047974 121774208 116606114 111608007 106993074 102985495
14216A02985495m246458l317121l913615l722790l220334k776494k917312k897421
$$ 102985495 98739037 95421916 91508301 87785511 84565177 81788683 78871371 75973950
14208G5973950k840286k617142k169720k423447k005695j846682k302825j919463
$$ 75973950 73133664 70516522 68346802 65923355 63917660 62070978 59768153 57848690
14200E7848690j693162j314889j697051j869911j582574j250316j610335p71937
$$ 57848690 56155528 54840639 53143588 51273677 49691103 48440787 46830452 46058515
14192D6058515j324034j213544j182010j298860j146575j175923o41710q74339
$$ 46058515 44734481 43520937 42338927 41040067 39893492 38717569 38075859 37201520
14184C7201520j306706o75139p09253r88860j259995p08452o41018p65679q15981
$$ 37201520 35894814 35219675 34510422 33521562 32261567 31553115 30912097 30146418 29330437
14175B9330437n67657r90430l35271m65933p63787o17404o57215l86569l73057
$$ 29330437 28762780 27772350 27437079 26971146 26207359 25589955 24932740 24546171 24173114
14166B4173114r49183n53366m37870k22073m26625m79294l49298m27205l77915
$$ 24173114 23223931 22670565 22232695 22010622 21583997 21104703 20755405 20328200 19950285
14157A9950285l49813m35752n14377k88294j92647n86677l19923n9926k14930
$$ 19950285 19600472 19164720 18650343 18362049 18169402 17582725 17262802 17202876 16987946
14148A6987946m53303l09764k16830k75850k78130m59655L9993k66868m79123
$$ 16987946 16534643 16224879 16008049 15732199 15454069 14994414 15034407 14767539 14288416
14139A4288416r7090n30973k17535k3384k04372n37016J94598k32561J40663m85301
$$ 14288416 14191326 13660353 13442818 13419434 13215062 12678046 12872644 12640083 12780746 12295445
14129A2295445k48887k80794O159k24424j16840j79177k03577j59162k65196Q9199
$$ 12295445 12046558 11765764 11771923 11547499 11430659 11251482 11047905 10888743 10623547 10712746
14119A0712746l25118K6872l77998j97935N9147k68620O3519k14987q9513m88578
$$ 10712746 10387628 10414500 10036502 9838567 9897714 9629094 9692613 9477626 9388113 8899535
14109H899535K61510l36474j04895J35251k67381J32507m51346M4741j94439N7760
$$ 8899535 9161045 8824571 8719676 8854927 8587546 8720053 8268707 8313448 8119009 8176769
14099H176769k88682j80914J2873m01121M14145l46478M5862p2662J736N5399
$$ 8176769 7888087 7707173 7720046 7318925 7733070 7386592 7432454 7359792 7361528 7416927
14089G416927o95618P58274q19191j50755J26466J4278l02545m527m099K82913
$$ 7416927 6721309 7479583 6660392 6509637 6636103 6650381 6347836 6343309 6339210 6622123
14079F622123n79872L71329k59144l62379K29182l56756J83621j96353K10133
$$ 6622123 6042251 6413580 6154436 5792057 6021239 5664483 5848104 5651751 5861884
14070E861884l82092J03612l20234L28859l82741J143J05059l8972j54704j5441
$$ 5861884 5479792 5583404 5263170 5592029 5209288 5210431 5315490 5276518 5121814 5106373
14060E106373K90372l96972J59610l40383M9773k33822J57653m0570k9343k56341
$$ 5106373 5396745 4999773 5159383 4819000 4868773 4634951 4792604 4752034 4722691 4466350
14050D466350L6308J26616N7353r042k20618j63085M30495j32591o3978j19083
$$ 4466350 4502658 4629274 4686627 4677585 4456967 4293882 4724377 4591786 4527808 4408725
14040D408725l06691J34839k07054K13623l47550k1847K1512j50528K31026Q657
$$ 4408725 4102034 4236873 4029819 4243442 3895892 3874045 3895557 3745029 3976055 3984712
14030C984712m08186J56167K85837k07083M3848j35860n23829L75893o9363K52149
$$ 3984712 3576526 3732693 4018530 3811447 3855295 3719435 3195606 3571499 3502136 3754285
14020C754285l91484K46389R5969j91788k085j75003R2210L8463j29857M0493
$$ 3754285 3362801 3609190 3705159 3513371 3511286 3336283 3428493 3466956 3337099 3377592
14010C377592k77952R2957K48694k30127k94605J7203j37825L02225l0918l65299
$$ 3377592 3099640 3192597 3441291 3211164 2916559 2933762 2795937 3098162 3067244 2701945
14000B701945J60599j49996K34573M8913q3009J93982l56465m2656l28471Q4981
$$ 2701945 2862544 2712548 2947121 2996034 2913025 3107007 2750542 2707886 2379415 2464396
13990B464396J81171m00435L18298j03787J94544O5892k50208R1515K36165Q093
$$ 2464396 2645567 2245132 2563430 2459643 2654187 2720079 2469871 2561386 2797551 2805644
13980B805644K28858L21544K65751M14942P55656R87554J613454L747866O331057
$$ 2805644 3034502 3356046 3621797 4036739 4792395 5779949 7393403 11141269 17472326
13971A7472326R623023L582142q937417p384163m234190k478509j225646j039077
$$ 17472326 27095349 30677491 21740074 14355911 10121721 7643212 6417566 5378489
13963E378489o23788n34719j19956m17338p9675l37518j21398j16234Q9235p2057
$$ 5378489 4754701 4219982 4100026 3682688 3603013 3265495 3144097 3027863 3117098 3045041
13953C045041k22795r9655j3003Q8244k25155K20483k70367k28485J10592k0088
$$ 3045041 2822246 2722591 2709588 2797832 2572677 2793160 2522793 2294308 2404900 2384812
13943B384812j03558j24326L84495k19762r7856L96887n10592p844k02947L20000
$$ 2384812 2281254 2156928 2541423 2321661 2223805 2620692 2110100 2102256 1899309 2219309
13933B219309k07516L87465k88617J80216j25662o390j02977k03741L33831j22467
$$ 2219309 2011793 2399258 2110641 2290857 2165195 2158805 2055828 1852087 2185918 2063451
13923B063451k0330j92326O6854p5515L3894j80876P1124J5067K3181k1767K95124
$$ 2063451 2043121 1850795 1917649 1842134 1876028 1695152 1766276 1781343 1804524 1782757 2077881
13912B077881j28397k00037j7207m5192K38148k04024j74095r7942L77398K94601
$$ 2077881 1949484 1749447 1732240 1687048 1925196 1721172 1547077 1449135 1826533 2121134
13902B121134n86174J57193r1465O2989P1676m2190J57189l7054j01921j83930
$$ 2121134 1534960 1692153 1600688 1663677 1735353 1693163 1850352 1813298 1711377 1527447
13892A527447n2063L17010p6234q3231j0589m9634l5245J5792o9388K40341j50041
$$ 1527447 1475384 1792394 1716160 1632929 1622340 1572706 1537461 1553253 1483865 1724206 1574165
13881A574165m72204N89584p3528Q5002j95576J23288j89351J95138r5818j79882
$$ 1574165 1101961 1691545 1618017 1703019 1507443 1630731 1441380 1636518 1540700 1360818
13871A360818J22361k74936K64321l18539P04282p34616J64412J02794O9462R902
$$ 1360818 1483179 1208243 1472564 1154025 1858307 1123691 1288103 1390897 1460359 1470261
13861A470261l33011K76406J51717k84915o4525N3519n6883J15133j05992J37205
$$ 1470261 1137250 1413656 1565373 1280458 1215933 1269452 1212569 1327702 1221710 1358915
13851A358915n2330p8786j08691J78522K18868N0117o46978L39993Q6518l28464
$$ 1358915 1306585 1227799 1119108 1297630 1516498 1566615 919637 1259630 1346148 1017684
13841A017684K99793j70977Q0418j10932J83434j42199k39744M42350j11060l17697
$$ 1017684 1317477 1146500 1226918 1115986 1299420 1157221 917477 1359827 1248767 931070
13831I31070L94220j56230P7105J16038l72047J94502O2429j70094P2178J15929
$$ 931070 1325290 1169060 1246165 1362203 990156 1184658 1247087 1076993 1149171 1265100
13821A265100j42548L7247j07378J0134Q7913q1605p3385L21148k75993j37147
$$ 1265100 1122552 1159799 1052421 1062555 1150468 1068863 995478 1316626 1040633 903486
13811I03486K77536l72311j31086L37237k91718L70207k84985j0412L36069R905
$$ 903486 1181022 808711 677625 1014862 723144 1093351 808366 797954 1134023 1143928
13801A143928l04415K48591j53511k30546J04051K87708J60505l20332K80296
$$ 1143928 839513 1088104 934593 704047 808098 1095806 1256311 935979 1216275
13792A216275k01062l0972L41067l33661M74555n46739p4777o4932L74730l68036
$$ 1216275 1015213 984241 1325308 991647 1466202 919463 844686 779754 1154484 786448
13782G86448P2643j71028j85616P63609l94055N7957l03077L97749l08114K10382
$$ 786448 859091 688063 502447 1266056 872001 929958 626881 1024630 716516 926898
13772I26898j76386M30048l76532p1204Q5457j71138N1718R3934J84361l52781
$$ 926898 750512 1180560 804028 732824 818281 647143 698861 792795 977156 624375
13762F24375r8707J59091K27648j01264Q9238k05915m7215J02443M8126j387N038
$$ 624375 525668 684759 912407 811143 900381 694466 647251 749694 797820 796433 801471
13751H01471L857J91785P7769m17547B82186L37087J08480j66961J40398L2734
$$ 801471 805328 997113 1074882 657335 282186 619273 727753 560792 701190 733924
13741G33924n5395M3395L9907K65573K7780k51697K26608l5893m37625r9751O92078
$$ 733924 678529 721924 761831 1027404 1055184 803487 1030095 994202 556577 456826 1148904
13730A148904m16363P9819m4566j24571K497R6609n1498q5314P8934K1761K2912
$$ 1148904 732541 812360 767794 643223 645720 742329 690831 605517 684451 706212 729124
13719G29124N9591K8929K0521j01023K5515l0176j51275J39726k33272K10975
$$ 729124 788715 817644 838165 737142 762657 732481 581206 720932 487660 698635
13709F98635k72031K24917J96831K1460D34680K30574L41644k56447k39269J79871
$$ 698635 426604 651521 848352 869812 434680 665254 1006898 750451 511182 691053
13699F91053j64512K00629k20710K74796j59099k86935K01726J37323N7786l46563
$$ 691053 526541 727170 506460 781256 622157 335222 536948 674271 732057 385494
13689C85494L91497J20806k89575m964J05491P1807O375K3410p8812k83403l0840
$$ 385494 776991 897797 608222 603258 708749 780556 786931 810341 731529 448126 417286
13678D17286R7709K64118j73484K41624l46309J71121o6986J32891p9693J35071
$$ 417286 514995 779113 605629 847253 500944 672065 605079 737970 658277 793348
13668G93348n4666A69553q0465Q35172l72271J13599N3723J28317m05367K33260
$$ 793348 738682 169553 89088 924260 551989 665588 719311 847628 442261 675521
13658F75521l14159L48828J02930k19756k03753R132J79940Q3029k34400L40669
$$ 675521 361362 710190 813120 593364 389611 398743 578683 661712 427312 767981
13648G67981C21923N36738j55759p5929K88598D38042P2743j05085j51764M31164
$$ 767981 321923 858661 702902 626973 915571 438042 510785 405700 253936 685100
13638F85100j85099l0087Q7526j7944p5299p8838O2248K0054j69851J25689J21957
$$ 685100 500001 469914 557440 539496 464197 385359 447607 467661 297810 423499 545456
13627E45456j46943K35216j12778j65082J53007J34128C13119K67575B47944P8377
$$ 545456 398513 633729 520951 355869 508876 643004 313119 580694 247944 326321
13617C26321j35225K95710j92725N18813k66336k00315K51926J34603j38870n8001
$$ 326321 191096 486806 294081 812894 546558 346243 598169 732772 593902 535901
13607E35901k34689j2456P3615J95336l4385j92248K38815O980J37403j36263
$$ 535901 301212 288756 362371 557707 523322 331074 569889 576869 714272 578009
13597E78009k65988L31372p2082P8782C05807J12796K83016j90959k28732o8873
$$ 578009 312021 643393 571311 650093 305807 418603 701619 510660 281928 213055
13587B13055q3829L75131p3748L10332B65107N7674A39791L00609k6987j2571
$$ 213055 129226 504357 430609 740941 265107 322781 139791 440400 413413 400842
13577D00842J44371J22635p9133k36025K42724j74595j88679K11048k07780J33716
$$ 400842 545213 667848 588715 352690 595414 420819 232140 443188 235408 369124
13567C69124r3772A13201j4604A6210N91246o9682k06070K37473L856A30923L05028
$$ 369124 275352 113201 98597 16210 607456 537774 331704 569177 573033 130923 435951
13556D35951G1928M63324A23876Q05305B60402K83364j64953L3276J14171l9471
$$ 435951 71928 535252 123876 929181 260402 543766 378813 412089 526260 486789
13546D86789j92037l3581J2586j2492M26659C21555n4815A06603O0228K40477
$$ 486789 294752 261171 273757 261265 687924 321555 266740 106603 166831 407308
13536D07308p1007M9313n8693M4964J5630J65336B06662Q6850N4665A36301M5547
$$ 407308 336301 385614 326921 371885 387515 552851 206662 293512 348177 136301 181848
13525A81848F9263L42269P3910J35107B09569L06151p5856J02905j48784r2948
$$ 181848 69263 411532 485442 620549 209569 515720 439864 542769 393985 301037
13515C01037k3149J27440n9740j20001K28140m6296J03602K48643A45534K05326
$$ 301037 277888 405328 345588 225587 453727 407431 511033 759676 145534 350860
13505C50860n4423m8523K09201k07533N6618J13445j57437k3593J98318K32458
$$ 350860 296437 247914 457115 249582 306200 419645 262208 238615 436933 669391
13495F69391B54992L9938n7504l3295P5477R1863I9763J40356J25187N9411B01240
$$ 669391 254992 294930 237426 204131 279608 371471 99763 240119 365306 424717 201240
13483a15981D70737r6443A23709K87743K22251A69216L46811A46510F2308J53737
$$ -115981 470737 374294 123709 411452 633703 169216 516027 146510 62308 216045
13473B16045J02281J53019j35324A5575N93455B1277N73239J39487k15311k07709
$$ 216045 318326 471345 336021 15575 609030 21277 594516 734003 518692 310983
13463C10983F1220p049K01337n1277a01747E59730k06040j002e9211D73036N8670
$$ 310983 61220 54171 255508 204231 -101747 559730 353690 352688 -59211 473036 531706
13452E31706k02470n3640q2609O22043A86270L23227m6491R0453B47651P3385
$$ 531706 329236 275596 192987 815030 186270 509497 463006 553459 247651 321036
13442C21036A47359F9561J98496q3860J68359L3893A54417J25454L0978J51771
$$ 321036 147359 69561 268057 184197 352556 386449 154417 279871 310849 462620
13432D62620B15380K09971N6057A82228O0743R5900n9312j24771n5290M63823
$$ 462620 215380 425351 481408 182228 242971 338871 279559 154788 99498 563321
13422E63321D986K53744L53554k71437A64339k0809K72781l0031A16662j7594
$$ 563321 4986 258730 612284 340847 164339 143530 416311 386280 116662 99068
13412I9068P12590B63598A17377J00172m2964J56935p7465J19822G2165K10030
$$ 99068 811658 263598 117377 217549 174585 331520 254055 373877 72165 282195
13402B82195j29260J38398q0265l9378K27232F13K69840J00238A34861P4653K37197
$$ 282195 152935 291333 211068 171690 398922 613 270453 370691 134861 209514 446711
13391D46711q4604G6683N06198k74527p2639P266Q8211a57604A35582J05161o4105
$$ 446711 362107 76683 582881 308354 235715 242981 331192 -157604 135582 240743 176638
13380A76638N9725m4313K26859D039M8716K22762h2333C18675E9134J38919d1703
$$ 176638 236363 192050 418909 4039 52755 275517 -82333 318675 59134 198053 -41703
13368C17026j11551N6714E1530K12954Q6596q5552a95108D75060n696p7571A83463
$$ 317026 205475 262189 51530 264484 351080 265528 -195108 475060 469364 391793 183463
13356B04966m4105o8028L04474j03047L87424B32264r7980K37471j4781H4415
$$ 204966 160861 92833 397307 294260 681684 232264 134284 371755 356974 84415
13345C61120D6567h8703C35217K33108B72332j30683M28339I3034J06464J13575
$$ 361120 46567 -88703 335217 568325 272332 141649 569988 93034 199498 313073
13335C13073p4729J86825A6196L07360K51694j91016P7695P8465k58748J95740
$$ 313073 238344 425169 16196 323556 575250 384234 461929 540394 281646 477386
13325D77386A78915M31415E8250L61664D6319J10387L3361a51936B57427J82524
$$ 477386 178915 610330 58250 419914 46319 156706 190067 -151936 257427 439951
13315D39951j98557c0769B39664R6193n6779J64163j34589J71811h7859D17690
$$ 439951 241394 -30769 239664 335857 279078 443241 308652 480463 -87859 417690
13304B90815R9543q9461l0581O4767n908H1993K85640q7721j36934l0652L39329
$$ 290815 390358 300897 270316 335083 329175 81993 367633 279912 142978 112326 451655
13293D51655J1239K69830A14433D8356L84343A45963E8840J66832J91193j46532
$$ 451655 462894 732724 114433 48356 432699 145963 58840 225672 416865 270333
13283B70333o3380b23432B60218R1165A26599Q9719a8422C09862R8285k01431
$$ 270333 206953 -223432 260218 351383 126599 216318 -18422 309862 408147 206716
13273B06716H7867R8900J43814H0530J20902J83239j23574I2103J5088J18264
$$ 206716 87867 186767 330581 80530 201432 384671 261097 92103 107191 225455
13263B25455k0697D9718J1556K69169j62379a48113K7596E8653L31990k4278j52095
$$ 225455 204758 49718 61274 330443 168064 -148113 -120517 58653 390643 366365 214270
13252B14270H9898B9761K16523J96120K6833A47174c4965l3138A33439n2146b75908
$$ 214270 89898 29761 246284 442404 469237 147174 -34965 -68103 133439 81293 -275908
13240D0535e1989f869A31524k1998A8508J9163M2978K02393k9787J52098A80592
$$ 40535 -51989 -6869 131524 109526 18508 37671 80649 283042 253255 405353 180592
13228C31898n1368j8529F0248J7046J65244m0517p1422D2073L08562q4979j22134
$$ 331898 280530 262001 60248 77294 242538 202021 130599 42073 350635 265656 143522
13217A43522M3378q6325l1197R2699b19848A02555f6242L2110H5222R7447G5198
$$ 143522 186900 100575 69378 162077 -219848 102555 -66242 -34132 85222 182669 75198
13205b5969B00554q1035m1738K67370J67188k42042J40560a3589A81469J50629
$$ -25969 200554 119519 77781 345151 512339 270297 410857 -13589 181469 332098
13195C32098I4257K96687b14A89337m1526l9875K03482j126F96Q93K41447n1512
$$ 332098 94257 390944 -214 189337 147811 107936 311418 310292 696 1589 243036 191524
13183A91524k3720a17723B79770A31610a6320A23902j7776K55K42891C4260J29693
$$ 191524 167804 -117723 279770 131610 -16320 123902 106126 106381 349272 34260 163953
13172A63953K08800A42230f3837q1204g2324A54091J65630j32550q9501K86953
$$ 163953 372753 142230 -63837 -145041 -72324 154091 319721 187171 97670 384623
13162C84623A85664J88041a18547A88364J61714f0698B71382a19476C8369J55929
$$ 384623 185664 373705 -118547 188364 350078 -60698 271382 -119476 38369 194298
13152A94298C3297K05059b67936D9370a58063a1315A93815a75350B6832a6220
$$ 194298 33297 238356 -267936 49370 -158063 -11315 193815 -175350 26832 -16220
13141C75158A03913K04512J84324j65786I6484J32186A10029k1359J47228n3815
$$ 375158 103913 308425 492749 326963 96484 228670 110029 88670 235898 182083
13131A82083a46878I8311J69129r3076f1638A8591M4842f2334J1581A65662J32885
$$ 182083 -146878 98311 267440 174364 -61638 18591 63433 -62334 -50753 165662 298547
13120B98547a78944D6155a13039D0277K77355I6745J0348C3335J07566a31133
$$ 298547 -178944 46155 -113039 40277 317632 96745 107093 33335 140901 -131133
13109F4263O8340a99879N5091L1169E00663A61910K247G172M722L02354f544j8619
$$ 64263 132603 -199879 -144788 -113619 500663 161910 164157 7172 11894 314248 -6544 -25163
13097b5163j24936H8692N8803l8577L3452c02885A54303p1534K7846K93691j61449
$$ -25163 -150099 88692 147495 108918 142370 -302885 154303 82769 110615 404306 242857
13086B42857r2723K24383A64997b32519A11366Q0488k5073m0286J69659e5247
$$ 242857 150134 374517 164997 -232519 111366 191854 166781 126495 296154 -55247
13075f3496A44028F8908A3197M4577a79776A14722j3104K62832b2420B40175f8800
$$ -63496 144028 68908 13197 57774 -179776 114722 101618 364450 -22420 240175 -68800
13063A25465a3197B95178k8342A5775K86859d8278B68035A22070b60447E4543
$$ 125465 -13197 295178 266836 15775 302634 -48278 268035 122070 -260447 54543
13052a76031A15657K57333l4348A44406L1858Q9629g2593q0288C96532r8215D8836
$$ -176031 115657 372990 338642 144406 176264 265893 -72593 -152881 396532 298317 48836
13040D4099N4976l6542J6114K29006h5109I1484R2132J36785q710E7111b94521
$$ 44099 99075 62533 78647 307653 -85109 91484 183616 320401 311691 57111 -294521
13028A48436a74448H6463K39284g339o5808I2192L79230k08134j0283p0518l1065
$$ 148436 -174448 86463 325747 -7339 -73147 92192 471422 263288 253005 182487 151422
13017A51422L193G0313L19927I0161J17508R9167c3771A5355L90191a12676A57363
$$ 151422 154615 70313 390240 90161 207669 306836 -33771 15355 405546 -112676 157363
13005d3882B39249G3037J60991N3945R8562K4261H3727J86889Q1175R060A57197
$$ -43882 239249 73037 234028 287973 386535 410796 83727 270616 351791 360851 157197
12993a9492B16147a30642I403K06372N9250p4725F3688b82263a07704b6382N346
$$ -19492 216147 -130642 9403 215775 275025 200300 63688 -282263 -107704 -26382 -21036
12982b1036k8590A94190B3117N7301b170A92422G359e2560m1693k4278j64585
$$ -21036 -49626 194190 23117 80418 -2170 192422 7359 -52560 -94253 -118531 -283116
12971b83116D29603H3954l0768J24519F765J52894d079j100r5718B28798B4518
$$ -283116 429603 83954 53186 177705 6765 159659 -4079 -5179 -100897 228798 24518
12959f1556A3202L9080K15340E0605L60645A01502K06080a79440b6407C18031
$$ -61556 13202 52282 267622 50605 411250 101502 307582 -179440 -26407 318031
12948B09738p6188J72933a06364A44109b35010a0540A07781m07A3256h6582H6402
$$ 209738 133550 306483 -106364 144109 -235010 -10540 107781 107374 13256 -86582 86402
12936B61223e7931j34099A03055J74713a05111A81355M8079a0833H8960A8551
$$ 261223 -57931 -192030 103055 277768 -105111 181355 229434 -10833 88960 18551
12925I07h2294K5337C62670r7010a89306E050b42312b618C17490C5638a53242
$$ 907 -82294 -56957 362670 265660 -189306 5050 -242312 -2618 317490 35638 -153242
12913H9854D3513J48163a01963c8238o417C91750c5975B72741E6060a9188A74523
$$ 89854 43513 191676 -101963 -38238 -44655 391750 -35975 272741 56060 -19188 174523
12901H7798L30450a59884A44296O3378P0550b61571E05041A49284N6592i3778
$$ 87798 418248 -159884 144296 207674 278224 -261571 505041 149284 205876 -93778
12890B09057G9628b2592F1977a97403L2032A78772k9497j9765m4017L5042J73063
$$ 209057 79628 -22592 61977 -197403 -165371 178772 149275 129510 85493 120535 293598
12879B93598A30235M2424O4483d14970C84936G5643b18189A80502q6178N4926
$$ 293598 130235 172659 237142 -414970 384936 75643 -218189 180502 94324 149250
12869A49250F7710J0597O6132q23h2535I0931J15525f1792B58300H1460P3345
$$ 149250 67710 78307 144439 143616 -82535 90931 206456 -61792 258300 81460 154805
12858A54805l64n1792e3742B2607J5341R0738E4043a46817A29273F2086c61721
$$ 154805 154441 102649 -53742 22607 37948 128686 54043 -146817 129273 62086 -361721
12846A35597d12025A43833k8540b978B4459J11232J39657a16454c7242j00070
$$ 135597 -412025 143833 115293 -2978 24459 135691 275348 -116454 -37242 -137312
12836a37312f3663k4477F8188O1788n5731J13385a34069H5946J38141n7582K19547
$$ -137312 -63663 -88140 68188 129976 74245 187630 -134069 85946 224087 166505 386052
12825C86052k7655A09320l4111R3333L3566A4090Q8489L11261a09877D5483O4109
$$ 386052 358397 109320 75209 168542 202108 14090 102579 413840 -109877 45483 109592
12814A09592B7487d7373B85254I581a02356b698A57063K1998H7304a67227Q2711
$$ 109592 27487 -47373 285254 9581 -102356 -2698 157063 179061 87304 -167227 -84516
12803h4516m5023A77056a15119B78285G2407K5495b90331B57518l5856e8284j73820
$$ -84516 -129539 177056 -115119 278285 72407 97902 -290331 257518 221662 -58284 -232104
12792b32104g90o1558B85512C1241L3762R6756j7784b09707i6416A59336f4852
$$ -232104 -790 -62348 285512 31241 65003 161759 143975 -209707 -96416 159336 -64852
12780C45060G5584k0668K34199a85048B19708K7639j6374a7274C58611a46125
$$ 345060 75584 54916 289115 -185048 219708 247347 230973 -17274 358611 -146125
12769C33650a74626g502A13884b77605f0586j44216i6984k34781a21061I3858
$$ 333650 -174626 -7502 113884 -277605 -60586 -204802 -96984 -331765 -121061 93858
12758a14803E947J34322F5700J80864B6358J10608J26581h5310B14253i3359H2573
$$ -114803 5947 140269 65700 246564 26358 136966 263547 -85310 214253 -93359 82573
12746b14427H3336R8728A0144L63244b5990C21316A448N5708P3227J77504b01880
$$ -214427 83336 182064 10144 373388 -25990 321316 1448 57156 130383 307887 -201880
12734C36874A61752o1824J37044a80354a261D33362G4324l7131g8916A61819a59342
$$ 336874 161752 99928 236972 -180354 -1261 433362 74324 37193 -78916 161819 -159342
12722e9819A51725M653p7188J20781m2402b02264f2820j91794e2831A23484a47534
$$ -59819 151725 156378 79190 199971 157569 -202264 -62820 -254614 -52831 123484 -147534
12710B91058a55797J3676B097J36468F9059L00938i3810D26572j71783h4674d1995
$$ 291058 -155797 -142121 2097 138565 69059 369997 -93810 426572 254789 -84674 -41995
12698B74280D6021g8194k09004G4869k3983j3015Q7989K83574o1283A71157K58600
$$ 274280 46021 -78194 -287198 74869 50886 37871 125860 409434 348151 171157 429757
12687D29757G9450K41275J66613B15042L45868j91172A37298N4760H8169a71937
$$ 429757 79450 320725 487338 215042 560910 369738 137298 192058 88169 -171937
12676B44015f24H4458b7548A23370J22405a08659d7717B02196a41505O1099K6257
$$ 244015 -624 84458 -27548 123370 245775 -108659 -47717 202196 -141505 -80406 -54149
12665e4149k679o6093j04762O9307C59696A78913q6944M54766r8665j62042J00940
$$ -54149 -56828 -122921 -227683 -158376 359696 178913 91969 546735 448070 286028 386968
12654C86968j73245a6947D50309c2684H4731c9543n88j53623J6725I8271K51281
$$ 386968 213723 -16947 450309 -32684 84731 -39543 -40131 -193754 -177029 98271 349552
12643C49552a10320j97122B2013J11347J66012m9343B8927P0592K11027j32512
$$ 349552 -110320 -307442 22013 133360 299372 250029 28927 99519 310546 178034
12633A78034C175b08894C72700F4383d54890A24246L1333C7751a18777M5637A57950
$$ 178034 3175 -208894 372700 64383 -454890 124246 155579 37751 -118777 -73140 157950
12621D0984a76902L5069D9204a07636A19080L8221R7371M7018J29803E1103M80249
$$ 40984 -176902 -141833 49204 -107636 119080 157301 254672 301690 431493 51103 531352
12610E31352A01929K27158J1027j65576J48710j51803c65858B9065L91762r6536
$$ 531352 101929 329087 340114 174538 323248 171445 -365858 29065 420827 324291
12600C24291j5292J20617A26771P1899J78627A22409J72959a9283A56632a40027
$$ 324291 308999 429616 126771 198670 377297 122409 295368 -19283 156632 -140027
12589a13818L383H6681b29405A62554A7414K58344m2769B5170J32904e7822C01927
$$ -113818 -110435 86681 -229405 162554 17414 275758 232989 25170 158074 -57822 301927
12577A07100J07554K74877k43489B0490h9581a7283E6766Q9369C3150b36067B46209
$$ 107100 214654 489531 246042 20490 -89581 -17283 56766 146135 33150 -236067 246209
12565A26059J4692K03284H1863l375J57844l7591p9943D1167G977L38286j1313
$$ 126059 140751 344035 81863 78488 236332 198741 118798 41167 7977 346263 334950
12554C34950A25906K03603j47953P7396a07941A81312b658A91793b08517G7471
$$ 334950 125906 329509 181556 258952 -107941 181312 -2658 191793 -208517 77471
12543A69018b11258g5801D53652E2384N5925j9589b58818A27064b129k69796d0517
$$ 169018 -211258 -75801 453652 52384 108309 88720 -258818 127064 -2129 -271925 -40517
12531A5330a2159j4312R311k7333j41593a1379A43168a6233B00238a30931H2792
$$ 15330 -12159 -26471 -17160 -44493 -186086 -11379 143168 -16233 200238 -130931 82792
12519b8653A31365a42350A98361R0932n3379j10676j7217G49Q5415d6555G2531
$$ -28653 131365 -142350 198361 289293 235914 125238 108021 749 86164 -46555 72531
12507C96235A41679N6512F1047K1488c95270b9032O473k26522J07093O2966L2017
$$ 396235 141679 198191 61047 82535 -395270 -29032 -22559 -249081 -141988 -79022 -47005
12496d7005n1038j501C04085A22189K33295a7607m6820C761M01214b19366A57436
$$ -47005 -98043 -99544 304085 122189 355484 -17607 -64427 3761 404975 -219366 157436
12484f2849C00804j22193j1460B6729i9877B39474g0509B8975b9758C10009a2883
$$ -62849 300804 178611 167151 26729 -99877 239474 -70509 28975 -29758 310009 -12883
12472C4229K08463J0126C8506b32436A78914b70937B3793K91487j1942b72667
$$ 34229 242692 252818 38506 -232436 178914 -270937 23793 315280 303338 -272667
12461a09495B5614J45920J80k697k3485E5420K7363J63071A01663i4669B17111
$$ -109495 25614 171534 171714 169017 145532 55420 82783 245854 101663 -94669 217111
12449c5431B30090a43513A36406K8482J9423b49205A97121a55424H7418a40795
$$ -35431 230090 -143513 136406 164888 184311 -249205 197121 -155424 87418 -140795
12438a0989G1123K62560H5209J1907b1238B3421a97528B38991H5167k3022a94152
$$ -10989 71123 333683 85209 97116 -21238 23421 -197528 238991 85167 62145 -194152
12426a76711I9882J54558I0942J69444P9767a2017B82069a17258d4110k08744
$$ -176711 99882 254440 90942 260386 340153 -12017 282069 -117258 -44110 -252854
12416b52854M4397j40603l8886A83029b42371C38149b7070j30889H6272l7469
$$ -252854 -208457 -349060 -387946 183029 -242371 338149 -27070 -157959 86272 48803
12406D8803a9822A03237c60840F3182c37680c6530A8528f3596B93962A10961a2712
$$ 48803 -19822 103237 -360840 63182 -337680 -36530 18528 -63596 293962 110961 -12712
12394B6257J77487b64707H848c0939A05759C5173b981B97120a08501j71094J38377
$$ 26257 203744 -264707 8848 -30939 105759 35173 -2981 297120 -108501 -279595 -141218
12383a41218B46114i4421o4811F8971j426J19067b17641e3154A51608n1508k4894
$$ -141218 246114 -94421 -159232 68971 67545 186612 -217641 -53154 151608 100100 75206
12372G5206a45740E4166J6716d853A58471A5576e2463j39257B71222b13242M2556
$$ 75206 -145740 54166 70882 -4853 158471 15576 -52463 -191720 271222 -213242 -170686
12361a70686A47413C6439J53820j5807a08848j2555A84453f1975p2265j03640
$$ -170686 147413 36439 190259 174452 -108848 -121403 184453 -61975 -134240 -237880
12351b37880J10067A33060J00113n5658d5755A49603n2843f5269B11258B2413
$$ -237880 -127813 133060 233173 177515 -45755 149603 96760 -65269 211258 22413
12340A41623c9984b056A86250K00746j55658l0467a15489D8740r270b2733A09906
$$ 141623 -39984 -2056 186250 386996 231338 200871 -115489 48740 39470 -22733 109906
12328d2597m7765A08674j1249a07211E8570b81556A32887F4952J30538a88793
$$ -42597 -90362 108674 97425 -107211 58570 -281556 132887 64952 195490 -188793
12317C68523A18754J56462a6158j72300Q9450B04664a48825b9164F9296C2826
$$ 368523 118754 275216 -16158 -188458 -99008 204664 -148825 -29164 69296 32826
12306B47590c06248a9212H875a29973B0367d03965h4732j02494A11616a43134
$$ 247590 -306248 -19212 8875 -129973 20367 -403965 -84732 -187226 111616 -143134
12295e0324F0192J09998c56257e1630A89306E373c4617q2455G7741J76877b54722
$$ -50324 60192 170190 -356257 -51630 189306 5373 -34617 -117072 77741 254618 -254722
12283A34084B7298b07829B70227b46775C05980A10823i5544A34985a73692A7138
$$ 134084 27298 -207829 270227 -246775 305980 110823 -95544 134985 -173692 17138
12272A08804E3511h2546A20285K26534D1850M3922M8181a08556B38791A6682a85279
$$ 108804 53511 -82546 120285 346819 41850 85772 133953 -108556 238791 16682 -185279
12260A61218n2848J52618c04466B22240K3813b16288D78050A4222K04380e0149
$$ 161218 108370 260988 -304466 222240 246053 -216288 478050 14222 218602 -50149
12249I6869A0729A440M81931k41330i7601L3865E5956J93753a16170C96435b3101
$$ 96869 10729 1440 483371 242041 -97601 -63736 55956 249709 -116170 396435 -23101
12237c8246C4319J14552a82714D29136A69696R2111j04601G2047L0532J32449
$$ -38246 34319 148871 -182714 429136 169696 261807 157206 72047 102579 235028
12227B35028a99560C12759a8118B52385K69278B42048h6768B97657n2162d4685
$$ 235028 -199560 312759 -18118 252385 521663 242048 -86768 297657 245495 -44685
12216C10800j34904g5709B08360L09053I2262K85305o28G2218K75198O7826j98125
$$ 310800 175896 -75709 208360 517413 92262 377567 376939 72218 347416 415242 217117
12205B17117N8722j07712l091A3197J18806R058n1016K81208j7648G6761K45343
$$ 217117 275839 168127 165036 13197 132003 141061 90045 371253 353605 76761 322104
12194C22104F0484J28480J62647A70533K26994A92537N3560J6375G0319J90717
$$ 322104 60484 188964 351611 170533 397527 192537 246097 262472 70319 261036
12184B61036A02777A7060M84245G4093J68031j00250l0778P0341b0946A79488
$$ 261036 102777 17060 501305 74093 242124 141874 111096 181437 -20946 179488
12173A53361k2263a94740B37130j03329K58978j28976a49300A97317M37623F2486
$$ 153361 131098 -194740 237130 133801 392779 263803 -149300 197317 634940 62486
12162D63921N9501k08450J44374B22537H6936j8359c19880A35533a38411O7825
$$ 463921 523422 314972 459346 222537 86936 68577 -319880 135533 -138411 -70586
12152g0586B25554K9459p6963q3131K28315j29654N4286a2636o637A11495b77646
$$ -70586 225554 255013 178050 94919 323234 193580 247866 -12636 -19273 111495 -277646
12140A79098A7496a11066A80218c57151a16716H976a8505D6157M4462K49133A16578
$$ 179098 17496 -111066 180218 -357151 -116716 8976 -18505 46157 90619 339752 116578
12128d438B75546p4479p2181J57068A02475h425A716J28364e9659q0902j01889
$$ -4438 275546 201067 128886 285954 102475 -8425 1716 130080 -59659 -140561 -242450
12117b42450H6043f9842A30888a50096M1867B863N0643b11068e2063r2053B94859
$$ -242450 86043 -69842 130888 -150096 -108229 2863 53506 -211068 -52063 -144116 294859
12105A1931a8253m155m347A48298a13914A82339a0422o5299B36365E8105d41006
$$ 11931 -18253 -22408 -26755 148298 -113914 182339 -10422 -75721 236365 58105 -441006
12093B20371q6864J8661a0521B31662J0244I1610C2182K5143J11654d8390I5552
$$ 220371 133507 152168 -10521 231662 241906 91610 32182 57325 168979 -48390 95552
12081a48933O9076A75798R24m8987R1553p6974L8975C5050b30712L186L4819N518
$$ -148933 -79857 175798 176722 127735 219288 142314 181289 35050 -230712 -227526 -192707 -187189
12069a87189F5046J01465g2619A34212i5970A15887L5259a42590A7782G999K96502
$$ -187189 65046 166511 -72619 134212 -95970 115887 151146 -142590 17782 7999 304501
12058C04501p5498d2181j83972I3908k0217A6851L77616j65287M19615O33558
$$ 304501 229003 -42181 -226153 93908 73691 16851 394467 229180 648795 1282353
12048A282353E75441B9474K39635k7733D8460J05266a9736A50927g8242k22172
$$ 1282353 575441 29474 269109 241376 48460 153726 -19736 150927 -78242 -300414
12038c00414a11372I0489c4779D077f7527A53112A9809L1765M3106a69980A91540
$$ -300414 -111372 90489 -34779 4077 -67527 153112 19809 51574 94680 -169980 191540
12026F1746b8468k41038A57564J00924b8750A04001e14485g7752j38315g2651
$$ 61746 -28468 -269506 157564 258488 -28750 104001 -514485 -77752 -216067 -72651
12015b32494B21625R4573P3669c50987H2006a75659P6413A4474K04416b07235
$$ -232494 221625 316198 389867 -350987 82006 -175659 -99246 14474 218890 -207235
12004a37683f8629p8440a2881j45023C4629K26176d1106G11d657G5636b62866
$$ -137683 -68629 -147069 -12881 -157904 34629 260805 -41106 711 -4657 75636 -262866
11992E5309R9438b51671H7608K2146K46511b59213g5999F7826R2810R1771a24653
$$ 55309 154747 -251671 87608 109754 356265 -259213 -75999 67826 160636 252407 -124653
11980F3487a65221g5055k239q2683A57280L10490B2783H413P1182g5992B4152
$$ 63487 -165221 -75055 -77294 -159977 157280 467770 22783 8413 79595 -75992 24152
11968a47685j47757B9190K44639c32501a4006m8462j57629O8731C9527L3562l854
$$ -147685 -295442 29190 273829 -332501 -14006 -62468 -220097 -151366 39527 73089 69235
11957F9235O9546f3072B18463e6814a1687A20287K7950b03116c8967F2533a88843
$$ 69235 138781 -63072 218463 -56814 -11687 120287 148237 -203116 -38967 62533 -188843
11945a16349A79633D5861e3136k41308A10422L8296b02606j2215B33754f8873
$$ -116349 179633 45861 -53136 -294444 110422 148718 -202606 -214821 233754 -68873
11934f8395O697I1539J57311l6144e471k19709I9192N2249b33289b680k14644
$$ -68395 -61698 91539 248850 212706 -5471 -225180 99192 151441 -233289 -2680 -217324
11923b17324I3169p624b89903E6465a45261F3037a5641l1777H4923L6569a07915
$$ -217324 93169 85545 -289903 56465 -145261 63037 -15641 -47418 84923 121492 -107915
11911a84867C4462O8677J58905A16992e7378k13880J13006f9429a4388n8142A26514
$$ -184867 34462 103139 262044 116992 -57378 -271258 -158252 -69429 -14388 -72530 126514
11899A15449L4868O6857D7093a91038f3313L162o4784A11165b4730A13221J273
$$ 115449 150317 217174 47093 -191038 -63313 -60151 -124935 111165 -24730 113221 114494
11888A14494J01045H4757A4312i2422L6954C16528k2369a01365M0478B05898q1536
$$ 114494 215539 84757 14312 -92422 -55468 316528 294159 -101365 -60887 205898 124362
11877A24362c94953i0423j38825Q5469d8090A31370A0928a90112Q7341C8969a18278
$$ 124362 -394953 -90423 -229248 -143779 -48090 131370 10928 -190112 -102771 38969 -118278
11865c314A92081q8896a42955C7516b82916M5395f3387q5078B5841K04408a42707
$$ -3314 192081 103185 -142955 37516 -282916 -237521 -63387 -148465 25841 230249 -142707
11853e0272E6852c91202a62689p7523B51892f9614C33558a07493M7321A97247
$$ -50272 56852 -391202 -162689 -240212 251892 -69614 333558 -107493 -60172 197247
11842a72035P4995k52379a10319E3054L0410K45632j17744B1780K28517j19982
$$ -172035 -97040 -349419 -110319 53054 83464 329096 211352 21780 250297 130315
11832A30315o4831e3877A40173J9835n5104D6840e9113q1579G0886c00046g3002
$$ 130315 65484 -53877 140173 160008 104904 46840 -59113 -140692 70886 -300046 -73002
11820a3895l88740B55247i1451A76988C6352g1051F7644a66036j56800A67501
$$ -13895 -402635 255247 -91451 176988 36352 -71051 67644 -166036 -322836 167501
11809B70574r8670c4579p9964A19543K838b3018p1401m4612B6742a01666I8480
$$ 270574 171904 -34579 -114543 119543 122381 -23018 -94419 -139031 26742 -101666 98480
11797F2610A07f2848l1401a5376j16495H334J81810i9821j52289H5098a38486
$$ 62610 107 -62848 -94249 -15376 -131871 8334 190144 -99821 -252110 85098 -138486
11785c5951G1743f0127A38139a140A32820k6538K09498d21041G6608K6007h378
$$ -35951 71743 -60127 138139 -1140 132820 106282 315780 -421041 76608 102615 -8378
11773a66489d9250A8215f0907k90532O0390e2907I5396e1199F5050Q9954c43077
$$ -166489 -49250 18215 -60907 -351439 -291049 -52907 95396 -51199 65050 155004 -343077
11761B8412R3277o0354a28244a6738A6286K70631a85019b1017B33114c67412b2033
$$ 28412 121689 61335 -128244 -16738 16286 286917 -185019 -21017 233114 -367412 -22033
11749A449N9789R5993b68029C17558L1993c42994A17223d9182H097K9369c4514
$$ 1449 61238 157231 -268029 317558 349551 -342994 117223 -49182 8097 37466 -34514
11737A77359A861J91393b27311e560j90716g0121A3190R1695O5689n3916N6328
$$ 177359 1861 193254 -227311 -5560 -196276 -70121 13190 104885 170574 116658 172986
11726A72986D9694J5231j8063M2800L0914A6388a90307k31756A92140a34597A62595
$$ 172986 49694 64925 46862 89662 120576 16388 -190307 -422063 192140 -134597 162595
11714b21625B1014a56464O5155A17243A523J86783G8288a1094C10480A51112a53160
$$ -221625 21014 -156464 -91309 117243 1523 188306 78288 -11094 310480 151112 -153160
11702B32594m2178c47541d7573J6836l4005j22333r5412F7651K70628B015i8592
$$ 232594 190416 -347541 -47573 -30737 -64742 -187075 -282487 67651 338279 2015 -98592
11690D8441g1708m4369B39827b00803A43197o9353f6759J8270C16580a2177D982
$$ 48441 -71708 -116077 239827 -200803 143197 73844 -66759 -48489 316580 -12177 4982
11678f9783A16754a0735B06999O598G2826d9882F2405O0653J20546F2865p963
$$ -69783 116754 -10735 206999 213597 72826 -49882 62405 123058 243604 62865 54902
11667E4902J19972h8806G7905R0997i017j01031A57993b11420A634J7446L7768
$$ 54902 174874 -88806 77905 168902 -9017 -110048 157993 -211420 1634 19080 56848
11656E6848P0986f324F9222a27076N6307C5188e4906B580a15583I9186c7496G5790
$$ 56848 127834 -6324 69222 -127076 -70769 35188 -54906 2580 -115583 99186 -37496 75790
11643h4961C2097c3831A06181j0171c2071A97948r0881b5248K833p609j56765
$$ -84961 32097 -33831 106181 96010 -32071 197948 107067 -25248 -22415 -30024 -186789
11632a86789A87636c2840A94292f795A04380h105C34864j17529D1492a45331p0931
$$ -186789 187636 -32840 194292 -6795 104380 -8105 334864 217335 41492 -145331 -216262
11621b16262a7411F4169a33620c7806D26214j87800E209J39621o9152L4138J68826
$$ -216262 -17411 64169 -133620 -37806 426214 238414 5209 144830 75678 109816 278642
11610B78642o6946D6030a0494k13645G9065K00796k0541J3477n4150r8871r017
$$ 278642 211696 46030 -10494 -224139 79065 279861 259320 272797 218647 119776 110759
11599A10759a1816A75117J47116A31442K5557o6886b16732G6971b02035N5391
$$ 110759 -11816 175117 322233 131442 156999 90113 -216732 76971 -202035 -146644
11589a46644k3832H8514A6834K3796a02039I5459J0286h2855q3957d1962p8319
$$ -146644 -170476 88514 16834 40630 -102039 95459 105745 -82855 -166812 -41962 -120281
11578a20281A54928b07442A00771Q4607K6911Q0748a716j05137j13278G2377b32873
$$ -120281 154928 -207442 100771 185378 212289 293037 -1716 -106853 -220131 72377 -232873
11566b78817A35003L0043k3308L04678i4258C478M31426D1567b07072a8266n4647
$$ -278817 135003 165046 141738 446416 -94258 3478 434904 41567 -207072 -18266 -72913
11555g2913A92632a13704B44024k3860P723B7315Q942a15496E16394g7757A9982
$$ -72913 192632 -113704 244024 220164 227887 27315 36257 -115496 516394 -77757 19982
11543A10724m322m1863K34641j32132m7489J43229A15953c17547h3075E10478
$$ 110724 106402 64539 299180 167048 119559 262788 115953 -317547 -83075 510478
11532a95316A438J02222J02357d8347B861d8250j07582C96525o5272b18282B31536
$$ -195316 1438 103660 206017 -48347 2861 -48250 -155832 396525 331253 -218282 231536
11520B76333m947E1134a04481C30886j10527m6486J83868d0729I7143J3074R7588
$$ 276333 271386 51134 -104481 330886 220359 173873 357741 -40729 97143 110217 207805
11509B07805a39478J50B71957j07221a4420B75654j28558J33608n7446l5551J22220
$$ 207805 -139478 -139328 271957 164736 -14420 275654 147096 280704 223258 187707 309927
11498C09927c7059k5488A37784o2960N6265a9568E415a24087b461l0057R783B48017
$$ 309927 -37059 -62547 137784 74824 131089 -19568 5415 -124087 -2461 -32518 -22735 248017
11485A9548J36786m8542k0921K6463b30192B12321b11893A97808a63550B53771
$$ 19548 156334 107792 86871 113334 -230192 212321 -211893 197808 -163550 253771
11474d7403A88674N06976H2032N8229a30201c5735B1259J33507K31739c0334n341
$$ -47403 188674 695650 82032 140261 -130201 -35735 21259 154766 386505 -30334 -35675
11463c5675A28404L05063o7809A72732C3328J43301a11251G9521J51506p1309
$$ -35675 128404 433467 365658 172732 33328 176629 -111251 79521 231027 159718
11453A59718J07722m9910j1776p6658J35942H2609K40849j04909o6917E4434J2652
$$ 159718 267440 217530 205754 129096 265038 82609 323458 218549 151632 54434 67086
11442F7086c5156E77353f3484M017B6797a01710C09475p0322F0208h2175A25402
$$ 67086 -35156 577353 -63484 -59467 26797 -101710 309475 239153 60208 -82175 125402
11430A22810k783J75822f7919A57298a4655o6309A57127o8466i0390a0624B36871
$$ 122810 120027 295849 -67919 157298 -14655 -80964 157127 88661 -90390 -10624 236871
11418A19285J92971j55170K5254a75575F592b28687F8338R903b0949m812F5189
$$ 119285 312256 157086 182340 -175575 6592 -228687 68338 78241 -20949 -25761 65189
11406B36622b43444a03542q9033F3453a4187B11302A0417c38337A24825j1938
$$ 236622 -243444 -103542 -192575 63453 -14187 211302 10417 -338337 124825 112887
11396A12887c1342p1779H9275e3016J3944l01223b8875A00113J28678I1235h8538
$$ 112887 -31342 -103121 89275 -53016 -39072 -340295 -28875 100113 228791 91235 -88538
11384B08500e3861M09D3071a85765b6144A31851A863K97695A38440b4431B49709
$$ 208500 -53861 -53452 43071 -185765 -26144 131851 1863 299558 138440 -24431 249709
11372a46483E279b40458Q3588A31586M4127c2967m8274E9255f5004p0805H8898
$$ -146483 5279 -240458 -156870 131586 175713 -32967 -81241 59255 -65004 -135809 88898
11360A94667a00189A71129J1933b29335f8827n1180C47290b4197A04606P196C2205
$$ 194667 -100189 171129 183062 -229335 -68827 -120007 347290 -24197 104606 111802 32205
11348b31104N5513A2559J78774O6045a0930F1728j5298J82013a67638q590A60304
$$ -231104 -175591 12559 191333 257378 -10930 61728 46430 228443 -167638 -176228 160304
11336E4250M14152b46450i6371b5411A1223o93e1190A21085J45895c4039B31430
$$ 54250 468402 -246450 -96371 -25411 11223 10530 -51190 121085 266980 -34039 231430
11324C09213j10441B0944L1180h3539j00144F7090O7287f0999j82117B25901E7677
$$ 309213 198772 20944 52124 -83539 -183683 67090 134377 -60999 -243116 225901 57677
11312a74560e2081A27623b8012F0119g1124I2790J14963b53669d3513G4990M36396
$$ -174560 -52081 127623 -28012 60119 -71124 92790 207753 -253669 -43513 74990 511386
11301E11386h4939I5276b77562A54666a11796A6387F095a3047l9487a1421j67772
$$ 511386 -84939 95276 -277562 154666 -111796 16387 6095 -13047 -52534 -11421 -179193
11290a79193j6888g9572a8029l025j92602G4000a02057c4577I289K53268i161
$$ -179193 -196081 -79572 -18029 -21054 -213656 74000 -102057 -34577 9289 262557 -9161
11278i5795l9601j45024E3404M1978J01604p3296n0157b45468f4526m3945d0846
$$ -95795 -135396 -280420 53404 95382 196986 123690 73533 -245468 -64526 -108471 -40846
11266a7850A80173c6036A26159E748A839g4698k53017B121h8627J5540F1789O4712
$$ -17850 180173 -36036 126159 5748 1839 -74698 -327715 2121 -88627 -73087 61789 126501
11254A26501a44591p1591a311A37505e6858r2767O4082H8068a21909L2498C46818
$$ 126501 -144591 -216182 -1311 137505 -56858 -149625 -85543 88068 -121909 -89411 346818
11242b55354A12970a8056k98695B24975a9120j90126N2815B31667J5969G622O9465
$$ -255354 112970 -18056 -316751 224975 -19120 -209246 -156431 231667 247636 7622 77087
11231G7087D413J37656B3555M7577N7000a53647D4081Q1857o1735B6432R3066
$$ 77087 4413 142069 23555 71132 128132 -153647 44081 125938 64203 26432 119498
11220A19498a26336d5583J6871A3938J07742m4430a59123d2969m295G1758L58893
$$ 119498 -126336 -45583 -28712 13938 121680 77250 -159123 -42969 -47264 71758 430651
11209D30651a68259c6463k42127A51069E8940J23674K3406b23657l4631D945e9552
$$ 430651 -168259 -36463 -278590 151069 58940 182614 206020 -223657 -258288 4945 -59552
11197G907a70209k6399e5231k88064B30586i6503E257b03643k09469B79691b87149
$$ 7907 -170209 -196608 -55231 -343295 230586 -96503 5257 -203643 -413112 279691 -287149
11185a08443a1731k56824g1327A0789h5220C5922g375A43510a63953l764j5811
$$ -108443 -11731 -268555 -71327 10789 -85220 35922 -7375 143510 -163953 -167717 -183528
11174a83528C03681a58837j23768B47258e4556l01981a07600k56009B03713j01727
$$ -183528 303681 -158837 -282605 247258 -54556 -356537 -107600 -363609 203713 101986
11164A01986g403A02698a59975l1116A7392J0774L66419C3591d0828D8276J52
$$ 101986 -7403 102698 -159975 -191091 17392 28166 394585 33591 -40828 48276 48428
11153D8428a96212B63895b5981C12541b9691j64170B7007P9215J01207a25351
$$ 48428 -196212 263895 -25981 312541 -29691 -193861 27007 106222 207429 -125351
11142a36182D4876a08998C35803c14816f3339j02565n9850A37577o0555i3182
$$ -136182 44876 -108998 335803 -314816 -63339 -165904 -225754 137577 77022 -93182
11131c6262l04220E4114g049k84615A98360D5652J83266a2031A06716J87978c63464
$$ -36262 -340482 54114 -7049 -291664 198360 45652 228918 -12031 106716 294694 -363464
11119C28455i5972B00449e0519j73870L9823i0477j9812B4495L24327G2855J64458
$$ 328455 -95972 200449 -50519 -224389 -184566 -90477 -110289 24495 348822 72855 237313
11108B37313i136j20065D36559A04224D122a45863B73230m7667a75533D6678L74196
$$ 237313 -9136 -129201 436559 104224 4122 -145863 273230 225563 -175533 46678 420874
11097D20874k04511L37982A42151n3676m3903R0178J24937A07786m8935J2529
$$ 420874 216363 554345 142151 88475 44572 134750 259687 107786 58851 71380
11087G1380N06964C2783J08321n5912d1789B95230d8003D03494N9A36191l9050
$$ 71380 578344 32783 141104 85192 -41789 295230 -48003 403494 403553 136191 97141
11076I7141K16263C7d2212C4025L97913A37471K40538q9487A5960L02299p7549
$$ 97141 313404 37 -42212 34025 431938 137471 378009 288522 15960 318259 240710
11065B40710k9586H2540O9124J18992D5132D330N16493D9605O8586Q7163K77213
$$ 240710 211124 82540 151664 270656 45132 4330 520823 49605 118191 205354 482567
11054D82567n2204j3994j93740L19010q8311K75686C57818R702J5979K31136A70910
$$ 482567 430363 416369 222629 541639 453328 729014 357818 367520 383499 614635 170910
11042I84720l64946J5832K36313R5637k57118J96420k01151r466K22320l06719
$$ 984720 619774 635606 871919 967556 710438 906858 705707 696241 918561 611842
11032F11842j54072L96294m0109k32460M5318j4967K01930o3788J33335o948l39149
$$ 611842 457770 854064 813955 581495 626813 611846 813776 749988 883323 876375 537226
11021E37226J58887J2052J23052p6982l08719L82472J90795k76735m7216R1341
$$ 537226 696113 708165 831217 754235 445516 827988 1018783 742048 694832 786173
11011G86173q3301k48259L81579l01041L59836q8704o8652k60325K00342K72367
$$ 786173 702872 454613 836192 535151 894987 806283 737631 477306 677648 950015
11001I50015C65166J33251L49594k24547J53483q5103M2345k23664K23561r5637
$$ 950015 365166 498417 848011 623464 776947 691844 734189 510525 734086 638449
10991F38449k86009M95918l0335l70712K90732j79637J77436J59081j27375J97178
$$ 638449 352440 848358 818023 447311 738043 558406 735842 894923 767548 964726
10981I64726j35606j78251P8380J08308j23472O1517R6776j31160k8389J98064
$$ 964726 829120 650869 729249 837557 714085 775602 872378 741218 712829 910893
10971I10893k1195J31976K07064k9236N0810j20316L81110j24207L40074p9807
$$ 910893 889698 1021674 1228738 1199502 1250312 1129996 1511106 1386899 1726973 1647166
10961A647166M09801J39782J46493J23978K62481J93761j04415n32064L37135
$$ 1647166 2056967 2196749 2343242 2467220 2729701 2923462 2819047 2286983 2624118
10952B624118q1654k59753m40348j71394J93109k90643K66044m9883K00814k98830
$$ 2624118 2542464 2282711 1842363 1670969 1864078 1573435 1839479 1789596 1990410 1691580
10942A691580P9701J33882n81189N49617m11990o35491q546Q5628L79951l03618
$$ 1691580 1771281 1905163 1323974 1873591 1461601 826110 817564 903192 1283143 979525
10932I79525D84296j52772A51775J79720K43231k23401A08103A1282L231K57215
$$ 979525 484296 331524 151775 331495 574726 351325 108103 11282 14513 271728
10922B71728R0371a41481A93856m6192a9124B39384n0589O1288R773m0602C0251
$$ 271728 362099 -141481 193856 147664 -19124 239384 188795 250083 259856 219254 30251
10910C49998a67148h1503A69356p5717b5716I1822e714k03996E9217a888j78572
$$ 349998 -167148 -81503 169356 93639 -25716 91822 -5714 -209710 59217 -1888 -180460
10899a80460A04274K63095A49406D4921i2922A73502n931a3158A40902a22214
$$ -180460 104274 367369 149406 44921 -92922 173502 167571 -13158 140902 -122214
10888C45197j2909a16158A41333J24011k8324f8276c2539k41342A2538a64423
$$ 345197 332288 -116158 141333 265344 237020 -68276 -32539 -273881 12538 -164423
10877A83316E0297K0399a82626e9249k8183d1769I096M133J55154h2518B11339
$$ 183316 50297 70696 -182626 -59249 -87432 -41769 9096 13229 168383 -82518 211339
10865a32347o0235k79803A71045d9768j4267a5760n0895j50814A06042J61748
$$ -132347 -192582 -472385 171045 -49768 -64035 -15760 -66655 -217469 106042 267790
10855B67790b27968A99162j4864K4123F2003M2075f8299j89048B77414j14575
$$ 267790 -227968 199162 184298 208421 62003 104078 -68299 -257347 277414 162839
10845A62839a58958e1586l645j1772n0953A94958G6539J84907E0377a32949A8761
$$ 162839 -158958 -51586 -55231 -67003 -117956 194958 76539 261446 50377 -132949 18761
10833a93994A88594B1673J05642K1729i1113n7177a6479j34712A73219B7445J54525
$$ -193994 188594 21673 127315 149044 -91113 -148290 -16479 -151191 173219 27445 181970
10822A81970e9452j53332O5076P3216O667c2473k45546Q8530I5281B0206K92514
$$ 181970 -59452 -212784 -147708 -74492 -67825 -32473 -278019 -189489 95281 20206 312720
10811C12720a1514k88213A14551b49107G4729K00353A26508a18447g391F7823
$$ 312720 -11514 -299727 114551 -249107 74729 275082 126508 -118447 -7391 67823
10800b43099a16810G070J28807E0336a22023Q643C3511O4543a19156e7495b51
$$ -243099 -116810 7070 135877 50336 -122023 -113380 33511 98054 -119156 -57495 -251
10788a36409e9096G4749a19904A11003k3447J00048k5561F6140e7293E1332J43108
$$ -136409 -59096 74749 -119904 111003 87556 187604 162043 66140 -57293 51332 194440
10777A94440P5040a61141k5674B26569j09950a23331k14396a13707p3058d1596
$$ 194440 269480 -161141 -186815 226569 116619 -123331 -337727 -113707 -186765 -41596
10766c5388O380o2060C7511Q4595a09840l2077M6508o4142P7304J1255j30729
$$ -35388 -29008 -91068 37511 122106 -109840 -141917 -95409 -159551 -82247 -70992 -201721
10755b01721o8772A2054b55265D8697a25195C53721j21927m7050b04121A7205
$$ -201721 -270493 12054 -255265 48697 -125195 353721 231794 184744 -204121 17205
10744B05828d66659a64481A13986c13286C6402d3801I0600c6012k53483b2214
$$ 205828 -466659 -164481 113986 -313286 36402 -43801 90600 -36012 -289495 -22214
10733a89243I4201C3776a85898A95368a39404f7218J964l24582B16078a53247
$$ -189243 94201 33776 -185898 195368 -139404 -67218 -65254 -389836 216078 -153247
10722C2535c7944k39241J15319N3413j48588j28128a55546d3809A66347n6891
$$ 32535 -37944 -277185 -161866 -108453 -257041 -385169 -155546 -43809 166347 109456
10712A09456g3838j13441m8077a07879j081j03531a01164B14561I7595I462c09458
$$ 109456 -73838 -187279 -235356 -107879 -108960 -212491 -101164 214561 97595 9462 -309458
10700H4140D362K4139h929j71071J9693e7998o9027M9119k50583B67479a68146
$$ 84140 4362 28501 -8929 -180000 -160307 -57998 -127025 -77906 -328489 267479 -168146
10688C95474a45764k57990c6598r2407d7131B08026Q8009a61521C40556h0998
$$ 395474 -145764 -403754 -36598 -129005 -47131 208026 296035 -161521 340556 -80998
10677a56411A6550b62667a26587O18A17469c07445M9980J18633H2565a33861c6312
$$ -156411 16550 -262667 -126587 -125969 117469 -307445 -257465 -138832 82565 -133861 -36312
10665B29658A857a63391G7641C3666a27886D8040a09397A51465a1038B12465a33523
$$ 229658 1857 -163391 77641 33666 -127886 48040 -109397 151465 -11038 212465 -133523
10653c37225b2242k297E7479b18063B86820c39480a68164j17953a27162N1702
$$ -337225 -22242 -24539 57479 -218063 286820 -339480 -168164 -286117 -127162 -75460
10643g5460J2043A34792a64386A29557c2117F828a81517D7677N5642a61255c6888
$$ -75460 -63417 134792 -164386 129557 -32117 6828 -181517 47677 103319 -161255 -36888
10631b35125K2990A46385a31499B6962K36972g142n0726b047B46873B2489b4920
$$ -235125 -212135 146385 -131499 26962 263934 -7142 -57868 -2047 246873 22489 -24920
10619a98358D1154f3980k32304E6962a32542H8822d00403a38969K8998C05481
$$ -198358 41154 -63980 -296284 56962 -132542 88822 -400403 -138969 -109971 305481
10608a81186j10364k1254A60647C2873a62374h651I7271B499e7003j99378p867
$$ -181186 -291550 -312804 160647 32873 -162374 -8651 97271 2499 -57003 -256381 -264248
10597b64248a18371m88469b25689i1199j03345g7827C421c23084d124j7936j0315
$$ -264248 -118371 -606840 -225689 -91199 -194544 -77827 3421 -323084 -4124 -22060 -32375
10586c2375F8264A8365b39423b8850A02470a41686j81508F6110a36360C7895i1737
$$ -32375 68264 18365 -239423 -28850 102470 -141686 -323194 66110 -136360 37895 -91737
10574a14270B4074M2164a32447B12463p3236f8105l06534A11144B7969b37671
$$ -114270 24074 66238 -132447 212463 139227 -68105 -374639 111144 27969 -237671
10563D0883a38831e769j1034k26364j3821a4618j26573e8217A17610e9049j38905
$$ 40883 -138831 -5769 -16803 -243167 -256988 -14618 -141191 -58217 117610 -59049 -197954
10552a97954H047a16828M6825j86184f6120L0517A97838k6847e1660A97422a04428
$$ -197954 8047 -116828 -70003 -256187 -66120 -35603 197838 170991 -51660 197422 -104428
10540h7101D6760f8370B21128c6239I6277P3846O1438i2546D6928J99274r8493
$$ -87101 46760 -68370 221128 -36239 96277 170123 231561 -92546 46928 246202 147709
10529A47709K9961F8590d6304B49117b11802C03195E0853J93127B7927b66541
$$ 147709 177670 68590 -46304 249117 -211802 303195 50853 243980 27927 -266541
10518B19361g978j6834k98919A48325a36808e8994A56483d2105I907M6979A2508
$$ 219361 -7978 -24812 -323731 148325 -136808 -58994 156483 -42105 9907 56886 12508
10506a21838c4975A22354D6341b63517C55615f6866A30908c69595g5417B1699
$$ -121838 -34975 122354 46341 -263517 355615 -66866 130908 -369595 -75417 21699
10495a88787N4936j4187C2907b01531a7759A8755K15895a64970P0935Q289p4042
$$ -188787 -133851 -148038 32907 -201531 -17759 18755 234650 -164970 -94035 -85746 -159788
10484a59788C83902b05791o0193H7731a35309j42240b8193r573E5203b4816C28371
$$ -159788 383902 -205791 -265984 87731 -135309 -277549 -28193 -37766 55203 -24816 328371
10472b03106A35559J97787H279M8964R5908L44066N7022R2902F1489K67276b7074
$$ -203106 135559 333346 8279 57243 153151 497217 554239 647141 61489 328765 -27074
10460a57805Q642A89963a59186r3001C53221a09403k8805A3616a78460k54310
$$ -157805 -149163 189963 -159186 -252187 353221 -109403 -138208 13616 -178460 -432770
10450d32770b849n6315K3059A10782A5221e9885A46424b19381i5957j0399H209
$$ -432770 -2849 -59164 -36105 110782 15221 -59885 146424 -219381 -95957 -106356 8209
10438b33193j59236a39278F0047M2585J43644b12161a03110C4148a01431H3700
$$ -233193 -392429 -139278 60047 102632 246276 -212161 -103110 34148 -101431 83700
10427B10039B4552K48834A8980a39777G1472J2708a19003A92433q7305i4311B830
$$ 210039 24552 273386 18980 -139777 71472 84180 -119003 192433 105128 -94311 2830
10415A7441C946a00712j38408h814q4657A31738a0101A28237D6255J8848c7874
$$ 17441 3946 -100712 -239120 -8814 -93471 131738 -10101 128237 46255 65103 -37874
10403e2369D0806R4662A9551c9416j65579P8914N325B87741r3061b0063j96177
$$ -52369 40806 135468 19551 -39416 -204995 -126081 -120756 287741 194680 -20063 -216240
10392b16240k1481J2905A3953c83159J72231A72529L1310b0698j90647h2105A95113
$$ -216240 -237721 -224816 13953 -383159 -210928 172529 203839 -20698 -211345 -82105 195113
10380A46406a79251A98111o1376A4404a10942D00273C3929F958P3506g6684C1121
$$ 146406 -179251 198111 136735 14404 -110942 400273 33929 6958 80464 -76684 31121
10368A20867K40627O91G0476J80743G4266q480C2161M61401c279D4492K48461
$$ 120867 361494 362185 70476 251219 74266 65786 32161 493562 -3279 44492 292953
10357B92953J7203R4731j49260L71297k65798K08019l1645J14910j74636j08011
$$ 292953 310156 404887 255627 626924 361126 569145 537500 652410 477774 369763
10347C69763a7760D26261j64276H6077K93736n9219j30273o371R8001N8936R830
$$ 369763 -17760 426261 261985 86077 379813 320594 190321 183950 281951 340887 350717
10336C50717j25093M20731k95586k342K14673k40130A26177P2393J02733n8808
$$ 350717 225624 646355 350769 348427 563100 322970 126177 198570 301303 242495
10326B42495m1727E0575L11022A54633J05339P9579M9492j83258J55001a45728
$$ 242495 200768 50575 361597 154633 259972 339551 389043 205785 360786 -145728
10315H2819O2079g3605E5348J46992E9336J97697a17279A75153L55039F7922Q8872
$$ 82819 144898 -73605 55348 202340 59336 257033 -117279 175153 530192 67922 156794
10304A56794J97245e9171B69744D3360h6340d2739N56B45481a772A37745b623
$$ 156794 354039 -59171 269744 43360 -86340 -42739 -42183 245481 -1772 137745 -2623
10292h1602Q686B30193g5185F292J8395O6385K10930d3769p1890B26253g4366
$$ -81602 -72916 230193 -75185 6292 24687 91072 302002 -43769 -115659 226253 -74366
10280a50011P1200k626K2040n2672J1909c4574j75825q7566c9347r2779B21220
$$ -150011 -78811 -81437 -59397 -112069 -100160 -34574 -210399 -297965 -39347 -132126 221220
10268i2134k25131A02583G367b52605c0615A43648Q6916a36370F4465P4842o9002
$$ -92134 -317265 102583 7367 -252605 -30615 143648 230564 -136370 64465 139307 70305
10257G0305C0689h7472A46648e9760k7844B42768f1120A7701Q0022K3382A2158
$$ 70305 30689 -87472 146648 -59760 -87604 242768 -61120 17701 97723 121105 12158
10245D22429Q8127O0023j00127j40542j08866E1537a72472B58479j01656l5962
$$ 422429 510556 570579 470452 329910 221044 51537 -172472 258479 156823 120861
10235A20861a90400c616D6911J22675k996b63066a06157G3254J2936a92953h3313
$$ 120861 -190400 -3616 46911 169586 166590 -263066 -106157 73254 86190 -192953 -83313
10223i6666A70257a78141H9185b90870J36427A2485J1650c14375O2118R1312a1650
$$ -96666 170257 -178141 89185 -290870 -154443 12485 24135 -314375 -252257 -160945 -11650
10211E6610a76775A63092a41252N0988H7662b43613J02146B1605a07456A38026
$$ 56610 -176775 163092 -141252 -90264 87662 -243613 -141467 21605 -107456 138026
10200f5671k48777J04246A29251a03113j07602A59476A3193Q857M3416b50798
$$ -65671 -314448 -210202 129251 -103113 -210715 159476 13193 22050 65466 -250798
10189A63249a00099C7822c17509d0371m2330B39133a92969b0623k48676A49286
$$ 163249 -100099 37822 -317509 -40371 -82701 239133 -192969 -20623 -269299 149286
10178c6961j15180f084k56122k72849C03476a33392j40390B57346b70401E4922
$$ -36961 -152141 -6084 -262206 -535055 303476 -133392 -273782 257346 -270401 54922
10167i5719n8479I6786l0284b87042A46554a94054k0902d6577j38020l3332O834
$$ -95719 -154198 96786 66502 -287042 146554 -194054 -214956 -46577 -184597 -217929 -211095
10156b11095C4003a09458H128c63116d870o7324j94121j13248a31210n3960H738
$$ -211095 34003 -109458 8128 -363116 -4870 -72194 -266315 -379563 -131210 -185170 8738
10144h4490J7090m1598A21230c98311a01174B6788c6834p6936r8782I1518g3274
$$ -84490 -67400 -108998 121230 -398311 -101174 26788 -36834 -113770 -212552 91518 -73274
10132g743j35260l35694C11066e0174m4018A04004b20648g6643l0423F4732h1841
$$ -7743 -143003 -478697 311066 -50174 -94192 104004 -220648 -76643 -107066 64732 -81841
10120A43034i5455j12653A86955a56172K6445e7101j46093A32408e9094k68716
$$ 143034 -95455 -208108 186955 -156172 -129727 -57101 -203194 132408 -59094 -327810
10110c27810d9271m456B28655i6758p5779N2645D9813J7572J12412b26038J4951
$$ -327810 -49271 -53727 228655 -96758 -172537 -119892 49813 67385 179797 -226038 -211087
10099b11087A59446n6919c7173B74894c60378B88794E2441d0826j98628Q1685
$$ -211087 159446 102527 -37173 274894 -360378 288794 52441 -40826 -239454 -157769
10089a57769D78437b74938f9289m3509a9540G7056i1963q9394n2935A59633F0359
$$ -157769 478437 -274938 -69289 -112798 -19540 77056 -91963 -181357 -234292 159633 60359
10077A82034H5303Q3008h7795j44p794m2825C0912b34075A60031a312m22090A1074
$$ 182034 85303 168311 -87795 -87939 -95733 -138558 30912 -234075 160031 -1312 -423402 11074
10064a16145j4985B08715E1864a6835m14846A74693b1263n4091l20731A62732
$$ -116145 -131130 208715 51864 -16835 -431681 174693 -21263 -75354 -396085 162732
10053A90035g8602j56928A31801m4010a73438A51785l576o4531a43072A3650K7798
$$ 190035 -78602 -235530 131801 87791 -173438 151785 148209 83678 -143072 13650 41448
10042D1448J10981a7117B2130a64406a3608p9252A40723a71498A772a69146N3194
$$ 41448 152429 -17117 22130 -164406 -13608 -92860 140723 -171498 1772 -169146 -115952
10031a15952A5772i9242A23233b53483f7768A28419a19105k7784p3346j83231
$$ -115952 15772 -99242 123233 -253483 -67768 128419 -119105 -146889 -220235 -403466
10021d03466J21515L3085a07704B1652J92198I5701R4263a23988H423J5272J56947
$$ -403466 -281951 -248866 -107704 21652 213850 95701 189964 -123988 8423 23695 180642
10010A80642E5222a1354l81687A28002a73060m4088C56600d13070a47916J3650
$$ 180642 55222 -11354 -393041 128002 -173060 -217148 356600 -413070 -147916 -134266
10000a34266A19614c12406c2727k15983E4772N8795j1981a32736r5685f858j04944
$$ -134266 119614 -312406 -32727 -248710 54772 113567 101586 -132736 -228421 -6858 -111802
9989a11802r1199N6589e2332j9713G7501b2306B79864a83798l7079l558H3881
$$ -111802 -203001 -146412 -52332 -72045 77501 -22306 279864 -183798 -220877 -224435 83881
9977d5456l13598f4349j82500A33405e7731E5003a37408N0318d1537k12959P7502
$$ -45456 -359054 -64349 -246849 133405 -57731 55003 -137408 -87090 -41537 -254496 -176994
9966a76994a4893G9624A2947o057J3373d9410A21259a49896q3576b5113A27865
$$ -176994 -14893 79624 12947 6890 20263 -49410 121259 -149896 -233472 -25113 127865
9954B89388a4830j67522j14732B9658a15129b5954b798B77829e8676j20267B023
$$ 289388 -14830 -182352 -297084 29658 -115129 -25954 -2798 277829 -58676 -178943 2023
9942b22400f8622R527j25398A10586B0706M1451a51708N3371B05677d26708D3390
$$ -222400 -68622 -59095 -184493 110586 20706 62157 -151708 -98337 205677 -426708 43390
9930a88634d0014B54357b62815b7367k21475C1231b29501F1621b26441l1025B19381
$$ -188634 -40014 254357 -262815 -27367 -248842 31231 -229501 61621 -226441 -257466 219381
9918E04871b1890k61851J6283g7074A21408c02132L0912e6578j659b623k19813
$$ 504871 -21890 -283741 -267458 -77074 121408 -302132 -271220 -56578 -58237 -2623 -222436
9907b22436a10162r4203d7330B41980n5640q1005b52632e7121L519j15174G5579
$$ -222436 -110162 -204365 -47330 241980 186340 105335 -252632 -57121 -53602 -168776 75579
9895F1745b00117Q9253A00228b23018A63741D672R702b4873j20233A20891J28929
$$ 61745 -200117 -110864 100228 -223018 163741 4672 14374 -24873 -145106 120891 249820
9884B49820c58078a30070N9303K7412B78847N2827a88161K565k5398R7560M2581
$$ 249820 -358078 -130070 -70767 -43355 278847 331674 -188161 -185596 -210994 -113434 -70853
9873g0853I3889b0583f897j00793B08899k6199b70772C7078L1413K38980C9462
$$ -70853 93889 -20583 -6897 -107690 208899 182700 -270772 37078 68491 307471 39462
9861a40912I2466J18525A4010a69999j50030a43237j6198p381B0494N642J16553
$$ -140912 92466 210991 14010 -169999 -320029 -143237 -159435 -166816 20494 26136 142689
9850A42689F1071c6168j01338C06305G8231b19796k8740A01768J65837b80098
$$ 142689 61071 -36168 -137506 306305 78231 -219796 -248536 101768 267605 -280098
9839b37378A704c9927k4874j73084J14672j87159B28211a51176B4497b09064D4140
$$ -237378 1704 -39927 -64801 -237885 -123213 -310372 228211 -151176 24497 -209064 44140
9827a77711a3338A27478n8892a89970J4594a5259k03774O5038a6488q3254j07642
$$ -177711 -13338 127478 68586 -189970 -175376 -15259 -219033 -153995 -16488 -99742 -207384
9816b07384M0425A99914d51405a15669a3134q0025l29497a44551L8206H6989a3957
$$ -207384 -166959 199914 -451405 -115669 -13134 -93159 -422656 -144551 -106345 86989 -13957
9804a49739H1837C6224e2687B09528f7956j39996H3753h6210o1887E3548a69623
$$ -149739 81837 36224 -52687 209528 -67956 -207952 83753 -86210 -148097 53548 -169623
9792a53834a2979j18312B04450a12933C6145A3774b09031j9594a09198o9794P9176
$$ -153834 -12979 -131291 204450 -112933 36145 13774 -209031 -228625 -109198 -178992 -99816
9781i9816d9077o8728K3496d2520B78903a68004G9533b4774A47144a04237A78072
$$ -99816 -49077 -117805 -94309 -42520 278903 -168004 79533 -24774 147144 -104237 178072
9769A61523a66242j435E8344J04317i6835c3389j55389H4675K501K204a63866
$$ 161523 -166242 -167677 58344 162661 -96835 -33389 -188778 84675 87176 89380 -163866
9757a41926f3049F6594L7282O3423c09142d5439l876D20431C2168i4183k14369
$$ -141926 -63049 66594 103876 167299 -309142 -45439 -49315 420431 32168 -94183 -308552
9746c08552c5777E9217a87431m32924i1491q6123g0295G0345G825K68849e9882
$$ -308552 -35777 59217 -187431 -620355 -91491 -177614 -70295 70345 7825 276674 -59882
9734c97370D7365c14741a43841D9617e9564j21302A43301b18517B6406J46750
$$ -397370 47365 -314741 -143841 49617 -59564 -180866 143301 -218517 26406 173156
9724A73156M1853d5096C8642a00935j83884B07157p2068b65333A60993c1925B6670
$$ 173156 215009 -45096 38642 -100935 -284819 207157 135089 -265333 160993 -31925 26670
9712B0686b09502j83858f3482m39081A30361l2155b59358c6367k05852A09319
$$ 20686 -209502 -393360 -63482 -502563 130361 98206 -259358 -36367 -242219 109319
9701H5268K21650i3517J1383K5256j13777N9561d9770l40288H4383a36364K7569
$$ 85268 306918 -93517 -82134 -56878 -170655 -111094 -49770 -390058 84383 -136364 -108795
9690a08795B99779a10771o1827f4067B7187b12467d5734j42143H5951b64061p4293
$$ -108795 299779 -110771 -172598 -64067 27187 -212467 -45734 -187877 85951 -264061 -338354
9679c38354n406F6487L6945J9000e8539j38154J8798q1333i9278p3447j85428
$$ -338354 -343760 66487 103432 122432 -58539 -196693 -177895 -259228 -99278 -172725 -358153
9668c58153a72990e8128j7388r0618A97218a55446A46247i2896B21355l6577K4468
$$ -358153 -172990 -58128 -75516 -166134 197218 -155446 146247 -92896 221355 184778 209246
9657B09246m615a74370B2929h7965r1538A62406j5863a18976M1M4784K8221J5805
$$ 209246 204631 -174370 22929 -87965 -179503 162406 146543 -118976 -118935 -74151 -45930 -30125
9645c0125B1245g947j11006D6526j6212d26561H9766L3145g5043j12321a7432
$$ -30125 21245 -7947 -118953 46526 30314 -426561 89766 122911 -75043 -187364 -17432
9633c32906J43694g5074G2099b01274P0857L88k10697h2370H740c07902J17706
$$ -332906 -189212 -75074 72099 -201274 -130417 -130029 -340726 -82370 8740 -307902 -190196
9622a90196j53606B25625a1700F6768L7909c4705j53438J1767K1596A39606h3084
$$ -190196 -343802 225625 -11700 66768 104677 -34705 -188143 -176376 -154780 139606 -83084
9610c53054A19012a6178G2649c1215I9893J95776b01550j73401J47454A18749
$$ -353054 119012 -16178 72649 -31215 99893 295669 -201550 -374951 -227497 118749
9599A2513Q7088b8173k4844C13173A36112o7603Q5628a39812j66734L7813J7566
$$ 12513 99601 -28173 -53017 313173 136112 68509 154137 -139812 -306546 -268733 -251167
9588b51167A24341b33549j15081P9465i8701b7673j93676B15138e4727j09764
$$ -251167 124341 -233549 -348630 -269165 -98701 -27673 -221349 215138 -54727 -164491
9578a64491o5175A83447Q0287k9778o8818E361b44881a09684j04312N4034A53222
$$ -164491 -229666 183447 263734 233956 165138 5361 -244881 -109684 -213996 -159962 153222
9566A91920g945A56178b1748B628h3996j2389D6371K3288P1839b13615l4852l8327
$$ 191920 -7945 156178 -21748 2628 -83996 -96385 46371 69659 141498 -213615 -248467 -286794
9554b86794h9485k2423C0336M23775c50027C82508a59818j40320b8210n7718m4523
$$ -286794 -89485 -111908 30336 454111 -350027 382508 -159818 -300138 -28210 -85928 -130451
9543a30451B57363c65986a00937o8682Q3847j39535K4572D6193a35624A91952
$$ -130451 257363 -365986 -100937 -169619 -85772 -225307 -200735 46193 -135624 191952
9532a86351f9823a8773F0132k6813c15765A10208c39109d8419j15058A09140e3291
$$ -186351 -69823 -18773 60132 33319 -315765 110208 -339109 -48419 -163477 109140 -53291
9520B4419a01157A02400a98954P9704c532l62907G9126a93377P234M4181B29782
$$ 24419 -101157 102400 -198954 -119250 -3532 -366439 79126 -193377 -186143 -141962 229782
9508c3730q3074D5288d28413h9749k86145H8809a2573G5273d38143F3459c760
$$ -33730 -116804 45288 -428413 -89749 -375894 88809 -12573 75273 -438143 63459 -3760
9496h8724E6146J51906o4470c95455I551L02635a11890j34192B9196K3458a92954
$$ -88724 56146 208052 143582 -395455 9551 312186 -111890 -246082 29196 52654 -192954
9484a27902j85952B30719E0308K5733R120J63836n5481E2453r252a04486j91933
$$ -127902 -313854 230719 50308 76041 85161 248997 193516 52453 43201 -104486 -296419
9473b96419J07723O5764B0587J83473b06628g8330A07557b15259j96451d3873
$$ -296419 -188696 -122932 20587 204060 -206628 -78330 107557 -215259 -411710 -43873
9462d06213A18092g6177L5905j99086R0528B10280b71268O2430M0112l31162A80449
$$ -406213 118092 -76177 -40272 -239358 -148830 210280 -271268 -208838 -168726 -499888 180449
9450c08989J2868I7218b22082i9371k50464a12848M8899a7114A081J31907b72235
$$ -308989 -296121 97218 -222082 -99371 -349835 -112848 -63949 -17114 1081 132988 -272235
9438E2376j8361h8467J7192G7965a21709L9959j8066K7120I4674a08279j59191
$$ 52376 34015 -88467 -71275 77965 -121709 -81750 -99816 -72696 94674 -108279 -267470
9427b67470A0417d16376f4411H1512c39977J53012A8138J4208f4199l3667k92029
$$ -267470 10417 -416376 -64411 81512 -339977 -186965 18138 32346 -64199 -97866 -389895
9416c89895A08655a98112d7887I8768j8138i1957j68655B8065b32776d5431B2318
$$ -389895 108655 -198112 -47887 98768 80630 -91957 -260612 28065 -232776 -45431 22318
9404E6831f9457j32331g0592r7384B43705B2667M7486i3473d4159l31170F6782
$$ 56831 -69457 -201788 -70592 -167976 243705 22667 70153 -93473 -44159 -375329 66782
9392a63009P2333A32063F1572a85872j73023A32971M4565f9483E2278f2313k28222
$$ -163009 -90676 132063 61572 -185872 -358895 132971 177536 -69483 52278 -62313 -290535
9381b90535A13718l1600O5569E6498a06751J786J7816j5136b6872A0783c93788
$$ -290535 113718 82118 147687 56498 -106751 -104965 -87149 -102285 -26872 10783 -393788
9369d06396A00127A8276K7084M5944N8791b69860g0205G7852a85547j55794A76940
$$ -406396 100127 18276 45360 91304 150095 -269860 -70205 77852 -185547 -341341 176940
9357g478r8130c7206j25145g6854A74865J26847a31441L9442C35794a24018d4950
$$ -7478 -105608 -37206 -162351 -76854 174865 301712 -131441 -91999 335794 -124018 -44950
9345a67772k7518j33887H7828J02390b862n1911j30829l70j3756k0766h7439j87323
$$ -167772 -195290 -329177 87828 190218 -2862 -54773 -185602 -185972 -199728 -220494 -87439 -274762
9333b74762R9788A3579a39271N9456b3508j38698f0244k5142k3807I8981a95010
$$ -274762 -174974 13579 -139271 -79815 -23508 -162206 -60244 -85386 -109193 98981 -195010
9321f76B592b14921A03173d9926f906F3224a66377g9283k73940J53691A97037
$$ -676 2592 -214921 103173 -49926 -6906 63224 -166377 -79283 -353223 -199532 197037
9309b36179d8852C79213c53222A89807B5352c0578j99919C83620p9533c71548
$$ -236179 -48852 379213 -353222 189807 25352 -30578 -230497 383620 304087 -371548
9298g6901A11166E1792b19744A68972b56460Q3622b1263A85080a80926c1980A21076
$$ -76901 111166 51792 -219744 168972 -256460 -172838 -21263 185080 -180926 -31980 121076
9286g7396B06736m2693e5416C43297D3275a41935A53616b37214B6042J16630M6169
$$ -77396 206736 164043 -55416 343297 43275 -141935 153616 -237214 26042 142672 188841
9275A88841b62759H384a97934j90223J93594C7589f7517r108C4763b16940a06957
$$ 188841 -262759 8384 -197934 -388157 -194563 37589 -67517 -76625 34763 -216940 -106957
9263F4859f5416k10010A54898c9447M80n5984L5732j11098j98448J64949L7784
$$ 64859 -65416 -275426 154898 -39447 -38967 -94951 -59219 -170317 -368765 -203816 -166032
9252a66032A35229K250b7682A48675i594A02923a00695j36484A17939b8672p5291
$$ -166032 135229 137479 -27682 148675 -9594 102923 -100695 -237179 117939 -28672 -103963
9241a03963d5326n7493l1227G8631b14671h5163l7794m157B77282a17772l23964
$$ -103963 -45326 -102819 -134046 78631 -214671 -85163 -122957 -127114 277282 -117772 -441736
9230d41736a43400j11788A42140j9743b81098D0427c01191r38J33985F7130J34806
$$ -441736 -143400 -255188 142140 122397 -281098 40427 -301191 -302129 -168144 67130 201936
9219B01936d0851l2226o4893k288I3684K14328g008n6008j48617c3802j51128
$$ 201936 -40851 -73077 -137970 -140258 93684 308012 -7008 -63016 -211633 -33802 -184930
9208a84930e1311i206A6855b03019q4669O2043B94474I0053h3980j04841N8670
$$ -184930 -51311 -9206 16855 -203019 -287688 -225645 294474 90053 -83980 -188821 -130151
9197a30151A00847b13104j3282l0258a10578H3374B1455J72457f1970B94356H5373
$$ -130151 100847 -213104 -226386 -256644 -110578 83374 21455 193912 -61970 294356 85373
9185d2851p7136B47954e7189p2752C38526f1948A84606n1496L4836a59359A96657
$$ -42851 -119987 247954 -57189 -129941 338526 -61948 184606 133110 167946 -159359 196657
9173i0091I8724J09220i8553a9081j82213j49533E00272A94859a90174H1115b34347
$$ -90091 98724 207944 -98553 -19081 -201294 -350827 500272 194859 -190174 81115 -234347
9161a28215L1775A95458a83724j49927N9541a6821P468j74409j27175R6465H7615
$$ -128215 -96440 195458 -183724 -333651 -274110 -16821 -9353 -183762 -310937 -214472 87615
9149i5212M6486J0959j89493G6866b24955m137k2822e7425A02617o727b06778
$$ -95212 -48726 -37767 -227260 76866 -224955 -229092 -251914 -57425 102617 95890 -206778
9137i3897a5531l9619C14615e5512n425C330J9550a87167M1266A48511J66661
$$ -93897 -15531 -55150 314615 -55512 -60937 3330 22880 -187167 -145901 148511 315172
9126C15172m3130p1262a27874k31815M0632r7467b05712h1807k7016L9153D647
$$ 315172 272042 200780 -127874 -359689 -319057 -416524 -205712 -81807 -108823 -69670 4647
9114e2915A42932P1432A887K96267j42731d4331A73306B6836N9685K3840b0308
$$ -52915 142932 214364 1887 298154 155423 -44331 173306 26836 86521 110361 -20308
9102a05299A95614i4817A7359h4126a0545j16841A26238N2227B8474b1307A23738
$$ -105299 195614 -94817 17359 -84126 -10545 -127386 126238 178465 28474 -21307 123738
9090i5019b2284B23239A3744g2312A33354b44941K2821O3653N4260A9496M9745
$$ -95019 -22284 223239 13744 -72312 133354 -244941 -222120 -158467 -104207 19496 69241
9079F9241c78264A66665A9413P636L7723g2825k13872f0198l14357c3663a5450
$$ 69241 -378264 166665 19413 27049 64772 -72825 -286697 -60198 -374555 -33663 -15450
9067B44564A6177e0545n3880m73634B22360b66549J03827L3335c3528A26372r226
$$ 244564 16177 -50545 -104425 -578059 222360 -266549 -162722 -129387 -33528 126372 117146
9056A17146h3553j92165A01913a12508p0921C399f9832n5520p5823R9932j26162
$$ 117146 -83553 -275718 101913 -112508 -183429 3399 -69832 -125352 -201175 -101243 -227405
9045b27405P1959k19484J54624m2670H60b84565A63342j5783a8707j01714B3088
$$ -227405 -155446 -374930 -220306 -262976 860 -284565 163342 147559 -18707 -120421 23088
9033h4719k630B43408b60228A00980j8637N0600f3371H1206a97341A10155J12672
$$ -84719 -87349 243408 -260228 100980 82343 132943 -63371 81206 -197341 110155 222827
9022B22827a95229Q4763A55783r789b68184d3385q9074j05328C5108c82254i4838
$$ 222827 -195229 -110466 155783 145994 -268184 -43385 -132459 -237787 35108 -382254 -94838
9010E384a94395K5587A46049J94082A23837c7019D5098j2848b3792j14816m2146
$$ 5384 -194395 -168808 146049 340131 123837 -37019 45098 32250 -23792 -138608 -180754
8999a80754E7503a65545A7941a85446m7898j22974M8211k08822i6516B00305b09806
$$ -180754 57503 -165545 17941 -185446 -233344 -356318 -308107 -516929 -96516 200305 -209806
8987a21890j00565N7225A95206D4522a22261J7719B1514J67368i8045B38376J64907
$$ -121890 -222455 -165230 195206 44522 -122261 -104542 21514 188882 -98045 238376 403283
8976D03283j68026d11605a15932l784j48054b3979k21261A46898k6496a07734
$$ 403283 235257 -411605 -115932 -119716 -267770 -23979 -245240 146898 120402 -107734
8965a79795e8024A36518a35894b8510A267J63963g3259e109j75751r2660a21701
$$ -179795 -58024 136518 -135894 -28510 1267 165230 -73259 -5109 -180860 -273520 -121701
8953a97597H5332J16715a91209e319l65123A15230a61200l31855C173i2797A03174
$$ -197597 85332 202047 -191209 -5319 -370442 115230 -161200 -493055 3173 -92797 103174
8941E0037L1677A780a33604b3755r1291l8924p6142a09861k26286E6239b68981
$$ 50037 81714 1780 -133604 -23755 -115046 -153970 -230112 -109861 -336147 56239 -268981
8929C31815j18576a82697D5575J32551b18627A03463b84405B10656i3366j81229
$$ 331815 213239 -182697 45575 178126 -218627 103463 -284405 210656 -93366 -274595
8919b74595A59267K4952P0108J3320D4201J16527j3155C2345N9674L45307M26903
$$ -274595 159267 184219 254327 267647 44201 160728 147573 32345 92019 437326 864229
8908H64229M75304J375758K429573p58683B027777H69820C68716j7366A18030
$$ 864229 1339533 2715291 5144864 4386181 2027777 869820 368716 351350 118030
8898B46426J66645P0921i1415I2071Q8881a20993B82605A31645a21082K7089B0731
$$ 246426 413071 483992 -91415 92071 180952 -120993 282605 131645 -121082 -93993 20731
$$ [...]
##END NTUPLES=NMR SPECTRUM
##END=
