
##TITLE=AC1081_MACI02_5867994_ldfmXdodMP
##JCAMPDX= 6.0         $$ Bruker NMR JCAMP-DX V2.0
##DATA TYPE= NMR SPECTRUM
##DATA CLASS= NTUPLES
##ORIGIN= BRUKER
##OWNER= Administrator
$$ 1.72 TOPSPIN		Version 2.1
$$ 2012-03-31 01:52:31.281 -0500  Administrator@TOPSPIN
$$ Compression mode = diff/dup
##.OBSERVE FREQUENCY= 400.13188235
##.OBSERVE NUCLEUS= ^1H
##.ACQUISITION MODE= SIMULTANEOUS (DQD)
##.ACQUISITION SCHEME= undefined
##.AVERAGES= 64
##.DIGITISER RES= 22
##SPECTROMETER/DATA SYSTEM= spect
##.PULSE SEQUENCE= noesygpps1d.comp
##.SOLVENT NAME= COFFEE_meoh
##.SHIFT REFERENCE= INTERNAL, COFFEE_meoh, 1, 14.96676
##AUDIT TRAIL= $$ (NUMBER, WHEN, WHO, WHERE, PROCESS, VERSION, WHAT)
$$ ##TITLE= Audit trail, TOPSPIN		Version 2.1
$$ ##JCAMPDX= 5.01
$$ ##ORIGIN= Bruker BioSpin GmbH
$$ ##OWNER= Administrator
$$ $$ C:\Bruker\TOPSPIN/data/COFFEE/nmr/AC1081_MACI02_5867994_ldfmXdodMP/12/pdata/1/auditp.txt
$$ ##AUDIT TRAIL=  $$ (NUMBER, WHEN, WHO, WHERE, PROCESS, VERSION, WHAT)
(   1,<2012-03-31 01:52:26.593 -0500>,<Administrator>,<TOPSPIN>,<go>,<TOPSPIN 2.1>,
      <created by zg
	started at 2012-03-31 01:40:55.000 -0500,
	POWCHK enabled, PULCHK disabled,
       configuration hash MD5:
       1A 1E CE 29 27 FD 77 03 67 4E F0 E3 C4 B2 CB 90
       data hash MD5: 64K
       6E 27 D9 9A 3D DC F0 5A 35 EE FB 8F FE 76 D1 0D>)
(   2,<2012-03-31 01:52:29.281 -0500>,<Administrator>,<TOPSPIN>,<proc1d>,<TOPSPIN 2.1>,
      <Start of raw data processing
       efp LB = 0.3 FT_mod = 6 PKNL = 1 PHC0 = 0 PHC1 = 0 SI = 128K 
       data hash MD5: 128K
       63 2B 06 44 B6 51 3A 6D 98 55 A3 6B 57 44 DA 30>)
(   3,<2012-03-31 01:52:30.515 -0500>,<Administrator>,<TOPSPIN>,<proc1d>,<TOPSPIN 2.1>,
      <pk PHC0 = 32.62939 PHC1 = 0 
       data hash MD5: 128K
       41 DB BD 32 F5 DE 34 49 87 70 0D D7 71 2A 3D 04>)
(   4,<2012-03-31 01:52:30.750 -0500>,<Administrator>,<TOPSPIN>,<proc1d>,<TOPSPIN 2.1>,
      <abs ABSG = 1 
       data hash MD5: 128K
       51 47 82 B8 4F E2 76 91 9E D2 8B CD 39 2B F4 44>)
(   5,<2012-03-31 01:52:30.828 -0500>,<Administrator>,<TOPSPIN>,<proc1d>,<TOPSPIN 2.1>,
      <abs ABSG = 2 
       data hash MD5: 128K
       57 BC 8D 8A 9D C1 74 2D 15 86 BC D4 8C F8 C9 25>)
(   6,<2012-03-31 01:52:30.968 -0500>,<Administrator>,<TOPSPIN>,<proc1d>,<TOPSPIN 2.1>,
      <abs ABSG = 3 
       data hash MD5: 128K
       6F 1D F0 FA B4 EB 3B 30 4D 7F 3A 06 62 BD EA 02>)
(   7,<2012-03-31 01:52:31.140 -0500>,<Administrator>,<TOPSPIN>,<proc1d>,<TOPSPIN 2.1>,
      <abs ABSG = 4 
       data hash MD5: 128K
       BA 9B 52 BA 12 7B C9 AB 2A 09 F7 86 ED 22 AC CC>)
(   8,<2012-03-31 01:52:31.187 -0500>,<Administrator>,<TOPSPIN>,<proc1d>,<TOPSPIN 2.1>,
      <abs ABSG = 5 
       data hash MD5: 128K
       33 A2 7E 39 19 09 7A BE 05 C5 43 8D E5 C1 29 96>)
$$ ##END=
$$ 
$$ $$ hash MD5
$$ $$ 2D DA 3B 42 4C 6F 7E 34 43 CB 9E 64 C9 A7 11 AC
##$RELAX= 
##$RELAX= 
##$RELAX= 
##$RELAX= 
##$RELAX= 
##$RELAX= 
##$RELAX= 
##$RELAX= 
$$ Bruker specific parameters
$$ [...]
##$TP07= 0
##$TPNAME0= <>
##$TPNAME1= <>
##$TPNAME2= <>
##$TPNAME3= <>
##$TPNAME4= <>
##$TPNAME5= <>
##$TPNAME6= <>
##$TPNAME7= <>
##$TPOAL= (0..7)
0.5 0.5 0.5 0.5 0.5 0.5 0.5 0.5
##$TPOFFS= (0..7)
0 0 0 0 0 0 0 0
##$TUNHIN= 0
##$TUNHOUT= 0
##$TUNXOUT= 0
##$USERA1= <user>
##$USERA2= <user>
##$USERA3= <user>
##$USERA4= <user>
##$USERA5= <user>
##$V9= 5
##$VALIST= <valist>
##$VCLIST= <CCCCCCCCCCCCCCC>
##$VD= 0
##$VDLIST= <DDDDDDDDDDDDDDD>
##$VPLIST= <PPPPPPPPPPPPPPP>
##$VTLIST= <TTTTTTTTTTTTTTT>
##$WBST= 2048
##$WBSW= 25
##$XGAIN= (0..3)
0 0 0 0
##$XL= 0
##$YL= 0
##$YMAX_a= 10868352
##$YMIN_a= -6321942
##$ZGOPTNS= <>
##$ZL1= 120
##$ZL2= 120
##$ZL3= 120
##$ZL4= 120
##$ABSF1= 14.96676
##$ABSF2= -5.585771
##$ABSG= 5
##$ABSL= 3
##$ALPHA= 0
##$AQORDER= 0
##$ASSFAC= 0
##$ASSFACI= 0
##$ASSFACX= 0
##$ASSWID= 0
##$AUNMP= <proc_prof1d_extract.lims>
##$AXLEFT= 0
##$AXNAME= <>
##$AXNUC= <1H>
##$AXRIGHT= 0
##$AXTYPE= 0
##$AXUNIT= <>
##$AZFE= 0.1
##$AZFW= 0.1
##$BCFW= 0
##$BC_mod= 0
##$BYTORDP= 0
##$COROFFS= 0
##$CY= 15
##$DATMOD= 1
##$DC= 0
##$DFILT= <>
##$DTYPP= 0
##$F1P= 0
##$F2P= 0
##$FCOR= 0.5
##$FTSIZE= 131072
##$FT_mod= 6
##$GAMMA= 0
##$GB= 0
##$INTBC= 1
##$INTSCL= 1
##$ISEN= 128
##$LB= 0.3
##$LEV0= 0
##$LPBIN= 0
##$MAXI= 10000
##$MC2= 0
##$MEAN= 0
##$ME_mod= 0
##$MI= 0
##$NCOEF= 0
##$NC_proc= -3
##$NLEV= 6
##$NOISF1= 0
##$NOISF2= 0
##$NSP= 0
##$NTH_PI= 0
##$NZP= 0
##$OFFSET= 14.96676
##$PC= 1
##$PHC0= 32.62939
##$PHC1= 0
##$PH_mod= 1
##$PKNL= yes
##$PPARMOD= 0
##$PPDIAG= 0
##$PPIPTYP= 0
##$PPMPNUM= 2147483647
##$PPRESOL= 1
##$PSCAL= 4
##$PSIGN= 0
##$PYNMP= <proc.py>
##$REVERSE= no
##$SF= 400.130005543941
##$SI= 131072
##$SIGF1= 0
##$SIGF2= 0
##$SINO= 400
##$SIOLD= 131072
##$SPECTYP= <>
##$SREGLST= <1H.CDCl3>
##$SSB= 0
##$STSI= 131072
##$STSR= 0
##$SW_p= 8223.68421052632
##$SYMM= 0
##$S_DEV= 0
##$TDeff= 65536
##$TDoff= 0
##$TI= <>
##$TILT= no
##$TM1= 0
##$TM2= 0
##$TOPLEV= 0
##$USERP1= <user>
##$USERP2= <user>
##$USERP3= <user>
##$USERP4= <user>
##$USERP5= <user>
##$WDW= 1
##$XDIM= 131072
##$YMAX_p= 437854851
##$YMIN_p= -213981352
##$CURPLOT= <Network HP LaserJet P1505>
##$CURPRIN= <$Network HP LaserJet P1505>
##$DFORMAT= <normdp>
##$LAYOUT= <+/1D_H.xwp>
##$LFORMAT= <normlp>
##$PFORMAT= <normpl>
##$SURQMSG= 1
$$ End of Bruker specific parameters
$$ ---------------------------------
##NTUPLES= NMR SPECTRUM
##VAR_NAME=  FREQUENCY,     SPECTRUM/REAL,   SPECTRUM/IMAG
##SYMBOL=    X,             R,               I
##VAR_TYPE=  INDEPENDENT,   DEPENDENT,       DEPENDENT
##VAR_FORM=  AFFN,          ASDF,            ASDF
##VAR_DIM=   131072,        131072,          131072
##UNITS=     HZ,            ARBITRARY UNITS, ARBITRARY UNITS
##FACTOR=    0.0627417313425165, 1,          1
##FIRST=     8223.62146879498, 2172,         -101533
##LAST=      0,             4034,            -102016
##MIN=       0,             -213981352,      0
##MAX=       8223.62146879498, 437854851,    0
$$ Real data points
##PAGE= N=1
##DATA TABLE= (X++(R..R)), XYDATA
$$ [...]
64842 259739 262831 266434 270481 274551 278660 283631 289986 297020 303620 309520 315189 321071 327773 336490
64828 336490 348021 361189 373108 381490 386366 389576 393017 397507 402752 407990 412738 417054 420993
64815 420993 423995 425202 424367 422082 419054 415486 411276 406429 401120 395515 389662 383463 376907 370575
64801 370575 365634 362764 361101 358841 355047 350351 345867 342045 338773 335766 332344 327521 321065 314174
64787 314174 308416 304192 300631 296648 291543 285023 277559 270633 265825 263439 262518 262184 262318 262920 263516
64772 263516 263590 263166 262644 262344 262278 262073 261124 259298 257566 257330 258881 261045 262669 263905 265606 267929 270191
64755 270191 271903 273313 274893 276810 279110 282046 285858 290300 294793 299274 304633 311806 320324 328321
64741 328321 334437 339390 345085 352368 360279 367380 372982 376875 378645 377903 374929 370717 366465 362999
64727 362999 360318 357588 353923 349220 343951 338412 332971 328859 327492 328576 329975 330205 330196 331752 335053
64712 335053 338715 341735 344207 346463 348712 351531 355676 361274 367832 374981 382400 389216 394575 398993
64698 398993 404204 411423 420450 430565 441214 451511 460102 466312 470822 474726 478467 482165 486210
64685 486210 490809 495507 499970 504777 510538 516467 520785 522625 522650 521495 518342 511813 502105 491542
64671 491542 482558 475341 467958 458914 449138 440986 435552 431645 427443 422563 418181 415486 414297 413130
64657 413130 410660 407315 405121 405494 407555 409477 411104 413852 417922 421280 422293 422022 422732 425149 428532
64642 428532 432415 436504 439355 439138 435885 431408 426787 421468 415153 408868 403317 397624 390806 383500
64628 383500 377057 371690 366598 361390 356338 351608 347253 343709 341453 340357 340062 340653 342197 344089 345859
64613 345859 348290 352527 358138 363264 366875 369764 373062 376970 381458 387021 393695 400171 404996 408280
64599 408280 411157 413778 414922 413731 410860 407533 404160 400477 396531 392775 389316 385805 382370 380121
64585 380121 380159 382121 384182 384606 383093 380632 378548 377935 379499 383259 388411 394057 400314 408433 419629
64570 419629 433862 449735 465497 480181 493964 507326 519837 530075 536941 540606 541760 540418
64558 540418 536221 529597 521627 512703 502360 490725 479213 469271 461043 453720 446544 439016 430809
64545 430809 422196 414076 406986 400496 394090 388092 383029 378650 374482 370928 368807 367988 367493 366963 367096
64530 367096 368480 370891 373999 377965 382857 388092 393028 397789 403011 408927 415138 421373 428195 436599
64516 436599 446789 457607 467607 476607 485598 495109 504536 513395 522174 531102 538909 543910 545834
64503 545834 545496 543158 538507 531871 523968 514465 502302 487706 472489 457960 443916 430195 417815
64490 417815 407748 399683 392831 386949 381827 376887 372314 369551 369537 371261 373255 375657 379376 383824
64476 383824 387116 388393 388469 388182 387509 386569 386092 386151 385381 382325 377164 371561 367056 364013 361896 360137
64460 360137 358613 357348 355948 353715 350531 347376 345650 346076 348393 351744 355139 358010 360690 363915
64446 363915 367417 369637 369542 368303 368330 370918 375588 381460 388237 395739 403481 411157 419033 427494 436397
64431 436397 444941 452007 456961 460513 464483 470115 476816 483057 488152 492422 495992 498475 499849 500728
64417 500728 501573 502327 502882 503192 502912 501681 499795 497893 496001 493766 491642 490830 491823 493974 496770 500643
64401 500643 506167 513334 521940 531865 542577 553214 563519 573811 583682 591889 598231 604531 612807
64388 612807 623144 634188 645083 656107 668034 681791 698241 717442 738522 760925 785203
64377 785203 811836 840142 869570 901448 938013 979900 1026090 1076354 1132312 1195679 1266667
64366 1266667 1344726 1429835 1522346 1622376 1730265 1847219 1974673 2112971 2261008 2416851
64356 2416851 2578126 2741690 2903395 3058705 3203953 3337223 3457815 3564475 3654041 3721992
64346 3721992 3764446 3779775 3768844 3734190 3678729 3604424 3511814 3401134 3274020 3133835 2984251
64335 2984251 2827988 2667139 2504277 2342709 2185692 2035724 1894529 1763285 1642474
64326 1642474 1531581 1429405 1335063 1248742 1171212 1102576 1041838 987826 940105 898619 862708
64315 862708 830858 801374 773106 745883 720709 699264 682464 669295 657449 645196 632364
64304 632364 619503 606724 593655 580164 566664 553637 541058 528385 515173 501748 489144
64293 489144 478254 469146 461355 454675 449402 445840 443806 442615 441544 440527 440407 442018 444769 446750
64279 446750 446795 445856 445530 445701 444798 442148 438676 435050 430572 424647 418230 412751 408304 403954 399396 395307
64263 395307 392314 390554 390064 390640 391349 391102 389871 388558 387595 386531 385270 384703 385424 386460 386144 384079
64247 384079 381594 380232 380186 380201 378654 374767 369122 363167 358072 353942 350158 346382 343059 340884 339859
64232 339859 339049 337405 334758 331824 329244 327025 325114 323982 324052 324919 325908 327216 329539 332502 334662
64217 334662 335598 336971 340691 346734 353626 360402 367028 373434 379461 385548 392243 398919 404153 407479
64203 407479 409647 410956 410627 408370 405412 403170 401840 401093 401337 403276 406680 410468 413625 415379 414999
64188 414999 412275 407816 402190 395207 386837 378268 371019 365218 359732 353775 347541 341577 336585 333516
64174 333516 332631 332476 331107 328495 326547 326481 327424 328003 328039 327958 327683 327124 327013 328188 330411 332695 334456
64157 334456 335678 336278 336129 335569 335251 335430 335749 335629 334613 332516 329617 326654 324435 323422 323583 324301
64141 324301 324564 323754 322295 321011 320019 319087 319012 321375 326346 331844 335707 337966 340193 343381 347592 353098
64125 353098 360640 370462 381864 393766 405370 416654 428658 442595 457815 471129 479121 480929
64113 480929 478023 471917 463313 453103 442567 432218 421652 410906 400941 392337 384551 377043 370336
64100 370336 365301 361965 359648 357734 355716 352869 348566 342937 336950 332050 329686 330531 333647 336893
64086 336893 338877 340467 343818 349850 357021 362770 365942 367603 369568 372414 375212 377049 378261 379803
64072 379803 381843 383592 384381 384266 383462 381705 378554 374176 369697 366847 366949 369825 373774 377135 379926
64057 379926 383560 389017 395878 403195 410683 418690 427467 436910 446759 456743 466678 476659 487045 498050
64043 498050 509403 520358 529981 537602 543408 548611 554651 561997 569855 577055 583126 588638 594717 602043
64029 602043 609971 616826 621372 623665 623943 621233 614130 602867 589509 575865 562251 548673 535987
64016 535987 524922 514777 504217 493089 482481 473151 464834 457255 451016 447049 445491 445491 446126 447365
64002 447365 449936 454098 458682 461842 462943 463251 464490 467109 470360 473621 477032 480991 485670 491171
63988 491171 497734 505621 514955 525658 537340 549290 560869 572009 583197 594935 607221 619453
63976 619453 630720 640244 647685 653015 656221 657314 656588 654444 650805 645083 637022 627413 617750 609290
63962 609290 602492 596955 591713 586116 580836 577573 577111 577937 577579 575248 572378 570413 568901 566304 562007
63947 562007 556732 551239 545580 539811 534658 530775 527675 524171 519984 516332 514543 514523 515132 515892 517559
63932 517559 520838 525139 529162 532483 536041 541074 548031 556695 566930 578821 592196 606450 621010
63919 621010 635653 650150 664030 677225 690897 706896 726121 747778 770528 793918 818253
63908 818253 843515 869189 895246 922736 953088 986902 1023531 1061813 1101380 1143385 1189808
63897 1189808 1241993 1300128 1364253 1435067 1513297 1598986 1692436 1795590 1911418 2041694 2186118
63886 2186118 2343721 2514268 2697887 2893960 3100894 3316665 3539358 3767460 3999677
63877 3999677 4233856 4465820 4689627 4899135 5089032 5254723 5392381 5499694 5575927 5620700
63867 5620700 5633072 5612025 5557194 5468767 5347568 5196166 5019552 4823973 4615000 4396821
63857 4396821 4172771 3945843 3719006 3495681 3279750 3074501 2881579 2701301 2533817
63848 2533817 2379571 2238891 2111769 1998018 1897192 1808295 1729850 1660276 1598063 1541857
63838 1541857 1490838 1445077 1405251 1371807 1344292 1321258 1300809 1281607 1263606 1247673 1234362
63827 1234362 1223334 1214002 1206318 1200618 1197078 1195738 1196967 1201551 1210161 1222735 1238490 1256840 1278378
63814 1278378 1304420 1335202 1369056 1404034 1439826 1477232 1516297 1556142 1596150 1635691 1672822
63803 1672822 1705163 1732363 1755898 1775886 1790042 1796667 1796677 1791400 1780305 1762638 1739637 1713043
63791 1713043 1682690 1647777 1609474 1569869 1529012 1485450 1439341 1392625 1346230 1299469 1252306
63780 1252306 1205852 1160261 1114547 1069096 1026077 986442 948660 911494 875943 843045 811684
63769 811684 780461 750304 723271 699510 677150 654737 632400 610997 591344 574033 558946
63758 558946 545077 531536 518351 505832 493889 482786 473650 467104 461980 456559 450641 445255 440692
63745 440692 436072 430684 424761 419026 414369 411625 410517 409033 405183 399486 394583 392091 390960 389283
63731 389283 386608 383681 380744 377182 372746 368370 365453 364488 364576 364334 363282 362106 361489 361169 360572 359898
63715 359898 359770 359887 358958 356366 353201 351030 349924 348417 345512 342146 340262 340648 342280 343839 345287
63700 345287 347432 350466 353640 356116 357273 356362 353044 348576 345353 344602 345346 346094 346551 346916 346665 345302
63684 345302 343628 342876 343066 343645 345348 349648 356175 362282 365869 367469 368961 371281 374174 377394 381222
63669 381222 386072 392070 398722 404896 409716 413655 418021 423185 428282 432994 438411 445328 452761 459203
63655 459203 464498 469171 472641 473658 472309 470048 467690 464821 461494 459021 458316 458591 458579 458183 457954 457645
63639 457645 456481 454670 453654 454713 457825 461905 465769 469067 472669 477910 484922 492031 497473 501460
63625 501460 505770 511454 517868 523948 529360 534026 537533 539669 540839 541337 540833 539307 537911 538019 539671
63610 539671 541755 543540 545258 547295 549634 552182 554923 557501 559142 559219 557575 554394 550205 545926 542171
63595 542171 538325 533018 525904 518511 512863 509519 507375 505228 503098 501959 502414 503952 505695 507711
63581 507711 511109 516586 523412 530250 536598 542906 549714 557452 566804 578340 591765 606302 621741
63568 621741 638265 655296 671610 686858 702092 718465 736163 754755 773732 792607 811642
63557 811642 832727 858263 888594 921756 956289 992903 1032636 1074950 1118976 1165137 1213829
63546 1213829 1263750 1313575 1364443 1418427 1474756 1529656 1579720 1623198 1657942 1681066 1692022
63535 1692022 1694067 1691130 1684522 1673987 1660500 1646166 1631989 1617367 1601394 1583280 1561636 1534686
63523 1534686 1501453 1462170 1417814 1370084 1321484 1274343 1229672 1187735 1149505 1116409 1088540
63512 1088540 1064305 1042374 1023171 1007976 997341 991074 989125 991418 996968 1004129 1012146 1021980 1035261
63499 1035261 1052629 1073387 1096512 1121580 1148671 1177886 1209373 1243621 1281267 1322459 1366715
63488 1366715 1413495 1462723 1514734 1570196 1630244 1695834 1765800 1835276 1896928 1944723 1976872
63477 1976872 1995306 2002852 2001294 1991656 1975288 1954175 1930531 1906388 1883159 1861007 1838665 1814255
63465 1814255 1786308 1753812 1715656 1670825 1619315 1562256 1500861 1435898 1368678 1301900 1238546
63454 1238546 1179895 1125221 1073455 1024539 979112 937603 900046 866381 836497 810111 786885
63443 786885 766528 748694 732949 718964 706438 694677 682683 670077 657682 646689 637331 628903
63431 628903 621086 614583 610029 606803 603595 600046 597081 595492 594874 594463 594439 595650 598251 601584 605509
63416 605509 610946 618470 626887 633892 638034 639684 640288 641058 642168 642791 641966 639714 637142 635291 634266
63401 634266 633796 634038 635175 636708 638107 639903 643160 647919 653208 658630 664718 671418 677667 683438 690980
63386 690980 702552 717451 732902 747885 764551 785274 809642 835529 862483 892638 928131
63375 928131 968820 1013202 1060789 1112420 1168207 1226051 1282447 1334081 1378412 1413804 1440360
63364 1440360 1460541 1477978 1495411 1514216 1535657 1561526 1593215 1631040 1675005 1725474 1782427
63353 1782427 1844560 1909736 1975829 2040339 2099640 2149689 2187764 2213219 2226782 2229846 2224289 2212042
63341 2212042 2194486 2172759 2148658 2124253 2100019 2073795 2042229 2003035 1955701 1900809 1839668
63330 1839668 1774463 1707734 1641260 1575826 1512175 1451533 1394966 1342859 1295539 1253840 1218327
63319 1218327 1188267 1162201 1139534 1120902 1107009 1097882 1093348 1093367 1097456 1104557 1114066 1126463 1142485
63306 1142485 1162265 1185815 1213698 1246362 1283293 1323763 1368008 1416660 1469305 1524682 1582182
63295 1582182 1641950 1703562 1765937 1828774 1892554 1956334 2016679 2069646 2113078 2146337 2168919
63284 2168919 2180470 2181482 2172986 2156199 2133492 2108795 2085319 2062817 2038279 2009309 1975662 1937552
63272 1937552 1894128 1844456 1789044 1729576 1667660 1604533 1541610 1480612 1423109 1370082 1321820
63261 1321820 1278272 1239848 1207694 1182495 1162761 1144834 1124879 1100513 1070753 1035614 996625
63250 996625 956989 919929 886608 856040 826902 798926 772699 748797 727326 707872 689704
63239 689704 672337 656046 641616 629479 619338 610722 603518 597658 592488 586864 580011 572140 564154
63226 564154 556875 550600 545174 540281 535697 531481 528011 525684 524416 523536 522335 520779 519657 520028 522445
63211 522445 526463 530759 533915 535457 536166 537315 539646 543179 547768 553299 559336 565091 570190 575271
63197 575271 581451 589298 598575 608842 619842 631237 642522 653584 665114 678023 692546 708305
63185 708305 725162 743485 763479 784802 807208 831091 856926 884495 913266 943294 975066
63174 975066 1008420 1042279 1075660 1108504 1141429 1175207 1210485 1247292 1284502 1320543 1355150
63163 1355150 1389798 1425793 1462441 1497880 1531325 1563642 1595775 1627379 1656945 1682556 1702376
63152 1702376 1715116 1720437 1718734 1710495 1696087 1675938 1650382 1619381 1582976 1542164 1499027 1456000
63140 1456000 1415297 1378664 1346916 1319676 1296278 1277045 1263074 1254819 1251680 1253080 1258949 1268798
63128 1268798 1281393 1296094 1313787 1335628 1361422 1390068 1421085 1454639 1490204 1526241 1561379
63117 1561379 1595257 1628084 1660011 1691056 1720976 1748863 1773307 1793254 1808509 1819240 1825281
63106 1825281 1826061 1820893 1809131 1790301 1764341 1731594 1692421 1646998 1595751 1539922 1481515 1422519
63094 1422519 1364206 1307168 1251979 1199647 1151240 1107105 1066709 1029361 994875 963442 935146
63083 935146 909921 887708 868221 850585 833680 817103 801627 788536 778479 771058 765409 761078
63071 761078 758056 755939 753483 749608 744824 740962 739240 739128 739423 739799 740773 742736 745838 750324 756007
63056 756007 761663 766043 769506 773560 778691 783808 788186 792686 798212 804032 808824 812823 817721 824559
63042 824559 832646 840514 847171 852426 856755 860983 865575 870240 874723 879771 886476 894680 902946 910248
63028 910248 916789 922749 927190 929058 928866 928675 930481 934978 941570 949121 956970 965760 977127 992146
63014 992146 1010182 1029564 1049145 1068899 1089406 1111460 1135986 1163551 1193754 1225565 1258351
63003 1258351 1292182 1327258 1363761 1402505 1445040 1492638 1545446 1602928 1664798 1731168 1802007
62992 1802007 1876772 1954488 2034123 2115230 2198328 2284229 2372721 2462421 2552247 2642471 2733645
62981 2733645 2824969 2914704 3002194 3088579 3175177 3261802 3346962 3428975 3506217 3576637 3637821
62970 3637821 3687738 3725077 3748791 3757644 3750332 3725853 3683787 3624787 3551395 3468221 3380364 3290898
62958 3290898 3200061 3107523 3015352 2928027 2849337 2780111 2719532 2667907 2626985 2597816 2579568
62947 2579568 2570960 2571989 2583522 2605509 2636151 2672763 2713212 2756758 2803811 2854791 2909089 2965244
62935 2965244 3022056 3079142 3136341 3193085 3248586 3302052 3352331 3397836 3437303 3470141 3495369
62924 3495369 3510556 3512613 3499566 3471049 3427450 3369529 3298767 3216923 3124896 3022937 2912468
62913 2912468 2796839 2679655 2563022 2448183 2337004 2231543 2132408 2038932 1951270 1871110
62903 1871110 1799538 1735099 1675090 1618439 1566239 1519448 1477237 1438092 1401527 1367613 1335334
62892 1335334 1302886 1269937 1238380 1209948 1183765 1157349 1129790 1102773 1078333 1056617 1036332
62881 1036332 1016454 996669 976689 956161 935327 915122 896485 879914 865649 853812 844223
62870 844223 836360 829587 823315 817152 811217 806072 801906 797912 793084 787635 783038 780503 779878 780082 780016
62855 780016 778894 776454 773342 770721 769030 767543 765545 763249 760945 757976 753484 747734 741575 734955
62841 734955 727306 719434 713511 710546 708989 706626 703017 699302 696413 694491 693467 693128 692844 692168 691553
62826 691553 691688 692412 693231 694590 697403 701291 704547 706194 706910 707535 707849 707540 707232 707484 707572 706444 704454
62809 704454 702901 702107 701062 699027 696497 694388 693058 692277 691457 689801 687031 684246 683337 685134 688666
62794 688666 692450 695876 698961 701553 703503 705268 707608 710705 713948 716528 718013 718574 718847 719294 719535
62779 719535 718667 716532 714216 712909 712702 712980 713565 714808 716850 719523 722852 726877 731039 734559 737642
62764 737642 741609 747504 755059 763336 771764 780058 787610 793785 798895 804357 811643 821264 832863 845905
62750 845905 859933 874249 888041 901237 914998 930703 948419 966936 985561 1005279 1027669
62739 1027669 1053137 1080838 1110033 1140818 1173628 1208758 1246469 1287105 1331036 1378877 1431541
62728 1431541 1489533 1552286 1618901 1689519 1765318 1847312 1936051 2032351 2136962 2249068 2366365
62717 2366365 2487328 2612183 2740570 2869240 2993437 3109990 3217714 3315178 3399635 3468097
62707 3468097 3517974 3546445 3550897 3530943 3488993 3428054 3349853 3256003 3149986 3036345 2917964
62696 2917964 2795442 2669488 2542932 2419702 2302367 2191291 2085810 1985446 1890071 1799722
62686 1799722 1714823 1636315 1565038 1500943 1443141 1390642 1342815 1299308 1260061 1225479 1196053
62675 1196053 1171377 1149830 1129668 1110393 1092903 1078435 1067496 1059597 1053722 1049229 1046430 1046196
62663 1046196 1049029 1054899 1063934 1076487 1092125 1109396 1127337 1146684 1168757 1193681 1220813 1250488
62651 1250488 1283995 1321836 1363427 1408858 1459653 1517041 1580617 1649584 1724411 1806212 1895119
62640 1895119 1990496 2092408 2201543 2317370 2437341 2558420 2678930 2798513 2916459 3030285
62630 3030285 3135790 3228375 3304528 3362287 3400487 3417953 3413675 3387610 3340887 3275228 3192447
62619 3192447 3094622 2984471 2865223 2739972 2611241 2481269 2352668 2228349 2110496 1999724
62609 1999724 1895560 1797586 1705732 1619807 1539535 1465225 1397650 1336934 1282007 1231437 1184316
62598 1184316 1140151 1098614 1059928 1024885 993798 965864 940166 916886 896758 879546 863853
62587 863853 848400 832839 817410 802537 788857 776975 766905 758055 749864 742129 734816 728073
62575 728073 722478 718731 716939 716583 717181 718433 719586 719358 717051 713579 710980 710893 713512 717698 721905
62560 721905 725267 728145 731716 736945 743990 752486 762157 773020 785100 798147 811707 825570 840253
62547 840253 856910 876573 899368 924466 950784 977884 1006575 1038769 1076291 1119361 1166318
62536 1166318 1215161 1265288 1317527 1372670 1430406 1489495 1548388 1605461 1659026 1707455 1749285
62525 1749285 1783143 1807735 1822097 1825999 1820057 1805169 1781552 1748496 1705618 1654338 1597572 1537937
62513 1537937 1476969 1416182 1357696 1302896 1251248 1201443 1153374 1108097 1066343 1028105 993377
62502 993377 962070 933314 906100 880799 858901 841011 826192 813553 803287 795585 789645 784604
62490 784604 780591 778000 776318 774586 772596 770848 769597 768668 768020 767849 768268 769458 772113 777246 785453
62475 785453 796441 809124 822056 834144 845385 856816 869548 883904 899517 915984 933462
62464 933462 952986 976201 1004281 1037048 1073674 1114082 1158862 1207877 1260172 1315619 1375365
62453 1375365 1439874 1507682 1577050 1647778 1719918 1791374 1858419 1918483 1971036 2015724 2051073
62442 2051073 2075536 2088761 2091249 2083513 2066156 2040376 2007899 1970663 1930691 1889836 1849432 1810422
62430 1810422 1773968 1741692 1715154 1695123 1681213 1672114 1666686 1665308 1669923 1682304 1702540 1729690
62418 1729690 1763222 1802706 1846341 1891173 1935235 1978512 2021181 2061595 2096641 2123673 2141599
62407 2141599 2150363 2150030 2140498 2121788 2094320 2058621 2014780 1962616 1902774 1837241 1768252 1696992
62395 1696992 1623961 1550313 1478037 1408975 1344363 1285040 1231191 1182074 1137123 1097180 1063341
62384 1063341 1034675 1008733 984726 964393 948886 936543 925144 914889 907300 902183 897793 893547
62372 893547 890369 888126 884702 878361 869623 859978 849846 838679 826263 813017 799488 786212 773644
62359 773644 761668 749525 736762 723973 712209 702039 693571 686938 682115 678546 675528 672821 670415
62346 670415 667993 665321 663066 662431 663674 665534 666491 666243 665517 664721 663436 661418 659644 659825 662826 667889
62330 667889 673528 678933 684227 689673 695185 700742 706851 714273 723406 734029 745487 757091 768659
62317 768659 780850 794667 810440 827570 845503 864661 886071 910386 937617 967473 999415
62306 999415 1032627 1066719 1102610 1142211 1187065 1237622 1293701 1354870 1420294 1489133 1561831
62295 1561831 1640474 1727065 1821439 1921193 2023288 2125137 2224366 2318299 2403902 2477919 2537286
62284 2537286 2580112 2606498 2617991 2616004 2600954 2572820 2531915 2478916 2414711 2340741 2259277
62273 2259277 2173036 2084620 1996373 1910358 1828091 1750445 1678047 1611504 1550843 1495080 1442992
62262 1442992 1394397 1350079 1310203 1273308 1237376 1201730 1167268 1134797 1103794 1073296 1043566
62251 1043566 1015986 991188 968042 944978 921816 899691 879523 861321 844925 830627 818824
62240 818824 809563 802635 797665 793886 790312 786523 782999 780451 779046 778397 777959 777321 776558 776505 778254 782160
62224 782160 787821 795217 805028 817255 830231 841955 852196 862523 874467 888321 903476 919074
62212 919074 934404 949599 966235 986478 1011265 1039646 1070001 1101367 1133638 1167437 1204294
62201 1204294 1246257 1294530 1348743 1408053 1472732 1544127 1623209 1709749 1802866 1901718 2005209
62190 2005209 2111273 2216833 2318434 2412714 2496346 2566153 2619872 2656851 2677609 2682645 2672069
62179 2672069 2646539 2607838 2557824 2496979 2424655 2340804 2247093 2146466 2042165 1937185 1833911
62168 1833911 1733923 1638502 1549449 1468781 1397252 1333588 1275706 1222494 1174066 1130567 1091367
62157 1091367 1055472 1022346 992189 965579 942916 923982 907835 893152 878748 864019 849178
62146 849178 835178 823161 813603 805925 799130 793001 788552 787136 789040 793109 797749 802155 806613 812093
62132 812093 819909 831205 845895 862159 877887 892847 908574 925904 943823 961531 980436 1002602
62120 1002602 1027708 1053060 1076542 1098222 1119091 1139841 1161404 1185265 1212261 1241948 1273929
62109 1273929 1309124 1348898 1393677 1443402 1498890 1561698 1632592 1710722 1794149 1880730 1968571
62098 1968571 2055939 2140554 2218862 2286664 2341078 2381598 2408977 2423737 2426308 2417774 2399282 2370897
62086 2370897 2331939 2282367 2223110 2155403 2080898 2002552 1924393 1849848 1780619 1717158 1659574
62075 1659574 1607947 1562388 1523109 1490151 1463023 1440965 1423488 1410252 1400682 1394371 1391598 1392670
62063 1392670 1396839 1402674 1409295 1416146 1421635 1423628 1421852 1418522 1415674 1413069 1409636 1405691 1402052 1397681
62049 1397681 1390101 1378330 1364002 1349313 1335061 1321138 1307818 1295776 1285462 1277080 1270901 1267257
62037 1267257 1266530 1269280 1275885 1285872 1298108 1311821 1326793 1342395 1357291 1370704 1383318 1396297
62025 1396297 1409988 1424255 1439555 1456779 1476376 1498444 1523386 1551523 1582227 1614396 1647840
62014 1647840 1683265 1720859 1759766 1799111 1838558 1877705 1916094 1954342 1994234 2036962 2082102
62003 2082102 2129083 2178781 2232608 2290517 2350811 2411260 2469343 2521955 2566377 2601650 2627992
61992 2627992 2644958 2651428 2647422 2634464 2613551 2583857 2544149 2494558 2436117 2369341 2294363 2212220
61980 2212220 2125092 2035329 1944878 1855640 1769708 1688836 1613706 1543750 1477766 1415053 1356168
61969 1356168 1302476 1254881 1213119 1176172 1143021 1112991 1085907 1061979 1041063 1021948 1003106
61958 1003106 984416 967429 953445 941876 931036 919893 908440 896962 885904 876087 868084 861480
61946 861480 855644 851093 849023 849320 850112 849886 849290 850056 852517 855045 855881 854853 852989 851004 848716 845852
61930 845852 842766 839912 836837 832207 824953 815062 803282 790499 777542 765044 753107 741362 729704
61917 729704 718708 709051 700822 693753 687727 682547 677495 671797 665516 659483 654359 650223 647025 644835
61903 644835 643446 642281 640999 639891 639348 639231 639164 639318 640388 642616 645257 647575 650295 655342 663702
61888 663702 674055 684145 693202 702299 712668 724766 738969 755817 774966 795029 815336 837001
61876 837001 861325 887869 915206 942943 971691 1001311 1030496 1058115 1083772 1106949 1126833
61865 1126833 1143465 1158089 1171643 1183386 1191477 1194629 1193039 1188126 1181559 1174233 1166074 1157037 1148091
61852 1148091 1140727 1135733 1133086 1132852 1135382 1140727 1148664 1159354 1173018 1188866 1205203 1220765 1235098
61839 1235098 1247549 1257027 1263135 1266491 1267347 1264860 1258296 1247955 1234207 1216618 1195126 1171328 1147458
61826 1147458 1124504 1102347 1081405 1062981 1047916 1035676 1024787 1013667 1001318 988008 975129
61815 975129 963719 953210 942317 930938 920352 911601 904585 898941 894933 893010 893027 894355 896511
61802 896511 899431 903423 909121 917230 928088 941559 957432 975719 996463 1019439 1044200 1070485
61790 1070485 1098610 1129418 1163603 1200854 1239791 1278837 1316965 1353484 1387581 1418549 1446259
61779 1446259 1470856 1491932 1508237 1518179 1520572 1515366 1504217 1490051 1475338 1460667 1445415 1429713
61767 1429713 1415179 1403737 1396377 1393375 1395080 1401891 1413545 1428677 1445038 1460066 1471595 1478348
61755 1478348 1479761 1475380 1464677 1447575 1424736 1396926 1364246 1326553 1284852 1241819 1200337 1161377
61743 1161377 1123782 1086376 1049910 1016407 986800 959948 934120 908856 885121 864211 846910
61732 846910 833242 822435 813322 805195 798126 792197 786864 781521 776353 772031 768804 766395 764508 762801
61718 762801 760675 757841 755010 753251 752627 752092 750738 748480 745546 742124 738657 735687 733138 730387 727305
61703 727305 724545 722583 721131 719807 718713 717996 717554 717546 718443 720058 721224 721129 720370 720059 720460 721162 721938
61686 721938 722556 722250 720446 717732 715220 713203 711364 709933 709357 708917 707077 703608 700170 698265 697674
61671 697674 697515 697754 698630 699443 699257 698581 699168 701927 705884 709497 712342 715083 718179 721181 723253 724136
61655 724136 724447 725182 727042 730217 734503 739280 743470 746002 746429 744814 740996 734528 725616 715622 706202
61640 706202 698232 691879 687119 683561 680106 675637 670047 664011 657914 651789 646296 642727 641484 641118
61626 641118 639473 635569 630110 624543 620011 616898 614813 613029 611187 609610 608863 609226 610630 612787 615152
61611 615152 617050 618082 618230 617493 615849 613704 611829 610468 609062 607375 606335 607019 609169 611578 613724
61596 613724 616016 618485 620281 620731 620054 618769 617290 616488 617522 620264 622738 623196 622321 622342 624313 627479
61580 627479 631138 635694 641412 647282 651958 655086 656999 657708 657078 655529 653648 651285 647955 644041 640565
61565 640565 637578 633795 628331 622018 616319 611645 607624 604541 603319 603979 605104 605308 604662 604176 604299
61550 604299 604421 603636 601521 598179 593825 588517 582169 574794 566755 558754 551460 545001 538800 532137 525226
61535 525226 519588 516626 515547 513449 508232 500946 494313 489370 484772 479326 473606 468533 463748 458538
61521 458538 453409 449515 446937 444573 441529 437788 433847 430498 428616 428238 428121 427055 425329 423871 422366
61506 422366 419597 415714 412658 411782 412193 412123 411126 410198 410398 412064 414945 418451 421916 424965 427410 428728
61490 428728 428229 426006 423270 421427 421060 421896 423241 424379 425118 426073 427814 429692 430338 429424 428021 426944
61474 426944 425943 425027 425272 427233 429505 430236 429570 429311 430400 431915 432587 432262 431639 431325 431492 432048 432869
61457 432869 433887 434785 434619 432438 428617 424882 422431 420732 418889 417295 416757 416678 415667 413759 412449
61442 412449 412319 412098 410573 408247 406379 405302 404394 403122 401470 399792 398691 398706 399737 401065 402129
61427 402129 402892 403369 403389 403028 402777 403059 404029 405869 408626 411605 413704 414618 415085 415773 416774 418385 421222
61410 421222 424893 427622 428219 427708 427928 429073 429861 429873 430303 432099 434424 435648 435340 434692 435012 436161 436676
61393 436676 435469 433158 431256 430183 428943 427156 426368 428325 432485 436436 438658 439736 440799 441992
61379 441992 443012 444187 446306 449854 454876 460984 466959 471042 472562 473061 474978 479084 483747 486765
61365 486765 487476 487019 487073 488599 491479 494911 498182 501149 504045 506900 509338 510928 511554 511506 511436 512177 514163
61348 514163 516755 518458 518210 516424 514499 513380 512832 511994 510233 507499 504382 502002 501240 501616 501389 499486
61332 499486 497075 496384 497886 499540 499224 497092 494910 493734 493283 493236 493925 495506 497439 499245 501071 503012
61316 503012 504557 505387 506118 507497 509258 510660 511920 514103 517511 521159 524162 526868 530206 534522 539490
61301 539490 544504 548672 551066 551832 552731 555795 561490 568697 576240 583692 590823 597232 602968 608964 616427
61286 616427 625792 636279 646136 653490 657620 659667 661758 665232 670016 675688 682481 690723 699698 707763
61272 707763 713716 717765 721006 724155 726998 729102 730673 732232 733471 733126 730503 726747 723980 723346 724394
61257 724394 726087 727763 729325 731391 735288 741997 750837 759944 768290 776578 785924 796464 807625 819046
61243 819046 830771 843153 856875 872232 887841 900817 909054 912858 913798 912745 909872 905881 901880
61230 901880 898123 893807 888241 881523 874135 866551 859259 852513 846025 839333 832547 826331 821235 817404
61216 817404 814792 813211 812277 811692 811497 811863 812949 815177 819018 823985 828488 831534 834171 838371 844718
61201 844718 852077 859288 866212 873156 880199 887308 894405 901108 906912 911702 915729 919270 922831 927321
61187 927321 933182 939400 944141 946433 946880 947014 948332 951298 954407 954882 951478 946150 941713 938459 934738
61172 934738 930402 927434 926869 927307 927277 927192 927847 928756 929462 931146 935157 940727 945736 949365 952743 957363
61156 957363 964027 972997 983946 995850 1007785 1019632 1031247 1041461 1049144 1055037 1061272 1068929 1077035
61143 1077035 1084190 1090260 1096273 1103456 1112727 1124324 1137306 1149900 1161070 1171759 1184159 1199455
61131 1199455 1216328 1231882 1244256 1254224 1263975 1274452 1284389 1291959 1296699 1299584 1301904 1304557 1307821
61118 1307821 1311068 1312941 1312422 1309721 1305879 1301857 1298326 1295757 1293960 1291734 1287778 1282034 1275717 1269938
61104 1269938 1264649 1258858 1251516 1242095 1230590 1217215 1202341 1186844 1171981 1158188 1144186 1128351
61092 1128351 1111203 1095480 1083180 1073495 1064383 1055152 1046410 1038250 1029849 1020542 1010121 998407 985799
61079 985799 974074 965218 959189 953907 947726 940958 934780 929698 925553 922143 919368 917446 917364 920398
61065 920398 926840 935904 947072 960502 975697 991108 1006208 1023022 1044084 1069206 1095651 1121576
61053 1121576 1147969 1176900 1208977 1243189 1278304 1313591 1348678 1383581 1418628 1453687 1487670
61042 1487670 1519451 1549026 1576929 1602521 1623930 1640042 1651702 1660306 1665894 1667463 1664743 1658800
61030 1658800 1650917 1641460 1629755 1614600 1595093 1571638 1546063 1520185 1494439 1468490 1442782 1418375
61018 1418375 1395366 1372745 1350138 1328502 1308530 1289563 1270980 1253812 1239885 1229763 1222496
61007 1222496 1217021 1212868 1209728 1207394 1206288 1207287 1210855 1216918 1225714 1237975 1253837 1272148 1291653
60994 1291653 1312789 1337524 1367060 1400250 1435010 1471093 1510662 1555947 1607198 1663286 1723314
60983 1723314 1786928 1853951 1924919 2001403 2084633 2174193 2269259 2370546 2479503 2596041 2718843
60972 2718843 2847793 2984040 3127547 3276745 3431243 3593021 3764532 3947748 4145694
60963 4145694 4362324 4599592 4856992 5135479 5439616 5774608 6144354 6554862 7016610
60954 7016610 7540202 8132248 8799469 9554859 10415771 11398369 12519145 13799349 15260387
60945 15260387 16916278 18778910 20863580 23157262 25550560 27805612 29630833 30830152
60937 30830152 31403318 31514804 31380786 31187197 31076973 31142607 31371344 31593262 31525038 30913173
60927 30913173 29667838 27883736 25756322 23483591 21217778 19060279 17067998 15261533
60919 15261533 13639765 12195118 10919278 9801459 8828318 7986401 7262016 6639321 6101568
60910 6101568 5634567 5227262 4869422 4551030 4264136 4003627 3765929 3548141 3348408
60901 3348408 3165861 2999879 2849895 2715330 2594575 2484377 2381333 2283893 2192042 2105460
60891 2105460 2023109 1944426 1869702 1799269 1733273 1672205 1616653 1566317 1520056 1477053 1437285
60880 1437285 1400727 1366719 1334373 1303210 1273229 1244545 1216945 1189818 1162768 1136297 1111282
60869 1111282 1087641 1064256 1040649 1017889 997192 978355 960414 943226 927509 913734 901818
60858 901818 891446 881844 871662 860126 848032 836665 826104 815680 805770 797760 792117 787794
60846 787794 783887 780731 778749 777198 774840 771312 767092 762522 757683 753158 750141 749392 750348 751616 752333
60831 752333 752697 753072 753108 752256 750847 749852 749506 749026 747882 746485 745153 743390 740996 739160 739337 741376
60815 741376 743676 745082 745879 747152 750006 755199 762568 770742 778349 785753 794912 807127 821411 835317
60801 835317 846942 855966 863184 869523 875527 881641 888614 897059 906505 915590 923726 931965 941454 951596
60787 951596 960802 968802 976889 985778 994553 1002305 1009690 1017942 1027093 1036255 1045290 1055094 1066157 1077858
60773 1077858 1089535 1101481 1114255 1127583 1140832 1154466 1170017 1188133 1207401 1225871 1243301
60762 1243301 1261005 1279631 1298123 1315114 1330302 1343865 1355286 1363653 1368771 1371067 1370518 1366459
60750 1366459 1358576 1347437 1333748 1317549 1298509 1276824 1253451 1229434 1205193 1180614 1155717
60739 1155717 1131001 1107038 1083967 1061612 1040073 1020028 1002422 987757 975296 962988 948923
60728 948923 933343 918632 906645 896653 886747 876560 867243 859120 851026 842101 832657 822834 812033
60715 812033 800450 789833 781668 775643 770767 766837 763676 759999 754522 747680 741059 735523 730887 726755
60701 726755 722431 716499 707922 697577 687588 679122 671700 664541 657597 651173 645286 639615 633748 627681
60687 627681 622361 619137 618123 617779 616890 616194 616923 618368 618171 614859 608981 601981 595058 588960 583786
60672 583786 578965 574237 570314 567708 565493 562603 559884 559163 560313 561026 559885 558138 557683 558627 559610
60657 559610 559605 558598 557156 555956 555128 553664 550141 544483 538420 533725 530461 527324 523236 518254 513259
60642 513259 509077 505731 502498 498843 495100 491949 489701 488557 488901 490408 491390 490287 487654 485500 484711
60627 484711 484356 483521 482467 481730 481312 481255 481985 483648 485836 488258 490877 493338 495189 496702 498511 500561
60611 500561 502600 505510 510480 516727 521889 525130 527940 531119 533024 532256 530428 530478 533319 537758 542746
60596 542746 547921 552577 556002 558762 562174 566476 570745 574629 578968 584459 590613 596301 600729 603807
60582 603807 606004 607737 608471 606797 602023 595354 588781 583104 577846 572762 568360 564808 561349 557249
60568 557249 552796 548929 546128 543900 541263 537688 533636 530138 527771 526224 524790 522956 520496 517604
60554 517604 515194 514504 515922 518535 521138 523153 524161 523273 519878 514909 510584 508651 509132 510659 511831
60539 511831 512403 513409 516048 520337 525019 528732 530907 531675 531683 532187 534426 538393 542720 546194 548775 550853
60523 550853 552392 553458 554820 557137 560098 563081 566119 569467 572954 576823 582608 591675 602970 613565
60509 613565 621842 629128 637811 648688 660691 672472 683441 693367 701654 707347 709822 709336 706790
60496 706790 703000 698470 693755 689449 685511 681241 676543 672845 672011 674405 678757 684034 690777 700214
60482 700214 712514 726442 740687 754998 769736 784599 798353 809881 818919 825522 829481 830936
60470 830936 831025 830960 830645 829104 826149 822628 819127 815588 812329 810141 808959 807686 805884 804545 804640 806082
60454 806082 808803 813420 819701 825609 829429 832211 836714 844438 854944 867640 882808 900982 922503
60441 922503 947571 975806 1006040 1037664 1071993 1111093 1155202 1202165 1249123 1293611 1333202
60430 1333202 1365614 1389647 1404985 1410722 1405093 1387166 1358087 1320282 1276080 1227417 1176155 1124039
60418 1124039 1072596 1023294 977435 935622 897593 862735 830655 801364 775231 752699 733766
60407 733766 717764 703806 691223 679526 668457 658422 650168 643465 636738 628782 620380 613388 608618
60394 608618 605368 602497 599071 594478 589053 584311 581405 579585 577198 573899 570621 567685 564458 560829
60380 560829 557483 554515 551308 548145 546337 546108 545822 544214 542194 541382 541828 542255 541856 540771 539322 537744
60364 537744 536417 535503 534636 533599 533030 533779 535742 537935 539592 540761 541985 543798 546349 549099 550982
60349 550982 551222 549995 548251 547174 547910 551194 556625 562416 566454 567914 567870 568288 570243 572932 574516
60334 574516 574150 572970 572813 574287 576729 579758 583888 589340 595129 599922 603383 606149 608750 611043 612734
60319 612734 614210 616552 620473 625248 629252 631869 634208 637276 640087 640781 639376 638098 638844 641467 644826
60304 644826 648290 651634 654525 656941 659392 662048 664315 665895 667573 670230 673738 677651 682378 688619
60290 688619 695963 703077 709366 715564 722518 729963 736761 741966 745390 747309 747886 747020 744763 741633 738140
60275 738140 734099 728945 722800 716667 711432 707164 703608 700692 698144 695332 692151 689654 688979 689813 690540
60260 690540 689919 688186 686606 686432 688219 691663 695957 700648 706182 713436 722765 733877 746571 761099
60246 761099 777585 795595 814796 835707 859013 883921 907857 928288 944332 955974 962270 961545
60234 961545 953346 939037 920292 898298 874904 852849 833484 815309 796320 777172 760493 747644
60222 747644 737807 729902 723476 717683 711426 705048 700213 697375 694914 691606 688452 686899 686392 685019
60208 685019 681930 678014 674592 672278 670837 669451 667367 664518 661184 657125 651960 646420 641958 638735
60194 638735 635366 631214 627547 625629 625111 625402 627076 630435 633986 636218 637997 641220 645590 648702 649287
60179 649287 648611 648547 649773 652106 655124 657999 659858 660823 661890 663517 665145 666316 667420 669095 671582
60164 671582 674807 678477 682030 685080 687896 690850 693673 696022 698475 701919 706133 710166 714118 719251
60150 719251 726096 733683 741129 748809 757188 765348 771629 775475 778094 781535 787319 795539 804919 813943
60136 813943 822032 829425 836213 842080 846838 850489 852872 854107 855262 857481 860329 862137 862334 862260 863148
60121 863148 864478 865100 864944 864540 863661 861601 858329 854237 849085 842314 834432 827046 821318 817083 813546
60106 813546 810130 806467 802274 797651 793099 788924 784974 781229 778288 776864 776930 777739 778651 779597 780710
60091 780710 781918 783208 785025 787828 791213 794007 795596 796778 798869 802216 806051 809580 812623 815287
60077 815287 817752 820464 823915 827960 831844 835117 837971 840450 841978 842167 841590 841209 841344 841685 842023 842431
60061 842431 842935 843550 844474 845777 847031 847776 848240 849110 850610 852329 853910 855380 856786 858061 859294 860610
60045 860610 861678 862010 861851 862055 862676 862497 860565 857577 854964 853099 851354 849505 847884 846205 843634
60030 843634 840441 838434 838955 841313 843995 846670 849933 853655 856915 859504 862229 865415 868077 869112
60016 869112 868620 867554 866607 865977 865670 865325 863805 859572 851804 841141 829369 818231 808282 798776 788818
60001 788818 778504 768730 760154 752818 746591 741186 735678 728943 721061 713632 708116 704282 700884 697464
59987 697464 694769 693524 693534 694301 696157 700275 707295 715964 723598 728279 730417 731762 733282 734760 736149
59972 736149 738058 740609 742939 744412 745437 746385 746532 744855 741279 736440 730888 725269 720500 716723 712540
59957 712540 706384 698336 689711 681261 672918 665068 658770 654460 651350 648398 645272 642314 640121 639075
59943 639075 638701 637701 635304 632285 629815 627732 625135 622440 621296 622135 623242 623011 622054 622201 624114
59928 624114 626851 629372 631646 634214 637124 639595 640920 641802 644158 648855 654035 656838 656807 656418 657963
59913 657963 661155 664273 666356 667335 667019 665349 663229 661945 661769 661893 661623 660964 660144 659221 658207 657113
59897 657113 655956 655037 654936 655749 656569 656378 655353 654646 654884 655439 655282 654037 652039 649849 647984 646846
59881 646846 646558 646936 647628 648184 648074 646958 645059 642980 640985 638739 635989 633232 631193 629779 628194
59866 628194 626284 625134 625770 627797 630089 632435 635409 638744 641251 642799 644924 648491 652048 653992
59852 653992 655437 658960 664769 670160 673102 674569 676576 679544 682818 686501 691241 696760 701940 706150
59838 706150 709409 711348 711104 708523 704828 701846 700862 702223 705516 709903 714468 718583 722239 726189 731416
59823 731416 737856 743840 747665 749913 753282 759704 768422 777374 785489 792742 798825 803084 805425 806176
59809 806176 805249 802510 798781 795279 792004 787942 783174 779600 778870 780519 782905 785394 788730 793621 799902
59794 799902 807147 815400 824845 834871 843747 849569 851820 851973 852168 853274 854601 855433 856040 856717 856494
59779 856494 853663 847507 838854 828944 818421 807607 797061 787322 778398 770015 762307 755903 751314
59766 751314 748501 747103 746801 747272 747838 747347 744722 739973 734745 731371 730911 732114 732636 731188 728099 724094
59750 724094 719432 714554 710683 708850 708621 708513 707613 706229 705053 704437 704530 705286 705939 705029 701563 695947
59734 695947 689455 683064 677163 672032 667886 664388 660674 656236 651594 647880 645826 645216 645118 644453 642500
59719 642500 639290 635742 633166 632253 632517 632947 633199 633811 635225 637043 638589 639913 641759 644526 647684
59704 647684 650347 652165 653489 654817 656394 658369 661032 664540 668457 672036 675176 678631 682797 686724
59690 686724 689144 690358 692188 695902 701062 706652 712316 717948 723096 727666 732465 738068 743805 748856
59676 748856 753685 759105 764387 767839 769158 769660 770122 770001 769323 769713 772464 776652 780311 782727 784473
59661 784473 785823 786484 786775 787731 789679 791573 792318 792241 792637 794098 795872 797059 797964 799766 802882 806133
59645 806133 807835 807563 806661 807080 809642 813165 815394 815296 814488 815586 818921 821893 822266 821050 820992 823012
59629 823012 825718 828057 830588 833679 836006 835796 832881 828829 825476 823544 822197 819691 815014 809093
59615 809093 804006 800961 799423 797989 795480 791518 786961 783548 781984 780584 776992 771177 765249 760347
59601 760347 755505 750084 745485 743326 743173 743231 742354 740462 737904 735404 733938 733762 734185 734881 736496 739314
59585 739314 742352 744691 746685 748870 750669 751328 751234 751096 750577 749027 746928 745298 744148 742797 741312
59570 741312 740388 740103 739868 739368 738547 737104 735111 733675 733735 734484 734169 732165 729106 725278 720470 715380
59554 715380 711634 709875 708866 706995 704040 701262 700272 701779 704853 707558 708932 709949 711736 713406
59540 713406 712992 710335 707532 706166 705410 703540 700386 697508 696376 697002 698254 699213 700129 701895 704675
59525 704675 707586 709860 711439 711938 710187 705987 701435 698931 698212 696860 693565 689341 685441 681686 677395
59510 677395 672709 668346 664944 663152 663505 665605 667981 669216 668922 667559 665976 665153 665672 667247 669287
59495 669287 671925 675881 681278 687222 692571 696693 699680 702421 706068 710762 715382 719418 724398 732201
59481 732201 742556 753739 765322 778360 793065 808433 824550 842941 863422 882223 894674
59470 894674 898993 896731 890677 883362 876624 871202 866826 863148 860236 858046 856369 855652 856890 860099
59456 860099 863794 866455 867646 867330 865249 861753 858129 855139 851963 847378 841324 834656 828080 821953
59442 821953 816244 810025 801911 791781 781324 772223 764685 758417 753833 751199 749573 747880 746357 745777
59428 745777 745996 746493 747686 750257 753591 756324 758311 760754 764553 769731 776449 785240 795889 807071
59414 807071 817495 826776 835041 842369 848767 854185 858450 861650 864545 868029 872203 876352 879771 882122
59400 882122 883313 883733 884646 887654 893514 901680 910965 920466 930036 940197 951468 963661 976201 989263
59386 989263 1003900 1020568 1038059 1054413 1068298 1078837 1084725 1084599 1078198 1066560 1051342 1034474
59374 1034474 1018009 1003345 990582 979082 968316 957783 946890 935937 926688 920743 917560 915199
59362 915199 912935 912111 914459 920668 930542 943301 957530 972021 987214 1004960 1026555 1052015 1081473
59349 1081473 1115599 1153113 1188557 1214166 1224681 1220252 1205274 1185299 1164856 1146715 1131995
59338 1131995 1120994 1114435 1113633 1118455 1124811 1125299 1113884 1090393 1059894 1027707 995810 964034 933117
59325 933117 905226 881954 862974 846707 831712 817559 805014 795356 789040 785073 781913 778689
59313 778689 775314 772171 770270 771051 775017 780821 786466 790982 794260 796102 796813 798206 802217 808336 813955
59298 813955 817660 820896 825941 833564 843334 854804 867316 879626 891071 902646 915866 930790
59286 930790 946129 961107 976349 992861 1010788 1029384 1047818 1065788 1083470 1100834 1117030
59275 1117030 1130705 1141029 1148198 1152928 1155818 1157224 1157166 1155095 1150275 1142671 1133037 1121989 1109693
59262 1109693 1096791 1084712 1074147 1063842 1051918 1038204 1024421 1012259 1002218 994262 988466 984628
59250 984628 982087 980563 980661 983039 987445 993068 999618 1007509 1016807 1026138 1032642 1033278 1026654 1013953 997956
59235 997956 981196 965213 951102 939673 930656 922763 915348 909378 905813 903652 900915 897411 895071
59222 895071 895221 896850 898283 899384 901120 903758 906652 909465 912648 916864 922644 930244 939166 948217
59208 948217 956846 965839 975729 985249 992865 999447 1007434 1017070 1025378 1029629 1030212 1029075 1026834 1022858
59194 1022858 1017113 1010227 1002306 993166 983451 974192 965386 956282 947012 938735 931945 925805 919541 913655
59180 913655 909340 907208 906876 907326 907583 907647 908827 912518 918393 924412 928870 931920 934808 938161 941400
59165 941400 943437 943511 941594 938303 934263 929376 922901 914437 904674 895017 886588 879626 873560 867476 860696
59150 860696 853241 845855 839554 835016 832255 830824 830407 831198 833466 836721 839681 841449 842572 844656 848880
59135 848880 854916 861107 865616 867756 868469 869429 871419 873766 875403 876205 877113 879219 882923 887660 892289
59120 892289 895987 898828 901187 902845 903567 904545 907928 914314 921848 928696 935236 942617 950207 956322 960968
59105 960968 965947 972220 979005 985889 994049 1004399 1015740 1025799 1033403 1038881 1042996 1046211 1048454
59092 1048454 1048939 1046646 1041554 1034979 1028195 1021224 1013477 1005027 996592 988690 981490 975116 969390 963548
59078 963548 956953 950036 943833 938605 933580 928181 922997 919222 917387 916880 916611 916045 915568 915836 916862
59063 916862 917981 918827 919953 922178 925488 928940 931638 933612 935866 939754 946116 954620 963999 973274
59049 973274 982727 993247 1004632 1015137 1023193 1029319 1035623 1043343 1051515 1058388 1063553 1067919 1071885
59036 1071885 1074647 1075631 1075787 1076634 1078385 1079880 1080338 1080365 1080902 1081735 1081617 1079668 1076137 1071796 1067096 1062216
59020 1062216 1057526 1053319 1048985 1043012 1034251 1022939 1010172 996799 983348 970631 959467 949742
59008 949742 940529 931388 922893 915682 909648 904269 899044 893378 886935 880549 875918 873770 872973 871979 870272
58993 870272 867754 863879 858643 853609 850385 848441 845915 842439 839594 838449 838182 837731 837484 838433 840511
58978 840511 842722 844501 846252 848724 852318 856788 861265 864712 866751 868098 870103 873842 879516 886575
58964 886575 894560 903815 915091 928271 942067 955291 967813 979731 990452 999619 1008373 1018253
58952 1018253 1028974 1038627 1046183 1052502 1058529 1063910 1068091 1071653 1075476 1079322 1082307 1084484 1087080 1091267
58938 1091267 1097356 1105122 1114255 1124357 1134907 1145440 1155632 1165162 1173701 1181185 1188029 1194801 1201505
58925 1201505 1207345 1211547 1214359 1216791 1219392 1221936 1224372 1227198 1230453 1233284 1235317 1237764 1242248 1249145
58911 1249145 1257996 1268763 1281349 1294489 1306852 1319194 1333763 1351291 1369910 1387372 1402977
58900 1402977 1416975 1429582 1441453 1453837 1467106 1479846 1490257 1497797 1502640 1504277 1501880 1495808
58888 1495808 1487725 1478981 1469517 1458580 1446220 1433751 1422698 1413315 1404355 1394336 1382781 1370144
58876 1370144 1357189 1344923 1334462 1325910 1317683 1307957 1296793 1285950 1276561 1267891 1258488 1247811
58864 1247811 1236654 1226602 1218948 1213383 1207955 1201207 1194081 1188677 1185540 1183582 1182464 1183268 1186384 1190388
58850 1190388 1193805 1196912 1201080 1207240 1215439 1225060 1235124 1245286 1256698 1270867 1287597 1305276
58838 1305276 1323125 1341611 1360499 1378532 1395651 1413503 1432655 1451046 1466562 1479690 1492307
58827 1492307 1505269 1518701 1533389 1549993 1567509 1584017 1598575 1611308 1622340 1631747 1639844 1646332
58815 1646332 1649831 1649282 1645108 1637908 1626951 1611262 1591491 1569296 1545499 1520201 1494192 1468779
58803 1468779 1444487 1421125 1398845 1378017 1358422 1339610 1321677 1304706 1288026 1271175 1254973
58792 1254973 1240317 1226455 1211937 1196910 1182917 1170573 1158942 1147282 1135908 1125056 1114178
58781 1114178 1102882 1091687 1081370 1072057 1063294 1054742 1046807 1040626 1036880 1034402 1030810 1025117 1018761
58768 1018761 1013311 1008350 1002893 997838 995227 995532 997282 999100 1000596 1001582 1002049 1002968 1005583 1009768 1014325
58753 1014325 1018867 1023984 1029478 1033960 1036603 1038102 1039480 1040975 1042336 1043198 1042885 1040884 1037800 1034936
58739 1034936 1032667 1030141 1026741 1022861 1018929 1014546 1009012 1002034 993734 984546 975238 966424 958133 950413
58725 950413 944007 939476 935918 931865 927473 924691 924908 927396 930320 932410 933379 933505 933151 932194 929889
58710 929889 925872 921054 916688 912717 908002 902109 895855 890121 885075 880591 876496 872491 868726 866267
58696 866267 865840 866345 865964 864665 864061 864698 865232 864838 864777 866575 869915 873401 876513 879843 884066 889531
58680 889531 896347 904051 911599 918238 924065 929405 934196 938380 942302 946313 950477 955061 960661 967336
58666 967336 974125 980057 985262 990555 996153 1001450 1006095 1010797 1016655 1023635 1030134 1034509 1037072 1039928
58652 1039928 1044739 1051316 1058657 1066261 1073680 1079739 1083404 1084956 1085304 1084614 1082548 1079162 1074369 1067117
58638 1067117 1056635 1044098 1031580 1019617 1007292 994411 981764 969243 955709 941327 928299
58627 928299 918432 911099 904267 896620 888210 879916 872556 865724 857548 846777 835081 825875 820655 817911
58613 817911 815821 814300 813825 813970 814253 815180 817408 820666 824322 828246 832518 837026 841836 847205 852868
58598 852868 858143 862903 867433 871124 872571 871370 868621 865362 861792 858326 855827 854115 851793 848394
58584 848394 845315 843764 843145 842464 841927 841953 841861 840825 839098 837062 834186 830407 827591 827832 830698 833777
58568 833777 835846 838107 842040 847216 851791 854607 856311 858401 861422 864378 866200 867356 869433 873452
58554 873452 879341 886675 894784 902343 908248 912988 917872 922881 926749 929214 931398 933617 934721 934314
58540 934314 933707 933669 933010 930701 927806 925868 924767 923659 922893 923301 924369 924675 923808 922790 923042 925683
58524 925683 931092 938337 945804 953022 960928 969725 977941 984688 991527 1000696 1012417 1025166 1037621
58511 1037621 1049203 1059762 1070083 1081689 1094946 1108385 1121162 1134925 1151690 1171084 1191547
58500 1191547 1213154 1236990 1262348 1286767 1308760 1328687 1347057 1363745 1378842 1392521 1403813
58489 1403813 1411019 1413703 1413189 1410986 1407738 1403678 1398931 1393247 1386370 1378655 1370463 1361190 1349845 1336451
58475 1336451 1321929 1306793 1290941 1274457 1257635 1240365 1222574 1205167 1189629 1176703 1166188
58464 1166188 1157690 1150711 1144289 1137622 1131085 1125875 1122778 1121716 1122009 1122391 1121432 1119001 1116888 1116969 1119091
58449 1119091 1121609 1123458 1124561 1124681 1123273 1120489 1117185 1113763 1109886 1105450 1101187 1098069 1096470 1095796
58435 1095796 1094774 1092536 1089768 1088257 1089008 1091382 1094275 1097163 1099669 1101371 1102859 1105760 1110647 1115817
58421 1115817 1119167 1120619 1121990 1125431 1132693 1144553 1159732 1175314 1189390 1202483 1215632 1228431
58409 1228431 1239976 1250237 1259101 1265438 1268622 1269628 1269198 1266478 1261239 1255853 1252854 1251797 1250752 1249660
58395 1249660 1249779 1250962 1252165 1253957 1257758 1263139 1268579 1274527 1282845 1293119 1302189 1307696 1309885 1309698
58381 1309698 1307410 1303488 1298614 1292390 1283930 1274141 1265647 1260210 1257817 1258162 1261016 1265170 1269293 1274093
58367 1274093 1281441 1290963 1299706 1305844 1310764 1316785 1324712 1334319 1345435 1357539 1369543 1380658 1390466
58354 1390466 1398032 1402370 1403973 1404395 1404164 1402545 1399278 1394861 1389167 1381703 1373368 1365978 1359776 1353388
58340 1353388 1346507 1340619 1336685 1334206 1333076 1334205 1337581 1341735 1345909 1350856 1356681 1361897 1365736 1369612
58326 1369612 1375106 1381919 1388848 1395372 1401298 1406118 1409766 1412946 1415982 1418385 1420239 1422865 1427506 1434330
58312 1434330 1443185 1454281 1467678 1483016 1499838 1517137 1532790 1545075 1554862 1564873 1576738 1590235
58300 1590235 1605214 1622164 1640665 1659218 1677031 1694360 1711010 1726455 1741510 1757750 1774938
58289 1774938 1791131 1805585 1819314 1832512 1844035 1854060 1864648 1876686 1888780 1900261 1912811
58278 1912811 1927747 1943991 1960236 1977115 1995628 2015243 2035125 2055627 2077145 2099000 2120851
58267 2120851 2143837 2169063 2196229 2224705 2254433 2284708 2313646 2340100 2364828 2388869 2412221
58256 2412221 2435012 2458276 2482521 2507036 2531635 2557529 2585387 2614046 2642297 2670547 2699762
58245 2699762 2730154 2761919 2795852 2832201 2870081 2908794 2948571 2989537 3031363 3074459 3119939
58234 3119939 3167860 3216999 3266808 3317960 3370671 3424293 3478966 3535749 3594641 3654375 3714692
58223 3714692 3777032 3842626 3911600 3984030 4059969 4138549 4219121 4302931 4391391 4483363 4577018
58212 4577018 4673626 4775991 4883644 4993646 5106135 5224784 5351272 5483553 5620272 5762552
58202 5762552 5910505 6062444 6218722 6382103 6553223 6730180 6913719 7107905 7314222
58193 7314222 7530070 7754832 7992113 8243838 8507651 8782927 9073962 9384003 9711299
58184 9711299 10054691 10418330 10807124 11221818 11662251 12131439 12633017 13168457 13739527
58175 13739527 14349111 14997112 15680702 16401597 17167783 17985111 18853064 19771940 20747489
58166 20747489 21784224 22880875 24037434 25260420 26556126 27925124 29369009 30896528
58158 30896528 32517795 34238883 36067500 38017270 40101059 42327686 44711224 47275847
58150 47275847 50045720 53039529 56282821 59817827 63695295 67968175 72702267 77982008
58142 77982008 83895718 90524793 97954391 106281045 115603839 126031435 137714744 150853126
58134 150853126 165648545 182264325 200824780 221406506 244016623 268657865 295441643
58127 295441643 324412200 354854598 384530208 409728923 426477586 432156385 426383425
58120 426383425 410740494 387840766 360449704 330963797 301196843 272371552 245239262
58113 245239262 220225272 197524092 177158600 159042613 143034874 128960094 116617003
58106 116617003 105800091 96319961 88001361 80675999 74191861 68424787 63272541 58644134
58098 58644134 54462589 50670367 47222149 44075939 41196640 38561046 36150702 33943604
58090 33943604 31918266 30059938 28355712 26787812 25337907 23993820 22746102 21582152
58082 21582152 20489661 19462333 18496599 17585909 16723407 15906924 15136062 14406962 13714647
58073 13714647 13057765 12436472 11848203 11289927 10762119 10266207 9800127 9360138 8944707
58064 8944707 8552891 8181362 7826891 7489553 7169729 6864165 6568759 6283178 6008920
58055 6008920 5744833 5488585 5240904 5004341 4778900 4562543 4355079 4158186 3972340
58046 3972340 3796709 3631337 3476609 3331425 3194502 3066580 2948752 2839582 2736583
58037 2736583 2639697 2550676 2469541 2394189 2323100 2256271 2193791 2135435 2081339 2031487 1984850
58026 1984850 1940266 1897458 1856222 1815870 1776636 1740083 1706596 1673976 1640254 1606350 1574127
58015 1574127 1543311 1512445 1481646 1452219 1424441 1397674 1371904 1347433 1323911 1301108 1279577
58004 1279577 1259142 1238176 1216065 1194830 1176256 1158913 1140347 1120995 1103435 1088606 1075138
57993 1075138 1061741 1047942 1033106 1017081 1001512 988416 977707 967904 958631 950249 941618 930831
57981 930831 918326 906957 898410 891203 882664 871512 858254 844379 831488 820124 809206 797292
57969 797292 784222 770824 757618 744816 732970 722287 711671 699653 686061 671856 657869
57958 657869 644688 633061 623226 614449 606350 599822 595342 591388 586270 580767 577025 575387 574242 572648
57944 572648 571051 569520 567345 564628 562444 561025 559323 556639 553173 548636 541896 532644 522194 512074
57930 512074 502803 494393 486977 480534 474875 470251 467107 465046 462948 460362 457974 456450 455643 455092 454515
57915 454515 453633 452290 450771 449289 447275 444179 440881 439139 439412 440395 441014 441758 443467 445857 448038
57900 448038 449807 451592 453573 455525 457339 459014 460150 459990 458281 455922 454447 454655 455889 456953 457591
57885 457591 458650 460885 464278 468508 473182 477413 480241 481962 484016 486962 489695 491540 493827 497925
57871 497925 502714 505820 506894 507885 510078 512558 513812 513358 511394 508094 503910 499646 495720 491886 487842
57856 487842 483338 477646 469856 460139 450052 441235 434244 428647 423601 418268 412379 406566 401618 397473
57842 397473 393682 390687 389564 390293 391366 391669 391884 393306 395798 397734 397772 396063 393742 391725 390323
57827 390323 389750 390407 392272 394382 395630 395978 396051 395508 392981 388211 382980 378901 375193 369950 362991 356095
57811 356095 350790 347234 345025 343718 342599 341156 339758 338748 337073 333371 328477 325204 325040 326422
57797 326422 326952 326175 325389 325707 327202 329342 331491 333331 335142 337237 338983 339229 337942 336606 336559 337679
57781 337679 339100 340339 341211 341448 341149 340986 341405 342124 342910 344109 345789 347094 347293 346888 346855 347235 347490
57764 347490 347989 350017 354059 358844 362566 364740 366566 369568 374006 378610 381749 382656 381416 378149 372901
57749 372901 366391 360191 355688 353012 351084 348416 343852 337197 329528 322590 317463 313979 311453 309513
57735 309513 307888 305881 302721 298488 294427 292104 292033 292978 292923 291215 289551 290114 292812 295267 295726 295063
57719 295063 295446 298026 302724 309302 317186 324531 329009 330092 329645 329742 330633 331532 332626 335027 338771 342079
57703 342079 343331 343014 342797 343091 342573 340055 335717 330242 324004 317828 313446 311921 312064 311462 308803 304316
57687 304316 298558 292173 286624 283527 282788 282612 281816 281043 281207 281869 281943 281167 280034 278775 277103 274623
57671 274623 271220 267556 265321 265999 268951 271641 272381 271856 271382 270925 269968 269136 269282 269651 268707 266474 264377
57654 264377 262776 260471 257039 253984 252711 252560 251826 249788 246845 243452 239968 237036 234964 233005 230233
57639 230233 227150 225543 226569 229564 232839 235036 235614 234791 233543 233129 233950 234999 234974 233828 232727 232446
57623 232446 232510 232276 232408 234521 239365 245886 252356 258133 264079 271490 280976 292379 305536 320922
57609 320922 339566 362332 389229 419288 450825 481437 507821 526255 534044 530758 517929 497654
57597 497654 471848 442788 413535 386953 364181 344484 326675 310335 295662 282843 272020
57586 272020 263450 257065 252122 247926 244748 243279 243187 243079 242147 241004 240432 240092 239220 237965 237078 236615
57570 236615 235939 235016 234818 236120 238389 240085 239838 237432 234033 231271 229638 227942 224850 220672 216892
57555 216892 214200 211985 209859 208595 209085 211115 213601 215498 216123 215327 213810 212767 212756 213298 213748 213889
57539 213889 213382 211504 208179 204571 201965 200466 199447 198695 198309 197908 196843 194888 192020 187938 182725
57524 182725 177573 173765 171158 168858 167171 167358 169242 170595 169646 166929 163864 160773 157511 154882 153759
57509 153759 153427 152593 151780 152726 155151 156257 154479 151930 151406 152271 151483 148247 145261 144936 146453 147680
57493 147680 148410 150083 153156 156402 158593 159552 159539 158882 158417 159214 161294 163400 164517 165044 165992 167511
57477 167511 168805 169232 169053 169157 170228 172085 173750 174438 174465 174796 175669 176208 175576 173908 171800 169526 167294
57460 167294 165751 165545 166593 168364 170674 173568 176566 178810 180117 181334 183382 186298 189415 192187
57446 192187 194592 196910 199302 201488 202773 202598 201261 199940 199755 200751 201871 201946 200681 198663 196571
57431 196571 194511 192228 189865 188245 188183 189539 191291 192732 194438 197555 202067 206312 208727 209696 210871
57416 210871 212770 214121 214040 213740 215039 217742 219894 220666 221692 225025 230607 236516 241164 244541 247504
57401 247504 250607 253795 256779 259347 261294 262367 262592 262662 263568 265578 267956 270052 272188 274864 277569
57386 277569 279315 280163 281239 283254 286037 289572 294233 299522 303769 305977 307141 308924 311670 314585
57372 314585 317273 320113 323471 327371 331759 336314 340270 343189 345695 348712 352225 355625 359127 363840
57358 363840 370172 376963 382618 386725 390266 394495 399738 405297 410485 415636 421639 428450 434806 439939
57344 439939 444800 450760 457572 463687 468428 472796 478007 484114 490364 496230 501777 507522 514172 522139
57330 522139 531204 540845 550672 560169 568432 574979 580615 586625 593241 599915 607030 616052 627509 639992
57316 639992 651796 662693 673315 683648 693210 702315 712069 723012 734353 744649 753026 759934
57304 759934 767046 776072 787098 798224 807369 814447 821380 830058 840662 851964 862814 873112 883623
57291 883623 895088 907591 920719 934178 948081 962644 977908 993861 1010604 1028212 1046595
57280 1046595 1065599 1085110 1105062 1125547 1146961 1169668 1193365 1217090 1240082 1262453 1285001
57269 1285001 1308638 1333952 1360740 1387741 1413467 1437753 1462067 1487884 1515175 1542965 1570820
57258 1570820 1598920 1626984 1654170 1680187 1705734 1731509 1757435 1783235 1809283 1836320 1864521
57247 1864521 1893275 1921863 1950063 1978017 2005736 2032957 2059598 2086205 2113593 2141848 2170001
57236 2170001 2197140 2223710 2251190 2280497 2311199 2342384 2373700 2405084 2435911 2465048 2491876
57225 2491876 2517065 2542368 2569661 2599933 2632811 2667077 2701689 2736177 2770143 2802980 2834481
57214 2834481 2865219 2895625 2924929 2951693 2975396 2996788 3016729 3035604 3054153 3073856 3095637
57203 3095637 3118847 3142450 3166861 3193611 3223227 3254446 3285799 3317222 3349706 3384013 3420151
57192 3420151 3457605 3495404 3532196 3566822 3598872 3628423 3655335 3679094 3699320 3716247 3730701
57181 3730701 3743718 3756020 3767726 3778654 3788961 3799270 3810160 3822058 3835946 3853727 3877189
57170 3877189 3906664 3941170 3979752 4021971 4067020 4113222 4159268 4205790 4254969 4308259 4364725
57159 4364725 4421890 4478036 4533312 4588596 4643821 4697895 4750089 4800790 4850460 4898244 4942228
57148 4942228 4981317 5016506 5049945 5082760 5114138 5142801 5169072 5194818 5221275 5247670 5272473
57137 5272473 5295306 5316726 5336602 5354088 5369374 5384067 5399174 5413780 5426681 5438445 5450563
57126 5450563 5462919 5473444 5480374 5483746 5484379 5482400 5477471 5469881 5460543 5449939 5437547 5422497 5404589
57113 5404589 5384473 5362802 5339540 5314540 5288669 5263567 5239861 5216217 5190912 5164079 5137664
57102 5137664 5113265 5090568 5067687 5042111 5011262 4973155 4927217 4874221 4815276 4751336 4683670
57091 4683670 4613942 4543178 4471116 4397213 4321984 4246707 4171863 4096495 4019140 3938727 3854109
57080 3854109 3763184 3663268 3552558 3430858 3298733 3156454 3004155 2842386 2671374 2489496
57070 2489496 2293335 2079764 1847378 1595420 1321907 1023462 696353 336738 -59783 -497788
57060 -497788 -981035 -1512838 -2097514 -2740581 -3447176 -4221238 -5067090 -5991444 -7003106
57051 -7003106 -8111109 -9324303 -10653149 -12111083 -13713245 -15474469 -17409969 -19538449
57043 -19538449 -21883748 -24473426 -27337784 -30512160 -34039302 -37967614 -42347406 -47230345
57035 -47230345 -52670863 -58723354 -65434853 -72839500 -80956347 -89785184 -99298985 -109437436
57027 -109437436 -120099651 -131131292 -142321293 -153438113 -164297913 -174793321 -184817225
57020 -184817225 -194121223 -202241526 -208582620 -212605505 -213981352 -212625622 -208640008 -202239046
57012 -202239046 -193706787 -183382445 -171656076 -158957929 -145732626 -132401366 -119326728
57005 -119326728 -106793102 -95003533 -84086173 -74105604 -65076901 -56979198 -49766148
56998 -49766148 -43374202 -37730548 -32759899 -28388724 -24547695 -21173600 -18210251 -15607893
56990 -15607893 -13322352 -11314903 -9551871 -8003185 -6641133 -5440471 -4378992 -3437478
56982 -3437478 -2599504 -1851786 -1184264 -588937 -58112 416438 842834 1227775 1576409 1893960
56972 1893960 2187049 2461376 2716455 2943284 3129090 3265180 3350660 3390788 3394416 3372588
56962 3372588 3336083 3291988 3243067 3190666 3136554 3081315 3022856 2958095 2885128 2802679 2708915
56951 2708915 2602590 2484575 2356608 2218998 2071025 1913108 1747083 1574743 1397836
56942 1397836 1219441 1043536 872760 707996 550621 403782 270560 151872 46908 -45169
56931 -124950 -193456 -252074 -301746 -342800 -375490 -400297 -417837 -428963 -434859 -436780 -435839 -433334
56919 -433334 -430986 -430280 -431497 -433694 -435627 -436383 -435206 -431366 -424662 -415890 -406432 -397267 -388375 -378927 -367935
56904 -367935 -354883 -339936 -323465 -305284 -284599 -261135 -236192 -212092 -190433 -171338 -154577
56893 -154577 -140874 -131551 -127087 -126480 -128039 -130515 -133516 -137107 -141029 -144236 -145390 -143967 -140603 -136092
56879 -136092 -130394 -122948 -113552 -102304 -88941 -72974 -54461 -34007 -11979 11471 35330 57243
56867 57243 74653 86215 92047 93072 90386 84910 77309 68320 59139 51127 44954 40260 36218 32259
56853 32259 28347 24962 22896 22707 24351 27567 32285 38076 43505 47067 48925 50832 54000 57987 62114
56838 62114 67012 73839 82540 91845 100819 109703 119316 130211 142384 155305 168260 180981 193856
56825 193856 207225 220554 232477 241551 246820 248054 245802 241043 234566 226858 218609 210858 204419
56812 204419 199684 197279 198175 202515 208889 215684 223027 232667 246034 263180 283652 307535 334974
56799 334974 364910 394712 421241 442289 457107 465729 468134 464424 455651 443935 431547 420124
56787 420124 410649 403576 398751 395827 395296 398750 407758 422717 442954 467478 495505 526945 562706
56774 562706 603661 648528 693283 733319 765714 788862 800822 799542 784828 759262 727013 692145
56762 692145 657709 625490 596342 571018 550471 535059 524036 516591 512985 513895 519152 528228 541623
56749 541623 560328 583657 608823 633055 655134 674212 688093 693738 689471 676256 656826 633654
56737 633654 607651 578765 547885 517749 491497 470432 453648 439652 427863 418810 413462 412283
56725 412283 414383 417870 421605 426253 432853 440807 448255 453957 457478 457761 453226 443604 430244 414112
56711 414112 394984 373383 351911 333334 318027 304373 291179 278701 267587 257732 248268 238413
56699 238413 228506 220156 214630 210846 205979 198625 190461 184002 179563 175469 170565 165324 160814 157835
56685 157835 157017 158499 161117 162767 162152 159884 157575 156133 155191 153997 152461 151107 150131 149060 147663
56670 147663 146706 147063 148376 149562 150572 152493 155672 158973 161417 163401 165484 167048 167254 166520 165944
56655 165944 165909 166254 167230 169011 170750 171407 171328 171789 173046 173961 173642 172530 171817 172468 174687 177525 179355
56638 179355 179703 180212 182552 185708 186936 185401 183165 182156 181949 181445 181072 181701 182293 180357 174797 167221
56622 167221 160333 155721 153162 151369 149185 146430 143785 141764 140006 137739 134816 132007 130374 130468 131977
56607 131977 133996 135754 137183 138674 140331 141710 142262 141891 141191 141362 143568 147823 152694 156776 160317
56592 160317 164611 169846 174595 177730 179819 182099 184889 187716 190295 192554 194224 195302 196629 199183
56578 199183 202843 206553 209584 212117 214692 217685 221247 225118 228463 230441 231070 231200 231679 232913 235049
56563 235049 237927 240762 242462 242576 241612 240306 238892 237195 235084 232727 230695 229803 230350 231352 231075
56548 231075 228716 225238 222311 220776 220469 220969 221833 222353 221884 220517 218842 217053 214913 212751 211677
56533 211677 212364 214281 216652 219510 222958 225929 226954 226201 225624 226683 228904 231176 233544 236770 240664
56518 240664 243938 245632 245949 245700 245558 245904 246762 247733 248453 249208 250705 253175 256145 259237 262794 267606
56502 267606 274325 283215 294157 306743 320660 335931 352367 368711 382782 392820 398650 401512
56490 401512 402978 403962 404418 403901 402506 401145 400606 400656 400542 400085 399496 398273 395283 390256 384287 378417
56474 378417 372497 366079 359724 354547 350886 348168 345806 343379 340163 335446 329504 323581 318669 314858
56460 314858 312022 310448 310281 310777 310685 309288 306804 303987 301775 301100 302320 304447 305422 303688 299531 294695
56444 294695 290845 288708 288394 289679 291721 293151 293065 291807 290487 290000 290725 292681 295420 298017 299797
56429 299797 300944 301926 302623 302646 302246 302021 301803 300796 299015 297667 297671 298482 298863 298281 297119 296012 295406 295395
56411 295395 295650 295859 296424 298108 300641 302421 302311 301174 300833 301804 302940 303215 303030 303499 305048 307078
56395 307078 308749 309742 310328 310984 312051 313701 315868 317970 318964 318206 316307 314689 314165 314315 314199 313250
56379 313250 311423 309195 307612 307729 309569 312008 313898 314943 315497 316112 317423 319642 321951 323335 324371
56364 324371 326992 331705 336140 337609 336336 334828 334512 334527 333734 332468 331784 331955 332249 331678 329667 326448
56348 326448 323027 320464 319190 319235 320799 323907 327644 330510 331702 331682 331512 332103 333938 336875 340214 343414
56332 343414 346601 349883 352507 353553 353293 352875 352678 352055 350979 350780 352536 355470 357747 358516 358584 359235
56316 359235 360869 362799 364175 365008 366101 367882 369726 371048 372659 375979 380795 384839 386089 384710
56302 384710 382240 379726 377439 375809 375547 376895 379463 382810 386636 390470 393764 396443 398956 401653
56288 401653 404386 406814 408829 410587 412412 414754 417993 422082 426492 430647 434361 437726 440707 443077
56274 443077 444749 445995 447303 449127 451781 455291 459208 462817 465823 468624 471612 474514 476855 478932
56260 478932 481707 485705 490537 495470 499910 503335 505521 507024 508749 510865 512849 514764 517449 521121
56246 521121 524961 528760 533706 540352 546923 551256 553830 557214 562675 569034 575034 581216 588757 597619
56232 597619 606726 615367 623752 632563 642299 652729 662774 671355 678594 685876 694701 705775 719029
56219 719029 733878 749370 764694 779827 795481 812462 831194 851475 872278 892353 911752
56208 911752 932370 956228 983563 1013377 1045298 1079780 1116949 1156644 1199508 1246679 1298387
56197 1298387 1354011 1413420 1476921 1544117 1614623 1690115 1773733 1866825 1968031 2076312 2192924
56186 2192924 2319129 2453731 2594625 2741464 2894724 3052763 3211721 3368131 3520004
56177 3520004 3665403 3801466 3925176 4033911 4124852 4194694 4240422 4260068 4252856 4219381 4161732
56166 4161732 4082749 3984932 3870464 3742281 3604429 3461049 3315373 3169685 3025659 2884271
56156 2884271 2745817 2610697 2480313 2356730 2241267 2133817 2033955 1942222 1859346 1784247
56146 1784247 1714091 1647000 1583810 1526367 1474919 1428254 1385597 1346886 1311591 1278894 1249033
56135 1249033 1222987 1200650 1180661 1162223 1145649 1130781 1116394 1101727 1087481 1074707 1063802
56124 1063802 1054996 1048503 1043554 1038451 1032216 1025309 1018456 1012195 1007951 1007668 1011280 1015987 1019229 1021233
56110 1021233 1023615 1026870 1030636 1035239 1041351 1048740 1056587 1064431 1071977 1078990 1086499 1096911 1111543
56097 1111543 1128908 1146794 1164988 1184477 1205040 1225703 1246963 1270641 1297684 1327817 1361269
56086 1361269 1399207 1442393 1490757 1544421 1603953 1669595 1741276 1819152 1902844 1990063 2077058
56075 2077058 2160552 2238465 2309080 2370848 2423330 2467687 2506067 2540745 2573218 2603296 2629370
56064 2629370 2650040 2664889 2673394 2674566 2668916 2659503 2649142 2637108 2620010 2595256 2562026 2519716
56052 2519716 2467810 2407590 2342290 2275286 2209267 2146864 2090312 2040233 1996073 1957772 1925768
56041 1925768 1899528 1877774 1860252 1847702 1839855 1835043 1832275 1832190 1835254 1840223 1845216 1849614 1854396
56028 1854396 1861175 1871097 1884090 1898969 1914753 1931688 1950367 1970275 1990145 2009577 2029330 2050145
56016 2050145 2072173 2095350 2119434 2143917 2168805 2195086 2223427 2252774 2281440 2309351 2338102
56005 2338102 2368960 2401861 2436197 2471660 2508483 2547565 2589850 2634796 2680272 2725080 2770679
55994 2770679 2819063 2869833 2921064 2972483 3025950 3082901 3142774 3203890 3264774 3324918 3385257
55983 3385257 3447582 3512822 3580693 3651445 3726255 3804890 3885054 3965674 4048765 4136107 4226394
55972 4226394 4318401 4414714 4518859 4630239 4745500 4863585 4985774 5111873 5240562 5373010
55962 5373010 5512016 5657615 5807349 5960923 6120789 6288049 6461666 6642108 6832062
55953 6832062 7033099 7245203 7469976 7710670 7968582 8242915 8534367 8845003 9174445
55944 9174445 9520508 9884209 10269851 10679503 11111991 11568504 12054595 12574936 13130043
55935 13130043 13719571 14344821 15006733 15705750 16445412 17232147 18069995 18959297 19901567
55926 19901567 20901254 21961526 23083028 24268232 25522481 26849614 28251772 29735145
55918 29735145 31310827 32988618 34775323 36680444 38717605 40899027 43235399 45743712
55910 45743712 48449369 51379635 54563117 58038840 61859209 66082579 70771277 75998958
55902 75998958 81850324 88410408 95763220 104003247 113238842 123585782 135175580 148176647
55894 148176647 162793072 179237291 197715587 218430417 241553401 267161115 295165792
55887 295165792 325181048 356194868 386153517 411923016 430020525 437854851 434658610
55880 434658610 421516985 400658269 374625738 345748702 315917007 286519200 258480821
55873 258480821 232369596 208499201 186990464 167816376 150856940 135944040 122879405
55866 122879405 111446445 101432823 92647319 84917912 78087005 72017154 66595776 61729270
55858 61729270 57337590 53356766 49738790 46443307 43432668 40676093 38151454 35838731
55850 35838731 33715878 31763179 29966141 28310870 26780916 25361297 24041609 22812828
55842 22812828 21664812 20588975 19579810 18631894 17738697 16895555 16100111 15348677 14635834
55833 14635834 13958718 13317742 12712069 12138436 11595523 11084881 10605671 10152516 9720440
55824 9720440 9308072 8914243 8535627 8170217 7819483 7484364 7162101 6849427 6546178
55815 6546178 6253550 5971620 5700872 5443543 5200779 4970280 4748791 4535368 4330840
55806 4330840 4136145 3952594 3781653 3622963 3474499 3335818 3208848 3094263 2989482
55797 2989482 2891648 2800148 2714769 2633979 2556897 2484602 2417482 2353352 2290156 2228607 2170202
55786 2170202 2114432 2059988 2007155 1957005 1909520 1864295 1821888 1782692 1745521 1708954 1673255
55775 1673255 1639673 1608607 1579486 1551654 1524594 1498189 1473192 1450333 1428688 1406423 1383350
55764 1383350 1360968 1339789 1318706 1297317 1276364 1255283 1232097 1206904 1182874 1162293 1144007
55753 1144007 1126128 1108796 1092607 1076861 1061401 1047967 1037551 1028346 1018353 1008169 999274 991587
55741 991587 984829 980232 978351 976921 973423 968248 962899 956869 949168 941418 936163 933007 929539 925466
55727 925466 922691 921615 920477 918578 917274 917076 916068 912070 904725 894828 883002 869583 854867 839273
55713 839273 823958 810759 800437 791637 782976 775504 771329 770154 768901 764703 756734 745354 731249
55700 731249 715783 700839 687764 676927 667841 658978 648282 635180 621493 609028 597051 583738
55688 583738 569411 556298 545391 535522 525551 515596 505925 496402 487511 480507 476189 474474 475087 477262
55674 477262 478904 477776 473927 469609 466441 463847 460507 456113 451229 446409 441804 437018 431362 424859
55660 424859 418565 413008 407166 400439 394842 393142 395047 397463 398734 400449 404398 409824 414710 418184
55646 418184 420482 421799 422239 421953 420489 416916 411230 404699 398276 391715 384837 378402 372885 367614 362148
55631 362148 357535 354983 353925 352558 349868 346213 342292 338537 335296 332764 330647 328470 326288 324920
55617 324920 325482 328584 333566 338519 341683 342887 343073 342484 340301 336360 332142 329367 328248 327804 327378
55602 327378 327199 327769 329246 331256 333069 334291 335548 337929 341522 344949 346628 346122 344187 342096 341010
55587 341010 341227 341682 340863 338515 335857 333971 332857 332292 332406 332663 331345 327215 321211 315602 311802 309696
55571 309696 308494 307174 304389 299105 291556 283040 274857 267936 263110 260728 259930 259136 257535 255527 253606
55556 253606 251517 248891 246062 243692 241890 240302 238943 238304 238433 238437 237337 235147 232526 229418 224880
55541 224880 218728 212642 208694 206911 205198 201867 197476 193829 191881 191193 191011 191121 191719 192979 194850
55526 194850 196895 198314 198439 197325 195679 194100 192615 191170 190305 190792 192444 193922 194353 194755 196886
55511 196886 200645 203819 204924 205205 206751 209403 210940 210073 207923 206406 206393 207857 210604 214025 216734
55496 216734 217402 215900 213300 210845 209136 208176 207948 208767 210682 212486 212096 208701 204046 200623 198871
55481 198871 197212 194597 191611 188982 186630 184841 184909 187475 191143 193805 194760 194638 193944 192865 192199 193182
55465 193182 196151 199955 202812 203513 202039 199479 197203 195772 194774 193773 192837 191875 190290 187963 185883
55450 185883 184855 184069 182047 178762 175717 173826 172317 170120 167503 165628 164889 164318 162599 159318 155169
55435 155169 151189 147983 145565 143609 141626 139154 136260 133781 132625 132851 133852 135364 137547 139993
55421 139993 141582 141743 141124 140513 139845 138815 137771 137158 136652 135730 134643 133964 133472 132421 130742 129129
55405 129129 128026 127331 127060 127560 128978 131090 133557 135834 137143 137334 137508 138828 140806 141804 141331 140733
55389 140733 141307 142725 143715 143369 141260 137232 132042 127707 126172 127580 130192 131953 131908 130525 129110
55374 129110 128761 129489 130369 130600 130151 129309 128175 127002 126520 127246 128640 129501 129262 128535 128399 129431 131387
55357 131387 133504 135144 136380 137925 140169 142291 142672 140405 136283 132259 129981 129793 130773 131498 130902
55342 130902 128840 126076 123701 122367 121971 122051 122282 122406 121887 120241 117909 116363 116898 119501 123252 127482
55326 127482 131854 135506 137206 136864 136147 136746 138261 138668 136953 134527 133544 134353 135347 135151 134122 133362
55310 133362 133074 132690 132225 132430 133389 133945 133143 131562 130429 129804 128570 126255 124051 123746 126056 130152
55294 130152 134433 137584 139237 139843 139860 139247 137972 136659 136064 136074 135961 135632 135816 136785 137784 138137 138203 138696
55276 138696 139771 141395 143881 147078 149514 149440 146664 142504 138044 133467 129117 125926 124147 122579 120054
55261 120054 117252 116107 117462 120089 122187 123227 123987 125245 126988 128753 130128 130700 129990 127883 125090
55246 125090 122725 121379 120905 121089 121982 123413 124792 125907 127381 129630 131728 132233 131095 129812 129517
55231 129517 129849 130022 130019 130025 129576 128367 127388 128041 130218 132396 133782 135273 137799 140628 142056 141274 138933
55214 138933 136235 134106 133065 133279 134666 137122 140418 143673 145402 144711 142311 139864 138525 138485 139425
55199 139425 140536 140389 138063 134670 132738 133549 135836 137545 137953 137373 135805 133238 130726 129705 130187
55184 130187 130772 130618 130258 130160 129752 128611 127648 128045 129549 130784 131038 130871 131161 132258 133998 135756 136504
55167 136504 135548 133350 131084 129383 128121 127357 127571 128756 130156 131298 132538 134056 135051 134680 133263
55152 133263 131817 130809 130130 129932 130540 131643 132469 132831 133300 134273 135584 137082 138815 140362 140756 139515
55136 139515 137328 135375 134411 134695 136198 138373 140147 140656 139822 138024 135585 132842 130336 128532 127639
55121 127639 127878 129388 131510 132811 132467 131322 131058 132537 135272 137991 139282 138357 136094 134829 136126
55106 136126 138888 140635 140498 139913 140374 141691 142853 143713 145145 147959 151947 155671 157229 155921 153247
55091 153247 151483 151205 151044 149970 148563 147463 145951 143260 140454 139579 141144 143541 144904 144596 142991
55076 142991 140822 139044 138521 139480 141604 144637 148266 151439 152684 151552 149223 147334 146529 146325 145882
55061 145882 144620 142590 140686 140095 141055 142475 143264 143745 145116 147643 150015 150698 149406 147125 145160
55046 145160 144444 145301 147297 149407 150795 151493 152116 152998 153932 154754 155730 157079 158353 158658 157572 155776
55030 155776 154700 155457 157889 160596 162004 161534 159832 158075 157276 158018 160307 163467 166499 168736 170060
55015 170060 170586 170495 170079 169386 167826 164931 161686 160093 160819 162200 162435 161958 162422 163962 164994 164601 163565
54998 163565 162808 162197 161497 161315 162261 163924 165399 166320 166846 167191 167649 168428 168936 167923 165016 161580 159328
54981 159328 158474 157933 156894 155462 154017 152751 151839 151502 151838 152851 154400 155869 156329 155556 154604 154872
54965 154872 156779 159699 162718 164893 165272 163578 160849 158667 157598 156891 155750 154454 154056 155264 157736
54950 157736 160401 162581 164683 167402 170233 171490 170267 167764 166106 166284 167817 169816 171575 172481 172335
54935 172335 171784 171756 172419 173134 173231 172355 170402 167812 165682 164806 164720 164360 163547 163124 163781 165477 167907 170706
54917 170706 173189 174626 174905 174428 173386 171742 169807 168217 167419 167714 169444 172308 174856 175710 175161 174538
54901 174538 174160 173251 171939 171791 173757 176751 179071 180282 180970 181510 182033 182970 184587 186194 186720 186169
54885 186169 185886 187028 188935 189364 186721 182103 178509 177626 178042 177309 175012 172660 171216 170441 170447 171873
54869 171873 174100 175172 174410 173500 173892 174607 174004 172525 172011 173073 174757 176478 178714 181826 185384 188808
54853 188808 191840 194472 197180 201080 207002 214448 221985 228375 232804 234658 234092 232456 231022 229402
54839 229402 226289 221710 217513 215461 215622 216749 217499 217123 215686 213829 211951 209728 206795 203469 200076
54824 200076 196136 191334 186985 185139 186105 188159 189986 192108 195389 199412 203176 206431 209248 210987
54810 210987 210828 209157 207571 207545 209571 213360 218227 223329 228006 232013 235217 237278 237914 237252 235548
54795 235548 232756 228731 223714 218247 212748 207505 202887 199091 195743 192310 189016 186854 186441 187098 187335
54780 187335 186166 183811 181313 179599 178720 177722 175428 171685 167808 165386 164623 164318 163678 163558 165273 168504
54764 168504 171157 171441 169549 167157 165912 166554 168849 171797 174287 176048 177778 180038 182345 183704 183714
54749 183714 182771 181565 180748 180684 181019 180940 180381 180409 181664 183071 183266 182913 184016 186756 188562 187146 183290
54732 183290 179742 178239 178664 180318 182564 184399 184767 183685 182254 181291 180695 180357 180789 182266 183989 184939
54716 184939 185207 185726 186794 187738 188167 188741 190237 192461 194733 197003 199686 202575 204855 206390 208132
54701 208132 210763 213660 215975 218283 222185 228235 234919 239924 241919 241147 239023 237547 238330 241229 243935
54686 243935 243655 239607 233668 228510 225347 223529 221760 219179 215560 211247 207104 203969 201776 199527
54672 199527 196515 193318 191260 191119 192662 195041 197103 197719 196708 195439 195707 197800 200301 201900 202696
54657 202696 203511 204734 206319 208351 211166 215267 221261 229207 237645 244049 246798 246317 244018 240930 237830
54642 237830 235638 234589 233548 231194 227594 223769 220094 216109 211711 207587 204451 202498 201468 200734
54628 200734 199633 198345 197858 198318 198105 195726 192167 189956 190131 191518 192861 194044 195045 195362 195105 195247
54612 195247 196040 196323 195267 193741 192988 192748 191689 189267 186272 183824 182383 181572 180640 179447 179015 180389
54596 180389 182823 184086 183026 180817 179049 177612 175463 172671 170529 170019 171134 173445 176425 179347
54582 179347 181627 183243 184393 185047 185288 185633 186337 186785 186322 185384 185107 185992 187547 188904 189193 187852 185447
54565 185447 183803 184207 185681 186082 184870 183608 183556 184059 183936 183438 183898 185839 188321 190096 190805 190886 190712
54548 190712 190108 188684 186457 183961 181785 180284 179844 181008 183991 188135 192167 194991 196279 196591 196969
54533 196969 197988 198982 198693 196891 194686 192889 190855 187730 184091 181282 179608 178407 177654 178115 179755
54518 179755 181358 182271 183444 186019 189582 192461 193285 191796 188704 185357 183159 182754 183871 185973 188538
54503 188538 190680 191522 191485 192192 194224 195796 194921 192359 190931 191956 193908 194977 195529 197125 200113 203292
54487 203292 205426 205995 204819 202179 199399 198174 198827 199876 199819 198837 198330 199199 201061 202837 203696 203743 204247
54470 204247 206844 211904 217797 222236 224205 224165 222826 220604 218192 216552 215910 215397 214176 212430 210916
54455 210916 210041 209783 210100 210891 211725 212004 211337 209671 207348 205092 203603 203017 203054 203609 204654 205669 206040
54438 206040 206155 207140 209103 210657 210779 210038 209180 207686 205105 202888 203107 205518 207581 207519 205971 204419
54422 204419 203437 203123 203935 206083 208812 211123 212792 214097 215033 215456 215668 216223 217222 218233 218927 219612 221138
54405 221138 224166 228279 231937 233821 234148 234125 234131 233289 231050 228385 226789 226653 227191 227537 227298 226335 224719
54388 224719 222907 221502 220636 219820 218474 216593 214881 214156 214487 215075 215156 214695 213856 212347 210169 208671
54372 208671 209476 212050 213691 212590 209892 207938 207623 208689 211512 216587 222387 225744 225188 222642 221017
54357 221017 221036 221412 221344 221427 222187 223074 223473 223771 224519 225004 223955 221804 221043 223392 227375 229867 229775 228901
54339 228901 229174 230538 232142 234113 236887 239760 241641 242837 244580 246900 248483 248973 249864 252358 255457
54324 255457 257249 257370 257012 256784 255729 252699 248020 243428 240662 240270 241506 243122 244314 245024 245457 245539
54308 245539 245020 243894 242479 241157 240253 240081 240825 242336 244221 246120 247729 248648 248480 247227 245403 243673
54292 243673 242404 241592 241181 241472 243138 246582 251129 255156 257436 258199 258504 258839 259028 259472 261454 265590
54276 265590 270619 274555 276712 277942 279171 280661 282664 285694 289612 293087 294565 293483 290229 285361
54262 285361 279435 273259 267659 262896 258656 254695 251231 248598 246691 244833 242430 239888 238721 240231
54248 240231 243947 247747 249663 249306 247613 245814 244836 244970 245636 245918 245666 245545 245762 245664 245158 245461 247299
54231 247299 249237 249262 247619 246466 246837 247615 247828 248328 250375 253715 256997 259259 260213 259789 258217 256122
54215 256122 253922 251575 249311 247918 247785 248346 249150 250701 253389 256271 258016 258710 259616 261230 262516
54200 262516 262107 259558 255409 250726 246677 243989 242685 242579 243735 245959 248257 249656 250431 251712 253913
54185 253913 256326 258305 259988 261556 262514 262112 260137 257064 253783 251186 249576 248417 247049 245480 243888
54170 243888 241620 237809 233109 229642 228558 228581 227790 226115 225015 225131 225385 224439 222166 219555 217832 217886
54154 217886 219918 223295 227091 230970 235207 239694 243438 245483 246031 246208 246866 248026 249447 251116 252899
54139 252899 254137 254120 252962 251707 251438 252390 253886 254991 255264 255070 255178 255886 256592 256453 255324 253688 251763
54122 251763 249342 246662 244752 244392 245230 246405 247548 248431 248197 246086 242913 240656 240190 240341 239686 238430
54106 238430 237723 237813 237922 237702 237760 238557 239674 240467 240806 240649 239437 236683 233124 230575 230312 231797 233288
54089 233288 233596 232976 232356 232142 232100 232201 233059 235283 238600 241837 243685 243438 241348 238701 237372 238590
54073 238590 241799 245051 246927 247774 248683 249550 248983 246273 242729 240462 240203 240900 241365 241681 242845 245416
54057 245416 248742 251395 252283 251512 250211 249432 249336 249482 249616 249755 249804 249732 250019 251230 252996 254172 254271 254093
54039 254093 254507 255245 255500 255141 254647 254230 253771 253429 253562 254069 254451 254634 255211 256789 259469 262869 266252
54022 266252 268789 270247 271419 273263 275602 277283 277640 277155 276550 275987 275488 275440 276212 277734 279900 282844
54006 282844 286257 288828 289120 286961 283560 280467 278821 279284 281792 285243 288122 289820 291024 292579 294434
53991 294434 296111 297859 300724 305448 311712 318505 324834 330023 333860 336812 339742 342988 346065 348834
53977 348834 352594 359059 368194 378075 387255 396308 406297 416617 425648 433170 440745 449460 458482 466404
53963 466404 473205 480171 488316 497542 507123 516443 525262 533520 540874 546337 548685 547451 543322 537313
53949 537313 529716 520079 508028 493862 478535 463293 449135 436297 424327 412846 402157 392888
53937 392888 385138 378297 371697 365254 359396 354545 350717 347512 344346 340786 336935 333611 331883 331961 332457
53922 332457 331290 327711 323174 319830 318356 317669 316456 314355 311853 309761 308921 309673 311397 313030 314224
53907 314224 315414 316657 317217 316651 315617 315093 315392 316536 318946 322983 328052 332909 336765 339559 341407
53892 341407 342461 343291 344797 347554 351463 355905 360042 363360 366394 370461 375998 381493 385033 386904
53878 386904 389687 395511 403974 413064 421400 428932 436074 443013 449963 457474 466035 475310 483915 490330
53864 490330 494351 497573 502029 508284 515124 521074 525922 530731 536777 544630 553943 563961 574296 585039
53850 585039 595794 604909 610482 612390 612614 613139 613935 613474 610850 606851 603135 600772 599474 597834 594405
53835 594405 588899 582316 575826 569789 564025 558476 552972 546704 538807 529502 520013 511264 503352 496424
53821 496424 491221 488153 486514 485369 484837 485576 487095 487672 486347 484343 483889 486080 490514 496678 504779
53806 504779 515120 527487 541686 558006 576272 594423 608808 616335 616210 609619 598298 583862
53794 583862 568054 552687 538813 526234 514158 502361 491490 482242 474413 466867 458340 448220
53782 448220 436730 424673 413156 403244 395421 389198 383549 378059 373497 370917 370167 369667 367833 364590
53768 364590 361303 359365 359042 359566 360086 360521 361584 363914 367120 369897 371305 371673 371862 371868 370959 369280 368446
53751 368446 369833 372780 375394 377022 379040 382952 388568 394651 400828 407915 416297 424749 431423 435873
53737 435873 439593 444376 450328 455755 458980 459937 459924 460160 460994 462282 463872 465507 466757 467415 467737 467979
53721 467979 467916 467159 465742 463973 461805 458905 455415 452044 449033 445454 440136 433215 426214 420461 415839
53706 415839 411328 406327 401009 395624 390127 384591 379488 375256 371905 369260 367267 365725 364098 362074
53692 362074 360081 358651 357409 355412 352646 350508 350366 352081 354294 355785 356096 355248 353576 351898 351273
53677 351273 352349 355060 358833 362781 365843 367398 367962 368870 370875 373266 374691 374891 375323 377871 382872
53662 382872 388543 392619 394641 396304 399315 403412 407186 410510 414964 421396 428227 433142 435901 438297
53648 438297 441588 445291 448743 452599 457981 464870 472184 479013 485043 490100 494050 497074 499457 501252
53634 501252 502664 504461 507165 509965 511345 510988 510290 510724 512383 514420 516161 517292 517559 516903 515654
53619 515654 514175 512544 510792 509046 507198 504947 502491 500647 499933 500061 500657 501751 503024 503331 501791
53604 501791 498878 495759 493078 491077 490172 490349 490559 489853 488731 488138 487617 485943 483498 482372 483825 486978
53588 486978 490406 493659 496675 498980 500273 501016 501780 502786 504475 507577 511999 516503 520042 522677 524792
53573 524792 526489 528334 531514 536293 541268 545144 548358 551988 555936 559373 562335 565641 569760 574815
53559 574815 581170 588781 596489 603234 609691 617401 626502 635647 644023 652033 659922 667128 673426 679599
53545 679599 686456 693930 701473 708582 714642 718991 721528 722847 723684 724714 726686 729920 733614 736440
53531 736440 737902 738365 737849 735878 732752 729920 728489 728031 727295 725637 723458 721757 721375 722112 722554 721513
53515 721513 719707 719189 720904 723623 725427 725218 722523 717082 709511 701538 694793 689897 687140 687002 689004
53500 689004 690970 690782 688690 686817 686573 687597 689209 691746 695974 701904 708790 715916 722920 729437 734950
53485 734950 739300 743254 748303 755624 765337 776887 789786 803586 817468 830729 843841 858271
53473 858271 874975 893638 913653 935075 958098 982312 1007378 1033989 1063141 1094381 1125714
53462 1125714 1155670 1184992 1215784 1249261 1284819 1321354 1358893 1398369 1440029 1482847 1525932
53451 1525932 1569887 1616095 1664974 1715612 1766907 1818175 1868730 1917856 1965527 2012442 2059005
53440 2059005 2104817 2149386 2192703 2234839 2275583 2314908 2353306 2391275 2428806 2465507 2500846
53429 2500846 2534396 2566562 2598979 2633040 2667744 2700183 2728846 2755401 2782400 2810181 2836952
53418 2836952 2861007 2881584 2898132 2910162 2917795 2921464 2921104 2916409 2907651 2895373 2879397 2859116
53406 2859116 2834772 2807618 2778821 2748940 2718425 2687645 2656230 2623176 2587974 2551134 2513481
53395 2513481 2475494 2437432 2399472 2361455 2323101 2284824 2247932 2213606 2181902 2151986 2123233
53384 2123233 2095967 2071244 2050019 2032484 2018247 2007060 1999023 1993992 1991313 1990492 1991765 1995520 2001525
53371 2001525 2009305 2019143 2032083 2048912 2069448 2092720 2117607 2143668 2171715 2203201 2238598 2276808
53359 2276808 2316718 2358769 2404189 2453132 2504695 2558490 2615012 2674451 2736403 2800967 2868958
53348 2868958 2940513 3014622 3090728 3169824 3253032 3339862 3429014 3520532 3615880 3715727 3818668
53337 3818668 3922596 4026578 4130801 4235240 4339348 4443044 4546986 4651242 4754186
53328 4754186 4853436 4947709 5037098 5121775 5201366 5275575 5344292 5406609 5460777 5505908 5542984
53317 5542984 5573293 5596472 5610986 5615973 5611562 5597839 5574728 5542707 5502381 5453144 5393310 5321968
53305 5321968 5240070 5149723 5053202 4952678 4849807 4745116 4638473 4530516 4422979 4317374
53295 4317374 4213944 4112305 4012628 3915902 3823320 3735390 3651247 3568919 3486879 3405224 3324886
53284 3324886 3246149 3168958 3094391 3024344 2959465 2898631 2840806 2786138 2734745 2685806 2638915
53273 2638915 2595319 2556612 2522701 2492037 2463372 2436415 2411106 2387103 2363949 2341221 2318752
53262 2318752 2297029 2276910 2258622 2241690 2226320 2213917 2205375 2199710 2195654 2194060 2197208 2205596
53250 2205596 2216743 2227716 2238060 2249716 2264635 2283058 2304040 2327167 2353426 2384152 2419209
53239 2419209 2456808 2495438 2535390 2577828 2622867 2669454 2716910 2765419 2814675 2862979 2908411
53228 2908411 2950602 2990665 3029288 3065401 3097105 3123779 3146655 3166968 3183929 3195210 3199278
53217 3199278 3196511 3187972 3174090 3154988 3131171 3103102 3070707 3034167 2994712 2953658 2910937 2865433
53205 2865433 2816568 2764756 2710591 2654746 2598661 2544040 2491190 2438685 2385172 2330679 2275683
53194 2275683 2219810 2162458 2104266 2046962 1991754 1938553 1886846 1836550 1787696 1739813 1692305
53183 1692305 1645340 1599909 1556868 1516254 1477737 1441405 1407604 1376059 1345732 1315925 1287252
53172 1287252 1261142 1238379 1218344 1199637 1181197 1162769 1144466 1126025 1106618 1085529 1063007
53161 1063007 1040252 1018329 997107 975388 952182 927931 904422 883314 864641 847002 829380
53150 829380 812397 797302 784052 771099 757024 741606 725331 708730 692559 677800 664803
53139 664803 652864 641071 629139 617109 604953 593097 582651 574225 566849 558870 549760 540355
53127 540355 531552 523471 515818 508360 501043 494182 488481 484396 481534 479193 477316 476351 476295 476432 475978
53112 475978 474556 472250 469746 468122 467863 468296 468621 469089 470260 471493 471483 470269 469295 469139 468523 466321
53096 466321 463444 461737 461667 461977 461198 458736 454897 450617 446949 444235 441936 439697 438127 437864 438274 437913
53080 437913 436197 433848 431722 429961 428434 427349 427024 427432 428264 429244 430247 431264 432369 433494 434228
53065 434228 434148 433372 432486 431751 430774 429252 427739 427184 427792 428799 429487 430019 431009 432526 433891 434337 433549
53048 433549 431726 429526 427901 427396 427422 426752 425047 423396 422870 422933 421942 418996 414674 410150 406267 403423
53032 403423 401516 399796 397453 394694 392700 392277 393051 394195 395285 396131 396554 396906 398045 399990 401245
53017 401245 400515 398650 397680 398099 398460 397791 397016 397356 398578 399740 400675 401564 401716 400175 397266 394328 391929
53000 391929 389587 387352 386371 387448 390111 393521 397146 399982 400536 398804 397156 397756 399732 400503 399434
52985 399434 398332 398373 398600 398089 397750 398746 400401 401069 400257 398564 396123 392575 388460 385364 384350 385023
52969 385023 386286 387338 387695 386886 384607 381118 377395 374809 374286 375503 377167 378352 379236 380315 381432
52954 381432 382089 382257 382220 382003 381613 381548 382317 383648 384886 385995 387444 389274 391056 392661 394252 395491
52938 395491 395628 394553 393121 392230 392079 392375 392660 392388 391343 390149 389840 390770 392401 394120 395731 397208
52922 397208 398617 400291 402388 404294 405135 404920 404496 404418 404600 404994 405721 406537 407193 408347 410944 414504 417320
52905 417320 418797 420318 423180 426867 430283 433509 437229 441209 444581 447098 449032 450237 450255 448994 446471
52890 446471 442415 437074 431937 428444 426311 424191 421775 420015 419283 418625 417108 414851 412256 409240 405838
52875 405838 402858 401136 400488 400015 399330 398975 399593 401003 402266 402610 402132 401505 401090 400605 399695 398466 397307
52858 397307 396472 396022 395881 395789 395579 395607 396419 397771 398601 398284 397160 395406 392441 388375 385143 384690 386393
52841 386393 387686 387246 386103 385446 384834 383347 381331 379984 379773 380100 380196 379746 378936 378412 378940 380639 382690
52824 382690 384066 384297 383403 381659 379819 379001 379614 380683 380920 380397 380534 382375 385462 388580 391040 392867
52808 392867 394125 394670 394565 394234 394034 393970 394107 394826 396066 396511 394519 390266 386183 384390 384171 382939 379568
52791 379568 375649 373187 372125 370875 368637 366262 364984 365079 365870 366521 366610 366215 365710 365447 365534 365887 366417
52774 366417 367034 367458 367134 365500 362630 359633 358104 358720 360511 361949 362679 363621 365299 366790 366772 365072
52758 365072 362589 360108 357981 356734 356998 358512 359928 360163 359519 359055 359254 359964 361330 363811 367003 369423
52742 369423 370201 370549 372547 376429 379970 380936 379442 377345 375843 374581 372857 370675 368356 365901 363317
52727 363317 361074 359671 359039 358803 358843 359094 359078 358371 357420 357101 357372 357163 356026 355148 356102 359025 362680 365886
52709 365886 368127 369054 368483 367079 366127 366093 365955 364438 361572 358742 357521 358664 361685 365049 367192 367807
52693 367807 367849 368124 368487 368698 369163 370007 370141 368388 365240 362481 361288 361646 363311 366099 369247 371777
52677 371777 373764 376260 379747 383699 387801 392317 396939 400656 403341 406184 409812 413321 416097 419162
52663 419162 423266 426740 427016 423854 419570 416332 414507 413335 411803 408937 404604 400158 397227 395863
52649 395863 394915 394064 394151 395402 396824 397754 398663 399760 399907 397869 393994 389953 387217 386168 386163 386104 385441
52632 385441 384976 386157 389304 393032 395608 396329 395533 394184 393681 395026 397531 399237 399270 399005 400092 402157
52616 402157 403448 403148 401851 400143 398120 396375 396119 397638 399551 400329 400047 399854 400082 399839 398609 397345
52600 397345 397264 398090 398458 397999 397969 399356 401320 402393 402647 403604 406245 410142 414463 418673 422002 423348
52584 423348 422376 420051 417599 415421 413342 411275 409106 406449 403062 399286 395831 393450 392860 394283 396826
52569 396826 399002 400267 401451 403357 405641 407551 409024 410526 412471 415352 419627 424642 428358 429116
52555 429116 427327 424719 422412 420580 419338 418742 418106 416522 414148 412052 410743 409768 408872 408570 409260 410504
52539 410504 411667 412795 414487 417077 420088 422378 423024 422334 421713 422132 423119 423776 424272 425421 427098 428234
52523 428234 428438 428591 429562 431221 432995 434567 435656 435872 435278 434527 434076 433731 433140 432175 430722 428917 427831
52506 427831 428911 432043 434938 435192 432565 428711 425339 423271 422518 422222 420960 418202 415345 414341 415340
52491 415340 416578 416694 416232 416619 418482 421336 424221 426106 426180 424452 421922 419780 418527 418018 418070 418563
52475 418563 419074 418974 418124 417292 417526 418979 420497 420641 419156 417220 416159 416286 417276 419163 422218 425953
52459 425953 429159 431151 432199 432349 430794 427314 423705 422476 424098 426645 428381 429663 431783 434891
52445 434891 438044 440766 443505 446691 450290 454310 458866 463370 466452 467268 466465 465281 463869 461062 455755
52430 455755 448253 440372 434446 431965 432585 434319 435070 434236 432764 431762 431410 431254 431077 431048 431249 431461 431476
52413 431476 431402 431657 432852 435502 439513 443875 447245 449069 449890 450503 451248 452355 454356 457458 460801 463201
52397 463201 464643 466272 468750 471469 473577 474945 475610 475202 473767 472432 472137 472063 470440 466825 462548
52382 462548 458882 455816 452784 449629 446443 443316 440660 439106 438635 438476 438147 437904 437802 437225 435937 434837
52366 434837 434933 436241 438416 441669 445974 450001 452207 452907 454102 457153 461725 467209 473862 481757 489471
52351 489471 494967 497781 499694 503176 509511 518388 528791 539830 550882 561521 571711 581742 591353
52338 591353 598928 602253 600391 594349 585667 575134 563437 552254 543470 537355 532549 528012 524200
52325 524200 521987 521210 520899 520506 520330 520835 522042 523658 525517 527589 529704 531623 533583 536474 541008
52310 541008 546836 553133 560090 569016 580484 593036 604413 613645 621327 628225 634386 639484 643339
52297 643339 646082 648280 650721 653693 656769 659715 663062 667220 671700 676123 681385 688639 697571 706993
52283 706993 716772 727609 739169 750392 761996 776623 795564 816924 838180 859104 880900 903748
52271 903748 926942 950671 976005 1003405 1032632 1063774 1097040 1131762 1166936 1202720 1240095
52260 1240095 1279046 1318277 1356837 1394846 1432417 1469111 1504774 1539622 1572883 1602561 1627575
52249 1627575 1649354 1670204 1690430 1708049 1721211 1730120 1736479 1741648 1745573 1747259 1746183 1743358 1740839
52236 1740839 1739913 1739869 1738801 1735572 1730655 1725078 1718968 1711558 1702594 1693353 1685889 1681315 1679161 1678536 1679411
52221 1679411 1682443 1688026 1696212 1707306 1721586 1738303 1755880 1773572 1792217 1812823 1835123 1858294
52209 1858294 1882480 1908456 1935911 1963192 1989004 2013424 2036785 2058315 2076595 2090956 2101881
52198 2101881 2110257 2116706 2121392 2123966 2123850 2121073 2116672 2111809 2106641 2100631 2093831 2087086 2080763 2073983
52184 2073983 2065579 2055409 2044272 2032793 2020845 2007923 1993716 1978380 1962545 1947025 1932472
52173 1932472 1919425 1908728 1901351 1897322 1895119 1892763 1889558 1886349 1884105 1882857 1882210 1882318 1883804 1886852
52159 1886852 1890923 1895458 1900547 1906688 1914085 1922459 1931390 1940499 1949419 1958229 1968146 1980906 1996638
52146 1996638 2012814 2026444 2037237 2047457 2058590 2069577 2078837 2086490 2093386 2099129 2102739 2104651
52134 2104651 2106383 2108395 2109843 2110474 2111124 2112116 2112691 2112577 2112615 2113101 2112952 2111505 2109858 2109117 2108289 2105438 2100443
52117 2100443 2095152 2091009 2087821 2084691 2080827 2075314 2067389 2057491 2047189 2037670 2029036 2021379 2015587 2012400
52103 2012400 2011271 2010915 2010689 2010865 2011879 2013941 2017264 2022010 2027890 2034264 2040781 2047508 2054327 2060662 2066168
52088 2066168 2071305 2076669 2081875 2085857 2088476 2091129 2095159 2100202 2105046 2109956 2116984 2127572 2140754
52075 2140754 2154460 2168066 2182854 2200262 2220444 2242536 2265574 2289029 2313078 2338690 2367084
52064 2367084 2398802 2433424 2470215 2508779 2548962 2590444 2632686 2675199 2717741 2760224 2802273
52053 2802273 2842677 2879459 2910961 2937125 2959419 2979309 2996961 3011460 3021888 3027798 3028910 3024956
52041 3024956 3016038 3002844 2986320 2967374 2946984 2926308 2906311 2887478 2870170 2855109 2842981
52030 2842981 2833586 2825914 2819306 2814067 2810793 2809610 2810432 2813324 2817939 2823135 2828025 2833207 2840222 2849951
52016 2849951 2862395 2877740 2896351 2917486 2939285 2960728 2982662 3006146 3030563 3054160 3075827
52005 3075827 3095410 3112785 3127663 3140138 3150535 3158699 3164081 3166387 3165430 3160476 3150494 3135194 3115259
51992 3115259 3091621 3065003 3036072 3005338 2972926 2939053 2904597 2870502 2836700 2802505 2768045
51981 2768045 2734257 2701238 2667799 2633307 2598910 2565937 2533991 2501985 2470707 2442777 2419721
51970 2419721 2400368 2382859 2367318 2355378 2347381 2341245 2334438 2326369 2318275 2311110 2304168 2295752 2284855
51957 2284855 2272034 2258799 2246080 2233110 2217901 2199004 2176735 2152484 2127197 2100979 2073840
51946 2073840 2045772 2015868 1982407 1944742 1904673 1865149 1827634 1791342 1754932 1718240 1682082
51935 1682082 1646871 1611902 1576028 1538915 1501561 1465561 1431914 1400697 1371748 1345277 1321675
51924 1321675 1301073 1283211 1267406 1252621 1238057 1223903 1210966 1199290 1187768 1175364 1162099
51913 1162099 1148367 1134153 1119610 1105689 1093155 1081479 1069668 1057733 1046321 1035417 1024760
51902 1024760 1015272 1008535 1004709 1002418 1000970 1001284 1004091 1008632 1013914 1019963 1026815 1033281 1037969 1040879
51888 1040879 1042890 1044198 1044371 1043467 1041829 1038914 1033594 1025924 1017833 1011839 1009594 1011590 1017335 1025547
51874 1025547 1034865 1044828 1055839 1068037 1080644 1092469 1102500 1109859 1113898 1114763 1113258 1109525 1102189
51861 1102189 1089530 1071552 1050387 1028608 1007480 986858 966245 945571 925164 905324 886068
51850 886068 867321 849422 833391 820372 810688 803611 798207 794092 791171 788993 786992 785325 785036
51837 785036 787324 792916 801991 814097 828069 842618 857318 872592 888622 904767 920149 934029
51825 934029 945338 952803 956261 957195 957090 955814 952371 946560 938751 928592 915572 900986 887907
51812 887907 878683 873320 870653 870006 871073 873055 874751 875337 874771 873914 874288 876866 880683 883261 882702 878736
51796 878736 871655 861566 849396 837450 827651 819764 812464 805714 800960 799266 800433 803873 809075
51783 809075 815005 820089 823326 824647 823918 820499 814506 807657 801792 796767 790854 783397 776115 771167
51769 771167 768576 766464 763590 760551 758276 756545 754895 754089 755246 757708 759244 758723 757394 756867 756778
51754 756778 755285 751220 744957 737760 731152 726570 724614 724656 725754 727790 731115 735447 739982 744395 748712
51739 748712 752099 752816 749972 744668 738877 733559 728400 723046 717868 713365 709289 704806 699497 693890
51725 693890 688848 684602 680730 676942 673486 670689 668593 667237 666883 667613 669031 670688 672468 674236 675443
51710 675443 675553 674720 673780 673797 675755 680097 686092 692236 698007 704753 713900 724549 733989 740804 746546
51695 746546 754009 764502 776994 789053 798074 802317 801691 797533 791356 783984 775916 767806 759909 751647
51681 751647 742713 734513 729450 728402 729757 731660 734676 741283 752890 768344 785538 803370 821334
51668 821334 838121 852202 863819 875116 887687 900873 913039 923640 932878 939722 941643 936845
51656 936845 926250 912893 899673 887855 877299 867377 857436 846783 834986 822522 810784 800885
51644 800885 792591 784914 777618 771528 767432 765535 766154 769832 776019 782388 786438 787593 787170 786697 786906
51629 786906 788011 790074 792977 796451 799972 802402 802303 799274 794576 789697 784675 778629 771634 765122 760484
51614 760484 758135 757931 759593 762591 766344 770831 776566 784105 794107 807615 825283 846123 867669
51601 867669 887395 903462 914395 919202 918043 911935 901592 887415 870663 853573 837839 823965
51589 823965 812468 804609 801020 800362 800327 799632 798301 796333 793007 787652 780624 773265 766819 761298 755450
51574 755450 748050 739047 729154 718716 707718 696596 686037 676063 666481 658391 653866 653408 654859
51561 654859 655634 655183 654405 653559 652089 650094 648746 649021 650602 652159 652543 651968 652126 654548 658630 662082
51545 662082 663745 664918 667149 669793 671036 670641 670191 670940 672888 676082 681407 689520 699917 711536
51531 711536 723769 736541 749876 763620 777116 788911 797155 800705 800031 797237 795130 795629 798597
51518 798597 802555 806873 812673 821215 832306 845243 860561 879479 901989 926831 953190 981001
51506 981001 1009538 1037308 1063909 1090806 1119469 1149537 1179248 1206989 1232154 1255598 1279821
51495 1279821 1307779 1340746 1378000 1418881 1463954 1513077 1563073 1608437 1644142 1667326 1677170
51484 1677170 1674379 1660538 1636963 1604095 1562373 1513298 1459128 1402136 1344777 1289696 1238431
51473 1238431 1190630 1145697 1104647 1068842 1037384 1007733 979204 953951 933690 916993 901036
51462 901036 884852 869588 856314 844952 834945 825668 816209 805852 794985 784825 776116 768591
51450 768591 761565 754409 746468 737337 727488 718202 710739 705863 703884 704500 706517 708446 709555 709920 709446
51435 709446 707563 704031 699415 694596 690493 688372 689435 693434 698393 702360 705061 707352 709748 712208
51421 712208 714736 717190 718863 719208 718690 717893 715930 710995 702722 692914 683500 674647 665408 655443 645421
51406 645421 636274 628689 623025 619084 616097 613269 610182 606534 602059 597072 592625 589614 588064 587754
51392 587754 589036 592317 597034 601962 606515 611068 616009 621289 627186 634788 645102 657943 672172
51379 672172 686961 702493 719392 737709 756453 773875 788139 798041 803558 805996 807477 809939
51367 809939 814206 819563 823870 824304 818885 808036 794534 781389 769694 758820 748322 738811 731030
51354 731030 725029 720596 717643 715702 713868 712012 711389 713122 716464 719506 721394 722943 725148 728115
51340 728115 731667 735985 741037 746000 749912 752734 755361 758774 763505 769745 777515 786668 796965 808331
51326 808331 821022 835522 852353 872049 895301 922902 955338 992532 1034221 1080524 1131726
51315 1131726 1187551 1247215 1310366 1377323 1447791 1519544 1588768 1651502 1704667 1746487 1776739
51304 1776739 1796229 1805195 1802348 1786123 1756680 1715909 1665658 1606973 1541203 1470830 1398675 1326875
51292 1326875 1257024 1190640 1128882 1072090 1020069 972746 930286 892834 860367 832623 809061
51281 809061 788952 771567 756163 742041 728972 717319 707266 698203 689568 681989 676515 672678
51269 672678 668489 662747 656250 650079 643855 636742 629368 623480 619946 618148 617193 616716 616491 616175 615635
51254 615635 614872 613524 611084 607758 604451 601655 598864 595398 591364 587632 585156 584498 585495 587104 587882
51239 587882 587017 584777 581823 578548 575453 573783 574988 579235 584816 589426 591990 593137 594159 595880
51225 595880 598489 601878 605719 609532 613236 617569 623579 631675 641452 652141 662517 670501 674047 673091
51211 673091 670020 667524 666414 665947 665519 665051 664205 662546 660595 659632 660052 660697 660309 658985 657654 656550
51195 656550 654792 651331 645940 639386 632959 627772 624243 622097 620734 619453 617481 614301 610178 606144
51181 606144 603260 601971 602075 602967 603874 604309 604488 604940 605546 605355 603720 601284 599352 598379 597509 595731 593257
51164 593257 591571 592149 595105 599131 602702 605171 606627 607101 606534 605454 604961 605709 607321 609092 610772
51149 610772 612279 613145 612997 612429 612681 614254 616255 617340 617116 616523 617034 619465 623382 627509 630800 633144
51133 633144 635113 637224 639513 641566 642787 642831 642063 641477 641987 643850 646763 650072 652756 653774 653017 651674
51117 651674 651092 651451 651983 652169 652074 651750 651100 650304 649605 648645 646790 644198 641738 639698 637492 634958 633018
51100 633018 632503 633223 634806 637487 641146 644462 646268 647119 648130 648737 647418 644664 643273 644796 647224
51085 647224 647494 645333 643162 642702 643147 642759 640999 638647 636668 635500 634979 634521 633631 632448 631526 631003
51069 631003 630445 629742 629601 630653 632461 634051 635243 636807 639277 642210 644789 646570 647435 647368 646838 646999
51053 646999 648878 652385 656512 660369 663610 666107 667869 669359 671285 673850 676638 679347 682133 685104
51039 685104 688055 691003 694385 698316 702186 705544 708872 712847 717235 721265 724817 728399 732087 735438
51025 735438 738520 742093 746394 750439 753059 754104 754150 753453 751894 749831 748337 748271 749335 750437 751118 752278
51009 752278 755068 759202 763217 766706 771406 779210 789810 801470 813723 827857 844704 863505 883351
50996 883351 904213 925670 945893 963110 977268 989273 999627 1009210 1020511 1035947 1054815 1073518
50984 1073518 1089397 1103110 1116772 1130984 1144488 1155729 1163659 1167542 1167278 1164069 1159896 1155865 1151262
50971 1151262 1144295 1133402 1117723 1096906 1071291 1042527 1013433 986646 963422 943963 928372
50960 928372 916388 906377 896034 884925 875459 870320 869499 870896 873343 877536 883914 891236 898105
50947 898105 904922 913273 923771 935545 947859 961431 977666 996822 1017421 1037611 1056810 1075670
50935 1075670 1094756 1114136 1134487 1157478 1184013 1212701 1241250 1269183 1297886 1327966 1358019
50924 1358019 1386573 1413935 1441143 1468065 1493786 1518500 1543765 1570581 1597939 1623599 1646072
50913 1646072 1665741 1684330 1703523 1724301 1747605 1775072 1808362 1847879 1893032 1943904 2001731
50902 2001731 2067287 2139739 2217825 2301299 2390200 2483344 2578868 2676189 2776264 2879630 2984915
50891 2984915 3089393 3190220 3285028 3372140 3450767 3520661 3581457 3632844 3675480 3711078 3741178
50880 3741178 3766336 3786869 3803880 3818800 3831855 3841266 3844116 3838264 3823919 3803600 3780135 3754400
50868 3754400 3725186 3691276 3652966 3610979 3564505 3511391 3450369 3382201 3308237 3228619 3142768
50857 3142768 3051323 2956570 2860687 2764296 2667319 2570840 2477340 2389076 2306860 2230588 2160246
50846 2160246 2095923 2037299 1983949 1936012 1893788 1856414 1821616 1787347 1753544 1721972 1694585
50835 1694585 1672256 1654610 1640290 1627419 1614579 1601796 1590255 1580823 1573215 1566791 1561553 1557890
50823 1557890 1555885 1555620 1557755 1562808 1569895 1577246 1584322 1592614 1603892 1618352 1634928 1652698 1671418
50810 1671418 1691377 1713476 1738870 1767746 1799033 1832092 1868040 1908231 1952003 1997461 2044388
50799 2044388 2094899 2150918 2212403 2278547 2349566 2426692 2511345 2604886 2708206 2821003 2942352
50788 2942352 3072590 3213634 3366819 3531518 3706815 3893337 4092073 4302143 4521044
50779 4521044 4746540 4976916 5209897 5442758 5673219 5898559 6113807 6312400 6489270
50770 6489270 6642465 6771808 6877255 6958902 7017333 7053449 7068952 7067449 7053882 7032159 7004294
50759 7004294 6972477 6940884 6914231 6895137 6883649 6878492 6877194 6875080 6865525 6842041 6800128 6737434
50747 6737434 6652929 6546094 6416584 6264566 6091569 5900754 5695908 5480216 5256382 5027699
50737 5027699 4798407 4572949 4355315 4149067 3957273 3781828 3622907 3479427 3350338
50728 3350338 3235682 3136389 3052762 2982990 2923546 2871473 2826115 2788081 2756707 2729314 2703205
50717 2703205 2677737 2653826 2631797 2610438 2588204 2564679 2540411 2515665 2489888 2462425 2433291
50706 2433291 2403096 2372524 2342028 2311634 2280745 2248585 2215429 2183036 2153044 2124975 2096869
50695 2096869 2068140 2040839 2017392 1998026 1981509 1967816 1958545 1954749 1955794 1960919 1970654 1985731
50683 1985731 2005434 2028274 2053960 2083661 2118388 2158210 2203257 2254455 2312643 2377642 2448893
50672 2448893 2526613 2611572 2703831 2802334 2905828 3013753 3126065 3242475 3361933 3482751
50662 3482751 3603242 3722479 3840339 3956560 4069848 4178166 4279645 4372687 4455274 4524819
50652 4524819 4578884 4615589 4633513 4632339 4614237 4583915 4546447 4505294 4462851 4422109 4386520
50641 4386520 4358320 4338002 4325439 4320338 4321227 4325168 4329382 4332492 4333208 4328150 4311969 4279905 4229844
50628 4229844 4162229 4078898 3982390 3875818 3762751 3646928 3531864 3420435 3314817 3216983
50618 3216983 3128985 3052295 2986990 2932249 2887878 2854774 2833709 2824344 2825976 2838465 2861403 2892677
50606 2892677 2929096 2968693 3011359 3056730 3102491 3145809 3185909 3224095 3261267 3296585 3329018
50595 3329018 3359477 3390640 3424815 3462384 3502252 3543392 3585756 3629924 3676320 3725159 3777016
50584 3777016 3832915 3893504 3958533 4027576 4101142 4180614 4267001 4359894 4457365 4556700 4655730
50573 4655730 4753999 4852192 4949750 5043525 5129777 5207156 5276573 5338522 5392398 5438594 5478680
50562 5478680 5511343 5529199 5522018 5483889 5416868 5328403 5226790 5119265 5012679 4913955 4828722
50551 4828722 4759024 4702697 4656038 4617716 4589546 4573041 4566011 4563245 4559552 4550976 4533917 4504979
50539 4504979 4462013 4404207 4331173 4243076 4141683 4029990 3910491 3784780 3654909 3523916
50529 3523916 3394697 3269505 3150751 3040779 2940103 2847123 2760508 2680949 2609853 2547435
50519 2547435 2493123 2446813 2408382 2376541 2349450 2326325 2307516 2293324 2283559 2277847 2275509 2275570
50507 2275570 2277864 2283673 2294088 2308089 2323543 2339945 2358755 2380993 2406174 2434172 2466626 2505320
50495 2505320 2550078 2599333 2652212 2708943 2769520 2833113 2898898 2966687 3036479 3107986 3180795
50484 3180795 3254554 3328733 3402544 3475501 3548073 3621741 3698541 3780550 3869501 3966671 4073164
50473 4073164 4190227 4318994 4459772 4611984 4775356 4951068 5141184 5346731 5566592
50464 5566592 5798282 6039314 6287511 6540517 6795607 7049822 7299834 7541817 7771945
50455 7771945 7986798 8182616 8354306 8496291 8604871 8679206 8719543 8725101 8694367 8627065
50445 8627065 8525157 8392255 8232999 8053135 7859376 7658663 7457693 7263028 7080886
50436 7080886 6916315 6772829 6653236 6560406 6496615 6462060 6454312 6469025 6500565 6541963 6585097
50425 6585097 6621582 6643343 6642298 6610453 6541694 6433929 6289278 6112444 5909507 5687716
50415 5687716 5454687 5216685 4978029 4742359 4513567 4294798 4087474 3892304 3710688
50406 3710688 3544037 3392142 3253451 3126961 3012813 2911019 2820573 2740068 2668463 2605132
50396 2605132 2549785 2502225 2461583 2426080 2394472 2367480 2346682 2332089 2321956 2314781 2310186 2307901
50384 2307901 2307594 2309920 2315969 2325107 2335120 2345222 2357058 2371717 2387682 2403247 2419045 2436098
50372 2436098 2452924 2467245 2479864 2494230 2512265 2532879 2554613 2577309 2600797 2624317 2648499
50361 2648499 2676203 2710070 2750229 2795400 2845235 2900534 2962009 3030046 3105374 3189106 3282124
50350 3282124 3384718 3496513 3616482 3743393 3876325 4014204 4154809 4295084 4432578
50341 4432578 4565643 4691869 4807613 4909918 4997978 5071658 5129256 5167885 5185672 5182410 5158201
50330 5158201 5112664 5045723 4958394 4852690 4731681 4600080 4463917 4328761 4198252 4074571
50320 4074571 3959951 3857260 3769378 3698490 3645849 3611457 3593651 3589418 3595579 3609543 3628681
50309 3628681 3649259 3666394 3674970 3670394 3649065 3609252 3551716 3478763 3392373 3293929 3185872
50298 3185872 3072536 2958503 2846705 2738588 2635104 2536473 2441819 2350582 2264161 2184865
50288 2184865 2113262 2047728 1986694 1930160 1878805 1832841 1792254 1757177 1727430 1702456 1682011
50277 1682011 1666108 1653915 1643793 1634980 1628244 1624158 1621768 1619996 1619535 1622030 1627782 1635490 1644089
50264 1644089 1653708 1664665 1676602 1688978 1701736 1715039 1728818 1742861 1757133 1771673 1786305
50253 1786305 1800632 1814400 1827933 1842036 1856945 1871035 1881011 1884015 1879699 1870244 1858688 1847480
50241 1847480 1837944 1830195 1823518 1817444 1812477 1809382 1808028 1807835 1809403 1814592 1824310 1836954 1849930 1862373
50227 1862373 1875391 1889723 1904212 1916967 1927228 1935362 1941646 1946060 1949193 1952394 1956685 1962129 1968596
50214 1968596 1976666 1987256 2000521 2015143 2028073 2034762 2030761 2014540 1988955 1959348 1930046 1902822
50202 1902822 1877925 1855323 1834776 1815856 1798636 1783994 1772851 1765414 1761379 1760462 1762421 1766827
50190 1766827 1773053 1780397 1788278 1796666 1806102 1816749 1827508 1836799 1844349 1851457 1859308 1867746 1875931
50177 1875931 1883284 1889203 1892761 1893698 1893473 1894508 1898398 1905137 1913732 1922989 1932023 1940872 1950810 1963600
50163 1963600 1980230 2000488 2023552 2048601 2074837 2101391 2127456 2152454 2175980 2197724 2217647
50152 2217647 2236412 2255508 2276496 2299595 2323037 2343824 2358873 2365395 2361099 2345109 2318475 2282943
50140 2282943 2239439 2188728 2133266 2076932 2022510 1970592 1921322 1875900 1835664 1800813 1770846
50129 1770846 1745172 1722295 1699336 1673511 1643575 1609166 1569994 1527015 1483346 1442119 1403700
50118 1403700 1366645 1331050 1299123 1272264 1249352 1228640 1209974 1194251 1181588 1170877 1160750
50107 1160750 1150497 1140461 1131880 1125975 1122925 1121965 1122376 1123867 1126222 1129410 1134124 1141338 1151107 1162530
50093 1162530 1175094 1189226 1205196 1222235 1239164 1255355 1270704 1285300 1299530 1313926 1328397
50082 1328397 1341978 1353669 1363171 1370612 1376121 1380072 1383248 1386326 1389514 1393035 1397608 1404078 1412790
50069 1412790 1423537 1435877 1449497 1464706 1482526 1503679 1527370 1551911 1576832 1603449 1632872
50058 1632872 1664460 1697101 1731173 1767846 1806828 1846264 1885269 1925633 1970551 2022292 2081490
50047 2081490 2147968 2221308 2300597 2384274 2470744 2559063 2648743 2738828 2827524 2913171 2995629
50036 2995629 3076491 3157860 3240897 3325003 3407629 3484765 3552268 3607081 3646926 3669086 3670688
50025 3670688 3650946 3612472 3559476 3494902 3419957 3335956 3245474 3151422 3055871 2960200 2865884
50014 2865884 2774623 2687866 2606466 2530633 2460059 2394209 2332693 2275277 2221556 2170823 2122338
50003 2122338 2075687 2030881 1988344 1948767 1912668 1880046 1850771 1825366 1804910 1789771 1778768
49992 1778768 1770184 1763519 1759621 1758971 1760543 1762877 1765768 1770081 1776018 1782462 1788233 1793231 1797793 1801565
49978 1801565 1803746 1804231 1803707 1802589 1800511 1796966 1791956 1785797 1778703 1770879 1762702 1754618 1747020 1740273
49964 1740273 1734490 1729138 1723242 1716333 1709046 1702590 1697683 1694070 1690881 1687329 1683215 1678941 1675041 1671713
49950 1671713 1668915 1666732 1665257 1664054 1661958 1657517 1649716 1638752 1626578 1616265 1609935 1607324 1607119
49937 1607119 1609567 1616564 1628851 1644549 1661522 1680339 1703697 1733419 1769261 1810314 1856142 1906317
49925 1906317 1959981 2016250 2074088 2131414 2185328 2234088 2278210 2318851 2355688 2387298 2413317
49914 2413317 2435095 2454076 2470412 2483410 2492313 2495731 2490827 2474132 2443454 2398711 2341175 2272865
49902 2272865 2196859 2117124 2037059 1958367 1881836 1808778 1740940 1679289 1623840 1574665 1532112
49891 1532112 1495840 1464695 1438090 1416684 1401034 1390282 1382931 1378312 1376350 1376410 1377597 1380079 1384829
49878 1384829 1391710 1398773 1404009 1407069 1408721 1409305 1408495 1406139 1402281 1396182 1386122 1370682 1349972 1325294
49864 1325294 1297962 1269026 1239987 1212788 1188491 1166484 1145776 1126828 1111225 1099608 1091008
49853 1091008 1084491 1080188 1077982 1076351 1073864 1071142 1069883 1070290 1071111 1072216 1075399 1081865 1090262 1098172
49839 1098172 1104810 1111452 1119854 1130943 1144362 1158499 1171497 1183030 1194648 1207748 1221693 1234529
49827 1234529 1244806 1251798 1254887 1254305 1252215 1251428 1252675 1254142 1253714 1250623 1244735 1235541 1222336 1204538
49813 1204538 1181682 1154388 1125690 1099875 1078924 1061130 1044122 1028078 1014802 1004782 996935
49802 996935 990637 986143 983084 980390 978092 977798 980769 986562 993930 1001950 1009872 1017055 1023851 1031736
49788 1031736 1041762 1053606 1066721 1081575 1098854 1118076 1137851 1156956 1174283 1188368 1198250
49777 1198250 1204692 1209545 1213839 1217238 1219204 1219680 1218498 1215108 1209306 1201638 1192723 1182700 1171716 1160608
49763 1160608 1150749 1143286 1138459 1135425 1132905 1130392 1128626 1128542 1130092 1132713 1136574 1142512 1150884 1161471
49749 1161471 1174374 1189790 1206774 1223603 1239805 1256429 1273515 1288766 1300095 1308381 1316113 1323921
49737 1323921 1330240 1334077 1336154 1337100 1336309 1333290 1328537 1321922 1311345 1294531 1271860 1246395 1221280
49724 1221280 1197907 1176251 1155826 1135994 1116183 1096364 1077212 1059706 1044648 1032331 1022280
49713 1022280 1013511 1005588 999342 995941 995219 995552 995547 995153 994951 995222 996393 999685 1006237 1015670 1026350 1037090
49697 1037090 1047946 1059300 1071014 1082769 1094519 1106084 1116864 1126464 1135158 1143004 1148752 1150418
49685 1150418 1147128 1139929 1130622 1120205 1108636 1095745 1082017 1068580 1056664 1047082 1039949 1034577
49673 1034577 1029484 1022861 1013709 1002883 992706 985259 981208 980395 982777 987937 994055 998687 1001083 1003016
49659 1003016 1006705 1012449 1019032 1025974 1034350 1045129 1057574 1069981 1081706 1093775 1107290 1121671
49647 1121671 1134750 1144352 1149518 1150476 1148072 1143477 1138092 1133263 1129871 1128001 1126837 1125159 1122391 1119104
49633 1119104 1115902 1111919 1105324 1095571 1084275 1073380 1063439 1054388 1046829 1041193 1036563 1032141 1029491
49620 1029491 1031275 1037490 1044947 1051285 1057830 1067343 1080303 1094883 1109665 1124963 1141941 1161582
49608 1161582 1183892 1206728 1225830 1237623 1242240 1242904 1242517 1242076 1242147 1244020 1248483 1254612 1260847 1266805
49594 1266805 1273268 1280671 1288081 1293302 1293452 1285906 1269571 1245651 1217079 1187095 1158173 1131761 1108453
49581 1108453 1088223 1070553 1054583 1039640 1026017 1014939 1007171 1001718 996594 991000 985953 982374
49569 982374 979404 975433 970310 965416 961518 957605 952356 945934 939444 933043 925606 916461 906630 897845
49555 897845 890910 885598 881538 878260 874636 869570 863738 859688 859367 861927 864621 865582 865138 864755 865475
49540 865475 867360 869768 871889 873393 874673 876313 878402 880621 882760 884860 887037 889541 892664 896161
49526 896161 899171 901385 903938 908238 913982 919221 922387 923442 923173 922553 923028 926057 931542 937668 943105
49511 943105 948494 954863 961503 966925 971493 977515 986448 997302 1008319 1019195 1030752 1043059 1054874
49498 1054874 1064947 1073144 1079997 1085553 1089066 1089922 1088668 1086871 1085792 1085229 1083799 1080356 1075048 1069078
49484 1069078 1063715 1059754 1057682 1057925 1060607 1065200 1070811 1076943 1083759 1091465 1099742 1108069 1116374 1124960
49470 1124960 1133931 1143147 1152679 1162898 1174116 1186614 1200982 1217793 1236874 1257441 1279022 1301469
49458 1301469 1323808 1344038 1360790 1374637 1387169 1399301 1411205 1423247 1435938 1449170 1462514
49447 1462514 1476285 1491506 1508807 1528121 1549348 1572285 1595513 1616065 1630590 1636558 1632516 1618122
49435 1618122 1594335 1563108 1526757 1488072 1450567 1417133 1387989 1361123 1335485 1312603 1294224
49424 1294224 1279559 1266273 1253466 1242090 1232747 1224717 1217285 1210614 1204842 1199490 1194373 1190240 1188013
49411 1188013 1188002 1190187 1194299 1199119 1202683 1204181 1205137 1207727 1212302 1217491 1222401 1227555 1233496 1239660 1245282
49396 1245282 1250727 1256981 1263943 1269971 1273427 1274233 1273447 1271562 1267926 1262114 1255217 1248903 1243346 1237013
49382 1237013 1228838 1219832 1211955 1205967 1201218 1197111 1193670 1190700 1187599 1184683 1183910 1187420 1195677 1207702
49368 1207702 1222703 1240507 1260570 1281926 1304683 1330481 1360617 1394651 1432054 1474294 1523364
49357 1523364 1578782 1638883 1705672 1784503 1874924 1962761 2025531 2047937 2031499 1989697 1936646
49346 1936646 1881311 1828808 1782552 1744281 1714032 1691164 1675029 1664900 1660118 1660353 1665041 1672827
49334 1672827 1682318 1693119 1705397 1718640 1731650 1743514 1753874 1762519 1769510 1775223 1779269 1779751 1774753
49321 1774753 1764469 1750783 1735027 1717442 1698750 1680617 1664084 1648721 1633877 1619763 1606855
49310 1606855 1595174 1584650 1575396 1567314 1560285 1555087 1553056 1554316 1557126 1559422 1560209 1559143 1555847 1550363
49296 1550363 1543413 1535587 1526911 1517635 1508462 1499450 1489679 1478823 1468215 1459558 1453250 1448633 1445146
49283 1445146 1442511 1440531 1439453 1439822 1441376 1442905 1443902 1445455 1448666 1453037 1457218 1460312 1461542 1459925
49269 1459925 1455755 1451436 1449229 1448685 1447769 1445877 1444137 1443231 1442828 1443056 1444743 1447875 1451319 1454424 1457607
49254 1457607 1461001 1463754 1465205 1465812 1466449 1467542 1469204 1471548 1474542 1478078 1482308 1487439 1493124 1498466
49240 1498466 1502584 1505022 1506211 1507905 1512220 1519362 1527104 1533584 1539743 1547752 1558145 1570272 1584681
49227 1584681 1602616 1623453 1645053 1666810 1689903 1714047 1736455 1755245 1771889 1788918 1806722
49216 1806722 1823922 1839618 1853850 1866764 1878446 1888833 1896908 1900792 1899488 1893773 1884806 1872972
49204 1872972 1858958 1844883 1833213 1825113 1820628 1819648 1821875 1826583 1833271 1842142 1853477 1867228 1883498
49191 1883498 1902533 1924137 1948437 1977358 2013317 2055665 2100449 2144854 2189517 2234387 2274303
49180 2274303 2301770 2313454 2311447 2298759 2276587 2246364 2211676 2176528 2142863 2110695 2079761
49169 2079761 2050381 2023299 1999204 1978284 1960412 1946106 1936564 1931846 1929712 1927520 1924896 1923319
49157 1923319 1923550 1925105 1927947 1932779 1939331 1946156 1952922 1961434 1973471 1988611 2005087 2022020 2039950
49144 2039950 2059789 2081978 2106309 2132000 2158188 2184678 2211861 2239738 2267629 2295209 2323248
49133 2323248 2352729 2383519 2414414 2444400 2473518 2502412 2531195 2558957 2584593 2608112 2630769
49122 2630769 2653816 2677597 2702128 2727877 2755351 2784353 2814423 2845816 2879412 2915861 2955390
49111 2955390 2998206 3044584 3094926 3150329 3212642 3283187 3361640 3446324 3534178 3618949 3690546
49100 3690546 3739014 3760395 3758138 3739057 3709368 3674432 3639753 3610123 3588041 3573885 3567305 3568007
49088 3568007 3575574 3589029 3606620 3626322 3647131 3669721 3694990 3722140 3749101 3774797 3799854
49077 3799854 3825060 3850588 3877207 3906837 3940754 3977849 4015497 4051822 4086695 4121099 4156070
49066 4156070 4192007 4228664 4265875 4303902 4342538 4380367 4416046 4450112 4484249 4518877 4553008
49055 4553008 4586727 4622137 4661341 4705028 4753597 4807924 4868046 4932850 5002497 5079856 5168265
49044 5168265 5269413 5385280 5520697 5680729 5864156 6059998 6251100 6422952 6572859
49035 6572859 6712491 6857925 7011329 7150760 7241252 7259314 7208345 7112234 6996162 6872084
49025 6872084 6737547 6584452 6409426 6218429 6023324 5835069 5660440 5503294 5365767
49016 5365767 5247404 5145545 5058212 4985434 4926726 4879061 4839102 4806171 4780864 4761444 4743986
49005 4743986 4726186 4709054 4694247 4681367 4668772 4655829 4643323 4632269 4623271 4616582 4611853 4607856
48993 4607856 4603242 4597921 4593439 4591607 4592713 4595171 4597106 4598185 4599481 4601520 4603185 4603191 4602090 4601705 4602687
48978 4602687 4603856 4604289 4604872 4606975 4610585 4614927 4620319 4627994 4638148 4649602 4661731 4675351 4690875
48965 4690875 4706486 4719167 4727197 4730929 4731708 4731031 4730444 4730883 4731715 4731277 4728924 4726152 4725426 4728371 4735201
48950 4735201 4745026 4756056 4766127 4774134 4781121 4789327 4799936 4812082 4824168 4835675 4847335 4859720
48938 4859720 4872090 4882730 4890320 4894866 4897404 4898951 4899772 4899358 4896800 4891319 4882905 4872577 4861683
48925 4861683 4850716 4839120 4826452 4813336 4800843 4789259 4778149 4767577 4758581 4752161 4748329 4746521
48913 4746521 4746545 4748769 4753665 4761667 4773164 4787938 4804585 4821153 4836674 4851683 4867100 4883162
48901 4883162 4899754 4917047 4934951 4952276 4967544 4980913 4994578 5010904 5030744 5053909 5080456
48890 5080456 5110601 5143791 5178977 5216131 5256743 5302411 5353449 5409405 5470513 5537752 5611156
48879 5611156 5688743 5767833 5847513 5929356 6015596 6106971 6202564 6301218 6402462 6506213 6612347
48868 6612347 6720702 6830942 6942209 7053438 7164268 7275140 7386187 7496472 7604758
48859 7604758 7710698 7814867 7917892 8019900 8120554 8219235 8315317 8408402 8497991 8582928
48849 8582928 8661823 8734347 8801519 8864385 8923198 8978325 9030865 9081360 9128686 9171436 9209814
48838 9209814 9244830 9276197 9302683 9324380 9342828 9358550 9370083 9375998 9376406 9371709 9361296 9344617
48826 9344617 9322432 9295666 9263728 9225242 9180062 9129334 9073762 9012935 8946515 8875201 8800145
48815 8800145 8721868 8639940 8553656 8463071 8369506 8274633 8178775 8080455 7978020 7871404 7762037
48804 7762037 7651575 7541326 7432504 7326249 7223454 7125043 7032179 6945691 6865572 6791664
48794 6791664 6724598 6665415 6614429 6571130 6534941 6505216 6480647 6459850 6442781 6430497 6423085
48783 6423085 6418839 6416323 6416443 6421438 6432301 6448272 6468587 6493381 6522653 6555525 6591202 6629773
48771 6629773 6671194 6714044 6756156 6796281 6834555 6871736 6908791 6946816 6986173 7025735 7064102
48760 7064102 7101604 7139870 7179235 7218076 7255305 7291952 7329204 7366378 7402452 7438473 7476302
48749 7476302 7515503 7553659 7589929 7626243 7664456 7704072 7743640 7782926 7822633 7862985 7903631
48738 7903631 7944256 7984463 8023665 8061816 8099642 8137476 8174448 8209548 8242949 8275557 8307624
48727 8307624 8338364 8366579 8391058 8410694 8424706 8432639 8434081 8428903 8417846 8401970 8381042 8353166
48715 8353166 8316357 8269762 8213005 8145626 8068132 7982690 7891696 7796156 7696319 7593135 7487956
48704 7487956 7381358 7273456 7165184 7058234 6953935 6853016 6756123 6663569 6574830 6489296
48694 6489296 6407391 6330007 6257144 6188160 6123230 6063492 6009776 5962220 5921088 5886753 5858745
48683 5858745 5835877 5817672 5804722 5797279 5794374 5794593 5796963 5800762 5805367 5810715 5817246 5825090 5833997
48670 5833997 5844167 5856061 5868880 5880318 5888636 5894134 5897716 5898936 5896795 5891951 5886517 5881488 5875688
48657 5875688 5867849 5858694 5850117 5842937 5836388 5829566 5822482 5815625 5809320 5803876 5799762 5797037 5794841 5791961
48643 5791961 5787871 5782934 5777622 5771875 5765207 5757262 5748315 5739345 5731410 5724684 5718489 5712577 5707966 5705878
48629 5705878 5706211 5707809 5709922 5712563 5715720 5719302 5723823 5729768 5735982 5739919 5740063 5737004 5731661 5723756
48615 5723756 5712870 5699763 5685372 5669295 5650486 5628813 5604732 5577887 5547222 5512169 5472704
48604 5472704 5428769 5380837 5330645 5279975 5228762 5175698 5120698 5065554 5012125 4961146 4912967
48593 4912967 4867819 4824434 4779483 4729542 4673476 4612467 4548287 4482238 4415471 4349507 4286112
48582 4286112 4226731 4172010 4121686 4074886 4030549 3987802 3946180 3905553 3865592 3825418 3784182
48571 3784182 3741960 3699518 3657317 3615622 3575587 3538897 3505688 3474042 3442487 3411892 3383627
48560 3383627 3356762 3328728 3298415 3267226 3237293 3209940 3185614 3163853 3143227 3122588 3102486
48549 3102486 3084327 3068359 3053908 3041546 3033293 3030154 3030861 3033743 3038575 3045602 3053653 3060365 3064002
48536 3064002 3064532 3063179 3061272 3059296 3056830 3053518 3049837 3046373 3042764 3038151 3032321 3025224 3015509 3001125
48522 3001125 2981802 2959685 2936764 2912780 2886497 2858256 2830306 2804981 2783192 2764370 2747319
48511 2747319 2731285 2716522 2703751 2693220 2684748 2678594 2675460 2675524 2678272 2683434 2691187 2700950 2710846
48498 2710846 2719045 2725203 2730069 2734116 2736993 2737857 2735639 2729289 2718320 2703237 2685289 2665931 2646512
48485 2646512 2628140 2611592 2597373 2585754 2576475 2568539 2560591 2551509 2540523 2527151 2511453 2494048
48473 2494048 2475422 2455511 2434456 2413491 2394471 2378608 2365917 2355539 2346519 2339028 2335135 2337256
48461 2337256 2345176 2355855 2367008 2379227 2392928 2404755 2409503 2404930 2392365 2373293 2348347 2319815
48449 2319815 2292059 2268172 2248176 2231398 2218659 2211050 2208300 2209575 2214560 2222799 2233377 2246357
48437 2246357 2263391 2285892 2313351 2343671 2373663 2398700 2413758 2416202 2406713 2387216 2359644 2327477
48425 2327477 2296038 2269108 2246218 2224759 2203685 2183614 2164529 2145450 2126085 2107128 2088831
48414 2088831 2070397 2050942 2030509 2010223 1991635 1975420 1960619 1946001 1932278 1921774 1915525
48403 1915525 1912054 1909524 1907606 1906497 1905697 1904912 1904901 1906266 1908525 1911371 1915588 1921616 1928513 1935624 1944049
48388 1944049 1954978 1967483 1979217 1988466 1994496 1997095 1996964 1995481 1992894 1988076 1981293 1975515 1973122
48375 1973122 1972660 1970983 1967507 1963979 1960754 1955734 1946923 1934193 1918664 1902056 1886442 1872906 1860358
48362 1860358 1846955 1832438 1817763 1803010 1787419 1771228 1755759 1741665 1728542 1716122 1704320
48351 1704320 1692203 1678556 1663602 1648754 1634534 1620095 1605020 1590293 1577110 1565808 1556252
48340 1556252 1548414 1542213 1537358 1533511 1530255 1527172 1524323 1522136 1520310 1517571 1513214 1508007 1502685 1496523
48326 1496523 1488700 1480290 1473422 1468865 1465660 1462682 1459325 1455147 1450187 1445444 1441954 1439651 1438061 1437565
48312 1437565 1438822 1441303 1443426 1443937 1442559 1439903 1437372 1436169 1435603 1433461 1428990 1424256 1421434 1420130
48298 1420130 1418790 1417302 1416472 1416214 1416186 1417131 1419478 1421514 1421015 1418115 1414776 1412266 1410946 1411527 1414139 1416763
48282 1416763 1416966 1415102 1413902 1415152 1418445 1422752 1427328 1431421 1434914 1439140 1445587 1454053 1463161 1472080
48268 1472080 1480687 1489142 1498457 1510120 1523780 1537005 1548852 1561690 1577642 1595527 1613810 1634192
48256 1634192 1659255 1688515 1720081 1754351 1792479 1832805 1872598 1912128 1953189 1994709 2033568
48245 2033568 2068948 2102368 2134528 2165781 2198576 2235619 2276728 2321098 2371120 2429780 2495820
48234 2495820 2565965 2640574 2722574 2812440 2909099 3014171 3130064 3255494 3388399 3531545
48224 3531545 3689465 3861879 4046500 4246354 4467623 4712826 4983882 5289357 5640039
48215 5640039 6039939 6491011 7003350 7589584 8252973 8994992 9831919 10788637 11879470
48206 11879470 13113989 14517896 16123759 17944980 19992602 22309028 24904627 27593759
48198 27593759 29925369 31367553 31617108 30741756 29053297 26891926 24519536 22124193
48190 22124193 19835039 17719014 15796022 14071636 12550248 11226351 10083366 9104140
48182 9104140 8273052 7569433 6969511 6455267 6014398 5633495 5298834 5002533 4740997
48173 4740997 4508355 4297405 4105389 3932658 3776626 3632441 3498359 3375194 3261604
48164 3261604 3154792 3054643 2962232 2875368 2790395 2707617 2630303 2558980 2491091 2425778 2364693
48153 2364693 2308266 2255072 2204882 2158832 2116672 2077044 2040263 2007753 1978872 1951104 1922953
48142 1922953 1893964 1862488 1826504 1786427 1744499 1701661 1657566 1613087 1570070 1528862 1488719
48131 1488719 1450322 1415389 1384022 1354885 1327747 1303516 1282092 1262567 1245244 1231024 1218997
48120 1218997 1207173 1195465 1185529 1177635 1170121 1162199 1154972 1149290 1144645 1140617 1137498 1134942 1131691
48107 1131691 1127230 1122460 1118412 1115385 1113382 1112253 1111490 1110984 1111645 1114045 1116892 1118231 1117853 1117179 1117281
48092 1117281 1118441 1121045 1125076 1129043 1131227 1131971 1133127 1135428 1137979 1140199 1142488 1145015 1147549 1150666
48078 1150666 1155479 1161745 1167619 1171712 1174446 1177190 1180855 1185353 1189713 1193124 1196644 1203043 1213646 1226077
48064 1226077 1236762 1245143 1253599 1263640 1274226 1283998 1293167 1302621 1312680 1323421 1335208 1348389
48052 1348389 1363110 1379420 1396879 1414432 1431635 1449661 1469941 1492184 1514930 1537589 1560694
48041 1560694 1584623 1609514 1635886 1663707 1691267 1716775 1740725 1764844 1789042 1811612 1832484
48030 1832484 1853968 1877730 1902906 1927694 1950934 1971690 1989403 2005351 2022126 2040599 2058867
48019 2058867 2074993 2089110 2101805 2112312 2120019 2126576 2134616 2144827 2155604 2165280 2173503 2180539
48007 2180539 2186288 2190422 2193203 2195935 2200202 2206243 2212346 2216579 2218947 2220997 2223542 2225897 2227190 2226913
47993 2226913 2223932 2216474 2203938 2187702 2169552 2150245 2130066 2109460 2088099 2064241 2036204 2004223
47981 2004223 1970202 1935978 1902259 1868824 1835283 1801823 1769318 1738291 1707823 1676321 1643424
47970 1643424 1610376 1578325 1547220 1516642 1486826 1458412 1431957 1407958 1386622 1367410 1349641
47959 1349641 1333689 1320450 1309394 1298304 1285470 1271093 1256133 1241087 1226601 1214018 1204167
47948 1204167 1196319 1189128 1181868 1174151 1165613 1156834 1149648 1145207 1142351 1139007 1134728 1130762 1128133 1126878
47934 1126878 1126971 1128692 1131840 1135341 1137899 1138625 1137202 1133999 1130004 1126219 1123100 1120751 1119316 1118848 1119063
47919 1119063 1119524 1119684 1118625 1115457 1110437 1104997 1100079 1095168 1089726 1084871 1082475 1082903 1084712 1086483 1087858
47904 1087858 1088772 1088772 1087740 1086632 1086869 1089203 1093411 1098790 1104571 1110070 1115002 1119937 1126169 1134638 1144803
47889 1144803 1154994 1164186 1173171 1183619 1196335 1210959 1226917 1243641 1259992 1274691 1287738 1300570
47877 1300570 1314282 1328303 1341189 1351962 1360247 1365884 1369147 1370778 1371242 1370399 1368334 1365797 1363131
47864 1363131 1359446 1353765 1346584 1339391 1332824 1326119 1318243 1308842 1298026 1285858 1272276 1257383 1241895
47851 1241895 1227284 1215051 1205568 1198123 1192334 1188740 1187461 1187060 1185810 1183688 1182194 1182330 1183807 1186221
47837 1186221 1189968 1195496 1202245 1208964 1215159 1222025 1231644 1244831 1259799 1273592 1285142 1296274 1309230
47824 1309230 1323899 1338203 1350575 1361104 1370561 1379332 1387221 1393470 1396980 1397235 1394984 1391398 1386785
47811 1386785 1380858 1373892 1366476 1358163 1347691 1334883 1321207 1307919 1294586 1280121 1264474 1248439
47799 1248439 1232443 1216469 1200957 1186956 1175327 1166298 1159681 1155007 1151461 1148255 1145175 1142372 1139579
47786 1139579 1136052 1131627 1127566 1125896 1127833 1132973 1139917 1147424 1154934 1162386 1169835 1177178 1183927 1189323
47772 1189323 1193022 1195782 1199171 1204304 1210883 1217453 1222471 1225143 1225627 1224791 1223756 1223467 1224484 1226822 1229759
47757 1229759 1232092 1233209 1233967 1236067 1240454 1246737 1254109 1262060 1270111 1277898 1286278 1297613 1313901 1334830
47743 1334830 1358418 1383421 1410386 1440467 1473961 1510192 1548195 1587227 1626744 1665906 1703067
47732 1703067 1736190 1764253 1787981 1808643 1826248 1839424 1846766 1847720 1842395 1831362 1815731 1796841
47720 1796841 1775770 1753463 1730946 1708727 1686307 1663261 1640719 1620619 1603431 1587735 1572367
47709 1572367 1557727 1544408 1531736 1518739 1505771 1494095 1484386 1476626 1470952 1467407 1465053 1462602
47697 1462602 1460125 1459200 1461092 1465511 1471392 1478057 1485269 1492905 1501144 1510439 1520707 1530906 1539991 1548035
47683 1548035 1556032 1565020 1575943 1589794 1606772 1625329 1643274 1660299 1678382 1698905 1720263 1739468
47671 1739468 1755595 1770097 1783782 1795217 1802902 1807549 1810730 1812126 1809780 1802936 1793047 1781735 1769180
47658 1769180 1755019 1739463 1722516 1703151 1680538 1655575 1630116 1605116 1580733 1557852 1537914
47647 1537914 1520958 1505264 1489540 1474446 1461394 1450994 1443544 1439909 1440460 1443702 1447415 1451044 1455734
47634 1455734 1462053 1469137 1476435 1484917 1495775 1508903 1523599 1540013 1558869 1580078 1602532 1625126
47622 1625126 1647350 1669052 1690170 1710489 1729171 1744921 1757274 1767380 1776688 1785069 1791033 1793670
47610 1793670 1793441 1791050 1786452 1779170 1768843 1755251 1738450 1718999 1697514 1674116 1649114 1623979
47598 1623979 1600383 1578156 1555706 1532934 1512199 1495329 1480975 1466270 1450331 1434696 1420976
47587 1420976 1409647 1400923 1395212 1392321 1391320 1391473 1392635 1394674 1397415 1401234 1406733 1413526 1420115 1425350
47573 1425350 1429365 1432859 1436190 1439591 1443641 1449045 1456240 1465484 1476956 1490611 1506385 1524630 1545796
47560 1545796 1569638 1595449 1623340 1654491 1689645 1727924 1767692 1807940 1848223 1887771 1925474
47549 1925474 1960458 1991838 2018011 2037056 2048003 2051221 2047374 2036399 2017662 1990783 1956109 1914661
47537 1914661 1867799 1816845 1762968 1707399 1651520 1596463 1542696 1490387 1440169 1393236 1350451
47526 1350451 1311645 1275977 1242879 1212412 1184797 1159965 1137717 1118103 1101220 1086537 1072748
47515 1072748 1058672 1044319 1030853 1019484 1010565 1003674 998163 993450 989116 985090 981737 979520 978545
47502 978545 978402 978386 977858 976619 975049 973713 972662 971340 969383 967413 966721 968084 970992 974019 975888
47487 975888 976375 976406 977223 979191 981475 983010 983673 984270 985582 987900 991327 995767 1000284 1003174 1003412 1001738
47471 1001738 999669 997630 994879 991233 987858 985880 984977 984098 983067 982570 982710 982520 981141 978819 976454
47456 976454 974688 973852 974328 976347 979413 982282 983678 983104 981069 978589 976294 974000 971254 968114 965084
47441 965084 962419 960089 958435 958113 959028 959926 959681 958657 958157 958733 959577 959558 958420 957023 956760 958672 962675
47424 962675 967625 972347 976577 980713 985051 989696 994955 1001131 1007892 1014375 1019942 1024411 1027621 1029396
47410 1029396 1030018 1030190 1030375 1030678 1031407 1032958 1034838 1035631 1034693 1033410 1033944 1036834 1040603 1043821 1046716 1050296
47394 1050296 1054361 1057265 1057837 1057023 1057170 1059982 1065675 1073996 1085050 1098578 1113145 1127128 1140546
47381 1140546 1155067 1172132 1191822 1213776 1238214 1265290 1294032 1322962 1351764 1381660 1413944
47370 1413944 1448607 1484536 1520705 1556876 1593294 1629830 1665489 1698796 1728712 1754975 1777405
47359 1777405 1795211 1807369 1813423 1813317 1806589 1792569 1771836 1746811 1720247 1693399 1666214 1638918
47347 1638918 1612448 1587247 1562566 1537526 1512402 1488487 1467065 1448891 1434169 1422386 1412468
47336 1412468 1403662 1396168 1390639 1387437 1386892 1389621 1395683 1403804 1412534 1421974 1433165 1445828 1458131
47323 1458131 1469017 1479344 1490071 1500617 1509843 1517530 1523765 1527835 1528930 1527301 1523636 1517930 1510050
47310 1510050 1500722 1490712 1479533 1466276 1451185 1435025 1417361 1397083 1374469 1351127 1327933
47299 1327933 1304608 1281305 1258821 1237002 1214750 1192172 1170994 1152153 1134648 1117652 1102082
47288 1102082 1088811 1076799 1064582 1052621 1042657 1035396 1030224 1026607 1024389 1023052 1022034 1021739 1023170
47275 1023170 1026470 1030547 1034048 1036300 1037722 1039876 1044453 1051424 1058683 1064266 1068302 1072012 1075693 1078967
47261 1078967 1082269 1086452 1091083 1094605 1096285 1096775 1096626 1095467 1092970 1089673 1086456 1083867 1082030 1080627
47247 1080627 1079027 1077153 1076001 1076489 1078107 1079723 1081476 1084592 1089484 1095363 1101832 1109409 1118217 1127527
47233 1127527 1137041 1147304 1158372 1169500 1180787 1193724 1209044 1225296 1240703 1255486 1271029
47222 1271029 1287482 1303483 1317892 1330620 1341985 1352340 1362181 1371751 1380558 1388001 1394300 1400156
47210 1400156 1405643 1410116 1413080 1414547 1414700 1413746 1411923 1409128 1404851 1399035 1392562 1386091 1378767 1369085
47196 1369085 1357053 1344709 1334424 1327144 1322166 1317906 1313038 1307579 1302853 1299857 1298041 1296514 1295968
47183 1295968 1298069 1303013 1309199 1315736 1323795 1334731 1348119 1362755 1378626 1396607 1416818 1438645
47171 1438645 1462136 1488056 1516446 1546218 1576354 1606418 1635371 1660750 1679941 1692190 1699023
47160 1699023 1702899 1705590 1707362 1707104 1703322 1695449 1684384 1671773 1658860 1646095 1633506 1621065 1608720
47147 1608720 1596386 1584052 1571886 1560224 1549361 1539139 1528760 1517452 1505653 1495240 1488167
47136 1488167 1485048 1485352 1488574 1494440 1502132 1510473 1519386 1530381 1544825 1562249 1581145 1601117 1623295
47123 1623295 1648640 1676706 1706246 1736322 1766494 1796580 1826708 1857219 1888113 1918806 1948562
47112 1948562 1976766 2002705 2025670 2045617 2063059 2077846 2088730 2094846 2097039 2096786 2094198 2088149
47100 2088149 2078319 2065919 2052244 2037593 2022080 2006507 1991618 1977127 1962288 1947173 1932728
47089 1932728 1919744 1908263 1897874 1888168 1879123 1871367 1865707 1862096 1859490 1857246 1856118 1857111 1859853
47076 1859853 1863184 1867033 1872344 1878994 1885119 1889051 1890779 1890802 1888768 1884295 1878142 1871063 1862041 1849350
47062 1849350 1833314 1816358 1799906 1782731 1763179 1741839 1720794 1701008 1681672 1661868 1641762
47051 1641762 1622160 1603745 1586815 1571029 1555291 1538731 1522028 1507156 1495384 1485978 1477164 1467862
47039 1467862 1458099 1448246 1438626 1429743 1422296 1416780 1413317 1411807 1412001 1413461 1415834 1419200 1423926 1430206
47025 1430206 1437974 1447095 1457070 1466565 1474024 1479271 1484038 1490244 1497937 1505453 1511374 1515568 1518352 1519589
47011 1519589 1519127 1517477 1515413 1513189 1510691 1508150 1506159 1505120 1505075 1506000 1507853 1510441 1513625 1517508 1522114
46996 1522114 1527289 1533465 1541941 1553405 1566460 1578906 1590459 1602765 1616435 1629793 1641553 1653130
46984 1653130 1666620 1681448 1695026 1706478 1717757 1730757 1744926 1758481 1770701 1782080 1793081
46973 1793081 1803785 1814500 1825908 1838462 1851773 1864568 1875417 1884019 1891641 1899547 1907000 1911728
46961 1911728 1912557 1910612 1907493 1903332 1897383 1889647 1880831 1871315 1861353 1852001 1844660 1839553 1835484 1831298
46947 1831298 1826900 1822778 1819261 1816591 1815204 1815521 1817634 1821405 1826646 1833010 1839811 1846184 1851775 1857488
46933 1857488 1865297 1876640 1890854 1905785 1920250 1935140 1951648 1969277 1986621 2003608 2021680
46922 2021680 2041760 2063107 2084413 2105151 2125516 2145757 2165991 2186274 2206517 2226608 2246637
46911 2246637 2266687 2286494 2305698 2324112 2341136 2355334 2365638 2372900 2379093 2384927 2389449 2392250
46899 2392250 2394568 2397493 2400440 2402515 2404401 2407589 2412428 2418243 2424913 2432920 2441999 2451154 2460306 2470895
46885 2470895 2484329 2500414 2517535 2533910 2548610 2561947 2575018 2588507 2602002 2614900 2627627
46874 2627627 2641130 2655235 2668488 2679856 2689651 2698308 2704925 2707624 2705035 2697040 2684485 2668617
46862 2668617 2650558 2630856 2609577 2586922 2563573 2540319 2517689 2496129 2476200 2458316 2442505
46851 2442505 2428677 2416892 2407218 2399581 2394017 2390976 2391189 2395363 2403969 2417079 2434259 2454862 2478624
46838 2478624 2505842 2536831 2571239 2607922 2645459 2683039 2721027 2760451 2801552 2843044 2883160
46827 2883160 2921173 2957316 2991518 3023056 3051401 3076536 3098324 3116518 3131686 3145235 3158075
46816 3158075 3169960 3180507 3190016 3198857 3207060 3215251 3225043 3237472 3251691 3266327 3281711 3299669
46804 3299669 3321313 3346015 3372408 3399401 3426208 3452299 3477519 3501727 3524343 3544801 3563225
46793 3563225 3579974 3594705 3606606 3615265 3620488 3621637 3618331 3611725 3603788 3595052 3584313 3571021 3556887
46780 3556887 3544417 3534612 3526769 3519900 3513771 3509044 3506990 3508691 3514095 3522091 3531630 3542320 3553948
$$ [...]
##END NTUPLES=NMR SPECTRUM
##END=
