
##TITLE=AC1082_NSTO01_5818588_j4YIMWLkmI
##JCAMPDX= 6.0         $$ Bruker NMR JCAMP-DX V2.0
##DATA TYPE= NMR SPECTRUM
##DATA CLASS= NTUPLES
##ORIGIN= BRUKER
##OWNER= Administrator
$$ 1.72 TOPSPIN		Version 2.1
$$ 2012-03-26 19:56:40.765 -0500  Administrator@TOPSPIN
$$ Compression mode = diff/dup
##.OBSERVE FREQUENCY= 400.13188235
##.OBSERVE NUCLEUS= ^1H
##.ACQUISITION MODE= SIMULTANEOUS (DQD)
##.ACQUISITION SCHEME= undefined
##.AVERAGES= 64
##.DIGITISER RES= 22
##SPECTROMETER/DATA SYSTEM= spect
##.PULSE SEQUENCE= noesygpps1d.comp
##.SOLVENT NAME= COFFEE_meoh
##.SHIFT REFERENCE= INTERNAL, COFFEE_meoh, 1, 14.96883
##AUDIT TRAIL= $$ (NUMBER, WHEN, WHO, WHERE, PROCESS, VERSION, WHAT)
$$ ##TITLE= Audit trail, TOPSPIN		Version 2.1
$$ ##JCAMPDX= 5.01
$$ ##ORIGIN= Bruker BioSpin GmbH
$$ ##OWNER= Administrator
$$ $$ C:\Bruker\TOPSPIN/data/COFFEE/nmr/AC1082_NSTO01_5818588_j4YIMWLkmI/12/pdata/1/auditp.txt
$$ ##AUDIT TRAIL=  $$ (NUMBER, WHEN, WHO, WHERE, PROCESS, VERSION, WHAT)
(   1,<2012-03-26 19:56:35.546 -0500>,<Administrator>,<TOPSPIN>,<go>,<TOPSPIN 2.1>,
      <created by zg
	started at 2012-03-26 19:45:03.859 -0500,
	POWCHK enabled, PULCHK disabled,
       configuration hash MD5:
       1A 1E CE 29 27 FD 77 03 67 4E F0 E3 C4 B2 CB 90
       data hash MD5: 64K
       4C 00 55 EF EF 1F C9 AC 10 F7 F3 2D C2 1E 20 60>)
(   2,<2012-03-26 19:56:38.437 -0500>,<Administrator>,<TOPSPIN>,<proc1d>,<TOPSPIN 2.1>,
      <Start of raw data processing
       efp LB = 0.3 FT_mod = 6 PKNL = 1 PHC0 = 0 PHC1 = 0 SI = 128K 
       data hash MD5: 128K
       33 A9 17 3F C6 19 52 2C EC 53 9D 6A 37 B2 6B 8A>)
(   3,<2012-03-26 19:56:39.875 -0500>,<Administrator>,<TOPSPIN>,<proc1d>,<TOPSPIN 2.1>,
      <pk PHC0 = 31.64612 PHC1 = 0 
       data hash MD5: 128K
       69 7F 05 19 A3 63 72 DD E4 79 EC 16 2C 02 0D E1>)
(   4,<2012-03-26 19:56:40.453 -0500>,<Administrator>,<TOPSPIN>,<proc1d>,<TOPSPIN 2.1>,
      <abs ABSG = 1 
       data hash MD5: 128K
       50 58 CE 30 BA C3 E4 59 1B 53 7B 0A 11 72 CB 3F>)
(   5,<2012-03-26 19:56:40.515 -0500>,<Administrator>,<TOPSPIN>,<proc1d>,<TOPSPIN 2.1>,
      <abs ABSG = 2 
       data hash MD5: 128K
       37 F7 69 AC 98 35 38 88 99 63 4B 99 82 52 52 EE>)
(   6,<2012-03-26 19:56:40.578 -0500>,<Administrator>,<TOPSPIN>,<proc1d>,<TOPSPIN 2.1>,
      <abs ABSG = 3 
       data hash MD5: 128K
       9B B6 FE FC CE 14 62 1A B5 F9 CE 20 9B 23 B0 E5>)
(   7,<2012-03-26 19:56:40.640 -0500>,<Administrator>,<TOPSPIN>,<proc1d>,<TOPSPIN 2.1>,
      <abs ABSG = 4 
       data hash MD5: 128K
       0D FD 0F 41 FF C0 56 5A 27 F4 A5 66 7E FD 50 18>)
(   8,<2012-03-26 19:56:40.687 -0500>,<Administrator>,<TOPSPIN>,<proc1d>,<TOPSPIN 2.1>,
      <abs ABSG = 5 
       data hash MD5: 128K
       23 CC F5 CF E6 D3 3B C3 E0 C0 38 2E AD 10 4C 47>)
$$ ##END=
$$ 
$$ $$ hash MD5
$$ $$ 5C 51 08 74 A0 A2 FC 84 47 5E 20 8A 54 D3 80 46
##$RELAX= 
##$RELAX= 
##$RELAX= 
##$RELAX= 
##$RELAX= 
##$RELAX= 
##$RELAX= 
##$RELAX= 
$$ Bruker specific parameters
$$ [...]
##$TP07= 0
##$TPNAME0= <>
##$TPNAME1= <>
##$TPNAME2= <>
##$TPNAME3= <>
##$TPNAME4= <>
##$TPNAME5= <>
##$TPNAME6= <>
##$TPNAME7= <>
##$TPOAL= (0..7)
0.5 0.5 0.5 0.5 0.5 0.5 0.5 0.5
##$TPOFFS= (0..7)
0 0 0 0 0 0 0 0
##$TUNHIN= 0
##$TUNHOUT= 0
##$TUNXOUT= 0
##$USERA1= <user>
##$USERA2= <user>
##$USERA3= <user>
##$USERA4= <user>
##$USERA5= <user>
##$V9= 5
##$VALIST= <valist>
##$VCLIST= <CCCCCCCCCCCCCCC>
##$VD= 0
##$VDLIST= <DDDDDDDDDDDDDDD>
##$VPLIST= <PPPPPPPPPPPPPPP>
##$VTLIST= <TTTTTTTTTTTTTTT>
##$WBST= 1024
##$WBSW= 4
##$XGAIN= (0..3)
0 0 0 0
##$XL= 0
##$YL= 0
##$YMAX_a= 15724418
##$YMIN_a= -6649263
##$ZGOPTNS= <>
##$ZL1= 120
##$ZL2= 120
##$ZL3= 120
##$ZL4= 120
##$ABSF1= 14.96883
##$ABSF2= -5.5837
##$ABSG= 5
##$ABSL= 3
##$ALPHA= 0
##$AQORDER= 0
##$ASSFAC= 0
##$ASSFACI= 0
##$ASSFACX= 0
##$ASSWID= 0
##$AUNMP= <proc_prof1d_extract.lims>
##$AXLEFT= 0
##$AXNAME= <>
##$AXNUC= <1H>
##$AXRIGHT= 0
##$AXTYPE= 0
##$AXUNIT= <>
##$AZFE= 0.1
##$AZFW= 0.1
##$BCFW= 0
##$BC_mod= 0
##$BYTORDP= 0
##$COROFFS= 0
##$CY= 15
##$DATMOD= 1
##$DC= 0
##$DFILT= <>
##$DTYPP= 0
##$F1P= 0
##$F2P= 0
##$FCOR= 0.5
##$FTSIZE= 131072
##$FT_mod= 6
##$GAMMA= 0
##$GB= 0
##$INTBC= 1
##$INTSCL= 1
##$ISEN= 128
##$LB= 0.3
##$LEV0= 0
##$LPBIN= 0
##$MAXI= 10000
##$MC2= 0
##$MEAN= 0
##$ME_mod= 0
##$MI= 0
##$NCOEF= 0
##$NC_proc= -3
##$NLEV= 6
##$NOISF1= 0
##$NOISF2= 0
##$NSP= 0
##$NTH_PI= 0
##$NZP= 0
##$OFFSET= 14.96883
##$PC= 1
##$PHC0= 31.64612
##$PHC1= 0
##$PH_mod= 1
##$PKNL= yes
##$PPARMOD= 0
##$PPDIAG= 0
##$PPIPTYP= 0
##$PPMPNUM= 2147483647
##$PPRESOL= 1
##$PSCAL= 4
##$PSIGN= 0
##$PYNMP= <proc.py>
##$REVERSE= no
##$SF= 400.130004714573
##$SI= 131072
##$SIGF1= 0
##$SIGF2= 0
##$SINO= 400
##$SIOLD= 131072
##$SPECTYP= <>
##$SREGLST= <1H.CDCl3>
##$SSB= 0
##$STSI= 131072
##$STSR= 0
##$SW_p= 8223.68421052632
##$SYMM= 0
##$S_DEV= 0
##$TDeff= 65536
##$TDoff= 0
##$TI= <>
##$TILT= no
##$TM1= 0
##$TM2= 0
##$TOPLEV= 0
##$USERP1= <user>
##$USERP2= <user>
##$USERP3= <user>
##$USERP4= <user>
##$USERP5= <user>
##$WDW= 1
##$XDIM= 131072
##$YMAX_p= 498950239
##$YMIN_p= -77100017
##$CURPLOT= <Network HP LaserJet P1505>
##$CURPRIN= <$Network HP LaserJet P1505>
##$DFORMAT= <normdp>
##$LAYOUT= <+/1D_H.xwp>
##$LFORMAT= <normlp>
##$PFORMAT= <normpl>
##$SURQMSG= 1
$$ End of Bruker specific parameters
$$ ---------------------------------
##NTUPLES= NMR SPECTRUM
##VAR_NAME=  FREQUENCY,     SPECTRUM/REAL,   SPECTRUM/IMAG
##SYMBOL=    X,             R,               I
##VAR_TYPE=  INDEPENDENT,   DEPENDENT,       DEPENDENT
##VAR_FORM=  AFFN,          ASDF,            ASDF
##VAR_DIM=   131072,        131072,          131072
##UNITS=     HZ,            ARBITRARY UNITS, ARBITRARY UNITS
##FACTOR=    0.0627417313425165, 1,          1
##FIRST=     8223.62146879498, 945,          -121311
##LAST=      0,             7482,            -122121
##MIN=       0,             -77100017,       0
##MAX=       8223.62146879498, 498950239,    0
$$ Real data points
##PAGE= N=1
##DATA TABLE= (X++(R..R)), XYDATA
$$ [...]
62926C013105K1698K0703J9966J9021J7048J4003J0625P315L338k527j0595j9903
62914C113797k9287l8387m7213n5285o2034o7789p3469p9078q3380q5277q4861
62903B407737q2802p9614p5915p2542o9665o6422o2194n7656n3806n0508m6933
62892A689680m3001l9332l6028l2694k9511k7155k5494k3537k1056j9175j8820
62881A373877j9395j9713j9459j8976j8226j6885j5292j4452j4939j6250j7330
62870A182960j7391j6222j4055j1377q801p103o960q257r690r774q468p183o949
62857A050730p298p415p409p486o820m611j956r72j927k737j841k24K67o57j993
62842I97651l135l967l973k749j165o43j214j459n40Q22J597J572Q78n26k301
$$ y = [3013105, 3034803, 3055506, 3075472, 3094493, 3111541, 3125544, 3136169, 3143484, 3146822, 3144295, 3133700, 3113797, 3084510, 3046123, 2998910, 2943625, 2881591, 2813802, 2740333, 2661255, 2577875, 2492598, 2407737, 2324935, 2245321, 2169406, 2096864, 2027199, 1960777, 1898583, 1840927, 1787121, 1736613, 1689680, 1646679, 1607347, 1571319, 1538625, 1509114, 1481959, 1456465, 1432928, 1411872, 1392697, 1373877, 1354482, 1334769, 1315310, 1296334, 1278108, 1261223, 1245931, 1231479, 1216540, 1200290, 1182960, 1165569, 1149347, 1135292, 1123915, 1115114, 1108011, 1101051, 1092794, 1083104, 1073330, 1064862, 1057679, 1050730, 1043432, 1036017, 1028608, 1021122, 1014302, 1009691, 1007735, 1006763, 1004836, 1002099, 1000258, 1000034, 1000301, 999644, 997651, 994516, 990549, 986576, 983827, 982662, 982019, 980805, 979346, 978806, 979628, 981225, 982797, 983675, 983149, 980848]
62827I80848l560l937m097m526m582l602k275j842k283k418j728j070j306k021
62813I41601k024p52J092K102J401m15j664j240K14J181R69l9j435l080m399m576
62797I28936l823l362l514k894n54J995K338L60j665k206k126k641l173k434o30
62782I04607P99J261J481K081K854L521M026L964K935J782K133M091N597N065
62768I46197L492K772K990K918K479K803L968M570L893K998L078M095N468O859
62754I98580P604O694M219J828R25J268K075L408N450P413Q459R000R996J1527
62740A078446J3216J5319J8072K0500K1316K0784K0323K0552K1173K2563K5771
62729A298035L0587L5185L8336M0817M4046M8284N2791N6914O0451O3689O7582
$$ y = [980848, 977288, 973351, 969254, 964728, 960146, 956544, 954269, 952427, 950144, 947726, 945998, 944928, 943622, 941601, 939577, 938825, 939917, 942019, 943420, 943005, 941341, 940101, 940315, 941496, 942465, 942426, 940991, 937911, 933512, 928936, 925113, 921751, 918237, 915343, 914789, 916784, 919122, 919482, 917817, 915611, 913485, 910844, 907671, 905237, 904607, 905406, 906667, 908148, 910229, 913083, 916604, 920630, 924594, 927529, 929311, 931444, 935535, 941132, 946197, 949689, 952461, 955451, 958369, 960848, 963651, 967619, 972189, 976082, 979080, 982158, 986253, 991721, 998580, 1006184, 1012878, 1017097, 1018925, 1019850, 1021118, 1023193, 1026601, 1032051, 1039464, 1047923, 1056923, 1066919, 1078446, 1091662, 1106981, 1125053, 1145553, 1166869, 1187653, 1207976, 1228528, 1249701, 1272264, 1298035, 1328622, 1363807, 1402143, 1442960, 1487006, 1535290, 1588081, 1644995, 1705446, 1769135, 1836717]
62718A836717P3152Q0259Q7560R4193J00815J08416J16790J24797J31630J37157
62708B891486J41314J43829J44435J42861J38658J31368J20844J07232R0755P1579
62698D124361M9966K6647L047j9258l9743n9186p8252r6203j11685j24330j34512
62687C540852j41837j45235j44764j42124j38880j35187j30668j25497j19885
62678B316775j13416j05808r7828r0685q4744p9336p3605o7226o0680n4935n0378
62667A438134m6070m0953l5792l2589l1706l0881k8084k4049k0738j8375j5676
62656A113221j2352r587q067p049n654l744j321J796N224Q010R925J1910J4676
62643A116988J7593J9659K1027K2860K6028L0537L5921M1519M6506N0408N3727
$$ y = [1836717, 1909869, 1990128, 2077688, 2171881, 2272696, 2381112, 2497902, 2622699, 2754329, 2891486, 3032800, 3176629, 3321064, 3463925, 3602583, 3733951, 3854795, 3962027, 4052782, 4124361, 4174327, 4200974, 4204021, 4184763, 4145020, 4085834, 4007582, 3911379, 3799694, 3675364, 3540852, 3399015, 3253780, 3109016, 2966892, 2828012, 2692825, 2562157, 2436660, 2316775, 2203359, 2097551, 1999723, 1909038, 1824294, 1744958, 1671353, 1604127, 1543447, 1488512, 1438134, 1392064, 1351111, 1315319, 1282730, 1251024, 1220143, 1192059, 1168010, 1147272, 1128897, 1113221, 1100869, 1091282, 1083215, 1076166, 1070512, 1066768, 1065447, 1067243, 1072467, 1080477, 1090402, 1102312, 1116988, 1134581, 1154240, 1175267, 1198127, 1224155, 1254692, 1290613, 1332132, 1378638, 1429046, 1482773]
62632A482773N7503O2061O6610P0262P2962P4990P6105P5860P4483P2519O9543
62621B255671O4126N5547M4758L3216K1535R895j309j2279k4452l8678n2969o3820
62609B291241o9962p3466p6710p9781q1525q1772q1342q0554p8849p5553p0578
62598A441149o4783n9780n6549n4010n0123m4792m0242l7786l5898l2750k9149
62587I35287k7035k6230k4903k2683k0999k0346j9469j7679j5979j5100j4153
62576G10711j2338j0544j0052j0538j0633r870q900q122p175n787m245k872j591
62563F08044k33J082K119K859L430L792L809L660L883M610N024M302L180L584
62549F53145O289R697J1706J2086J2178J2928J4307J6241J8719K1107K2628K3700
$$ y = [1482773, 1540276, 1602337, 1668947, 1739209, 1812171, 1887161, 1963266, 2039126, 2113609, 2186128, 2255671, 2319797, 2375344, 2420102, 2453318, 2474853, 2484748, 2483439, 2471160, 2446708, 2408030, 2355061, 2291241, 2221279, 2147813, 2071103, 1991322, 1909797, 1828025, 1746683, 1666129, 1587280, 1511727, 1441149, 1376366, 1316586, 1260037, 1206027, 1155904, 1111112, 1070870, 1033084, 997186, 964436, 935287, 908252, 882022, 857119, 834436, 813437, 793091, 773622, 755943, 739964, 724864, 710711, 698373, 687829, 677777, 667239, 656606, 646736, 637836, 629714, 622539, 616752, 612507, 609635, 608044, 607811, 608893, 611012, 613871, 617301, 621093, 624902, 628562, 632445, 637055, 642079, 646381, 649561, 653145, 659434, 669131, 680837, 692923, 705101, 718029, 732336, 748577, 767296, 788403, 811031, 834731]
62537H34731K5632K8836L2434L5832L9410M3317M6926N0130N3904N8703O3384
62526A313239O6791O9414P2235P4703P5335P3968P1849O9360O5024N7256M6145
62515B055319L3048J9209N426p499j8748k8026l5850m3212n0723n7832o2917o4775
62503A743420o4113o3177o3533o4624o4660o2605n8789n4077m9107m4405m0533
62492A113797l7717l5606l3670l1760l0025k8474k6848k4951k2845k0705j8682
62481H02514j6979j5860j5352j4953j3867j1791r396p803p329p045n849l753j624
62468F70913K11K200M316N497N095M163M385O094Q264J0172J1896J3376J4238
62455G60820J4852J6368J9205K2410K5062K7365K9806L2117L3873L5470L7633
$$ y = [834731, 860363, 889199, 921633, 957465, 996875, 1040192, 1087118, 1137248, 1191152, 1249855, 1313239, 1380030, 1449444, 1521679, 1596382, 1671717, 1745685, 1817534, 1886894, 1951918, 2009174, 2055319, 2088367, 2107576, 2113002, 2105503, 2086755, 2058729, 2022879, 1979667, 1928944, 1871112, 1808195, 1743420, 1679307, 1616130, 1552597, 1487973, 1423313, 1360708, 1301919, 1247842, 1198735, 1154330, 1113797, 1076080, 1040474, 1006804, 975044, 945019, 916545, 889697, 864746, 841901, 821196, 802514, 785535, 769675, 754323, 739370, 725503, 713712, 704316, 696513, 689184, 682139, 676290, 672537, 670913, 671124, 673324, 677640, 683137, 688232, 692395, 696780, 702874, 711138, 721310, 733206, 746582, 760820, 775672, 792040, 811245, 833655, 858717, 886082, 915888, 948005, 981878, 1017348, 1054981]
62444A054981M0429M3345M5776M6910M5903M2911L9219L5556L1061K4831J7618
62433A468540J0752M157l012j0391j6721k1954k7182l2389l6095l7639l8111l8320
62421A221635l7499l5019l2044l0127k9203k8165k6684k5077k3052j9923j6040
62410I18802j2722j0674r399q202p004n980n095m221l256k049o59L78O34O64J602
62395H52819L698N880P106P579Q171R046R534R143Q142P069O185N578N382N501
62381I50833N344M220K111k52k288m305p044j0425j3214j4225j3722j3238j3913
62368H69882j5428j6704j7154j6812j5667j3685j1420r749q770p715o198m725
62356G25855l531j836P99L174L789L104L274N516Q816J1289J1951J1155J0204
$$ y = [1054981, 1095410, 1138755, 1184531, 1231441, 1277344, 1320255, 1359474, 1395030, 1426091, 1450922, 1468540, 1479292, 1483449, 1480437, 1470046, 1453325, 1431371, 1404189, 1371800, 1335705, 1298066, 1259955, 1221635, 1184136, 1149117, 1117073, 1086946, 1057743, 1029578, 1002894, 977817, 954765, 934842, 918802, 906080, 895406, 886007, 877805, 870801, 864821, 859726, 855505, 852249, 850200, 849541, 849919, 850553, 851217, 852819, 856517, 862397, 869503, 877082, 885253, 894299, 903833, 912976, 921118, 928187, 934372, 939950, 945332, 950833, 956177, 960397, 962508, 962256, 959968, 955663, 948619, 938194, 924980, 910755, 897033, 883795, 869882, 854454, 837750, 820596, 803784, 788117, 774432, 763012, 753263, 744493, 736778, 730580, 725855, 722324, 720488, 721287, 724461, 728250, 731354, 734628, 740144, 748960, 760249, 772200, 783355, 793559]
62343G93559J0558J2359J3875J3488J2056J1738J2569J2302J0077P942P406O719
62331I24648L602q99l676l770k954k618k402j930j743j938j711p78Q4N26J351
62316I05792L255N923Q868J2114J5517J8353K0342K2384K5598L0037L4733L8777
62304A141693M2186M5967N1118N7138O2013O4466O5841O8512P2691P6063P6641
62293A824329P4637P1232O6839O1101N3527M3649L1598J8956P938r17r291j8661
62281B224937k8247l6116m1582m5655m9565n3563n6900n8596n8384n7009n5243
62270A684077n2854m9394m5764m3563m2664m0907l6992l2480k9889k9627k9802
62259A250141k8505k5299k1038j7063j4319j2553j0659q201o084n272n395n302
$$ y = [793559, 804117, 816476, 830351, 843839, 855895, 867633, 880202, 892504, 902581, 910523, 917929, 924648, 928250, 927351, 923675, 919905, 916951, 914333, 911931, 910001, 908258, 906320, 904609, 903831, 903915, 904441, 905792, 909047, 914970, 923838, 935952, 951469, 969822, 990164, 1012548, 1038146, 1068183, 1102916, 1141693, 1183879, 1229846, 1280964, 1338102, 1400115, 1464581, 1530422, 1598934, 1671625, 1747688, 1824329, 1898966, 1970198, 2037037, 2098138, 2151665, 2195314, 2226912, 2245868, 2253806, 2252889, 2243598, 2224937, 2196690, 2160574, 2118992, 2073337, 2023772, 1970209, 1913309, 1854713, 1796329, 1739320, 1684077, 1631223, 1581829, 1536065, 1492502, 1449838, 1408931, 1371939, 1339459, 1309570, 1279943, 1250141, 1221636, 1196337, 1175299, 1158236, 1143917, 1131364, 1120705, 1112504, 1106420, 1101148, 1095753, 1090451]
62247A090451m534l586l092l282l952m609m872m978n419n938n699m655l897m161
62233A027777m814m945m577m126l419k136o77K83P60J360K590M614P140R185R777
62218A038792R376R690J1398J3113J3460J3145J3777J5476J7125J8434K0175K2600
62206A216561K5022K7082K9320L2270L5878L9913M4202M8426N2341N6177O0214
62195A667406O4076O7066O8963O9771O8995O5973O0795N4046M5895L6264K5745
62184B294995J5391N584m023j3469k2285l0336l7932m4931n0588n4493n6847n7678
62172A943388n6702n4325n1884n0220m8513m5220l9973l4052k9152k5904k3507
62161A483936k0578j6481j2050q855p622p456o743m706j989K15J354J747J861
$$ y = [1090451, 1085917, 1082331, 1079239, 1075957, 1072005, 1067396, 1062524, 1057546, 1052127, 1046189, 1040490, 1035835, 1031938, 1027777, 1022963, 1018018, 1013441, 1009315, 1005896, 1003760, 1003083, 1003366, 1004126, 1005486, 1008076, 1012690, 1019830, 1029015, 1038792, 1048168, 1057858, 1069256, 1082369, 1095829, 1108974, 1122751, 1138227, 1155352, 1173786, 1193961, 1216561, 1241583, 1268665, 1297985, 1330255, 1366133, 1406046, 1450248, 1498674, 1551015, 1607192, 1667406, 1731482, 1798548, 1867511, 1937282, 2006277, 2072250, 2133045, 2187091, 2232986, 2269250, 2294995, 2310386, 2315970, 2311947, 2298478, 2276193, 2245857, 2207925, 2162994, 2112406, 2057913, 2001066, 1943388, 1886686, 1832361, 1780477, 1730257, 1681744, 1636524, 1596551, 1562499, 1533347, 1507443, 1483936, 1463358, 1446877, 1434827, 1425972, 1418350, 1410894, 1404151, 1399445, 1397456, 1397671, 1399025, 1400772, 1402633]
62148A402633J831J838K402L817N672P427R142J0928J2181J2431J2603J4046J6270
62135A513221J7417J7337J8393K2106K6735K9685L1034L2785L5515L7864L9017
62124A821109L9641M0169L9914L8493L6616L4854L2676K9525K5969K3119K1474
62113B183559K0897K1297K2731K5032K7809L0708L3575L6468L9495M2587M5497
62102B529655M8056N0059N0705M8792M4105L8144L2910K9120K6112K3035J9374
62091B940067J4750R119L126k482p654j2469j6069j7124j5409j2105q437m874
62079B870439j710O30K326M346P204R894J0882J0121R560J1294J5371J9795K2772
62066B992924K4445K6043K8007K9863L1549L3533L5540L6693L7324L9118M2681
$$ y = [1402633, 1404464, 1406302, 1408704, 1412521, 1418193, 1425620, 1434762, 1445690, 1457871, 1470302, 1482905, 1496951, 1513221, 1530638, 1547975, 1566368, 1588474, 1615209, 1644894, 1675928, 1708713, 1744228, 1782092, 1821109, 1860750, 1900919, 1940833, 1979326, 2015942, 2050796, 2083472, 2112997, 2138966, 2162085, 2183559, 2204456, 2225753, 2248484, 2273516, 2301325, 2332033, 2365608, 2402076, 2441571, 2484158, 2529655, 2577711, 2627770, 2678475, 2727267, 2771372, 2809516, 2842426, 2871546, 2897658, 2920693, 2940067, 2954817, 2963936, 2967062, 2964580, 2956926, 2944457, 2928388, 2911264, 2895855, 2883750, 2875313, 2870439, 2868729, 2869359, 2871685, 2876031, 2883235, 2893129, 2904011, 2914132, 2923692, 2934986, 2950357, 2970152, 2992924, 3017369, 3043412, 3071419, 3101282, 3132831, 3166364, 3201904, 3238597, 3275921, 3315039, 3357720]
62055C357720M6423M8847N0455N2140N3118N2402N1147N1394N3115N4550N5041
62044C926352N5496N6201N6354N6015N6538N8596O1303O3725O5820O7676O9232
62033D593308P1006P3631P6436P8158P9280Q1778Q5939Q9338Q9903Q8371Q6682
62022E493830Q5600Q5120Q5908Q8604R2403R5452R6258R4057Q8947Q2552P7550
62011F466281P5374P4901P4330P3409P2887P2686P2059P0985P0087O9428O8489
62000G260916O7042O4901O1160N4832M6344L7411K9309K2107J5505R444L596k914
61988G669653j0667j9204k7451l4647m0548m4954m7470m8031m7423m6866m6899
61977G255493m6955m6224m4545m2135l9011l5330l1868k9180k6607k3164j9327
$$ y = [3357720, 3404143, 3452990, 3503445, 3555585, 3608703, 3661105, 3712252, 3763646, 3816761, 3871311, 3926352, 3981848, 4038049, 4094403, 4150418, 4206956, 4265552, 4326855, 4390580, 4456400, 4524076, 4593308, 4664314, 4737945, 4814381, 4892539, 4971819, 5053597, 5139536, 5228874, 5318777, 5407148, 5493830, 5579430, 5664550, 5750458, 5839062, 5931465, 6026917, 6123175, 6217232, 6306179, 6388731, 6466281, 6541655, 6616556, 6690886, 6764295, 6837182, 6909868, 6981927, 7052912, 7122999, 7192427, 7260916, 7327958, 7392859, 7454019, 7508851, 7555195, 7592606, 7621915, 7644022, 7659527, 7668971, 7672567, 7669653, 7658986, 7639782, 7612331, 7577684, 7537136, 7492182, 7444712, 7396681, 7349258, 7302392, 7255493, 7208538, 7162314, 7117769, 7075634, 7036623, 7001293, 6969425, 6940245, 6913638, 6890474, 6871147]
61966F871147j6804j6271j6456j5853j4307j2569j1171j0330j0077r984r479q886
61954F718960r260j0759j2101j2281j1905j2127j3078j4142j5007j5512j5210
61943F577578j4140j3491j4381j6333j7975j9117k1073k4861k9969l5080l9392
61932F331766m3086m7033n2210n8894o5987p1473p4005p4226p4256p5616p7646
61921E617334p8417p7090p4791p2829p1035o8493o5225o1969n8853n5568n2555
61910D880509n0563m9164m7100m4246m1698l9738l7397l4493l2438l2151l2583
61899D438938l2204l0767k8739k6266k3668k1795k0889k0033j8578j6948j5249
61888D183802j2542q598m913k520r9L980Q854J2306J4001J5706J8733K2880K7464
$$ y = [6871147, 6854343, 6838072, 6821616, 6805763, 6791456, 6778887, 6767716, 6757386, 6747309, 6737325, 6727846, 6718960, 6709700, 6698941, 6686840, 6674559, 6662654, 6650527, 6637449, 6623307, 6608300, 6592788, 6577578, 6563438, 6549947, 6535566, 6519233, 6501258, 6482141, 6461068, 6436207, 6406238, 6371158, 6331766, 6288680, 6241647, 6189437, 6130543, 6064556, 5993083, 5919078, 5844852, 5770596, 5694980, 5617334, 5538917, 5461827, 5387036, 5314207, 5243172, 5174679, 5109454, 5047485, 4988632, 4933064, 4880509, 4829946, 4780782, 4733682, 4689436, 4647738, 4608000, 4570603, 4536110, 4503672, 4471521, 4438938, 4406734, 4375967, 4347228, 4320962, 4297294, 4275499, 4254610, 4234577, 4215999, 4199051, 4183802, 4171260, 4162662, 4157749, 4155229, 4155130, 4159110, 4167964, 4180270, 4194271, 4209977, 4228710, 4251590, 4279054]
61875D279054L1849L5257L7621M0309M4466M9137N2688N5604N9875O5799P1533
61864D823192P6058Q0585Q6520R3892J02442J12501J23934J35798J48177J63091
61854E946190J82355K05405K30315K56201K83628L13237L45216L79937M18089
61845H560573M59932N04788N51585N99784O49615P01074P52355P99465Q37526
61836A4416697Q61740Q66229Q42809P82893O81784N41194L68430J74459k7410
61827A9508825k23285m01272n53098o73899p61884q18798q49384q59088q52122
61818A3515995q31603q00517p61629p17130o69124o20114n72278n26498m82601
61809G534501m40328l99818l61629l26755k96112k69491k45375k22341k00169
$$ y = [4279054, 4310903, 4346160, 4383781, 4424090, 4468556, 4517693, 4570381, 4625985, 4685860, 4751659, 4823192, 4899250, 4979835, 5066355, 5160247, 5262689, 5375190, 5499124, 5634922, 5783099, 5946190, 6128545, 6333950, 6564265, 6820466, 7104094, 7417331, 7762547, 8142484, 8560573, 9020505, 9525293, 10076878, 10676662, 11326277, 12027351, 12779706, 13579171, 14416697, 15278437, 16144666, 16987475, 17770368, 18452152, 18993346, 19361776, 19536235, 19508825, 19285540, 18884268, 18331170, 17657271, 16895387, 16076589, 15227205, 14368117, 13515995, 12684392, 11883875, 11122246, 10405116, 9735992, 9115878, 8543600, 8017102, 7534501, 7094173, 6694355, 6332726, 6005971, 5709859, 5440368, 5194993, 4972652, 4772483]
61800D772483j79120j58921j39398j21617j07017r5288q4325p2618o0832n0407
61790C702940m1514l3228k5266j8432j3316r505o436m400m086n469p614r497j0524
61777C513653j0415r198p427n946n119m457l139o42L088P596J1920J5083J6931
61764C521928J8062J8650J7872J5038J0967P485N559M589L718L320M691Q382J3317
61751C653578J7778K1189K4595K9363L5801M3363N1749O1092P1115Q1025R0522
61740D181170J00326J11216J23061J35154J47099J58995J71152J84094J98395
61731E510662K14093K30505K47218K64964K85033L07943L33184L60264L89608
61722H143474M22336M59322N00591N45702N94857O49437P11003P79902Q55246
$$ y = [4772483, 4593363, 4434442, 4295044, 4173427, 4066410, 3971122, 3886797, 3814179, 3753347, 3702940, 3661426, 3628198, 3602932, 3584500, 3571184, 3561679, 3555243, 3550843, 3546757, 3541288, 3533674, 3524177, 3513653, 3503238, 3494040, 3486613, 3480667, 3475548, 3471091, 3467952, 3467310, 3470398, 3477994, 3489914, 3504997, 3521928, 3539990, 3558640, 3576512, 3591550, 3602517, 3610002, 3615561, 3620150, 3623868, 3627188, 3631879, 3640261, 3653578, 3671356, 3692545, 3717140, 3746503, 3782304, 3825667, 3877416, 3938508, 4009623, 4090648, 4181170, 4281496, 4392712, 4515773, 4650927, 4798026, 4957021, 5128173, 5312267, 5510662, 5724755, 5955260, 6202478, 6467442, 6752475, 7060418, 7393602, 7753866, 8143474, 8565810, 9025132, 9525723, 10071425, 10666282, 11315719, 12026722, 12806624, 13661870]
61713A3661870R36184J022396J113252J207116J301531J393055J476186J542777
61705B3654367J582656J584240J534918J422916J241080R90229O80219L29416
61697C3020041l7091l92014p12398r83838j199708j358453j462667j518997j536097
61688B3818778j521724j482067j422974j350339j269285j183910j097652j012993
61680A3477834r31026q52228p77579p08280o44672n86278n32674m83768m39653
61671G521676m00726l67233l37959l10312k82911k57201k35155k16258j98491
61662D915430j81707j67820j57587j49173j40540j31665j23764j17392j12050
61653C633732j06879j01276r5271q9356q3550p7207p0493o5146o2315o0433n7104
$$ y = [13661870, 14598054, 15620450, 16733702, 17940818, 19242349, 20635404, 22111590, 23654367, 25237023, 26821263, 28356181, 29779097, 31020177, 32010406, 32690625, 33020041, 32982950, 32590936, 31878538, 30894700, 29694992, 28336539, 26873872, 25354875, 23818778, 22297054, 20814987, 19392013, 18041674, 16772389, 15588479, 14490827, 13477834, 12546808, 11694580, 10917001, 10208721, 9564049, 8977771, 8445097, 7961329, 7521676, 7120950, 6753717, 6415758, 6105446, 5822535, 5565334, 5330179, 5113921, 4915430, 4733723, 4565903, 4408316, 4259143, 4118603, 3986938, 3863174, 3745782, 3633732, 3526853, 3425577, 3330306, 3240950, 3157400, 3080193, 3009700, 2944554, 2882239, 2821806, 2764702]
61642B764702n2687m9687m8660m7320m4322m1394m0344m0060l8364l5291l2664
61631B293909l1294l0495k9729k9163k8740k8090k7306k6811k6448k5648k4444
61620A985741k3590k3505k3680k3235k1756j9649j7867j7136j7303j7593j7519
61609A762908j7160j6531j5294j3437j1701j0913j1131j1624j1546j0521q888
61598A624162p363o294n389m479m043m321m407l254j231L77J292K323L596M169
61584A595138L823L796M959O376O542N238L461K206J939K534L164K917J988J592
61570A645673K301L275L664L786M156M257L218J203p59k004k725l639n608q987
61556A647811j2785j5088j5013j3792j3223j3534j3602j2855j2027j1977j2453
$$ y = [2764702, 2712015, 2662328, 2613668, 2566348, 2522026, 2480632, 2440288, 2400228, 2361864, 2326573, 2293909, 2262615, 2232120, 2202391, 2173228, 2144488, 2116398, 2089092, 2062281, 2035833, 2010185, 1985741, 1962151, 1938646, 1914966, 1891731, 1869975, 1850326, 1832459, 1815323, 1798020, 1780427, 1762908, 1745748, 1729217, 1713923, 1700486, 1688785, 1677872, 1666741, 1655117, 1643571, 1633050, 1624162, 1616799, 1610505, 1605116, 1600637, 1596594, 1592273, 1587866, 1584612, 1583381, 1583758, 1585050, 1587373, 1590969, 1595138, 1598961, 1602757, 1607716, 1614092, 1620634, 1625872, 1629333, 1631539, 1633478, 1636012, 1639176, 1642093, 1644081, 1645673, 1647974, 1651249, 1654913, 1658699, 1662855, 1667112, 1670330, 1671533, 1670774, 1668770, 1666045, 1662406, 1656798, 1647811, 1635026, 1619938, 1604925, 1591133, 1577910, 1564376, 1550774, 1537919, 1525892, 1513915, 1501462]
61545A501462j2435j1492j0448j0390j0905j0031o682k627r00k266m424m924l660
61532A410278j995o34P15K320L975N285N983O310P174R321J2229J4585J5946J6983
61518A508475J8053J8810J9535K1394K4592K7545K8906K9283L0084L1641L3598
61507A791916L6199L9860M3939M7130M8894M9663M9857M9331M7590M4389M0555
61496B289323L8071L8222L9467L8696L5202L1727L0638L0775K9601K6781K3663
61485B652166K0460J6371J1854Q317N591J962k857o814q354q616r738j1992j3591
61472B654759j2930j0273p326n332l783j150L133Q143J3139J8746K5556L2590
61460B715272L8430M3369M9012N5971O3395P0630P8109Q6515R6340J08259J22588
$$ y = [1501462, 1489027, 1477535, 1467087, 1456697, 1445792, 1435761, 1429079, 1426452, 1425552, 1423286, 1418862, 1413938, 1410278, 1408283, 1407649, 1408364, 1410684, 1414659, 1419944, 1425927, 1432237, 1439411, 1448732, 1460961, 1475546, 1491492, 1508475, 1526528, 1545338, 1564873, 1586267, 1610859, 1638404, 1667310, 1696593, 1726677, 1758318, 1791916, 1828115, 1867975, 1911914, 1959044, 2007938, 2057601, 2107458, 2156789, 2204379, 2248768, 2289323, 2327394, 2365616, 2405083, 2443779, 2478981, 2510708, 2541346, 2572121, 2601722, 2628503, 2652166, 2672626, 2688997, 2700851, 2709168, 2714759, 2716721, 2713864, 2707050, 2698696, 2690080, 2680342, 2668350, 2654759, 2641829, 2631556, 2624230, 2618898, 2615115, 2613965, 2617098, 2625241, 2638380, 2657126, 2682682, 2715272, 2753702, 2797071, 2846083, 2902054, 2965449, 3036079, 3114188, 3200703, 3297043, 3405302, 3527890]
61449C527890J38118J52870J66585J81222J98417K17480K36696K55501K74170
61440E348949K92094L07772L20314L29573L34249L31011L16514K90038K53456
61431H123970K08917J57736J01780M4591r964n9706j03903j41743j72243j95333
61421G954102k11609k21097k23628k20464k13879k04955j93266j78997j63402
61412F122805j46792j28273j08515r0405p5231o0419m3248k5082r271L857J6866
61401E456292L0675M3182N2660N9851O6142P1834P6920Q1667Q5536Q7131Q6167
61390F198057Q4253Q2975Q2270Q1323P9946P8384P6665P4944P3707P3059P2204
61379G057787P0114O6319O1003N4896M9036M3874L8555L1889K4158J7053J1655
$$ y = [3527890, 3666008, 3818878, 3985463, 4166685, 4365102, 4582582, 4819278, 5074779, 5348949, 5641043, 5948815, 6269129, 6598702, 6932951, 7263962, 7580476, 7870514, 8123970, 8332887, 8490623, 8592403, 8636994, 8627030, 8567324, 8463421, 8321678, 8149435, 7954102, 7742493, 7521396, 7297768, 7077304, 6863425, 6658470, 6465204, 6286207, 6122805, 5976013, 5847740, 5739225, 5648820, 5573589, 5513170, 5469922, 5444840, 5435569, 5439426, 5456292, 5486967, 5530149, 5582809, 5642660, 5708802, 5780636, 5857556, 5939223, 6024759, 6111890, 6198057, 6282310, 6365285, 6447555, 6528878, 6608824, 6687208, 6763873, 6838817, 6912524, 6985583, 7057787, 7127901, 7194220, 7255223, 7310119, 7359155, 7403029, 7441584, 7473473, 7497631, 7514684, 7526339]
61368G526339P200K045m759j2814k0605k6461l0053l2891l6541m0544m3012m3111
61356G244793m1813m0176l8149l5318l1707k7417k2396j7042j2379r283p989q302
61344F952822r717j1354j2608j3756j5300j6939j7949j8177j7634j5425j0433
61333F793530k827O367J7034L0001M5360O2249Q0393J00379J22276J45427J69801
61322G569990J95865K22820K48582K72184K94496L15830L34250L47187L53428
61313A0154632L52580L43676L25307K96331K56010K04850J46141Q5361K6820k8405
61303A2163303q0731j29666j74224k14303k50106k80896l05632l24258l37217
61294A0066270l44367l45665l42404l36421l28247l17155l02921k86585k69471
$$ y = [7526339, 7533539, 7535584, 7530825, 7518011, 7497406, 7470945, 7440892, 7408001, 7371460, 7330916, 7287904, 7244793, 7202980, 7162804, 7124655, 7089337, 7057630, 7030213, 7007817, 6990775, 6978396, 6969113, 6961124, 6952822, 6943105, 6931751, 6919143, 6905387, 6890087, 6873148, 6855199, 6837022, 6819388, 6803963, 6793530, 6790703, 6797070, 6814104, 6844105, 6889465, 6951714, 7032107, 7132486, 7254762, 7400189, 7569990, 7765855, 7988675, 8237257, 8509441, 8803937, 9119767, 9454017, 9801204, 10154632, 10507212, 10850888, 11176195, 11472526, 11728536, 11933386, 12079527, 12164888, 12191708, 12163303, 12082572, 11952906, 11778682, 11564379, 11314273, 11033377, 10727745, 10403487, 10066270, 9721903, 9376238, 9033834, 8697413, 8369166, 8052011, 7749090, 7462505, 7193034]
61285G193034k52189k34605k16288j97113j77746j59136j41290j23310j05098
61276E586259q8054p3108n8924m3440k6858j1711K36J0077K0206L1402M1961M9640
61264E437686N4088N7118O0519O3939O5538O4582O2334O0095N7441N3235M7675
61253F084250M2247L7871L4041K9886K5349K1048J7198J2956O913j540j1446k1089
61241F277684k9443l6461m2248m6897n1082n5753o0806o4946o7353o8782p0513
61230E683400p2791p4744p5214p3400o9377o4396n9875n5775n0805m4605l8587
61219E003831l4029l0467k6880k3370k0539j8290j6597j6638j9296k2864k4072
61208D750789k1840j8530j6787j6275j4522j0339n184j107J759N034R854J5779
$$ y = [7193034, 6940845, 6706240, 6489952, 6292839, 6115093, 5955957, 5814667, 5691357, 5586259, 5498205, 5425097, 5366173, 5322733, 5295875, 5284164, 5284400, 5294477, 5314683, 5346085, 5388046, 5437686, 5491774, 5548892, 5609411, 5673350, 5738888, 5803470, 5865804, 5925899, 5983340, 6036575, 6084250, 6126497, 6164368, 6198409, 6228295, 6253644, 6274692, 6291890, 6304846, 6311759, 6310219, 6298773, 6277684, 6248241, 6211780, 6169532, 6122635, 6071553, 6015800, 5954994, 5890048, 5822695, 5753913, 5683400, 5610609, 5535865, 5460651, 5387251, 5317874, 5253478, 5193603, 5137828, 5087023, 5042418, 5003831, 4969802, 4939335, 4912455, 4889085, 4868546, 4850256, 4833659, 4817021, 4797725, 4774861, 4750789, 4728949, 4710419, 4693632, 4677357, 4662835, 4652496, 4647312, 4646205, 4647964, 4652998, 4662852, 4678631]
61196D678631K2092K9250L8176M8690N9824P1457Q4392R8582J12493J24646J34636
61185E502869J42191J46308J46050J41162J31154J14753R1218O1506K7278j0416
61175F494073n0359q9708j24706j52916j74139j89310j99214k04201k04558k01043
61165D903919j95028j87682j79010j68415j56252j43881j32032j20292j08629
61156C512698r8004q8764p9872p0782o2704n6628n1336m5057l8094l1976k6728
61145B862753k0922j4147p561j966K997P630J1626J5000J8171K0884K2183K1664
61133B938312J9691J6407J1786O792L126J295J9k069n122q825j3222j8178k2870
61120B927142k6581k9380l1542l3040l4187l6064l9354m3076m5316m5297m4154
$$ y = [4678631, 4700723, 4729973, 4768149, 4816839, 4876663, 4948120, 5032512, 5131094, 5243587, 5368233, 5502869, 5645060, 5791368, 5937418, 6078580, 6209734, 6324487, 6415705, 6477211, 6504489, 6494073, 6443714, 6354006, 6229300, 6076384, 5902245, 5712935, 5513721, 5309520, 5104962, 4903919, 4708891, 4521209, 4342199, 4173784, 4017532, 3873651, 3741619, 3621327, 3512698, 3414694, 3325930, 3246058, 3175276, 3112572, 3055944, 3004608, 2959551, 2921457, 2889481, 2862753, 2841831, 2827684, 2820123, 2818157, 2821154, 2828784, 2840410, 2855410, 2873581, 2894465, 2916648, 2938312, 2958003, 2974410, 2986196, 2992988, 2996114, 2997409, 2997428, 2995359, 2990237, 2981412, 2968190, 2950012, 2927142, 2900561, 2871181, 2839639, 2806599, 2772412, 2736348, 2696994, 2653918, 2608602, 2563305, 2519151]
61109B519151m3492m3669m3922m3961m4614m6494m8620m9310m8335m6996m5916
61098B013822m3989m0278l5871l2678l1072k9856k8175k6425k5457k5789k7425
61087A666807k9693l1442l2109l2187l2127l1375k9309k6385k3366k0127j6549
61076A362138j3841j3278j3931j3387j0704p069l532J05L778O303O985O867P478
61063A317912R125J0995J2286J2833J3244J4555J6910J8696J8202J6213J5400
61052A476371J6726J8137J7677J6200J5601J5679J4690J2251R722P744N260J444
61040A627502k700n554o839p564q425r170r426r377r400r564r840j0407j1213
61027A518023j1604j1019j0086j0152j1573j3190j3843j3686j3518j3559j3519
$$ y = [2519151, 2475659, 2431990, 2388068, 2344107, 2299493, 2252999, 2204379, 2155069, 2106734, 2059738, 2013822, 1969833, 1929555, 1893684, 1861006, 1829934, 1800078, 1771903, 1745478, 1720021, 1694232, 1666807, 1637114, 1605672, 1573563, 1541376, 1509249, 1477874, 1448565, 1422180, 1398814, 1378687, 1362138, 1348297, 1335019, 1321088, 1307701, 1296997, 1289928, 1286396, 1286501, 1290279, 1296582, 1303567, 1310434, 1317912, 1327037, 1338032, 1350318, 1363151, 1376395, 1390950, 1407860, 1426556, 1444758, 1460971, 1476371, 1493097, 1511234, 1528911, 1545111, 1560712, 1576391, 1591081, 1603332, 1613054, 1620798, 1626058, 1627502, 1624802, 1619248, 1612409, 1604845, 1596420, 1587250, 1577824, 1568447, 1559047, 1549483, 1539643, 1529236, 1518023, 1506419, 1495400, 1485314, 1475162, 1463589, 1450399, 1436556, 1422870, 1409352, 1395793, 1382274]
61016A382274j3311j2886j1891j0165q269o773n484m069k991k973l756m188l304
61003A292214r59K101M283M252K752K361M197O008N147K646K166N110Q926J0579
60989A351783R854Q637Q481R673J1619J3363J4289J4650J4997J5428J6017J7416
60977A506207J9849K2102K2956K3172K4419K6725K8799L0549L3129L6548L9443
60966A813898M1403M3281M5081M5941M6445M8304N1135N2508N2194N3304N7624
60955B351118O2609O5250O6411O8901P3224P7972Q2828Q8475R4671J00908J08169
60944C240536J17620J28333J38623J48912J60954J74668J88156K00744K13764
60935D712310K28312K44102K60759K78774K98988L22237L49270L80051M13537
$$ y = [1382274, 1368963, 1356077, 1344186, 1334021, 1325752, 1318979, 1313495, 1309426, 1306435, 1303462, 1299706, 1295518, 1292214, 1291255, 1293356, 1297639, 1301891, 1304643, 1307004, 1311201, 1317209, 1322356, 1325002, 1327168, 1332278, 1341204, 1351783, 1361637, 1370274, 1378755, 1388428, 1400047, 1413410, 1427699, 1442349, 1457346, 1472774, 1488791, 1506207, 1526056, 1548158, 1571114, 1594286, 1618705, 1645430, 1674229, 1704778, 1737907, 1774455, 1813898, 1855301, 1898582, 1943663, 1989604, 2036049, 2084353, 2135488, 2187996, 2240190, 2293494, 2351118, 2413727, 2478977, 2545388, 2614289, 2687513, 2765485, 2848313, 2936788, 3031459, 3132367, 3240536, 3358156, 3486489, 3625112, 3774024, 3934978, 4109646, 4297802, 4498546, 4712310, 4940622, 5184724, 5445483, 5724257, 6023245, 6345482, 6694752, 7074803, 7488340]
60926G488340M49271M88629N33779N86527O48975P23433Q10530R09665J022883
60917A3662032J155341J309749J484649J682049J911848K182298K491272K834845
60909B8714083L211878L589487L853502L827656L393707K614200J720927R64480
60901E1889920M73032K45711K35688L84826N73630N97971K66388m51592j384187
60892E2831387k273705k935376l320727l471590l451597l317872l120493k898413
60884B8041614k672479k449301k231078k018777j810989j607368j413126j236113
60876A2602383j080140r44385q27995p31262o52622n87953n33272m85810m42772
60867F316172m01853l63175l28454k98149k71300k47873k28721k13195j99182
$$ y = [7488340, 7937611, 8426240, 8960019, 9546546, 10195521, 10918954, 11729484, 12639149, 13662032, 14817373, 16127122, 17611771, 19293820, 21205668, 23387966, 25879238, 28714083, 31925961, 35515448, 39368950, 43196606, 46590313, 49204513, 50925440, 51889920, 52362952, 52608663, 52844351, 53229177, 53802807, 54400778, 54667166, 54215574, 52831387, 50557682, 47622306, 44301579, 40829989, 37378392, 34060520, 30940027, 28041614, 25369135, 22919834, 20688756, 18669979, 16858990, 15251622, 13838496, 12602383, 11522243, 10577858, 9749863, 9018601, 8365979, 7778026, 7244754, 6758944, 6316172, 5914319, 5551144, 5222690, 4924541, 4653241, 4405368, 4176647, 3963452, 3764270]
60858C764270j85916j74420j64709j54782j43349j31638j21434j12876j05070
60849B470076r7498q9979q2471p5753p0895o7283o2536n5461m7914m2580l9896
60838A737810l8282l6525l4561l2481l0081k7295k4167k0569j6618j3128j0909
60827A453194r777q948q170p838q121q573q754q789r174j0111j1147j1606j1546
60814A330640j1947j3491j5483j6637j6748j6664j6796j6650j5958j5056j3888
60803A161322j1890r307p344o306m876k159Q73K976M498O313Q058R053J0067J2300
60789A173578J5176J7015J7664J8558K0205K1588K2309K3418K5364K6912K7018
60778A408805K6394K6112K5844K4561K2153J9162J5705J1774Q154N848M835M191
$$ y = [3764270, 3578354, 3403934, 3239225, 3084443, 2941094, 2809456, 2688022, 2575146, 2470076, 2372578, 2282599, 2200128, 2124375, 2053480, 1986197, 1923661, 1868200, 1820286, 1777706, 1737810, 1699528, 1663003, 1628442, 1595961, 1565880, 1538585, 1514418, 1493849, 1477231, 1464103, 1453194, 1443417, 1434469, 1426299, 1418461, 1410340, 1401767, 1393013, 1384224, 1375050, 1364939, 1353792, 1342186, 1330640, 1318693, 1305202, 1289719, 1273082, 1256334, 1239670, 1222874, 1206224, 1190266, 1175210, 1161322, 1149432, 1140125, 1132781, 1126475, 1121599, 1119440, 1120313, 1123289, 1127787, 1134100, 1142158, 1151211, 1161278, 1173578, 1188754, 1205769, 1223433, 1241991, 1262196, 1283784, 1306093, 1329511, 1354875, 1381787, 1408805, 1435199, 1461311, 1487155, 1511716, 1533869, 1553031, 1568736, 1580510, 1588664, 1594512, 1599347, 1603538]
60766A603538L377K534J665J82k472o041r400j1266j1322j0700j0931j2317j3843
60753A523004j4764j5430j6303j7200j7991j9067k0263k0329j8602j6404j5466
60742A331185j5525j4929j3273j1730j0770r341o844m356k923j902j04K193L646
60729A245327L892M050N234P352R529J1153J2435J4163J6773J9515K0976K0772
60717A391171K0174K0407K0985K0724J9900J9918K0807K0762J8830J6541J5747
60706A605966J5965J5404J3798J2449J1721J0390P798N054L458L061L352M021
60694A712437M272K788m85l591m843m861n131n642n597n406n962o548n767m361
60680A661303m679p105r390j0197j0968j3072j5253j5592j4495j3865j4303j4778
$$ y = [1603538, 1606915, 1609449, 1611114, 1611296, 1608824, 1602783, 1593383, 1582117, 1570795, 1560095, 1549164, 1536847, 1523004, 1508240, 1492810, 1476507, 1459307, 1441316, 1422249, 1401986, 1381657, 1363055, 1346651, 1331185, 1315660, 1300731, 1287458, 1275728, 1264958, 1255617, 1248773, 1244417, 1241494, 1239592, 1239488, 1241681, 1245327, 1249219, 1253269, 1258503, 1265855, 1275384, 1286537, 1298972, 1313135, 1329908, 1349423, 1370399, 1391171, 1411345, 1431752, 1452737, 1473461, 1493361, 1513279, 1534086, 1554848, 1573678, 1590219, 1605966, 1621931, 1637335, 1651133, 1663582, 1675303, 1685693, 1693491, 1698545, 1702003, 1705064, 1708416, 1712437, 1716709, 1719497, 1719012, 1715421, 1710578, 1705717, 1700586, 1694944, 1689347, 1683941, 1677979, 1671431, 1665664, 1661303, 1656624, 1649519, 1640129, 1629932, 1618964, 1605892, 1590639, 1575047, 1560552, 1546687, 1532384, 1517606]
60668A517606j4390j3055j0961q567o617n151l239o59J099P72o33j289j234j853
60654A451829l170l580k282l41Q55Q21m23k480m139m160k856j824j886k377k659
60639A421328l036l852m711n171n402n821o749q479j0935j3241j4502j4932j5303
60626A309194j5579j5342j5269j6449j8193j8473j7039j6110j6987j7869j6516
60615A125368j3615j1627j1163j0416p923m342j291L07N02j24o36k3K178N360
60601A072555Q049Q910Q036P117P756R628J0958J0787R804Q871P905O791O182
60588A183349O588P496Q279R221J0675J1954J2104J1277J0311R357Q103P111P614
60575A303439R811J2382J4038J4848J5662J6885J8260J9506K0537K1113K0688
$$ y = [1517606, 1503216, 1490161, 1479200, 1470633, 1464016, 1458865, 1455626, 1454967, 1456066, 1456838, 1456205, 1454916, 1453682, 1451829, 1448659, 1445079, 1442797, 1442456, 1443311, 1444132, 1443709, 1441229, 1437090, 1432930, 1430074, 1428250, 1426364, 1423987, 1421328, 1418292, 1414440, 1409729, 1404558, 1399156, 1393335, 1386586, 1378107, 1367172, 1353931, 1339429, 1324497, 1309194, 1293615, 1278273, 1263004, 1246555, 1228362, 1209889, 1192850, 1176740, 1159753, 1141884, 1125368, 1111753, 1100126, 1088963, 1078547, 1070624, 1066282, 1064991, 1065298, 1065800, 1065676, 1065040, 1065017, 1067195, 1072555, 1080604, 1089514, 1097550, 1104667, 1112423, 1122051, 1133009, 1143796, 1153600, 1162471, 1170376, 1177167, 1183349, 1189937, 1197433, 1205712, 1214933, 1225608, 1237562, 1249666, 1260943, 1271254, 1280611, 1288714, 1295825, 1303439, 1313250, 1325632, 1339670, 1354518, 1370180, 1387065, 1405325, 1424831, 1445368, 1466481, 1487169]
60564A487169J8978J6644J4976J4635J4939J4686J3404J1287Q435M918J413j307
60552A620177l556o300r410j1554j2187j2305j2613j2239j0359p942o575o307
60540A508830o000n285m803m723m462l975m230n964q624j0719j0897q861n784
60527A424503l488k668k163o27J589L071L419L448L568L332K838L167M734O168
60513A450891N811L738J579O39J016K295M061N650O093N027L243J841J005J70
60499A493059p18j031o74o22j547k758l395l938n256o526n867l077j83J332K280
60484A461079M005O356Q628J1394J5712K1014K5306K7549K8912L1458L6120M2058
60472A719591M7597N1854N5358N8558N9920N6730M8323L7260K6424J6136N296
$$ y = [1487169, 1506147, 1522791, 1537767, 1552402, 1567341, 1582027, 1595431, 1606718, 1615153, 1620071, 1621484, 1620177, 1616621, 1610321, 1600911, 1589357, 1577170, 1564865, 1552252, 1540013, 1529654, 1521712, 1515137, 1508830, 1502830, 1497545, 1492742, 1488019, 1483557, 1479582, 1475352, 1469388, 1460764, 1450045, 1439148, 1430287, 1424503, 1421015, 1418347, 1416184, 1415557, 1417146, 1420217, 1423636, 1427084, 1430652, 1433984, 1436822, 1439989, 1444723, 1450891, 1456702, 1460440, 1462019, 1462658, 1463674, 1465969, 1470030, 1475680, 1481773, 1486800, 1490043, 1491884, 1492889, 1493059, 1492341, 1491310, 1490636, 1490014, 1488467, 1485709, 1482314, 1478376, 1473120, 1466594, 1460727, 1457650, 1457467, 1458799, 1461079, 1465084, 1471440, 1480068, 1491462, 1507174, 1528188, 1553494, 1581043, 1609955, 1641413, 1677533, 1719591, 1767188, 1819042, 1874400, 1932958, 1992878, 2049608, 2097931, 2135191, 2161615, 2177751, 2183047]
60461B183047n692j4756k0518k3289k3907k2845k0423j6745j1505m790K073P518
60449B028168J1496J5260J9430K3213K5633K6699K7338K8743L1631L5646L9813
60438B313070M4186N0233N8718O8062P6161Q3274R1546J02130J14412J27714J41927
60427C271433J56379J70022J83187J97561K13970K31721K50664K72225K97587
60418E244749L26186L56647L87530M15629M34480M36033M14019L65781K92348
60409H673402J98098Q9900k4300j36304k37775l21463l83656m24886m47602m54029
60399F531385m46833m30383m09387l86360l61352l34077l05323k76507k48804
60390C332359k22962j99452j78477j59913j43223j27583j12686r9347q8644q0259
$$ y = [2183047, 2177355, 2162599, 2142081, 2118792, 2094885, 2072040, 2051617, 2034872, 2023367, 2018577, 2020650, 2028168, 2039664, 2054924, 2074354, 2097567, 2123200, 2149899, 2177237, 2205980, 2237611, 2273257, 2313070, 2357256, 2407489, 2466207, 2534269, 2610430, 2693704, 2785250, 2887380, 3001792, 3129506, 3271433, 3427812, 3597834, 3781021, 3978582, 4192552, 4424273, 4674937, 4947162, 5244749, 5570935, 5927582, 6315112, 6730741, 7165221, 7601254, 8015273, 8381054, 8673402, 8871500, 8961400, 8937100, 8800796, 8563021, 8241558, 7857902, 7433016, 6985414, 6531385, 6084552, 5654169, 5244782, 4858422, 4497070, 4162993, 3857670, 3581163, 3332359, 3109397, 2909945, 2731468, 2571555, 2428332, 2300749, 2188063, 2088716, 2000072, 1919813]
60380A919813p2626o4973n8223n3261m9350m5258m1041l7572l4846l2041k8976
60369A401646k6343k4455k2746k0712j8576j6856j5730j4916j3894j2376j0790
60358A204252r933r735q939o729m135k809k780k516j117O89J893K356K336J870
60344A164703J288J441K664M027M395L959M012N322P255Q506Q272O768N052M364
60330A232028N210O842P840P413O056M870M389M281M064L658K963J419j364m532
60316A285137o468o590n974n559m619k202N40J211m83k111j978j407k100k867
60302A244530j336J930L809L236K679M109O119O690O561P488Q832Q719P687Q142
60288A319195J0307J1614J0694R327R419J0448J1166J1786J2740J3023J1640R535
$$ y = [1919813, 1847187, 1782214, 1723991, 1670730, 1621380, 1576122, 1535081, 1497509, 1462663, 1430622, 1401646, 1375303, 1350848, 1328102, 1307390, 1288814, 1271958, 1256228, 1241312, 1227418, 1215042, 1204252, 1194319, 1184584, 1175645, 1168916, 1164781, 1161972, 1159192, 1156676, 1155559, 1156248, 1158141, 1160497, 1162833, 1164703, 1165991, 1167432, 1170096, 1174123, 1178518, 1182477, 1186489, 1191811, 1199066, 1207572, 1215844, 1222612, 1227664, 1232028, 1237238, 1244080, 1251920, 1259333, 1265389, 1270259, 1274648, 1278929, 1282993, 1286651, 1289614, 1291033, 1289669, 1285137, 1278669, 1272079, 1266105, 1260546, 1255927, 1253725, 1254265, 1255476, 1254993, 1252882, 1250904, 1249497, 1247397, 1244530, 1243194, 1245124, 1248933, 1252169, 1254848, 1258957, 1265076, 1271766, 1278327, 1285815, 1294647, 1303366, 1311053, 1319195, 1329502, 1341116, 1351810, 1361137, 1370556, 1381004, 1392170, 1403956, 1416696, 1429719, 1441359, 1450894]
60276A450894Q246P627O681N756N858O341N387K776M01q8J227L461N778P260P333
60261A524938O684O511O593N345K126j735m671o477p659q221p974p341p082p473
60247A493564q127q373p682o155m683m143m437m754m594l910k518k77K130L486
60233A439527L239J771l09k205k548l74L282N947O366N636N337N678O069O474
60219A483890P283Q405R288R645R750J0207J1462J3196J4327J4282J3985J4700
60207A620420J6077J6714J6684J7860K1119K4826K7174K8824L1714L6082M0249
60196A897743M3132M5481M8370N1648N4625N7615O1910O8124P5339Q2324Q9167
60185B575478R6789J04978J12256J18303J25177J34812J46106J56024J63093J68246
$$ y = [1450894, 1459140, 1466767, 1473448, 1479204, 1485062, 1491403, 1496790, 1499566, 1499967, 1499879, 1501106, 1504567, 1510345, 1517605, 1524938, 1531622, 1538133, 1544726, 1550071, 1552197, 1550462, 1545791, 1539314, 1531655, 1523434, 1515460, 1508119, 1501037, 1493564, 1485437, 1477064, 1469382, 1463227, 1458544, 1454401, 1449964, 1445210, 1440616, 1436706, 1434188, 1433911, 1436041, 1439527, 1442766, 1444537, 1444228, 1442023, 1439475, 1439101, 1442383, 1448330, 1454696, 1460332, 1465669, 1471347, 1477416, 1483890, 1491173, 1499578, 1508866, 1518511, 1528261, 1538468, 1549930, 1563126, 1577453, 1591735, 1605720, 1620420, 1636497, 1653211, 1669895, 1687755, 1708874, 1733700, 1760874, 1789698, 1821412, 1857494, 1897743, 1940875, 1986356, 2034726, 2086374, 2140999, 2198614, 2260524, 2328648, 2403987, 2486311, 2575478, 2672267, 2777245, 2889501, 3007804, 3132981, 3267793, 3413899, 3569923, 3733016, 3901262]
60175C901262J72520J75703J77365J77412J75234J69812J61107J50072J37103
60166E397590J21965J05458Q9271P3657N7075L8936K0897M602j0002k2962l2849
60155E843638l8609m1323m2383m1298l6965k9896k1140j0060M522K1555L8288
60144E646329N3525O8525Q4587J01321J17465J32043J44446J54474J62346J67815
60134F832876J69436J65773J57156J45210J30777J13400R2684O9159M3937J8495
60124G938903n518k7438m8284o8901q7643j01420j09272j13256j15271j14576
60114G147324j09398r9707q6970p1788n3387l1732q988J2011L0458M7965O5989
60103F841777Q3539R7970J07660J12969J14794J13285J08295J00054Q8933P5461
$$ y = [3901262, 4073782, 4249485, 4426850, 4604262, 4779496, 4949308, 5110415, 5260487, 5397590, 5519555, 5625013, 5714284, 5787941, 5845016, 5883952, 5904849, 5909451, 5899449, 5876487, 5843638, 5805029, 5763706, 5721323, 5680025, 5643060, 5613164, 5592024, 5581964, 5586486, 5608041, 5646329, 5699854, 5768379, 5852966, 5954287, 6071752, 6203795, 6348241, 6502715, 6665061, 6832876, 7002312, 7168085, 7325241, 7470451, 7601228, 7714628, 7807312, 7876471, 7920408, 7938903, 7933385, 7905947, 7857663, 7788762, 7701119, 7599699, 7490427, 7377171, 7261900, 7147324, 7037926, 6938219, 6851249, 6779461, 6726074, 6694342, 6685354, 6697365, 6727823, 6775788, 6841777, 6925316, 7023286, 7130946, 7243915, 7358709, 7471994, 7580289, 7680343, 7769276, 7844737]
60093G844737O0966M7167L4557K2249J0151P0o208q739q087l441O304K0366L6793
60080H056885N4891P5318R8124J22549J48714J77795K10061K44042K78029L11571
60070I777979L45315L80145M16280M52368M85676N14155N37964N57780N72087
60061A4039749N77712N72871N58066N34024N00603M58090M07818L50730K86702
60052A8286365K15967J40003O0507k1188j02956j81471k53959l19279l76333m22615
60042A7025041m55606m75045m82623m79859m67339m45701m16249l80426l39482
60033A3082711k94898k48653k02657j57833j13854p0105k7360J1740M4315O9247
60023A2092653Q7041R7954J01259R6496Q4530O7049M5695K2062k385k7033n2270
$$ y = [7844737, 7905703, 7952870, 7987427, 8009676, 8019827, 8019897, 8013689, 8004950, 7996863, 7993422, 7999726, 8020092, 8056885, 8111776, 8187094, 8285218, 8407767, 8556481, 8734276, 8944337, 9188379, 9466408, 9777979, 10123294, 10503439, 10919719, 11372087, 11857763, 12371918, 12909882, 13467662, 14039749, 14617461, 15190332, 15748398, 16282422, 16783025, 17241115, 17648933, 17999663, 18286365, 18502332, 18642335, 18702842, 18681654, 18578698, 18397227, 18143268, 17823989, 17447656, 17025041, 16569435, 16094390, 15611767, 15131908, 14664569, 14218868, 13802619, 13422193, 13082711, 12787813, 12539160, 12336503, 12178670, 12064816, 11994711, 11967351, 11979091, 12023406, 12092653, 12179694, 12277648, 12378907, 12475403, 12559933, 12626982, 12672677, 12694739, 12692354, 12665321, 12613051]
60012A2613051p8382j04699j30151j54106j76175j95697k11976k24819k34480
60003A1102566k41257k45332k46511k44018k37019k25790k11823j96417j79581
59994I074818j60802j40241j18548r5761p1386m5637j9813M986K9069N3443P7999
59983H588127J01037J20827J37073J50272J60066J65181J64831J59072J47487
59974I893973J28967J03729P4630M5073J6028j3750m4939p6363j06225j33209
59964I887914j56129j73784j85674j92108j93391j89692j81857j71252j58443
59955H285584j42869j24317j03899q3009o1973m0201j7153P337L3194O0056Q7343
59944G900093J14589J41284J66388J88689K07904K24672K38975K48999K52174
$$ y = [12613051, 12534669, 12429970, 12299819, 12145713, 11969538, 11773841, 11561865, 11337046, 11102566, 10861309, 10615977, 10369466, 10125448, 9888429, 9662639, 9450816, 9254399, 9074818, 8914016, 8773775, 8655227, 8559466, 8488080, 8442443, 8422630, 8427616, 8456685, 8510128, 8588127, 8689164, 8809991, 8947064, 9097336, 9257402, 9422583, 9587414, 9746486, 9893973, 10022940, 10126669, 10201299, 10246372, 10262400, 10248650, 10203711, 10127348, 10021123, 9887914, 9731785, 9558001, 9372327, 9180219, 8986828, 8797136, 8615279, 8444027, 8285584, 8142715, 8018398, 7914499, 7831490, 7769517, 7729316, 7712163, 7719500, 7752694, 7812750, 7900093, 8014682, 8155966, 8322354, 8511043, 8718947, 8943619, 9182594, 9431593, 9683767]
59935I683767K47137K34512K16061J93233J66371J35208J00300O3590K7004r101
59925A1058082m5169q0404j12682j40517j63690j81551j92290j94929j90876j82375
59915I573599j70204j54096j34623j13112q9942o4437l6615p979J9803M5984P0321
59904H938699R2511J12662J31418J48756J63118J72634J77107J77982J76368J72002
59894A0463257J64471J54570J43573J31737J18662J05178R3660Q5979Q1931Q0365
59884A1623383Q1358Q6486R7224J13806J35572J61896J92678K28182K68227L11409
59874A3300221L55448L98640M40440M80223N15902N44378N62785N68559N58769
59865A7725365N30592M82698M15604L30946K31377J21432P448j04179k08775l03346
$$ y = [9683767, 9930904, 10165416, 10381477, 10574710, 10741081, 10876289, 10976589, 11040179, 11067183, 11058082, 11012913, 10932509, 10819827, 10679310, 10515620, 10334069, 10141779, 9946850, 9755974, 9573599, 9403395, 9249299, 9114676, 9001564, 8911622, 8847185, 8810570, 8802591, 8822394, 8868378, 8938699, 9031210, 9143872, 9275290, 9424046, 9587164, 9759798, 9936905, 10114887, 10291255, 10463257, 10627728, 10782298, 10925871, 11057608, 11176270, 11281448, 11375108, 11461087, 11543018, 11623383, 11704741, 11791227, 11888451, 12002257, 12137829, 12299725, 12492403, 12720585, 12988812, 13300221, 13655669, 14054309, 14494749, 14974972, 15490874, 16035252, 16598037, 17166596, 17725365, 18255957, 18738655, 19154259, 19485205, 19716582, 19838014, 19845462, 19741283, 19532508, 19229162]
59855A9229162l85295m51770n00679n32280n49004n53073n44791n24251m94157
59846A4693862m59110m21517l80150l33761k84433k35629j88345j41231r3676
59837A2156010m6675j116M2603Q3254J18981J48991J73389J91260K00418J99223
59827A3266338J87070J63225J27071P9934K5045l4681r7365j60595k21033k76133
59817A3058876l24585l64782l94805m14642m26517m31944m30122m20258m03862
59808I447359l83552l61042l37416l13850k90532k66156k39991k13604j89201
59799F852015j67185j46666j27567j10825r7181q6880p9942p5524p1749o7418
59789E821078o3253o0284n7704n3680m7708m0883l4237k8304k4026k2546k3861
$$ y = [19229162, 18843867, 18392097, 17891418, 17359138, 16810134, 16257061, 15712270, 15188019, 14693862, 14234752, 13813235, 13433085, 13099324, 12814891, 12579262, 12390917, 12249686, 12156010, 12109335, 12108219, 12150822, 12234076, 12353057, 12502048, 12675437, 12866697, 13067115, 13266338, 13453408, 13616633, 13743704, 13823638, 13848683, 13814002, 13716637, 13556042, 13335009, 13058876, 12734291, 12369509, 11974704, 11560062, 11133545, 10701601, 10271479, 9851221, 9447359, 9063807, 8702765, 8365349, 8051499, 7760967, 7494811, 7254820, 7041216, 6852015, 6684830, 6538164, 6410597, 6299772, 6202591, 6115711, 6035769, 5960245, 5888496, 5821078, 5757825, 5697541, 5639837, 5586157, 5538449, 5497566, 5463329, 5435025, 5410999, 5388453, 5364592]
59778E364592k6812l0720l6001m2864n0175n6242o0362o3145o5179o5759o3553
59767D803780n8596n2800m7536m1530l2696k1610j1149k547N983J5894K5787L3634
59755D616614L9673M5336N0834N5898O1682O9637P8960Q7263R3497R8257J01283
59744E398934J00633R5013Q5615P5097O5438N6983M8969M0930L3842K9502K8354
59733F059310K8892K9933L2407L7709M5434N4438O5334P9864R8049J17904J38078
59722F787352J59089J81921K07021K34931K66152K99921L34643L69920M06653
59713I247603M44428M80102N09244N27188N27920N04041M50254L67140K61214
59704A3319134J42361K1917q8632j80200k48750k95069l22021l32497l29567l16829
$$ y = [5364592, 5337780, 5307060, 5271059, 5228195, 5178020, 5121778, 5061416, 4998271, 4933092, 4867333, 4803780, 4745184, 4692384, 4644848, 4603318, 4570622, 4549012, 4537863, 4535316, 4541299, 4557193, 4582980, 4616614, 4656287, 4701623, 4752457, 4808355, 4870037, 4939674, 5018634, 5105897, 5199394, 5297651, 5398934, 5499567, 5594580, 5680195, 5755292, 5820730, 5877713, 5926682, 5967612, 6001454, 6030956, 6059310, 6088202, 6118135, 6150542, 6188251, 6233685, 6288123, 6353457, 6433321, 6531370, 6649274, 6787352, 6946441, 7128362, 7335383, 7570314, 7836466, 8136387, 8471030, 8840950, 9247603, 9692031, 10172133, 10681377, 11208565, 11736485, 12240526, 12690780, 13057920, 13319134, 13461495, 13483412, 13394780, 13214580, 12965830, 12670761, 12348740, 12016243, 11686676, 11369847]
59694A1369847k97396k72601k42454k07440j69619j31677r5082n9509k4127J0996
59684I880938M4993P7352J08386J38696J68697J98847K29936K62689K96995L31703
59674A1739232L65518L98452M32367M69664N11213N55886O02226O50012O99855
59665A6424425P51915Q05647Q60360R15115R67985J016098J056590J087325J106827
59656B4992287J114161J109072J091992J064127J028036R88159R50045R18382
59648C3256261Q95634Q82372Q78373Q82825Q93547R06518R16735R19518R10786
59639D1342569Q86334Q41883P74861O86211N80159M62280L38032K12784R2233
59630D6217346j7703j11566j85318k37091k66825k74921k61606k27904j76231
$$ y = [11369847, 11072451, 10799850, 10557396, 10349956, 10180337, 10048660, 9953578, 9894069, 9869942, 9880938, 9925931, 10003283, 10111669, 10250365, 10419062, 10617909, 10847845, 11110534, 11407529, 11739232, 12104750, 12503202, 12935569, 13405233, 13916446, 14472332, 15074558, 15724570, 16424425, 17176340, 17981987, 18842347, 19757462, 20725447, 21741545, 22798135, 23885460, 24992287, 26106448, 27215520, 28307512, 29371639, 30399675, 31387834, 32337879, 33256261, 34151895, 35034267, 35912640, 36795465, 37689012, 38595530, 39512265, 40431783, 41342569, 42228903, 43070786, 43845647, 44531858, 45112017, 45574297, 45912329, 46125113, 46217346, 46199643, 46088077, 45902759, 45665668, 45398843, 45123922, 44862316, 44634412, 44458181]
59621D4458181j09017k7469O7186J72023K83717M01117N24500O52078P79010R00126
59611D8101452J011568J108849J184934J231208J239071J200184J107335R57122
59603E7141723P51577M97151K03851j13715m36701p45825j025170j262844j450788
59594E3559259j586229j672148j714343j718333j689710j635724j564486j483765
59586D0494521j402243j330700j279307j253310j251971j270420j300773j332821
59578C0072976j356621j365481j356334j328783j285456j231729j172311j108264
59570A9867997j039119r66978q96025q28416p63455p00800o41791n87099n35607
59561A2908707m86559m40835l99214l61120l25905k93851k65037k38687k14509
$$ y = [44458181, 44349164, 44321695, 44388881, 44560904, 44844621, 45245738, 45770238, 46422316, 47201326, 48101452, 49113020, 50221869, 51406803, 52638011, 53877082, 55077266, 56184601, 57141723, 57893300, 58390451, 58594302, 58480587, 58043886, 57298061, 56272891, 55010047, 53559259, 51973030, 50300882, 48586539, 46868206, 45178496, 43542772, 41978286, 40494521, 39092278, 37761578, 36482271, 35228961, 33976990, 32706570, 31405797, 30072976, 28716355, 27350874, 25994540, 24665757, 23380301, 22148572, 20976261, 19867997, 18828878, 17861900, 16965875, 16137459, 15374004, 14673204, 14031413, 13444314, 12908707, 12422148, 11981313, 11582099, 11220979, 10895074, 10601223, 10336186, 10097499, 9882990]
59552I882990j93545j76930j64672j56024j50111j45951j43089j42510j45508
59543H464650j51191j56519j59379j60470j61372j61940j60464j55796j48461
59534G049058j40028j31698j23216j13246j01296q8905p7946o8227n7941m6323
59524F100232l4424k3205j2386j525Q956J8460K6911L4417M0897M6357N0862N4295
59512F309847N6847N9447O2862O6701P0322P4275P9654Q6504R4328J03649J15372
59501G179808J28815J42154J54860J68175J83286K00540K20075K41353K62353
59492H881419K81511L00331L21742L45749L69118L89643M07963M24573M37842
59483A2159891M46203M49812M48642M41208M26890M07579L85538L61290L34817
$$ y = [9882990, 9689445, 9512515, 9347843, 9191819, 9041708, 8895757, 8752668, 8610158, 8464650, 8313459, 8156940, 7997561, 7837091, 7675719, 7513779, 7353315, 7197519, 7049058, 6909030, 6777332, 6654116, 6540870, 6439574, 6350669, 6272723, 6204496, 6146555, 6100232, 6065808, 6042603, 6030217, 6028692, 6037648, 6056108, 6083019, 6117436, 6158333, 6204690, 6255552, 6309847, 6366694, 6426141, 6489003, 6555704, 6626026, 6700301, 6779955, 6866459, 6960787, 7064436, 7179808, 7308623, 7450777, 7605637, 7773812, 7957098, 8157638, 8377713, 8619066, 8881419, 9162930, 9463261, 9785003, 10130752, 10499870, 10889513, 11297476, 11722049, 12159891, 12606094, 13055906, 13504548, 13945756, 14372646, 14780225, 15165763, 15527053, 15861870]
59474A5861870L06805K77196K44532K08668J72458J39041J09139Q2784O1765M7958
59464A7512216M0857L9227M4029N6930P6651R9274J21656J42152J58375J66870
59454A8458237J65164J52006J25539Q3672K7071m0070j13069j89253k66879l43081
59444A8059337m14068m76622n28660n68737n95746o09137o09449n98720n79932
59435A3078266n55351n25618m90909m52586m12863l73209l34009k95708k59179
59426I378834k24766j91837j59751j28719r9239p1002m2821j3761J5838M4636
59416H507412P1656R7246J22598J48642J75658K03325K30399K54889K75695K93852
59406A0381372L10733L24885L32239L29980L18768L00234K73769K37161J89620
$$ y = [15861870, 16168675, 16445871, 16690403, 16899071, 17071529, 17210570, 17319709, 17402493, 17464258, 17512216, 17553073, 17592300, 17636329, 17693259, 17769910, 17869184, 17990840, 18132992, 18291367, 18458237, 18623401, 18775407, 18900946, 18984618, 19011689, 18971619, 18858550, 18669297, 18402418, 18059337, 17645269, 17168647, 16639987, 16071250, 15475504, 14866367, 14256918, 13658198, 13078266, 12522915, 11997297, 11506388, 11053802, 10640939, 10267730, 9933721, 9638013, 9378834, 9154068, 8962231, 8802480, 8673761, 8574522, 8503520, 8460699, 8446938, 8462776, 8507412, 8579068, 8676314, 8798912, 8947554, 9123212, 9326537, 9556936, 9811825, 10087520, 10381372, 10692105, 11016990, 11349229, 11679209, 11997977, 12298211, 12571980, 12809141, 12998761]
59397A2998761J32723O8878K98p0430j39713k03603k59093l05125l42413l71979
59387A1508304l93943m08044m14846m15367m09822l98263l82382l64993l47131
59378G973513l27538l05693k83545k63018k43344k22554k00504j78967j59532
59369E788818j42729j28364j15305j01704q6811p2076n9307m8469l8360k8490
59359D967203j8869q944J620J1624J9607K6010L2559M0027M8063N6680O5911P4120
59347E315611P8727P8941P6454P3377P1088P1144P5263Q3639R4809J07913J23723
59336F250689J42384J61373J77030J87794J95263K02669K13082K28502K49520
59327H008306K75482L05385L38678L75067M13847M53917M94771N37112N82191
$$ y = [12998761, 13131484, 13200362, 13200660, 13130230, 12990517, 12786914, 12527821, 12222696, 11880283, 11508304, 11114361, 10706317, 10291471, 9876104, 9466282, 9068019, 8685637, 8320644, 7973513, 7645975, 7340282, 7056737, 6793719, 6550375, 6327821, 6127317, 5948350, 5788818, 5646089, 5517725, 5402420, 5300716, 5213905, 5141829, 5082522, 5034053, 4995693, 4967203, 4948334, 4939390, 4941010, 4952634, 4972241, 4998251, 5030810, 5070837, 5118900, 5175580, 5241491, 5315611, 5394338, 5473279, 5549733, 5623110, 5694198, 5765342, 5840605, 5924244, 6019053, 6126966, 6250689, 6393073, 6554446, 6731476, 6919270, 7114533, 7317202, 7530284, 7758786, 8008306, 8283788, 8589173, 8927851, 9302918, 9716765, 10170682, 10665453, 11202565, 11784756]
59318A1784756O30299O80126P29500P76363Q18487Q52732Q75423Q83832Q76955
59309A8908473Q55222Q20215P74701P21810O63861O02484N39861M78599M19937
59300B4785163L63079L06668K50018J92524J33156P1183O404o1806j34135k09076
59290B5703178k82451l50404m11808m66769n14386n53785n86116o13558o36905
59281B1286996o55930o71323o84034o92995o95665o91175o81106o66893o48155
59272A5199720o24124n95292n63031n28710m93574m58479m23171l86799l49606
59263A0776934l13291k79333k47680k17450j88172j59990j33269j08379q5363
59254I044007o3652m2670k2815n245R450K1777L2275M0607M6032M8348M7980M5346
$$ y = [11784756, 12415055, 13095181, 13824681, 14601044, 15419531, 16272263, 17147686, 18031518, 18908473, 19763695, 20583910, 21358611, 22080421, 22744282, 23346766, 23886627, 24365226, 24785163, 25148242, 25454910, 25704928, 25897452, 26030608, 26101791, 26108195, 26046389, 25912254, 25703178, 25420727, 25070323, 24658515, 24191746, 23677360, 23123575, 22537459, 21923901, 21286996, 20631066, 19959743, 19275709, 18582714, 17887049, 17195874, 16514768, 15847875, 15199720, 14575596, 13980304, 13417273, 12888563, 12394989, 11936510, 11513339, 11126540, 10776934, 10463643, 10184310, 9936630, 9719180, 9531008, 9371018, 9237749, 9129370, 9044007, 8980355, 8937685, 8914870, 8909625, 8919075, 8940852, 8973127, 9013734, 9059766, 9108114, 9156094, 9201440]
59242I201440M0420L2996K3259J2027L26j1137k1818l0985l8205m4009m8983n2063
59230I063268n0949m4856l5680k5590j4474r62J5015L2094M9530O7961Q8181J10109
59218I253647J32834J54792J74073J89507K01449K11041K18866K24467K26437
59209A0987113K22554K11077J92973J71762J49644J24533R2626N3662J2155k6257
59199A2191842n8260q3160j01814j15842j26580j34283j39006j41904j44471j46717
59189A0999805j47615j47412j47718j48904j49076j46506j41681j35874j28871
59180I706148j19546j08000r5520q2366o6893m7555k4831l19K5651N4326Q6301
59169I327396J20286J54921J90821K29374K70132L11206L51928L92930M33060
$$ y = [9201440, 9241860, 9274856, 9298115, 9310142, 9310468, 9299331, 9277513, 9246528, 9208323, 9164314, 9115331, 9063268, 9012319, 8967463, 8931783, 8906193, 8891719, 8890757, 8905772, 8937866, 8987396, 9055357, 9143538, 9253647, 9386481, 9541273, 9715346, 9904853, 10106302, 10317343, 10536209, 10760676, 10987113, 11209667, 11420744, 11613717, 11785479, 11935123, 12059656, 12152282, 12205944, 12218099, 12191842, 12133582, 12050422, 11948608, 11832766, 11706186, 11571903, 11432897, 11290993, 11146522, 10999805, 10852190, 10704778, 10557060, 10408156, 10259080, 10112574, 9970893, 9835019, 9706148, 9586602, 9478602, 9383082, 9300716, 9233823, 9186268, 9161437, 9161118, 9186769, 9241095, 9327396, 9447682, 9602603, 9793424, 10022798, 10292930, 10604136, 10956064, 11348994, 11782054]
59160A1782054M68409M95442N13103N20454N14224M90813M49530L91792L18254
59151A5944075K29113J26916J7068r4485k02633l02948l92210m69034n32405n79851
59141A3743606o08950o20581o18839o07470n88029n61638n30563m97194m62712
59132H647630m27519l92157l57422l24288k93740k65930k39695k14024j89789
59123E943066j68786j51106j34801j18364j02302q7921p5549o4303n3021m1334
59113D945579l0292k1457j4719p700J549J2055K1518K9548L7482M5514N2325N7695
59101E129097O3393P0765P9085Q6965R4119J01051J07942J14427J19700J22735
59091F089279J23153J21772J19300J14974J07656R7968Q7626P6942O4659N0375
$$ y = [11782054, 12250463, 12745905, 13259008, 13779462, 14293686, 14784499, 15234029, 15625821, 15944075, 16173188, 16300104, 16317172, 16222687, 16020054, 15717106, 15324896, 14855862, 14323457, 13743606, 13134656, 12514075, 11895236, 11287766, 10699737, 10138099, 9607536, 9110342, 8647630, 8220111, 7827954, 7470532, 7146244, 6852504, 6586574, 6346879, 6132855, 5943066, 5774280, 5623174, 5488373, 5370009, 5267707, 5179786, 5104237, 5039934, 4986913, 4945579, 4915287, 4893830, 4879111, 4871411, 4872960, 4885015, 4906533, 4936081, 4973563, 5019077, 5071402, 5129097, 5192490, 5263255, 5342340, 5429305, 5523424, 5624475, 5732417, 5846844, 5966544, 6089279, 6212432, 6334204, 6453504, 6568478, 6676134, 6774102, 6861728, 6938670, 7003329, 7053704]
59081G053704L5262K0287N579q055j8887k6512l2673l8852m4234m6919m6170m2528
59069F810002l6534k8180j7301m127J0318K4573L8103N2023O7619Q4560J01598
59058G102654J18519J35977J53855J71490J89324K08491K28653K48072K66045
59049H823080K83467L00630L16304L29543L40648L49455L54140L52561L43680
59040A1793508L27012L01777K67208K22937J68893J06018L7252l3363j02838j69443
59030A2918961k31123k85445l31415l69607m00163m22186m35528m41472m41159
59021I560863m34935m23886m10249l95468l79156l60754l40932l20729l00688
59012F194066k81519k64174k48481k32844k16177j99262j83711j70452j59440
$$ y = [7053704, 7088966, 7109253, 7114832, 7106777, 7087890, 7061378, 7028705, 6989853, 6945619, 6898700, 6852530, 6810002, 6773468, 6745288, 6727987, 6723860, 6734178, 6758751, 6796854, 6848877, 6916496, 7001056, 7102654, 7221173, 7357150, 7511005, 7682495, 7871819, 8080310, 8308963, 8557035, 8823080, 9106547, 9407177, 9723481, 10053024, 10393672, 10743127, 11097267, 11449828, 11793508, 12120520, 12422297, 12689505, 12912442, 13081335, 13187353, 13224605, 13191242, 13088404, 12918961, 12687838, 12402393, 12070978, 11701371, 11301208, 10879022, 10443494, 10002022, 9560863, 9125928, 8702042, 8291793, 7896325, 7517169, 7156415, 6815483, 6494754, 6194066, 5912547, 5648373, 5399892, 5167048, 4950871, 4751609, 4567898, 4397446, 4238006]
59003D238006j49711j39715j28836j18615j10924j04983r8058q9375q1187p5417
58993C141185p1301o7267o3140n9370n5646n1604m7719m4525m1846l9458l7454
58982B561855l5539l3183l0710k8880k7255k4570k0931j7770j5377j2478q649
58971B306513n012j929J682N969R220J0491J1074J2376J4118J5582J6604J6503
58959B413191J4201J0458P765O961O199M441L269L749M192L216K560M424P919
58946B492545J0679J2367J4076J5618J5942J5273J4549J3442J0972P389L671j4
58934B626509l703o247o285m035q45K324M768N577M752L914M576O471Q581J0767
58920B657124J3265J5819J8377K1418K4641K6801K7829K9422L2359L5190L6919
$$ y = [4238006, 4088295, 3948580, 3819744, 3701129, 3590205, 3485222, 3387164, 3297789, 3216602, 3141185, 3069884, 3002617, 2939477, 2880107, 2824461, 2772857, 2725138, 2680613, 2638767, 2599309, 2561855, 2526316, 2493133, 2462423, 2433543, 2406288, 2381718, 2360787, 2343017, 2327640, 2315162, 2306513, 2301501, 2299572, 2301254, 2307223, 2316443, 2326934, 2338008, 2350384, 2364502, 2380084, 2396688, 2413191, 2427392, 2437850, 2445615, 2452576, 2458775, 2463216, 2466485, 2470234, 2474426, 2477642, 2480202, 2484626, 2492545, 2503224, 2515591, 2529667, 2545285, 2561227, 2576500, 2591049, 2604491, 2615463, 2622852, 2626523, 2626509, 2622806, 2616559, 2610274, 2606239, 2605394, 2607718, 2612486, 2618063, 2622815, 2626729, 2631305, 2637776, 2646357, 2657124, 2670389, 2686208, 2704585, 2726003, 2750644, 2777445, 2805274, 2834696, 2867055, 2902245, 2939164]
58909B939164L8841M2030M5124M6828M8663N2760N8314O2664O4811O5766O6468
58898C531433O7428O9371P2293P4822P6170P7459P9647Q1878Q3756Q7341R4490
58887D396088J03814J12604J20312J27796J34948J41732J49876J60645J72342
58878E620157J83053J94268K08338K23874K37632K50166K65338K84337L04269
58869G771432L23219L42965L65621L90793M17443M45951M77054N10689N46856
58860A1592023N85929O27504O70523P14866P61133Q08678Q55596R00806R44294
58851A8461352R85026J020239J046856J061826J061142J040476R97158R30033
58843B6604108Q37747P19231N76140M13196K36229N1518j33315l10198m72920
$$ y = [2939164, 2978005, 3020035, 3065159, 3111987, 3160650, 3213410, 3271724, 3334388, 3399199, 3464965, 3531433, 3598861, 3668232, 3740525, 3815347, 3891517, 3968976, 4048623, 4130501, 4214257, 4301598, 4396088, 4499902, 4612506, 4732818, 4860614, 4995562, 5137294, 5287170, 5447815, 5620157, 5803210, 5997478, 6205816, 6429690, 6667322, 6917488, 7182826, 7467163, 7771432, 8094651, 8437616, 8803237, 9194030, 9611473, 10057424, 10534478, 11045167, 11592023, 12177952, 12805456, 13475979, 14190845, 14951978, 15760656, 16616252, 17517058, 18461352, 19446378, 20466617, 21513473, 22575299, 23636441, 24676917, 25674075, 26604108, 27441855, 28161086, 28737226, 29150422, 29386651, 29438169, 29304854, 28994656, 28521736]
58834B8521736o17346p39996q38570r13778r68275j003585j019988j019272j005154
58825B0395772r80578r46827r05744q60626q14043p66609p18513o70806o24561
58816A3107465n80416n39398n02712m70141m39901m10543l82089l55253l30671
58807I096341l08631k88350k67932k46439k25521k07271j91229j75452j59854
58798G025662j45885j33214j19603j04445q9813p7338o6315n5661m5472l5645
58788F152271k4972j2765K0J2269K4056L5844M7651N9557P1924Q4562R6820J08764
58776F656001J21262J34779J49118J64242J80045J95583K10037K24354K40456
58767H275877K58937K79060L00619L23971L48413L72561L96582M22363M51415
$$ y = [28521736, 27904390, 27164394, 26325824, 25412046, 24443771, 23440186, 22420198, 21400926, 20395772, 19415194, 18468367, 17562623, 16701997, 15887954, 15121345, 14402832, 13732026, 13107465, 12527049, 11987651, 11484939, 11014798, 10574897, 10164354, 9782265, 9427012, 9096341, 8787710, 8499360, 8231428, 7984989, 7759468, 7552197, 7360968, 7185516, 7025662, 6879777, 6746563, 6626960, 6522515, 6432702, 6355364, 6289049, 6233388, 6187916, 6152271, 6127299, 6114534, 6114554, 6126823, 6150879, 6186723, 6234374, 6293931, 6365855, 6450417, 6547237, 6656001, 6777263, 6912042, 7061160, 7225402, 7405447, 7601030, 7811067, 8035421, 8275877, 8534814, 8813874, 9114493, 9438464, 9786877, 10159438, 10556020, 10978383, 11429798]
58758A1429798M84154N20968N61912O05394O49206O93117P38626P86109Q33948
58749A7303232Q80332R23648R60989R88514J003644J004856R89162R52029Q90209
58740B5896615Q02679O88924N49174L87326K11236K8989j53386l30037m93865
58731B7587655o38726p61697q62005r39173r93273j025888j039655j037482j022366
58722A9267390r97015r63371r23339q79538q34107p87331p39177o91597o47225
58713A1804690o06236n67064n29953m96873m67672m39317m09986l81295l55344
58704G550950l31879l09785k89287k71115k54933k39793k25021k09998j94333
58695E224806j78940j65502j54371j44185j33801j23244j12716j02374r3122q5846
$$ y = [11429798, 11913952, 12434920, 12996832, 13602226, 14251432, 14944549, 15683175, 16469284, 17303232, 18183564, 19107212, 20068201, 21056715, 22060359, 23065215, 24054377, 25006406, 25896615, 26699294, 27388218, 27937392, 28324718, 28535954, 28564943, 28411557, 28081520, 27587655, 26948929, 26187232, 25325227, 24386054, 23392781, 22366893, 21327238, 20289756, 19267390, 18270375, 17307004, 16383665, 15504127, 14670020, 13882689, 13143512, 12451915, 11804690, 11198454, 10631390, 10101437, 9604564, 9136892, 8697575, 8287589, 7906294, 7550950, 7219071, 6909286, 6619999, 6348884, 6093951, 5854158, 5629137, 5419139, 5224806, 5045866, 4880364, 4725993, 4581808, 4448007, 4324763, 4212047, 4109673, 4016551, 3930705]
58685C930705p9754p3345o6911o2041n8698n5227n1388m8824m8035m7483m6302
58674C292697m5453m5403m5051m3874m2881m2644m2392m1900m2147m3327m4248
58663B813377m4451m4825m5557m5658m5120m5342m6627m7534m7345m6966m6818
58652B307134m6151m5052m4697m4944m4173m2077m0075l8372l5566l1856k9543
58641A864628k9300k8926k6990k4821k3532k2243k0675k0446k2009k3099k2115
58630A600472k0267j8743j6492j2867r660q271p297n127k647j292o40N3J11q23
58616A496510j562j750k994n621o943n142k421j655k152j606k37R1n57m77Q04
58601A464288K344L622M503M351L062J996K259L166L686M069M741N335O109Q391
$$ y = [3930705, 3850951, 3777606, 3710695, 3648654, 3589956, 3534729, 3483341, 3434517, 3386482, 3338999, 3292697, 3247244, 3201841, 3156790, 3112916, 3070035, 3027391, 2984999, 2943099, 2900952, 2857625, 2813377, 2768926, 2724101, 2678544, 2632886, 2587766, 2542424, 2495797, 2448263, 2400918, 2353952, 2307134, 2260983, 2215931, 2171234, 2126290, 2082117, 2040040, 1999965, 1961593, 1926027, 1894171, 1864628, 1835328, 1806402, 1779412, 1754591, 1731059, 1708816, 1688141, 1667695, 1645686, 1622587, 1600472, 1580205, 1561462, 1544970, 1532103, 1522443, 1514172, 1506875, 1501748, 1499101, 1497809, 1497169, 1497222, 1497333, 1496510, 1494948, 1493198, 1490204, 1484583, 1477640, 1472498, 1470077, 1468422, 1466270, 1464664, 1464427, 1464518, 1463961, 1463484, 1464288, 1466632, 1470254, 1474757, 1479108, 1482170, 1484166, 1486425, 1489591, 1493277, 1497346, 1502087, 1507422, 1513531, 1521922]
58587A521922J2166J5309J6870J8857K2858K7199K9749L1393L4217L7949M0842
58576A809331M2755M5002M8187N2172N7092O2637O7573P1613P6360Q2963R0376
58565B506061R7298J04073J11347J18954J27671J39652J55269J71650J86440K00789
58555C919204K16653K33391K49346K64596K79652K93186L03334L09447L10427
58546F379236L03238K85326K56905K19121J72186J17319N8252j433o0253j16169
58536G613728j64752k02732k31036k51861k65259k71233k72345k70941k66091
58527E417478k56446k43970k31494k18747k04163j88608j73904j59536j44318
58518C596292j29575j17289j06626r5619q4702p5496o7834o1162n6785n5263n3650
$$ y = [1521922, 1534088, 1549397, 1566267, 1585124, 1607982, 1635181, 1664930, 1696323, 1730540, 1768489, 1809331, 1852086, 1897088, 1945275, 1997447, 2054539, 2117176, 2184749, 2256362, 2332722, 2415685, 2506061, 2603359, 2707432, 2818779, 2937733, 3065404, 3205056, 3360325, 3531975, 3718415, 3919204, 4135857, 4369248, 4618594, 4883190, 5162842, 5456028, 5759362, 6068809, 6379236, 6682474, 6967800, 7224705, 7443826, 7616012, 7733331, 7791583, 7790150, 7729897, 7613728, 7448976, 7246244, 7015208, 6763347, 6498088, 6226855, 5954510, 5683569, 5417478, 5161032, 4917062, 4685568, 4466821, 4262658, 4074050, 3900146, 3740610, 3596292, 3466717, 3349428, 3242802, 3147183, 3062481, 2986985, 2919151, 2857989, 2801204, 2745941, 2692291]
58507B692291m9079m3398m0329l9799l9140l8271l9217m1460m2249m1190m0567
58496B237592m1374m2329m2595m2453m1673m0017l8542l7872l6367l2703k8764
58485A812903k7003k6499k4795k1960j9571j7451j4885j3240j3734j4333j2744
58474A606688j0644j0919j2639j3154j3355j5911j9707k1160k0195j9962k1248
58463A427794k1914k1390k0982k0237j7790j5288j5643j7672j7419j4631j2803
58452A232025j2829j1911r315p904q786r231p496n495n035n001l816j751K90J724
58438A145469J681R6q22R60L835M765M024M205N401N558M914N572P099P084N831
58423A205672N873P001O576M749M418N782N997M669M508N846N746L586K331K862
$$ y = [2692291, 2643212, 2599814, 2559485, 2519686, 2480546, 2442275, 2403058, 2361598, 2319349, 2278159, 2237592, 2196218, 2153889, 2111294, 2068841, 2027168, 1987151, 1948609, 1910737, 1874370, 1841667, 1812903, 1785900, 1759401, 1734606, 1712646, 1693075, 1675624, 1660739, 1647499, 1633765, 1619432, 1606688, 1596044, 1585125, 1572486, 1559332, 1545977, 1530066, 1510359, 1489199, 1469004, 1449042, 1427794, 1405880, 1384490, 1363508, 1343271, 1325481, 1310193, 1294550, 1276878, 1259459, 1244828, 1232025, 1219196, 1207285, 1197970, 1190066, 1181280, 1172049, 1164553, 1159058, 1154023, 1149022, 1145206, 1143455, 1143745, 1145469, 1147150, 1147246, 1146424, 1147384, 1151219, 1155984, 1160008, 1164213, 1169614, 1175172, 1180086, 1185658, 1192757, 1199841, 1205672, 1211545, 1218546, 1225122, 1229871, 1234289, 1240071, 1246068, 1250737, 1255245, 1261091, 1266837, 1270423, 1272754, 1275616]
58409A275616K103j554n602q027j0033j2299j2940j1317r979j0653j1745j1674
58397A171896j1265j1221j0473q711p441p134o258m234k458j581p97k40q37j558
58383A097688l98J787K351J794L186O412P858O623O106Q114J0182J0306R752R437
58369A181198P942N053L191L400L659K697J826J579N76r33m41K383M663N046N491
58354A227330O987P784P365P893R980J1137J0199R242R517R462Q365P913Q434
58341A341608P711N136L040K263N82k888n786o635o823p070o078m128l725n255
58327A311952o240o017o553p498n630q17K704K900K589L530L303N90j618r72P87
58312A293010J969L906P102Q991Q325P609Q662R819R876J0441J2120J2694J1356
$$ y = [1275616, 1277719, 1276165, 1270563, 1262536, 1252503, 1240204, 1227264, 1215947, 1205968, 1195315, 1183570, 1171896, 1160631, 1149410, 1138937, 1130226, 1122785, 1115651, 1109393, 1105159, 1102701, 1101120, 1100323, 1100083, 1099246, 1097688, 1097290, 1099077, 1101428, 1103222, 1106408, 1112820, 1120678, 1127301, 1133407, 1141521, 1151703, 1162009, 1171761, 1181198, 1189140, 1194193, 1197384, 1200784, 1204443, 1207140, 1208966, 1210545, 1211121, 1210188, 1209747, 1212130, 1216793, 1221839, 1227330, 1234317, 1242101, 1249466, 1257359, 1267339, 1278476, 1288675, 1297917, 1307434, 1316896, 1325261, 1333174, 1341608, 1349319, 1354455, 1357495, 1359758, 1360340, 1357452, 1351666, 1345031, 1338208, 1331138, 1325060, 1320932, 1317207, 1311952, 1305712, 1299695, 1293142, 1285644, 1280014, 1279197, 1281901, 1284801, 1287390, 1290920, 1294223, 1294813, 1293195, 1292223, 1293010, 1294979, 1298885, 1305987, 1314978, 1323303, 1330912, 1339574, 1349393, 1359269, 1369710, 1381830, 1394524, 1405880]
58299A405880J0518J1345J1833J1184J1486J3201J3787J2815J3495J7007K0120
58288A552671K0561J9885J9146J6643J2056P935N331K691K47J80J564J026o46
58275A659290R26N580Q174P542Q188J1533J3461J2820J3822J7368J8615J6383
58263A793702J6195K0166K2642K0259J7742J9012K1057K1421K3369K8201L0884
58252B034650K8910K7473L0127L2434L0646K8485K9274K9546K6853K5753K9305
58241B353456L2563L1332K9502L0875L1794K9089K7335L0671L5082L6327L7740
58230B705766M2553M6371M5200M3350M5353M7760M7015M7522N3357N9678O1124
58219C245049O1186O4601O8333O8922P0966P8823Q7475R0936R2398R6966J02042
$$ y = [1405880, 1416398, 1427743, 1439576, 1450760, 1462246, 1475447, 1489234, 1502049, 1515544, 1532551, 1552671, 1573232, 1593117, 1612263, 1628906, 1640962, 1648897, 1654228, 1656919, 1657166, 1657346, 1658910, 1659936, 1659290, 1660216, 1665796, 1673970, 1681512, 1689700, 1701233, 1714694, 1727514, 1741336, 1758704, 1777319, 1793702, 1809897, 1830063, 1852705, 1872964, 1890706, 1909718, 1930775, 1952196, 1975565, 2003766, 2034650, 2063560, 2091033, 2121160, 2153594, 2184240, 2212725, 2241999, 2271545, 2298398, 2324151, 2353456, 2386019, 2417351, 2446853, 2477728, 2509522, 2538611, 2565946, 2596617, 2631699, 2668026, 2705766, 2748319, 2794690, 2839890, 2883240, 2928593, 2976353, 3023368, 3070890, 3124247, 3183925, 3245049, 3306235, 3370836, 3439169, 3508091, 3579057, 3657880, 3745355, 3836291, 3928689, 4025655, 4127697]
58208D127697J04265J07919J16901J26117J30503J34458J42721J50614J53411
58199E294606J56561J66100J77634J85518J93802K07093K20004K27076K33728
58190G062122K45690K57469K63359K69720K83590K99532L10862L23278L43716
58181I659338L66566L85239M06210M36705M69715M96659N23529N58841N97385
58172A3900187O32172O70059P18560P69889Q15607Q63671R22929R84863J039811
58163B1317748J096330J164686J237289J306401J383637J479237J580780J677172
58155C2243280J783988J918228K068575K219356K381785K570034K770366K969454
58147E0925066L189624L458527L769352M112053M516649N020475N620609O306208
$$ y = [4127697, 4231962, 4339881, 4456782, 4582899, 4713402, 4847860, 4990581, 5141195, 5294606, 5451167, 5617267, 5794901, 5980419, 6174221, 6381314, 6601318, 6828394, 7062122, 7307812, 7565281, 7828640, 8098360, 8381950, 8681482, 8992344, 9315622, 9659338, 10025904, 10411143, 10817353, 11254058, 11723773, 12220432, 12743961, 13302802, 13900187, 14532359, 15202418, 15920978, 16690867, 17506474, 18370145, 19293074, 20277937, 21317748, 22414078, 23578764, 24816053, 26122454, 27506091, 28985328, 30566108, 32243280, 34027268, 35945496, 38014071, 40233427, 42615212, 45185246, 47955612, 50925066, 54114690, 57573217, 61342569, 65454622, 69971271, 74991746, 80612355, 86918563]
58139H6918563P106073Q053518R144240J0389141J1862945J3628989J5662683
58132A62766152J7916734K0385278K3030795K5810425K8942186L2858921L7313633
58125C49024124M0403334L9092184L1400782J8239111K942174j0949210k1428012
58118D48724487k8103493l1419765l2138371l1177851k9401036k7370154k5332216
58111B43781601k3369560k1478530j9587671j7642945j5688124j3814479j2067138
58104A20133154j0453517q999772p733708o637926n671284m812787m045193l328285
58096F8450682k631326j964948j346465p60532j71386M73188J255780K197205
58088F5502198L066215L370730K699334J112562q60562k615305l822758m460085
$$ y = [86918563, 94024636, 102078154, 111222394, 121611535, 133474480, 147103469, 162766152, 180682886, 201068164, 224098959, 249909384, 278851570, 311710491, 349024124, 389427458, 428519642, 459920424, 478159535, 481101709, 470152499, 448724487, 420620994, 389201229, 357062858, 325885007, 296483971, 269113817, 243781601, 220412041, 198933511, 179345840, 161702895, 146014771, 132200292, 120133154, 109679637, 100679865, 92946157, 86308231, 80636947, 75824160, 71778967, 68450682, 65819356, 63854408, 62507943, 61747411, 61576025, 62049213, 63304993, 65502198, 68568413, 71939143, 74638477, 75751039, 74890477, 72275172, 68452414, 63992329]
58080F3992329m652408m556044m316372m036534l762220l504893l266209l035715
58072C2861934k793708k534915k275255k028509j794541j575893j385461j229672
58064A7243980j101014r93043r06744q38007p75893p17703o70100o32039n92590
58055A0016847n48830n09753m78826m48281m14393l83418l58175l32853l05280
58046F237038k81429k63870k47867k31897k20217k12461k02309j88832j77940
58037D210216j70681j61334j48669j37921j30164j20970j10816j05390j04322
58028C019949j00908r4279r0392q9727q5850p7990p3209p3715p3370o9314o5914
58017B125281o4552o0485n2992m8015m7482m6113m1860l9402m0003l8136l1952
$$ y = [63992329, 59339921, 54783877, 50467505, 46430971, 42668751, 39163858, 35897649, 32861934, 30068226, 27533311, 25258056, 23229547, 21435006, 19859113, 18473652, 17243980, 16142966, 15149923, 14243179, 13405172, 12629279, 11911576, 11241476, 10609437, 10016847, 9468017, 8958264, 8479438, 8031157, 7616764, 7233346, 6875171, 6542318, 6237038, 5955609, 5691739, 5443872, 5211975, 4991758, 4779297, 4576988, 4388156, 4210216, 4039535, 3878201, 3729532, 3591611, 3461447, 3340477, 3229661, 3124271, 3019949, 2919041, 2824762, 2734370, 2644643, 2558793, 2480803, 2407594, 2333879, 2260509, 2191195, 2125281, 2060729, 2000244, 1947252, 1899237, 1851755, 1805642, 1763782, 1724380, 1684377, 1646241, 1614289]
58006A614289k7392k7628k7729k4052k0283j9622j9221j6857j5575j7205j8332
57995A380393j6764j5483j6435j6808j4935j3699j4758j5438j4350j4052j5423
57984A212248j5449j3250j2276j3846j4555j2614j0725j0249q694n450l807m664
57972A086669m367j493M08m57q51R65J499j664n288n705l788j735M31K446K650
57957A069720J587K132M058L535J5j986l20J241m19l191m647o060q275q728o280
57942A042382m379n803q275q607p386o649o495o685q017r816r708p851p512r628
57928I35571j1030r900q458q260p461n112l459l523k932n70J093P84J031L395
57914H81169N606N981O097O582N068J206j175j9J470N68n70K82J002n52k205j660
$$ y = [1614289, 1586897, 1559269, 1531540, 1507488, 1487205, 1467583, 1448362, 1431505, 1415930, 1398725, 1380393, 1363629, 1348146, 1331711, 1314903, 1299968, 1286269, 1271511, 1256073, 1241723, 1227671, 1212248, 1196799, 1183549, 1171273, 1157427, 1142872, 1130258, 1119533, 1109284, 1100590, 1095140, 1091333, 1086669, 1082302, 1080809, 1081217, 1080760, 1079909, 1080874, 1082373, 1080709, 1075421, 1069716, 1065928, 1064193, 1064624, 1067070, 1069720, 1071307, 1073439, 1077497, 1081032, 1081047, 1079061, 1078741, 1079982, 1079563, 1076372, 1071725, 1065665, 1057390, 1048662, 1042382, 1038003, 1032200, 1023925, 1015318, 1007932, 1001283, 994788, 988103, 980086, 970270, 960562, 952711, 945199, 935571, 924541, 914641, 906183, 897923, 890462, 885350, 881891, 878368, 875436, 874866, 875959, 876743, 877774, 881169, 886775, 892756, 898853, 905435, 910503, 911709, 910534, 910515, 911985, 912553, 911983, 912265, 913267, 912715, 910510, 908850]
57898I08850r37k434m267l907k927l827n362n395n350p429j0102j0641r677r123
57884H27472p976m508n43Q33K10N09J974K326R23o25j342j634j824k167l363n341
57868H04924o864p645r029j1263j2483j1841j0927j0534r139o505n245o432p143
57855F89874n211k882k609k519J08L819N446N204N484O479O801O703P223P641
57841G31561O963O254O513O158L835J761K722N469O545N337L849K788J308l69
57827G90694j313k094l778n623o317o411p065p636p087o386o817p342o389m827
57813G11609m349m274k752p4K031L243M300N016N103N589O955P603O622O143Q003
57798G60768R986Q847N398L049K630K279J355P45R0j719l794m357m062m965o760
$$ y = [908850, 907913, 905479, 901212, 897305, 894378, 890551, 885189, 879794, 874444, 867015, 856913, 846272, 836595, 827472, 819496, 814988, 814445, 815278, 815488, 815997, 817971, 820297, 821220, 820595, 819253, 817619, 815795, 813628, 810265, 804924, 798060, 790415, 781386, 770123, 757640, 745799, 734872, 724338, 715199, 708694, 703449, 697017, 689874, 684663, 681781, 679172, 676653, 676761, 680580, 686026, 691230, 696714, 703193, 709994, 716697, 723920, 731561, 738524, 744778, 751291, 757449, 761284, 763045, 765767, 771236, 777781, 783118, 786967, 789755, 791063, 790694, 789381, 787287, 783509, 777886, 771569, 765158, 758093, 750457, 743370, 736984, 730167, 722825, 716436, 711609, 707260, 702986, 700234, 700160, 702191, 705434, 709734, 714750, 719853, 725442, 732397, 740000, 746622, 752765, 760768, 770754, 779601, 784999, 788048, 790678, 792957, 794312, 795057, 795147, 793428, 789634, 785277, 781215, 776250, 769490]
57783G69490p312o532o434p455p893o941n598m589l927m162n514o329n029l033
57769F88742k995m778o064o216o466o845o367n949p644j0767j2268j1365j0584
57756E90434j1490j2362j1212q642o524n752o131o835o517m524k190j483k435
57743E04337l490l900l979l466j728O57K412L436M352M909M860N563Q178J0998
57729E33139J1317R540Q633R498R859P941M735K106Q38Q34J380J170j83j130m94
57714E99183Q8j552m384n661n294n441o278n922m510m361n452m659q16L001L937
57699E51879L134L121M025M337L611K523J596J187J607K445K916L249M362N948
57685E95940O676O405O254O383N883N004N115O103O360N870O514Q625R941R162
$$ y = [769490, 762178, 755646, 749212, 741757, 733864, 726923, 721325, 716736, 712809, 708647, 703133, 696804, 691775, 688742, 685747, 680969, 674905, 668689, 662223, 655378, 649011, 643062, 635418, 624651, 612383, 601018, 590434, 578944, 566582, 555370, 546728, 540204, 534452, 528321, 521486, 514969, 510445, 508255, 506772, 504337, 500847, 496947, 492968, 489502, 487774, 488431, 490843, 494279, 498631, 503540, 508400, 513963, 522141, 533139, 544456, 553996, 562629, 572127, 581986, 589927, 594662, 596768, 597606, 598440, 599820, 600990, 600807, 599677, 599183, 599271, 597719, 593335, 587674, 582380, 576939, 570661, 564739, 560229, 555868, 550416, 545757, 544941, 547942, 551879, 555013, 558134, 562159, 566496, 570107, 572630, 574226, 575413, 577020, 579465, 582381, 585630, 589992, 595940, 602616, 609021, 615275, 621658, 627541, 632545, 637660, 643763, 650123, 655993, 662507, 671132, 681073, 690235]
57671F90235P927P911Q503Q800R537J1203J2345J1730J0666J1292J3730J6400
57659H20279J8155J8919J9321K0584K3511K6866K8121K6576K4380K3800K5126
57648A075638K7879L1958L6468L9429M0205M0688M2720M5809M8646N1383N4916
57637A535739N9124O3273O7190P0957P4600P8987Q5689R4892J04755J13979J23551
57626B472736J34812J47303J59960J73118J87574K02798K17620K31832K45650
57617D173403K58158K67567K72283K70670K60578K40693K12049J77486J40139
57608F273026J03106O9230L9542J2001j7288n1616r2095j36870j80847k17500
57598E800689k42667k56546k61673k59849k51914k39215k23721k06867j89314
$$ y = [690235, 698162, 706073, 714576, 723376, 732913, 744116, 756461, 768191, 778857, 790149, 803879, 820279, 838434, 857353, 876674, 897258, 920769, 947635, 975756, 1002332, 1026712, 1050512, 1075638, 1103517, 1135475, 1171943, 1211372, 1251577, 1292265, 1334985, 1380794, 1429440, 1480823, 1535739, 1594863, 1658136, 1725326, 1796283, 1870883, 1949870, 2035559, 2130451, 2235206, 2349185, 2472736, 2607548, 2754851, 2914811, 3087929, 3275503, 3478301, 3695921, 3927753, 4173403, 4431561, 4699128, 4971411, 5242081, 5502659, 5743352, 5955401, 6132887, 6273026, 6376132, 6445362, 6484904, 6496905, 6479617, 6428001, 6335906, 6199036, 6018189, 5800689, 5558022, 5301476, 5039803, 4779954, 4528040, 4288825, 4065104, 3858237, 3668923]
57589C668923j71542j53944j36659j19957j04449r0419p7505o5376n4154m3712
57579B651206l3393k2936j3076m545L000J0516J8507K6810L5145M3618N2901O3678
57567B831431P5545Q6977R7132J07139J18391J30316J41434J52043J63670J75869
57557D079947J85871J91784J93954J92260J84159J66903J40430J07008O9190K8914
57547E540420j2485n4171r4842j31549j60809j81387j94895k03384k07730k08455
57537D090713k06332k01582j94045j84554j74544j64133j52459j40165j29340
57528B543559j20479j11853j02558r3811q6366p9193p1822o5565o0998n6607n1459
57517A642848m6973m4355m2445l9682l6216l2574k8462k4395k2075k1368j9457
$$ y = [3668923, 3497381, 3343437, 3206778, 3086821, 2982372, 2891953, 2814448, 2749072, 2694918, 2651206, 2617813, 2594877, 2581801, 2577256, 2580256, 2590772, 2609279, 2636089, 2671234, 2714852, 2767753, 2831431, 2906976, 2993953, 3091085, 3198224, 3316615, 3446931, 3588365, 3740408, 3904078, 4079947, 4265818, 4457602, 4651556, 4843816, 5027975, 5194878, 5335308, 5442316, 5511506, 5540420, 5527935, 5473764, 5378922, 5247373, 5086564, 4905177, 4710282, 4506898, 4299168, 4090713, 3884381, 3682799, 3488754, 3304200, 3129656, 2965523, 2813064, 2672899, 2543559, 2423080, 2311227, 2208669, 2114858, 2028492, 1949299, 1877477, 1811912, 1750914, 1694307, 1642848, 1595875, 1551520, 1509075, 1469393, 1433177, 1400603, 1372141, 1347746, 1325671, 1304303, 1284846]
57506A284846j5057j0846r336q942o973m090k530j942n58J122J545J787M299Q561
57492A241886J1576J2484J3398J5701J8506K1060K3911K7180L0001L2095L4217
57481A482015L6887M0082M3825M7693N0618N2995N7595O6090P5803Q2774Q7157
57470B123534R2461J00095J08091J15205J22646J31058J38866J44766J49285J52620
57460C378627J53074J48744J39088J23926J02602P5220M3588J0362k1916n1119
57450D102196p6251r7810j16252j30525j39600j44587j47203j46796j41521j32339
57440B829312j23024j15689j08828j00291q9954p8820o7772n7946n0313m3998
57430A992677l6916k8838k1912j7383j3673q726k560L583R092J4023J8461K2610
$$ y = [1284846, 1269789, 1258943, 1249607, 1240665, 1233692, 1229602, 1227072, 1225130, 1224572, 1225694, 1227239, 1229026, 1233325, 1241886, 1253462, 1265946, 1279344, 1295045, 1313551, 1334611, 1358522, 1385702, 1415703, 1447798, 1482015, 1518902, 1558984, 1602809, 1650502, 1701120, 1754115, 1811710, 1877800, 1953603, 2036377, 2123534, 2215995, 2316090, 2424181, 2539386, 2662032, 2793090, 2931956, 3076722, 3226007, 3378627, 3531701, 3680445, 3819533, 3943459, 4046061, 4121281, 4164869, 4175231, 4153315, 4102196, 4025945, 3928135, 3811883, 3681358, 3541758, 3397171, 3249968, 3103172, 2961651, 2829312, 2706288, 2590599, 2481771, 2381480, 2291526, 2212706, 2144934, 2086988, 2036675, 1992677, 1955761, 1926923, 1905011, 1887628, 1873955, 1865229, 1862669, 1866252, 1875344, 1889367, 1907828, 1930438]
57418A930438K6671L0237L2828L5102L8238M2320M6804N2311N9990O9062P7309
57407B441310Q4310R1949J01202J10687J19077J26553J32832J35855J33892J27250
57397C604917J16653J01383Q0276N3488K2443j0870m3940p4271j00609j22672
57387C626798j39787j51230j57938j61841j63292j61073j55286j48005j40542
57378B247804j32407j23633j15634j08787j01534r3118q4940p8034p1458o4595
57368A273664n8674n4425n0405m5483m0841l7585l4486l0294k6410k4843k4948
57357H45270k4646k3576k2711k1887k0245j8362j7515j7265j5965j3491j1471
57346F38136j0877j1156j1664j2290j2560j1605r469p437o705p208p804p391n957
$$ y = [1930438, 1957109, 1987346, 2020174, 2055276, 2093514, 2135834, 2182638, 2234949, 2294939, 2364001, 2441310, 2525620, 2617569, 2718771, 2829458, 2948535, 3075088, 3207920, 3343775, 3477667, 3604917, 3721570, 3822953, 3903229, 3956717, 3979160, 3968290, 3924350, 3850079, 3749470, 3626798, 3487011, 3335781, 3177843, 3016002, 2852710, 2691637, 2536351, 2388346, 2247804, 2115397, 1991764, 1876130, 1767343, 1665809, 1572691, 1487751, 1409717, 1338259, 1273664, 1214990, 1160565, 1110160, 1064677, 1023836, 986251, 951765, 921471, 895061, 870218, 845270, 820624, 797048, 774337, 752450, 732205, 713843, 696328, 679063, 663098, 649607, 638136, 627259, 616103, 604439, 592149, 579589, 567984, 558515, 551078, 544373, 537165, 529361, 521970, 516013]
57333E16013m611m148l873k857j941k784m888n681m198k494k347k718j927m10
57319D71136M07M00J30n83j657j733p5J675J454l82j885k201j838j212n75m32
57303D62629n86J61J979L032K150R37J231J957R27j447k813k448j679j266q85
57288D63879q74k032l607l620j479J348L403M465M847M785M462L711K184O01O57
57273D82730K507L942L642L404N012O814O360M867N485Q109R730R651J0351J2811
57259E75415J4762J4790J4702J6300J8618K0135K1230K2629K3402K2499K0811
57248G85293J9911J9892J9964K0243K1394K3082K4075K3675K2330K1048K0541
57237A021448K0668K0651K0266K0522K2316K4784K6068K5759K5338K6283K8864
$$ y = [516013, 511402, 507254, 503381, 500524, 498583, 495799, 490911, 485230, 481032, 478538, 476191, 473473, 471546, 471136, 471543, 471943, 472073, 471490, 469833, 468100, 468025, 469700, 471154, 470772, 468887, 466686, 464848, 463636, 463061, 462629, 462043, 462204, 464183, 467215, 469365, 470302, 471533, 473490, 474417, 472970, 470157, 467709, 466030, 464764, 463879, 463005, 460973, 457366, 453746, 452267, 453615, 457018, 461483, 466330, 471115, 475577, 479288, 481472, 482073, 482730, 485237, 489179, 492821, 496225, 501237, 508051, 514411, 519278, 524763, 532872, 542602, 552253, 562604, 575415, 590177, 604967, 619669, 635969, 654587, 674722, 695952, 718581, 741983, 764482, 785293, 805204, 825096, 845060, 865303, 886697, 909779, 933854, 957529, 979859, 1000907, 1021448, 1042116, 1062767, 1083033, 1103555, 1125871, 1150655, 1176723, 1202482, 1227820, 1254103, 1282967]
57226A282967L2721L7276M1372M3832M4830M5776M7624N0033N2168N3457N3633
57215A785689N2909N1936N0768M8255M3353L6636K9524K2529J5286P585p23r929
57203B133818j9104k5579k7691k7391k8166l0843l3216l3292l0959k7073k2868
57192A827636j9869j8356j6494j2899r224p828p868o649m113k703k866k192M50
57179A717025L260M738N641O680P087O625O560P511Q475Q998J0101J2154J3947
57166A818802J4858J5860J7498J8910J9790K1261K4020K7442L1189L5611M0029
57155B085270M2867M4284M6416N0266N4558N8295O2113O6319O9989P2960P6378
57144B729715Q0509Q4266Q7674R2162R7554J01387J02363J02030J01967J01659
$$ y = [1282967, 1315688, 1352964, 1394336, 1438168, 1482998, 1528774, 1576398, 1626431, 1678599, 1732056, 1785689, 1838598, 1890534, 1941302, 1989557, 2032910, 2069546, 2099070, 2121599, 2136885, 2144470, 2143747, 2133818, 2114714, 2089135, 2061444, 2034053, 2005887, 1975044, 1941828, 1908536, 1877577, 1850504, 1827636, 1807767, 1789411, 1772917, 1760018, 1750794, 1742966, 1735098, 1728449, 1724336, 1721633, 1718767, 1716575, 1717025, 1720285, 1725023, 1730664, 1737344, 1744431, 1751056, 1757616, 1765127, 1773602, 1782600, 1792701, 1804855, 1818802, 1833660, 1849520, 1867018, 1885928, 1905718, 1926979, 1950999, 1978441, 2009630, 2045241, 2085270, 2128137, 2172421, 2218837, 2269103, 2323661, 2381956, 2444069, 2510388, 2580377, 2653337, 2729715, 2810224, 2894490, 2982164, 3074326, 3171880, 3273267, 3375630, 3477660, 3579627, 3681286]
57134C681286J00272R8107R5373R1728Q7890Q5228Q3301Q0474P7389P6568P7950
57123D635566P8453P6903P5645P6002P6019P4410P2940P2932P3030P2434P2745
57112E457079P4454P5220P3841P2385P2144P1318O9063O7952O9493P1038P0146
57101F244133O8414O7921O7634O6592O6937P0184P3785P5001P4782P4436P2005
57090G021824O5670N7360M9118L9322K6301J2269k05j2210k5063l6587m4986n2699
57078G100114o2031p0772p6574q1700q8765r5786j00313j04169j08905j11150
57068F199949j08358j04905j06303j11628j17777j26693j41501j59934j78791
57059E044059k00719k29363k62179k95582l32487l76906m26187m77008n33626
$$ y = [3681286, 3781558, 3879665, 3975038, 4066766, 4154656, 4239884, 4323185, 4403659, 4481048, 4557616, 4635566, 4714019, 4790922, 4866567, 4942569, 5018588, 5092998, 5165938, 5238870, 5311900, 5384334, 5457079, 5531533, 5606753, 5680594, 5752979, 5825123, 5896441, 5965504, 6033456, 6102949, 6173987, 6244133, 6312547, 6380468, 6448102, 6514694, 6581631, 6651815, 6725600, 6800601, 6875383, 6949819, 7021824, 7087494, 7144854, 7193972, 7233294, 7259595, 7271864, 7271659, 7259449, 7234386, 7197799, 7152813, 7100114, 7038083, 6967311, 6890737, 6809037, 6720272, 6624486, 6524173, 6420004, 6311099, 6199949, 6091591, 5986686, 5880383, 5768755, 5650978, 5524285, 5382784, 5222850, 5044059, 4843340, 4613977, 4351798, 4056216, 3723729, 3346823, 2920636, 2443628, 1910002]
57050A910002o01083F32981a20310q36638r29969j027168j121024j215541j315960
57041f566610j414182j498656j570453j633887j681906j710912j739971j792930
57033a9609507j872246j973690k108247k275122k434841k555386k650606k685697
57025c8165342k474366j851655j064091q54804j909457m108495o399854p499484
57017f4327548o764030m485806j522633J269294L377912M674667N275655N367248
57009e7135241N101978M598525L984155L397271K945988K677114K578937K598460
57001b9252813K663375K712327K716629K672971K582683K447695K279126K094345
56993i083662J905069J717292J539765J381451J241836a84744H08839Q84427P85091
$$ y = [1910002, 1308919, 632981, -120310, -956948, -1886917, -2914085, -4035109, -5250650, -6566610, -7980792, -9479448, -11049901, -12683788, -14365694, -16076606, -17816577, -19609507, -21481753, -23455443, -25563690, -27838812, -30273653, -32829039, -35479645, -38165342, -40639708, -42491363, -43555454, -44410258, -46319715, -50428210, -56828064, -64327548, -71091578, -75577384, -77100017, -75830723, -72452811, -67778144, -62502489, -57135241, -52033263, -47434738, -43450583, -40053312, -37107324, -34430210, -31851273, -29252813, -26589438, -23877111, -21160482, -18487511, -15904828, -13457133, -11178007, -9083662, -7178593, -5461301, -3921536, -2540085, -1298249, -184744, 808839, 1693266, 2478357]
56984B478357O91876O06376N34122M75250M24235L78287L38313L02345K66040
56975F495201K29836J98291J72254J48654J27769J13120J03744R3949Q1831P1143
56965G835792O3654N6419M8247M2072L8529L2959K1524N462j2876l3283n4693
56954H043806p3484q7715r9652j12043j25148j38868j54045j69730j82712j91627
56944F708782j98333k03542k04531j99127j88574j74235j54796j29412j00689
56935E155543p1162l9045j800L5702N9186N3259J3024n0836j18089j71578k05536
56924D658668k23399k30386k30143k25858k19923k11968k00269j85579j70862
56915B760281j57247j43362j29144j16993j08148j00932r3710q6806q0350p2987
$$ y = [2478357, 3170233, 3776609, 4310731, 4785981, 5210216, 5588503, 5926816, 6229161, 6495201, 6725037, 6923328, 7095582, 7244236, 7372005, 7485125, 7588869, 7682818, 7764649, 7835792, 7899446, 7955865, 8004112, 8046184, 8084713, 8117672, 8139196, 8144658, 8131782, 8098499, 8043806, 7970322, 7882607, 7782955, 7670912, 7545764, 7406896, 7252851, 7083121, 6900409, 6708782, 6510449, 6306907, 6102376, 5903249, 5714675, 5540440, 5385644, 5256232, 5155543, 5084381, 5045336, 5043536, 5079238, 5138424, 5191683, 5204707, 5153871, 5035782, 4864204, 4658668, 4435269, 4204883, 3974740, 3748882, 3528959, 3316991, 3116722, 2931143, 2760281, 2603034, 2459672, 2330528, 2213535, 2105387, 2004455, 1910745, 1823939, 1743589, 1670602]
56905A670602o4296n6000m9281m3026l6129k9309k3248j7092j0422m985k876m476
56893A329462r267j6878k5979l3779l8154l9269l8378l6369l4006l1779k8872
56882I96732k4121j8561j4821j3272j1232p040k296J275M471Q320J1670J3252
56870I44377J3997J4791J3685P955k084j3424k3495l1113l5609l7204l7477l7554
56858G76845l6688l4077l1014k9254k8381k6693k3913k1148j8912j7117j6280
56847D93368j6789j7472j6766j4919j3377j2497j1594j0756j0699j1013j0456
56836C47030r023q176q788j0125j1046j1230j1082j1259j2162j3411j4057j3868
56824B12803j3532j3209j2036j0095r416j1455j4507j5369j2910q594m074N6L618
$$ y = [1670602, 1606306, 1550306, 1501025, 1457999, 1421870, 1392561, 1369313, 1352221, 1341799, 1336814, 1333938, 1329462, 1320195, 1303317, 1277338, 1243559, 1205405, 1166136, 1127758, 1091389, 1057383, 1025604, 996732, 972611, 954050, 939229, 925957, 914725, 907685, 905389, 906664, 911135, 919455, 931125, 944377, 958374, 973165, 986850, 994805, 992721, 979297, 955802, 924689, 889080, 851876, 814399, 776845, 740157, 706080, 675066, 645812, 617431, 590738, 566825, 545677, 526765, 509648, 493368, 476579, 459107, 442341, 427422, 414045, 401548, 389954, 379198, 368499, 357486, 347030, 338007, 329831, 321043, 310918, 299872, 288642, 277560, 266301, 254139, 240728, 226671, 212803, 199271, 186062, 174026, 163931, 154515, 143060, 128553, 113184, 100274, 91680, 87606, 87662, 91280]
56811I1280O664R655J2618J4642J5484J6852K0495K5677L0190L3354L6319L9853
56799C53083M3488M6240M6402M1411L0243J5802K743o948j4378k0152k3091k2716
56787D92127k0480j7567j3543q104k376K542O918J1545J6779K3083L1100M0585
56775E62609N0381N9775O8288P3741P2408O2229M4813K3757K383j6397l0084l8078
56763I35825m2152m4306m4863m3292l9719l4727k8780k2691j7477j2856p092N53
56751E98423Q502J5190K1416K8633L5751L9572L8094L1850K2168R930l591j6101
56739H29837k5473l1187l4226l5842l6596l6245l4435l1488k8417k5986k4035
56728D85907k1781j8525j4000q444k595K761P313J0992J3302J3522J1631Q363
$$ y = [91280, 97944, 107599, 120217, 134859, 150343, 167195, 187690, 213367, 243557, 276911, 313230, 353083, 396571, 442811, 489213, 530624, 560867, 576669, 579412, 572464, 558086, 537934, 514843, 492127, 471647, 454080, 440537, 432433, 430057, 432599, 439517, 451062, 467841, 490924, 522024, 562609, 612990, 672765, 741053, 814794, 887202, 949431, 994244, 1018001, 1020384, 1003987, 973903, 935825, 893673, 849367, 804504, 761212, 721493, 686766, 657986, 635295, 617818, 604962, 597870, 598423, 606925, 622115, 643531, 672164, 707915, 747487, 785581, 817431, 839599, 849529, 845938, 829837, 804364, 773177, 738951, 703109, 666513, 630268, 595833, 564345, 535928, 509942, 485907, 464126, 445601, 431601, 423157, 420562, 423323, 430636, 441628, 454930, 468452, 480083, 488446]
56716D88446M253o35n925j0857j5129j8907k1670k2299k0871j9153j8514j8363
56704C20376j7619j6641j6312j6074j4426j1169p745n411m282m060m376m278k778
56691A95205n06L91j137l390l909k516j172j088j376r73n05j099k151j830K09
56676A74153K023J779j85k263l625m405m736m586m203l835l390l042l446m476
56662A35763m604k770k28Q97L14p15j680k955l874k986n73J152J037L90O75J516
56646A21359J940J958J865J309K41l87J47J186J715J503P14n60j731j892j246
56631A28121j060j572j505m27K12l27l61J643M288N147M296L842M629N569N938
56616A58433O282O941P277O663N246L655K635K616K948K202J13j605j497n25o31
$$ y = [488446, 492699, 492064, 486139, 475282, 460153, 441246, 419576, 397277, 376406, 357253, 338739, 320376, 302757, 286116, 269804, 253730, 239304, 228135, 220390, 214979, 210697, 206637, 202261, 197983, 195205, 194699, 195090, 193953, 190563, 186654, 184138, 182966, 181878, 180502, 179529, 179024, 177925, 175774, 173944, 174153, 176176, 177955, 177770, 175507, 171882, 167477, 162741, 158155, 153952, 150117, 146727, 143685, 140239, 135763, 131159, 128389, 128161, 129058, 129372, 128657, 126977, 124022, 120148, 117162, 116589, 117741, 118778, 119168, 119843, 121359, 123299, 125257, 127122, 128431, 128672, 128285, 128432, 129618, 131333, 132836, 133550, 132990, 131259, 129367, 128121, 127061, 125489, 123984, 123557, 123769, 123442, 123081, 124724, 129012, 134159, 138455, 142297, 146926, 152495, 158433, 164715, 171656, 178933, 185596, 190842, 194497, 197132, 199748, 202696, 204898, 205011, 203406, 201909, 201384, 200753]
56601B00753j911k745k234r44M50J690K393K389K515L731N573O616O263M922K733
56586B32194m95m182p106q653r142r106r163j0013j1484j2063j0699q494p325
56573A24269p272o920n755m540l576k341r88n45j346k506l198l362l140k702k514
56558G3564k721k542j378j26l3o43m21R06K238L055L691L835K704Q26j29L70J248
56541H4444J744K155K465K120J545J966L115K985Q47j162p35J531K995K260M88
56526A08763k74O09J805J714N67K10J510L173L915M340N121M905K322q78j563
56511A36239L64K086K257K213K768K962K776L858O284P535O347M919N488P077
56497A93173P764P981R145J0569J0342Q393O513N818N922O184O281N902M949L769
$$ y = [200753, 198842, 196097, 193863, 192919, 193369, 195059, 197452, 199841, 202356, 206087, 211660, 218276, 224539, 229461, 232194, 231699, 227517, 220411, 211758, 202616, 193510, 184347, 174334, 162850, 150787, 140088, 131594, 124269, 116997, 110077, 104322, 99782, 96206, 93865, 92877, 92332, 90986, 88480, 85282, 81920, 78780, 76078, 73564, 70843, 68301, 66923, 66797, 66764, 66121, 65700, 66606, 68844, 71899, 75590, 79425, 82129, 82955, 82826, 83196, 84444, 86188, 88343, 90808, 92928, 94473, 96439, 99554, 102539, 103386, 102224, 101489, 103020, 106015, 108275, 108763, 108489, 109098, 110903, 112617, 113184, 113394, 114904, 118077, 121992, 126332, 131453, 136358, 138680, 137802, 136239, 136603, 138689, 140946, 143159, 145927, 148889, 151665, 155523, 161807, 169342, 175689, 180608, 186096, 193173, 200937, 208918, 218063, 228632, 238974, 247367, 253880, 259698, 265620, 271804, 278085, 283987, 288936, 292705]
56483B92705K533J050k49l35P34J302K45j599k894l503l785l521k687k144k472
56468B75380l098l589m475n869o616n967m853m288l854k985k393k754l225k785
56454B18629k003j954k381k381k042k011k264k508k821k829j533Q36K228J449
56440A98415L6k52j77j221k518k140m83L55K9J30J068J387N38j4P88J893J805
56423A99639O31k84QJ461L242M290M124L272K577K315K369K848L868M999N661
56408B41020N764N599N484N786O637P418P431P332Q591J1032J2423J1372R089
56395C44978P297O041M770L949L891L399J529m65q54j14J6o71r30l72K30M63N00
56378C73657J67o66j351j445j720k797l726l538l221m202n765o052m881l590k708
$$ y = [292705, 295238, 296288, 296039, 295704, 296438, 297740, 297985, 296386, 293492, 289989, 286204, 282683, 279996, 277852, 275380, 272282, 268693, 264218, 258349, 251733, 245766, 240913, 236625, 232771, 229786, 227393, 224639, 221414, 218629, 216626, 214672, 212291, 209910, 207868, 205857, 203593, 201085, 198264, 195435, 193902, 194738, 196966, 198415, 198451, 198199, 198022, 196801, 194283, 192143, 191660, 192015, 192044, 192174, 193242, 194629, 195167, 195153, 195941, 197834, 199639, 200270, 199986, 199994, 201455, 204697, 208987, 213111, 216383, 218960, 221275, 223644, 226492, 230360, 235359, 241020, 246784, 252383, 257867, 263653, 270290, 277708, 285139, 292471, 301062, 312094, 324517, 335889, 344978, 352275, 358316, 363086, 367035, 370926, 374325, 375854, 375389, 374535, 374421, 374437, 373766, 372836, 372464, 372694, 373157, 373657, 373824, 373158, 371807, 370362, 368642, 365845, 362119, 358581, 355360, 351158, 345393, 339341, 334460, 330870, 328162]
56363C28162j995k203m383p589r418q892p045m941k984j929k479l849m566m539
56349B61350m626m524l184j124p2k39j32P24J060L04l64j00K31l57j402j747r14
56332B44884P18K232K632J800R14R96J482J207K61l32j49P07K300L985L926J464
56316B69027j039j016N96R72L6L57K696M860N463N818P143Q431Q308O998N395
56301C24045L881K863K873L492L641L276L272L455K698J287J097K895N228O550
56287C70553O681N781L903K023J626K499K906K390K478L794M620L523J618R87
56273D15382K180M233N977O577O029N641O763Q574Q812P160O110P548J0148J1393
56259E12527J0842J0240J1105J3264J5293J5838J4894J3844J3720J3858J3143
$$ y = [328162, 326167, 323964, 319581, 311992, 302574, 293682, 286637, 281696, 278712, 276783, 274304, 270455, 265889, 261350, 256724, 252200, 249016, 247892, 247820, 247581, 247449, 248173, 249233, 249537, 249173, 249073, 249304, 248947, 247545, 245798, 244884, 245602, 247834, 250466, 252266, 253180, 254176, 255658, 256865, 257126, 256794, 256645, 257352, 259652, 263637, 267563, 269027, 267988, 266972, 267568, 268540, 268576, 268933, 271629, 276489, 281952, 287770, 294913, 303344, 311652, 318650, 324045, 327926, 330789, 333662, 337154, 340795, 344071, 347343, 350798, 353496, 354783, 355880, 358775, 364003, 370553, 377234, 383015, 386918, 388941, 390567, 393066, 395972, 398362, 400840, 404634, 409254, 412777, 414395, 415382, 417562, 421795, 427772, 434349, 440378, 446019, 452782, 461356, 470168, 477328, 483438, 490986, 501134, 512527, 523369, 533609, 544714, 557978, 573271, 589109, 604003, 617847, 631567, 645425, 658568]
56248F58568J2033J1881J2568J2464J0637P699M726K729K715M527O044N430L782
56235G55803L591N089O470P260Q794J1296J3172J3585J3329J2944J2331J2491
56223H76155J5028J9537K3725K6547K8909L1193L2724L3990L6578M0382M3605
56212A208373M6006M9333N3919N7954O0976O5045P1242P7944Q3889R0232R8050
56201A962963J06403J14452J23181J33493J44687J56094J68097J80383J91264
56192C281017J99916K07188K13312K17032K17830K16435K12220K02826J87673
56183E155449J69126J48917J26046R9634P1333M3268J6042r846l2974n2765o9989
56172E664241q4418r4541j00636j05359j10086j13793j16539j20665j26786j32133
$$ y = [658568, 670601, 682482, 695050, 707514, 718151, 725850, 730576, 733305, 736020, 740547, 746591, 752021, 755803, 759394, 764483, 770953, 778213, 787007, 798303, 811475, 825060, 838389, 851333, 863664, 876155, 891183, 910720, 934445, 960992, 989901, 1021094, 1053818, 1087808, 1124386, 1164768, 1208373, 1254379, 1303712, 1357631, 1415585, 1476561, 1541606, 1612848, 1690792, 1774681, 1864913, 1962963, 2069366, 2183818, 2306999, 2440492, 2585179, 2741273, 2909370, 3089753, 3281017, 3480933, 3688121, 3901433, 4118465, 4336295, 4552730, 4764950, 4967776, 5155449, 5324575, 5473492, 5599538, 5699172, 5770505, 5813773, 5829815, 5819969, 5786995, 5734230, 5664241, 5579823, 5485282, 5384646, 5279287, 5169201, 5055408, 4938869, 4818204, 4691418, 4559285]
56162D559285j34969j37295j40890j43969j44555j44083j44712j45606j44917
56153C278289j43226j42029j40687j37584j32732j26925j20045j12230j04863
56144B117968r8505r1883q4614p8467p4008o8806o1245n3435m7876m3860l9860
56133A375409l6643l5018l3017k8709k3808k1108k0117j8350j5526j3328j2227
56122A117558j1307j0303r346p732m982k053K03K342M653O070O290O944Q955J1040
56108A118332J2356J4127J6835J8648J8590J8442J9385J9750J8382J7024J6893
56097A308764J6143J3552J1451J1904J3189J3272J3676J6370J9890K2142K4277
56086A484630K8071L2277L5263L8638M4431N1208N6749O2154O9638P8805Q8689
$$ y = [4559285, 4424316, 4287021, 4146131, 4002162, 3857607, 3713524, 3568812, 3423206, 3278289, 3135063, 2993034, 2852347, 2714763, 2582031, 2455106, 2335061, 2222831, 2117968, 2019463, 1927580, 1842966, 1764499, 1690491, 1621685, 1560440, 1507005, 1459129, 1415269, 1375409, 1338766, 1303748, 1270731, 1242022, 1218214, 1197106, 1176989, 1158639, 1143113, 1129785, 1117558, 1106251, 1095948, 1086602, 1078870, 1073888, 1071835, 1072038, 1074380, 1079033, 1085103, 1091393, 1098337, 1107292, 1118332, 1130688, 1144815, 1161650, 1180298, 1198888, 1217330, 1236715, 1256465, 1274847, 1291871, 1308764, 1324907, 1338459, 1349910, 1361814, 1375003, 1388275, 1401951, 1418321, 1438211, 1460353, 1484630, 1512701, 1544978, 1580241, 1618879, 1663310, 1714518, 1771267, 1833421, 1903059, 1981864, 2070553]
56075B070553J00597J15106J29080J39794J49095J59197J67110J68155J62526
56066C361213J53839J43544J31612J20390J12496J06294R7951Q6429P2369N4501
56056D440638L2049Q833j0020k4105l6326m7499n7153o7610q2088r9812j17307
56045C939600j33045j46502j54834j55442j50363j43553j35549j25061j13580
56036B681671j03536r4015q3229p3095o6295o1039n4038m6470m1559l8400l3852
56025A986143k8646k5739k4538k2440k0249k0114k0068j6801j2031r812r174n895
56013A770636j62M137O478R483J2762J3601J2954J4374J7641J9640K0617K3379
56001A925540K7192K8732K8318K9063L0854L1094L0333L1236L3307L4474L6053
$$ y = [2070553, 2171150, 2286256, 2415336, 2555130, 2704225, 2863422, 3030532, 3198687, 3361213, 3515052, 3658596, 3790208, 3910598, 4023094, 4129388, 4227339, 4313768, 4386137, 4440638, 4472687, 4481520, 4471500, 4447395, 4411069, 4363570, 4306417, 4238807, 4156719, 4056907, 3939600, 3806555, 3660053, 3505219, 3349777, 3199414, 3055861, 2920312, 2795251, 2681671, 2578135, 2484120, 2400891, 2327796, 2261501, 2200462, 2146424, 2099954, 2058395, 2019995, 1986143, 1957497, 1931758, 1907220, 1884780, 1864531, 1844417, 1824349, 1807548, 1795517, 1785705, 1776531, 1770636, 1770474, 1774611, 1781089, 1790572, 1803334, 1816935, 1829889, 1844263, 1861904, 1881544, 1902161, 1925540, 1952732, 1981464, 2009782, 2038845, 2069699, 2100793, 2131126, 2162362, 2195669, 2230143, 2266196]
55990B266196L9920M3089M1933L9484M1329M6301M8873M8846N0617N4448N6549
55979B777585N6770N8427O1601O4084O7373P4043Q1112Q3924Q4645Q8751R5357
55968C593672R9762J03086J10093J19642J26902J32986J42578J53997J61664J66495
55958D910877J73759J82693J88732J93766K03314K15590K24471K30906K40062
55949F764170K49987K55311K59371K69864K85127K97956L09961L28179L50543
55940I370469L69722L88423M15034M46885M74488M99816N32789N72009O07464
55931A3677099O40461O81424P29512P74503Q17772Q70444R31459R89195J044275
55922B1156144J108434J181430J252522J324122J409170J505891J601710J701490
$$ y = [2266196, 2306116, 2349205, 2391138, 2430622, 2471951, 2518252, 2567125, 2615971, 2666588, 2721036, 2777585, 2834355, 2892782, 2954383, 3018467, 3085840, 3159883, 3240995, 3324919, 3409564, 3498315, 3593672, 3693434, 3796520, 3906613, 4026255, 4153157, 4286143, 4428721, 4582718, 4744382, 4910877, 5084636, 5267329, 5456061, 5649827, 5853141, 6068731, 6293202, 6524108, 6764170, 7014157, 7269468, 7528839, 7798703, 8083830, 8381786, 8691747, 9019926, 9370469, 9740191, 10128614, 10543648, 10990533, 11465021, 11964837, 12497626, 13069635, 13677099, 14317560, 14998984, 15728496, 16502999, 17320771, 18191215, 19122674, 20111869, 21156144, 22264578, 23446008, 24698530, 26022652, 27431822, 28937713, 30539423, 32240913]
55914C2240913J823412J967278K116964K273555K453217K652893K854833L066416
55906E1449481L316612L611767L937840M309442M769830N337214O000419O771841
55898H9504446P688798Q757426R959619J1324763J2927193J4810783J7002963
55891A71975991J9605041K2753530K6476734L0707555L5358693L9980353M3095980
55884C89953877M2265757L5537222K3201337P992046o599225j8229431k6234678
55877D47886905l0953694l3019443l3142301l2044867l0297076k8230319k6030504
55870B34168701k3824988k1665576j9537301j7445464j5451428j3610088j1931954
55863A10701902j0424678r115712q010917p075730o276612n603254n037168m538858
$$ y = [32240913, 34064325, 36031603, 38148567, 40422122, 42875339, 45528232, 48383065, 51449481, 54766093, 58377860, 62315700, 66625142, 71394972, 76732186, 82732605, 89504446, 97193244, 105950670, 115910289, 127235052, 140162245, 154973028, 171975991, 191581032, 214334562, 240811296, 271518851, 306877544, 346857897, 389953877, 432219634, 467756856, 490958193, 498950239, 492351014, 474121583, 447886905, 416933211, 383913768, 350771467, 318726600, 288429524, 260199205, 234168701, 210343713, 188678137, 169140836, 151695372, 136243944, 122633856, 110701902, 100277224, 91161512, 83150595, 76074865, 69798253, 64194999, 59157831, 54618973]
55855E4618973m083567l677430l325192l012666k731790k491468k290610k108057
55847C0898193j931180j769170j628021j497367j372167j263137j174753j094769
55839A9167629j015426r44307q85000q27415p66528p11575o67594o26032n82114
55830A2141638n43721n14664m86457m54945m28578m11776l96222l76800l60566
55821H167909l51460l41282l24602l08336k97839k87011k70850k54966k44040
55812E487523k32930k17730k04127j96481j89335j77753j65818j57517j49129
55803C796703j37930j28592j23833j18111j07614r7312r1408q5766p6565o7581
55793B761991o2207n6614m7687l9742l6869l6195l4929l6471m3274n0737n4237
$$ y = [54618973, 50535406, 46857976, 43532784, 40520118, 37788328, 35296860, 33006250, 30898193, 28967013, 27197843, 25569822, 24072455, 22700288, 21437151, 20262398, 19167629, 18152203, 17207896, 16322896, 15495481, 14728953, 14017378, 13349784, 12723752, 12141638, 11597917, 11083253, 10596796, 10141851, 9713273, 9301497, 8905275, 8528475, 8167909, 7816449, 7475167, 7150565, 6842229, 6544390, 6257379, 5986529, 5731563, 5487523, 5254593, 5036863, 4832736, 4636255, 4446920, 4269167, 4103349, 3945832, 3796703, 3658773, 3530181, 3406348, 3288237, 3180623, 3083311, 2991903, 2906137, 2829572, 2761991, 2699784, 2643170, 2595483, 2555741, 2518872, 2482677, 2447748, 2411277, 2368003, 2317266, 2263029]
55782B263029n5527n6741n5222m9734m4930m3863m2741l8323l3942l2879l2358
55771A776769k9591k7495k8927l1111l0897l0036l0525l0434k8702k8352l0646
55760A450053l1913l0184k8891k9965k9831k6527k4115k5254k5889k2408j7943
55749A157133j6410j6139j4509j3208j3679j2871q656m344k966k287j14R48j095
55736A051803l067k429k284n398q657q872q844j2038j6167j7701j8114j9930k1068
55723I07234j9006j6361j6404j6843j3946r370p096o618m840k114j121k139m007
55710G87369p262j1997j5279j5012j3576j3854j4648j3861j2693j2504j1163p034
55698F38486l294l639o677q995j0702j3447j5900j5957j4890j4964j5370j4455
$$ y = [2263029, 2207502, 2150761, 2095539, 2045805, 2000875, 1957012, 1914271, 1875948, 1842006, 1809127, 1776769, 1747178, 1719683, 1690756, 1659645, 1628748, 1598712, 1568187, 1537753, 1509051, 1480699, 1450053, 1418140, 1387956, 1359065, 1329100, 1299269, 1272742, 1248627, 1223373, 1197484, 1175076, 1157133, 1140723, 1124584, 1110075, 1096867, 1083188, 1070317, 1061661, 1057317, 1054351, 1052064, 1051950, 1052898, 1051803, 1048736, 1046307, 1044023, 1038625, 1029968, 1021096, 1012252, 1000214, 984047, 966346, 948232, 928302, 907234, 888228, 871867, 855463, 838620, 824674, 815304, 808208, 801590, 796750, 794636, 793515, 791376, 787369, 780107, 768110, 752831, 737819, 724243, 710389, 695741, 681880, 669187, 656683, 645520, 638486, 635192, 631553, 624876, 615881, 605179, 591732, 575832, 559875, 544985, 530021, 514651, 500196]
55686E00196j3319j3234j2381r173n983n531o446o369o237p425p860n472k520
55673C98246j967k440j256N26O26J58J001J376r81l886m038k833l827o416p161
55658C67128n634m143l227j980j218j950k462j072J33j401l820l787j984j041
55644C33542k44K504N443N180K726J983L229L351J708P23J084J115N86Q17J492
55629C65239J485J964M535P183O607L781K577L545L676J967N25K13l09j070n80
55614D01338O54L74j467k592k351k160k161j112N28J028P45J379K255J099j559
55599C95998k728j684m80K88K083M431M574K018k60l49K20k34j008j047r19j460
55583C99443k436l444m473n245n668o728r024j0941j0471q393p255p701q264q290
$$ y = [500196, 486877, 473643, 461262, 452089, 446106, 440575, 434129, 427760, 421523, 414098, 406238, 400766, 398246, 396279, 393839, 392583, 393109, 393735, 393893, 394894, 396270, 395289, 391403, 387365, 384532, 380705, 374289, 367128, 361494, 357351, 354124, 352144, 350926, 348976, 346514, 345442, 345575, 344174, 340354, 336567, 334583, 333542, 333298, 335802, 341245, 346425, 349151, 351134, 354363, 357714, 359422, 360145, 361229, 362344, 362930, 363747, 365239, 366724, 368688, 373223, 380406, 387013, 390794, 393371, 396916, 400592, 402559, 403084, 403297, 402988, 401918, 401338, 401992, 402366, 400899, 398307, 395956, 393796, 391635, 390523, 391051, 392079, 392824, 394203, 396458, 397557, 395998, 393270, 391586, 391106, 391394, 393477, 397908, 402482, 404500, 404240, 403891, 404111, 403877, 402869, 401822, 400903, 399443, 397007, 393563, 389090, 383845, 378177, 371449, 362425, 351484, 341013, 332620, 325365, 317664, 309400, 301110]
55569C01110q349q259p363o462o834p696p350o207n960o316n586m059l622m257
55555B12790m123l001k564l117l126k222j779k294k785k972l431l659k616j123
55541A73978j056k124k110m05J271J606Q40o55k367k789j175L16r05l710m705
55526A56010l289j927j633r31M64O39r57k237j791p89n62p03l59N32J825L113
55510A47405L112J044j624k915l234l999m409k559P85K899L275L687M289L325
55496A51081Q97o42o09q35k045k698k242k173l088l758l824m393n150m193j583
55481A14745R2k96p75K48J751K463K732K997K893K795L764N287N563M510L888
55466A52657M093L789L050L532M954M850K666P15J94k76j225j195k89q70l189
$$ y = [301110, 292761, 284502, 277139, 270677, 263843, 256147, 248797, 242590, 236630, 230314, 224728, 220669, 217047, 212790, 208667, 205666, 203102, 199985, 196859, 194637, 192858, 190564, 187779, 184807, 181376, 177717, 175101, 173978, 172922, 170798, 168688, 168283, 169554, 171160, 172000, 171345, 168978, 166189, 165014, 165330, 164425, 160715, 156010, 152721, 150794, 149161, 148230, 148694, 149333, 148376, 146139, 144348, 143559, 142997, 142294, 141935, 142467, 144292, 147405, 150517, 151561, 149937, 147022, 143788, 139789, 135380, 132821, 133606, 136505, 139780, 143467, 147756, 151081, 151978, 151336, 150727, 149892, 147847, 145149, 142907, 140734, 137646, 133888, 130064, 125671, 120521, 116328, 114745, 114837, 114541, 113766, 114014, 115765, 118228, 120960, 123957, 126850, 129645, 133409, 138696, 144259, 148769, 152657, 156750, 160539, 163589, 167121, 172075, 176925, 179591, 180306, 180500, 180224, 178999, 177804, 177515, 176645, 173456]
55451A73456m106k188m38j544l804m403l595l059k843k639l519n670o780n386
55437A23482l602l835m969m600l144k770l631m064l521k832k283j556q99p66r10
55422H0100j094j557j888r45R18J421m69k688k966j845j214j465j836k046j993
55407F0433j125M89J689J860J572Q84r07k961k923n35J403J274J018K386L664
55392F8221K642K88j312k317l578l912k164j34j92j481j702j155j549k129p67
55377D8759J786K529Q90o66p35l86k33O76K348L065K039N80j77o07j009p40K75
55360E8394R42Q11Q63J682K278J612j5j652k745k861j570O83K497K899K187J091
55344F7096O4l91K54J535J952P24j064j801j393j065j432j786j507j191j620k186
$$ y = [173456, 169350, 167162, 166724, 165180, 161376, 156973, 153378, 150319, 147476, 144837, 141318, 135648, 128868, 123482, 119880, 116045, 111076, 106476, 103332, 100562, 96931, 92867, 89346, 86514, 84231, 82675, 81776, 81010, 80100, 79006, 77449, 75561, 74616, 75534, 76955, 76486, 73798, 70832, 68987, 67773, 66308, 64472, 62426, 60433, 59308, 59797, 61486, 63346, 64918, 65802, 64895, 61934, 59011, 58476, 59879, 61153, 62171, 64557, 68221, 70863, 71151, 69839, 67522, 63944, 60032, 57868, 57734, 57542, 56061, 54359, 53204, 51655, 49526, 48759, 50545, 53074, 53964, 53298, 52563, 52177, 51944, 52620, 54968, 58033, 60072, 60652, 60475, 59868, 58859, 58119, 58394, 59336, 60147, 61010, 62692, 64970, 66582, 66567, 64915, 62170, 59309, 57739, 58422, 60919, 63818, 66005, 67096, 67160, 66769, 67023, 68558, 70510, 71234, 70170, 68369, 66976, 65911, 64479, 62693, 61186, 59995, 58375, 56189]
55328E6189j632k74o1j741l311k605m45N15m81j673j715j207r04l44R36K214K478
55311D5939J476n47k938m241l164m66J556J923J772J893J439j17j574j807j297
55296C9847o89N25K511L694K590mk063k708k367j570p64m73m85J27J354J748O06
55279D1879p62j054q68j193j462p80P2j84j004p61O99J904J941J349R57R28Q58
55262D2519K13j009j701o82J307J923L16j483j315L59J740K270K441K168J117
55247E0183j25p80j111j708k298k442k503k734k412j174j29k44o59j97O21O95
55231C2983M29P70J019k40k456l388k019L41J941K220J661J068Q83O38m56j879
55215C3515j912k24J165P59j11L86J487J314K50K31J251J296k50j659j715j417
$$ y = [56189, 54557, 54283, 54222, 52481, 49170, 46565, 46120, 46635, 46154, 44481, 42766, 41559, 40655, 40311, 41247, 43461, 45939, 47415, 46868, 43930, 39689, 36525, 36059, 37615, 39538, 41310, 43203, 44642, 44525, 42951, 41144, 39847, 39158, 39683, 42194, 45888, 48478, 48474, 46411, 43703, 41336, 39766, 39002, 38529, 38044, 38171, 39525, 41273, 41879, 41117, 40063, 39195, 38002, 36540, 35760, 35832, 35648, 34644, 33883, 34582, 36486, 38427, 39776, 40733, 41661, 42519, 42732, 41723, 40022, 39340, 40647, 42570, 42886, 41403, 40088, 40447, 42187, 44457, 46898, 49066, 50183, 50058, 49278, 48167, 46459, 44161, 41719, 39216, 36482, 34070, 32896, 32767, 32523, 31864, 31667, 32288, 32983, 33412, 34182, 35201, 34961, 32505, 29117, 27098, 27439, 29380, 31600, 33261, 34329, 35212, 35850, 35394, 33515, 31603, 31379, 32544, 33303, 33192, 33578, 35065, 36379, 36629, 36860, 38111, 39407, 39157, 37498, 35783, 34366]
55199C4366k058l287l880l294j735K87K020K611J698j94j877k127p44Q78J138
55184B3802L71M45J838K729J877N62M03R24R16O05N54j26k104l565k148J360L681
55167C2124L222J552O89Q61J060M73q05j655r66O44J239N10N71K432L807K610
55151D8368O31O75J821J079j239j876k66K67k256n419n994l855r49J370K600K521
55135C7478J634J001P96K92m35k89R21J924J840J139M71m7j80K49M45m94j820
55118D4925j962j087p68j150p65M06L53j641l397k844p91O41P76L93K23N85J481
55101C5378K172J634M1j146j013o9R12J638J661O00p01p45M50J278R12J00o36
55084D2466j652k591k189m29R69J061P26N72m8r64m80J762L411K599O28l25l12
$$ y = [34366, 32308, 29021, 25141, 21847, 20112, 20399, 22419, 25030, 26728, 26534, 24657, 22530, 21786, 22664, 23802, 24173, 24618, 26456, 29185, 31062, 31624, 32027, 32951, 33867, 34472, 35026, 34900, 32796, 29231, 27083, 28443, 32124, 35346, 36898, 37587, 38448, 39508, 39981, 39176, 37521, 36555, 37199, 38438, 38948, 39519, 41951, 45758, 48368, 48999, 49674, 51495, 52574, 51335, 49459, 49193, 49460, 47204, 41785, 35791, 31936, 30987, 32357, 34957, 37478, 39112, 40113, 40909, 41201, 40766, 40477, 41398, 43322, 45162, 46301, 46772, 46725, 46545, 46794, 47239, 46745, 44925, 42963, 41876, 41108, 39958, 39193, 39599, 39952, 38311, 34914, 32070, 31279, 31920, 32696, 33089, 33312, 33897, 35378, 37550, 39184, 39225, 38079, 37066, 36997, 37909, 39547, 41208, 41808, 41107, 40362, 40812, 42090, 43002, 43102, 42466, 40814, 38223, 36034, 35605, 36574, 37635, 38361, 38933, 38885, 37921, 37441, 39203, 42614, 45213, 45841, 45516, 45204]
55067D5204m13j72J293K876K757J360O80J195J707J889K590L562L243J246q25
55052F8192j687j837j961j480K04K213L058K439J104m08j845k496j699j18O25
55037F4304O5m61J01Q30L99m39K37K310L309J892j98p16J24P31Q23J217J890K157
55019G8575K218K678K902J698o10k543l551l948l146l66K922L873K179P39J499
55004H5119K815K352M87q78j369k048l045l148j621P51K406K356R70k55j28R05
54988H5669J504J406J550K229K509J806P09l39j690l109l175j256J057J663M14
54973I0947j100j543p94M26J031K11j587k824k578j555q39m14L69J417J945J640
54957H4752J090J010J342J250J27j328j572j80J266J153N0k56N63J189R22M01
$$ y = [45204, 44791, 44619, 45912, 48788, 51545, 52905, 53585, 54780, 56487, 58376, 60966, 64528, 67771, 69017, 68192, 66505, 64668, 62707, 61227, 61431, 63644, 66702, 69141, 70245, 69837, 67992, 65496, 63797, 63679, 64304, 64369, 63908, 64009, 64839, 65238, 64799, 65036, 67346, 70655, 72547, 72349, 71633, 71757, 72488, 73311, 74528, 76418, 78575, 80793, 83471, 86373, 88071, 87461, 84918, 81367, 77419, 74273, 73907, 76829, 80702, 82881, 83620, 85119, 87934, 90286, 90773, 89895, 88526, 86478, 83433, 80285, 78664, 79415, 81821, 84177, 85147, 84892, 84764, 85669, 87173, 88579, 90129, 92358, 94867, 96673, 97382, 97043, 95353, 92244, 89069, 87813, 88870, 90533, 90947, 89847, 88304, 87510, 87936, 88967, 89178, 87591, 84767, 82189, 80634, 79795, 79381, 79750, 81167, 83112, 84752, 85842, 86852, 88194, 89444, 89571, 88243, 86671, 86491, 87757, 88910, 88960, 88704, 89267, 90456, 91378, 91779]
54941I1779J05k35n40l13N9m38j589j983j240n00l64j60K76J35m79k06J186K125
54923H7618J873J673K110J762O2q27Q09L073L079J179M6M42P46J95j2R81K500
54906A07309L744M668N094M430K875J710J922L202M501M970M411L489L398M699
54892A60422O520P531P465P265P888R470J1370J2660J2829J2304J2025J2429J3329
54879B93507J4592J5853J5635J2199N903n95n223q406j1388j4013j5376j5590
54867B87098j5598j5791j5798j5265j4065j2301j0548r289p887n250j999l56j054
54854A61897j972r92J210K619K721K366K028J923K827N009P148P961Q224R451
54840B12420J1362J2484J2786J3627J5220J5880J4094J0063N055K54l657o600
$$ y = [91779, 91884, 91649, 91109, 90796, 90855, 90417, 88828, 86845, 85605, 85105, 84741, 84581, 84857, 84992, 84513, 84307, 85493, 87618, 89491, 91164, 93274, 95036, 95098, 94271, 95080, 98153, 101232, 102411, 102457, 102899, 103645, 103840, 103828, 104809, 107309, 111053, 115721, 120815, 125245, 128120, 129830, 131752, 134954, 139455, 144425, 148836, 152325, 155723, 160422, 166942, 174473, 181938, 189203, 197091, 206561, 217931, 230591, 243420, 255724, 267749, 280178, 293507, 308099, 323952, 339587, 351786, 357689, 357094, 351871, 343465, 332077, 318064, 302688, 287098, 271500, 255709, 239911, 224646, 210581, 198280, 187732, 178443, 170556, 165306, 163307, 162951, 161897, 159925, 158933, 160143, 162762, 165483, 167849, 169877, 171800, 174627, 179636, 186784, 194745, 202969, 212420, 223782, 236266, 249052, 262679, 277899, 293779, 307873, 317936, 322991, 323245, 319588, 312988]
54828C12988q891j0538j1249j1488j2421j4032j4602j3215j1472j1204j1660j0887
54816A71329q920p473p049o599n780n323n147m129k197p17m40n91n01n70j082
54801A14811j387j004m58l06k13L10R07P11o39k569l954l920k613j004R5N76M75
54784I9818l05j299j458n75J25m34j739k634k836k598j849p16rm7K5P23J067K95
54766H5554n55l38J74j60m99N38K089K219J197R44J587J388J65j29J266K659K857
54749A00956K936L894M638L819K104J246K016M006O402Q019P665N555L643L728
54735A60627N720Q154R768J0327J0577J1602J3615J5560J6577J7278J8336J8607
54723C16748J6487J2781R866Q015N098M35l728n720o946r157j1392j1778j0809
$$ y = [312988, 304097, 293559, 282310, 270822, 258401, 244369, 229767, 216552, 205080, 193876, 182216, 171329, 162409, 154936, 147887, 141288, 135508, 130185, 125038, 120909, 118712, 117995, 117555, 116964, 116463, 115893, 114811, 113424, 112420, 111962, 111656, 111443, 111753, 112660, 113371, 112732, 110163, 106209, 102289, 99676, 98672, 98767, 99343, 99818, 99513, 98214, 96756, 96181, 96306, 95872, 94133, 91499, 88663, 86065, 84216, 83500, 83491, 83444, 83469, 84192, 85259, 85554, 84999, 84661, 84835, 84675, 84176, 84714, 86803, 89022, 90219, 91163, 92750, 94138, 94303, 94174, 95440, 98099, 100956, 103892, 107786, 112424, 116243, 118347, 119593, 121609, 125615, 132017, 140036, 147701, 153256, 156899, 160627, 166347, 174501, 184269, 194596, 205173, 216775, 230390, 245950, 262527, 279805, 298141, 316748, 333235, 346016, 355882, 363897, 368995, 369430, 365702, 359982, 353036, 343879, 332487, 320709, 309900]
54710C09900j0479j1018j0816r203p252n858m728l557k718k304j724o47M28J184
54696B41208K346M778Q094J0742J1691J1559J1813J3105J4863J6404J7758J9070
54684C83431J9983K0079J9470J8166J5426J0611M349j998p697j2580j6046j7483
54672D35711j7602j8034j9300k0253j9857j8514j7276j6521j5946j5242j4358
54661B42808j3412j2567j1745j0622r205p989o985n302k547j20K46j080j953j247
54647A58280o4O4r89k240k831k551j698p08L05J319J685N32j460k037l15J565
54631A48857J374J49L30J620J626K71K77K605M501L404M38j551j575m99R78K631
54615A65436L924M316L907L052K076J619K238L267L330K436K188L400M931N489
$$ y = [309900, 299421, 288403, 277587, 268384, 261132, 255274, 250546, 246989, 244271, 241967, 240243, 239596, 240024, 241208, 243554, 248332, 256426, 267168, 278859, 290418, 302231, 315336, 330199, 346603, 364361, 383431, 403414, 423493, 442963, 461129, 476555, 487166, 491515, 489517, 481820, 469240, 453194, 435711, 418109, 400075, 380775, 360522, 340665, 322151, 304875, 288354, 272408, 257166, 242808, 229396, 216829, 205084, 194462, 185257, 177268, 170283, 164981, 162434, 162314, 162560, 161480, 159527, 158280, 158216, 158280, 157291, 155051, 152220, 149669, 147971, 147263, 147568, 148887, 150572, 151104, 149644, 147607, 147292, 148857, 150231, 150380, 150710, 152330, 153956, 154227, 154504, 157109, 161610, 165014, 165452, 163901, 162326, 161827, 162805, 165436, 169360, 173676, 177583, 180635, 182711, 184330, 186568, 189835, 193165, 195601, 197789, 201189, 206120, 211609]
54601B11609N206M783M491M581N271N729M753K997K710M451O048N777M631M258
54587B77295M623N124O047P292P567O658O699R061J1810J2615J2653J4732J8572
54574D00748K0866J9731J6387J2400P901K968j430m734p576j0711j4177j7655
54562D24718k0476k1465k0036j7557j6095j5761j4669j1797q433o346n699n490
54550B60894n135m859n004n407n441m516k789j125j34L71O28K35j089k675l715
54535B20239m355n183n980o052n425m713m069l198k340k237l149m603o000o724
54521A56211o118m236k462k315l670m951n080m375l578k805j740l55P54P09o63
54506A15326k135k074n16O88L64l81nJ045J173J48p99r51o41n6R18J776J770J366
$$ y = [211609, 216815, 221598, 226089, 230670, 235941, 241670, 246423, 249420, 252130, 256581, 262629, 268406, 273037, 277295, 281918, 287042, 293089, 300381, 307948, 314606, 321305, 330366, 342176, 354791, 367444, 382176, 400748, 421614, 441345, 457732, 470132, 478033, 481001, 479571, 474837, 467261, 456550, 442373, 424718, 404242, 382777, 362741, 345184, 329089, 313328, 298659, 286862, 278429, 272083, 266384, 260894, 255759, 250900, 245896, 240489, 235048, 230532, 227743, 226618, 226484, 226855, 227483, 227718, 226629, 223954, 220239, 215884, 210701, 204721, 198669, 193244, 188531, 184462, 181264, 178924, 176687, 173538, 168935, 162935, 156211, 150093, 145857, 143395, 141080, 137410, 132459, 127379, 123004, 119426, 116621, 114881, 114526, 115280, 115989, 115326, 113191, 111117, 110601, 111289, 111653, 111272, 111267, 112312, 113485, 113633, 112834, 111883, 111242, 111186, 112104, 113880, 115650, 117016]
54488A17016J773K877L082J709J54R7J558L324M338M104K729J294J396L497O179
54473A55127P670P677P232P198P514P772P831P819P775P438O473M890L112J452
54459B46980k48k197m137n571o352o680o768o833p127p532p493o849o362o713
54445A66118p247o678m947l504l455m168m158k951j535j048j410j526q24o7k41
54430A22359j039j407j329j903l267l954l088j802j336q06J294M188N356M000
54416A17266K151J872K883L661L698L658L927L898K753N77j361j625q2J798K383
54401A47457J390l04j822k713k828k484k383k677k617j864j413k132k961k163
54387A20486LJ489J375Q78J004J000kj176j182l33k79j678l312l570k265o94j69
$$ y = [117016, 118789, 121666, 124748, 126457, 126611, 126708, 128266, 131590, 135928, 140032, 142761, 144055, 145451, 148948, 155127, 162797, 170474, 177706, 184904, 192418, 200190, 208021, 215840, 223615, 231053, 237526, 242416, 245528, 246980, 246732, 244535, 240398, 234827, 228475, 221795, 215027, 208194, 201067, 193535, 186042, 179193, 172831, 166118, 158871, 152193, 147246, 143742, 140287, 136119, 131961, 129010, 127475, 126427, 125017, 123491, 122667, 122600, 122359, 121320, 119913, 118584, 116681, 113414, 109460, 106372, 104570, 103234, 102428, 103722, 107910, 113266, 117266, 119417, 121289, 124172, 127833, 131531, 135189, 139116, 143014, 145767, 146344, 144983, 143358, 143276, 145074, 147457, 148847, 148543, 146721, 144008, 141180, 138696, 136313, 133636, 131019, 129155, 127742, 125610, 122649, 120486, 120489, 121978, 123353, 124231, 125235, 126235, 126233, 125057, 123875, 123542, 123263, 121585, 118273, 114703, 112438, 111744, 111575]
54370A11575n92o76M54K100K813K115Q68J21K50J133K280K791J993M95j50P96
54354A28366K416L337L224K579J718O07m47p03K05J714K843L181L122L062K809
54339A58033K256K255L870O515P947O781M297K899L317M286M568M088L207K027
54325B16346O79m63j190j610j857j993k132k256k115j768j735k125k250j854k055
54310A91622l775n804n982m219k685k816l679l833l278k747k262j573j101j364
54296A46504j824j351K95K155L237L469L438L554L649L365K795K377K125J554
54282A75342Q13J198L597O747Q287P428N537M035K935J887J273J440J653Q70p46
54267B22296j939j948j456j852l671n853o738n940m805m650n102m967m146l544
$$ y = [111575, 110983, 110307, 110761, 112861, 115674, 117789, 118657, 118778, 119028, 120161, 122441, 125232, 127225, 127720, 127570, 128366, 130782, 134119, 137343, 139922, 141640, 142247, 141800, 141097, 141302, 143016, 145859, 149040, 152162, 155224, 158033, 160289, 162544, 166414, 172929, 180876, 187657, 191954, 194853, 198170, 202456, 207024, 211112, 214319, 216346, 217025, 216562, 215372, 213762, 211905, 209912, 207780, 205524, 203409, 201641, 199906, 197781, 195531, 193677, 191622, 187847, 182043, 176061, 171842, 169157, 166341, 162662, 158829, 155551, 152804, 150542, 148969, 147868, 146504, 144680, 143329, 143624, 145779, 149016, 152485, 155923, 159477, 163126, 166491, 169286, 171663, 173788, 175342, 176155, 177353, 180950, 187697, 195984, 203412, 208949, 212984, 215919, 217806, 219079, 220519, 222172, 223042, 222296, 220357, 218409, 216953, 215101, 211430, 205577, 198839, 192899, 188094, 183444, 178342, 173375, 169229, 165685]
54253A65685l416l214l130m091n804o460n295m014m383n592n491l804k317k123
54239A06551k301j733q01m76o93n75R5O18N86M99P91Q73j43j963l077k470p62
54222I5019O74J223J138O74j31j058j762k220k627k837k411j231K54J347J476
54207H7528O00m61n88K86Q71J51j176j675r93J68J348K471K958K062J95j161j003
54190I1581L89K120L313L289K145R89N61J2j773l905m214k203M07K197L399M264
54174A02571M017K424Q06L47M90R7q29j464j384o10O27J456P14j329k626j768
54158A03539K01J321J148N60P3l37l51L57J227J405R56N69M11K38J97N89J127
54141A13230J314J238J176Q97K87J45J152K456K536J259r8q34j456k288k749k505
$$ y = [165685, 162269, 159055, 155925, 151834, 146030, 139570, 134275, 130261, 125878, 120286, 114795, 110991, 108674, 106551, 104250, 102517, 101716, 101240, 100547, 99972, 100067, 100685, 101271, 101770, 102561, 103434, 103291, 101328, 98251, 95781, 95019, 95693, 96916, 98054, 98728, 98597, 97539, 95777, 93557, 90930, 88093, 85682, 84451, 84705, 86052, 87528, 88128, 87667, 87079, 87365, 88236, 88387, 87211, 85536, 84543, 84711, 86059, 88530, 91488, 93550, 93745, 92584, 91581, 91970, 94090, 97403, 100692, 102837, 103826, 104387, 104399, 102626, 98721, 94507, 92304, 92711, 94908, 98307, 102571, 106588, 109012, 109818, 110165, 110655, 110752, 109923, 108459, 107075, 106465, 107092, 108548, 109262, 107933, 105307, 103539, 103740, 105061, 106209, 106769, 106842, 106505, 106154, 106511, 107738, 109143, 110099, 110668, 111079, 111317, 111514, 112103, 113230, 114544, 115782, 116958, 117855, 118142, 118287, 119439, 121895, 124431, 125690, 125592, 124758, 123302, 121014, 118265, 115760]
54125A15760k191k301k204j028R15K222J804q8k053k625j358Q02K293K125M41
54110A12514j781l328l377k055m17M47L62k8r1L51J158K031K517K260J424O30
54094A12617L93O80R70O50m39j694k132j340O0J122J591J851J946J285l42j910
54078A15308k042q25N7o51k201k988k663j990j146L38J792J490o81k340j768l90
54062I9300m62j518j389L9O48m21j627j825j913k787l529k886j238N8L45l0l07
54045H0458L32K036L519L159J081q53j418r88q0J339K668K669J461O71Q60O82
54029I7596m58j096k96N97M63N53K014L260K264K7r23l87j51o25n97P1K10k29
54011A02293RJ165K165K689L273L269J243k055l625k119K27P26l50q68J36J792
$$ y = [115760, 113569, 111268, 109064, 108036, 108951, 111173, 112977, 112889, 110836, 108211, 106853, 107655, 109948, 112073, 112514, 110733, 107405, 104028, 101973, 101556, 102003, 102365, 102337, 102246, 102597, 103755, 105786, 108303, 110563, 111987, 112617, 113010, 113690, 114660, 115310, 114871, 113177, 111045, 109705, 109765, 110887, 112478, 114329, 116275, 117560, 117218, 115308, 113266, 112441, 112498, 111847, 109646, 106658, 103995, 102005, 100859, 101197, 102989, 104479, 103798, 101458, 99690, 99300, 98838, 97320, 95931, 95970, 96618, 96197, 94570, 92745, 90832, 88045, 84516, 81630, 80392, 80450, 80795, 80765, 80458, 80790, 82826, 86345, 89504, 90585, 89732, 88314, 87326, 87246, 88585, 91253, 93922, 95383, 96054, 96914, 97596, 97138, 96042, 95746, 96343, 96806, 97359, 99373, 102633, 104897, 104924, 104001, 103614, 103463, 102838, 102241, 102312, 102522, 102293, 102302, 103467, 105632, 108321, 111594, 114863, 116106, 114051, 110426, 108307, 108534, 109260, 108910, 108042, 108178, 109970]
53995A09970K940L084K450J839K005K726L049K733K535K794K783K007J144R85
53981A43044J221J091O54O78J592L187M990O515P241O881N753M853N382P794J0988
53966B11864J2821J2042R556P307O261O024O063O434P309Q462R244Q851O937M364
53952C23539K796K851L309K780J478M01k99r61j221p15l90j453l317m350m414
53937C20034m915o291p312p164o488n915n182m231l643l411k711j556j159k074
53923B57982l248l705l752l775l246j946r56j160j902k093j727j169M5K276M281
53908B35905M188J878o85j467k6K484M263L952J656j072k670k870k437k013j689
53893B39397j345r34n37l14k48O7R27J814J883J192P60J213K200L265M403N331
$$ y = [109970, 112910, 115994, 118444, 120283, 122288, 125014, 128063, 130796, 133331, 136125, 138908, 140915, 142059, 143044, 144265, 145356, 146010, 146688, 148280, 151467, 156457, 162972, 170213, 177094, 182847, 187700, 193082, 200876, 211864, 224685, 236727, 246283, 253590, 259851, 265875, 271938, 278372, 285681, 294143, 303387, 312238, 319175, 323539, 326335, 329186, 332495, 335275, 336753, 337154, 336855, 335894, 334673, 333958, 333568, 332115, 328798, 324448, 320034, 315119, 308828, 301516, 294352, 287864, 281949, 276767, 272536, 268893, 265482, 262771, 261215, 260056, 257982, 254734, 251029, 247277, 243502, 240256, 238310, 237354, 236194, 234292, 232199, 230472, 229303, 229348, 231624, 235905, 240093, 241971, 241286, 239819, 239793, 242277, 246540, 250492, 252148, 251076, 248406, 245536, 243099, 241086, 239397, 238052, 237118, 236581, 236267, 236019, 236086, 237013, 238827, 240710, 241902, 242662, 243875, 246075, 249340, 253743, 259074]
53877B59074N278M199L432M223O068P225O658M973L650L613M391M528L169J124
53863C21605j33l94o78j281j093P00L165M655M601L764L244L710N048O397P004
53848C60314P158P632Q274Q195P433P162P798Q265P799P130P010O759N418L392
53834D59739J753N79p82k324l333l531l382l420l853m576n228n641o310p678q989
53819D03024q954p850p388q070q345p337o497p091p781o711m687m018n126o576
53805C06593p723q888r306p718n132m348n876o871n290l000l006n159o628n853
53791B21795m105l232l487l952m023l764l316k654j920j553j751j973j466m00
53777A84199J09n68j635j914j409j111j511k068k176j913j716j730j611p98Q86
$$ y = [259074, 264352, 268551, 271983, 276206, 282274, 289499, 296157, 301130, 304780, 308393, 312784, 317312, 320481, 321605, 321472, 321078, 320400, 319119, 318026, 318726, 321891, 326546, 331147, 334911, 338155, 341865, 346913, 353310, 360314, 367472, 375104, 383378, 391573, 399006, 406168, 413966, 422231, 430030, 437160, 444170, 450929, 456347, 459739, 461492, 462071, 461289, 458965, 455632, 452101, 448719, 445299, 441446, 436870, 431642, 426001, 419691, 412013, 403024, 394070, 386220, 378832, 370762, 362417, 355080, 348583, 341492, 333711, 327000, 322313, 318295, 313169, 306593, 298870, 289982, 280676, 272958, 267826, 263478, 257602, 250731, 245441, 242441, 239435, 234276, 227648, 221795, 217690, 214458, 210971, 207019, 202996, 199232, 195916, 193262, 191342, 189789, 188038, 186065, 184599, 184199, 184308, 183740, 182105, 180191, 178782, 177671, 176160, 174092, 171916, 170003, 168287, 166557, 164946, 164148, 165034]
53762A65034K660L235K233Q01L12Q41J437J462R75K26m18m05L75J166J333J315
53746A82582J753K242K094J843K550L829M184L448L175M246N595O069O111O628
53732B36349P336P397O889O495O265N814N368N574O361O834O362N119L586K115
53718C17864J108R88J772K841L369K948J809M95o23j590k538l323l664l544l198
53703C14714k797k476k485k784k612j271N85J170l90k922m519m583l956l492l275
53688B78907l048k637j837n71O51R34J2j318k150k480k783k984k571j680j235
53673B55210j689k394k674k749k884k504j219j56p57k445l125k186j229j265j113
53658B26821L39J928J917O69k05l88o64p77K97K256L605M003M482N182M884L384
$$ y = [165034, 167694, 170929, 173162, 173963, 174275, 175116, 176553, 178015, 178990, 179216, 178798, 178393, 178768, 179934, 181267, 182582, 184335, 186577, 188671, 190514, 193064, 196893, 201077, 204525, 207700, 211946, 217541, 223610, 229721, 236349, 243685, 251082, 257971, 264466, 270731, 276545, 281913, 287487, 293848, 300682, 307044, 312163, 315749, 317864, 318972, 319960, 321732, 324573, 327942, 330890, 332699, 333194, 332571, 330981, 328443, 325120, 321456, 317912, 314714, 311917, 309441, 306956, 304172, 301560, 300289, 300874, 302044, 301654, 298732, 294213, 289630, 285674, 282182, 278907, 275859, 273222, 271385, 270814, 271465, 272399, 272411, 271093, 268943, 266463, 263680, 260696, 258125, 256445, 255210, 253521, 251127, 248453, 245704, 242820, 240316, 239097, 238941, 238184, 235739, 232614, 230428, 229199, 227934, 226821, 227160, 229088, 231005, 231674, 231469, 231081, 230417, 229640, 229937, 232193, 235798, 239801, 244283, 249465, 254349, 257733]
53642B57733K290K639L372L330L157M059N773P093P429O748M999K825J758K404
53628C15609L249K797K086L256O095P959P232N161L699L083K348J175K63K57J132
53613C65401K343L210L269K518J313Q1p78r24m76j89o59j513j850j455r64q77
53597C68450j063j278j466j409p85K01Q51R27R06J008O46o30k193k984k709j789
53581C56683o20M80Q67J55q42p02Q13K345K693K241K045K137J701O72J12P58K089
53564C73627L162L720L861L308J905N98P93K610M613N589N812O093O364O115N549
53549D33719N357N470N212M746N217O985Q741R054Q171P383P256P418P761Q546
53535E31036R309Q990P582O618P320R041J0270J0512J0243R609Q355O778N663
$$ y = [257733, 260023, 262662, 266034, 269364, 272521, 276580, 282353, 289446, 296875, 303623, 308622, 311447, 313205, 315609, 318858, 321655, 323741, 326997, 333092, 341051, 348283, 353444, 357143, 360226, 362574, 363749, 364012, 364269, 365401, 367744, 370954, 374223, 376741, 378054, 378135, 377357, 376433, 375957, 375768, 375109, 373596, 371746, 370291, 369327, 368450, 367387, 366109, 364643, 363234, 362449, 362650, 363501, 364428, 365334, 366342, 366988, 366358, 364165, 361181, 358472, 356683, 356063, 356543, 357410, 357565, 356723, 356021, 356834, 359179, 361872, 364113, 366158, 368295, 369996, 370668, 370780, 371538, 373627, 376789, 380509, 384370, 387678, 389583, 390181, 390974, 393584, 398197, 403786, 409598, 415691, 422055, 428170, 433719, 439076, 444546, 449758, 454504, 459721, 466706, 475447, 484501, 492672, 500055, 507311, 514729, 522490, 531036, 540345, 549335, 556917, 563535, 570855, 579896, 590166, 600678, 610921, 620530, 628885, 635663, 641326]
53522F41326N091M416L499L028L322L753L817L864M264M721N011N511O221O121
53508G03965M623K896K492L076K956J652M96N76J523K659L914M972M853L401K080
53493G46134K209L125L243K271J206N60O3r1Q65K851M664N526N855O061N681M501
53477G94724L590M106N604O575O461O150O537P432Q054P912P091O274O501Q211
53463H85222J0367J1352J1039J1061J2591J4693J5784J5986J6884J9138K1581
53452A045698K2880K3083K3160K3723K4825K6444K8560L0891L2951L4324L4854
53441A351393L4890L5418L7415M0666M3606M4762M4301M3880M5010M7661N0240
53430A819242N0987M9690M8119M8297N0178N1628N0989M9045M7854M8186M8917
$$ y = [641326, 646417, 650833, 654332, 657360, 660682, 664435, 668252, 672116, 676380, 681101, 686112, 691623, 697844, 703965, 708588, 711484, 713976, 717052, 720008, 721660, 722156, 722732, 724255, 726914, 730828, 735800, 740653, 744054, 746134, 748343, 751468, 754711, 756982, 758188, 758748, 758811, 758720, 759585, 762436, 767100, 772626, 778481, 784542, 790223, 794724, 798314, 802420, 808024, 814599, 821060, 827210, 833747, 841179, 849233, 857145, 864236, 870510, 877011, 885222, 895589, 906941, 917980, 929041, 941632, 956325, 972109, 988095, 1004979, 1024117, 1045698, 1068578, 1091661, 1114821, 1138544, 1163369, 1189813, 1218373, 1249264, 1282215, 1316539, 1351393, 1386283, 1421701, 1459116, 1499782, 1543388, 1588150, 1632451, 1676331, 1721341, 1769002, 1819242, 1870229, 1919919, 1968038, 2016335, 2066513, 2118141, 2169130, 2218175, 2266029, 2314215, 2363132]
53419B363132M8760M7734M6746M6401M6537M6694M6642M6411M5781M4076M0913
53408B869827L7186L4650L4160L4800L5036L4148L2076K8772K4550K0493J7380
53397C203078J4515J0813O849M414L894L377R00l476q439j3202j7584k1158k3495
53384C160486k4987k6569k8697l1170l3763l6348l8475l9583l9679l9360l9142
53373B782713l9201l9681m0662m1760m2314m2115m1338l9819l7105l3642l0973
53362B354103k9834k8676k5420k0529j6924j6279j6684j4993j0626n691j995M97
53350B166949K312L471M488O811J0991J5442J8318K0071K2743K7003L1214L3672
53338B363485L4675L6018L9108M3831M8653N1825N3022N3916N6511O0911O5388
$$ y = [2363132, 2411892, 2459626, 2506372, 2552773, 2599310, 2646004, 2692646, 2739057, 2784838, 2828914, 2869827, 2907013, 2941663, 2975823, 3010623, 3045659, 3079807, 3111883, 3140655, 3165205, 3185698, 3203078, 3217593, 3228406, 3235255, 3239669, 3243563, 3246940, 3247840, 3244364, 3235925, 3222723, 3205139, 3183981, 3160486, 3135499, 3108930, 3080233, 3049063, 3015300, 2978952, 2940477, 2900894, 2861215, 2821855, 2782713, 2743512, 2703831, 2663169, 2621409, 2579095, 2536980, 2495642, 2455823, 2418718, 2385076, 2354103, 2324269, 2295593, 2270173, 2249644, 2232720, 2216441, 2199757, 2184764, 2174138, 2168447, 2166452, 2166949, 2169261, 2172732, 2177220, 2184031, 2195022, 2210464, 2228782, 2248853, 2271596, 2298599, 2329813, 2363485, 2398160, 2434178, 2473286, 2517117, 2565770, 2617595, 2670617, 2724533, 2781044, 2841955, 2907343]
53327B907343O8637P1054P3675P6829Q0224Q3577Q6535Q8691R0248R2139R4798
53316C813750R7348R8675R8955R9253R9808R9580R7771R5051R2759R1193Q9190
53305D873333Q5563Q0434P4816O9090O2677N5431M8547M3250L8945L3645K6319
53294E492050J7926R852K226n690j4026k1994k8864l4677m0108m5870n2271n9069
53282E219485o5792p2151p8003q3000q6637q8665q9253q8860q8257q8344q9340
53271D301183r0216q9732q7987q6130q4590q2649q0046p7752p6433p5121p2366
53260C398161o8120o3531n9460n6048n3264n0872m8200m4861m1529l9072l7209
53249B835995l5033l2656l1106l0379k8843k5204k0352j6545j5203j5815j6585
$$ y = [2907343, 2975980, 3047034, 3120709, 3197538, 3277762, 3361339, 3447874, 3536565, 3626813, 3718952, 3813750, 3911098, 4009773, 4108728, 4207981, 4307789, 4407369, 4505140, 4600191, 4692950, 4784143, 4873333, 4958896, 5039330, 5114146, 5183236, 5245913, 5301344, 5349891, 5393141, 5432086, 5465731, 5492050, 5509976, 5519828, 5522054, 5516364, 5502338, 5480344, 5451480, 5416803, 5376695, 5330825, 5278554, 5219485, 5153693, 5081542, 5003539, 4920539, 4833902, 4745237, 4655984, 4567124, 4478867, 4390523, 4301183, 4210967, 4121235, 4033248, 3947118, 3862528, 3779879, 3699833, 3622081, 3545648, 3470527, 3398161, 3330041, 3266510, 3207050, 3151002, 3097738, 3046866, 2998666, 2953805, 2912276, 2873204, 2835995, 2800962, 2768306, 2737200, 2706821, 2677978, 2652774, 2632422, 2615877, 2600674, 2584859, 2568274]
53238B568274j5799j2945r039n669l470j695O00L332N574O697P011P504R194J2476
53224B572045J6772K0911K4057K6284K8113K9883L1759L4121L7299M0830M3450
53213B905524M4181M3301M1929M0820L9747L8095L5598L2433K8927K5490K2543
53202C298588K0156J7933J5644J3742J2612J1370Q315L076k374n692o878q227
53190C378265j1531j6213k0529k3896k7194l1118l5154l8452m0989m3265m5313
53179C044611m6722m7486m8022m8282m7770m6805m6747m8067m9008m7450m3859
53168B524393m1000m0527m1111m0533l8444l6196l4744l3858l3120l2569l2269
53157B120022l1934l1166k9710k7472k4735k2315k1002k0763k0850k0857k1238
$$ y = [2568274, 2552475, 2539530, 2530491, 2524822, 2521352, 2519657, 2520257, 2523589, 2529163, 2535860, 2542871, 2550375, 2559569, 2572045, 2588817, 2609728, 2633785, 2660069, 2688182, 2718065, 2749824, 2783945, 2821244, 2862074, 2905524, 2949705, 2993006, 3034935, 3075755, 3115502, 3153597, 3189195, 3221628, 3250555, 3276045, 3298588, 3318744, 3336677, 3352321, 3366063, 3378675, 3390045, 3398360, 3401436, 3399062, 3393370, 3386492, 3378265, 3366734, 3350521, 3329992, 3306096, 3278902, 3247784, 3212630, 3174178, 3133189, 3089924, 3044611, 2997889, 2950403, 2902381, 2854099, 2806329, 2759524, 2712777, 2664710, 2615702, 2568252, 2524393, 2483393, 2442866, 2401755, 2361222, 2322778, 2286582, 2251838, 2217980, 2184860, 2152291, 2120022, 2088088, 2056922, 2027212, 1999740, 1975005, 1952690, 1931688, 1910925, 1890075, 1869218, 1847980]
53146A847980k2592k4661k6391k6938k6473k5820k5449k5069k4414k4044k4881
53135A571248k6912k8916k9664k9087k7974k7066k6713k7084k8103k9220k9772
53124A260737k9586k9030k8503k8147k7983k7981k7932k7526k6664k5607k4735
53113I57043k4289k4315k4649k4797k4050k2097j9663j8203j8583k0012k0667
53102G15718j9411j6744j4037j2378j2081j2717j3345j3282j2931j3071j3168
53091E62553j1597q279n771o338q863j0347r788q652q013p460o791o506o190m717
53077D53241k697k394m253n805n404m674n446o430n440l176k016k134j668j88
53063D01516Q43Q33N88P8j629l831m169j978N45J426J164R16M46p87k026k234
$$ y = [1847980, 1825388, 1800727, 1774336, 1747398, 1720925, 1695105, 1669656, 1644587, 1620173, 1596129, 1571248, 1544336, 1515420, 1485756, 1456669, 1428695, 1401629, 1374916, 1347832, 1319729, 1290509, 1260737, 1231151, 1202121, 1173618, 1145471, 1117488, 1089507, 1061575, 1034049, 1007385, 981778, 957043, 932754, 908439, 883790, 858993, 834943, 812846, 793183, 774980, 756397, 736385, 715718, 696307, 679563, 665526, 653148, 641067, 628350, 615005, 601723, 588792, 575721, 562553, 550956, 542677, 536906, 530568, 521705, 511358, 501570, 492918, 484905, 477445, 470654, 464148, 457958, 453241, 450544, 448150, 443897, 438092, 432688, 428014, 422568, 416138, 410698, 407522, 405506, 403372, 401704, 401516, 402359, 403192, 403780, 403858, 402229, 398398, 394229, 392251, 392796, 394222, 395386, 396302, 396748, 395961, 393935, 391701]
53047C91701j446n6K079M555N713M550K429J416J575J354J71r36j144r25j166
53032D09870k145l564m908n539n090l875k648k048k419l748n368o192n867n272
53018C51187n360n866n859n225m742m814m918m349k997j331j18m0j054k194k545
53003B99775k405k814l924m571l866k508j932k441k948k548j688j413j856k144
52989B62717j673q32k15J86M92K11j146k963l914l578k827k450k236j682r24l60
52973B38806j9J07l39j400k151j557m4N78r06l577n172m325j853K26P82M11K29
52956B19796M28M08r0p54j464k316k910k495j187j72k62r20j276j257j194r47
52940B03388k40O12J103J302J499J497R55K36J47R24K022K812L000K512J560O43
$$ y = [391701, 390255, 390199, 392278, 396833, 402546, 407096, 409525, 410941, 412516, 413870, 414041, 413105, 411961, 411036, 409870, 407725, 404161, 399253, 393714, 388624, 384749, 382101, 380053, 377634, 373886, 368518, 362326, 356459, 351187, 345827, 339961, 334102, 328877, 324135, 319321, 314403, 310054, 307057, 305726, 305608, 305568, 304514, 302320, 299775, 297370, 294556, 290632, 286061, 282195, 279687, 277755, 275314, 272366, 269818, 268130, 266717, 264861, 262717, 261044, 260212, 259997, 260183, 260675, 260886, 259740, 256777, 252863, 249285, 246458, 244008, 241772, 240090, 239166, 238806, 238787, 238894, 238555, 237155, 235004, 233447, 233403, 233981, 233075, 229498, 224326, 220001, 218148, 218374, 219156, 219567, 219796, 220224, 220632, 220542, 219788, 218324, 216008, 213098, 210603, 209416, 209244, 208982, 208062, 206786, 205529, 204335, 203388, 203148, 203760, 204863, 206165, 207664, 209161, 210116, 210352, 210499, 211423, 213445, 216257, 219257, 221769, 223329, 223972]
52924B23972O9l56q00j000q28p31r58r01l1J088J667K118L256M456M109K083K06
52907B37419j04O23J323K026L182M403M994N082N292N760O198O473O413N641M343
52892B99068L512L617L644K614J371J463K628L066K160J254J321J545J035M22
52878C28720O03J020N23p84j927k771l937n229n581m657l352k484j989j679j683
52863B94793j799j467p24l19l90j00P38Q95m17j807j193J396L803M371L363J867
52847C03010M34q29j779k336k528k212j288k14M13P75J580K649K713J126j062
52832C00452k291k188j442n43N25J604K165J841Q32j97m18N93K216K986K020J65
52816C08320q46l00Q29J201O27J32P57K500M262M815L915K501J645J444J168M34
$$ y = [223972, 224041, 223685, 222885, 221885, 221057, 220326, 219368, 218467, 218436, 219524, 221191, 223309, 226565, 231021, 235130, 237213, 237419, 237315, 237938, 239261, 241287, 244469, 248872, 253866, 258948, 264240, 270000, 276198, 282671, 289084, 294725, 299068, 302580, 306197, 309841, 312455, 313826, 315289, 317917, 320983, 323143, 324397, 325718, 327263, 328298, 328720, 329323, 330343, 330866, 330082, 328155, 325384, 321447, 316218, 310637, 305980, 302628, 300144, 298155, 296476, 294793, 292994, 291527, 290803, 290484, 290094, 289994, 290732, 291627, 291210, 289403, 288210, 289606, 293409, 297780, 301143, 303010, 303444, 302615, 300836, 298500, 295972, 293760, 292472, 292258, 292671, 293446, 295026, 297675, 300388, 301514, 300452, 298161, 295973, 294531, 293988, 294513, 296117, 298282, 300123, 300955, 300758, 300340, 300933, 303149, 306135, 308155, 308320, 307474, 307174, 308003, 309204, 309831, 309963, 310720, 313220, 317482, 322297, 326212, 328713, 330358, 331802, 332970, 333404]
52800C33404k10r6N36P98M35K46R67K172K801K625K414K614K664K034J301J515
52784C56220K829M364N188M938L863K829K845L902M621L935K683K504L375L713
52770D07809K875K042K152K429J800N44n39j537k838l934m063l652l809m569m751
52755C89959l598j720l90n05k099m209n312m712l429l062l926m961n355n284n008
52740C36389m299l140k297k615m064n709o392n488l522k037k236l548m139l128
52726B83775j610j116j664k073j796j541k003k806l170l135l366l857l623k171
52712B49844o68p83k465l851l591k431j856j935j493j25J076J002j41j365k186
52697B29032k760l054k605j290P8M06m63j588k107k206k583l252l584l414l368
$$ y = [333404, 333194, 333098, 333634, 334432, 334867, 335113, 336080, 338252, 341053, 343678, 346092, 348706, 351370, 353404, 354705, 356220, 359049, 363413, 368601, 373539, 377402, 380231, 383076, 386978, 391599, 395534, 398217, 400721, 404096, 407809, 410684, 412726, 414878, 417307, 419107, 419651, 419112, 417575, 414737, 410803, 406740, 403088, 399279, 394710, 389959, 386361, 384641, 384251, 383746, 381647, 377438, 372126, 367414, 363985, 360923, 356997, 352036, 346681, 341397, 336389, 332090, 328950, 326653, 324038, 319974, 314265, 307873, 302385, 298863, 296826, 294590, 291042, 286903, 283775, 282165, 281049, 279385, 277312, 275516, 273975, 271972, 269166, 265996, 262861, 259495, 255638, 252015, 249844, 249176, 248393, 245928, 242077, 238486, 236055, 234199, 232264, 230771, 230646, 231722, 232724, 232583, 231218, 229032, 226272, 223218, 220613, 219323, 219401, 219807, 219344, 217756, 215649, 213443, 210860, 207608, 204024, 200610, 197242]
52682A97242l944m815n253m775l360j677j083k305l948l591r43J403J317j15n57
52667A63596N5l2j090j397j92R75O11o62j415j436j383j421j327j272j482j619
52651A50509j347j089j371j817j651r68o03p71o86L31J879K873K548R84r95k277
52635A45549k199j017L79J292J733K136K842L877N127O391P290P377O659N836
52621A93272N539N310M017J577m17n86K70Mk092m397n040l971k529j749j704k084
52605A85420k627l074l194l021k847k947l306l613l540l189l003l038k647j392
52591A43982KK83o57j615j672j252j238j789k437k841k878k413j470m12M19R70
52575A24982J222R86K44p21j659k378k257n66K250M258L893J764o1l90J32K19
$$ y = [197242, 193298, 188483, 183230, 178455, 175095, 173418, 172335, 170030, 166082, 162491, 161548, 162951, 164268, 164153, 163596, 163651, 163619, 162529, 161132, 160940, 161915, 162526, 161864, 160449, 159013, 157630, 156209, 154882, 153610, 152128, 150509, 149162, 148073, 146702, 144885, 143234, 142266, 141663, 140892, 140206, 140537, 142416, 145289, 147837, 148821, 147826, 145549, 143350, 142333, 142712, 144004, 145737, 147873, 150715, 154592, 159719, 166110, 173400, 180777, 187436, 193272, 198811, 204121, 208138, 209715, 209298, 208712, 208982, 208986, 206894, 202497, 197457, 193486, 190957, 189208, 187504, 185420, 182793, 179719, 176525, 173504, 170657, 167710, 164404, 160791, 157251, 154062, 151059, 148021, 145374, 143982, 143984, 144267, 143610, 141995, 140323, 139071, 137833, 136044, 133607, 130766, 127888, 125475, 124005, 123593, 124012, 124982, 126204, 127190, 127434, 126713, 125054, 122676, 120419, 119853, 122103, 126361, 130254, 132018, 131957, 131567, 131699, 131918]
52559A31918n79j587j759p64M69N68n70j358m03J585K639K048R91O19O13J64n91
52542A34003q55m33J80O27R57J100R18Q31J578K980L681K764J197P74J796K856
52526A54954K965K722K769K378P29j200j612m50N39N01M71J252J917J520R18J378
52510A71751K300K032O40R3J522L633M352L165J394Q22K278M872O411N301K355
52495B12921K5l20L44M52j21m12Q2J069K079K627K168Q69N5Q34K431L014K241
52478B30358J724K593L743L428J662k5o95p34o95o28n86p28n78P45L014M505L964
52461B51067K345J679K580L739L715K374M46j388k681l029k308r74P3Rj286k888
52445B53473l384k213l43P48O45J38jK62O01P43M78j08l09N93K203L126K461P22
$$ y = [131918, 131339, 129752, 127993, 127229, 127698, 128266, 127696, 126338, 125935, 127520, 130159, 132207, 133198, 133817, 134430, 134594, 134003, 133148, 132715, 132895, 133522, 134479, 135579, 136497, 137328, 138906, 141886, 145567, 148331, 149528, 150302, 152098, 154954, 157919, 160641, 163410, 165788, 166517, 165317, 163705, 163255, 163794, 164295, 164766, 166018, 167935, 169455, 170373, 171751, 174051, 176083, 176723, 176816, 178338, 181971, 186323, 189488, 190882, 191704, 193982, 198854, 205265, 210566, 212921, 212946, 212626, 212970, 213422, 213301, 212889, 212971, 214040, 216119, 218746, 220914, 221783, 221838, 222672, 225103, 228117, 230358, 232082, 234675, 238418, 241846, 243508, 243483, 242788, 242054, 241359, 240731, 240145, 239417, 238839, 239584, 242598, 247103, 251067, 253412, 255091, 257671, 261410, 265125, 267499, 267945, 266557, 263876, 260847, 258539, 257565, 257638, 257647, 256361, 253473, 250089, 247876, 247533, 248281, 248926, 249064, 249063, 249325, 249926, 250669, 251147, 251039, 250730, 251323, 253526, 256652, 259113, 259835]
52427B59835q21j138K14K794N011N106L014O55k52M7K78J47L65J178J885J936
52411B80254J637J525J633J590J187O10K33K56N48R24J380J760J485K42j137j309
52395B92818j25J189J746J921K178K133J528J051J134R41j02p23O25L070M118
52380C13502L092J893J941K175J008j102k348j977q64j8L77N88P61R11J112J487
52364C22538K039K463K254J353N13N36J042P34q65k531k684j295O9j13j802l452
52348C20799l367j295J229K304J547K84o5O36J575K050J873J129J43n22m43K11
52332C28088Q95J316J670K219K818K971K453J636J018N29k19j002r69J38J406
52317C44967J966K088K368K460J726P03N70J368K020K266L005M434N316M838L882
$$ y = [259835, 259014, 257876, 258090, 260884, 265895, 271001, 274015, 274670, 274418, 274465, 274743, 274890, 275255, 276433, 278318, 280254, 281891, 283416, 285049, 286639, 287826, 288436, 288669, 288925, 289473, 290397, 291777, 293537, 295022, 295264, 294127, 292818, 292693, 293882, 295628, 297549, 299727, 301860, 303388, 304439, 305573, 306514, 306412, 305689, 306314, 309384, 313502, 316594, 318487, 320428, 322603, 323611, 322509, 320161, 318184, 317320, 317302, 317679, 318267, 319028, 319939, 321051, 322538, 324577, 327040, 329294, 330647, 331160, 331696, 332738, 333472, 332607, 330076, 327392, 326097, 326166, 326053, 324251, 320799, 317432, 316137, 317366, 319670, 321217, 321501, 321436, 322072, 323647, 325697, 327570, 328699, 328842, 328320, 327877, 328088, 328983, 330299, 331969, 334188, 337006, 339977, 342430, 344066, 345084, 345613, 345394, 344392, 343423, 343561, 344967, 346933, 349021, 351389, 353849, 355575, 356278, 356848, 358216, 360236, 362502, 365507, 369941, 375257, 380095, 383977]
$$ [...]
##END NTUPLES=NMR SPECTRUM
##END=
