
##TITLE=AC1082_NSTO01_5818588_j4YIMWLkmI
##JCAMPDX= 6.0         $$ Bruker NMR JCAMP-DX V2.0
##DATA TYPE= NMR SPECTRUM
##DATA CLASS= NTUPLES
##ORIGIN= BRUKER
##OWNER= Administrator
$$ 1.72 TOPSPIN		Version 2.1
$$ 2012-04-16 19:08:46.125 -0500  Administrator@TOPSPIN
$$ Compression mode = diff/dup
##.OBSERVE FREQUENCY= 400.13188235
##.OBSERVE NUCLEUS= ^1H
##.ACQUISITION MODE= SIMULTANEOUS (DQD)
##.ACQUISITION SCHEME= undefined
##.AVERAGES= 64
##.DIGITISER RES= 22
##SPECTROMETER/DATA SYSTEM= spect
##.PULSE SEQUENCE= noesygpps1d.comp
##.SOLVENT NAME= COFFEE_meoh
##.SHIFT REFERENCE= INTERNAL, COFFEE_meoh, 1, 14.96797
##AUDIT TRAIL= $$ (NUMBER, WHEN, WHO, WHERE, PROCESS, VERSION, WHAT)
$$ ##TITLE= Audit trail, TOPSPIN		Version 2.1
$$ ##JCAMPDX= 5.01
$$ ##ORIGIN= Bruker BioSpin GmbH
$$ ##OWNER= Administrator
$$ $$ C:\Bruker\TOPSPIN/data/COFFEE/nmr/AC1082_NSTO01_5818588_j4YIMWLkmI/22/pdata/1/auditp.txt
$$ ##AUDIT TRAIL=  $$ (NUMBER, WHEN, WHO, WHERE, PROCESS, VERSION, WHAT)
(   1,<2012-04-15 14:55:21.750 -0500>,<Administrator>,<TOPSPIN>,<go>,<TOPSPIN 2.1>,
      <created by zg
	started at 2012-04-15 14:43:50.171 -0500,
	POWCHK enabled, PULCHK disabled,
       configuration hash MD5:
       1A 1E CE 29 27 FD 77 03 67 4E F0 E3 C4 B2 CB 90
       data hash MD5: 64K
       08 BE 9B 3D D6 E2 DD 74 A1 61 A1 67 CE B6 BE 0C>)
(   2,<2012-04-15 14:55:24.546 -0500>,<Administrator>,<TOPSPIN>,<proc1d>,<TOPSPIN 2.1>,
      <Start of raw data processing
       efp LB = 0.3 FT_mod = 6 PKNL = 1 PHC0 = 0 PHC1 = 0 SI = 128K 
       data hash MD5: 128K
       68 8D 97 47 70 8D BD 0C CA A0 A9 0F 0B B0 AD 89>)
(   3,<2012-04-15 14:55:25.765 -0500>,<Administrator>,<TOPSPIN>,<proc1d>,<TOPSPIN 2.1>,
      <pk PHC0 = 36.13953 PHC1 = 0 
       data hash MD5: 128K
       A3 F7 82 C8 16 48 72 5D B6 D6 F3 AD 48 24 77 C9>)
(   4,<2012-04-15 14:55:25.984 -0500>,<Administrator>,<TOPSPIN>,<proc1d>,<TOPSPIN 2.1>,
      <abs ABSG = 1 
       data hash MD5: 128K
       8F 7E 34 7D 55 F5 2F CB F8 FF E4 B5 BA 12 67 A2>)
(   5,<2012-04-15 14:55:26.062 -0500>,<Administrator>,<TOPSPIN>,<proc1d>,<TOPSPIN 2.1>,
      <abs ABSG = 2 
       data hash MD5: 128K
       3E 4D 37 F3 85 B7 D0 B5 29 2C 18 62 C3 E0 C9 D1>)
(   6,<2012-04-15 14:55:26.296 -0500>,<Administrator>,<TOPSPIN>,<proc1d>,<TOPSPIN 2.1>,
      <abs ABSG = 3 
       data hash MD5: 128K
       87 CC 7A E2 A6 23 DF 19 C6 9A BB 13 8F D5 B8 68>)
(   7,<2012-04-15 14:55:26.359 -0500>,<Administrator>,<TOPSPIN>,<proc1d>,<TOPSPIN 2.1>,
      <abs ABSG = 4 
       data hash MD5: 128K
       FF 84 7D 0F 8B 92 21 BD 3B 75 B3 C3 8A 24 27 B7>)
(   8,<2012-04-15 14:55:26.406 -0500>,<Administrator>,<TOPSPIN>,<proc1d>,<TOPSPIN 2.1>,
      <abs ABSG = 5 
       data hash MD5: 128K
       F9 C2 20 90 10 7A A4 1E 16 B7 A0 2F 7F 7C 9B 13>)
(   9,<2012-04-15 14:55:26.640 -0500>,<Administrator>,<TOPSPIN>,<audit>,<TOPSPIN 2.1>,
      <user comment:
       ICON-NMR User ID: COFFEE
       data hash MD5: 128K
$$ [...]
##$TP07= 0
##$TPNAME0= <>
##$TPNAME1= <>
##$TPNAME2= <>
##$TPNAME3= <>
##$TPNAME4= <>
##$TPNAME5= <>
##$TPNAME6= <>
##$TPNAME7= <>
##$TPOAL= (0..7)
0.5 0.5 0.5 0.5 0.5 0.5 0.5 0.5
##$TPOFFS= (0..7)
0 0 0 0 0 0 0 0
##$TUNHIN= 0
##$TUNHOUT= 0
##$TUNXOUT= 0
##$USERA1= <user>
##$USERA2= <user>
##$USERA3= <user>
##$USERA4= <user>
##$USERA5= <user>
##$V9= 5
##$VALIST= <valist>
##$VCLIST= <CCCCCCCCCCCCCCC>
##$VD= 0
##$VDLIST= <DDDDDDDDDDDDDDD>
##$VPLIST= <PPPPPPPPPPPPPPP>
##$VTLIST= <TTTTTTTTTTTTTTT>
##$WBST= 2048
##$WBSW= 25
##$XGAIN= (0..3)
0 0 0 0
##$XL= 0
##$YL= 0
##$YMAX_a= 13252060
##$YMIN_a= -7232502
##$ZGOPTNS= <>
##$ZL1= 120
##$ZL2= 120
##$ZL3= 120
##$ZL4= 120
##$ABSF1= 14.96797
##$ABSF2= -5.58456
##$ABSG= 5
##$ABSL= 3
##$ALPHA= 0
##$AQORDER= 0
##$ASSFAC= 0
##$ASSFACI= 0
##$ASSFACX= 0
##$ASSWID= 0
##$AUNMP= <proc_prof1d_extract.lims>
##$AXLEFT= 0
##$AXNAME= <>
##$AXNUC= <1H>
##$AXRIGHT= 0
##$AXTYPE= 0
##$AXUNIT= <>
##$AZFE= 0.1
##$AZFW= 0.1
##$BCFW= 0
##$BC_mod= 0
##$BYTORDP= 0
##$COROFFS= 0
##$CY= 15
##$DATMOD= 1
##$DC= 0
##$DFILT= <>
##$DTYPP= 0
##$F1P= 0
##$F2P= 0
##$FCOR= 0.5
##$FTSIZE= 131072
##$FT_mod= 6
##$GAMMA= 0
##$GB= 0
##$INTBC= 1
##$INTSCL= 1
##$ISEN= 128
##$LB= 0.3
##$LEV0= 0
##$LPBIN= 0
##$MAXI= 10000
##$MC2= 0
##$MEAN= 0
##$ME_mod= 0
##$MI= 0
##$NCOEF= 0
##$NC_proc= -2
##$NLEV= 6
##$NOISF1= 0
##$NOISF2= 0
##$NSP= 0
##$NTH_PI= 0
##$NZP= 0
##$OFFSET= 14.96797
##$PC= 1
##$PHC0= 36.13953
##$PHC1= 0
##$PH_mod= 1
##$PKNL= yes
##$PPARMOD= 0
##$PPDIAG= 0
##$PPIPTYP= 0
##$PPMPNUM= 2147483647
##$PPRESOL= 1
##$PSCAL= 4
##$PSIGN= 0
##$PYNMP= <proc.py>
##$REVERSE= no
##$SF= 400.130005057692
##$SI= 131072
##$SIGF1= 0
##$SIGF2= 0
##$SINO= 400
##$SIOLD= 131072
##$SPECTYP= <>
##$SREGLST= <1H.CDCl3>
##$SSB= 0
##$STSI= 131072
##$STSR= 0
##$SW_p= 8223.68421052632
##$SYMM= 0
##$S_DEV= 0
##$TDeff= 65536
##$TDoff= 0
##$TI= <>
##$TILT= no
##$TM1= 0
##$TM2= 0
##$TOPLEV= 0
##$USERP1= <user>
##$USERP2= <user>
##$USERP3= <user>
##$USERP4= <user>
##$USERP5= <user>
##$WDW= 1
##$XDIM= 131072
##$YMAX_p= 239981804
##$YMIN_p= -294045188
##$CURPLOT= <Network HP LaserJet P1505>
##$CURPRIN= <$Network HP LaserJet P1505>
##$DFORMAT= <normdp>
##$LAYOUT= <+/1D_H.xwp>
##$LFORMAT= <normlp>
##$PFORMAT= <normpl>
##$SURQMSG= 1
$$ End of Bruker specific parameters
$$ ---------------------------------
##NTUPLES= NMR SPECTRUM
##VAR_NAME=  FREQUENCY,     SPECTRUM/REAL,   SPECTRUM/IMAG
##SYMBOL=    X,             R,               I
##VAR_TYPE=  INDEPENDENT,   DEPENDENT,       DEPENDENT
##VAR_FORM=  AFFN,          ASDF,            ASDF
##VAR_DIM=   131072,        131072,          131072
##UNITS=     HZ,            ARBITRARY UNITS, ARBITRARY UNITS
##FACTOR=    0.0627417313425165, 1,          1
##FIRST=     8223.62146879498, 322,          -55890
##LAST=      0,             2615,            -56497
##MIN=       0,             -294045188,      0
##MAX=       8223.62146879498, 239981804,    0
$$ Real data points
##PAGE= N=1
##DATA TABLE= (X++(R..R)), XYDATA
$$ [...]
62038B702897J5253J5534J4790J3398J1659R795Q290P585P712Q638J0455J2693
$$ 2702897 2718150 2733684 2748474 2761872 2773531 2783326 2791616 2799201 2806913 2815551 2826006 2838699
62026B838699J3970J3256J1247R690R429R890J0381J1038J2254J3919J5572J6794
$$ 2838699 2852669 2865925 2877172 2886862 2896291 2906181 2916562 2927600 2939854 2953773 2969345 2986139
62014B986139J7237J6723J5625J4663J4032J3164J1591R599P780O330N137M114
$$ 2986139 3003376 3020099 3035724 3050387 3064419 3077583 3089174 3098773 3106553 3112883 3118020 3122134
62002C122134L034J455p49l210n823r224j3846j8830k2763k5349k7599l0408l3662
$$ 3122134 3125168 3126623 3125874 3122664 3116841 3107617 3093771 3074941 3052178 3026829 2999230 2968822 2935160
61989B935160l6838l9617m1777m3207m4345m5902m7808m8979m8604m7025m5036
$$ 2935160 2898322 2858705 2816928 2773721 2729376 2683474 2635666 2586687 2538083 2491058 2446022
61978B446022m2971m0917l9192l7857l6269l3916l1304k9308k7960k6680k5361
$$ 2446022 2403051 2362134 2322942 2285085 2248816 2214900 2183596 2154288 2126328 2099648 2074287
61967B074287k4394k3736k2934k2065k1740k2088k2521k2673k2743k2727k2210
$$ 2074287 2049893 2026157 2003223 1981158 1959418 1937330 1914809 1892136 1869393 1846666 1824456
61956A824456k1287k0788k1032k1082j9912j7774j5695j4095j2573j0848r150
$$ 1824456 1803169 1782381 1761349 1740267 1720355 1702581 1686886 1672791 1660218 1649370 1640220
61945A640220p734o537n362m063k584j099L1O02O27p0j890m759p850j0574j3313
$$ 1640220 1632486 1625949 1620587 1616524 1613940 1612841 1612872 1613474 1614101 1614031 1612141 1607382 1599532 1588958 1575645
61930A575645j6628k0157k3143k5694k8467l1140l2331l1415k9456k7788k6411
$$ 1575645 1559017 1538860 1515717 1490023 1461556 1430416 1398085 1366670 1337214 1309426 1283015
61919A283015k4544k2193k0310j9507j9264j8572j6910j4552j2232j0585r679
$$ 1283015 1258471 1236278 1215968 1196461 1177197 1158625 1141715 1127163 1114931 1104346 1094667
61908A094667r045q240p305o467n586m261k545j110m58j98O05K340M419N971O853
$$ 1094667 1085622 1077382 1070077 1063610 1058024 1053763 1051218 1050108 1049650 1049452 1050057 1052397 1056816 1062787 1069640
61893A069640P717R123J0830J2203J3203J4597J7020K0123K2972K5191K7239K9553
$$ 1069640 1077357 1086480 1097310 1109513 1122716 1137313 1154333 1174456 1197428 1222619 1249858 1279411
61881A279411L1926L3997L5930L8131M0419M2084M2863M3334M4125M5061M5505
$$ 1279411 1311337 1345334 1381264 1419395 1459814 1501898 1544761 1588095 1632220 1677281 1722786
61870A722786M5309M4996M4996M5035M4491M3300M2282M2492M4165M6498M8636
$$ 1722786 1768095 1813091 1858087 1903122 1947613 1990913 2033195 2075687 2119852 2166350 2214986
61859B214986N0790N4015N8991O5473P3062Q1870R2014J02970J14058J25369J37548
$$ 2214986 2265776 2319791 2378782 2444255 2517317 2599187 2691201 2794171 2908229 3033598 3171146
61848C171146J50786J64498J77953J90743K02727K14151K25770K38340K51841
$$ 3171146 3321932 3486430 3664383 3855126 4057853 4272004 4497774 4736114 4987955
61839D987955K65582K78936K91349L01727L08519L10412L06130K93404K69155
$$ 4987955 5253537 5532473 5823822 6125549 6434068 6744480 7050610 7344014 7613169
61830G613169K31297J79959J16919M4976l1560j06920j75866k35480k84453l21427
$$ 7613169 7844466 8024425 8141344 8186320 8154760 8047840 7871974 7636494 7352041 7030614
61820G030614l45295l56879l58903l53947l43187l27272l07534k85795k63607
$$ 7030614 6685319 6328440 5969537 5615590 5272403 4945131 4637597 4351802 4088195
61811D088195k42032k21721k02707j84452j66456j48834j32185j17098j03793
$$ 4088195 3846163 3624442 3421735 3237283 3070827 2921993 2789808 2672710 2568917
61802B568917r1926q0752o9752n9202m9727m1346l3425k5654j8474j2244o520
$$ 2568917 2476991 2396239 2326487 2267285 2217558 2176212 2142787 2117133 2098659 2086415 2079895
61791B079895p32M787R088J1824J3608J5038J5828J5250J3106R928O347K583j392
$$ 2079895 2079163 2083950 2093038 2104862 2118470 2133508 2149336 2164586 2177692 2187620 2193967 2196550 2195158
61778B195158n497r383j2504j4197j4071j2455j0262q083n632k342J630N446Q470
$$ 2195158 2189661 2180278 2167774 2153577 2139506 2127051 2116789 2108706 2103074 2100732 2102362 2107808 2116278
61765B116278J0589J1717J1574J0095P587M222j08n182j0243j4618j8189k0940
$$ 2116278 2126867 2138584 2150158 2160253 2167840 2172062 2171954 2166772 2156529 2141911 2123722 2102782
61753B102782k2597k2943k2139k0301j7390j3836j0548p727m275P92O922J2819
$$ 2102782 2080185 2057242 2035103 2014802 1997412 1983576 1973028 1965301 1961026 1961818 1968740 1981559
61741A981559J8206K3783K9773L5618M1058M6443N1933N7393O3219P0146P8001
$$ 1981559 1999765 2023548 2053321 2088939 2129997 2176440 2228373 2285766 2348985 2419131 2497132
61730B497132Q5620R2489R9586J08100J18060J28834J40245J52533J65734J79892
$$ 2497132 2582752 2675241 2774827 2882927 3000987 3129821 3270066 3422599 3588333 3768225
61720C768225J95543K13267K32940K53971K76140K99652L24559L50598L77666
$$ 3768225 3963768 4177035 4409975 4663946 4940086 5239738 5564297 5914895 6292561
61711F292561M05894M35166M64810M93939N21776N47327N68685N82830N86209
$$ 6292561 6698455 7133621 7598431 8092370 8614146 9161473 9730158 10312988 10899197
61702A0899197N75470N47401M98522M25775L28586K10366P7868o0647j96450l20904
$$ 10899197 11474667 12022068 12520590 12946365 13274951 13485317 13563185 13502538 13306088 12985184
61692A2985184m26943n10835n72117o11786o31316o33278o21561o00076n71646
$$ 12985184 12558241 12047406 11475289 10863503 10232187 9598909 8977348 8377272 7805626
61683G805626n38390n02424m65544m28849l93230l59717l28840l00179k73251
$$ 7805626 7267236 6764812 6299268 5870419 5477189 5117472 4788632 4488453 4215202
61674D215202k48385k26112k06152j87767j70752j55390j41654j29094j17411
$$ 4215202 3966817 3740705 3534553 3346786 3176034 3020644 2878990 2749896 2632485
61665B632485j06555r6504q7488q0093p4490o9828o5222o1078n8583n7867n7654
$$ 2632485 2525930 2429426 2341938 2261845 2187355 2117527 2052305 1991227 1932644 1874777 1817123
61654A817123n6782n5264n3506n1429m8838m6068m3604m1449l9323l7259l5538
$$ 1817123 1760341 1705077 1651571 1600142 1551304 1505236 1461632 1420183 1380860 1343601 1308063
61643A308063l4145l2730l1025k9060k7059k5280k3869k2732k1657k0667k0070
$$ 1308063 1273918 1241188 1210163 1181103 1154044 1128764 1104895 1082163 1060506 1039839 1019769
61632A019769k0032k0258k0349k0239k0042j9614j8679j7362j6237j5646j5283
$$ 1019769 999737 979479 959130 938891 918849 899235 880556 863194 846957 831311 816028
61621H16028j4620j3612j2657j1995j1503j1083j0858j0792j0423r358p896o786
$$ 816028 801408 787796 775139 763144 751641 740558 729700 718908 708485 699127 691231 684445
61609F84445o402o420o379o240o307o735p216p123o111m645l777m022m658m512
$$ 684445 678043 671623 665244 659004 652697 645962 638746 631623 625512 620867 617090 613068 608410 603898
61595F03898l400k244j782j667j176k06P46J327J668K091K786L635M217M171L573
$$ 603898 600498 598254 596472 594805 593629 593423 594169 595496 597164 599255 602041 605676 609893 614064 617637
61580F17637K847K233J676J254J200J390J225L71p26j261q07N20K224L562L991
$$ 617637 620484 622717 624393 625647 626847 628237 629462 629833 629107 627846 627039 627559 629783 633345 637336
61565F37336L778L755M222M545M111L109J898K59k023m353n913o844p993r602
$$ 637336 641114 644869 649091 653636 657747 660856 662754 663013 660990 656637 650724 643880 635887 626285
61551F26285j0959j1452j1220j0686j0023r276q545p820o903n726m486l502l022
$$ 626285 615326 603874 592654 581968 571945 562669 554124 546304 539401 533675 529189 525687 522665
61538E22665l129l570l796l397k426j170J61J312J913J968K089K760L641M110
$$ 522665 519536 515966 512170 508773 506347 505177 505338 506650 508563 510531 512620 515380 519021 523131
61524E23131M241M581N205N788O467P863J0013J2074J3319J3869J4191J4430J4580
$$ 523131 527372 531953 537158 542946 549413 557276 567289 579363 592682 606551 620742 635172 649752
61511F49752J4882J5622J6827J8331K0017K1734K3175K3988K4012K3380K2584
$$ 649752 664634 680256 697083 715414 735431 757165 780340 804328 828340 851720 874304
61500H74304K2176K2265K2404K2164K1543K0566J8959J6800J4955J4102J3592
$$ 874304 896480 918745 941149 963313 984856 1005422 1024381 1041181 1056136 1070238 1083830
61489A083830J2268J0266Q860Q506Q207P150N791M701L473J641j23q89r55j376
$$ 1083830 1096098 1106364 1115224 1123730 1131937 1139087 1144878 1149579 1153052 1154693 1154570 1153681 1152726 1151350
61475A151350k292k818k580k313k556k677j681M58K850M882O787R037J1630J4253
$$ 1151350 1149058 1146240 1143660 1141347 1138791 1136114 1134433 1134891 1137741 1142623 1149410 1158447 1170077 1184330
61461A184330J6994K0355K4500K8913L3112L7373M2269M7674N2885N7671O2614
$$ 1184330 1201324 1221679 1246179 1275092 1308204 1345577 1387846 1435520 1488405 1546076 1608690
61450A608690O8201P4195Q0204Q6300R2759R9525J06345J13051J19398J24856
$$ 1608690 1676891 1751086 1831290 1917590 2010349 2109874 2216219 2329270 2448668 2573524
61440B573524J28942J31498J32300J30638J25538J16289J02612Q4707O3424M0143
$$ 2573524 2702466 2833964 2966264 3096902 3222440 3338729 3441341 3526048 3589472 3629615
61430C629615J6210p365k9580m9350o6002p9439q9467r5560r7752r7248r5441
$$ 3629615 3645825 3638460 3608880 3559530 3493528 3414089 3324622 3229062 3131310 3034062 2938621
61419B938621r2622q8277q2338p5352o7734n9644n1516m3843l6407k8615k0742
$$ 2938621 2845999 2757722 2675384 2600032 2532298 2472654 2421138 2377295 2340888 2312273 2291531
61408B291531j3893q443l314K599R000J4790J9549K3687K7543L1098L4418L7583
$$ 2291531 2277638 2269195 2265881 2268480 2277480 2292270 2311819 2335506 2363049 2394147 2428565 2466148
61396B466148M0212M1726M2174M2163M1865M0836L9069L7571L7216L7533L7307
$$ 2466148 2506360 2548086 2590260 2632423 2674288 2715124 2754193 2791764 2828980 2866513 2903820
61385B903820L6152L4784L3821L3013L1852L0247K8285K5876K3016J9958J6710
$$ 2903820 2939972 2974756 3008577 3041590 3073442 3103689 3131974 3157850 3180866 3200824 3217534
61374C217534J2830Q295M204J821R74J83j593l988o216q220j0305j2155j3033
$$ 3217534 3230364 3238659 3242863 3244684 3245658 3245841 3244248 3240260 3234044 3225824 3215519 3203364 3190331
61361C190331j2861j2517j2835j3666j4236j4236j4202j4733j5590j5905j5231
$$ 3190331 3177470 3164953 3152118 3138452 3124216 3109980 3095778 3081045 3065455 3049550 3034319
61350C034319j4007j2869j1952j1217j1032j1818j3230j4329j4606j4316j3748
$$ 3034319 3020312 3007443 2995491 2984274 2973242 2961424 2948194 2933865 2919259 2904943 2891195
61339B891195j2734j1031q666n636j657L530R899J7337K5629L4214M2468N0560
$$ 2891195 2878461 2867430 2858764 2853128 2851471 2855001 2864900 2882237 2907866 2942080 2984548 3035108
61327C035108N9397O9345P9513Q8852R7497J06341J15582J24391J31875J37711
$$ 3035108 3094505 3163850 3243363 3332215 3429712 3536053 3651635 3776026 3907901 4045612
61317D045612J41733J43511J42498J38228J30194J17808J00783P9489N5043K9081
$$ 4045612 4187345 4330856 4473354 4611582 4741776 4859584 4960367 5039856 5094899 5123980
61307E123980L304k1111m3690o4284q2631r8440j11605j22135j30068j35666j39455
$$ 5123980 5127284 5106173 5062483 4998199 4915568 4817128 4705523 4583388 4453320 4317654 4178199
61296D178199j41667j41864j39537j34953j29040j22550j15709j08639j01619
$$ 4178199 4036532 3894668 3755131 3620178 3491138 3368588 3252879 3144240 3042621
61287C042621r4740q7710q0178p2142o4009n6348m9531m3407l7415l1221k5156
$$ 3042621 2947881 2860171 2779993 2707851 2643842 2587494 2537963 2494556 2457141 2425920 2400764
61276B400764j9772j5134j0855o724k767J249N774J0706J5092J8040J9719K1158
$$ 2400764 2380992 2365858 2355003 2348279 2345512 2346761 2352535 2363241 2378333 2396373 2416092 2437250
61264B437250K3095K5223K6578K6447K4970K2963K1177J9676J7864J5206J1900
$$ 2437250 2460345 2485568 2512146 2538593 2563563 2586526 2607703 2627379 2645243 2660449 2672349
61253B672349Q840O767N509M194K301K23j434k895n061q323j2006j5289j8143
$$ 2672349 2681189 2687956 2693465 2697659 2699960 2700183 2698749 2695854 2690793 2682470 2670464 2655175 2637032
61240B637032k1044k4048k6628k8314k9160k9605l0115l0794l1242l0961l0089
$$ 2637032 2615988 2591940 2565312 2536998 2507838 2478233 2448118 2417324 2386082 2355121 2325032
61229B325032k9310k8873k8086k6294k3819k1403j9100j6542j3989j2194j1225
$$ 2325032 2295722 2266849 2238763 2212469 2188650 2167247 2148147 2131605 2117616 2105422 2094197
61218B094197j0340r215q396q257q296q023p776q024q381q007o625m510j777J587
$$ 2094197 2083857 2074642 2066246 2057989 2049693 2041670 2033894 2025870 2017489 2009482 2002857 1998347 1996570 1998157
61204A998157N208Q593J1893J5671J9847K3541K6204K8231L0190L2050L3706L5714
$$ 1998157 2003365 2011958 2023851 2039522 2059369 2082910 2109114 2137345 2167535 2199585 2233291 2269005
61192B269005L8693M2259M5257M7162M8545M9919N0729M9915M7042M2368L5995
$$ 2269005 2307698 2349957 2395214 2442376 2490921 2540840 2591569 2641484 2688526 2730894 2766889
61181B766889K7492J6350K488j3548l0488m6568o0334p1424q0239q6886r0885
$$ 2766889 2794381 2810731 2813219 2799671 2769183 2722615 2662281 2590857 2510618 2423732 2332847
61170B332847r1906r0350q7073q2950p8758p4873p0901o6125o0686n5653n1549
$$ 2332847 2240941 2150591 2063518 1980568 1901810 1826937 1756036 1689911 1629225 1573572 1522023
61159A522023m7496m2495l6993l2317k8869k5808k2457j9062j6088j3530j1217
$$ 1522023 1474527 1432032 1395039 1362722 1333853 1308045 1285588 1266526 1250438 1236908 1225691
61148A225691r189p428n735m054k541j136N03K467M453O348Q390J0515J2001J2218
$$ 1225691 1216502 1209074 1203339 1199285 1196744 1195608 1196111 1198578 1203031 1209379 1217769 1228284 1240285 1252503
61134A252503J1335R963Q354O359L935J370r11k607l788n028o919r229j0961j1539
$$ 1252503 1263838 1273801 1282155 1288514 1292449 1293819 1292908 1290301 1286513 1281485 1274566 1265337 1254376 1242837
61120A242837j1544j1900j2708j3429j3938j4697j5920j7143j7822j7881j7615
$$ 1242837 1231293 1219393 1206685 1193256 1179318 1164621 1148701 1131558 1113736 1095855 1078240
61109A078240j7295j7127j7286j7833j8702j9755k0676k0952k0303j9142j8186
$$ 1078240 1060945 1043818 1026532 1008699 989997 970242 949566 928614 908311 889169 870983
61098H70983j7544j6581j4866j2869j1367j0487r759q940q327q256q644r261j0130
$$ 870983 853439 836858 821992 809123 797756 787269 777510 768570 760243 751987 743343 734082 723952
61085G23952j1435j3060j4388j4743j4063j3074j2501j2177j1275r559p887p079
$$ 723952 712517 699457 685069 670326 656263 643189 630688 618511 607236 597677 589790 582711
61073E82711o678n560l619j957j232p22M55J980K902L137L493M407N483O253O701
$$ 582711 576033 570473 566854 564897 563665 562943 563398 565378 568280 571417 574910 579317 584800 591053 597754
61058E97754O895O828O714O857O979O334M834L529L507M655N879O208N401L818
$$ 597754 604649 611477 618191 625048 632027 638361 643195 646724 650231 654886 660765 666973 672374 676192
61044F76192K094P31l38j664l496n377o692p281p250o641n685m996n001n356n382
$$ 676192 678286 679017 678679 677015 673519 668142 661450 654169 646919 640278 634593 629597 624596 619240 613858
61029F13858m877m105l301k694k736l623m739n167m785m224l797l105j908o90
$$ 613858 608981 604876 601575 598881 596145 592522 587783 582616 577831 573607 569810 566705 564797 564107
61015E64107o5j8j07r7j4J76N93J209J774K051K010J841J805K051K532L029L258
$$ 564107 564042 564024 563917 563820 563806 563982 564575 565784 567558 569609 571619 573460 575265 577316 579848 582877 586135
60998E86135L059K656K646L373M290M419L630L028L599M888N566N058M128L829
$$ 586135 589194 591850 594496 597869 602159 606578 610208 613236 616835 621723 627289 632347 636475 640304
60984F40304M458N591O663P375P878Q628R927J1475J2654J3221J3618J4499J6122
$$ 640304 644762 650353 657016 664391 672269 680897 690824 702299 714953 728174 741792 756291 772413
60971G72413J8128J9934K1366K2895K5010K7409K9271L0372L1424L3115L5326
$$ 772413 790541 810475 831841 854736 879746 907155 936426 966798 998222 1031337 1066663
60960A066663L7689M0314M3426M6785N0058N3384N6977O0509O3541O6382O9870
$$ 1066663 1104352 1144666 1188092 1234877 1284935 1338319 1395296 1455805 1519346 1585728 1655598
60949A655598P4442P9831Q5376R0325R4291R7989J03109J10924J21546J34871
$$ 1655598 1730040 1809871 1895247 1985572 2079863 2177852 2280961 2391885 2513431 2648302
60939B648302J51266J70545J91341K12763K35918K62442K92377L25020L61134
$$ 2648302 2799568 2970113 3161454 3374217 3610135 3872577 4164954 4489974 4851108
60930D851108M02403M49335N01633N60210O26696P01788P86806Q86263J005079
$$ 4851108 5253511 5702846 6204479 6764689 7391385 8093173 8879979 9766242 10771321
60921A0771321J143604J299780J473701J656055J801212J821648J635197J237795
$$ 10771321 11914925 13214705 14688406 16344461 18145673 19967321 21602518 22840313
60913B2840313P29917K61277n7665j97532j85032o5326R8054K06084J47043j33971
$$ 22840313 23570230 23831507 23773842 23576310 23391278 23325952 23424006 23630090 23777133 23643162
60903B3643162n83639j066971j452100j676858j750727j715453j612480j474229
$$ 23643162 23059523 21992552 20540452 18863594 17112867 15397414 13784934 12310705
60895A2310705j324880j179238j042948r17025q01805o97283o02986n19222m47147
$$ 12310705 10985825 9806587 8763639 7846614 7044809 6347526 5744540 5225318 4778171
60886D778171l86908l36933k95397k61062k32511k07991j86514j67935j51712
$$ 4778171 4391263 4054330 3758933 3497871 3265360 3057369 2870855 2702920 2551208
60877B551208j36788j22938j10837j00520r1145q2662p6251p2321o9386o5820
$$ 2551208 2414420 2291482 2180645 2080125 1988980 1906318 1830067 1757746 1688360 1622540
60867A622540o1750n8226n5357n2309m8703m5085m2160m0153l8724l7162l4961
$$ 1622540 1560790 1502564 1447207 1394898 1346195 1301110 1258950 1218797 1180073 1142911 1107950
60856A107950l2511l0829l0348l0318k9682k8161k6180k4231k2598k1391k0527
$$ 1107950 1075439 1044610 1014262 983944 954262 926101 899921 875690 853092 831701 811174
60845H11174j9811j9173j8580j7728j6299j4524j3020j2034j1344j0971j1259
$$ 811174 791363 772190 753610 735882 719583 705059 692039 680005 668661 657690 646431
60834F46431j2038j2363j1568j0139r132q985r233r131q326p111o168n954o266
$$ 646431 634393 622030 610462 600323 591191 582206 572973 563842 555516 548405 542237 536283 530017
60821E30017o579o617o315n497m177l025k818l400l793l434k709k140j715j201
$$ 530017 523438 516821 510506 505009 500832 497807 494989 491589 487796 484362 481653 479513 477798 476597
60807D76597o14j19J49Q1j41J00J217K693L661M113M742N611N996N629N187N210
$$ 476597 475983 475864 476013 476094 475953 476053 477270 479963 483624 487737 492479 498090 504086 509715 514902 520112
60791E20112N481N792O370P079P224O660O216O426O680O287N509M769L748K190
$$ 520112 525593 531385 537755 544834 552058 558718 564934 571360 578040 584327 589836 594605 598353 600543
60777F00543Q28M07L72m14k050l699m956n995o635o488n960o023o814p387p067
$$ 600543 601371 601778 602150 601736 599686 595987 591031 585036 578401 571913 565953 559930 553116 545729 538662
60762E38662o208n448m942m657m659m739m333l231j968j176q84p20n15l64l09
$$ 538662 532454 527006 522064 517407 512748 508009 503676 500445 498477 497301 496417 495697 495182 494818 494509
60747D94509j88K30J033J954K487K404K081K056K338K521K499K673L329M292N230
$$ 494509 494321 494551 495584 497538 500025 502429 504510 506566 508904 511425 513924 516597 519926 524218 529448
60732E29448N958O335O256O000O181O999P822P902P368P063P452Q128Q497Q518
$$ 529448 535406 541741 547997 553997 560178 567177 574999 582901 590269 597332 604784 612912 621409 629927
60718F29927Q399P967O868N353M178L542K712J153m42r99o29o09j685l155l883
$$ 629927 638326 646293 653161 658514 662692 666234 668946 670099 669657 668658 668029 667420 665735 662580 658697
60703F58697l621k986k584k583k877l273l642m050m560m902m702m106l690l609
$$ 658697 655076 652090 649506 646923 644046 640773 637131 633081 628521 623619 618917 614811 611121 607512
60689F07512l423k973k813l286l804l658l036k560k204j531p66p11j469k063j622
$$ 607512 604089 601116 598303 595017 591213 587555 584519 581959 579755 578224 577458 576747 575278 573215 571593
60674E71593m64L35J64n63q86k25J070K061K218J918J859K213K620K775K642K250
$$ 571593 571129 571464 571628 571065 570179 569954 571024 573085 575303 577221 579080 581293 583913 586688 589330 591580
60658E91580J714J335J290J329J048M07l58j139j848k138j866j726k697m769o815
$$ 591580 593294 594629 595919 597248 598296 598703 598345 597206 595358 593220 591354 589628 586931 582162 575347
60643E75347p951q450q983r497r397q553p541o903o626o484o483o671o672n964
$$ 575347 567396 558946 549963 540466 531069 522516 514975 508072 501446 494962 488479 481808 475136 469172
60629D69172m742m055m596n583n555m276l014k699k638j779m80nn67j046o69P9
$$ 469172 464430 460375 455779 450196 444641 440365 437351 434652 432014 430235 429755 429750 429183 428137 427468 427547
60613D27547M90O67J006J352J311R94Q97J266J951K670L110L048K726K889L986
$$ 427547 428037 428704 429710 431062 432373 433367 434264 435530 437481 440151 443261 446309 449035 451924 455910
60598D55910N476O343O238N758N602N884O358O968P872Q984R793R798R061Q215
$$ 455910 461386 467729 473967 479725 485327 491211 497569 504537 512409 521393 531186 540984 550045 558260
60584E58260P804P754P532O815N815N005M700M849N057M813L923K746J865J457
$$ 558260 566064 573818 581350 588165 593980 598985 603685 608534 613591 618404 622327 625073 626938 628395
60570F28395J206Q44N13M77O49O66L22k03n76o27n22n87r77j526j976k291k596
$$ 628395 629601 630445 630958 631435 632084 632750 633072 632869 632293 631666 631144 630557 629580 628054 626078 623787 621191
60553F21191k804k554j688o31r7l28p91p40n9O24O95K41k53p71j818l474m871
$$ 621191 618387 615833 614145 613514 613417 613089 612298 611558 611499 612123 612818 613059 612806 612035 610217 606743 601872
60536F01872n109m385l716l595l539l067k426k048j691p92N75J639J974K165L075
$$ 601872 596763 592378 588662 585067 581528 578461 576035 573987 572296 571504 572079 573718 575692 577857 580932
60521E80932M664N898N909N027M400M714N509N838N348M476L746L227K700K039
$$ 580932 585596 591494 597403 602430 606830 611544 617053 622891 628239 632715 636461 639688 642388 644427
60507F44427J292N74M7q9J35K78j65j172k153k610k655k726k960l143l158l040
$$ 644427 645719 646293 646340 646251 646386 646664 646499 645327 643174 640564 637909 635183 632223 629080 625922 622882
60491F22882k630j607j17J100J570J741K290L129L679L961M601N743O767P423
$$ 622882 620252 618645 618528 619628 621198 622939 625229 628358 632037 635998 640599 646342 653109 660532
60477F60532Q481J0698J3646J6180J7816J9105K0754K2778K4487K5051K4149K2202
$$ 660532 669013 679711 693357 709537 727353 746458 767212 789990 814477 839528 863677 885879
60465H85879J9822J6928J2785P109P72m934r307j2246j3713j3765j2822j1408
$$ 885879 905701 922629 935414 942523 943295 938361 929054 916808 903095 889330 876508 865100
60453H65100r785q161o927o134n151l438j445NR69K247M170O344Q576J1152J3983
$$ 865100 855315 847154 840227 834093 828942 825504 824059 824064 825033 827280 831450 837794 846370 857522 871505
60438H71505J6431J8261K0151K2747K5898K9058L1942L4339L5826L6230L5963
$$ 871505 887936 906197 926348 949095 974993 1004051 1035993 1070332 1106158 1142388 1178351
60427A178351L5419L4413L2780L1251L1144L3176L7030M2005M7745N4337O2047
$$ 1178351 1213770 1248183 1280963 1312214 1343358 1376534 1413564 1455569 1503314 1557651 1619698
60416A619698P1061Q1296R2374J03938J15964J28695J42216J56114J69406J80618
$$ 1619698 1690759 1772055 1864429 1968367 2084331 2213026 2355242 2511356 2680762 2861380
60406B861380J87863J88918J81382J63257J33793R4051M6598n268n7917j07385
$$ 2861380 3049243 3238161 3419543 3582800 3716593 3810644 3857242 3851974 3794057 3686672
60396C686672j49645j81493k01486k10315k10342k04418j94645j82134j67832
$$ 3686672 3537027 3355534 3154048 2943733 2733391 2528973 2334328 2152194 1984362
60387A984362j53060j38811j24953j10944r7249q5266p5690o7696o0114n2752
$$ 1984362 1831302 1692491 1567538 1456594 1359345 1274079 1198389 1130693 1070579 1017827
60377A017827m6146m0514l5633l1465k8242k5918k3932k1695j9136j6771j5240
$$ 1017827 971681 931167 895534 864069 835827 809909 785977 764282 745146 728375 713135
60366G13135j4670j4447j3806j2663j1593j1020j0730j0327r741r043q118o905
$$ 713135 698465 684018 670212 657549 645956 634936 624206 613879 604138 595095 586977 580072
60354E80072n729n057m944m998m838m406l896l500l165k629j799j005o46n82k44
$$ 580072 574343 569286 564342 559344 554506 550100 546204 542704 539539 536910 535111 534106 533460 532878 532634
60339E32634N31J215J312J063J093J606K229K532K421K066J700J501J579J986
$$ 532634 533165 534380 535692 536755 537848 539454 541683 544215 546636 548702 550402 551903 553482 555468
60325E55468K653L160K867J578L5p44o63n54r94j626j971k189k623l012k847k182
$$ 555468 558121 561281 564148 565726 565761 565017 564354 563800 562806 561180 559209 557020 554397 551385 548538 546356
60309E46356j538j091n18K45O54J56j050k050j988q00P40J741K021K114K461K900
$$ 546356 544818 543727 543209 543454 544108 544264 543214 541164 539176 538376 539116 540857 542878 544992 547453 550353
60293E50353L066L017L158L670M301M735M962N244N786O439O812O674O209N695
$$ 550353 553419 556436 559594 563264 567565 572300 577262 582506 588292 594731 601543 608217 614426 620121
60279F20121N134M387L561K917K522K347K539L148L669L478K746K342K717L439
$$ 620121 625255 629642 633203 636120 638642 640989 643528 646676 650345 653823 656569 658911 661628 665067
60265F65067L983M252M125L259J748L47m19r04j647k614l569m606n706o318o010
$$ 665067 669050 673302 677427 680686 682434 682781 682362 681458 679811 677197 673628 669022 663316 656998 650988
60250F50988n196m600m396m420m755n382n684n105m029l242k806k227j527j203
$$ 650988 645792 641192 636796 632376 627621 622239 616555 611450 607421 604179 601373 599146 597619 596416
60236E96416j215j004n38m52r80j505j503j201j030r67p36k64L45R48J339J441
$$ 596416 595201 594197 593659 593207 592227 590722 589219 588018 586988 586021 585285 585021 585366 586314 587653 589094
60220E89094J635K485L952N322N998O075O033O251O929Q028R126R643R451Q967
$$ 589094 590729 593214 597166 602488 608486 614561 620594 626845 633774 641802 650928 660571 670022 678989
60206F78989Q632Q551Q737R276J0083J0723J0802J0417J0162J0646J1924J3347
$$ 678989 687621 696172 704909 714185 724268 734991 745793 756210 766372 777018 788942 802289
60194H02289J4156J4398J4972J6578J8961K1466K3838K6067K7957K9567L1706
$$ 802289 816445 830843 845815 862393 881354 902820 926658 952725 980682 1010249 1041955
60183A041955L5117L9384M3399M6784M9969N3128N6046N9003O2655O6816P0446
$$ 1041955 1077072 1116456 1159855 1206639 1256608 1309736 1365782 1424785 1487440 1554256 1624702
60172A624702P3098P5316P7207P7784P6398P3796P0873O7241O1990N5281M8149
$$ 1624702 1697800 1773116 1850323 1928107 2004505 2078301 2149174 2216415 2278405 2333686 2381835
60161B381835M1086L3755K5888J7656R305J097o430j2726j7618k1029k2610k2246
$$ 2381835 2422921 2456676 2482564 2500220 2509525 2510622 2504192 2491466 2473848 2452819 2430209 2407963
60149B407963k0576j8360j5530j1588o702j550L875J0361J8161K6340L3826M0603
$$ 2407963 2387387 2369027 2353497 2341909 2335207 2333657 2337532 2347893 2366054 2392394 2426220 2466823
60137B466823M7387N4488O1322O6981P0992P3586P5208P5772P4498P0687O4436
$$ 2466823 2514210 2568698 2630020 2697001 2767993 2841579 2916787 2992559 3067057 3137744 3202180
60126C202180N6335M6768L5994K4665J3578K873p870j8572k8347l6498m3238m8923
$$ 3202180 3258515 3305283 3341277 3365942 3379520 3382393 3374523 3355951 3327604 3291106 3247868 3198945
60114C198945n3092n4865n4098n1504m7668m2530l5890k7956j9227j0182j264
$$ 3198945 3145853 3090988 3036890 2985386 2937718 2895188 2859298 2831342 2812115 2801933 2800669
60103B800669P166J5152K3154L1393L9267M5721N0074N2294N2531N0926M7835
$$ 2800669 2807835 2822987 2846141 2877534 2916801 2962522 3012596 3064890 3117421 3168347 3216182
60092C216182M3745L8747L2541K5343J8336J2650Q202M128L30k092k109J65L949
$$ 3216182 3259927 3298674 3331215 3356558 3374894 3387544 3395746 3399874 3400204 3398112 3396003 3396168 3400117
60079C400117Q929J5422K3671L3364M3876N4793O6165P8277R1122J04204J17158
$$ 3400117 3409046 3424468 3448139 3481503 3525379 3580172 3646337 3724614 3815736 3919940 4037098
60068D037098J30380J44612J59781J74710J88185J99954K10464K19990K28316
$$ 4037098 4167478 4312090 4471871 4646581 4834766 5034720 5245184 5465174 5693490
60059E693490K34764K38211K37398K31838K22197K09373J93338J73328J49047
$$ 5693490 5928254 6166465 6403863 6635701 6857898 7067271 7260609 7433937 7582984
60050G582984J21184R0794N8710K5566q055m1713p5007j07182j37005j63150j84535
$$ 7582984 7704168 7794962 7853672 7879238 7871183 7829470 7754463 7647281 7510276 7347126 7162591
60039G162591k00370k10219k14182k12805k06699j96381j82526j66134j48301
$$ 7162591 6962221 6752002 6537820 6325015 6118316 5921935 5739409 5573275 5424974
60030E424974j29752j10723r1201p1313n1513l2451j4681J395J5352K6793L5695
$$ 5424974 5295222 5184499 5093298 5021985 4970472 4938021 4923340 4924735 4940087 4966880 5002575
60019E002575M2316M6605M7931M5775M0468L2903K3697J3130J656j0095k1859
$$ 5002575 5044891 5091496 5139427 5185202 5225670 5258573 5282270 5295400 5297056 5286961 5265102
60008E265102l3670m5138n5483o4496p2927q1334q9015r4737r8297j00705j02766
$$ 5265102 5231432 5186294 5130811 5066315 4993388 4912054 4823039 4728302 4630005 4529300 4426534
59997D426534j04081j03697j01267r7096r1366q3824p4408o3754n2748m1749l0542
$$ 4426534 4322453 4218756 4117489 4020393 3929027 3845203 3770795 3707041 3654293 3612544 3582002
59986C582002j9021p583L333J3787K4128L4332M3895N2394N9831O6231P1145P3817
$$ 3582002 3562981 3555398 3558731 3572518 3596646 3630978 3674873 3727267 3787098 3853329 3924474 3998291
59974C998291P3828P1286O6460N9373M9961L8480K5576J1914k173j6597l1119
$$ 3998291 4072119 4143405 4209865 4269238 4319199 4357679 4383255 4395169 4392996 4376399 4345280
59963D345280m5132n7862o8835p8053q5608r1116r3725r2863q8935q3096p6301
$$ 4345280 4300148 4242286 4173451 4095398 4009790 3918674 3824949 3732086 3643151 3560055 3483754
59952C483754o8729o0115n0313l9501k8116j6762n850M904J6240K8241L9944N0551
$$ 3483754 3415025 3354910 3304597 3265096 3236980 3220218 3214368 3219272 3235512 3263753 3303697 3354248
59940C354248O0638P1314Q2338R2160R9864J06026J11166J14399J14395J10834
$$ 3354248 3414886 3486200 3568538 3660698 3760562 3866588 3977754 4092153 4206548 4317382
59930D317382J04039R3867Q0225O4351M8265L2754J6932Jj7459l4302m9940o4060
$$ 4317382 4421421 4515288 4595513 4659864 4708129 4740883 4757815 4757816 4740357 4706055 4656115 4592055
59918D592055p5936q4787r0434r3081r2691q9196q2953p4439o3766n1114l7542
$$ 4592055 4516119 4431332 4340898 4247817 4155126 4065930 3982977 3908538 3844772 3793658 3756116
59907C756116k4517j2541q53J1235K3267L4293M4093N3133O1526O8670P3979P7449
$$ 3756116 3731599 3719058 3718205 3729440 3752707 3787000 3831093 3884226 3945752 4014422 4088401 4165850
59895D165850P9264P9286P7413P4235P0732O7280O3302N8179N2206M6411M1576
$$ 4165850 4245114 4324400 4401813 4476048 4546780 4614060 4677362 4735541 4787747 4834158 4875734
59884D875734L7747L4683L2528L1945L3654L7864M4185N2170O1932P4016Q8549
$$ 4875734 4913481 4948164 4980692 5012637 5046291 5084155 5128340 5180510 5242442 5316458 5405007
59873E405007J04748J21430J37898J54131J70288J86206K01144K13740K22401
$$ 5405007 5509755 5631185 5769083 5923214 6093502 6279708 6480852 6694592 6916993
59864F916993K26107K24667K17781K04111J81972J51107J13201P0507K4602k3136
$$ 6916993 7143100 7367767 7585548 7789659 7971631 8122738 8235939 8306446 8331048 8307912
59854H307912p0439j14314j52305j83233k06855k23249k32634k35416k32251k24058
$$ 8307912 8237473 8123159 7970854 7787621 7580766 7357517 7124883 6889467 6657216 6433158
59844F433158k11914j96740j79159j59806j39562j19159r8666p7831n6955l7009
$$ 6433158 6221244 6024504 5845345 5685539 5545977 5426818 5328152 5250321 5193366 5156357
59834E156357j8640j457J5250L1303M5610N7397O6896P4564P9895Q1510P8366
$$ 5156357 5137717 5136260 5151510 5182813 5228423 5285820 5352716 5427280 5507175 5588685 5667051
59823E667051P0438N8150M1608K0809l585l0163n7446q4336j09864j32877j52218
$$ 5667051 5737489 5795639 5837247 5858056 5854471 5824308 5766862 5682526 5572662 5439785 5287567
59812E287567j67219j77834j84417j87398j87089j83661j77335j68606j58284
$$ 5287567 5120348 4942514 4758097 4570699 4383610 4199949 4022614 3854008 3695724
59803C695724j47331j36524j26140j15846j05149r4116q3441p3625o4346n5011
$$ 3695724 3548393 3411869 3285729 3169883 3064734 2970618 2887177 2813552 2749206 2694195
59793B694195m5705l7153k9813k3625j8640j5182j3146j1826j0842j0671j1688
$$ 2694195 2648490 2611337 2581524 2557899 2539259 2524077 2510931 2499105 2488263 2477592 2465904
59782B465904j3116j3691j3160j2478j2522j3213j3946j4381j4693j5375j6877
$$ 2465904 2452788 2439097 2425937 2413459 2400937 2387724 2373778 2359397 2344704 2329329 2312452
59771B312452j9110k1213k2257k2216k1965k2283k3183k4224k4970k5007k3856
$$ 2312452 2293342 2272129 2249872 2227656 2205691 2183408 2160225 2136001 2111031 2086024 2062168
59760B062168k1309j7624j3361r169n739l519k293j364k60J113L082O290J0770
$$ 2062168 2040859 2023235 2009874 2000705 1994966 1991447 1989154 1987790 1987530 1988643 1991725 1998015 2008785
59747B008785J5456J9317K2635K6501L1180L5666L8930M0993M2470M3526M3645
$$ 2008785 2024241 2043558 2066193 2092694 2123874 2159540 2198470 2239463 2281933 2325459 2369104
59736B369104M2295L9552L6130L2816K9860K6898K3685K0695J8826J8511J9512
$$ 2369104 2411399 2450951 2487081 2519897 2549757 2576655 2600340 2621035 2639861 2658372 2677884
59725B677884K1543K4721K9222L4849M1301M8573N6854O6046P5699Q5442R5322
$$ 2677884 2699427 2724148 2753370 2788219 2829520 2878093 2934947 3000993 3076692 3162134 3257456
59714C257456J05753J17131J29479J42386J55407J68499J81998J95979K09566
$$ 3257456 3363209 3480340 3609819 3752205 3907612 4076111 4258109 4454088 4663654
59705D663654K20717K26565K23932K09940J82661J41891Q9855L1397k6933p8803
$$ 4663654 4884371 5110936 5334868 5544808 5727469 5869360 5959215 5990612 5963679 5884876
59695E884876j19860j48296j64346j69690j66912j58597j46458j31345j14041
$$ 5884876 5765016 5616720 5452374 5282684 5115772 4957175 4810717 4679372 4565331
59686D565331r5648p7169n9214m2140k6074j0589M983K0595L5404M8978O2051
$$ 4565331 4469683 4392514 4333300 4291160 4265086 4254497 4259480 4280075 4315479 4364457 4426508
59675D426508P5454Q8972J02089J15397J30109J46242J62428J77864J93408K10293
$$ 4426508 4501962 4590934 4693023 4808420 4938529 5084771 5247199 5425063 5618471 5828764
59665E828764K28563K47540K67188K88087L10266L33015L55850L78951M02440
$$ 5828764 6057327 6304867 6572055 6860142 7170408 7503423 7859273 8238224 8640664
59656H640664M25711M47792M67874M85175M98580N06888N09314N05478M95093
$$ 8640664 9066375 9514167 9982041 10467216 10965796 11472684 11981998 12487476 12982569
59647A2982569M78279M56359M31997M08120L86702L68638L54337L43865L36527
$$ 12982569 13460848 13917207 14349204 14757324 15144026 15512664 15867001 16210866 16547393
59638A6547393L30732L24519L15932L03028K84172K58782K27543J91587J51763
$$ 16547393 16878125 17202644 17518576 17821604 18105776 18364558 18592101 18783688 18935451
59629A8935451J09027O5151K2565j6463n0068p6581r4708j04012j04810r7504
$$ 18935451 19044478 19109629 19132194 19115731 19065663 18989082 18894374 18790362 18685552 18588048
59619A8588048q2377n9964l1209K830M1106Q2482J25919J70777K16527K62144
$$ 18588048 18505671 18445707 18414498 18417328 18458434 18540916 18666835 18837612 19054139 19316283
59609A9316283L06210L47605L85531M18728M45096M62152M67387M58073M31479
$$ 19316283 19622493 19970098 20355629 20774357 21219453 21681605 22148992 22607065 23038544
59600B3038544L85804L20549K35978J33067J4788j12837k41828l64603m75370
$$ 23038544 23424348 23744897 23980875 24113942 24128730 24015893 23774065 23409462 22934092
59591B2934092n69840o44704o97888p29188p40402p34654p15302o85321o47583
$$ 22934092 22364252 21719548 21021660 20292472 19552070 18817416 18102114 17416793 16769210
59582A6769210o05515n63154n24508m93091m71918m63233m67558m82783n04202
$$ 16769210 16163695 15600541 15076033 14582942 14111024 13647791 13180233 12697450 12193248
59573A2193248n25603n41091n46972n42440n28577n06969m79520m48864m17527
$$ 12193248 11667645 11126554 10579582 10037142 9508565 9001596 8522076 8073212 7655685
59564G655685l86447l55283l24378k95343k69281k45604k23364k02708j84098
$$ 7655685 7269238 6913955 6589577 6294234 6024953 5779349 5555985 5353277 5169179
59555E169179j66988j50547j35114j21670j10211r9838r0252q1995p5292o9680
$$ 5169179 5002191 4851644 4716530 4594860 4484649 4384811 4294559 4212564 4137272 4067592
59545D067592o4926o1341n9103n8062n8187n9409o1033o2172o2817o3647o4734
$$ 4067592 4002666 3941325 3882222 3824160 3765973 3706564 3645531 3583359 3520542 3456895 3392161
59534C392161o5345o4968o3690o1513n8403n5038n2292m9710m5746l9973l3928
$$ 3392161 3326816 3261848 3198158 3136645 3078242 3023204 2970912 2921202 2875456 2835483 2801555
59523B801555k9153k5480k1960j8370j4806j0750n783o28L550O593R162J1520
$$ 2801555 2772402 2746922 2724962 2706592 2691786 2681036 2675253 2674625 2678175 2684768 2693930 2705450
59511B705450J3508J5422J7839K0644K3141K5139K7158K9493L1929L4471L7614
$$ 2705450 2718958 2734380 2752219 2772863 2796004 2821143 2848301 2877794 2909723 2944194 2981808
59500B981808M1586M5883M9930N3816N8218O3802P0714P8413Q5934R2702R9096
$$ 2981808 3023394 3069277 3119207 3173023 3231241 3295043 3365757 3444170 3530104 3622806 3721902
59489C721902J06035J14018J22830J31970J40921J49090J55940J61406J65756
$$ 3721902 3827937 3941955 4064785 4196755 4337676 4486766 4642706 4804112 4969868
59480D969868J69049J70909J70871J68694J64323J57777J48990J37659J23410
$$ 4969868 5138917 5309826 5480697 5649391 5813714 5971491 6120481 6258140 6381550
59471F381550J06491Q8125O9837N2481L6285K1471Q283l509j4298k3680l0469
$$ 6381550 6488041 6576166 6646003 6698484 6734769 6756240 6764523 6761014 6746716 6723036 6692567
59460F692567l4030l5031l4391l1850k6181j6668l880J1005K7161M4244O1881
$$ 6692567 6658537 6623506 6589115 6557265 6531084 6514416 6510536 6521541 6548702 6592946 6654827
59449F654827P9438R6151J11079J22709J28898J27757J18673J02226P9147M9847
$$ 6654827 6734265 6830416 6941495 7064204 7193102 7320859 7439532 7541758 7620905 7670752
59439G670752J5108k3303o3210j02879j40836j75185k03840k25471k39805k47058
$$ 7670752 7685860 7662557 7599347 7496468 7355632 7180447 6976607 6751136 6511331 6264273
59429F264273k47634k42344k32425k19084k03351j86224j68489j50365j31872
$$ 6264273 6016639 5774295 5541870 5322786 5119435 4933211 4764722 4614357 4482485
59420D482485j13556r6196p9729o3269m6522l0414j5756k009J1932K6147L9676
$$ 4482485 4368929 4272733 4193004 4129735 4083213 4052799 4037043 4035034 4046966 4073113 4112789
59409D112789N1926O3236P4112Q4564R4303J03029J10287J15457J18101J18065
$$ 4112789 4164715 4227951 4302063 4386627 4480930 4583959 4694246 4809703 4927804 5045869
59399E045869J15183J09085R9356Q5658O7828M6200K1799m127l0735n7355q2861
$$ 5045869 5161052 5270137 5369493 5455151 5522979 5569179 5590978 5586851 5556116 5498761 5415900
59388E415900j05912j25854j42802j56637j66665j72558j74991j74832j72267
$$ 5415900 5309988 5184134 5041332 4884695 4718030 4545472 4370481 4195649 4023382
59379D023382j67283j60537j52989j44988j36394j27378j18405j09547j00622
$$ 4023382 3856099 3695562 3542573 3397585 3261191 3133813 3015408 2905861 2805239
59370B805239r1939q4045p6693o8969o0771n3227m7178m2017l6653l1000k5790
$$ 2805239 2713300 2629255 2552562 2483593 2422822 2369595 2322417 2280400 2243747 2212747 2186957
59359B186957k1356j7405j3647r802n376k53M575P973J0398J3628J8246K2252
$$ 2186957 2165601 2148196 2134549 2124747 2119371 2119118 2123693 2131666 2142064 2155692 2173938 2196190
59347B196190K2974J9886J4924J0418P508O393P135R663J3558J8335K3869L0036
$$ 2196190 2219164 2239050 2253974 2264392 2271900 2278293 2285428 2295091 2308649 2326984 2350853 2380889
59335B380889L5889L9733M0478L8975L7620L8521M2111M7554N4041O1353O9440
$$ 2380889 2416778 2456511 2496989 2535964 2573584 2612105 2654216 2701770 2755811 2817164 2886604
59324B886604P8051Q6915R6051J05750J16328J27922J40363J53331J66737J80865
$$ 2886604 2964655 3051570 3147621 3253371 3369699 3497621 3637984 3791315 3958052 4138917
59314D138917J95976K11986K28749K46461K65462K85723L06895L28652L50510
$$ 4138917 4334893 4546879 4775628 5022089 5287551 5573274 5880169 6208821 6559331
59305F559331L71355L89627M04058M13824M18024M15661M06433L91123L70925
$$ 6559331 6930686 7320313 7724371 8138195 8556219 8971880 9378313 9769436 10140361
59296A0140361L46753L19486K90520K61605K34080K08230J83267J57983J31714
$$ 10140361 10487114 10806600 11097120 11358725 11592805 11801035 11984302 12142285 12273999
59287A2273999J04581P6560M6457J2498k6076o8495j13486j59951k06457k50902
$$ 12273999 12378580 12455140 12501597 12514095 12488019 12419524 12306038 12146087 11939630 11688728
59277A1688728k91308l26398l54955l75430l86891l90072l86761l78460l66106
$$ 11688728 11397420 11071022 10716067 10340637 9953746 9563674 9176913 8798453 8432347
59268H432347l50680l33297l14803k95826k77008k58814k41348k24833k09834
$$ 8432347 8081667 7748370 7433567 7137741 6860733 6601919 6360571 6135738 5925904
59259E925904j96489j84034j71835j60512j51057j43152j35433j27317j19402
$$ 5925904 5729415 5545381 5373546 5213034 5061977 4918825 4783392 4656075 4536673
59250D536673j12043j04702r7130r0084q4170p8778p2867o6277n9633n3330m7233
$$ 4536673 4424630 4319928 4222798 4132714 4048544 3969766 3896899 3830622 3770989 3717659 3670426
59239C670426m1069l4674k8089k1774j6371j1860p262j748M335J0026J5109K0255
$$ 3670426 3629357 3594683 3566594 3544820 3528449 3516589 3509327 3507579 3511914 3521940 3537049 3557304
59227C557304K5956L1938L7773M3446M9175N4955O0619O6020P0996P5258P8556
$$ 3557304 3583260 3615198 3652971 3696417 3745592 3800547 3861166 3927186 3998182 4073440 4151996
59216D151996Q0872Q2263Q2471Q0904P7124P1367O4427N7009M9275M0996L1914
$$ 4151996 4232868 4315131 4397602 4478506 4555630 4626997 4691424 4748433 4797708 4838704 4870618
59205D870618K1654R655m426k0086l6181n1825o6785q0912r3584j04032j11947
$$ 4870618 4892272 4901927 4897501 4877415 4841234 4789409 4722624 4641712 4548128 4444096 4332149
59194D332149j17525j21061j22773j22775j20985j17193j11559j04837r7769r0415
$$ 4332149 4214624 4093563 3970790 3848015 3727030 3609837 3498278 3393441 3295672 3205257
59184C205257q2485p4194o6207n8682n1074m3145l5589k9088k3142j6597r235
$$ 3205257 3122772 3048578 2982371 2923689 2872615 2829470 2793881 2764793 2741651 2725054 2715819
59173B715819k088M044R710J6051K3424L1304L9259M7431N6145O5571P5770Q6631
$$ 2715819 2713731 2717775 2727485 2743536 2766960 2798264 2837523 2884954 2941099 3006670 3082440 3169071
59161C169071R7757J08904J20516J33329J47326J61675J75907J90466K05687K20753
$$ 3169071 3266828 3375732 3496248 3629577 3776903 3938578 4114485 4304951 4510638 4731391
59151D731391K34258K45350K53655K58346K58074K51764K38791K18435J89957
$$ 4731391 4965649 5210999 5464654 5723000 5981074 6232838 6471629 6690064 6880021
59142F880021J53556J10871O4209J5557l3586q1793j27383j68240k01982k26730
$$ 6880021 7033577 7144448 7208657 7224214 7190628 7108835 6981452 6813212 6611230 6384500
59132F384500k42066k49060k49231k43753k33680k20424k05514j89936j74018
$$ 6384500 6142434 5893374 5644143 5400390 5166710 4946286 4740772 4550836 4376818
59123D376818j57841j41604j25676j10548r6746q4570p3889o4276n5475m7666
$$ 4376818 4218977 4077373 3951697 3841149 3744403 3659833 3585944 3521668 3466193 3418527
59113C418527m1247l6258l2177k8459k5329k3665k3846k5008k5826k5946k6304
$$ 3418527 3377280 3341022 3308845 3280386 3255057 3231392 3207546 3182538 3156712 3130766 3104462
59102C104462k7942l0866l4075l6474l7693l8246l8914l9829m0296l9659l8140
$$ 3104462 3076520 3045654 3011579 2975105 2937412 2899166 2860252 2820423 2780127 2740468 2702328
59091B702328l6463l4884l3107l1012k8765k6209k2839j8682j4535j0990p731
$$ 2702328 2665865 2630981 2597874 2566862 2538097 2511888 2489049 2470367 2455832 2444842 2437111
59080B437111m241o69K511N332Q251J1435J4676J7860K1035K4104K6931K9692
$$ 2437111 2432870 2432201 2434712 2440044 2448295 2459730 2474406 2492266 2513301 2537405 2564336 2594028
59068B594028L2625L5368L7149L7783L8152L9349M1556M3960M5579M5925M5105
$$ 2594028 2626653 2662021 2699170 2736953 2775105 2814454 2856010 2899970 2945549 2991474 3036579
59057C036579M3629M2160M1160M0507L9548L7790L5522L3542L2253L1275L0201
$$ 3036579 3080208 3122368 3163528 3204035 3243583 3281373 3316895 3350437 3382690 3413965 3444166
59046C444166K9364K9481L0579L1857L2680L3296L4306L5843L7665L9772M2423
$$ 3444166 3473530 3503011 3533590 3565447 3598127 3631423 3665729 3701572 3739237 3779009 3821432
59035C821432M5590M8739N1223N2622N2618N0794M6577L9239K8010J2548o442
$$ 3821432 3867022 3915761 3966984 4019606 4072224 4123018 4169595 4208834 4236844 4249392 4242950
59024D242950k7264m8161o8165q6924j03898j18142j28962j36460j41161j43388
$$ 4242950 4215686 4167525 4099360 4012436 3908538 3790396 3661434 3524974 3383813 3240425
59014C240425j43201j40755j36363j30340j23131j15491j08061j00845r3576q6596
$$ 3240425 3097224 2956469 2820106 2689766 2566635 2451144 2343083 2242238 2148662 2062066
59004B062066q0657p5776p0978o5636o0315n5786n1833m7754m3578l9821l6524
$$ 2062066 1981409 1905633 1834655 1769019 1708704 1652918 1601085 1553331 1509753 1469932 1433408
58993A433408l3387l0673k8843k7366k4995k1491j8063j5773j4421j3395j2646
$$ 1433408 1400021 1369348 1340505 1313139 1288144 1266653 1248590 1232817 1218396 1205001 1192355
58982A192355j2168j1338r674p727o394n638m667l175j649n11M66J767L577N608
$$ 1192355 1180187 1168849 1159175 1151448 1145054 1139416 1134749 1131574 1129925 1129414 1129880 1131647 1135224 1140832
58968A140832P314Q314Q772R212R814J0232J0245J0074R769Q837P085N255M077
$$ 1140832 1148146 1156460 1165232 1174444 1184258 1194490 1204735 1214809 1224578 1233415 1240500 1245755 1249832
58955A249832L099J406o41j504n03J209K135K130K057K384K917L561M395N117
$$ 1249832 1252931 1254337 1253696 1252192 1251689 1252898 1255033 1257163 1259220 1261604 1264521 1268082 1272477 1277594
58941A277594N116M387L690L401K677M28l113o441q495r706j1083j2778j4077
$$ 1277594 1282710 1287097 1290787 1294188 1296865 1297293 1294180 1287739 1279244 1269538 1258455 1245677 1231600
58928A231600j4459j4055j3142j1844j0366r070q040o978n640m070k377o40Q76
$$ 1231600 1217141 1203086 1189944 1178100 1167734 1158664 1150624 1143646 1138006 1133936 1131559 1130919 1131795
58915A131795J874K570L624N303P063Q245Q832R231R768J0652J2044J3704J4896
$$ 1131795 1133669 1136239 1139863 1145166 1152229 1160474 1169306 1178537 1188305 1198957 1211001 1224705 1239601
58902A239601J5158J4945J5128J5951J6943J7682J8147J8396J8365J8214J8554
$$ 1239601 1254759 1269704 1284832 1300783 1317726 1335408 1353555 1371951 1390316 1408530 1427084
58891A427084K0051K2765K5938K8546L0235L1655L3662L6208L8374L9564M0175
$$ 1427084 1447135 1469900 1495838 1524384 1554619 1586274 1619936 1656144 1694518 1734082 1774257
58880A774257M0971M2238M3939M6168M8977N1952N4604N7063O0011O3893O8482
$$ 1774257 1815228 1857466 1901405 1947573 1996550 2048502 2103106 2160169 2220180 2284073 2352555
58869B352555P3222P7844Q2625Q8099R4467J01283J08032J14920J22612J31173
$$ 2352555 2425777 2503621 2586246 2674345 2768812 2870095 2978127 3093047 3215659 3346832
58859C346832J39944J48739J58393J69657J82081J94737K07549K21114K35554
$$ 3346832 3486776 3635515 3793908 3963565 4145646 4340383 4547932 4769046 5004600
58850E004600K50329K65142K80253K95827L11592L27266L42779L57858L71731
$$ 5004600 5254929 5520071 5800324 6096151 6407743 6735009 7077788 7435646 7807377
58841G807377L83360L91859L96670L97506L93838L84315L67027L40697L05337
$$ 7807377 8190737 8582596 8979266 9376772 9770610 10154925 10521952 10862649 11167986
58832A1167986K61501K09555J50299Q5826J8882m8406j14404j76979k33638k82708
$$ 11167986 11429487 11639042 11789341 11875167 11894049 11845643 11731239 11554260 11320622 11037914
58822A1037914l23515l55428l77736l90730l96016l95293l89503l79471l66580
$$ 11037914 10714399 10358971 9981235 9590505 9194489 8799196 8409693 8030222 7663642
58813G663642l52146l36581l19748l01887k83825k66462k50359k35570k21628
$$ 7663642 7311496 6974915 6655167 6353280 6069455 5802993 5552634 5317064 5095436
58804E095436k07935j94358j81322j69221j58067j47665j37801j28113j18313
$$ 5095436 4887501 4693143 4511821 4342600 4184533 4036868 3899067 3770954 3652641
58795C652641j08762j00337r3425q7339q1031p4120o7003o0214n3982m8219m2608
$$ 3652641 3543879 3443542 3350117 3262778 3181747 3107627 3040624 2980410 2926428 2878209 2835601
58784B835601l6830l0898k5118j9701j4588r658m837M1N123J0190J4829J9037
$$ 2835601 2798771 2767873 2742755 2723054 2708466 2698808 2693971 2694012 2699135 2709325 2724154 2743191
58772B743191K3276K7765L2263L6788M1969M8167N4674O0439O5370P0375P6204
$$ 2743191 2766467 2794232 2826495 2863283 2905252 2953419 3008093 3068532 3133902 3204277 3280481
58761C280481Q2880R0255R8400J07250J16365J25510J35120J45752J57309J69292
$$ 3280481 3363361 3453616 3552016 3659266 3775631 3901141 4036261 4182013 4339322 4508614
58751D508614J81676J94924K09047K23297K37251K51621K67385K84367L01424
$$ 4508614 4690290 4885214 5094261 5317558 5554809 5806430 6073815 6358182 6659606
58742F659606L17807L33512L48195L60714L70193L76739L80406L79985L73530
$$ 6659606 6977413 7310925 7659120 8019834 8390027 8766766 9147172 9527157 9900687
58733I900687L59695L37874L07418K67637K18643J61603R8252L0640l8727j07146
$$ 9900687 10260382 10598256 10905674 11173311 11391954 11553557 11651809 11682449 11643722 11536576
58723A1536576j72242k31958k84266l27558l61335l86089m02553m11453m13719
$$ 11536576 11364334 11132376 10848110 10520552 10159217 9773128 9370575 8959122 8545403
58714H545403m10292m01888l89457l74608l58825l42406l25044l07179k89841
$$ 8545403 8135111 7733223 7343766 6969158 6610333 6267927 5942883 5635704 5345863
58705E345863k73130k56126k38582k21640k06359j92468j79222j66653j55224
$$ 5345863 5072733 4816607 4578025 4356385 4150026 3957558 3778336 3611683 3456459
58696C456459j44829j34925j25305j16131j07530r9642r2741q6791q1254p5688
$$ 3456459 3311630 3176705 3051400 2935269 2827739 2728097 2635356 2548565 2467311 2391623
58686B391623p0279o5301o0536n5659n0891m6679m3037l9687l6612l3905l1336
$$ 2391623 2321344 2256043 2195507 2139848 2088957 2042278 1999241 1959554 1922942 1889037 1857701
58675A857701k8682k6309k4896k4608k5008k5678k6467k7129k7272k6822k6181
$$ 1857701 1829019 1802710 1777814 1753206 1728198 1702520 1676053 1648924 1621652 1594830 1568649
58664A568649k5761k5529k5174k4592k4116k4245k5125k6346k7359k8038k8673
$$ 1568649 1542888 1517359 1492185 1467593 1443477 1419232 1394107 1367761 1340402 1312364 1283691
58653A283691k9444l0213l0825l1219l1188l0439k9110k7853k7064k6354k5102
$$ 1283691 1254247 1224034 1193209 1161990 1130802 1100363 1071253 1043400 1016336 989982 964880
58642I64880k3259k1332j9771j8686j7983j7396j6534j5175j3545j2126j1284
$$ 964880 941621 920289 900518 881832 863849 846453 829919 814744 801199 789073 777789
58631G77789j1102j1406j1795j1872j1605j1296j1070j0659r860q882p978p006
$$ 777789 766687 755281 743486 731614 720009 708713 697643 686984 677124 668242 660264 653258
58619F53258n631l826j910k24J028J799K290K863L625M240M417M456N002O176
$$ 653258 647627 643801 641891 641667 642695 644494 646784 649647 653272 657512 661929 666385 671387 677563
58605F77563P280P504O776N727M772L507J290j685m312n728o171o453o949p487
$$ 677563 684843 692347 699123 704850 709622 713129 714419 712734 708422 702694 696523 690070 683121 675634
58591F75634p862p924p381o109m526l166k003p33M57J112J438K232L817N685P356
$$ 675634 667772 659848 652467 646358 641832 638666 636663 635930 636387 637499 638937 641169 644986 650671 658027
58576F58027Q917J0507J1895J2864J3537J4139J4865J5982J7589J9260K0527K1708
$$ 658027 666944 677451 689346 702210 715747 729886 744751 760733 778322 797582 818109 839817
58564H39817K3500K5775K7655K8950L0532L3001L5871L8625M1647M5504M9965
$$ 839817 863317 889092 916747 945697 976229 1009230 1045101 1083726 1125373 1170877 1220842
58553A220842N4384N8552O2621O6655P0718P5012P9567Q4223Q9071R4289R9348
$$ 1220842 1275226 1333778 1396399 1463054 1533772 1608784 1688351 1772574 1861645 1955934 2055282
58542B055282J03219J05686J07533J09008J09000J06329J00887R2809Q1453O6264
$$ 2055282 2158501 2264187 2371720 2480728 2589728 2696057 2796944 2889753 2971206 3037470
58532C037470M7950K7867O765j4945l6196n5591p2374q6290r6839j03555j06730
$$ 3037470 3085420 3113287 3120052 3105107 3068911 3013320 2940946 2854656 2757817 2654262 2547532
58521B547532j07112j05130j01152r6095r0870q5386p8899p1326o3615n6865n1498
$$ 2547532 2440420 2335290 2234138 2138043 2047173 1961787 1882888 1811562 1747947 1691082 1639584
58510A639584m7114m2820l8073l3419k9959k7789k5789k3338k1169j9812j8341
$$ 1639584 1592470 1549650 1511577 1478158 1448199 1420410 1394621 1371283 1350114 1330302 1311961
58499A311961j5863j3312j2376j3189j4529j5870j7686j9973k1959k3444k5018
$$ 1311961 1296098 1282786 1270410 1257221 1242692 1226822 1209136 1189163 1167204 1143760 1118742
58488A118742k6780k7964k8079k7449k6495k5366k4421k4015k3669k2420k0255
$$ 1118742 1091962 1063998 1035919 1008470 981975 956609 932188 908173 884504 862084 841829
58477H41829j8282j7245j6693j5914j4896j4037j3524j3331j3255j2799j1658
$$ 841829 823547 806302 789609 773695 758799 744762 731238 717907 704652 691853 680195
58466F80195j0317r618r607r526q946q273p966p931p948q047q263q408q307p895
$$ 680195 669878 660260 650653 641127 632181 623908 615942 608011 600063 592016 583753 575345 567038 559143
58452E59143p148o248n591n225m554l174j665r03q84r59r14r07o84J41J188J722
$$ 559143 551995 545747 540156 534931 530377 527203 525538 524635 523751 522792 521878 520971 520287 520428 521616 523338
58436E23338J860K276K909L100L018L644N136O444O858O811O772O529O062O051
$$ 523338 525198 527474 530383 533483 536501 540145 545281 551725 558583 565394 572166 578695 584757 590808
58422E90808O749P220O438M512K302L81j169k495l942n751p445q181q031q141
$$ 590808 597557 604777 611215 615727 618029 618410 617241 614746 610804 605053 597608 589427 581396 573255
58408E73255r159j0206j0093q977q057p909p842o969n395m159m024m571m675l911
$$ 573255 564096 553890 543797 534820 526763 518854 511012 504043 498648 494489 490465 485894 481219 477308
58394D77308k986k541k174j273k00K64K44M72R69J153J238K203M200O132P168
$$ 477308 474322 471781 469607 468334 468134 468398 468642 469114 470083 471236 472474 474677 478877 485009 492177
58379D92177P619Q002Q216Q153Q208Q605Q951Q922Q781Q793Q775Q574Q401Q296
$$ 492177 499796 507798 516014 524167 532375 540980 549931 558853 567634 576427 585202 593776 602177 610473
58365F10473P750O298M013J324j248l122m006m299m565m701m298l577l145k911
$$ 610473 618223 624521 628534 629858 628610 625488 621482 617183 612618 607917 603619 600042 596897 593986
58351E93986k302j420q73m27Q54K917M513N081N535O612P734Q212Q392Q709Q582
$$ 593986 591684 590264 589391 588964 589818 592735 597248 602329 607864 614476 622210 630422 638814 647523 656105
58336F56105P298N303L574K274Q22j019k851m242n066n419n498n421n101m537
$$ 656105 663403 668706 672280 674554 675376 674357 671506 667264 662198 656779 651281 645860 640759 636222
58322F36222m084l923l563k556j439r81p97R1J397J782J052O18J324K292K627
$$ 636222 632138 628215 624652 622096 620657 619676 618879 618970 620367 622149 623201 623819 625143 627435 630062
58307F30062K829L633M611N025N184N859O994P882Q231Q332Q575R238J0351J1434
$$ 630062 632891 636524 641135 646160 651344 657203 664197 672079 680310 688642 697217 706455 716806 728240
58293G28240J1884J1760J1672J1827J1965J2107J2438J2567J2023J1358J1390
$$ 728240 740124 751884 763556 775383 787348 799455 811893 824460 836483 847841 859231
58282H59231J1446J0006P256N111M315L388J259r58j854j700j356o76O58J971
$$ 859231 870677 880683 887939 893050 897365 900753 902012 901054 899200 897500 896144 895468 896126 898097
58268H98097K573K907L662M660N633P000Q860J0287J0653J0748J1567J3009J4540
$$ 898097 900670 903577 907239 911899 917532 924532 933392 943679 954332 965080 976647 989656 1004196
58255A004196J6132J7605J8248J8007J7966J8750J9579J9802K0031K0784K1211
$$ 1004196 1020328 1037933 1056181 1074188 1092154 1110904 1130483 1150285 1170316 1191100 1212311
58244A212311K0330J8416J6179J3786J1610J0598J0789J0777R804R018R620J1109
$$ 1212311 1232641 1251057 1267236 1281022 1292632 1303230 1314019 1324796 1334600 1343618 1353238 1364347
58232A364347J2632J4458J6785J8538J8949J9071K0233K2191K4177K6492K9476
$$ 1364347 1376979 1391437 1408222 1426760 1445709 1464780 1485013 1507204 1531381 1557873 1587349
58221A587349L2160L3547L4136L4864L5643L6253L7416L9578M1922M3890M6286
$$ 1587349 1619509 1653056 1687192 1722056 1757699 1793952 1831368 1870946 1912868 1956758 2003044
58210B003044M9568N2663N4832N7048N9925O2116O2524O2420O3438O5143O6474
$$ 2003044 2052612 2105275 2160107 2217155 2277080 2339196 2401720 2464140 2527578 2592721 2659195
58199B659195O7870P0023P2108P3465P5401P9295Q4413Q9644R5621J03084J10870
$$ 2659195 2727065 2797088 2869196 2942661 3018062 3097357 3181770 3271414 3367035 3470119 3580989
58188C580989J17863J25220J34401J44606J54482J64566J75778J87441J99110
$$ 3580989 3698852 3824072 3958473 4103079 4257561 4422127 4597905 4785346 4984456
58179D984456K12270K27800K43853K58822K74106K91224L08743L25114L42043
$$ 4984456 5196726 5424526 5668379 5927201 6201307 6492531 6801274 7126388 7468431
58170G468431L61817L83763M06698M32207M61883M93952N26383N60579N98119
$$ 7468431 7830248 8214011 8620709 9052916 9514799 10008751 10535134 11095713 11693832
58161A1693832O36893O74859P14781P60786Q13110Q70746R35826J010409J092534
$$ 11693832 12330725 13005584 13720365 14481151 15294261 16165007 17100833 18111242 19203776
58152A9203776J181148J281497J400040J537869J695079J876855K088137K327102
$$ 19203776 20384924 21666421 23066461 24604330 26299409 28176264 30264401 32591503
58144C2591503K591993K889514L227949L607665M028653M501530N038563N637752
$$ 32591503 35183496 38073010 41300959 44908624 48937277 53438807 58477370 64115122
58136F4115122O286892O977969P707741Q478438R320523J0308117J1528623J3034115
$$ 64115122 70402014 77379983 85087724 93566162 102886685 113194802 124723425 137757540
58128A37757540J4808143J6688569J8201831J8484152J6573605J2036723N431241
$$ 137757540 152565683 169254252 187456083 205940235 222513840 234550563 239981804
58121B39981804j869569q382850j3168674j6002524j7149754j7069198j6224374
$$ 239981804 238112235 229729385 216560711 200558187 183408433 166339235 150114861
58114A50114861j4986993j3597667j2184156j0810186r506993q282472p134632
$$ 150114861 135127868 121530201 109346045 98535859 89028866 80746394 73611762
58107G3611762o068289n093183m210813l415283k703567k071904j507323j005692
$$ 73611762 67543473 62450290 58239477 54824194 52120627 50048723 48541400 47535708
58099D7535708o09306m11672n00759q81324j446761k028137k480696k740995k821301
$$ 47535708 46926402 46514730 46013971 45132647 43685886 41657749 39177053 36436058 33614757
58090C3614757k765944k617805k413414k186765j963626j754889j561779j385540
$$ 33614757 30848813 28231008 25817594 23630829 21667203 19912314 18350535 16964995
58082A6964995j228627j090760r69878q65483p77084p01468o35492n79588n34609
$$ 16964995 15736368 14645608 13675730 12810247 12033163 11331695 10696203 10116615 9582006
58073I582006m97286m62843m30459m02218l78144l56096l35408l16848k99743
$$ 9582006 9084720 8621877 8191418 7789200 7411056 7054960 6719552 6402704 6102961
58064F102961k82473k65135k48733k32592k15493j98567j84260j73124j64178
$$ 6102961 5820488 5555353 5306620 5074028 4858535 4659968 4475708 4302584 4138406
58055D138406j57495j53682j51527j48798j44826j40092j34131j26301j17887
$$ 4138406 3980911 3827229 3675702 3526904 3382078 3241986 3107855 2981554 2863667
58046B863667j10995j05833j01185r6792r3196q9965q6264q2496p9459p6597p3038
$$ 2863667 2752672 2646839 2545654 2448862 2355666 2265701 2179437 2096941 2017482 1940885 1867847
58035A867847o9359o6363o3146n8615n3920n0964m9292m6833m3231m0030l8013
$$ 1867847 1798488 1732125 1668979 1610364 1556444 1505480 1456188 1409355 1366124 1326094 1288081
58024A288081l6588l5505l5069l4898l4318l3691l3619l3362l1860k9744k8456
$$ 1288081 1251493 1215988 1180919 1146021 1111703 1078012 1044393 1011031 979171 949427 920971
58013I20971k7862k6718k4997k3765k3095k2047k0446j8867j7169j4863j2591
$$ 920971 893109 866391 841394 817629 794534 772487 752041 733174 716005 701142 688551
58002F88551j1469j1212j0631r653r184r288r271r160r421r547q682p296o549
$$ 688551 677082 665870 655239 645586 636402 627114 617843 608683 599262 589715 581033 573737 567188
57989E67188o433o182o004o534p133o736n959o270p395p723p026o500o252n098
$$ 567188 560755 554573 548569 542035 534902 528166 522207 515937 508542 500819 493793 487293 481041 475943
57975D75943l074j895k374l429m043m401m635m289l617l635m407m856m641m590
$$ 475943 472869 470974 468600 465171 461128 456727 452092 447803 444186 440551 436144 431288 426647 422057
57961D22057m853m468l278k461k441j986l17J426J849J194N55L33L13M08M93K76
$$ 422057 417204 412736 409458 406997 404556 402570 402253 403679 405528 406722 407277 407610 407923 408331 408824 409100
57945D09100r9p6L00K22n90j398j579j317q74k04L25j4j003j320l37Q18O47j063
$$ 409100 409001 408925 409225 409447 408857 407459 405880 404563 403689 403485 403810 403796 402793 401473 401136 401954 402601 401538
57927D01538l425n547o863p144o794o624o866o947o459n764n251m731l867k746
$$ 401538 398113 392566 385703 378559 371765 365141 358275 351328 344869 339105 333854 329123 325256 322510
57913C22510j710j056j006j469j805j437o34q8J37M24O55M46K06P63J858K237
$$ 322510 320800 319744 318738 317269 315464 314027 313393 313305 313442 313866 314521 314967 315173 315936 317794 320031
57897C20031J463N05R3k51j011j611j391p74o65j189j691j617r24P3Q42J027Q87
$$ 320031 321494 321999 322092 321841 320830 319219 317828 317054 316389 315200 313509 311892 310968 311041 311883 312910 313797
57880C13797J015J502J836J658J143N64J4l64n21q06j613k762l792m737n914p086
$$ 313797 314812 316314 318150 319808 320951 321515 321529 321165 320644 319838 318225 315463 311671 306934 301020 293934
57864B93934p684p751p793p793p343o635o277o104n315l984l234l535l975l586
$$ 293934 286250 278499 270706 262913 255570 248935 242658 236554 231239 227255 224021 220486 216511 212925
57850B12925k505j277j7J281K262K675K708K603K414K378K820L534L939L920L846
$$ 212925 210420 209143 209126 210407 212669 215344 218052 220655 223069 225447 228267 231801 235740 239660 243506
57835B43506L822L692L753M332M753L910K070P80P15R08N75J99J81k11j521k878
$$ 243506 247328 251020 254773 259105 263858 267768 269838 270618 271333 272241 272816 273015 273196 272985 271464 268586
57819B68586l178k674k297k188j951j780k239l163l716l393k364j035J97J011
$$ 268586 265408 262734 260437 258249 256298 254518 252279 249116 245400 242007 239643 238608 238805 239816
57805B39816J394J658J940K067K096K359K751K536J387N2m91j18N11P46L90k11
$$ 239816 241210 242868 244808 246875 248971 251330 254081 256617 258004 258056 257565 257447 257958 258704 259094 258883
57789B58883l79J03M06m23j941k653k052j248j222j575j641j655k021k226j596
$$ 258883 258504 258607 259013 258590 256649 253996 251944 250696 249474 247899 246258 244603 242582 240356 238760
57774B38760m85K12K79P6l56j193k106k401j883j132r42j674l008m200m800n166
$$ 238760 238275 238487 238766 238842 238486 237293 235187 232786 230903 229771 228829 227155 224147 219947 215147 209981
57758B09981n811o434o346n759n631o156o451o022n414m930l951k242q00n12q65
$$ 209981 204170 197736 191390 185631 180000 173844 167393 161371 155957 151027 147076 144834 144034 143522 142657
57743A42657q45l28K82J022K020K824K960K593K008J059j11o35JJ092J795K277
$$ 142657 141812 141484 141766 142788 144808 147632 150592 153185 155193 156252 156141 155506 155507 156599 158394 160671
57727A60671K941L385L193L048L772M822M975M061K849J647K55j004j527j544
$$ 160671 163612 166997 170190 173238 177010 181832 186807 190868 193717 195364 195619 194615 193088 191544
57713A91544j923k863l863m731n551n876n134l872l388l975m569m360l635k841
$$ 191544 189621 186758 182895 178164 172613 166737 161603 157731 154343 150368 145799 141439 137804 134963
57699A34963j842n79L68N17J73o3r1j24q7L65J286K227K656K551K414K575K601
$$ 134963 133121 132542 132910 133427 133600 133537 133446 133322 133235 133600 134886 137113 139769 142320 144734 147309 149910
57682A49910J874P30K54Q53J678J960K032K460K875K617J989J880K438L044L360
$$ 149910 151784 152514 152768 153621 155299 157259 159291 161751 164626 167243 169232 171112 173550 176594 179954
57667A79954L581L738L622L363L365L675L997M296M770N327N597N446N030M588
$$ 179954 183535 187273 190895 194258 197623 201298 205295 209591 214361 219688 225285 230731 235761 240349
57653B40349M494N135O289P043O937O682P095P818P985P710P897Q900J0234J1491
$$ 240349 244843 249978 256267 263310 270247 276929 284024 291842 299827 307537 315434 324334 334568 346059
57639C46059J2628J3483J3898J4252J5051J6139J6990J7608J8336J9046J9454
$$ 346059 358687 372170 386068 400320 415371 431510 448500 466108 484444 503490 522944
57628E22944J9997K1417K3600K5756K7762L0266L3521L7155M1139M5953N1604
$$ 522944 542941 564358 587958 613714 641476 671742 705263 742418 783557 829510 881114
57617H81114N7368O2851O8501P4861Q1923Q9413R7072J04587J11791J18919J25874
$$ 881114 938482 1001333 1069834 1144695 1226618 1316031 1413103 1517690 1629481 1748400 1874274
57606A874274J31242J32596J27835J15823R6430P1092M3097J5995q593l0847n0731
$$ 1874274 2005516 2138112 2265947 2381770 2478200 2549292 2592389 2608384 2599791 2568944 2518213
57595B518213o7401q0526r0706r8095j02003j02395j00698r8297r5146r0511q4411
$$ 2518213 2450812 2370286 2279580 2181485 2079482 1977087 1876389 1778092 1682946 1592435 1508024
57584A508024p7652p1051o5067n9717n4371m8321m1841l6078l1613k7847k4078
$$ 1508024 1430372 1359321 1294254 1234537 1180166 1131845 1090004 1053926 1022313 994466 970388
57573I70388k0364j6872j3320r615o320l714j100K253N949Q989J1124J3090J5670
$$ 970388 950024 933152 919832 910217 903897 900183 899083 901336 907285 916274 927398 940488 956158
57560I56158J9066K2934K6711L0052L3185L6654M0648M4864M9077N3278N7271
$$ 956158 975224 998158 1024869 1054921 1088106 1124760 1165408 1210272 1259349 1312627 1369898
57549A369898O0736O3843O7066P0186P2167P2265P0561O7088O1216N2322M0489
$$ 1369898 1430634 1494477 1561543 1631729 1703896 1776161 1846722 1913810 1975026 2027348 2067837
57538B067837K6101R490q530k6336m2351n5893o6891p5296q1204q5013q7016q7225
$$ 2067837 2093938 2103428 2094898 2068562 2026211 1970318 1903427 1828131 1746927 1661914 1574898 1487673
57526A487673q5870q3596q0736p6994p2225o6940o1666n6429n1283m6781m3308
$$ 1487673 1401803 1318207 1237471 1160477 1088252 1021312 959646 903217 851934 805153 761845
57515G61845m0484l7809l5289l2947l0292k7012k3770k1481k0062j8565j6448
$$ 761845 721361 683552 648263 615316 585024 558012 534242 512761 492699 474134 457686
57504D57686j4074j2068j0668r777r239q967q864q601p646n863m007l093l152
$$ 457686 443612 431544 420876 411099 401860 392893 384029 375428 367782 361919 357912 354819 351667
57491C51667l323l155l015k943k147k62J713K561K399K365L152M545O053P303
$$ 351667 348344 345189 342174 339231 337084 336822 338535 341096 343495 345860 349012 353557 359610 366913
57477C66913Q086Q564R246J0406J1763J3055J4412J5903J7263J8496K0074K2081
$$ 366913 374999 383563 392809 403215 414978 428033 442445 458348 475611 494107 514181 536262
57465E36262K3866K5161K6794K9487L2656L5364L7887M1218M5376M9299N2296
$$ 536262 560128 585289 612083 641570 674226 709590 747477 788695 834071 883370 935666
57454I35666N4605N6516N7936N8829N9191N8470N5725N0558M3315L4370K3865
$$ 935666 990271 1046787 1104723 1163552 1222743 1281213 1336938 1387496 1430811 1465181 1489046
57443A489046J2159j30j2628k5100l6787m6425n3313n7805o0619o2037o2011o0714
$$ 1489046 1501205 1501075 1488447 1463347 1426560 1380135 1326822 1269017 1208398 1146361 1084350 1023636
57431A023636n8625n6177n3374m9812m5197m0006l5366l1959k9294k6354k2803
$$ 1023636 965011 908834 855460 805648 760451 720445 685079 653120 623826 597472 574669
57420E74669j9203j6186j3819j1714r420o796m105j671O30L182N904Q218R961
$$ 574669 555466 539280 525461 513747 504327 497531 493426 491755 492385 495567 501471 509689 519650
57407E19650J1665J3574J5115J6003J7162J9690K3316K6815K9602L2083L4607
$$ 519650 531315 544889 560004 576007 593169 612859 636175 662990 692592 724675 759282
57396G59282L7105L9713M2793M6119M8842N0479N1311N1573N0839M8429M3933
$$ 759282 796387 836100 878893 925012 973854 1024333 1075644 1127217 1178056 1226485 1270418
57385A270418L7173K8138J7232N228p209j9728l1901m2934n1916n8386o2679o5701
$$ 1270418 1307591 1335729 1352961 1358189 1350980 1331252 1299351 1256417 1204501 1146115 1083436 1017735
57373A017735o8024o9130o7982o4579o0450n7174n4929n2892n0429m7330m3483
$$ 1017735 949711 880581 812599 748020 687570 630396 575467 522575 472146 424816 381333
57362C81333l9271l5771l3550l1655k8793k5315k2820k1883k1334j9990j7967
$$ 381333 342062 306291 272741 241086 212293 186978 164158 142275 120941 100951 82984
57351H2984j5991j4341j3032j2210j1882C840g401j0391r088p593o696o990p876
$$ 82984 66993 52652 39620 27410 15528 3840 -7401 -17792 -26880 -34473 -41169 -48159 -56035
57338e6035q057p205o244n977o209o495o737o694n888m521l641l762m091l740
$$ -56035 -64092 -71297 -77541 -83518 -89727 -96222 -102959 -109653 -115541 -120062 -123703 -127465 -131556 -135296
57324a35296k946k436k242k056k128k881l887m146l326k106j299j195j571j850
$$ -135296 -138242 -140678 -142920 -144976 -147104 -149985 -153872 -158018 -161344 -163450 -164749 -165944 -167515 -169365
57310a69365j401k35P32N68n45j555j781j458j147j128j368j665j767j649j611
$$ -169365 -170766 -171001 -170269 -169701 -170246 -171801 -173582 -175040 -176187 -177315 -178683 -180348 -182115 -183764 -185375
57295a85375j777j643o87O26J059O6j444k160j831j258j110j240j226j068j078
$$ -185375 -187152 -188795 -189482 -188856 -187797 -187731 -189175 -191335 -193166 -194424 -195534 -196774 -198000 -199068 -200146
57280b00146j323j544j609j748k190k795l168l078k600j971j481j322j404j351
$$ -200146 -201469 -203013 -204622 -206370 -208560 -211355 -214523 -217601 -220201 -222172 -223653 -224975 -226379 -227730
57266b27730r16m15m59j198j965j915r92r6j32r56j526j211n33k70k18M41J655
$$ -227730 -228646 -229061 -229520 -230718 -232683 -234598 -235590 -235686 -235818 -236774 -238300 -239511 -240044 -240314 -240532 -240091 -238436
57249b38436K343J981J418J536J949J845J576K215L781M982M899M047L559L938
$$ -238436 -236093 -234112 -232694 -231158 -229209 -227364 -225788 -223573 -219792 -214810 -209911 -205864 -202305 -198367
57235a98367M924N974O656O990P589R066J1228J3232J4650J5875J7411J9214K0873
$$ -198367 -193443 -187469 -180813 -173823 -166234 -157168 -145940 -132708 -118058 -102183 -84772 -65558 -44685
57222d4685K2034a82B2018K1560K0956K0367J9534J8558J7770J7065J6009J4666
$$ -44685 -22651 -182 22018 43578 64534 84901 104435 122993 140763 157828 173837 188503
57210A88503J3617J2842J1352Q363M351N13k446m576o174p552r057j0786j2321
$$ 188503 202120 214962 226314 234677 239028 239541 237095 232519 226345 218793 209736 198950 186629
57197A86629j3024j2645j1529j0274r260q349p114n405l619k130p34R33K576L497
$$ 186629 173605 160960 149431 139157 129897 121548 114434 109029 105410 103280 102546 103479 106055 109552
57183A09552L543L229K879K320J567J077J016R63O91O76J414K695M006N230O516
$$ 109552 113095 116324 119203 121523 123090 124167 125183 126146 126837 127513 128927 131622 135628 140858 147374
57168A47374P836R115J0470J1957J3291J4220J4873J5469J5943J6187J6365J6626
$$ 147374 155210 164325 174795 186752 200043 214263 229136 244605 260548 276735 293100 309726
57156C09726J6727J6272J5222J3955J2933J2396J2161J1673J0623R538R310J0039
$$ 309726 326453 342725 357947 371902 384835 397231 409392 421065 431688 441226 450536 460575
57144D60575J0894J1284J1593J2324J3166J3502J3431J3626J4405J5427J6175
$$ 460575 471469 482753 494346 506670 519836 533338 546769 560395 574800 590227 606402
57133F06402J6305J5674J4467J3244J2437J1900J1212J0353R625R084Q440P612
$$ 606402 622707 638381 652848 666092 678529 690429 701641 711994 721619 730703 739143 746755
57121G46755O995O960P303P397O879N963N054M190L096J644j15k331n291q742
$$ 746755 753750 760710 768013 775410 782289 788252 793306 797496 800592 802236 802121 799790 794499 785757
57107G85757j1901j4418j6886j9846k2890k5462k7980l1223l4932l8158m0787
$$ 785757 773856 759438 742552 722706 699816 674354 646374 615151 580219 542061 501274
57096E01274m3659m7075n0374n3165n5857n8697o1314o3684I89f8795p2791p4809
$$ 501274 457615 410540 360166 307001 251144 192447 131133 67449 989 -68795 -141586 -216395
57084b16395p6465p8742q1696q4711q7433q9941r2493r5681j00302j06672j14549
$$ -216395 -292860 -371602 -453298 -538009 -625442 -715383 -807876 -903557 -1003859 -1110531 -1225080
57073a225080j23998j35645j49696j65519j82626k01307k21744k43318k65444
$$ -1225080 -1349078 -1484723 -1634419 -1799938 -1982564 -2183871 -2405615 -2648933 -2914377
57064b914377k88464l13233l40388l70620m04956m44235m88798n39090n95859
$$ -2914377 -3202841 -3516074 -3856462 -4227082 -4632038 -5076273 -5565071 -6104161 -6700020
57055f700020o59501p29974q07845q94583r91533j099564j220271j356664j512460
$$ -6700020 -7359521 -8089495 -8897340 -9791923 -10783456 -11883020 -13103291 -14459955 -15972415
57046a5972415j691863j900409k144715k430804k763814l149533l594445m103542
$$ -15972415 -17664278 -19564687 -21709402 -24140206 -26904020 -30053553 -33647998 -37751540
57038c7751540m679749n326184o047121o845683p721391q668710r673900j0712687
$$ -37751540 -42431289 -47757473 -53804594 -60650277 -68371668 -77040378 -86714278 -97426965
57030i7426965j1756218j2783009j3782612j4745312j5649770j6455471j7088254
$$ -97426965 -109183183 -121966192 -135748804 -150494116 -166143886 -182599357 -199687611
57023a99687611j7416313j7248492j6387189j4713845j2242710r109039n521041
$$ -199687611 -217103924 -234352416 -250739605 -265453450 -277696160 -286805199 -292326240
57016b92326240j718948K053105N578678Q699993J1327382J3424950J4992908
$$ -292326240 -294045188 -291992083 -286413405 -277713412 -266386030 -252961080 -237968172
57009b37968172J6059775J6677078J6907465J6810509J6434850J5818807J4996586
$$ -237968172 -221908397 -205231319 -188323854 -171513345 -155078495 -139259688 -124263102
57002a24263102J4006534J2895928J1717791J0522647R352951Q242449P215972
$$ -124263102 -110256568 -97360640 -85642849 -75120202 -65767251 -57524802 -50308830
56995e0308830O287810N462168M737017M107309L565296L100941K704274K366856
$$ -50308830 -44021020 -38558852 -33821835 -29714526 -26149230 -23048289 -20344015 -17977159
56987a7977159K080554J836464J626463J444935J288034J152081J033546R29720
$$ -17977159 -15896605 -14060141 -12433678 -10988743 -9700709 -8548628 -7515082 -6585362
56979f585362Q38235P56485O82515O15919N56809N04137M55994M11389L70723
$$ -6585362 -5747127 -4990642 -4308127 -3692208 -3135399 -2631262 -2175268 -1763879 -1393156
56970a393156L34547L02662K74563b31420b970B06153J90991J73516J56586J40144
$$ -1393156 -1058609 -755947 -481384 -231420 -2970 206153 397144 570660 727246 867390
56960H67390J24172J08997R5323Q3740P4254O6315N9406N3520M8936M5565M2762
$$ 867390 991562 1100559 1195882 1279622 1353876 1420191 1479597 1533117 1582053 1627618 1670380
56949A670380M0016L7703L6932L8450M1739M4908M5036L8711K3329q67k9735n7075
$$ 1670380 1710396 1748099 1785031 1823481 1865220 1910128 1955164 1993875 2017204 2016337 1986602 1929527
56937A929527p8277r2424j01209j06590j09778j11474j12012j11325j09335j06220
$$ 1929527 1851250 1758826 1657617 1551027 1441249 1329775 1217763 1106438 997103 890883
56927H90883j01880r5649q7302p7991o9372o2020n5632n0435m7097m5193m3171
$$ 890883 789003 693354 606052 528061 458689 396669 341037 290602 243505 198312 155141
56916A55141m0223l7069l4298A2339a4758k2660j9051j6255j3336r845o118k523
$$ 155141 114918 77849 43551 12339 -14758 -37418 -56469 -72724 -86060 -95905 -102023 -104546
56904a04546O87L177M966O730Q916J0911J1946J2410J3316J4610a740A2535J2637
$$ -104546 -103859 -100682 -95716 -88986 -80070 -69159 -57213 -44803 -31487 -16877 -1740 12535 25172
56891B5172J0923R090P015N185M111L543K955K516K963M434N957O404N841N554
$$ 25172 36095 45185 52200 57385 61496 65039 67994 70510 73473 77907 83864 90268 96109 101663
56877A01663O597Q597J0298J1069J1398J1934J2699J3337J3489J2625J0157O272
$$ 101663 108260 116857 127155 138224 149622 161556 174255 187592 201081 213706 223863 230135
56865B30135K135j230l855o172p953q573q065p107o201n398m737m257l685k662
$$ 230135 232270 231040 227185 221013 213060 204487 196422 189315 183114 177716 172979 168722 165037 162375
56851A62375j322k15L38M38L41L53Q34J715K323K126J599J683K571L580M224M687
$$ 162375 161053 160838 161176 161614 161955 162308 163142 164857 167180 169306 170905 172588 175159 178739 182963 187650
56835A87650N231N721N995O238O745P516Q217Q456Q197P994Q442R130Q603N965
$$ 187650 192881 198602 204597 210835 217580 225096 233313 241769 249966 257960 266402 275532 284135 290100
56821B90100K173r25k571l436m211m810m989m733l879k151P8J750K330K626L843
$$ 290100 292273 291348 288777 285341 281130 276320 271331 266598 262719 260568 260646 262396 264726 267352 271195
56806B71195O184Q699J0343J0949J1274J2236J3987J5795J6838J6775J5328J1917
$$ 271195 277379 286078 296421 307370 318644 330880 344867 360662 377500 394275 409603 421520
56794D21520O555P43l579n944p339q240p903o021l752k246j060R18L592N927P712
$$ 421520 428075 428818 425239 419295 411956 403716 395813 389792 386040 383794 382734 383652 387244 393171 400883
56779D00883R836J2743J5665J7755J9258K1045K3391K5416K5534K2351J5607O625
$$ 400883 410719 423462 439127 456882 476140 497185 520576 545992 571526 593877 609484 616109
56767F16109k465j0175j6280k0998k4030k4814k3440k0795j7781j4749j1792r122
$$ 616109 613644 603469 587189 566191 542161 517347 493907 473112 455331 440582 428790 419668
56755D19668o897m875k571K91L657P312J0995J4408J7329J9578K0592J9297J4954
$$ 419668 412771 407896 405325 405616 409273 416585 427580 441988 459317 478895 499487 518784 533738
56742E33738Q087K24p313j3835j8628k0804k0282j8255j6120j4280j2504j0901
$$ 533738 541825 542049 534736 520901 502273 481469 461187 442932 426812 412532 400028 389127
56730C89127r714q514o520l788j312K85J502L193N492P835R587J0317R598P078
$$ 389127 379413 370899 364379 360591 359279 359564 361066 364259 369751 377586 387173 397490 407088 414166
56716D14166K865k220o954j0446j2630j3916j4408j3901j2635j1504j1026j0575
$$ 414166 417031 414811 407857 397411 384781 370865 356457 342556 329921 318417 307391 296816
56704B96816r246p180n444m696m657m794m876m790m371l663k961k472k220k202
$$ 296816 287570 280390 274946 270250 265593 260799 255923 251133 246762 243099 240138 237666 235446 233244
56690B33244k308k182j631j066j039j454j714j541j116n55J08M88J79m70o62l16
$$ 233244 230936 228754 227123 226057 225018 223564 221850 220309 219193 218638 218746 219234 219413 218943 218281 217965
56674B17965j48m72p52n66k02N2L35N56J80p90j419j128n88o31r86r96r33j428
$$ 217965 217817 217345 216593 216027 215825 215877 216212 216768 216948 216158 214739 213611 213023 212392 211406 210410 209477 208049
56656B08049k095j854o72K49J19n42r48j065j104q74k33K95J09n11o57L6R71J371
$$ 208049 205954 204100 203428 203677 203796 203254 202306 201241 200137 199263 199030 199325 199434 198923 198266 198302 199273 200644
56638B00644J095N19l6m51n50j32O36J140Q94J35l89k24L86Q44P77K14n50j147
$$ 200644 201739 202258 202222 201771 201221 201089 201725 202865 203759 203894 203505 203281 203667 204511 205288 205502 204952 203805
56620B03805j315j125r07r14j058j062p66k21L93R27J322J557J549J216P63O61
$$ 203805 202490 201365 200458 199544 198486 197424 196658 196437 196830 197757 199079 200636 202185 203401 204164 204825
56604B04825J121J699J811J535J471J793J953J472O04j11n45q80j112j077q45
$$ 204825 205946 207645 209456 210991 212462 214255 216208 217680 218284 218173 217628 216748 215636 214559 213714
56589B13714o32l98Q8P62J158R29K69l66p73j058j239j086m65K82N89K86k59o71
$$ 213714 213082 212684 212772 213534 214692 215621 215890 215524 214751 213693 212454 211368 210903 211185 211774 212060 211801 211130
56571B11130j035j600k275k678k598k164j521p38M3N25M42k59j328k215k353j710
$$ 211130 210095 208495 206220 203542 200944 198780 197259 196521 196564 197089 197531 197272 195944 193729 191376 189666
56555A89666r12n70o01m90n7M06O16M96L6o03r15n22K05M49J0m99n86m78n95r22
$$ 189666 188754 188184 187583 187093 187036 187442 188058 188554 188590 187987 187072 186550 186755 187204 187214 186715 186129 185651 185056 184134
56535A84134j176j181q14J1J026J595J402Q78O38P44P95N79L43M59J008J652J852
$$ 184134 182958 181777 180963 180974 182000 183595 184997 185875 186513 187257 188052 188631 188974 189433 190441 192093 193945
56518A93945J402P30M58O63Q79Q42P84R33J103J067R84J181J730K480L247L798
$$ 193945 195347 196077 196535 197198 198077 198919 199703 200636 201739 202806 203790 204971 206701 209181 212428 216226
56502B16226L860L394K721K238K091K154K185J997J723J805K442L150L328L115
$$ 216226 220086 223480 226201 228439 230530 232684 234869 236866 238589 240394 242836 245986 249314 252429
56488B52429L169L558L509K477Q84m02r28p62k71l4m74j317j812j754j809k562
$$ 252429 255598 259156 262665 265142 266026 265624 264696 263934 263663 263629 263155 261838 260026 258272 256463 253901
56472B53901l737m597m676l848k246n25L27n4j008j718k041k191k128j789j461
$$ 253901 250164 245567 240891 237043 234797 234272 234599 234545 233537 231819 229778 227587 225459 223670 222209
56457B22209j340j190q89q65j410j953j702p65K2J69j21n08p88p82m82k64m45
$$ 222209 220869 219679 218790 217925 216515 214562 212860 212095 212117 212286 212165 211657 210869 210087 209605 209341 208896
56440B08896p35n70J27Q42J055N91l50j144j071j41O96P06L91O47J256J117l9
$$ 208896 208161 207591 207718 208560 209615 210206 209856 208712 207641 207500 208196 208902 209293 209940 211196 212313 212274
56423B12274j129j171m94l7m7kM46J018J306J334J455J762J894J538R98Q99J390
$$ 212274 211145 209974 209480 209443 209396 209394 209840 210858 212164 213498 214953 216715 218609 220147 221145 222044 223434
56406B23434J955K178K221K389K614K724K835L094L296L162K771K341J836J263
$$ 223434 225389 227567 229788 232177 234791 237515 240350 243444 246740 249902 252673 255014 256850 258113
56392B58113J060J601K441K605J743M94l36o25q00j110j357j276j033j053j310
$$ 258113 259173 260774 263215 265820 267563 268057 267721 267096 266296 265186 263829 262553 261520 260467 259157
56377B59157j147k49N32K0j601k822k693j886j403j235r40q26j458k442k738k114
$$ 259157 258010 257761 258293 258313 256712 253890 251197 249311 247908 246673 245733 244907 243449 241007 238269 236155
56361B36155j458j511k006k190j679p02K10O90R05J308J840J819Q75l69j028r23
$$ 236155 234697 233186 231180 228990 227311 226609 226819 227509 228414 229722 231562 233381 234256 233887 232859 231936
56345B31936m23K25Q29R48L76l58o09n23o53r80j014o61k52J45O66J097J045N79
$$ 231936 231513 231738 232567 233515 233891 233533 232924 232401 231748 230768 229754 229093 228841 228986 229652 230749 231794 232373
56327B32373O8m58j119j491r81K22J232J592J610J576J407J097R00Q93R28J016
$$ 232373 232441 231983 230864 229373 228392 228614 229846 231438 233048 234624 236031 237128 238028 238921 239849 240865
56311B40865J303J666J850J907J973J816J273Q70J227J961K079J474J081J474
$$ 240865 242168 243834 245684 247591 249564 251380 252653 253523 254750 256711 258790 260264 261345 262819
56297B62819K166K530K567K436K022J371R79J214J804K213K100J365J74q40r49
$$ 262819 264985 267515 270082 272518 274540 275911 276890 278104 279908 282121 284221 285586 285760 284920 283971
56282B83971q2J106K011K522K693K468J840R36o2p86o73L37J355J478J051J264
$$ 283971 283889 284995 287006 289528 292221 294689 296529 297465 297403 296617 295944 296281 297636 299114 300165 301429
56266C01429K451L624L805L158K534K510L047L646L776L487L492M177M846M637
$$ 301429 303880 307504 311309 314467 317001 319511 322558 326204 329980 333467 336959 341136 345982 350619
56252C50619L868L596M044M459M524M733N235N436N119M956N408N970N994N628
$$ 350619 354487 358083 362127 366586 371110 375843 381078 386514 391633 396589 401997 407967 413961 419589
56238D19589N350N192M850M225L578L427M214N577O217N227L508K839L627M633
$$ 419589 424939 430131 434981 439206 442784 446211 450425 456002 462219 467446 470954 473793 477420 482053
56224D82053N056N557O765Q040Q524Q469Q742R627J0911J2516J4338J5922J6924
$$ 482053 487109 492666 499431 507471 515995 524464 533206 542833 553744 566260 580598 596520 613444
56211F13444J7632J8575K0010K2021K4639K7506K9938L1722L3384L5453L8000
$$ 613444 631076 649651 669661 691682 716321 743827 773765 805487 838871 874324 912324
56200I12324M1061M4842M9080N2889N5718N8028O0617O3635O6496O8375O8679
$$ 912324 953385 998227 1047307 1100196 1155914 1213942 1274559 1338194 1404690 1473065 1541744
56189A541744O7452O5285O2467N8400N2576M5722L8996L2225K4217J4889N652
$$ 1541744 1609196 1674481 1736948 1795348 1847924 1893646 1932642 1964867 1989084 2003973 2009625
56178B009625k469r775j6507k2004k5921k9038l2033l4544l6144l7150l7811l7859
$$ 2009625 2007156 1997381 1980874 1958870 1932949 1903911 1871878 1837334 1801190 1764040 1726229 1688370
56166A688370l7637l8409m0556m2591m3161m2925m3275m4174m4667m4748m5132
$$ 1688370 1650733 1612324 1571768 1529177 1486016 1443091 1399816 1355642 1310975 1266227 1221095
56155A221095m5686m5480m4270m2685m1079l9198l6877l4254l1465k8766k6682
$$ 1221095 1175409 1129929 1085659 1042974 1001895 962697 925820 891566 860101 831335 804653
56144H04653k5258k3622k1019j7950j5461j3776j2415j1258j0505r866q822p535
$$ 804653 779395 755773 734754 716804 701343 687567 675152 663894 653389 643523 634701 627166
56132F27166o658o276n767m768l675l096l233l703l762k896j405n9Q78J762K654
$$ 627166 620508 614232 608465 603697 600022 596926 593693 589990 586228 583332 581927 581868 582746 584508 587162
56117E87162L106L169L601M617N394N424N407O025O799P062P183P840Q821R646
$$ 587162 590268 593437 597038 601655 607049 612473 617880 623905 630704 637766 644949 652789 661610 671256
56103F71256J0695J2535J4640J5915J6171J6139J6315J6711J7424J8616K0095
$$ 671256 681951 694486 709126 725041 741212 757351 773666 790377 807801 826417 846512
56092H46512K1604K3153K4658K5778K6687K8248L0745L3368L5649L8473M2657
$$ 846512 868116 891269 915927 941705 968392 996640 1027385 1060753 1096402 1134875 1177532
56081A177532M7530N2180N7293O4358P3548Q3613R3301J01607J07135J08684J06254
$$ 1177532 1225062 1277242 1334535 1398893 1472441 1556054 1649355 1750962 1858097 1966781 2073035
56070B073035J00556R1966Q1154P0188O1476N5635N1452M7461M2527L5338K5053
$$ 2073035 2173591 2265557 2346711 2416899 2478375 2534010 2585462 2632923 2675450 2710788 2735841
56059B735841J2498l39j2074k2300l0800l7745m4565n3217o4217p6239q7576r7154
$$ 2735841 2748339 2748000 2735926 2713626 2682826 2645081 2600516 2547299 2483082 2406843 2319267 2222113
56047B222113j04218j08049j08230j04723r7954q9241q0501p2658o4918n6423
$$ 2222113 2117895 2009846 1901616 1796893 1698939 1609698 1529197 1456539 1391621 1335198
56037A335198m7926m0829l5298l0495k6085k2252j8744j5205j2040r729p720n249
$$ 1335198 1287272 1246443 1211145 1180650 1154565 1132313 1113569 1098364 1086324 1076595 1068875 1063626
56025A063626k779j324p03J47J492K677L383L771L738L203K815L184L830M015
$$ 1063626 1060847 1059523 1058820 1058967 1060459 1063136 1066519 1070290 1074028 1077231 1080046 1083230 1087060 1091075
56011A091075M002M315M505M122M169N842Q373R918J0276J0851J2144J3116J3167
$$ 1091075 1095077 1099392 1103897 1108019 1112188 1118030 1126403 1136321 1146597 1157448 1169592 1182708 1195875
55998A195875J3017J3402J4159J4869J5356J5581J5839J6775J8311J9323J9322
$$ 1195875 1208892 1222294 1236453 1251322 1266678 1282259 1298098 1314873 1333184 1352507 1371829
55987A371829J9550K1155K3271K4458K5010K6051K7300K7777K7904K8842L0296
$$ 1371829 1391379 1412534 1435805 1460263 1485273 1511324 1538624 1566401 1594305 1623147 1653443
55976A653443L1115L1456L2430L4034L5465L6905L9011M1269M2905M4729M7936
$$ 1653443 1684558 1716014 1748444 1782478 1817943 1854848 1893859 1935128 1978033 2022762 2070698
55965B070698N1754N4595N6799N9839O3557O6709O9566P3394P7843Q1550Q4749
$$ 2070698 2122452 2177047 2233846 2293685 2357242 2423951 2493517 2566911 2644754 2726304 2811053
55954B811053Q8686R3064R6848J00929J07014J14421J21001J26727J33354J41086
$$ 2811053 2899739 2992803 3089651 3190580 3297594 3412015 3533016 3659743 3793097 3934183
55944C934183J48716J56541J65933J76505J87022J98370K12086K26774K39831
$$ 3934183 4082899 4239440 4405373 4581878 4768900 4967270 5179356 5406130 5645961
55935E645961K52064K66501K83201K99598L15524L33369L53455L73992L95497
$$ 5645961 5898025 6164526 6447727 6747325 7062849 7396218 7749673 8123665 8519162
55926H519162M20565M49139M78689N09092N42559N78879O15924O54749O98992
$$ 8519162 8939727 9388866 9867555 10376647 10919206 11498085 12114009 12768758 13467750
55917A3467750P49337Q03964Q64113R33271J011298J095923J189871J299840J428849
$$ 13467750 14217087 15021051 15885164 16818435 17829733 18925656 20115527 21415367 22844216
55908B2844216J576813J747755J948211K179224K439116K733367L071085L451741
$$ 22844216 24421029 26168784 28116995 30296219 32735335 35468702 38539787 41991528
55900D1991528L866839M315095M804181N338450N920076O562974P289739Q114855
$$ 41991528 45858367 50173462 54977643 60316093 66236169 72799143 80088882 88203737
55892H8203737R049025J0117128J1344997J2725825J4218472J5738228J7033258
$$ 88203737 97252762 107369890 118714887 131440712 145659184 161397412 178430670
55885A78430670J7514209J6333192J2863840P252932N05437o021778j1274639
$$ 178430670 195944879 212278071 225141911 232394843 232900280 226878502 215603863
55878B15603863j4808305j6682689j7217412j6811672j5837657j4574313j3194761
$$ 215603863 200795558 184112869 166895457 150083785 134246128 119671815 106477054
55871A06477054j1801080j0457224r198255q039565o994033o074677n281280m598407
$$ 106477054 94675974 84218750 75020495 66980930 59986897 53912220 48630940 44032533
55863D4032533m010530l509344l085163k722979k410794k143145j913809j713244
$$ 44032533 40022003 36512659 33427496 30704517 28293723 26150578 24236769 22523525
55855B2523525j535691j381281j248722j132513j029042r38747q60425p89594
$$ 22523525 20987834 19606553 18357831 17225318 16196276 15257529 14397104 13607510
55847A3607510p24249o66401o16331n70930n29158m93516m64404m38347m13554
$$ 13607510 12883261 12216860 11600529 11029599 10500441 10006925 9542521 9104174 8690620
55838H690620l92134l74877l58727l41455l24459l08861k93010k76017k59945
$$ 8690620 8298486 7923609 7564882 7223427 6898968 6590107 6297097 6021080 5761135
55829E761135k46361k34000k21741k10710k01647j93076j83838j74737j66218
$$ 5761135 5514774 5280774 5059033 4848323 4646676 4453600 4269762 4095025 3928807
55820C928807j57078j46912j37381j29755j23418j17771j13158j09080j03942
$$ 3928807 3771729 3624817 3487436 3357681 3234263 3116492 3003334 2894254 2790312
55811B790312r7690r2225q8277q4265p9249p4578p1432o8961o6074o3081o0524
$$ 2790312 2692622 2600397 2512120 2427855 2348606 2274028 2202596 2133635 2067561 2004480 1943956
55800A943956n8277n6769n7182n9485o1938o3325o3965o3948o2308n8809n4762
$$ 1943956 1885679 1828910 1771728 1712243 1650305 1586980 1523015 1459067 1396759 1337950 1283188
55789A283188n1218m7872m4360m1166l8577l6166l3698l1307k8685k5600k3058
$$ 1283188 1231970 1184098 1139738 1098572 1059995 1023829 990131 958824 930139 904539 881481
55778H81481k2159k1962k0484j7736j5581j4586j3445j1800j0957j1235j1065
$$ 881481 859322 837360 816876 799140 783559 768973 755528 743728 732771 721536 710471
55767G10471r540p659o167m407k209q67j147k168l114m367o111p597q563r685
$$ 710471 700931 693272 687105 682698 680489 679622 678475 676307 673193 668826 662715 655118 646555 636870
55753F36870j0947j1448j1346j2044j3699j4642j4056j3195j2991j2599j1368
$$ 636870 625923 614475 603129 591085 577386 562744 548688 535493 522502 509903 498535
55742D98535j0168r534q520o676n280n212n373m701l975m127m356l640k642k494
$$ 498535 488367 478833 470313 463637 458357 453145 447772 443071 439096 434969 430613 426973 424331 421837
55728D21837k800k411j272j44N67O30k97j780k518k105j623j670j399n40o03k596
$$ 421837 419037 416626 415354 415210 415777 416407 416110 414330 411812 409707 408084 406414 405015 404475 403872 401276
55712D01276n149o582p337q579r743r527q311p489p112o115m509l390l193l435
$$ 401276 396127 389545 382208 373629 363886 354359 346048 338559 331447 325332 320823 317433 314240 310805
55698C10805m014n173o448p031p089p376p725p231n910m956n116n755n734m678
$$ 310805 306791 301618 295170 288139 281050 273674 265949 258718 252808 247852 242736 236981 231247 226569
55684B26569l317k882l884n283n449m145k799k426k429k026j637j852k109j616
$$ 226569 223252 220370 216486 211203 205754 201609 198810 196384 193955 191929 190292 188440 186331 184715
55670A84715p42k60m2L38M62k28j242j823k235k972l395k633j359j109k084l061
$$ 184715 183973 183713 183671 184009 184471 184243 183001 181178 178943 175971 172576 169943 168584 167475 165391 162330
55654A62330l234k881k353j746j407j542j423k90J126J365M64r2K80M93k39j114
$$ 162330 159096 156215 153862 152116 150709 149167 147744 147454 148580 149945 150409 150317 150597 151090 150851 149737
55638A49737j200q97j079j590j648j139p01o67p14m83l6L99P98J301J909K406
$$ 149737 148537 147640 146561 144971 143323 142184 141483 140816 140102 139619 139583 139982 140780 142081 143990 146396
55622A46396K681K956L450L959M087L904L858M002L917L506L195L012K297P83
$$ 146396 149077 152033 155483 159442 163529 167433 171291 175293 179210 182716 185911 188923 191220 192003
55608A92003p05j329j402j704k198k272j948j898k309k523j956q42O8L22K01M22
$$ 192003 191298 189969 188567 186863 184665 182393 180445 178547 176238 173715 171759 170917 170985 171307 171508 171930
55592A71930J224J880J582P63O47J424J822R98j70m72j49k90j109j868k175k330
$$ 171930 173154 175034 176616 177379 178026 179450 181272 182270 182100 181628 181479 181189 180080 178212 176037 173707
55576A73707k594k907l123l035k439j748j980l419m852m988m131l528l566l626
$$ 173707 171113 168206 165083 162048 159609 157861 155881 152462 147610 142622 138491 134963 131397 127771
55562A27771l359l044k768k318j809j632j742j788j759j847j807j299o39m78q14
$$ 127771 124412 121368 118600 116282 114473 112841 111099 109311 107552 105705 103898 102599 101960 101482 100668
55547A00668j125j279j553j840j676j070n39l44l11l67o31r85j112q79l23M73
$$ 100668 99543 98264 96711 94871 93195 92125 91586 91242 90931 90564 89933 88948 87836 86957 86634 87107
55531H7107J102R03j26r79q95l79k43k88J11P14Q66P28R24J335J538J885K852
$$ 87107 88209 89112 88986 88007 87112 86733 86490 86202 86313 87027 87893 88621 89545 90880 92418 94303 97155
55514I7155L682L278K208K143L291M129L935L833M769O013O399N840M851L645
$$ 97155 100837 104115 106323 108466 111757 115886 119821 123654 128423 134436 140835 146675 151526 155171
55500A55171K373J298J48j729m110n806o374o692p305p385o263m827m364m834
$$ 155171 157544 158842 158990 157261 153151 147345 140971 134279 126974 119589 113326 108499 104135 99301
55486I9301n294n300m928m034k564j129m02k57k74n67j344k060j970j205n66m36
$$ 99301 94007 88707 83779 79745 77181 76052 75650 75393 75119 74552 73208 71148 69178 67973 67407 66971
55470F6971n61o32m58J47J006J372P37l65r40o80K0R00J966K979L485L311K610
$$ 66971 66410 65778 65320 65467 66473 67845 68582 68217 67277 66597 66617 67517 69483 72462 75947 79258 81868
55453H1868J547L86l45l40K8K37K97M11L11l29j072j192q37q95j658k468k831
$$ 81868 83415 83801 83456 83116 83144 83381 83678 84089 84400 84071 82999 81807 80970 80075 78417 75949 73118
55436G3118k998l118k703j533l80j43n95p99n19m67j090j859k090j935k020k421
$$ 73118 70120 67002 64299 62766 62386 62243 61648 60849 60330 59863 58773 56914 54824 52889 50869 48448
55420D8448k568k158j613j401j331r03j71K35k8n26n92j27L96N54L84J86J20P0
$$ 48448 45880 43722 42109 40708 39377 38474 38303 38538 38510 37984 37392 37265 37661 38215 38599 38785 38905 38975
55402C8975j63n98j000j025m57N30J319J262L73n21o26j16J95J6j63JJ34j42n48
$$ 38975 38812 38214 37214 36189 35732 36262 37581 38843 39216 38695 38069 37953 38148 38164 38001 38002 38136 37994 37446
55383C7446o60o04o75p03m26j12j53l13j42J42m1n64o33L3Q24J119R40O59N93
$$ 37446 36786 36182 35507 34804 34378 34266 34113 33800 33658 33800 33759 33195 32562 32595 33419 34538 35478 36137 36730
55364C6730Q67J124N70r79k314k052n22O18O60M89P99R71M38j30R1P27Q91N56
$$ 36730 37597 38721 39291 38312 35998 33946 33424 34042 34702 35191 35990 36961 37399 37269 37360 38087 38978 39534
55346C9534L07K73K29K89N71N60k37j305j613j009k84N9K68N99P98N60k5o14q75
$$ 39534 39841 40114 40343 40632 41203 41763 41526 40221 38608 37599 37315 37374 37642 38241 39039 39599 39574 38960 38085
55327C8085o04O4O43P86O76O42O52N63N28O73O88K85j60q8L40M76K07k7j74o69
$$ 38085 37481 37545 38188 38974 39650 40292 40944 41507 42035 42708 43396 43681 43521 43433 43773 44249 44456 44429 44255 43586
55307D3586j523k044j827j304j044j008r23q25p97n69N4O68O41o4q48j169r32
$$ 43586 42063 40019 38192 36888 35844 34836 33913 33088 32291 31722 31776 32444 33085 33021 32173 31004 30072
55290C0072k99M78R73Q17J42m58n97n34o87r94j037o91k48J28N81J079J245R79
$$ 30072 29773 30251 31224 32041 32183 31725 31128 30594 29907 28913 27876 27185 26937 27065 27646 28725 29970 30949
55272C0949P94J072J326Q45j84r05j040j137j442j404o76J72M42K75K56N10P42
$$ 30949 31743 32815 34141 34986 34802 33897 32857 31720 30278 28874 28198 28370 28812 29087 29343 29853 30595
55255C0595Q42R01Q47O05L51J98n8m58m70K53J082J085L60j45r6k18r87j727j518
$$ 30595 31437 32338 33185 33790 34141 34339 34281 33823 33353 33606 34688 35773 36133 35988 35892 35674 34687 32960 31442
55236C1442m85L25J92n81j090p54J97R73R90L90k42n41n09k40J55M03K83j0p4
$$ 31442 30957 31282 31474 30893 29803 29049 29246 30219 31209 31599 31357 30816 30307 30067 30222 30625 30908 30898 30824
55217C0824R6J31l2L8N39R89Q59K83j88l14k36n3K25L15j85j187j934j733o82
$$ 30824 30920 31051 31019 31057 31596 32585 33444 33727 33539 33225 32989 32936 33161 33476 33291 32104 30170 28437 27755
55198B7755M61J044J000O31J93k35o03p75o17j07N89J167J344J045M80m4l61m62
$$ 27755 28216 29260 30260 30891 31084 30849 30246 29471 28854 28747 29336 30503 31847 32892 33372 33328 32967 32505
55180C2505l24L9M03M09j1m46m43k6L38L39J50J07K46L05J86J78N51J051J081
$$ 32505 32181 32220 32623 33032 33021 32575 32132 32106 32444 32783 32933 33040 33286 33591 33777 33955 34506 35557 36638
55161C6638M73k53n13l21o4O7M8k68q70j114k73J353K509K402J467N06k89r72
$$ 36638 37111 36858 36345 36024 35960 36027 36075 35807 34937 33823 33550 34903 37412 39814 41281 41787 41498 40526
55143D0526j221q04l08n59j414j848j260j49O65Q70O33K11j56l04l41n29q64r82
$$ 40526 39305 38501 38193 37634 36220 34372 33112 32963 33628 34498 35131 35342 35186 34882 34541 34012 33148 32166
55125C2166o49r4K71K75N6j14k4L00N27L30j98n99n81k60J44N78R92J128P50J
$$ 32166 31517 31423 31694 31969 32025 31911 31887 32187 32714 33044 32846 32247 31666 31406 31550 32128 33120 34248 34998 34999
55105C4999o31p06j51P30J474J754J528R28P3r27j817k242k070j521r21l97R9
$$ 34999 34368 33662 33511 34241 35715 37469 38997 39925 39998 39071 37254 35012 32942 31421 30500 30103 30202
55088C0202N38P83P84O44M39J14l01m92j22O35J111R05L75J15P7l26j199j724
$$ 30202 30740 31523 32307 32951 33390 33504 33203 32711 32589 33224 34335 35240 35615 35730 35807 35481 34282 32558
55070C2558j118L02J431J607J222J009J106J053N58OM7Q12J748K234K251K188
$$ 32558 31440 31742 33173 34780 36002 37011 38117 39170 39728 39734 39781 40593 42341 44575 46826 49014
55054D9014K206K078J624J085Q63J055J331J223N74k07n19k86j32n49j169j256
$$ 49014 51220 53298 54922 56007 56870 57925 59256 60479 61053 60846 60327 60041 59909 59360 58191 56935
55038E6935p63l15k02p9K32L34m4n40p28p18p63p02k78K69L85j82j173k029k108
$$ 56935 56172 55857 55655 55576 55808 56142 56098 55558 54830 54112 53349 52647 52369 52638 53023 52841 51668 49639 47531
55019D7531j145K73J119J035O40M88M04K15L55R99J332O19m77o94O5P35P58N71
$$ 47531 46386 46659 47778 48813 49453 49941 50345 50560 50915 51914 53246 53865 53388 52694 52759 53494 54252 54823
55001E4823M87J96l93q03q16q38j006q43k13J59k38p98o36R9N21L18L2J02K77
$$ 54823 55310 55506 55113 54310 53494 52656 51650 50807 50594 50753 50515 49717 49081 49180 49701 50019 50051 50153 50430
54982E0430J70q3KN78J217J419J241J198J446J413O41l40n46J08P10O93N85R25
$$ 50430 50600 50517 50519 51097 52314 53733 54974 56172 57618 59031 59672 59332 58786 58894 59604 60297 60882 61807
54964F1807J230P13k86n33M06J451J346J66r70j411j528j797j930j420m68K36
$$ 61807 63037 63750 63464 62931 63337 64788 66134 66300 65330 63919 62391 60594 58664 57244 56776 57012
54948E7012N08P80J229J487J437J519J822J617M72q17j146n92p3O9J77K29j55
$$ 57012 57520 58300 59529 61016 62453 63972 65794 67411 67883 67066 65920 65328 65255 65324 65501 65730 65575
54931F5575p18p07j84j06p92j367j209q67r07q32p5Q07Q98M56N35J353K017J873
$$ 65575 64857 64150 63966 63860 63068 61701 60492 59625 58718 57886 57811 58618 59516 59972 60507 61860 63877 65750
54913F5750J234O45J55m40j084j474j348o82J88O96N98L15M18Q42R74N60J69N26
$$ 65750 66984 67629 67784 67344 66260 64786 63438 62756 62944 63640 64238 64553 64971 65813 66787 67347 67516 68042
54895F8042J636K694K898K243J451J156J236J205J017J097J557J926J938K073
$$ 68042 69678 72372 75270 77513 78964 80120 81356 82561 83578 84675 86232 88158 90096 92169
54881I2169K824L829M248L871L314L102L145L151L164L374L669L650L117K307
$$ 92169 94993 98822 103070 106941 110255 113357 116502 119653 122817 126191 129860 133510 136627 138934
54867A38934J528O65o69k397l731l986l561l524m309n262n653n562n455n334m793
$$ 138934 140462 141127 140458 138061 134330 130344 126783 123259 118950 113688 108035 102473 97018 91684 86891
54852H6891l703k447j565j362j714k036j726p73K12P94J124J447J566J264Q55
$$ 86891 83188 80741 79176 77814 76100 74064 72338 71565 71777 72571 73695 75142 76708 77972 78827
54837G8827R09J565K527L482M257M762N060N340N547N350M740M232M035L508J971
$$ 78827 79736 81301 83828 87310 91567 96329 101389 106729 112276 117626 122366 126598 130633 134141 136112
54822A36112k52k223l543m461n076n199m922m640m460m196l923l862l736l014
$$ 136112 135860 133637 130094 125633 120557 115358 110436 105796 101336 97140 93217 89355 85619 82605
54808H2605j929j424j798k163j698p85l52n25o39l43n5k90r65j510j455q74k62
$$ 82605 80676 79252 77454 75291 73593 72808 72456 71931 71292 70949 70894 70604 69639 68129 66674 65800 65538
54791F5538ppR9L59M66K74L1j3M2l8k88n68p64q52q41p97p19m99j49n9n48j216
$$ 65538 65531 65524 65623 65982 66448 66722 66753 66740 66782 66744 66456 65888 65124 64272 63431 62634 61915 61416 61267 61208 60660 59444
54769E9444j213l57M97N41N6p9L64P23L56o41j625k038j790j188n53J38J077K079
$$ 59444 58231 57874 58371 58912 58968 58889 59253 59976 60332 59691 58066 56028 54238 53050 52497 52635 53712 55791
54751E5791K525K115J364R54Q57N77J23R3P29J445J571J200R71J274J891K237
$$ 55791 58316 60431 61795 62749 63606 64183 64306 64399 65128 66573 68144 69344 70315 71589 73480 75717
54735G5717J777N06p39q52L55J830K504K568K954L831M394M211L948M366N260
$$ 75717 77494 78000 77261 76409 76764 78594 81098 83666 86620 90451 94845 99056 103004 107370 112630
54720A12630N900O112O234O303N985N255M549M112L689K982K001Q40m91j843k850
$$ 112630 118530 124642 130876 137179 143164 148419 152968 157080 160769 163751 165752 166592 166101 164258 161408
54705A61408l314l417l414l294k958k431j771r60k9Q69J609K130K347K291K380
$$ 161408 158094 154677 151263 147969 145011 142580 140809 139849 139820 140689 142298 144428 146775 149066 151446
54690A51446L119M388N429N739N570N358N125M766M464M320L965L090K046J407
$$ 151446 154565 158953 164382 170121 175691 181049 186174 190940 195404 199724 203689 206779 208825 210232
54676B10232J144Q22L58J3l35j178k575l934m765n206n646o253o979p619p794
$$ 210232 211376 212198 212556 212569 212234 211056 208481 204547 199782 194576 188930 182677 175698 168079 160285
54661A60285p274o459o044o075n846m951l918l361l019k248j177o92j163j866
$$ 160285 153011 146552 140508 134433 128587 123636 119718 116357 113338 111090 109913 109221 108058 106192
54647A06192j918j458j321j769k000j265o3L06o19j822k073j334m55J29O30J038
$$ 106192 104274 102816 101495 99726 97726 96461 96398 96704 96085 94263 92190 90856 90401 90530 91160 92198
54631I2198Q34m0o85j82J236K415K471J405k04j653k351k112j286l84N05J576
$$ 92198 93032 92992 92307 92125 93361 95776 98247 99652 99448 97795 95444 93332 92046 91662 92167 93743
54615I3743K642L013K380J469J321J944K236J401J00l28M71J512J795J423J127
$$ 93743 96385 99398 101778 103247 104568 106512 108748 110149 110249 109921 110392 111904 113699 115122 116249
54600A16249J217J428J549J640J728J696J566J538J753K229K969L872M577M761
$$ 116249 117466 118894 120443 122083 123811 125507 127073 128611 130364 132593 135562 139434 144011 148772
54586A48772M647M830N628O781P888Q701R078Q947Q557Q424Q853R599J0037R551
$$ 148772 153419 158249 163877 170658 178546 187247 196325 205272 213829 222253 231106 240705 250742 260293
54572B60293P859N277K598L73j625l881o194p813q563r051r603r702r040q419
$$ 260293 268152 273429 276027 276400 274775 270894 264700 256887 248324 239273 229670 219968 210928 202509
54558B02509q820r898j0247r108p126n349m127l270k755k815l471m328m831m638
$$ 202509 193689 183791 173544 164436 157310 151961 147834 144564 141809 138994 135523 131195 126364 121726
54544A21726l849k930k343k165k107j927j719j695j823j876j805j849k180k567
$$ 121726 117877 114947 112604 110439 108332 106405 104686 102991 101168 99292 97487 95638 93458 90891
54530I0891k588k098j257k38P63J254O85p08j764j590o79k94q52j497j309l54
$$ 90891 88303 86205 84948 84710 85473 86727 87412 86704 84940 83350 82671 82377 81525 80028 78719 78365
54514G8365N65P21j13j512k499k239r45K94P70P84Q22P45K64l14m43j26K28M72
$$ 78365 78930 79651 79538 78026 75527 73288 72343 72637 73407 74191 75013 75758 76022 75708 75265 75139 75367 75839
54496G5839P07Q10O18M14O03R76R54N51M19Q20J215J114P56O44Q25J069J353J751
$$ 75839 76546 77356 77974 78388 78991 79967 80921 81472 81891 82711 83926 85040 85796 86440 87265 88334 89687 91438
54478I1438K078K088J894J882K258K884L503L962M210M320M398M456M414M363
$$ 91438 93516 95604 97498 99380 101638 104522 108025 111987 116197 120517 124915 129371 133785 138148
54464A38148M543M906M912M030K377N53j086k584l866m517m393m043m185m801
$$ 138148 142691 147597 152509 156539 158916 159469 158383 155799 151933 147416 143023 138980 134795 129994
54450A29994n217n059m678m471m168l247j853q22p37j255j591j397r96r00j293
$$ 129994 124777 119718 115040 110569 106401 103154 101301 100479 99742 98487 96896 95499 94503 93603 92310
54435I2310j942k409k368j785r01l3N55P32N61K94J50R6j4j50j41k2pr6J1M45
$$ 92310 90368 87959 85591 83806 82905 82872 83427 84159 84720 85014 85164 85260 85246 85096 84955 84933 84926 84830 84841 85286
54415H5286Q88R83Q15P26Q29R12P60L31k07n53m87j81m9j74k00J13M85O08N84
$$ 85286 86174 87157 87972 88698 89527 90439 91199 91530 91323 90770 90283 90102 90053 89879 89679 89792 90277 90885 91469
54396I1469N66L01m14j111j112n15m5l7j13N9L35M90M54J08n71j073p89n7j6j001
$$ 91469 92035 92336 91922 90811 89699 89184 89139 89102 88989 89048 89383 89873 90327 90435 89864 88791 88002 87945 87929 86928
54376H6928j888j618o45j76m75p94o52k62J24M91O96N77M43P43J216J114M36M0
$$ 86928 85040 83422 82777 82601 82126 81332 80680 80418 80542 81033 81729 82306 82749 83492 84708 85822 86258 86298
54358H6298K95M32l06j462j975j464l80P83J709K071J741J133Q06P76P12O22Q49
$$ 86298 86593 87025 86719 85257 83282 81818 81438 82221 83930 86001 87742 88875 89681 90457 91169 91791 92640
54341I2640J385J788J802J603J410J315J473J946K275J840P96nj76k68p34j154
$$ 92640 94025 95813 97615 99218 100628 101943 103416 105362 107637 109477 110273 110268 110092 109824 109090 107936
54325A07936j032p91j092j667j641r05k96m02r55j494j885k011j648j043r16j462
$$ 107936 106904 106113 105021 103354 101713 100808 100512 100110 99155 97661 95776 93765 92117 91074 90158 88696
54309H8696j849j292j38O80R17J044J261J280J078J083J398J437Q13Q4J01Q34
$$ 88696 86847 85555 85417 86097 87014 88058 89319 90599 91677 92760 94158 95595 96408 96492 96593 97427
54293I7427J370J068K73k29j90q4m24j132j610j356l89Q74J960K515K295J313
$$ 97427 98797 99865 100138 99909 99719 99635 99211 98079 96469 95113 94724 95598 97558 100073 102368 103681
54277A03681lr80j251j021p59p16q45j023j191j300j328j301j258j246j399j856
$$ 103681 103678 102698 101447 100426 99667 98951 98106 97083 95892 94592 93264 91963 90705 89459 88060 86204
54261H6204k387k317j250J72P50O9j029j497j204o67k10J17J31l29r15j110j010
$$ 86204 83817 81500 80250 80422 81172 81241 80212 78715 77511 76844 76634 76751 76882 76553 75638 74528 73518
54244G3518j163j596j666j115o00p72j375j655j248k92Q80J721J594N26n82r69
$$ 73518 72355 70759 69093 67978 67378 66606 65231 63576 62328 62036 62916 64637 66231 66757 66175 65206
54228F5206r04r61r63m29K88L87k8n7M24N23q6n00p2M29R1o06n41K62P48N00K44
$$ 65206 64302 63341 62378 61949 62237 62624 62596 62539 62963 63486 63400 62900 62828 63257 63348 62742 62201 62463 63211 63711 63955
54207F3955O19J341J891K134K026J312L1j111j455j143q26p33n25K0N96Q04O96
$$ 63955 64574 65915 67806 69940 71966 73278 73309 72198 70743 69600 68774 68041 67516 67536 68132 68936 69632
54190F9632O68R01J162J108O65J1o16j011j023o52q4M22O96N67r3j092j786j655
$$ 69632 70300 71201 72363 73471 74136 74147 73531 72520 71497 70845 70761 71183 71879 72446 72353 71261 69475 67820
54172F7820r14k48Q8M63J149J813K026J808J465J121P76N42M85L67o9o52q96n90
$$ 67820 66906 66658 66746 67209 68358 70171 72197 74005 75470 76591 77367 77909 78394 78761 78692 78040 77144 76554
54154G6554q0J02k60r08j362j353j029o18n3P90J585J672Q41l73j324j817j896
$$ 76554 76474 76576 76316 75408 74046 72693 71664 71046 70993 71783 73368 75040 75881 75508 74184 72367 70471
54137G0471j566r89n55l89j93J33J41l81p60l00N71P26j33j126j354q22p3M77
$$ 70471 68905 67916 67361 66972 66779 66912 67053 66672 65912 65612 66183 66909 66776 65650 64296 63474 63401 63878
54119F3878O47L78j88p48j066j073p86l89j96k37o8N96J304J417J072Q95R43P18
$$ 63878 64525 64903 64715 63967 62901 61828 61042 60653 60457 60220 60152 60748 62052 63469 64541 65436 66379 67097
54101F7097K35J08M15M00k99r61r72q68j399k107j898p63Q4r9o72o65p1L98L72
$$ 67097 67332 67440 67855 68255 67956 66995 66023 65155 63756 61649 59751 58988 59072 58973 58301 57636 57565 57963 58335
54082E8335J39M6O0p2m76j039j462j382o62L28Q66N63j41m31q6L03J33m85j038
$$ 58335 58474 58520 58580 58508 58032 56993 55531 54149 53487 53815 54681 55244 55103 54672 54586 54889 55022 54537 53499
54063E3499j234j017l15P12J428J331Q40Q02J260J368O82k04n62l99pO69J614
$$ 53499 52265 51248 50933 51645 53073 54404 55244 56046 57306 58674 59356 59152 58590 58191 58184 58853 60467
54046F0467K201J785O00n68j314j696j628r06J23P07N82K42J51K18K25K51M06
$$ 60467 62668 64453 65053 64485 63171 61475 59847 58941 59064 59771 60353 60595 60746 60964 61189 61440 61846
54029F1846N17M45M02O26R12P80J17o46q90l77N27J128J081Q03R54J491J630R65
$$ 61846 62363 62808 63210 63836 64748 65528 65645 64999 64109 63732 64259 65387 66468 67271 68225 69716 71346 72311
54011G2311J10j44M2q4n64n75K81J282J532J127Q20Q71Q42L60m07j071j303q36
$$ 72311 72421 72277 72319 72235 71671 71096 71377 72659 74191 75318 76138 77009 77851 78211 77804 76733 75430 74594
53993G4594L26J595K198K047J790J842J863J473R90R33J211J337J252J339J718
$$ 74594 74920 76515 78713 80760 82550 84392 86255 87728 88718 89651 90862 92199 93451 94790 96508
53978I6508K125K402K665K846K719K459K638L362L960L824L285L177L745M412
$$ 96508 98633 101035 103700 106546 109265 111724 114362 117724 121684 125508 128793 131970 135715 140127
53964A40127M577M276L953L853L767L359K614J925J672J731J594R71J42m98j012
$$ 140127 144704 148980 152933 156786 160553 163912 166526 168451 170123 171854 173448 174419 174561 174063 173051
53949A73051j775k729l105k269p28J11n86k120l087l000k620k742l238l524l414
$$ 173051 171276 168547 165442 163173 162445 162556 161970 159850 156763 153763 151143 148401 145163 141639 138225
53934A38225l084k615k069j811k147k762l008k682k106j472o33L20Q16L62q11
$$ 138225 135141 132526 130457 128646 126499 123737 120729 118047 115941 114469 113836 114156 114972 115334 114523
53919A14523j893k172j610q81p22j155j445j038k20L98P09R78J207J207J082R77
$$ 114523 112630 110458 108848 107967 107245 106090 104645 103607 103387 103785 104494 105472 106679 107886 108968 109945
53903A09945N72m71j670k093j597r17n25j59L84Q47J092J293J349Q59M8j88M81
$$ 109945 110517 110046 108376 106283 104686 103769 103244 103085 103469 104316 105408 106701 108050 108909 108957 108769 109250
53886A09250J317J656J731J950K192K372K871L640L759K704J398J089J773K567
$$ 109250 110567 112223 113954 115904 118096 120468 123339 126979 130738 133442 134840 135929 137702 140269
53872A40269L063L319L114K311J604J736K209J903Q10M3J64O91J293K235L363
$$ 140269 143332 146651 149765 152076 153680 155416 157625 159528 160338 160381 160545 161236 162529 164764 168127
53857A68127L785L180K470K605L350L890M044M247M687N027M912M401L940L921
$$ 168127 171912 175092 177562 180167 183517 187407 191451 195698 200385 205412 210324 214725 218665 222586
53843B22586M139L793K375M66q25j119r12o72m62n08j196k308l013k999k931l345
$$ 222586 226725 230518 232893 233359 232534 231415 230503 229831 229369 228861 227665 225357 222344 219345 216414 213069
53827B13069l808l695l240l164l664m334m775m789m242l272k473k381k864l392
$$ 213069 209261 205566 202326 199162 195498 191164 186389 181600 177358 174086 171613 169232 166368 162976
53813A62976l718l889l848l450k901k721l158l847m100l494k205r36l81o37j189
$$ 162976 159258 155369 151521 148071 145170 142449 139291 135444 131344 127850 125645 124709 124328 123691 122502
53798A22502j512j521j438j395j344j184q90o35p47j316j935k131j993j973k087
$$ 122502 120990 119469 118031 116636 115292 114108 113218 112583 111836 110520 108585 106454 104461 102488 100401
53783A00401j898j323q63p59n76MN79O24K94Q3L7p8j69L5L79M11R2j00K61J102
$$ 100401 98503 97180 96317 95558 94982 94986 95565 96189 96483 96566 96603 96525 96356 96391 96770 97181 97273 97173 97434 98536
53763I8536J941K134J298r6q27r2J496K569K510J844J262Q97O61O28P91Q84P48
$$ 98536 100477 102611 103909 103813 102986 102894 104390 106959 109469 111313 112575 113472 114133 114761 115552 116436 117184
53746A17184O63J008J748K453K792K863L105L828M793N353N136M440L820L417
$$ 117184 117847 118855 120603 123056 125848 128711 131816 135644 140437 145790 150926 155366 159186 162603
53732A62603K981K396J850J536J425J370J192P78K89J01K88L85M0l09rP63J110
$$ 162603 165584 167980 169830 171366 172791 174161 175353 176131 176420 176521 176809 177194 177234 176925 176916 177679 178789
53715A78789O11k38q72j352j932k542l000l326l482l266k725k327k317k335k037
$$ 178789 179400 179162 178290 176938 175006 172464 169464 166138 162656 159390 156665 154338 152021 149686 147649
53700A47649j651j535j516j267r78j095j504j645j331r46q31r62j206j441j376
$$ 147649 145998 144463 142947 141680 140702 139607 138103 136458 135127 134181 133350 132388 131182 129741 128365
53685A28365q05l0L77K90K9l08q57j286r07K33J045P46j00m79l39l84q12j117
$$ 128365 127560 127530 127907 128197 128226 127918 127061 125775 124868 125101 126146 126892 126792 126313 125974 125590 124778 123661
53667A23661r92o39j16Q05J937K496J985Q45p0k52L30J386K247K166J154K07K15
$$ 123661 122669 122030 121914 122719 124656 127152 129137 129982 129912 129660 129990 131376 133623 135789 136943 137150 137365
53650A37365Q88J266J054Q99J397K370L276L825L997L749L128K459K194K491L051
$$ 137365 138253 139519 140573 141472 142869 145239 148515 152340 156337 160086 163214 165673 167867 170358 173409
53635A73409L396L251K725K176J897J913K086K303K493K595K597K551K431K145
$$ 173409 176805 180056 182781 184957 186854 188767 190853 193156 195649 198244 200841 203392 205823 207968
53621B07968J764J594J765J896J477N89j48l29j78j02j37n5K36O28R76J129R12
$$ 207968 209732 211326 213091 214987 216464 217053 216905 216576 216398 216296 216159 216104 216340 216968 217944 219073 219985
53604B19985L67j17j57J53L31J36k07l87m05m15m42n25r38j840k746k799j814
$$ 219985 220352 220235 220078 220231 220562 220698 220491 220104 219699 219284 218842 218317 217379 215539 212793 209994 208180
53587B08180o59k98o84r43n45K13Q16J110J176J002O31L17L25O39J082J498J769
$$ 208180 207521 207223 206539 205596 205051 205264 206080 207190 208366 209368 209999 210316 210641 211280 212362 213860 215629
53570B15629J781J639J619J805J942J830J617J486J383J293J542K372L479M243
$$ 215629 217410 219049 220668 222473 224415 226245 227862 229348 230731 232024 233566 235938 239417 243660
53556B43660M363L975L420L142L528M380M812M221L188K856L507M371M757M744
$$ 243660 248023 251998 255418 258560 262088 266468 271280 275501 278689 281545 285052 289423 294180 298924
53542B98924M652M527M398M487M791M899M561M128M075M362M532M288L716L054
$$ 298924 303576 308103 312501 316988 321779 326678 331239 335367 339442 343804 348336 352624 356340 359394
53528C59394K434J843J261Q69R69J514J882J572R28P41J124J405J138O42K95M
$$ 359394 361828 363671 364932 365801 366770 368284 370166 371738 372666 373407 374531 375936 377074 377716 378011 378015
53512C78015l72n64l74j44k97p26j066j269j473j547j271q30o86r80j342j250
$$ 378015 377643 377079 376705 376561 376264 375538 374472 373203 371730 370183 368912 368082 367396 366416 365074 363824
53496C63824m89O44J472J460Q09K21M9Rj04O2P43J484J727J652J861K405K763
$$ 363824 363335 363979 365451 366911 367720 367941 367990 367999 367895 367957 368700 370184 371911 373563 375424 377829 380592
53479C80592K667K409K301K323K389K584L033L798M908O262P539Q415Q837Q971
$$ 380592 383259 385668 387969 390292 392681 395265 398298 402096 407004 413266 420805 429220 438057 447028
53465D47028Q956Q966R290J0086J1125J2050J2721J3157J3385J3611J4255J5468
$$ 447028 455984 464950 474240 484326 495451 507501 520222 533379 546764 560375 574630 590098
53453E90098J6812J7820J8599J9514K0522K1285K1837K2546K3535K4590K5565
$$ 590098 606910 624730 643329 662843 683365 704650 726487 749033 772568 797158 822723
53442H22723K6438K7052K7341K7708K8599K9727L0289L0027K9490K9193K9116
$$ 822723 849161 876213 903554 931262 959861 989588 1019877 1049904 1079394 1108587 1137703
53431A137703K9138K9368K9705K9733K9394K9317L0008L1015L1404L0912L0224
$$ 1137703 1166841 1196209 1225914 1255647 1285041 1314358 1344366 1375381 1406785 1437697 1467921
53420A467921L0052L0215K9749K7967K5307K3047K1993K1744K1424K0770K0060
$$ 1467921 1497973 1528188 1557937 1585904 1611211 1634258 1656251 1677995 1699419 1720189 1740249
53409A740249J9197J7720J5727J4003J2962J2122J0943R577Q261O636M224J277
$$ 1740249 1759446 1777166 1792893 1806896 1819858 1831980 1842923 1852500 1860761 1867397 1871621 1872898
53397A872898j497l842n985q031r891j1685j3671j5686j7291j8467j9694k1201
$$ 1872898 1871401 1867559 1861574 1853543 1843652 1831967 1818296 1802610 1785319 1766852 1747158 1725957
53385A725957k2562k3272k3415k3470k3787k4408k5262k6237k7135k7667k7558
$$ 1725957 1703395 1680123 1656708 1633238 1609451 1585043 1559781 1533544 1506409 1478742 1451184
53374A451184k6649k5087k3375k2018k1049k0064j8771j7250j5567j3513j1033
$$ 1451184 1424535 1399448 1376073 1354055 1333006 1312942 1294171 1276921 1261354 1247841 1236808
53363A236808q587o675n110l300j183O70K025L542N902Q824J1349J2972J4088
$$ 1236808 1228221 1221546 1216436 1213136 1211953 1212623 1214648 1218190 1224092 1232916 1244265 1257237 1271325
53350A271325J5435J7440J9997K2602K4756K6479K8307L0503L2577L4033L5203
$$ 1271325 1286760 1304200 1324197 1346799 1371555 1398034 1426341 1456844 1489421 1523454 1558657
53339A558657L6745L8548L9927M0866M2123M4058M6285M8611N1324N4172N6161
$$ 1558657 1595402 1633950 1673877 1714743 1756866 1800924 1847209 1895820 1947144 2001316 2057477
53328B057477N7134N8412O0934O3659O5024O5239O5751O6854O7371O6704O5712
$$ 2057477 2114611 2173023 2233957 2297616 2362640 2427879 2493630 2560484 2627855 2694559 2760271
53317B760271O5192O4728O3564O1628N9133N6017N2342M8609M5111M1521L7577
$$ 2760271 2825463 2890191 2953755 3015383 3074516 3130533 3182875 3231484 3276595 3318116 3355693
53306C355693L3589K9892K6281K2454J8526J4627J0416N535J56n331j0867j6556
$$ 3355693 3389282 3419174 3445455 3467909 3486435 3501062 3511478 3517013 3517169 3511838 3500971 3484415
53294C484415k2253k7803l3445l9548m6120n2758n8923o4019o7522o9319o9736
$$ 3484415 3462162 3434359 3400914 3361366 3315246 3262488 3203565 3139546 3072024 3002705 2932969
53283B932969o9094o7674o6149o5407o5574o5755o5191o4149o3252o2473o1476
$$ 2932969 2863875 2796201 2730052 2664645 2599071 2533316 2468125 2403976 2340724 2278251 2216775
53272B216775o0406n9576n8655n6952n4440n1750m9245m6757m4180m1649l9068
$$ 2216775 2156369 2096793 2038138 1981186 1926746 1874996 1825751 1778994 1734814 1693165 1654097
53261A654097l6096l2778k9692k7308k5600k4334k3235k1865j9883j7599j5727
$$ 1654097 1618001 1585223 1555531 1528223 1502623 1478289 1455054 1433189 1413306 1395707 1379980
53250A379980j4380j2833j0581q158o421n461m653l554k235q09P42K209L188L703
$$ 1379980 1365600 1352767 1342186 1334028 1327607 1322146 1317493 1313939 1311704 1310895 1311637 1313846 1317034 1320737
53236A320737M473O153Q563J0986J3067J4953J6629J7819J8721K0184K2565K4918
$$ 1320737 1325210 1331363 1339926 1350912 1363979 1378932 1395561 1413380 1432101 1452285 1474850 1499768
53224A499768K6035K6083K6449K7861K9503L0172K9674K8668K7727K6955K6133
$$ 1499768 1525803 1551886 1578335 1606196 1635699 1665871 1695545 1724213 1751940 1778895 1805028
53213A805028K4806K2649K0050J7952J6699J5545J3773J1772J0280R004P023M356
$$ 1805028 1829834 1852483 1872533 1890485 1907184 1922729 1936502 1948274 1958554 1967558 1974581 1978937
53201A978937K079O27j071m189q358j2170j5003j7608k0817k4319k7148k9148
$$ 1978937 1981016 1981643 1980572 1976383 1968025 1955855 1940852 1923244 1902427 1878108 1850960 1821812
53189A821812l1233l4064l6959l8686l9071l9109l9524l9956l9842l9329l8766
$$ 1821812 1790579 1756515 1719556 1680870 1641799 1602690 1563166 1523210 1483368 1444039 1405273
53178A405273l7917l6416l4656l3452l2952l2509l1646l0543k9620k9139k9152
$$ 1405273 1367356 1330940 1296284 1262832 1229880 1197371 1165725 1135182 1105562 1076423 1047271
53167A047271k9383k9158k8030k6389k4995k3926k2614k0888j9293j8245j7494
$$ 1047271 1017888 988730 960700 934311 909316 885390 862776 841888 822595 804350 786856
53156G86856j6662j5792j4993j4138j3249j2780j3057j3666j3840j3332j2557
$$ 786856 770194 754402 739409 725271 712022 699242 686185 672519 658679 645347 632790
53145F32790j1919j1400j0834j0354j0282j0572j0613r949r060q952r801j0595
$$ 632790 620871 609471 598637 588283 578001 567429 556816 546867 537807 528855 519054 508459
53133E08459j0544j0239j0704j1689j1938j0991r769r177r013q668q117p725p615
$$ 508459 497915 487676 476972 465283 453345 442354 432585 423408 414395 405727 397610 389885 382270
53120C82270p657p723p552o787n572m673m684n379o081o333n922m851l643l188
$$ 382270 374613 366890 359338 352551 346979 342306 337622 332243 326162 319829 313907 309056 305413 302225
53106C02225l777m633m837m376l812l389l015k769k805k959l051l300l884m308
$$ 302225 298448 293815 288978 284602 280790 277401 274386 271617 268812 265853 262802 259502 255618 251310
53092B51310l897k795j844j536j676k053k706l411l601l085k393k081k080j975
$$ 251310 247413 244618 242774 241238 239562 237509 234803 231392 227791 224706 222313 220232 218152 216177
53078B16177j594j129q57r44j309j600j489j074p45o62o56o31o59o68m64k13m76
$$ 216177 214583 213454 212597 211653 210344 208744 207255 206181 205436 204774 204118 203487 202828 202160 201696 201483 201007
53061B01007j451k493k736k024r65k44q5k96n53o87q56j337k104k725k810k414
$$ 201007 199556 197063 194327 192303 191338 191094 191009 190713 190160 189473 188617 187280 185176 182451 179641 177227
53045A77227j980j859k038k182j914j233o39o53j213j782k089k340k590k417j598
$$ 177227 175247 173388 171350 169168 167254 166021 165382 164729 163516 161734 159645 157305 154715 152298 150700
53030A50700o75l12l47j49K49P9r19j868j824j003l98m08m55M2Q46J305J196Q20
$$ 150700 150025 149713 149366 149217 149466 149545 148626 146758 144934 143931 143533 143125 142670 142712 143558 144863 146059 146879
53012A46879M69J86K0J53N78R46R80Q66R08R82O46p6n38k56M40Q43P11L44l4n03
$$ 146879 147348 147534 147554 147707 148285 149231 150211 151077 151985 152967 153613 153537 152999 152743 153183 154026 154737 155081 155047 154544
52992A54544j124j768k338k782k909k544j935j667j938k319k397k297k259k123
$$ 154544 153420 151652 149314 146532 143623 141079 139144 137477 135539 133220 130823 128526 126267 124144
52978A24144j658j116r48j107j201j209j465j897j934j362p25n73p91j019j315
$$ 124144 122486 121370 120422 119315 118114 116905 115440 113543 111609 110247 109522 108949 108158 107139 105824
52963A05824j865k369k275j556q07n04n62o08l86Q7M67K42o42j389j022L86J577
$$ 105824 103959 101590 99315 97759 96952 96448 95886 95278 94892 94979 95446 95688 95046 93657 92635 93021 94598
52946I4598J482L50p08j030q57o91p03p38n65r3N10Q46O71K22k6O2K10K75M72
$$ 94598 96080 96430 95722 94692 93835 93144 92441 91703 91138 91045 91555 92401 93072 93294 93268 93330 93540 93815 94287
52927I4287R23J240R58K13l61m21k75l68o80q04m55K46Q73J048P69N05P34J274
$$ 94287 95210 96450 97408 97621 97260 96839 96564 96196 95516 94712 94257 94503 95376 96424 97193 97698 98432 99706
52909I9706J376O89j52k69L23Q38Q98R72J482K077K158J708J181Q20N35K69R0
$$ 99706 101082 101771 101619 101350 101673 102511 103409 104381 105863 107940 110098 111806 112987 113807 114342 114611 114701
52892A14701k0o0J48O64J104J049P67R73J766K368K173J558J254J262R45Q8o84
$$ 114701 114681 114621 114769 115433 116537 117586 118353 119326 121092 123460 125633 127191 128445 129707 130652 130740 130056
52875A30056o68J68J305K281K876K886K104O80p00j217o02O11J586J860J623J406
$$ 130056 129388 129556 130861 133142 136018 138904 141008 141688 140988 139771 139169 139780 141366 143226 144849 146255
52859A46255J570K054K470K489K079J499J059R81J324J918K362K320J859J372
$$ 146255 147825 149879 152349 154838 156917 158416 159475 160456 161780 163698 166060 168380 170239 171611
52845A71611J062P53K75j70l31l34m83p50q18o56o30r41j250j096n04P2K43j8
$$ 171611 172673 173426 173701 173531 173200 172866 172383 171633 170815 170159 169529 168588 167338 166242 165738 165810 166053 166035
52827A66035n02r80j242j111n53K38Q87J068P57K56p8j75k73n78r82j141q54l30
$$ 166035 165533 164553 163311 162200 161647 161885 162772 163840 164597 164853 164775 164600 164327 163749 162767 161626 160772 160442
52809A60442j5j23l81l62nL11K06l38j000j403j288o73O2M81N72P40J207J696
$$ 160442 160427 160304 159923 159561 159556 159867 160073 159735 158735 157332 156044 155371 155433 155914 156486 157226 158433 160129
52791A60129J870J813J759J602J103M15K9R5J79j51p33r90o67k14l32j071j654
$$ 160129 161999 163812 165571 167173 168276 168691 168720 168815 168994 168843 168110 167120 166453 166239 165907 164836 163182
52774A63182j413p11m31o18l98N56J292R02j11o25n32o14j060j152n51J02J08
$$ 163182 161769 161058 160627 160009 159611 160167 161459 162361 162250 161625 161093 160479 159419 158267 157716 157818 157926
52757A57926m33r95j270j131n83K9J90j76o46r71j261j466j250o70k85l86o08
$$ 157926 157493 156498 155228 154097 153514 153543 153733 153557 152911 151940 150679 149213 147963 147293 147008 146622 146014
52740A46014o13n00l04K37J075J600J501J255J283J224N80m11j156j497j602j519
$$ 146014 145401 144901 144597 144834 145909 147509 149010 150265 151548 152772 153352 152941 151785 150288 148686 147167
52724A47167j388j599k139k277j636r65j050j439j223p28j109k390l176k602j454
$$ 147167 145779 144180 142041 139764 138128 137163 136113 134674 133451 132723 131614 129224 126048 123446 121992
52709A21992q84r38r65p87p79j122j579j850j765j336q62p93j258j839k027j738
$$ 121992 121108 120170 119205 118418 117639 116517 114938 113088 111323 109987 109125 108332 107074 105235 103208 101470
52693A01470j258q60o70p13r30j136j145q85n16l53o07j069j298j214j182j307
$$ 101470 100212 99352 98682 97969 97039 95903 94758 93873 93357 93004 92397 91328 90030 88816 87634 86327
52677H6327j088k25N67K74r74j905j637n57M87J203J657J640Q59l88j250j154
$$ 86327 85239 85014 85581 85855 84881 82976 81339 80782 81269 82472 84129 85769 86628 86240 84990 83836
52661H3836l36N28J074J415J654J451M70q80j662j535j210j372j718j567r88n47
$$ 83836 83500 84028 85102 86517 88171 89622 90092 89212 87550 86015 84805 83433 81715 80148 79160 78613
52645G8613k53L31J006R59J7r81j328j250j160r28l81P7J3l06l22m8O0j23k61
$$ 78613 78360 78691 79697 80656 80673 79692 78364 77114 75954 75026 74645 74722 74735 74429 74107 74059 74119 73996 73735
52626G3735j22J73M39O27P46P64O57M38K73M16R00J309J239R61J036J334J102
$$ 73735 73613 73786 74225 74852 75598 76362 77019 77457 77730 78146 79046 80355 81594 82555 83591 84925 86027
52609H6027K37l49o4M07J97l54k71M86J055J097J189J660J971J611R18N64O59
$$ 86027 86264 85915 85851 86258 86455 86101 85830 86316 87371 88468 89657 91317 93288 94899 95817 96381 97040
52592I7040P98P32N98O42R69J432J650J267L38o35j160j133p46k55R8J69J20K96
$$ 97040 97838 98570 99168 99810 100779 102211 103861 105128 105466 104831 103671 102538 101792 101537 101635 101804 101924 102220
52574A02220P80J192J137P82P12J233J953K144J479L47m94o26l15j70n28j192
$$ 102220 103000 104192 105329 106111 106823 108056 110009 112153 113632 113979 113485 112859 112544 112374 111846 110654
52558A10654j722j871j640j121m73kN1j32OP09J424J414Q00M78Q35J110M68p04
$$ 110654 108932 107061 105421 104300 103827 103825 103876 103744 103750 104459 105883 107297 108097 108575 109410 110520 110988 110284
52540A10284j232p32N4N03Q52J382J640J107K28K6P69J655J821J254N81L53O98
$$ 110284 109052 108320 108374 108877 109729 111111 112751 113858 114086 114112 114881 116536 118357 119611 120192 120545 121243
52523A21243J387K041K379K386K189J782J030l9j057j493j063n8Q11J007P07N38
$$ 121243 122630 124671 127050 129436 131625 133407 134437 134398 133341 131848 130785 130727 131538 132545 133252 133790
52507A33790P54R32O56K11K51Q69J391J165K78o15r62p23k35J38K50J92J47K42
$$ 133790 134544 135476 136132 136343 136594 137463 138854 140019 140297 139682 138720 137997 137762 137900 138150 138342 138489 138731
52489A38731M54O43O84N77L95O7n47j240j364n23P38J463J385J053Q31M37k77
$$ 138731 139185 139828 140512 141089 141484 141551 141004 139764 138400 137877 138615 140078 141463 142516 143347 143784 143507
52472A43507p96p02l82l68m59j81K31K26M0M86J549K137J552L99l96p26r33r11
$$ 143507 142711 142009 141627 141259 140800 140619 140850 141076 141116 141602 143151 145288 146840 147239 146843 146117 145184 144273
52454A44273m03K35L27m6j27L89R24Q93M78J59j7k79n61n99m70n23p68q15n35
$$ 144273 143870 144105 144432 144386 144259 144648 145572 146465 146943 147102 147085 146806 146245 145646 145176 144653 143885 143070 142535
52435A42535k99l40l09J18N64M33j20l38L8L71M7o86j110q63j53N80R00N89n2
$$ 142535 142236 141896 141587 141705 142269 142702 142582 142244 142282 142653 142700 142014 140904 140041 139888 140468 141368 141957 141905
52416A41905l77j46J28q7n85q18p99j028j662k191k058j203p7O43M04o31j449
$$ 141905 141528 141382 141510 141423 140838 140020 139221 138193 136531 134340 132282 131079 131002 131645 132049 131418 129969
52399A29969j155k7Q42R74R01J061J070N08k20m33j80p2k96m19j39K98N44N86
$$ 129969 128814 128787 129629 130603 131504 132565 133635 134143 133923 133490 133310 133238 132942 132523 132384 132682 133226 133812
52381A33812O12P21R37J215J397J299R71O63M95L61K18J56L2n73j692k503k062
$$ 133812 134424 135145 136082 137297 138694 139993 140964 141627 142122 142483 142701 142857 142889 142316 140624 138121 136059
52364A36059n21Q87J248Q65N09K85k33j024j519j440j117p60q0J074K182K591
$$ 136059 135538 136425 137673 138538 139047 139332 139099 138075 136556 135116 133999 133239 133159 134233 136415 139006
52348A39006K293J695R72J61l60j56N58J034R95R71J444K053K007J098J9l30K46
$$ 139006 141299 142994 143966 144127 143767 143611 144169 145203 146198 147169 148613 150666 152673 153771 153790 153460 153706
52331A53706J033J162N78Q7L59J058J324R20M86P24J651K684L099K455J030j30
$$ 153706 154739 155901 156479 156566 156925 157983 159307 160227 160713 161437 163088 165772 168871 171326 172356 172226
52315A72226o8R51J626J145J35k48K41Q56R61P31O71Q91J046Q93O82Q94J576K137
$$ 172226 172158 173109 174735 175880 176015 175767 176008 176864 177825 178556 179227 180118 181164 182057 182739 183633 185209 187346
52297A87346K001J350R31J155J726K164K234J841J019L04N29J807L039L009J803
$$ 187346 189347 190697 191628 192783 194509 196673 198907 200748 201767 202071 202600 204407 207446 210455 212258
52282B12258O72N64J207J648J314M88J9N47J859L013L298K938K630K635K719K819
$$ 212258 212930 213494 214701 216349 217663 218151 218170 218717 220576 223589 226887 229825 232455 235090 237809 240628
52266B40628L209L966M719N131N262N227M891M182L505L463M213N339O333P104
$$ 240628 243837 247803 252522 257653 262915 268142 273033 277215 280720 284183 288396 293735 300068 307172
52252C07172P995R305J0833J1909J2094J1749J1687J2267J3026J3371J3275J3122
$$ 307172 315167 324472 335305 347214 359308 371057 382744 395011 408037 421408 434683 447805
52240D47805J3155J3412J4000J4992J6023J6452J6098J5509J5313J5454J5390
$$ 447805 460960 474372 488372 503364 519387 535839 551937 567446 582759 598213 613603
52229F13603J4872J4234J3811J3379J2403J0763R013P814P232O744N945N012M377
$$ 613603 628475 642709 656520 669899 682302 693065 702078 709892 717124 723868 729813 734825 739202
52216G39202M058L615K729J568M41o33j775k801l314l180k632j969j398j180j509
$$ 739202 743260 746875 749604 751172 751613 750980 749205 746404 743090 739910 737278 735309 733911 732731 731222
52201G31222k075k201j624q23k97J35R12J954K838L561M575O062P666R056J0209
$$ 731222 729147 726946 725322 724499 724202 724337 725249 727203 730041 733602 738177 744239 751905 760961 771170
52186G71170J1020J1154J0583R900R754J0174J0638J0631J0005R022Q258Q157
$$ 771170 782190 793344 803927 813827 823581 833755 844393 855024 865029 874051 882309 890466
52174H90466Q456Q286P079N140L177J534J95p85j341j759k530l862n569p336q770
$$ 890466 898922 907208 914287 919427 922604 924138 924333 923548 922207 920448 917918 914056 908487 901151 892381
52159H92381r411r140q556q512r139r761r839r561r321r044q408p552p081p357
$$ 892381 882970 873830 865274 856762 847623 837862 828023 818462 809141 800097 791689 784137 777056 769699
52145G69699q017q323p857o871n916n300m845m257l524k915k574k314j817r87
$$ 769699 761682 753359 745502 738631 732715 727415 722570 718313 714789 711874 709300 706986 705169 704182
52131G04182p8M86M80R0k57l08j35J01L75N82M24k50j043j369j127p90p48r32
$$ 704182 704104 704590 705070 705160 704903 704595 704460 704561 704936 705518 705942 705692 704649 703280 702153 701363 700615 699683
52113F99683j132j403j934k668l286l456l067k383j960k225l028l758m006l879
$$ 699683 698551 697148 695214 692546 689260 685804 682737 680354 678394 676169 673141 669383 665377 661498
52099F61498l628l314k992k878l002k992k575k110k156k650k977k917k909l217
$$ 661498 657870 654556 651564 648686 645684 642692 640117 638007 635851 633201 630224 627307 624398 621181
52085F21181l400k950k129j635j657j692j314p12m13p68j750k965l765l640k646
$$ 621181 617781 614831 612702 611067 609410 607718 606404 605692 605279 604511 602761 599796 596031 592391 589745
52070E89745j319j80N00N34m9o49m10P69J973K428K534L125M083M499M152L944
$$ 589745 588426 588246 588746 589280 589231 588582 588172 588941 590914 593342 595876 599001 603084 607583 611735 615679
52054F15679M621N831O862P712Q871J0435J1974J3084J3626J3688J3688J4250
$$ 615679 620300 626131 632993 640705 649576 660011 671985 685069 698695 712383 726071 740321
52042G40321J5519J6785J7337J7469J8017J9046J9688J9351J8395J7441J6601
$$ 740321 755840 772625 789962 807431 825448 844494 864182 883533 901928 919369 935970
52031I35970J5744J4950J4272J3387J1952J0154Q487P114N792M336K854J541M39
$$ 935970 951714 966664 980936 994323 1006275 1016429 1024916 1032030 1037822 1042158 1045012 1046553 1046992
52018A046992n93j761l181m685n924o717p230p690q076q230q116p839p498p185
$$ 1046992 1046399 1044638 1041457 1036772 1030848 1024131 1016901 1009211 1001135 992905 984789 976950 969452 962267
52004I62267o937o611n931m820l551k447j557q02j44N46J533K835L955M443M528
$$ 962267 955330 948719 942788 937968 934417 931970 930413 929611 929467 930013 931546 934381 938336 942779 947307
51989I47307M905N864P027P931Q437Q539Q191P511O856O467O204N793N102M106
$$ 947307 952212 958076 965103 973034 981471 990010 998201 1005712 1012568 1019035 1025239 1031032 1036134 1040240
51975A040240K722R97p07j940k635l198m055n183o168o772p319q340r853j1315
$$ 1040240 1042962 1043959 1043252 1041312 1038677 1035479 1031424 1026241 1020073 1013301 1005982 997642 987789 976474
51961I76474j2406j3448j4673j5477j5136j4109j3804j4835j6284j6997j7010
$$ 976474 964068 950620 935947 920470 905334 891225 877421 862586 846302 829305 812295
51950H12295j7039j7234j7172j6813j6635j6850j7151j7231j7000j6300j5070
$$ 812295 795256 778022 760850 744037 727402 710552 693401 676170 659170 642870 627800
51939F27800j3904j3722j4597j5492j5539j5059j4853j4973j4807j4135j3424
$$ 627800 613896 600174 585577 570085 554546 539487 524634 509661 494854 480719 467295
51928D67295j3066j2894j2599j2215j1948j1787j1479j0890j0174r625r356r213
$$ 467295 454229 441335 428736 416521 404573 392786 381307 370417 360243 350618 341262 332049
51916C32049r000q741q504q101p297o380o060o498o830o111m573l350l105l428
$$ 332049 323049 314308 305804 297703 290406 284026 277966 271468 264638 258527 253954 250604 247499 244071
51902B44071l665l740l865l940l729l371l267l561l986m288m487m666m704m339
$$ 244071 240406 236666 232801 228861 225132 221761 218494 214933 210947 206659 202172 197506 192802 188463
51888A88463l467k361j609j728k671l702l930l099j761o67j18J8k12r54k069k886
$$ 188463 184996 182635 181026 179298 176627 172925 168995 165896 164135 163468 163350 163368 163156 162202 160133 157247
51872A57247k821k105j525j418j359r75o03p59j261j438j051n38k61o8K63N90
$$ 157247 154426 152321 150796 149378 148019 147044 146441 145682 144421 142983 141932 141394 141133 141065 141328 141918
51856A41918O42M37J66j54o21j107j257q96l39k17q31j697j880j032O4K90n08
$$ 141918 142560 142997 143163 143009 142388 141281 140024 139128 138789 138572 137741 136044 134164 133132 133196 133486 132978
51839A32978j427j737j660j705j767j382o04n6j14m15l74J35P06Q18L11m84r90
$$ 132978 131551 129814 128154 126449 124682 123300 122696 122640 122526 122111 121737 121872 122578 123396 123707 123223 122233
51822A22233q85m30j84m00p71q25m97k01k75m91k99L77Q81O00j65n31j65L15K53
$$ 122233 121348 120918 120734 120334 119563 118738 118241 118040 117765 117274 116975 117352 118233 118833 118668 118137 117972 118287 118540
51803A18540j84k98K19R35J185P65J28m9L37N79L8q52r73RJ117J347Q56M80N05
$$ 118540 118356 118058 118277 119212 120397 121162 121290 121241 121578 122157 122195 121343 120370 120379 121496 122843 123699 124179 124684
51784A24684N32K72r6j92L17J442K467K231N73j000r05M82J345R31L42O36J292
$$ 124684 125216 125488 125392 125200 125517 126959 129426 131657 132230 131230 130325 130807 132152 133083 133425 134061 135353
51767A35353J245N36M0J02K93K27r0n27q46n59N55J834K246J563N53m8l03o45
$$ 135353 136598 137134 137174 137276 137569 137796 137706 137179 136333 135774 136329 138163 140409 141972 142525 142477 142174 141529
51749A41529j133j440j297p52o7M00M18O0l08l75j56J44M43Q07J225J448J214
$$ 141529 140396 138956 137659 136907 136840 137240 137658 137718 137410 137035 136879 137023 137466 138273 139498 140946 142160
51732A42160O50K81N37J247J801J807J511J492K052K873L282K911K196K062K830
$$ 142160 142810 143091 143628 144875 146676 148483 149994 151486 153538 156411 159693 162604 164800 166862 169692
51717A69692L602L260K043J471K400L754L838K508J173Q23R07M33n48j191j149
$$ 169692 173294 176554 178597 180068 182468 186222 190060 192568 193741 194564 195471 195904 195356 194165 193016
51702A93016r81j305k062k702k784k245j347n57l36p37j183q92K96J605K049J463
$$ 193016 192035 190730 188668 185966 183182 180937 179590 179033 178697 177960 176777 175885 176181 177786 179835 181298
51686A81298O07K00J96J89J79M66R49J145R83J013J522J936J586P48L10N56Q96
$$ 181298 181905 182105 182301 182490 182669 183135 184084 185229 186212 187225 188747 190683 192269 193017 193327 193883 194779
51669A94779Q16M76K28J07J46O30J583K357K291J589J021Q80P56L61%J35Q40J839
$$ 194779 195595 196071 196299 196406 196552 197182 198765 201122 203413 205002 206023 206903 207659 208020 208020 208155 208995 210834
51651B10834K713K999K491J581R55Q09P98P70J061J751K189J770Q20J61O0J22
$$ 210834 213547 216546 219037 220618 221573 222382 223180 223950 225011 226762 228951 230721 231541 231702 231762 231884
51635B31884O8O4K35M07M26L80L96M63N18N57O11P26R29J077R29N16J28j96q58
$$ 231884 231952 232016 232251 232658 233084 233464 233860 234323 234841 235398 236009 236735 237664 238741 239670 240186 240314 240118 239260
51616B39260j999k984l135k691k460k667k765k377j788j432j399j559j745j695
$$ 239260 237261 234277 231142 228451 225991 223324 220559 218182 216394 214962 213563 212004 210259 208564
51602B08564j282q54q56j181j309j066p05l91k00n09j581k716k813j888j127j102
$$ 208564 207282 206428 205572 204391 203082 202016 201311 200920 200720 200211 198630 195914 193101 191213 190086 188984
51586A88984j033k91M29K55m33o90m41l11m79o93j040j682k120j642m48N50R21
$$ 188984 187951 187660 188089 188344 187911 187221 186780 186469 185990 185297 184257 182575 180455 178813 178365 178915 179836
51569A79836R09N89k10j196j649j382r30o59m53l47p17j508j963j469k99P83J233
$$ 179836 180745 181334 181124 179928 178279 176897 175967 175308 174855 174508 173791 172283 170320 168851 168552 169335 170568
51552A70568R45K04l62k29M51J013J069P31J71n61j221j491j460j479j460j012
$$ 170568 171513 171717 171355 171126 171577 172590 173659 174390 174561 174000 172779 171288 169828 168349 166889 165877
51536A65877k75J02l8r9K47N66N02L23J79l34j298j892j480o62m12o26m59K50
$$ 165877 165602 165704 165666 165567 165814 166380 166882 167205 167384 167050 165752 163860 162380 161718 161306 160680 160221 160471
51518A60471Q02Q16O62O79P30O69O30O08L38j82m87k19M19R19J008P53L63M4j39
$$ 160471 161273 162089 162751 163430 164160 164829 165459 166067 166405 166223 165736 165517 165936 166855 167863 168616 168979 169023 168884
51499A68884l25o47r61r70o03j42O7q9m47o47m39J2J86k34r62j438j430j107p52
$$ 168884 168559 167912 166951 165981 165378 165236 165303 165214 164767 164120 163681 163693 163879 163645 162683 161245 159815 158708 157956
51480A57956n84p12r78r81n30Q5N15Q29J228J496J242N65M4N6M86J066J572J797
$$ 157956 157372 156660 155682 154701 154171 154256 154771 155600 156828 158324 159566 160131 160175 160231 160717 161783 163355 165152
51462A65152J663J428J323J134N13k70n54k32R2N0NL18O81N96J48j73j62p4j83
$$ 165152 166815 168243 169566 170700 171213 170943 170389 170157 170249 170299 170304 170622 171303 171899 172047 171874 171712 171638 171455
51443A71455m26m59K9Q96J508J418J000R84J403J545J092O42Q17J479K206K867
$$ 171455 171029 170570 170599 171495 173003 174421 175421 176405 177808 179353 180445 181087 181904 183383 185589 188456
51427A88456L315L069K004Q72M78O75P97P37Q50J076J012P17O53Q73J011J015
$$ 188456 191771 194840 196844 197716 198194 198869 199666 200403 201253 202329 203341 204058 204711 205584 206595 207610
51411B07610J142J225Q01Lm61l88l08m71m89k91l93p94o12M86J376J009N4q4O46
$$ 207610 208752 209977 210778 210781 210320 209932 209624 209153 208664 208373 207980 207186 206574 207060 208436 209445 209499 209415 210061
51392B10061R99L91m09o25l76m4L10N77M05j07k56K91R17R35N39L56M58M31J93
$$ 210061 211060 211451 211042 210417 210041 209997 210307 210884 211289 211182 210926 211217 212134 213069 213608 213964 214422 214853 215046
51373B15046Q6K24L16J54q0j64j78l55p36j168j547j912k302k550k331j561o80
$$ 215046 215132 215356 215672 215826 215746 215582 215404 215049 214313 213145 211598 209686 207384 204834 202503 200942 200262
51356B00262l58q13j544j863j574j076q28q89r56q30p19r87j583j949j682j114
$$ 200262 199904 199091 197547 195684 194110 193034 192206 191317 190361 189531 188812 187825 186242 184293 182611 181497
51340A81497q91j093j191r36p58j115j776k079j736j048n15m58r41j726k396k632
$$ 181497 180606 179513 178322 177386 176628 175513 173737 171658 169922 168874 168359 167901 166960 165234 162838 160206
51324A60206k422j937j331p75m97o02r34j214j309j250j141j088j082r47n90k52
$$ 160206 157784 155847 154516 153741 153244 152642 151708 150494 149185 147935 146794 145706 144624 143677 143087 142835
51308A42835k02j70L65J219J420M46r70j716j550r48k37L85L57p08k063k375j390
$$ 142835 142633 142463 142828 144047 145467 145913 144943 143227 141677 140729 140492 140877 141234 140526 138463 136088 134698
51291A34698k50P4o5J95R36J527J445O06p24j898k155j449o52n94j064j298j099
$$ 134698 134448 134522 134457 134652 135588 137115 138560 139166 138442 136544 134389 132940 132288 131694 130630 129332 128233
51274A28233q69p54m84n0Q3l33r47j342j577j915k276k287j777j043n80o56j074
$$ 128233 127364 126610 126126 126076 126159 125826 124879 123537 121960 120045 117769 115482 113705 112662 112082 111426 110352
51257A10352j297r50j83M78O98N66L61K32J63J21J13J69L06M09K31l68j106j444
$$ 110352 109055 108105 107922 108400 109098 109664 110025 110257 110420 110541 110654 110823 111129 111538 111769 111401 110295 108851
51239A08851j152n90k74k94k91K7N63R83J059P90K98k78q11j159j156o87J48J014
$$ 108851 107699 107109 106835 106541 106250 106277 106840 107823 108882 109672 109970 109692 108881 107722 106566 105879 106027 107041
51221A07041J503J452R83K62o41j572k107j858j044m35n34r45q98l06J07j31n33
$$ 107041 108544 109996 110979 111241 110600 109028 106921 105063 104019 103584 103050 102105 101207 100901 101008 100877 100344
51204A00344l27L64O16Op24o78k9K90J3p0O23J354R16o45j829j394J87J383J363
$$ 100344 100017 100381 100997 101003 100279 99601 99572 99862 99875 99805 100428 101782 102698 102053 100224 98830 99017 100400 101763
51185A01763O83L10M64O47M57N2j98j48N1K03K26J66K49P53J587K030J331k19
$$ 101763 102446 102756 103220 103867 104324 104376 104178 104030 104081 104284 104510 104676 104925 105678 107265 109295 110626 110407
51167A10407j248p56O90J689J706J351J100O63j10n48r0P92J241J196J176J290
$$ 110407 109159 108403 109093 110782 112488 113839 114939 115602 115492 114944 114854 115646 116887 118083 119259 120549
51151A20549J268J231J498J719J208K08j54N56J425J558J205R64P21J37m10l63
$$ 120549 121817 123048 124546 126265 127473 127681 127527 128083 129508 131066 132271 133235 133956 134093 133683 133320
51135A33320m3j83o12m17N35J219Q82P2k38O4L28J13n23j331j962j928j085j00
$$ 133320 133277 133094 132482 132065 132600 133819 134701 134773 134535 134599 134927 135040 134517 133186 131224 129296 128211 128111
51117A28111J08n09j054q99m93o14j212j535j189n49j11K4q8m37q35r36p99j027
$$ 128111 128219 127710 126656 125757 125264 124650 123438 121903 120714 120165 120054 120078 119990 119553 118718 117782 116983 115956
51099A15956j852k521k177j110l99m00l91J05N13J37p26j216j097q51q05p36m18
$$ 115956 114104 111583 109406 108296 107897 107497 107106 107211 107724 107861 107135 105919 104822 103971 103166 102430 102012
51082A02012l4J81L47P14J124J081M28k62k72L20P09N33M02Q45J257O94m82q79
$$ 102012 101978 102159 102506 103220 104344 105425 105853 105591 105319 105639 106348 106881 107283 108128 109385 110079 109597 108718
51064A08718j08N38pr73r19K31J303J609J517J370R28L6q66j262j107o27j8N41
$$ 108718 108610 109148 109141 108168 107249 107480 108783 110392 111909 113279 114207 114243 113377 112115 111008 110381 110363 110904
51046A10904R50J311J683J731J148L49J29N70R08P55O99J326K207K444J885J213
$$ 110904 111854 113165 114848 116579 117727 118076 118205 118775 119683 120438 121137 122463 124670 127114 128999 130212
51030A30212R95J168J351J300J018P50Q56J446K156K487K301J830J264O51J01
$$ 130212 131207 132375 133726 135026 136044 136794 137650 139096 141252 143739 146040 147870 149134 149785 149886
51015A49886j99l02m76q36j123j044o62l11k32m17o95p97m31M34J343J663J264
$$ 149886 149687 149385 148909 148073 146950 145906 145244 144933 144701 144284 143589 142792 142361 142795 144138 145801 147065
50998A47065O62L35J51k50p49q98o35l94m11m99n87r27j456j548q62J6L43K56
$$ 147065 147727 148062 148213 147963 147214 146316 145681 145287 144876 144377 143790 142863 141407 139859 138997 139013 139356 139612
50980A39612M00Q47J151J269J623K151K193J508P55N34N89M03J28L13J039J829
$$ 139612 140012 140859 142010 143279 144902 147053 149246 150754 151509 152043 152632 153035 153163 153476 154515 156344
50964A56344K255K181J590O04l21o78m44LN53J513K901L901L598K199J039J070
$$ 156344 158599 160780 162370 162974 162653 161975 161531 161534 162087 163600 166501 170402 174000 176199 177238 178308
50948A78308J769K003J726J963L111M154M144L584L566M126M513M677N208N894
$$ 178308 180077 182080 183806 185769 188880 193034 197178 200762 204328 208454 212967 217644 222852 228746
50934B28746N714M627M094N162P002Q180Q498Q654Q848Q766Q550Q681R146R630
$$ 228746 234460 239087 243181 248343 255345 263525 272023 280677 289525 298291 306841 315522 324668 334298
50920C34298J0379J1841J3596J4726J5235J6071J7543J8893J9857K1466K4490
$$ 334298 344677 356518 370114 384840 400075 416146 433689 452582 472439 493905 518395
50909E18395K7941L0204L1212L2453L4992L8378M1555M4006M5804M7186M8472
$$ 518395 546336 576540 607752 640205 675197 713575 755130 799136 844940 892126 940598
50898I40598M9939N1465N2514N2721N2147N0820M8410M4760M0382L5894L1198
$$ 940598 990537 1042002 1094516 1147237 1199384 1250204 1298614 1343374 1383756 1419650 1450848
50887A450848K5776J9806J4262R625N154o3n673j0314j3161j4703j5861j6964
$$ 1450848 1476624 1496430 1510692 1520317 1525471 1525408 1519735 1509421 1496260 1481557 1465696 1448732
50875A448732j7754j8028j7900j7599j7354j7359j7717j8409j9431k0832k2589
$$ 1448732 1430978 1412950 1395050 1377451 1360097 1342738 1325021 1306612 1287181 1266349 1243760
50864A243760k4520k6426k8188k9779l1324l3171l5511l7853l9208l9061l7848
$$ 1243760 1219240 1192814 1164626 1134847 1103523 1070352 1034841 996988 957780 918719 880871
50853H80871l6291l4567l2549l0438k8639k7016k5015k2492j9999j8035j6479
$$ 880871 844580 810013 777464 747026 718387 691371 666356 643864 623865 605830 589351
50842E89351j4937j3293j1596r736p645n632m165l320k720j982j004J08J148J848
$$ 589351 574414 561121 549525 539789 532144 526512 522347 519027 516307 514325 513321 513429 514577 516425
50828E16425K105K219K679L583M473M865M756M521M510M892N676O604P196P198
$$ 516425 518530 520749 523428 527011 531484 536349 541105 545626 550136 555028 560704 567308 574504 581702
50814E81702P001P254Q122R196J0143J1064J2113J3113J3871J4613J5836J7794
$$ 581702 588703 595957 604079 613275 623418 634482 646595 659708 673579 688192 704028 721822
50802G21822K0254K2703K4743K6515K8760L2129L6296M0177M3239M6199N0103
$$ 721822 742076 764779 789522 816037 844797 876926 913222 953399 996638 1042837 1092940
50791A092940N5170O0892O6772P2429P7513Q2215Q7504R3966J00664J06059J09854
$$ 1092940 1148110 1209002 1275774 1348203 1425716 1507931 1595435 1689401 1790065 1896124 2005978
50780B005978J12863J15177J15746J14063J10981J07126J01653R3405Q2583P0273
$$ 2005978 2118841 2234018 2349764 2463827 2574808 2681934 2783587 2876992 2959575 3029848
50770C029848N7058M2992K8483J4204M13j2681k4150l2861l8693m2474m4719m5255
$$ 3029848 3086906 3129898 3158381 3172585 3172998 3160317 3136167 3103306 3064613 3022139 2977420 2932165
50758B932165m3994m1334l7737l3705l0245k8520k8811l0479l3121l7061m2455
$$ 2932165 2888171 2846837 2809100 2775395 2745150 2716630 2687819 2657340 2624219 2587158 2544703
50747B544703m8641n4845o0898o6767p1864p5468p7555p8645p8956p8098p5640
$$ 2544703 2496062 2441217 2380319 2313552 2241688 2166220 2088665 2010020 1931064 1852966 1777326
50736A777326p1606o6422o0582n4366m7802m0865l3694k6562j9645j3033o888
$$ 1777326 1705720 1639298 1578716 1524350 1476548 1435683 1401989 1375427 1355782 1342749 1335861
50725A335861j288M018R386J4624J8854K1284K1955K1561K0709J9485J7643J5037
$$ 1335861 1334573 1338591 1347977 1362601 1381455 1402739 1424694 1446255 1466964 1486449 1504092 1519129
50713A519129J1803Q173M209j42m650q742j2075j4988j8079k1447k4716k7616
$$ 1519129 1530932 1539105 1543314 1543172 1538522 1529780 1517705 1502717 1484638 1463191 1438475 1410859
50701A410859l0134l2149l3363l3704l3369l2461l1022k9419k8101k6834k4756
$$ 1410859 1380725 1348576 1315213 1281509 1248140 1215679 1184657 1155238 1127137 1100303 1075547
50690A075547k1535j7953j4960j2538r935o664k838J281N526R731J3769J7682
$$ 1075547 1054012 1036059 1021099 1008561 998626 991962 989124 990405 995931 1005662 1019431 1037113
50678A037113K1505K5067K8247L1334L4787L8689M2757M6882N1326N6227O1153
$$ 1037113 1058618 1083685 1111932 1143266 1178053 1216742 1259499 1306381 1357707 1413934 1475087
50667A475087O5336O8281P0041P0878P0865O9861O7815O4817O0841N5658M9211
$$ 1475087 1540423 1608704 1678745 1749623 1820488 1890349 1958164 2022981 2083822 2139480 2188691
50656B188691M1838L3874K5200J5582N321m825j4367k3187l0899l6678m0026m1301
$$ 2188691 2230529 2264403 2289603 2305185 2310506 2305681 2291314 2268127 2237228 2200550 2160524 2119223
50644B119223m1108l9589l6643l2645k8374k4352k0622j7193j4506j3272j3888
$$ 2119223 2078115 2038526 2001883 1969238 1940864 1916512 1895890 1878697 1864191 1850919 1837031
50633A837031j6024j8798k1582k4565k8231l2320l5709l7472l7654l6820l5203
$$ 1837031 1821007 1802209 1780627 1756062 1727831 1695511 1659802 1622330 1584676 1547856 1512653
50622A512653l2654k9086k4590j9326j3549p570j465M936J1557J7901K3736K9614
$$ 1512653 1479999 1450913 1426323 1406997 1393448 1385878 1384413 1389349 1400906 1418807 1442543 1472157
$$ [...]
##END NTUPLES=NMR SPECTRUM
##END=
