
##TITLE=AC1083__5836542_VRjT2nScWd
##JCAMPDX= 6.0         $$ Bruker NMR JCAMP-DX V2.0
##DATA TYPE= NMR SPECTRUM
##DATA CLASS= NTUPLES
##ORIGIN= BRUKER
##OWNER= Administrator
$$ 1.72 TOPSPIN		Version 2.1
$$ 2012-03-26 20:22:38.750 -0500  Administrator@TOPSPIN
$$ Compression mode = diff/dup
##.OBSERVE FREQUENCY= 400.13188235
##.OBSERVE NUCLEUS= ^1H
##.ACQUISITION MODE= SIMULTANEOUS (DQD)
##.ACQUISITION SCHEME= undefined
##.AVERAGES= 8
##.DIGITISER RES= 22
##SPECTROMETER/DATA SYSTEM= spect
##.PULSE SEQUENCE= zg30
##.SOLVENT NAME= COFFEE_meoh
##.SHIFT REFERENCE= INTERNAL, COFFEE_meoh, 1, 14.98061
##AUDIT TRAIL= $$ (NUMBER, WHEN, WHO, WHERE, PROCESS, VERSION, WHAT)
$$ ##TITLE= Audit trail, TOPSPIN		Version 2.1
$$ ##JCAMPDX= 5.01
$$ ##ORIGIN= Bruker BioSpin GmbH
$$ ##OWNER= Administrator
$$ $$ C:\Bruker\TOPSPIN/data/COFFEE/nmr/AC1083__5836542_VRjT2nScWd/10/pdata/1/auditp.txt
$$ ##AUDIT TRAIL=  $$ (NUMBER, WHEN, WHO, WHERE, PROCESS, VERSION, WHAT)
(   1,<2012-03-26 20:22:31.937 -0500>,<Administrator>,<TOPSPIN>,<go>,<TOPSPIN 2.1>,
      <created by zg
	started at 2012-03-26 20:21:25.031 -0500,
	POWCHK enabled, PULCHK disabled,
       configuration hash MD5:
       1A 1E CE 29 27 FD 77 03 67 4E F0 E3 C4 B2 CB 90
       data hash MD5: 64K
       15 D8 94 6B 86 F7 77 94 1E 58 F1 E0 E0 A1 7D DC>)
(   2,<2012-03-26 20:22:34.609 -0500>,<Administrator>,<TOPSPIN>,<proc1d>,<TOPSPIN 2.1>,
      <Start of raw data processing
       efp LB = 0 FT_mod = 6 PKNL = 1 PHC0 = 0 PHC1 = 0 SI = 32K 
       data hash MD5: 32K
       BE FE 97 5B 33 F9 90 D3 E9 41 93 A9 F1 4A BC 3C>)
(   3,<2012-03-26 20:22:35.015 -0500>,<Administrator>,<TOPSPIN>,<proc1d>,<TOPSPIN 2.1>,
      <pk PHC0 = 208.7402 PHC1 = 0 
       data hash MD5: 32K
       20 6D E4 E3 B6 AB F4 AF 6B B1 7D 75 51 55 45 17>)
(   4,<2012-03-26 20:22:35.140 -0500>,<Administrator>,<TOPSPIN>,<proc1d>,<TOPSPIN 2.1>,
      <abs ABSG = 1 
       data hash MD5: 32K
       11 BB E2 0A 6A 48 8D D5 75 05 0E E9 C4 78 E3 58>)
(   5,<2012-03-26 20:22:35.171 -0500>,<Administrator>,<TOPSPIN>,<proc1d>,<TOPSPIN 2.1>,
      <abs ABSG = 2 
       data hash MD5: 32K
       79 1B B1 6F F2 C8 65 95 23 28 8D F6 2A 2E 57 6A>)
(   6,<2012-03-26 20:22:35.203 -0500>,<Administrator>,<TOPSPIN>,<proc1d>,<TOPSPIN 2.1>,
      <abs ABSG = 3 
       data hash MD5: 32K
       95 83 45 92 3E 82 43 78 50 61 59 5C 4C 49 64 D7>)
(   7,<2012-03-26 20:22:35.218 -0500>,<Administrator>,<TOPSPIN>,<proc1d>,<TOPSPIN 2.1>,
      <abs ABSG = 4 
       data hash MD5: 32K
       77 6A 5A 86 5D 16 3C C2 96 BE FA 5A C7 B4 F2 92>)
(   8,<2012-03-26 20:22:35.250 -0500>,<Administrator>,<TOPSPIN>,<proc1d>,<TOPSPIN 2.1>,
      <abs ABSG = 5 
       data hash MD5: 32K
       29 A2 62 D7 16 7C 77 3C FD BA 49 83 F9 0B 0E 75>)
$$ ##END=
$$ 
$$ $$ hash MD5
$$ $$ 69 5F F9 36 24 0A 52 79 D0 CA 70 F6 C4 84 3E 44
##$RELAX= 
##$RELAX= 
##$RELAX= 
##$RELAX= 
##$RELAX= 
##$RELAX= 
##$RELAX= 
$$ Bruker specific parameters
$$ --------------------------
##$DU= <C:\Bruker\TOPSPIN>
$$ [...]
##$TP= (0..7)
150 150 150 150 150 150 150 150
##$TP07= 0
##$TPNAME0= <>
##$TPNAME1= <>
##$TPNAME2= <>
##$TPNAME3= <>
##$TPNAME4= <>
##$TPNAME5= <>
##$TPNAME6= <>
##$TPNAME7= <>
##$TPOAL= (0..7)
0.5 0.5 0.5 0.5 0.5 0.5 0.5 0.5
##$TPOFFS= (0..7)
0 0 0 0 0 0 0 0
##$TUNHIN= 0
##$TUNHOUT= 0
##$TUNXOUT= 0
##$USERA1= <user>
##$USERA2= <user>
##$USERA3= <user>
##$USERA4= <user>
##$USERA5= <user>
##$V9= 5
##$VALIST= <valist>
##$VCLIST= <CCCCCCCCCCCCCCC>
##$VD= 0
##$VDLIST= <DDDDDDDDDDDDDDD>
##$VPLIST= <PPPPPPPPPPPPPPP>
##$VTLIST= <TTTTTTTTTTTTTTT>
##$WBST= 1024
##$WBSW= 4
##$XGAIN= (0..3)
0 0 0 0
##$XL= 0
##$YL= 0
##$YMAX_a= 534525
##$YMIN_a= -664980
##$ZGOPTNS= <>
##$ZL1= 120
##$ZL2= 120
##$ZL3= 120
##$ZL4= 120
##$ABSF1= 14.98061
##$ABSF2= -5.57192
##$ABSG= 5
##$ABSL= 3
##$ALPHA= 0
##$AQORDER= 0
##$ASSFAC= 0
##$ASSFACI= 0
##$ASSFACX= 0
##$ASSWID= 0
##$AUNMP= <proc_prof1d_extract_pilot.lims>
##$AXLEFT= 0
##$AXNAME= <>
##$AXNUC= <1H>
##$AXRIGHT= 0
##$AXTYPE= 0
##$AXUNIT= <>
##$AZFE= 0.1
##$AZFW= 0.1
##$BCFW= 0
##$BC_mod= 0
##$BYTORDP= 0
##$COROFFS= 0
##$CY= 15
##$DATMOD= 1
##$DC= 0
##$DFILT= <>
##$DTYPP= 0
##$F1P= 0
##$F2P= 0
##$FCOR= 0.5
##$FTSIZE= 32768
##$FT_mod= 6
##$GAMMA= 0
##$GB= 0
##$INTBC= 1
##$INTSCL= 1
##$ISEN= 128
##$LB= 0
##$LEV0= 0
##$LPBIN= 0
##$MAXI= 10000
##$MC2= 0
##$MEAN= 0
##$ME_mod= 0
##$MI= 0
##$NCOEF= 0
##$NC_proc= -8
##$NLEV= 6
##$NOISF1= 0
##$NOISF2= 0
##$NSP= 0
##$NTH_PI= 0
##$NZP= 0
##$OFFSET= 14.98061
##$PC= 1
##$PHC0= 208.7402
##$PHC1= 0
##$PH_mod= 1
##$PKNL= yes
##$PPARMOD= 0
##$PPDIAG= 0
##$PPIPTYP= 0
##$PPMPNUM= 2147483647
##$PPRESOL= 1
##$PSCAL= 4
##$PSIGN= 0
##$PYNMP= <proc.py>
##$REVERSE= no
##$SF= 400.13
##$SI= 32768
##$SIGF1= 0
##$SIGF2= 0
##$SINO= 400
##$SIOLD= 32768
##$SPECTYP= <>
##$SREGLST= <1H.CDCl3>
##$SSB= 0
##$STSI= 32768
##$STSR= 0
##$SW_p= 8223.68421052632
##$SYMM= 0
##$S_DEV= 0
##$TDeff= 65536
##$TDoff= 0
##$TI= <>
##$TILT= no
##$TM1= 0
##$TM2= 0
##$TOPLEV= 0
##$USERP1= <user>
##$USERP2= <user>
##$USERP3= <user>
##$USERP4= <user>
##$USERP5= <user>
##$WDW= 1
##$XDIM= 32768
##$YMAX_p= 468461671
##$YMIN_p= -767668
##$CURPLOT= <Network HP LaserJet P1505>
##$CURPRIN= <$Network HP LaserJet P1505>
##$DFORMAT= <normdp>
##$LAYOUT= <+/1D_H.xwp>
##$LFORMAT= <normlp>
##$PFORMAT= <normpl>
##$SURQMSG= 1
$$ End of Bruker specific parameters
$$ ---------------------------------
##NTUPLES= NMR SPECTRUM
##VAR_NAME=  FREQUENCY,     SPECTRUM/REAL,   SPECTRUM/IMAG
##SYMBOL=    X,             R,               I
##VAR_TYPE=  INDEPENDENT,   DEPENDENT,       DEPENDENT
##VAR_FORM=  AFFN,          ASDF,            ASDF
##VAR_DIM=   32768,         32768,           32768
##UNITS=     HZ,            ARBITRARY UNITS, ARBITRARY UNITS
##FACTOR=    0.250966925370066, 1,           1
##FIRST=     8223.43324360095, -132644,      66399
##LAST=      0,             -304056,         -76464
##MIN=       0,             -767668,         0
##MAX=       8223.43324360095, 468461671,    0
$$ Real data points
##PAGE= N=1
##DATA TABLE= (X++(R..R)), XYDATA
$$ [...]
19473C8183H068c5865j07576d0236A14653D5766a15938A51271b49909r604A28118
19461b63805a07961j75009H81a42602A7853a10439J5423j71127i5967n7680O5478
19450h8169B24505P0003a51492d1190A34539A4285a68176C00804b50440A08028
19439E0178J37401g4727k11729b1602j91366P8756H5609J11405b58581q057d78
19427c9838A66344a58378D7190c10541a19449j76290P0212L4849j35754a54826
19416C0469b51005R8095A16246c22439a1453A49718a74058A30804b52029a7653
19405a80008K4160l76627B420J8680J44655e0027A70274b61079B28746G8173c26443
19393b36809R6339f9204C83751f6434j74487Q0616j53721a01777j09044A51864
$$ y = [38183, 8068, -35865, -143441, -40236, 114653, 45766, -115938, 151271, -249909, -259513, 128118, -263805, -107961, -282970, 881, -142602, 17853, -110439, -95016, -266143, -95967, -153647, -88169, 224505, 294508, -151492, -41190, 134539, 14285, -168176, 300804, -250440, 108028, 50178, 187579, -74727, -286456, -21602, -212968, -134212, 85609, 197014, -258581, -266638, -478, -39838, 166344, -158378, 47190, -310541, -119449, -295739, -225527, -190678, -326432, -154826, 30469, -251005, -152910, 116246, -322439, -11453, 149718, -174058, 130804, -252029, -17653, -180008, -155848, -532475, 2420, 21100, 165755, -50027, 170274, -261079, 228746, 78173, -326443, -236809, -140470, -69204, 383751, -66434, -240921, -160305, -314026, -101777, -210821, 151864]
19382b72688D1872a84675L0607B7497b47164A17009a55957k04010d1041m327q5670
19371a31038a6524p1931C47691F1632a52370A13890a72651C2660c66636J31942
19361b34694C55152a03254j25964r4455H1504J48926p3981b34970d7519b408B90931
19349B0441g5606I2951a9250p8216o7121j7440B25366B6618a49609P2197g273
19337b0562A76318m04a68573p9775k440i7676A07797c40508J42331O4481d96m9933
19325e0429n4260B23794c60187c7653m2917j30234K8055j80028a42096K7826A08871
19313B1129a07880j82440A11269J69947M4462a13592G0545C372J11451a85802
19302f1066o7430k2066e4371B61885c04602N1128a6419k71103F7045d5324i709
$$ y = [-272688, 41872, -184675, -154068, 27497, -247164, 117009, -155957, -359967, -41041, -45368, -131038, -16524, -88455, 347691, 61632, -152370, 113890, -172651, 32660, -366636, -234694, 355152, -103254, -229218, -323673, 81504, 230430, 156449, -234970, -47519, -2408, 290931, 20441, -75606, 92951, -19250, -97466, -164587, -182027, 225366, 26618, -149609, -77412, -7273, -20562, 176318, 175914, -168573, -248348, -250788, -97676, 107797, -340508, -198177, -133696, -496, -50429, -104689, 223794, -360187, -37653, -80570, -210804, -182749, -362777, -142096, -114270, 108871, 21129, -107880, -290320, 111269, 281216, 325678, -113592, 70545, 3372, 114823, -185802, -61066, -128496, -150562, -54371, 261885, -304602, -253474, -16419, -287522, 67045, -45324, -9709]
19290a90172I6568b15823I9845A9883J30496c55999c1529D0494e3248A02794c03044
19278a84172B24398a58014A32046b87334J39099A55352a4073o1442K7891A66048
19267c1527A8150Q5309b58001H007a52093p278H1016l6269L33606a4316D5315
19255a12880k04547j73197B0024c66174B08300C8509a84806Q8568Q702j47566
19245b35102h4821B13492c14057J01916g1168C0931a44415C8363h9984G1865r738
19234F2127b00136i2729E986J67113H5940d48718E078a07727j57740k3099C1814
19222G6979a2082l81783a35877j05653p0840a7147k61792a31191p1486B82399
19211g8109D6050c2066j379E4628h8138A45528a3520m5210A95188b17027H362
$$ y = [-190172, 96568, -215823, 99845, 19883, 150379, -355999, -31529, 40494, -53248, 102794, -303044, -184172, 224398, -158014, 132046, -287334, -148235, 155352, -14073, -75515, -47624, 166048, -31527, 18150, 103459, -258001, 8007, -152093, -159371, 81016, 44747, 378353, -14316, 45315, -112880, -317427, -490624, 20024, -366174, 208300, 38509, -184806, -96238, -87536, -235102, -84821, 213492, -314057, -212141, -71168, 30931, -144415, 38363, -89984, 71865, 62127, -200136, -92729, 5986, 173099, 85940, -448718, 5078, -107727, -265467, -288566, 31814, 76979, -12082, -393865, -135877, -241530, -312370, -17147, -278939, -131191, -202677, 282399, -78109, 46050, -32066, -33445, 54628, -88138, 145528, -13520, -58730, 195188, -217027, 8362]
19199A95445j9481d76680F2610a25895A7169d1784q4912o1888Q8285q9621a3723
19187h5649B2037h2728A03406m6283b6217k04584h2795K5070j84358K2409E8630
19175A72938c49551R365k18306H9998B688c08611a1499j59445q0934g4694l20412
19164c95106a49753A44019f2930k98995a27492F5433d2039A21972c6666i205j82233
19153a91438A36121o4245a57872j56471J22131j24945J40074N7576c8301h393
19142g3190j41163D4043J08791l6817a35513e8561j74476B347N5252J4905A8686
19130f1022j38759N0891i451B3848c83172C13361b38666C6605I522K5104d37328
19118a26709r7285M6498E3102a78160g7702o7583N4646A72102d6468E5484h103
$$ y = [195445, 175964, -476680, 62610, -125895, 17169, -41784, -126696, -188584, -100299, -189920, -13723, -85649, 22037, -82728, 103406, 57123, -26217, -230801, -82795, -57725, -242083, -219674, 58630, 172938, -349551, -340186, -558492, 89998, 2688, -308611, -11499, -170944, -251878, -74694, -395106, -149753, 144019, -62930, -361925, -127492, 65433, -42039, 121972, -36666, -9205, -191438, 136121, 71876, -157872, -314343, -192212, -317157, -177083, -119507, -38301, -8393, -73190, -214353, 44043, 152834, 116017, -135513, -58561, -233037, 2347, 57599, 72504, 18686, -61022, -199781, -148890, -9451, 23848, -383172, 313361, -238666, 36605, 9522, 34626, -437328, -126709, -223994, -177496, 53102, -178160, -77702, -145285, -90639, 172102, -46468, 55484, -8103]
19106a33177N0026C97486c81504a210j85852B6034h5068B10412d45081g2099j54588
19095b26687C01772H218J86696a00325A91615d9690p5415d6629k04611F0337b5612
19083h9155C56215A22161e410j44074j08280J11611G0476b25219F1336j2127J8856
19072F8065b52521L6284A85744b4379k90960h0679j8284k5288D8016Q048a82099
19060A02604a78102n483L3753g3883B79366q1063G9451c40423g5425L7435l6253
19049g4243F232b46061A03907b67771f6104r2684d8839m5309A59412J18585j7871
19038B60126B5863f2197R443k2854j42504F0636b59738J01483o7267I1743c04373
19026b36618g6112A65093k1276d2576j80868C7610a29396q1877P3448k14911D6368
$$ y = [-133177, -83151, 397486, -381504, -1210, -187062, 26034, -85068, 210412, -445081, -72099, -226687, 301772, 8218, 194914, -100325, 191615, -49690, -125105, -46629, -251240, 60337, -25612, -89155, 356215, 122161, -5410, -149484, -257764, -146153, 70476, -225219, 61336, 49209, 68065, -252521, -216237, 185744, -24379, -315339, -80679, -98963, -124251, 48016, 56064, -182099, 102604, -178102, -183585, -149832, -73883, 279366, 198303, 79451, -340423, -75425, -37990, -74243, 6232, -246061, 103907, -267771, -66104, -158788, -48839, -94148, 159412, 277997, 260126, 25863, -62197, -52754, -75608, -218112, 60636, -259738, -158255, -225522, 91743, -304373, -236618, -76112, 165093, 143817, -42576, -223444, 37610, -129396, -211273, -137825, -352736, 46368]
19014F8824B9729b811D4567i687m8961B16967L4767I3086i1621K1157j78749A9585
19001a03250C674J19920m079a27646c2905K568k7986l8905C26203C5730a35682
18989B17090b76084A34393J05957j1504a0464q4013B23369r7854J5583N026Q6391
18978B32515h9558L5724A21532b51715P8440O60a2401r01o7435N461o0089A54815
18965H5978c3978j03666A0546P282a95594B00842B5193J27759h8843E1509J48203
18954A99712J26723J10958j46654J7082o6996c740A14951i9530g744j34743C4186
18942b20416i8921m3452k69149A43629c0521H6839h6193B5711N9744d8527C4852
18930B5640a75995A56344F1952f8412A05438d2053B99249b43688i6808K520m2629
$$ y = [68824, 29729, -2811, 44567, -9687, -58648, 216967, 251734, 93086, -91621, -70464, -249213, 19585, -103250, 3674, 123594, 119515, -127646, -32905, -30337, -58323, -97228, 326203, 35730, -135682, 217090, -276084, 134393, 240350, 228846, -10464, -94477, 223369, 125515, 141098, 146124, 232515, -89558, -53834, 121532, -251715, -173275, -172615, -12401, -13302, -80737, -75276, -135365, 154815, 85978, -33978, -137644, 10546, 17828, -195594, 200842, 25193, 152952, -88843, 51509, 199712, 326435, 437393, 290739, 307821, 240825, -3740, 114951, -99530, -7744, -142487, 34186, -220416, -98921, -142373, -411522, 143629, -30521, 86839, -86193, 25711, 85455, -48527, 34852, 25640, -175995, 156344, 61952, -68412, 105438, -42053, 299249, -243688, -96808, -94288, -136917]
18919a36917A76031e0112C1013e11668H7348k0494g1717j84577n449d5267o1643
18908a06910A78781a06371B00617d8244J8356B35145b95378k16881b06730k3868
18898b30598A33374E4579f1206C90200q7843a8545A91173G5687L59746A65506
18887C43782l0993C8294a55232b8525j07762H6999g04737a22764B2662a28419
18876i3637D7143c84053a08735k8614o522O3466A0659a68550Q1056e36j10817
18865a11353q1024F1378l0250i3423a3860l56431Q5679d8487C05518F0262k6611
18854C3651b82577B30c36777A76348b41782A00895J85012a39477A487d10147d6415
18842c69445J70255B21494i2459p0856m7406D22143A93413a03285B30153p2890
$$ y = [-136917, 176031, -50112, 31013, -511668, 87348, 66854, -71717, -256294, -261743, -45267, -106910, 178781, -106371, 200617, -48244, -29888, 235145, -295378, -512259, -206730, -230598, 133374, 54579, -61206, 390200, 302357, -18545, 191173, 75687, 435433, 165506, 343782, 312789, 38294, -155232, -28525, -136287, 86999, -704737, -122764, 22662, -128419, -93637, 47143, -384053, -108735, -137349, -143871, -80405, 10659, -168550, -87494, -536, -111353, -192377, 61378, 31128, -93423, -13860, -370291, -284612, -48487, 305518, 60262, 33651, -282577, 230, -336777, 176348, -241782, 100895, 285907, -139477, 1487, -410147, -46415, -369445, -199190, 221494, -92459, -163315, -210721, 422143, 193413, -103285, 230153, 157263]
18832A57263K9231K7037h0255k08989H1225i3856o18751B9728g8285A58642D2041
18820I5785a57518A17955a87093M7309I0713a60489o613B31115a48229A77053
18809b99063f8297B9179c733k26770A16699l501d10687a07017j45787B68842r9531
18798A69311a07150D4698a8374A85193d57j01842B37900p4784b50140J14590c2170
18786e3255A48856p2712K16330G4246a42834j57840E0983A1982b65562g6707l3746
18775a10453j09936A44696I410L9495e3189j57251r6764c2833l1523n1858J8902
18764i7312M0218k48917c9921j70980N5215B4276b7180j87681Q8196f3311G8129
18752c02045J35839B54148B8202c15363J29243F5028e5824E9252b54960m9033
$$ y = [157263, 186494, 213531, -80255, -289244, 81225, -93856, -712607, 29728, -78285, 158642, 42041, 95785, -157518, 117955, -187093, -139784, 90713, -160489, -167102, 231115, -148229, 177053, -299063, -68297, 29179, -3733, -230503, 116699, 113198, -410687, -107017, -252804, 268842, 169311, -107150, 44698, -18374, 185193, -457, -102299, 237900, 163116, -250140, -135550, -32170, -53255, 148856, 76144, 292474, 74246, -142834, -300674, 50983, 11982, -265562, -76707, -110453, -220389, 144696, 9410, 48905, -53189, -210440, -307204, -32833, -64356, -116214, -97312, -57094, -306011, -39921, -210901, -155686, 24276, -27180, -214861, -126665, -63311, 78129, -302045, -166206, 254148, 28202, -315363, -186120, 65028, -55824, 59252, -254960, -303993]
18742c03993a49537B87094G9210N7833b00025b6627E6776g1355k5524D6451a71022
18730A80040K29451A18970l6638f5408A7271J03701M1695a53984n6084C18302
18719b39637B56290a26094a1594q5924J6104j21249k2689f5418k13972j31807
18709d11197i1740n723D2730a60996k5350C02258d946B28334a75866b1389j64474
18698a85863l6137J05362e5340B17928c75466h891j03840j30515p5022a25546
18687f1876j18678P8180q3498k11080G6439b64637k72878b05503B85446A24002
18676A25548K2094a29821A32406J27898l4494b21170J08227j00164N5679f829
18665a53887P4481j51971r79A91278k4844G0754L185b9329j4497a6217j42609
$$ y = [-303993, -149537, 287094, 79210, 137043, -200025, -26627, 56776, -71355, -96879, 46451, -171022, 180040, 409491, 118970, 82332, -65408, 17271, 120972, 162667, -153984, -210068, 318302, -239637, 256290, -126094, -11594, -97518, -81414, -202663, -225352, -65418, -279390, -411197, -91740, -97463, 42730, -160996, -186346, 302258, -4946, 228334, -175866, -21389, -185863, -222000, -116638, -55340, 217928, -375466, -8891, -112731, -243246, -318268, -125546, -61876, -180554, -102374, -185872, -396952, 76439, -264637, -537515, -205503, 285446, 124002, 125548, 147642, -129821, 132406, 260304, 225810, -221170, -112943, -213107, -157428, -6829, -153887, -79406, -231377, -232356, 191278, 166434, 70754, 73939, -29329, -43826, -16217, -158826]
18654a58826d3162E8244d9705I6520a66061o0743d1806j62875b8789G8857Q6266
18643A65123f134k39364e6358j85293j88985K13683I1664e7047l05478J75755
18633a86770A98196b4619q0581c5851n8154I9552P7265G3229a10177G2745O0889
18622A33634K03995A3042a88337o5830d1116G835a54581R294e6237A90148a56096
18610A64341i1970A723J53308o1301f1522B15213a9386B30272c0678k37247R1190
18599a76735p0414A29998i1920F5970d8206F3436a07895j71824j39815J71578
18589b47956A91379R6846c49j73026P2319I842K20658b8905j72957k96477a18330
18577a0983k17620A8832a48432j24381a21576A55524a88491G8764b66564R8328
$$ y = [-158826, -43162, 58244, -49705, 96520, -166061, -226804, -41806, -204681, -28789, 78857, 165123, -6134, -245498, -56358, -241651, -430636, -216953, 91664, -57047, -362525, -186770, 198196, -24619, -105200, -35851, -94005, 99552, 176817, 73229, -110177, 72745, 133634, 337629, 13042, -188337, -254167, -41116, 7835, -154581, -145287, -56237, 190148, -156096, 164341, -91970, 1723, 155031, 93730, -61522, 215213, -19386, 230272, -30678, -267925, -176735, -247149, 129998, -91920, 65970, -48206, 63436, -107895, -279719, -419534, -247956, 191379, 288225, -349, -173375, -101056, 9842, 230500, -28905, -201862, -498339, -118330, -10983, -228603, 18832, -148432, -272813, -121576, 155524, -188491, 78764, -266564, -168236]
18567a68236j29044i1526A06789a99289g1564j08977i534B60884G1561a53725
18556B43472b41213J15306G7415f3356k7481A42656a63625A53171a74083B01695
18545a15734n3341j09789J02621P8371i914k68269i7600I0960b87308a04673j05577
18534b10250j01432C6518P0812k5305a27923B18563C5069d65421B15848A00711
18523D2416K28978a15773k02540d0140j53214G6334l5940a32651k45248J09891
18513b68008R7220D2053a73991B95351G1653f545j90699j2062j26679h095c386
18501A25502b54359j231J27240j2007B01022a62344m4909j24107B9692R740h2761
18489A50305a3582j66943Q0450A11066J33845c00789F2655b2289o1640A12098
$$ y = [-168236, -297280, -91526, 106789, -199289, -71564, -180541, -9534, 260884, 71561, -153725, 243472, -241213, -125907, 77415, -63356, -90837, 142656, -163625, 153171, -174083, 201695, -115734, -169075, -278864, -176243, -97872, -9914, -278183, -97600, 90960, -287308, -104673, -210250, -311682, 36518, 107330, 82025, -127923, 218563, 35069, -465421, 215848, 100711, 42416, 271394, -115773, -318313, -40140, -193354, 76334, 40394, -132651, -377899, -268008, -170788, 42053, -173991, 295351, 71653, -6545, -197244, -209306, -335985, -8095, -3386, 125502, -254359, -255590, -128350, -140357, 201022, -162344, -207253, -331360, 29692, 39432, -82761, 150305, -13582, -180525, -100075, 111066, 244911, -300789, 62655, -22289, -83929, 112098]
18478C6205c5272D9179J4200g4792l41505d758A85892H5349b85722B2116a53942
18466B80115b58737j35793g1235n2217j53361a02583B64037i1948C2387J97512
18456B29899A9475i990F6852m251d0454k5586c2444E4590J63392l6594b64923
18444c3002B71206a2944D2895c34526a2334A3264g9260I8293M970a64105P7173
18433h6932e645j78161B52284b1018k23160A14518d7557k0598m9052H5762B4166
18421c65193i5831b2268j5021k79774C0129K08343f2067p1450B21788j6986p9232
18410A25570c80192c7303j71870m3575b4631j71179O6159j01453B40855a09431
18399A09510c40828f6736p3805c6372A65066a46950C8704d8191k71158A11771
$$ y = [36205, -35272, 49179, 63379, -74792, -416297, -4758, 185892, 85349, -285722, 22116, -153942, 280115, -258737, -394530, -71235, -123452, -276813, -102583, 264037, -91948, 32387, 229899, 19475, -9990, 66852, 62601, -40454, -66040, -32444, 54590, 217982, 181388, -264923, -33002, 271206, -12944, 42895, -334526, -12334, 13264, -79260, 98293, 103263, -164105, -86932, -5645, -183806, 252284, -21018, -244178, 114518, -47557, -68155, -117207, 85762, 24166, -365193, -95831, -22268, -37289, -317063, 30129, 238472, -62067, -133517, 221788, 204802, 125570, -380192, -37303, -209173, -252748, -24631, -195810, -129651, -231104, 240855, -109431, 109510, -340828, -66736, -140541, -36372, 165066, -146950, 38704, -48191, -319349, 111771]
18388h3223E3792a16500o9604n2780J11227e435C34744h3605D7626a2291p0374
18377h2665B72348g5739B45249j22258a21649l4844b0727A03533a68349B46382
18366a20729F8366a06828j85703F6404i4892K8407H6119f6646k27227I5696N2704
18355A48400h5683C23094g9680a2101k72452J08098I1663a31918f0760j45430
18345b06190C80540a90227B15298g5088H4774K2700a29878D7094a06146k39150
18335c45296J01590g8782D2699F955M6164a74214A64727G1378e3951l28335a17056
18323b61870N5253G3511J94234m3187a8295B25407I4714a8307j64685I2411g9013
18311b47393a13276D59177F1648N967j2437b02041b4042A45727k3843M3212A1461
$$ y = [-83223, 53792, -116500, -186104, -238884, -127657, -5435, 334744, -83605, 47626, -12291, -82665, 272348, -75739, 245249, 122991, -121649, -156493, -20727, 103533, -168349, 246382, -120729, 68366, -106828, -292531, 66404, -94892, -66485, 86119, -66646, -293873, 95696, 148400, -85683, 323094, -79680, -12101, -284553, -176455, 91663, -131918, -60760, -206190, 380540, -190227, 215298, -75088, 84774, 107474, -129878, 47094, -106146, -345296, -243706, -78782, 42699, 6955, 53119, -174214, 164727, 71378, -53951, -382286, -117056, -261870, -206617, 73511, 267745, 224558, -18295, 225407, 94714, -18307, -182992, 92411, -79013, -247393, -113276, 459177, 61648, 67615, 55178, -202041, -24042, 145727, 121884, 165096, 11461]
18299g4894B70172A8248a3005A05078J2950d2195p6408a1337A03654B3582b70748
18287g7278r8773h4656C78b00425a1180B40530o7307B2944O5707O2411C6075N3981
18275I0056N2063L5280a1628A2065a46121a3291A81530C9016N728a59626q31A36921
18262c11423K7726J10062n8040f3969b1298q8798E119a49297k6021j00190D2345
18250d6539j06169A43389c63925G0905b14959B16832k1961C7991Q8291b75427
18239g0511j34981R1782n197I7627a50120k22349h3647k35610B79313I7283i4860
18227b52661J18425N6593C5398j6222a48201m9222P7181l1810j01000F8048i9188
18215A8918M3759J3364K63J867J6591J25688h3884j73222B6980b4821j55964b5998
$$ y = [-74894, 270172, 18248, -13005, 105078, 118028, -42195, -118603, -11337, 103654, 23582, -270748, -77278, -176051, -84656, 378, -200425, -11180, 240530, 173223, 22944, 88651, 151062, 36075, 90056, 142119, 177399, -11628, 12065, -146121, -13291, 181530, 39016, 44744, -159626, -160457, 136921, -311423, -283697, -173635, -231675, -63969, -21298, -110096, 5119, -149297, -175318, -275508, 42345, -46539, -152708, 143389, -363925, 70905, -214959, 216832, 194871, 37991, 126282, -275427, -70511, -205492, -113710, -118907, 97627, -150120, -372469, -83647, -319257, 279313, 97283, -94860, -252661, -134236, -77643, 35398, 19176, -148201, -197423, -120242, -152052, -253052, 68048, -99188, 18918, 62677, 76041, 76304, 78171, 94762, 220450, -83884, -257106, 26980, -24821, -180785, -25998]
18202a44108B99845A39283J34259B7043a21662j08508A54791e8366l8363j94604
18192b91333i4442A88365H0368M31362d3892A0925L3256b28961e1310j43466D3341
18180a6669j13678H1465R818M175J68679a05139N1564A34770K19461B9567f5k64929
18168b64994h5070K6736A69296e9803A14588e0784j13690A12855L1633J23659
18158B68147a98149B46699b43272A78584F7706J73106h3972m5811c4610n235M430
18147c5415F8887a29793O745j06338b7901r8466A1941a44404b3825j8016A2436
18135g9104C2317f1956A51841J15994a92301j1506D88531a45563J833l56912K49979
18124b50663B83302j33958A5251a607I1100B4265a86822E9137M019b49513j73301
$$ y = [-144108, 299845, 139283, 273542, 27043, -121662, -230170, 154791, -58366, -96729, -291333, -94442, 188365, 80368, 511730, -43892, 10925, 44181, -228961, -51310, -194776, 43341, -16669, -130347, 81465, 91283, 95458, 264137, -105139, -53575, 134770, 354231, 29567, -65, -264994, -85070, -58334, 169296, -59803, 114588, -50784, -164474, 112855, 144488, 268147, -198149, 246699, -243272, 178584, 67706, 240812, -83972, -129783, -34610, -39845, -35415, 68887, -129793, -123048, -229386, -27901, -126367, 11941, -144404, -23825, -41841, 12436, -79104, 32317, -61956, 151841, 267835, -192301, -203807, 488531, -145563, -143730, -500642, -250663, 283302, 149344, 15251, -1607, 91100, 24265, -186822, 59137, 63156, -249513, -422814]
18113d22814d0050m1167A36519h0413N662b0456f948m9873I8562M26553A22399
18101F0199B6066e8540A94064c48318J59675I0420a57936A2954e2789o0350n8972
18090a72111Q5290C82481F8426k0631K77537A4028c75147R6889B39970b48085
18079a72979L4725A06589l9201L6481i6020L7892E2834I387a35059k04276g0359
18067f2752p6460C45538B8893c51452a9110j48175b7376F5609l1585Q5654f4602
18055B86166g982C6049K30518A06912a04392j78029g0409F8516N9574a37823l6414
18044a74237r721B07804C0609a35470k2285K0443r8716E3007L8429k7960L2749
18033I6225I458c47167J02099p6719C77748A41769d01563e4583p3657N3723C2880
$$ y = [-422814, -40050, -81217, 136519, -80413, -74751, -20456, -6948, -56821, 98562, 525115, 122399, 60199, 26066, -58540, 194064, -348318, -188643, 90420, -157936, 12954, -52789, -113139, -172111, -86821, 382481, 68426, 47795, 325332, 14028, -375147, -278258, 239970, -248085, -172979, -138254, 106589, 67388, 103869, -96020, -58128, 52834, 9387, -135059, -339335, -70359, -62752, -139212, 345538, 28893, -351452, -19110, -167285, -27376, 65609, 34024, 119678, -64602, 286166, -7982, 36049, 266567, 106912, -104392, -282421, -70409, 68516, 128090, -137823, -174237, -183958, 207804, 30609, -135470, -157755, -137312, -236028, 53007, 91436, 63476, 96225, 9458, -347167, -245068, -321787, 377748, 141769, -401563, -54583, -128240, -74517, 32880]
18021A8794P0246b78514F3243Q1797L807a63348A84342R930J4804G9739k2981
18010E6758c98397H858f9401j82372f3437j52870C4452b45978E3087J37293G4164
17998c11803P5759A42145d3047n8475M9005C45306D7117b75021h1732A56407d256
17986a82265j50482f8624A32600n333a81715B0805J24855K54135d03175J26053
17976b77122g6587J8482A731L1682A3930f888m853j4136A87004a63071j01296
17965b64367g0452D0974K99935e9027K4666j0385G5465b03729J00677k99895a06964
17953B15171a00052A3736b43442A17587J25312I162f9734A45584C776O9714K00142
17942B73632j02935e7930B57817j00464a05200r367C5225a27859d4888n4314L9969
$$ y = [18794, 89040, -278514, 63243, 145040, 148847, -163348, 184342, 194272, 209076, 79739, 56758, -398397, 8858, -69401, -251773, -63437, -216307, 34452, -245978, 53087, 190380, 74164, -311803, -236044, 142145, -43047, -101522, -52517, 345306, 47117, -275021, -81732, 156407, -4256, -182265, -332747, -68624, 132600, 127267, -181715, 20805, 145660, 399795, -403175, -277122, -76587, -58105, 1731, 33413, 13930, -6888, -11741, -25877, 187004, -163071, -264367, -70452, 40974, 340909, -59027, -34361, -44746, 75465, -203729, -103052, -402947, -106964, 215171, -100052, 13736, -243442, 117587, 242899, 9162, -69734, 145584, 3776, 73490, 273632, 170697, -57930, 257817, 157353, -105200, -114567, 35225, -127859, -44888, -99202, -59233]
17931e9233k9046j05943e189A0111L05982d3125l16110I0909a30396A21414n7774
17920F3640e975j52902l3244h7928A07009i1619F2997N344b1113A597J35474a20724
17907b20392a02191A43481K2069b20600N9207C80350A37218b06739A12286a3543
17896d51577A27032b66738a7007A95624D6064g0280B83831a76396C49933e2067
17885e4233K1944k03504A15726m6319a47143j87179a24034H9056b72468a4295
17874A06778K4037a87151B96858j6126H9723e2691A04459K25880F4469L71908
17864D36377b78520B37813N5306k0153j35472F6401L2830a10372A5747b70305
17853D37383k02291E7799b13258B52811d7948B48488a09740C18824m8827h777
$$ y = [-59233, -88279, -194222, -5189, 10111, 316093, -43125, -359235, 90909, -130396, 121414, 63640, -5975, -158877, -192121, -87928, 107009, -91619, 62997, 68341, -21113, 1597, 137071, -120724, -220392, -102191, 143481, 165550, -220600, -161393, 380350, 137218, -206739, 112286, -13543, -451577, 127032, -266738, -17007, 195624, 46064, -70280, 283831, -176396, 349933, -52067, -54233, -32289, -235793, 115726, 69407, -147143, -334322, -124034, 89056, -272468, -14295, 106778, 130815, -187151, 296858, 280732, 89723, -52691, 104459, 330339, 64469, 436377, -278520, 237813, 293119, 272966, 137494, 66401, 99231, -110372, 15747, -270305, 437383, 235092, 57799, -213258, 252811, -47948, 248488, -109740, 318824, 269997, -8777]
17842c61915g9031K3658K5137H8120J66736B565K3258L92039A4551J38326J28931
17831B81808E3301N1638C8663O5027J53386A4525L04646a57829A57150J07849
17821B64999E5363a18436M9683b4396D0258e2821A00208e9138e659I7340i8500
17809A09841M2972a59891C5013L45143A77655i2743A90494C926b88081J23732
17799a64349c242A12723a3897F7600q164Q4909a7919F5229J54551G2890c745I8805
17786a04829k887F3783J8129e9254j0495O450J4864k69551E2753a0023F0838a1128
17773b60106a07794A38644B7939b33909A40517a00741C92024A31862a25974j148
17763a27122j28689G5161O0062E6138K00742J3849I3307d469A40845J55033B3663
$$ y = [-361915, -79031, -55373, -30236, 88120, 254856, 2565, 25823, 417862, 14551, 152877, 281808, 53301, 104939, 38663, 103690, 257076, 14525, 319171, -157829, 157150, 264999, 55363, -118436, -68753, -24396, 40258, -52821, 100208, -59138, -5659, 97340, -98500, 109841, 152813, -159891, 35013, 380156, 177655, -92743, 190494, 3926, -288081, -164349, -3242, 112723, -13897, 67600, 59436, 144345, -17919, 65229, 219780, 72890, -3745, 98805, -104829, -107716, 63783, 81912, -59254, -69749, -63299, -48435, -317986, 52753, -10023, 60838, -11128, -260106, -107794, 138644, 27939, -233909, 140517, -100741, 392024, 131862, -125974, -127122, -255811, 75161, 135223, 56138, 256880, 270729, 93307, -4469, 140845, 295878, 23663]
17751a11001G3112i7415H1160b09178B21451f8526n3141B75512r1470J9121b29554
17739C2188b2643B23821l5819C3781J86568b17695E9224c67921E2977a32468B76805
17727B00207g1824B32685a4609m9298j19095D5706a42781A7299J48883H2110L17147
17716C99257a46824B45939g4457A41884j3194b27022A87016K0619k8633m5362
17706A33640J91862j29959a36283b2158J296B11146a29407l4071d4687A65774
17695C03243a67252D70236A21683e4584A31419Q1718P7838e2968B5692J00068
17685A25760a30989b5320j40772A39014J02337a33308E2118b58763A66841c9630
17674F0461J19011J02713i9707B821J09316A3127L64544A28740J37052b60887
$$ y = [-111001, 73112, -97415, 81160, -209178, 221451, -68526, -121667, 275512, 184042, 203163, -229554, 32188, -22643, 223821, 188002, 33781, 220349, -217695, 59224, -367921, 52977, -132468, 276805, 200207, -71824, 232685, -14609, -63907, -183002, 45706, -142781, 17299, 166182, 82110, 399257, -146824, 245939, -74457, 141884, 128690, -227022, 187016, 207635, 179002, 133640, 325502, 195543, -136283, -22158, -20862, 211146, -129407, -163478, -44687, 165774, 303243, -167252, 470236, 121683, -54584, 131419, 213137, 290975, -52968, 25692, 125760, -130989, -25320, -166092, 139014, 241351, -133308, 52118, -258763, 166841, -39630, 60461, 179472, 282185, -99707, 2821, 112137, 13127, 377671, 128740, 265792, -260887]
17663E1698f7384B40215P7050a0124B39580a27849I2234f9425m5127j2184G8498
17651a86941A59983J13198K19276a65571C9647L6184g2275G9036b92911B70091
17640a26706N8158j36727B28188l4640H1697b6459C20999a25717A07860g2359
17629H2409h8448B59450a85172h816A19206L14869j19225A54702b39090C3074
17618A93881a00611a9895A79257C8627J30089B9484N3643J19566J20563n3647
17608B69609A34584J28046j09707E3684J932a1955F5546J31387C1436K12701I5152
17596A02035J4124d9866A74334J40451A34764B401J90916l0783J18158B4136K68726
17585B92862b53191B42309I7742J36761l6556n1790f8137A46178D7503a1158B28237
$$ y = [51698, -67384, 240215, 317265, -10124, 239580, -127849, 92234, -69425, -114552, -126736, 78498, -186941, 159983, 273181, 492457, -165571, 39647, 75831, -72275, 79036, -292911, 270091, -126706, -68548, -205275, 228188, 193548, 81697, -26459, 320999, -125717, 107860, -72359, 82409, -88448, 259450, -185172, -8816, 119206, 434075, 314850, 154702, -239090, 33074, 193881, -100611, -19895, 179257, 38627, 168716, 29484, 83127, 202693, 323256, 269609, 134584, 262630, 152923, 53684, 55616, -11955, 65546, 196933, 31436, 244137, 95152, 102035, 116159, -49866, 174334, 314785, 134764, 2401, 193317, 162534, 280692, 24136, 292862, -253191, 242309, 97742, 234503, 197947, 146157, -68137, 146178, 47503, -11158, 228237]
17573B733J75778f342A89362k4231K74400A26867a73357D56681a19429D92947
17562A23399K7861M8461e6330G8025b14296A90411A7702F985P3890K63533j23890
17551B20518b85511A35981K48333c4951I0556D0102A6558K29184j04768K59057
17541D00031j74242a81957B08926a346C32272k1256a15005A42651J37993a509
17530A7018K04675L5064I4084L8969N24987k86705d6116A59672o5739J0950j4624
17519I0259J0006L0678P6805o8138L4662O6889J59703J01100k050L32057l8200
17508G93771j08858K52166K1701l10305l18025L4644K71691j40233A2935L78495
17498C91430M7414j52018N1352K93047L6503o1168j22236J69820M975Q9778k87358
$$ y = [2733, 178511, -6342, 189362, 165131, 439531, 126867, -173357, 456681, -119429, 492947, 123399, 151260, 199721, -56330, 78025, -214296, 190411, 17702, 6985, 80875, 344408, 220518, -285511, 135981, 384314, -34951, 90556, 40102, 16558, 245742, 140974, 400031, 225789, -181957, 208926, -1346, 332272, 311016, -115005, 142651, 280644, -1509, 17018, 221693, 256757, 94084, 133053, 658040, 371335, -46116, 159672, 93933, 104883, 90259, 100265, 130943, 207748, 139610, 174272, 241161, 400864, 501964, 499914, 831971, 793771, 684913, 937079, 958780, 648475, 330450, 365094, 636785, 496552, 12935, 391430, 438844, 286826, 338178, 631225, 667728, 606560, 484324, 654144, 659119, 748897, 461539]
17487D61539A47355L96646j26194A62828K25057j36556A14930r96E6330c69790
17476A36080b15701B25327R5454A42319K50687L1899K10804l09471a21626D12172
17465D51847H7989K35435l0783j1022J95249d9124H9809J49489J75775q6321R0249
17454D19001q0991q7129K6068O2619m575A18552J59236j29948J87946C8585K81783
17443C20368j13972J18110h40E54330A69116n4838K25979j50675E4696M76637
17433E31333j65109j03882K99907J15775B39943J20138D622L21329n7525Q1650
17423C50076J12258J29229j10105j34926J17676j02330N8844k07300C4055J99350
17413B33405q2978K83422n1229n4074l232a072B63119F7360J22361Q6159E9047
$$ y = [461539, 147355, 544001, 417807, 162828, 387885, 251329, 114930, 113934, 56330, -369790, 136080, -215701, 225327, 320781, 142319, 393006, 424905, 635709, 326238, -121626, 412172, 451847, 87989, 323424, 292641, 281619, 476868, -49124, 89809, 239298, 415073, 328752, 419001, 338010, 250881, 276949, 339568, 334993, 118552, 277788, 147840, 335786, 38585, 320368, 206396, 324506, -840, 554330, 169116, 114278, 340257, 189582, 54696, 531333, 366224, 262342, 562249, 678024, 239943, 360081, 4622, 325951, 268426, 350076, 462334, 591563, 481458, 346532, 464208, 361878, 420722, 213422, 34055, 233405, 150427, 433849, 382620, 328546, 325314, -1072, 263119, 67360, 189721, 275880, 59047]
17401C79468O3040N1214R6334j84334j33632J20492A36022j6528L02313k06328
17391B15479M67539A30886a07275D89553k13300a71164C72079k8527j08531R0028
17381C25049j30352H8911J21365Q9821O815D1030J94724l5920K29227b4025n7048
17370h1073C23345j57000N22627B65528n4468o4162J8742c5632C95683k8936d218
17358D43042j27251C7787L36572j28448A09111J69624L8043m3436J56695B07236
17347C41155j48079K25917B69J02996K23816j00918N1055r7418F629M8389L01122
17336C56140r1101h2490B81861G7206M13087A74670K10835A13228d6263C01389
17325D11123j11317j07586M0676m1731a21308A87783E3522J25349e4460A37077
$$ y = [379468, 442508, 493722, 590056, 405722, 272090, 392582, 136022, 119494, 421807, 215479, 683018, 130886, -107275, 489553, 276253, -171164, 372079, 343552, 235021, 325049, 194697, 88911, 210276, 300097, 306912, 41030, 235754, 199834, 429061, -24025, -81073, 323345, 166345, 688972, 265528, 211060, 146898, 165640, -35632, 395683, 366747, -4218, 443042, 315791, 37787, 374359, 245911, 109111, 278735, 316778, 273342, 430037, 207236, 341155, 193076, 418993, 269, 103265, 327081, 226163, 277218, 179800, 6629, 55018, 356140, 265039, -82490, 281861, 77206, 490293, 174670, 385505, 113228, -46263, 301389, 411123, 299806, 192220, 232896, 191165, -121308, 187783, 53522, 178871, -54460, 137077]
17314C39913j14401I2708M25800L9494E3090L1204K6462K39466A57754m3488D9319
17302B55572Q528r8368K31627A53267K513E4613Q6166K37220j68125j01093L15086
17291D23867P2106B16043K94275j98784K2624p3906J82705j68343M5968j43959
17281A76623n7937J00175J23507J38990A67056F9243J62270j07393L1504K16898
17271C72522a16510B08495o8118g0115D59913I6062a71084C32792P2153j26920
17261B78025m3143g6170I3197j9491L72325A53335J96327A43360K66323m5983
17251C63700j31978Q9258L6442A50073J70880q4457K14185B03983K5263A5011
17240B30039a35665D23550j98592q295a19333E53928k53774N4774j6362G4538
$$ y = [339913, 225512, 92708, 518508, 558002, 53090, 84294, 110756, 350222, 157754, 114266, 49319, 255572, 264100, 165732, 397359, 153267, 155780, 54613, 140779, 377999, 209874, 108781, 423867, 495973, 216043, 510318, 311534, 334158, 260252, 442957, 274614, 320582, 176623, 118686, 218861, 342368, 481358, 167056, 69243, 231513, 124120, 155624, 372522, -116510, 208495, 140377, -70115, 459913, 96062, -171084, 332792, 404945, 278025, 234882, -76170, 93197, 73706, 446031, 153335, 349662, 143360, 409683, 363700, 231722, 320980, 357422, 150073, 320953, 236496, 450681, 203983, 229246, 15011, 230039, -135665, 423550, 224958, 216663, -119333, 553928, 300154, 354928, 338566, 74538]
17229B53885R0517A68289N1512K10788r4356J30981L5439A27363B3880K84457
17219C08337O8931D9304P2933K05576L4323n4707A36583L79975J45427H0297K61193
17208C41490j20470J04793F8343O71539k74116D5414K90699r6979k8111N4735
17198B65758K95549A58279K34458k2838p5769j30030K37417m8902K2798j02187
17188B73226m6340q7614K65433j18550p1965M322J16222P8739R5540n0484A30628
17176A91829i265F01051k47699Q3647j37824J16706A95696L10411j89047j19581
17166A97479K76133Q5485B41746O2836P4623J01087B26222k7511R2776J73503
17156D64990J54333l06703l5760j7050K60055j89958J79698B42538Q2463Q3538
$$ y = [253885, 344402, 168289, 219801, 430589, 336233, 467214, 502653, 127363, 23880, 308337, 377268, 49304, 122237, 327813, 362136, 307429, 136583, 516558, 661985, 80297, 341490, 221020, 325813, 68343, 739882, 465766, 45414, 336113, 239134, 211023, 265758, 561307, 158279, 392737, 369899, 294130, 164100, 401517, 352615, 375413, 273226, 226886, 139272, 404705, 286155, 214190, 218512, 334734, 413473, 509013, 458529, 130628, 191829, -9265, 601051, 353352, 436999, 299175, 415881, 195696, 506107, 317060, 197479, 473612, 559097, 241746, 304582, 379205, 480292, 226222, 198711, 291487, 464990, 619323, 312620, 276860, 259810, 519865, 329907, 509605, 242538, 325001, 408539]
17146D08539j23387K67075j28221M42428l81349B07201J44131J53815r5404J55422
17136E65165j35187J00215k62847K73560j16741j1605P3151l6664p9482J64789
17126E34354l1918K40653l04008J79781j63596M8442J72205k10551j30346K96140
17116F31156k62831j28298M16619R2769r8559k13963m7849J07105J81478k09317
17106D68310j16412A65469L65457r5982m4628j62081N19132B92402L94014r3470
17096E92946k42159K96228r0462M0665l4295B17886J45118j24216M81074j96706
17086E23156j38623K13115j78818M40M47820C99961q8539L06246p0707j40984
17076D05977L75701B19164K59343J56707k59321J27446K22561j49647L25941n9467
$$ y = [408539, 285152, 552227, 424006, 866434, 485085, 207201, 351332, 505147, 409743, 565165, 429978, 530193, 267346, 540906, 424165, 412560, 485711, 449047, 369565, 534354, 502436, 743089, 439081, 618862, 455266, 503708, 675913, 465362, 335016, 631156, 368325, 240027, 656646, 749415, 650856, 436893, 389044, 496149, 677627, 468310, 351898, 165469, 530926, 434944, 390316, 228235, 747367, 292402, 686416, 592946, 350787, 647015, 556553, 597218, 562923, 217886, 363004, 238788, 719862, 523156, 384533, 597648, 418830, 419270, 867090, 399961, 311422, 617668, 546961, 405977, 781678, 219164, 478507, 635214, 375893, 503339, 725900, 576253, 902194, 842727]
17066H42727l32265j05107Q36142B93225M90272k06897J75245l11466K75203J92462
17056I08044k21173M4080j62799K16118l33499J31831J60627o9481l7641Q715
17046F44822J26120l59509M85104J55246C65045K03188j46448J99900R218J46923
17036G77826j34663p7824O4900J41272O3033q0642k29211J53466L02899k04999
17026G76057K29036m72710M63451k48716L7321J57653j49278o6207l25156K23985
17016F25436L82519R3742k70062O6797J22279l09992J23638j28762j44733M20053
17006I80915q5431L09882n26737O41591m46268k03892n867J54217j83635L32375
16996I67150J04684M743l8009k92558J46004l19547M12595P2264K29092F33698
$$ y = [842727, 510462, 405355, 1241497, 293225, 783497, 576600, 751845, 440379, 715582, 908044, 686871, 730951, 568152, 784270, 450771, 582602, 743229, 673748, 636107, 644822, 770942, 411433, 896537, 1051783, 365045, 568233, 421785, 621685, 630903, 777826, 643163, 565339, 630239, 771511, 834544, 753902, 524691, 678157, 981056, 776057, 1005093, 532383, 995834, 747118, 784439, 942092, 792814, 726607, 401451, 625436, 1007955, 1101697, 831635, 898432, 1020711, 710719, 834357, 705595, 560862, 980915, 895484, 1205366, 678629, 1320220, 873952, 670060, 664193, 818410, 634775, 967150, 1071834, 1076577, 1038568, 746010, 892014, 572467, 985062, 1057326, 1286418, 633698]
16985A062618N3327l65572L49273k36444K82768k0734J51359m32295L50128l63945
16975H30483K81374j26524P8536O6731M0351l76934M16211R5968j87186m3169
16965A075841o7184L13955k05151m9037L07125l47805K61115o7116J25763J93287
16955A540793l7874k12452J32772q6167J85095m82064M7850N56158l89400K79531
16945A534242m9537m70714J48302J60686J892k17782J07009M42451n02101R5835
16935A250283m1853K82770j67828N09803m27651R0696J47902q1342R7248j65933
16925A494095M4192j10751L21075j00131k38697J1933l9668L13499j58196j15875
16915A421476N67122n09622K75800j6500J7981p0154K70778q189p099p0273J89900
$$ y = [1062618, 1115945, 750373, 1099646, 863202, 1145970, 1125236, 1276595, 844300, 1194428, 830483, 1111857, 985333, 1063869, 1130600, 1170951, 794017, 1210228, 1306196, 1119010, 1075841, 1008657, 1322612, 1117461, 1068424, 1375549, 1027744, 1288859, 1221743, 1347506, 1540793, 1502919, 1290467, 1423239, 1337072, 1522167, 1040103, 1087953, 1644111, 1254711, 1534242, 1484705, 1013991, 1162293, 1322979, 1324871, 1107089, 1214098, 1656549, 1154448, 1250283, 1208430, 1491200, 1323372, 1833175, 1405524, 1496220, 1644122, 1562780, 1660028, 1494095, 1538287, 1427536, 1748611, 1648480, 1409783, 1421716, 1382048, 1695547, 1537351, 1421476, 1988598, 1478976, 1754776, 1738276, 1756257, 1686103, 1956881, 1948692, 1941593, 1871320, 2061220]
16904B061220k52366L16333k63174q8711K78159L0277n1581n0822l568J30904
16894B106671l12398N36490k64876K66226P7419k7243m7371l8705J82219l24101
16884B154331K7184L59553k14531r2008L42072o9517k5695J10252l0027j91427
16874B370187J96204j00228N29491l00497j11177J80477O8743L6537l6935M20399
16864C253201n56890J61204K94053m32912P66875n90712K12814K77279j5531j97229
16854C172152o2136K93468K77339n3562Q1415k14922J41309j45812K60543K08855
16844C958649o4884r2484J11241K48945p5489n35j20480K51610J02817L28824
16834D648214k23689Q0356m5125L7478J82642K09756p3167K69040L10420m55969
$$ y = [2061220, 1808854, 2125187, 1862013, 1773302, 2051461, 2081738, 2030157, 1979335, 1975767, 2106671, 1794273, 2330763, 2065887, 2332113, 2409532, 2382289, 2334918, 2296213, 2478432, 2154331, 2181515, 2541068, 2326537, 2234529, 2576601, 2507084, 2481389, 2591641, 2561614, 2370187, 2566391, 2466163, 2995654, 2695157, 2583980, 2764457, 2833200, 2869737, 2832802, 3253201, 2696311, 2857515, 3151568, 2718656, 3485531, 2894819, 3107633, 3384912, 3369381, 3172152, 3110016, 3403484, 3680823, 3627261, 3708676, 3493754, 3635063, 3489251, 3749794, 3958649, 3893765, 3801281, 3912522, 4161467, 4085978, 4085443, 3964963, 4216573, 4319390, 4648214, 4424525, 4504881, 4459756, 4497234, 4679876, 4889632, 4816465, 5085505, 5395925, 4939956]
16824D939956j0901M18611n9047J3932l1231L55418J35401n6818L12845q5056
16814E933110K44841J02734m5736K30937K77679j81417L39603L13791o28j75473
16804G039441J83460K89241L20324j32389L81313K36851K4191k8060M19781O3632
16794H797785J69816J61086K83703K88847J85120K88958o7374L77213L65689K70951
16784A1121794L98137J12310J00059M13145r0020Q08313K52103L26516K58528
16775A3700885K98148O51713K30593K79437J77683Q09802O43595M32302M42981
16766A7667139N20174K65424O21371O81795O60829O79596O16331K94286J028560
16757B3035505P95250Q08827R17921R56728R69603Q58644R83487J019419J274630
$$ y = [4939956, 4929055, 5347666, 5288619, 5302551, 5271320, 5626738, 5762139, 5705321, 6018166, 5933110, 6177951, 6280685, 6234949, 6465886, 6743565, 6562148, 6901751, 7215542, 7214914, 7039441, 7222901, 7512142, 7832466, 7700077, 8081390, 8318241, 8342432, 8314372, 8734153, 8797785, 8967601, 9128687, 9412390, 9701237, 9886357, 10175315, 10107941, 10485154, 10850843, 11121794, 11519931, 11632241, 11732300, 12145445, 12055425, 12863738, 13115841, 13442357, 13700885, 13999033, 14650746, 14881339, 15160776, 15338459, 16148261, 16791856, 17224158, 17667139, 18187313, 18452737, 19074108, 19755903, 20416732, 21096328, 21712659, 22006945, 23035505, 23830755, 24639582, 25557503, 26514231, 27483834, 28342478, 29325965, 30345384, 31620014]
16748C1620014J361394R90424J852105R91332R79999K285608J357266J699876
16740D3138018J974897J511137K506151K097068J568278L021192K358670K526303
16732F0701714K771691K861646L143314K967995L486092L596885L898730L886479
16724H7314546L703392L936371M583694L875776M817545M623863M340384M543204
16716A21738775M179020M752073L855622M102209L535694L616235K947065K400335
16708A51127028J728083J719896O47765J99641m22551q87768j601288j969690
16700A50541116k621995l293824l572909l845684l763829m548128m214999m742816
16692A19936932m071222m963212m302043m768526m217347m152614l933143m135433
$$ y = [31620014, 32981408, 33971832, 35823937, 36815269, 37795268, 40080876, 41438142, 43138018, 45112915, 46624052, 49130203, 51227271, 52795549, 55816741, 58175411, 60701714, 63473405, 66335051, 69478365, 72446360, 75932452, 79529337, 83428067, 87314546, 91017938, 94954309, 99538003, 103413779, 108231324, 112855187, 117195571, 121738775, 125917795, 130669868, 134525490, 138627699, 142163393, 145779628, 148726693, 151127028, 152855111, 154575007, 155222772, 155422413, 154999862, 154112094, 152510806, 150541116, 147919121, 144625297, 141052388, 137206704, 133442875, 128894747, 124679748, 119936932, 115865710, 110902498, 106600455, 101831929, 97614582, 93461968, 89528825, 85393392]
16684H5393392l974489l846653l199412l197091l591776k627987k833365l005320
16676E9117299k713853k481660k136129k290639k496538j823826j840552k049034
16668D1285068j492391j592131j606914j464643j510206j013332j212271j219334
16660C0173846j240105j162723j061604q88313q09951o59863q79665p57682o82535
16651B2031405o74201p95459n36278p65075n66968q11613l18102r27969J03743
16642A6739483o55272k39673q86337j11457l41210n57535n43445j49206o61289
16633A2594059j33726j10373m88517k46255k74856n66979R6019m56698m60713
16624I951961k42355j27802P9958l17616k76251l16487J11495l82500L3577l45916
$$ y = [85393392, 81418903, 77572250, 74372838, 71175747, 67583971, 64955984, 62122619, 59117299, 56403446, 53921786, 51785657, 49495018, 46998480, 45174654, 43334102, 41285068, 39792677, 38200546, 36593632, 35128989, 33618783, 32605451, 31393180, 30173846, 28933741, 27771018, 26709414, 25821101, 25011150, 24351287, 23471622, 22713940, 22031405, 21357204, 20561745, 20025467, 19260392, 18693424, 17881811, 17563709, 16635740, 16739483, 16084211, 15844538, 14958201, 14846744, 14505534, 13947999, 13404554, 13255348, 12594059, 12460333, 12349960, 11861443, 11615188, 11340332, 10773353, 10869372, 10412674, 9951961, 9709606, 9581804, 9661762, 9344146, 9067895, 8751408, 8862903, 8480403, 8513980, 8168064]
16614H168064R4631l73614k12546j94713k58490m29850L16903j75071k83688k39647
16604F411979L07310k57458k28819P0226r7602l74185j83j60302k16587k43237
16594E211142K64673j6968n38110R2519r6838J00810m09031K88105k62010J1469
16584D645761Q4802k34608q3674q3894j64853m7143j94314l3557J09455k44840
16574C753135K0006K72944o6750m39161l61635M02877k84231K40748j16039j38516
16564C283378M9265J46485j46159k69433k08853K20053J45153j44575m09232L66820
16554C032902j21885j50522J70181l4376l6551m14223J72260M723O3137l72312
16544B313334L19140j4518l16140R2354j7302q2837k38547M27261L2131k19344
$$ y = [8168064, 8262695, 7889081, 7676535, 7481822, 7223332, 6793482, 7110385, 6935314, 6651626, 6411979, 6719289, 6461831, 6233012, 6303238, 6205636, 5831451, 5831268, 5670966, 5454379, 5211142, 5475815, 5458847, 4920737, 5013256, 4916418, 5017228, 4608197, 4896302, 4634292, 4645761, 4730563, 4495955, 4412281, 4328387, 4163534, 4116391, 3922077, 3888520, 3997975, 3753135, 3773141, 4046085, 3979335, 3540174, 3178539, 3581416, 3297185, 3537933, 3421894, 3283378, 3332643, 3479128, 3332969, 3063536, 2854683, 3074736, 3219889, 3075314, 2666082, 3032902, 2911017, 2760495, 2930676, 2896300, 2859749, 2445526, 2617786, 2622509, 2685646, 2313334, 2632474, 2617956, 2301816, 2394170, 2376868, 2294031, 2055484, 2482745, 2514876, 2295532]
16534B295532M3294q6403q0739J32674N8692m10460J44137k24090M88657k44481
16524B116813K28930k40281j86173K49349m14912J17938K80394j93343K33670
16515B192385k40046k12544J0473p8246L230N1460k1393r0917j27215J27784J59051
16504A774022k2246l61683L8750L05671M547m02952K57108k01651m0338L99661
16494A750889l40769J17102o3438j62922K06323P9533k61484J94792q0764j04645
16484A334617M5251Q414j15475K04872p6420l03723l65760L47320L23330l26810
16474A075616K9740o324J23650k8234P6500q7974j19566K13983J2268j87941K41431
16463A343149l05674j3302J95114k38514o7472j7026N03753m00232K45693j52209
$$ y = [2295532, 2338826, 2252423, 2171684, 2304358, 2363050, 1952590, 2096727, 1872637, 2361294, 2116813, 2345743, 2105462, 1919289, 2168638, 1753726, 1871664, 2152058, 1958715, 2192385, 1952339, 1739795, 1750268, 1672022, 1675252, 1726712, 1705319, 1614402, 1487187, 1614971, 1774022, 1751776, 1390093, 1428843, 1734514, 1739061, 1336109, 1593217, 1391566, 1351228, 1750889, 1410120, 1527222, 1463784, 1300862, 1507185, 1586718, 1325234, 1520026, 1439262, 1334617, 1379868, 1388282, 1272807, 1477679, 1401259, 1097536, 731776, 1079096, 1402426, 1075616, 1105356, 1099032, 1222682, 1194448, 1270948, 1182974, 1063408, 1277391, 1289659, 1101718, 1343149, 1037475, 1024173, 1219287, 980773, 913301, 896275, 1400028, 999796, 1245489, 1093280]
16453A093280l7652k2279J83550j25321L4300k67299L64771j01491l12875j21989
16443F86995M71827k11313J62008J38869m27172J75158j66393J57311K1832K0113
16433A029235k21225J51252O0461l68952O5955J87904J17540j34827l47593J51725
16423F91475M00657j38149j06025j18749K96148l39954j08947P5861J35980j33263
16413F55034P651J02371C63994M11714n3549k95135K48115K30768k404j25598
16403G77905J60505m02511J91379k52237J60311L7389j68690Q5124Q1464r5591
16393E75048K33130K35874k43498C21806L20733n1975K87945C91982O6139K35131
16383F93252O4242J90155l78274m0492K02540K6093l76373N2174K70958R0344
$$ y = [1093280, 1055628, 1033349, 1216899, 1091578, 1125878, 858579, 1223350, 1121859, 808984, 686995, 1158822, 947509, 1109517, 1248386, 821214, 996372, 829979, 987290, 1009122, 1029235, 808010, 959262, 1019723, 650771, 716726, 904630, 1022170, 887343, 539750, 691475, 1092132, 953983, 847958, 729209, 1025357, 685403, 576456, 652317, 788297, 655034, 662685, 765056, 363994, 775708, 722159, 427024, 675139, 905907, 903503, 777905, 938410, 535899, 727278, 475041, 635352, 672741, 504051, 589175, 670639, 575048, 808178, 1044052, 800554, 321806, 642539, 590564, 878509, 391982, 458121, 693252, 757494, 947649, 569375, 528883, 731423, 757516, 381143, 433317, 704275, 794619]
16373G94619p5194j60625l1194j80229M75892p5722o3283j88208L07402C25974
16362E29257q6064L69J30293J22162j40848B37476M12867j14463p9071J91219
16352F48028B48707K38433k06642K44127B52902K81040p7598K39757M773k1206
16342F79668j53433j18939L39190M1961l78692m6928m2529j0882J00948J44391
16332E54755K53471j76786l14887J04267j42091p8031K74536A9607O03736B72473
16321E87230J68373r227B83482J08351j76025O5528J0491J01400o7598L2764J87971
16310E46364A38422M84440n0083j64161l7564J37954n9595o3303P2340J7959j85367
16299B91042L26646B94448J2664K03756A06326J13807J24265K54115k77148K80087
$$ y = [794619, 719425, 558800, 527606, 347377, 823269, 747547, 684264, 496056, 803458, 325974, 529257, 443193, 443562, 573855, 696017, 555169, 237476, 650343, 535880, 456809, 648028, 248707, 487140, 280498, 524625, 252902, 533942, 456344, 696101, 700874, 679668, 526235, 407296, 746486, 788447, 409755, 362827, 320298, 309416, 410364, 554755, 808226, 631440, 316553, 420820, 278729, 200698, 475234, 19607, 623343, 272473, 587230, 755603, 746376, 283482, 391833, 215808, 281336, 291827, 393227, 325629, 358393, 546364, 138422, 622862, 572779, 408618, 371054, 509008, 449413, 386110, 458450, 476409, 291042, 617688, 294448, 307112, 510868, 106326, 220133, 344398, 598513, 321365, 601452]
16289F01452j79367J45310B68252o4405j8777J05953A11148K44317K31319B10953
16278E69776A14660L54700J17800B23561A5435O002M33783j81103G0649j9441
16268E1208M69421M02k42491G7027J65596j09497R3142p9360m736K98565p1861
16257C68876j64408J25285A2168M45072k24999J14546A43687J25395K50446A55759
16246a56902B86400f152C06608f3417C19570K7017j29704K90548B50320G0850
16235A44856J02480J26580c1674H1060K71374N3924A24910L9585p2376J58664
16225B50783p9027a37324D90662A15794J26777a4186E67919B83245H4190J98009
16215B82199o0865Q8605j8514a21077B09908Q6812A00180a85442B58063p2869
$$ y = [601452, 422085, 567395, 268252, 203847, 185070, 291023, 111148, 355465, 586784, 210953, 569776, 114660, 469360, 587160, 223561, 15435, 21437, 455220, 274117, 70649, 51208, 520629, 521031, 278540, 77027, 242623, 133126, 226268, 146908, 142172, 440737, 368876, 204468, 329753, 12168, 457240, 232241, 346787, 143687, 269082, 519528, 155759, -156902, 286400, -6152, 306608, -63417, 319570, 346587, 216883, 507431, 250320, 70850, 144856, 247336, 373916, -31674, 81060, 352434, 406358, 124910, 164495, 92119, 250783, 171756, -137324, 490662, 115794, 242571, -14186, 567919, 283245, 84190, 282199, 221334, 309939, 291425, -121077, 209908, 296720, 100180, -185442, 258063, 185194]
16205A85194P1006A19613O6357K45992j90089k8580l4109a8866A09451O9484r968
16194A68967F0686J62620K50385F3866J7159a18488A32364b83189B56056L805
16184B59861A08359m6494J08831c21663a47163C09895J50455j51881a6482l2925
16174d9407A37753R0042E5501a37189E73229B80826B2863J2757J90220K55635
16164D81475A18500a9421A33443E3643J67637H1433K62558H5671J90619N0710
16154C27000M7140A42858h4700B33477a25232I7900J12976N4509J1122a43427
16143C84691e3441A59786d9886A73555a00963A34613M9902j2791E0387L28248
16133C78635q3963J8282m01I0275a15469d2233a1823A69010i3156A74823A833
$$ y = [185194, 256200, 119613, 185970, 431962, 241873, 213293, 179184, -18866, 109451, 178935, 168967, 60686, 223306, 473691, 63866, 81025, -118488, 132364, -283189, 256056, 259861, 108359, 61865, 170696, -321663, -147163, 309895, 460350, 308469, -16482, -49407, 137753, 227795, 55501, -137189, 573229, 280826, 22863, 35620, 225840, 481475, 118500, -19421, 133443, 53643, 221280, 81433, 343991, 85671, 276290, 327000, 374140, 142858, -84700, 233477, -125232, 97900, 210876, 265385, 276507, -143427, 384691, -53441, 159786, -49886, 173555, -100963, 134613, 184515, 171724, 50387, 378635, 294672, 312954, 312553, 90275, -115469, -42233, -11823, 169010, -93156, 174823, 1833]
16121B21069r7544J57664j19937P3179r6411E8768A4561J87550a07048a2117I7615
16109B08990j01486A3163J9475J03587J1883R19K21371E6175L37800e0659B00583
16097i3251A47192a95859A49447p133N9788r2895G832K06780j8621d2618j2031
16086e4649k49112D15957a61656D7536J15236h110B21450F781J05975C1285b74276
16074b8429B30953J21642b10436c5026j88765B12898l3926c7484B92686D2J59558
16063A59600n8044a33044A08628b07807B56712a03840a4996K516k2633j89902
16053b25015A38510a14946r76A07874b08310N9033A86639B5490f1653A20187n9753
16042F0434K01646i2578o642l028p446j535A03187L058K10711a30193B81607A07596
$$ y = [221069, 123525, 281189, 161252, 234431, 138020, 58768, 14561, 202111, -107048, -12117, 97615, 208990, 107504, 13163, 32638, 136225, 148108, 149027, 370398, 56175, 393975, -50659, 200583, -93251, 147192, -195859, 149447, 142314, 202102, 109207, 7832, 214612, 195991, -42618, -54649, -303761, 415957, -161656, 47536, 162772, -8110, 221450, 6781, 112756, 31285, -274276, -28429, 230953, 352595, -210436, -35026, -223791, 212898, 178972, -37484, 292686, 42, 159600, 101556, -133044, 108628, -207807, 256712, -103840, -14996, -12480, -35113, -225015, 138510, -114946, -115922, 107874, -208310, -149277, 186639, 25490, -61653, 120187, 60434, 262080, -92578, -99220, -102248, -109694, -111229, 103187, 106245, 316956, -130193, 281607, 107596]
16029E7647h1557I072d9791A48795a97074e4445B36218G2805b54825i8496A4433
16017A64060J12852G5425J06815l1866b89316J37306C4175b5203I7630k0889M8438
16006A25179Q1148d4220A62154a41833E1260Q7497a71524k32801b2804A17257
15995d2087j2263d353B71205c59725J61146B20953b20389A31590B4591a37519
15984B33226f4288C073N5793K08370c8908B10185a40622C10900c9911P614E7798
15972B43910P1487J65248K47463k2849l14203N64366D55260P11A60161C4275R8914
15961A33189d1167b0208j18571B34676r5809P1780m3882a11803c3335k4006m2558
15950i9899A98614b59824K125J15525j00167j77664A52499m4584a16940G2138
$$ y = [57647, -81557, 9072, -49791, 148795, -197074, -54445, 236218, 72805, -254825, -98496, 14433, 164060, 276912, 75425, 182240, 150374, -289316, -152010, 34175, -25203, 97630, 76741, 125179, 206327, -44220, 162154, -141833, 51260, 138757, -171524, -404325, -22804, 117257, -42087, -54350, -4353, 271205, -359725, -198579, 220953, -220389, 131590, 24591, -137519, 233226, -64288, 3073, 58866, 267236, -38908, 210185, -140622, 310900, -39911, -32297, 57798, 243910, 315397, 480645, 728108, 705259, 391056, 955422, 455260, 455971, 160161, 34275, 133189, -41167, -20208, -138779, 234676, 138867, 210647, 166765, -111803, -33335, -57341, -99899, 198614, -259824, -257699, -142174, -242341, -420005, 152499, 107915, -116940, 72138]
15939B6653a39826d1548A09411Q388f4358j93087A49379c7671j78148b9802B1109
15927d05781A85393c89609a48453B62674G9561i3390C9553a26411p2189A23356
15916G930a13511b6794j1353G4431C5112d3630j73745A84802j5070k5001k7365
15905A17366b03868O7629o6594A90002J4304N506a32636G2218e1666a4511k19048
15894b33559e4165k8474l59636A05318E819b59768D9219b83575f0384G7120n337
15883G1783d48447Q3834i7023A59066B1208a14670k94454k5599f6297L2445A22984
15871A85822f2436G0075B0227b3508e244p9145d1410B32012e9406j50568a6561
15859c9363k552j1701k42761A08904K0087J63950A5238a73024h2490j53492E4565
$$ y = [26653, -139826, -41548, 109411, 117799, -64358, -257445, 149379, -37671, -215819, -29802, 21109, -405781, 185393, -389609, -148453, 262674, 79561, -93390, 39553, -126411, -198600, 123356, 7930, -113511, -26794, -38147, 74431, 35112, -43630, -217375, 184802, 169732, 144731, 117366, -203868, -136239, -202833, 190002, 204306, 209812, -132636, 72218, -51666, -14511, -233559, -54165, -82639, -442275, 105318, 5819, -259768, 49219, -283575, -60384, 77120, 71783, -448447, -364613, -97023, 159066, 21208, -114670, -409124, -434723, -66297, -33852, 122984, 185822, -62436, 70075, 20227, -23508, -5244, -84389, -41410, 232012, -59406, -209974, -16561, -39363, -41915, -53616, -296377, 108904, 128991, 292941, 15238, -173024, -82490, -235982, 54565]
15847a237F9017k5410a14715d6342j07981r6234f8098d734j30912B8353b5448
15835A36185a72042j68062F6672b67457Q6713A02925b6401j5613j27979m1047
15825b11040B99464f0582a1110j22376l8078F741a88476A8184h5385A5796N0396
15814F6192b06351q161p0111l786h5924H9579K27002B8046J35834c26358I0120
15802d21584J68553P8490A21339J90580G3741M9683L9093a32460m468A744J17602
15791A19346L4753m140j4257k6367C3901f2777j26700p7016B33740c1413E6566
15779E5769D255P5138b5874k28134m3345e1874A12274j2774a18822p9887A6322
15767A8899J19026b9156j5340k80358B01327F6052J31443c3709h902l31746A29592
$$ y = [-1237, 69017, 43607, -114715, -46342, -154323, -250557, -68098, -4734, -135646, 28353, -25448, 136185, -172042, -340104, 66672, -267457, -180744, 102925, -26401, -42014, -169993, -211040, 299464, -60582, -11110, -133486, -171564, 6741, -188476, 18184, -85385, 15796, 66192, -206351, -214512, -284623, -288409, -85924, 89579, 316581, 28046, 163880, -326358, 90120, -421584, -253031, -174541, 121339, 311919, 73741, 123424, 162517, -132460, -136928, 1744, 119346, 154099, 149959, 135702, 109335, 33901, -62777, -189477, -266493, 233740, -31413, 56566, 55769, 4255, 79393, -25874, -254008, -297353, -51874, 112274, 99500, -118822, -198709, 16322, 18899, 137925, -29156, -44496, -324854, 201327, 66052, 197495, -33709, -8902, -340648, 129592]
15755f7723j07892G6397b55232k6024a34989k6999A87248Q8203c7969A17869F307
15743h9802l5844A84611b05708b5487j33932q3167h5448m309G0667a85710b1696
15731C6305e9785j1509D7042c06646B58518K57084A69716i4170k7750o5224c0602
15719f8200k67926R1948k9944O8645j88758a85222j26848C0648b93575A41963
15708c11873a42584B78311j23325o5726L14113c14693a43780C0012b52901i1046
15697A02924L29949f7410A87745e8916O853A45210a31554I9425e4032j48929B55465
15685b14876n3400A4820b79760B1641J65766O9638a34887k04097G0328L024a26593
15673g5240l9098k21157a2446C6416i0517j96629f7668r842j20665j06273B62817
$$ y = [-67723, -175615, 76397, -255232, -281256, -134989, -161988, 187248, 275451, -37969, 117869, 6307, -89802, -125646, 184611, -205708, -25487, -159419, -242586, -85448, -89757, 70667, -185710, -21696, 36305, -59785, -71294, 47042, -306646, 258518, 515602, 169716, -94170, -121920, -187144, -30602, -68200, -336126, -244178, -274122, -205477, -394235, -185222, -312070, 30648, -293575, 141963, -311873, -142584, 278311, 154986, 89260, 403373, -314693, -143780, 30012, -252901, -91046, 102924, 432873, -67410, 187745, -58916, -52063, 145210, -131554, 99425, -54032, -202961, 255465, -214876, -268276, 14820, -279760, 21641, 187407, 257045, -134887, -338984, 70328, 73352, -126593, -75240, -114338, -335495, -12446, 36416, -90517, -287146, -67668, -77510, -198175, -304448, 262817]
15661B42507J2865r0346g6830C40184H7283P761a31011B7412b13091I7818b60530
15649D4011b925B83552g7690o5282I7247h8774D3909j4135c43347e8563q786G4639
15636A12839J98302a07851c4566j01797d084r4601j7103F3460c6848j49822c559
15624d87293J18803A62973A1204c6231D0392L37390A27830a13763j72195A2125
15613B863J93830p9629i2545E7384a36944f807m7491k87657a43502A72576b07336
15601A91584d20927r7898C7495c84767i8064j65418C4385i8434j0493q3406j104
15590a93437g7416b3048k12331b7654k37738l1344l4589c1630o7619j80867Q727
15579b71389A09593a73090P1394C68037A32646A9341J82735Q4034A06622c56854
$$ y = [242507, 255372, 165026, -76830, 340184, 87283, 95044, -131011, 27412, -213091, 97818, -260530, 44011, -2925, 283552, -77690, -142972, 97247, -88774, 43909, 29774, -343347, -58563, -67349, 74639, 112839, 311141, -107851, -34566, -136363, -4084, -98685, -115788, 63460, -36848, -186670, -3559, -487293, -368490, 162973, 11204, -36231, 40392, 377782, 127830, -113763, -285958, 12125, 2863, 196693, 117064, -92545, 57384, -136944, -6807, -54298, -341955, -143502, 172576, -207336, 191584, -420927, -518825, 37495, -384767, -98064, -263482, 34385, -98434, -108927, -192333, -193437, -77416, -23048, -235379, -27654, -265392, -296736, -331325, -31630, -99249, -280116, -271389, 109593, -173090, -101696, 368037, 132646, 19341, 202076, 286110, 106622, -356854]
15568h750j09566N2104k30300j1341E2138b39179h9059n4020F349J64060B0730
15556a15817B8846J7458J0446O2743K35988a20121A11983n0012a1580A44985a60597
15544a51826F5622a96124k19479c7681p5792G3625c43839F1173a22127o4194A63748
15532E7086a72591A77657D5385g2387A91602q4427B0928J49426p7153K5775a14499
15520A58550b45723B1264d2951H8540d95481B94305F4879G113R8391a18862M1946
15509g6916j26779B99282A33736B4817L65745A47265E0213a97920A49583e5888
15498A10834C3244K6533a70520M6575K4155A20703J02561a3597l3909A1162a02774
15486C91957d3761G1905B2724J28005c1501k09797B41323j2731G640a64830n2339
$$ y = [-8750, -118316, -66212, -296512, -307853, 52138, -239179, -89059, -143079, 6349, 170409, 20730, -115817, 28846, 46304, 56750, 119493, 355481, -120121, 111983, 61971, -11580, 144985, -160597, -151826, 65622, -196124, -415603, -37681, -113473, 73625, -343839, 61173, -122127, -186321, 163748, 57086, -172591, 177657, 45385, -72387, 191602, 107175, 20928, 170354, 93201, 118976, -114499, 158550, -245723, 21264, -42951, 88540, -495481, 294305, 64879, 7113, 105504, -118862, -76916, -203695, 299282, 133736, 24817, 390562, 147265, 50213, -197920, 149583, -55888, 110834, 33244, 59777, -170520, -123945, -99790, 120703, 223264, -13597, -47506, 11162, -102774, 391957, -43761, 71905, 22724, 150729, -31501, -241298, 241323, 228592, 7640, -164830, -217169]
15475b17169j57106g4564A09411M2389n2886b04821I8558a68037A59950a81265
15464c469I6590K71135A8796K17090O0789M3272j27415G6969L59699j80694l222
15453B52752k7343m2630J13968K3094H4815Q9284J79813A05242k1660a29587j8302
15442a47889B02344b13839A2278J00758D417J60377e9514B95380A24407F1238
15431B56096j23742a17046D3136M05514r2767L60129B39911N99498j77346j47625
15421E14438j71907J21071f3879A74325p4244g125k54994i766A37052a18772o2284
15410a81056O0958H912a90879C49974A05306K25703E2413m89J29621B1862B787
15398b70768B98844c5640j13325O6869I6073N4165c11404a18701C3042c41279
$$ y = [-217169, -374275, -74564, 109411, 151800, 98914, -204821, 98558, -168037, 159950, -181265, -3469, 96590, 367725, 18796, 235886, 296675, 339947, 212532, 76969, 436668, 255974, 252752, 225409, 182779, 296747, 319841, 84815, 174099, 353912, 105242, 83582, -129587, -147889, 202344, -213839, 12278, 113036, 4417, 164794, -59514, 295380, 124407, 61238, 256096, 132354, -117046, 43136, 448650, 355883, 716012, 239911, 839409, 662063, 514438, 342531, 463602, -63879, 174325, 100081, -7125, -262119, -9766, 137052, -118772, -181056, -120098, 8912, -190879, 349974, 105306, 331009, 52413, 51924, 181545, 21862, 2787, -270768, 298844, -35640, -148965, -82096, 96073, 150238, -311404, -118701, 33042, -341279]
15387i1893H4760p794J77981A6674d6131B14096I7059b93858D43493b98691a12450
15375a33116B6632J7579R4152a80153E3525l68M39238A45313c744C8283a65597
15363A50593B0037O8351K27795j21870a23941E25568p3467j89721J59067j86650
15353B34797a50089C1490a9127A30904K01851g8954A82826a54278D45577j58314
15343B87263K5751P3467j61086Q6741j17822L5564I7259a67975A73083J04178
15333B77261E5219j7626a22531J9822E12569F4403J28971K06391A94853K925l1473
15322A66305F2973J21748k2886a5701j57487E7516P200H756K81260A27462N3528
15311A80990J96851o0760b50589i5259G0675O2612Q0330a01523E4573E188b14124
$$ y = [-91893, 84760, 76966, 254947, 16674, -46131, 214096, 97059, -293858, 443493, -298691, -112450, -133116, 26632, 44211, 138363, -180153, 53525, 53157, 492395, 145313, -3744, 38283, -165597, 150593, 20037, 88388, 316183, 194313, -123941, 525568, 452101, 262380, 421447, 234797, -150089, 31490, -19127, 130904, 332755, -78954, 182826, -154278, 445577, 287263, 313014, 386481, 225395, 312136, 194314, 229878, 97259, -167975, 173083, 277261, 55219, 37593, -122531, -102709, 512569, 64403, 193374, 399765, 194853, 197778, 166305, 62973, 184721, 161835, -15701, -173188, 57516, 64716, 8756, 290016, 127462, 180990, 377841, 317081, -250589, -95259, 70675, 133287, 213617, -101523, 54573, 5188, -214124]
15299A37175i3940d6125A9438K23138K4185P042j29786k8221a03403B07604F5671
15287a04039p6104B22922a24192j34969J8044B96052a06171A00909M3361a08132
15276g7504j19093f774a114G5638P0588c28438B23625F1009k6726K09116d033
15264C8694K1035d4333k65153B2141b68927a17357F0026j6776O8864a61395D45378
15252A64019a21262A9406L8409H457a29194A69516e6422n0837A70585a15055k14341
15241c29396B8563j2994J32570K6354a05290A29188J67090i2837H817K58844L43869
15230F11530J06600P7226J044655p56460K03025O911m53587j28911a4471D22102
15219A06584n2674f7258A25348j9069k5482L4585c6670m336A12479c17340A9795
$$ y = [137175, -93940, -46125, 19438, 242576, 266761, 273803, 144017, 115796, -103403, 207604, 65671, -104039, -180143, 222922, -124192, -259161, -241117, 296052, -106171, 100909, 144270, -108132, -77504, -196597, -6774, -1114, 75638, 146226, -328438, 223625, 61009, 34283, 243399, -4033, 38694, 59729, -44333, -309486, 22141, -268927, -117357, 60026, 43250, 112114, -161395, 445378, 164019, -121262, 19406, 57815, 8457, -129194, 169516, -56422, -107259, 170585, -115055, -329396, 28563, 15569, 148139, 174493, -105290, 129188, 296278, -92837, 8817, 267661, 611530, 718130, 795356, 1840011, 1083551, 1286576, 1293487, 839900, 710989, -14471, 422102, 106584, 53910, -67258, 125348, 106279, 80797, 115382, -36670, -41006, 112479, -317340, 19795]
15207G4996K83678D6352c07403B14012b07692B46117b02023c475C24083C5251
15196B3825J75525i0678A96785k7019a2562B43411J45694j31407c47486B32586
15185B34874a0175C1777i2262B09110e669G4304J98338o7563K011J55572j76962
15174A85700J66834N1577j56434G2315J8303e8628C73117A04070M7139a68710
15163E9115f293H2656K8417J44145h8526Q546j52104B78187a26874B51970c3079
15151h5523I8663C1485b1908E7393K92888a98416H0298d483B10762a23589A63940
15139F6064J74987G8592J49109N6305H7570P9691l9886j3226b49348e8432F0460
15127A03212K68008a16856D54404G2358L7527c7359D02062A69400a67167q115
$$ y = [74996, 358674, 46352, -307403, 214012, -207692, 246117, -202023, -3475, 324083, 35251, 23825, 199350, -90678, 196785, 169766, -12562, 243411, 389105, 257698, -347486, 232586, 234874, -10175, 31777, -92262, 209110, -5669, 74304, 272642, 205079, 207090, 362662, 185700, 352534, 404111, 247677, 72315, 90618, -58628, 373117, 104070, 151209, -168710, 59115, -6293, 82656, 111073, 255218, -88526, -79980, -232084, 278187, -126874, 251970, -33079, -85523, 98663, 31485, -21908, 57393, 350281, -198416, 80298, -4483, 210762, -123589, 163940, 66064, 241051, 78592, 227701, 284006, 87570, 167261, 127375, 114149, -249348, -58432, 60460, 103212, 371220, -116856, 454404, 72358, 109885, -37359, 402062, 169400, -167167, -175282]
15117a75282L9117k4516B02159a02629B41636j10864K67486q3154b14213A71502
15106C89429A17457N8078j7385M3602J94264A69960J64256A32564M6202M0906
15096B19672b33695B74125j15547J8804K0977I7793b8380C47503n1374r111b4278
15084A67733k0221L5383A6883O9219J16001F0877J88096M4910Q0193j13881k2827
15073B37368i7986B21094a93041A88153f7260k57617A510P8829J24772A2609h6527
15061D29209j77891C4533L18481B4855J97896K3663H9126b73941c98H9454b70308
15049C8194R3206O8605J76831r5462j02134P3729o6111N2250K08544j91060I2694
15037D81446b7718E62064A40601a01072B71350I0820l9777J98084M31774l27539
$$ y = [-175282, -136165, -160681, 202159, -102629, 241636, 130772, 398258, 315104, -214213, 171502, 389429, 117457, 175535, 158150, 201752, 396016, 169960, 334216, 132564, 178766, 219672, -233695, 274125, 158578, 177382, 198359, 97793, -28380, 347503, 296129, 287018, -24278, 167733, 147512, 182895, 16883, 86102, 202103, 60877, 248973, 293883, 374076, 260195, 237368, -97986, 221094, -193041, 188153, -67260, -324877, 1510, 80339, 205111, 12609, -86527, 429209, 251318, 34533, 353014, 24855, 222751, 246414, 89126, -273941, -398, 89454, -270308, 38194, 131400, 200005, 376836, 281374, 179240, 252969, 186858, 239108, 447652, 256592, 92694, 481446, -27718, 562064, 140601, -101072, 271350, 90820, 51043, 249127, 680901, 353362]
15027C53362F4026J74390Q945J9054J58165J53633k88419K7840L52532l25321
15017C44845A11927L82707J83197k04841r4547K56547n4917j52430N556l8453
15007C94746J92478B50976m1615J22097K28544j2666A82274J1313L39344k60040
14997B72891L43713B92942N60310A55637M81427G2525K37125R4412J85425A31503
14986F95924A78262L60269A09817N39773k44527j00469J64799J9121j24854O950
14976C70610L75581l29416A61806J70125j4251n1703J36897o0183J42728O3101
14966E48520j19062Q3640P557J63971j8460n0409J55658k49341L2307l9179j03017
14955D12185j08847J75400M1405B40726J53951A75811J05274M0830K75667c0360
$$ y = [353362, 64026, 238416, 247361, 266415, 424580, 578213, 289794, 317634, 670166, 344845, 111927, 494634, 677831, 472990, 378443, 634990, 580073, 427643, 433199, 394746, 587224, 250976, 209361, 331458, 560002, 547336, 182274, 193587, 532931, 272891, 616604, 292942, 853252, 155637, 637064, 72525, 309650, 404062, 589487, 131503, 695924, 178262, 538531, 109817, 649590, 405063, 304594, 469393, 488514, 363660, 370610, 746191, 416775, 161806, 331931, 317680, 265977, 402874, 342691, 485419, 548520, 429458, 513098, 520655, 684626, 666166, 615757, 771415, 522074, 554381, 515202, 412185, 303338, 478738, 520143, 240726, 394677, 175811, 281085, 321915, 597582, -30360]
14944F82595B48254O2160E8704L26266j69927L7930l2219P7225o5986K47683k01130
14933B78546J81560J78423B42088L72560k49810L17537C19986O0758K41232j52039
14923D69937j16910p6525R5327J12380A90897L16694J65738M8266B88658m897
14913B83761J011355j14809k39808K7974k1176K42899j5378L14318j60467j14407
14903A214262J76339r9630K05067k18701K26762j08664J16404l16264j95001J15766
14893A116340k33793k29414r5561m3108B45045J48118l535q8162A40723O00873
14883G41596A79490K15968J11005A71950M97183j33890J92046C52834j20039J31097
14873C63892M1757j53771M56880k33284j59452L97930k1368K0357k22646j46874
$$ y = [682595, 248254, 310414, 58704, 384970, 215043, 252973, 220754, 297979, 231993, 479676, 278546, 460106, 638529, 242088, 614648, 364838, 682375, 319986, 380744, 621976, 469937, 353027, 276502, 371829, 484209, 190897, 507591, 673329, 721595, 288658, 283761, 1295116, 1180307, 940499, 968473, 947297, 1190196, 1174818, 1489136, 1328669, 1214262, 1390601, 1290971, 1496038, 1277337, 1504099, 1395435, 1511839, 1195575, 1000574, 1116340, 882547, 653133, 557572, 514464, 245045, 393163, 389628, 301466, 140723, 741596, 179490, 395458, 506463, 171950, 669133, 535243, 727289, 352834, 232795, 363892, 405649, 251878, 708758, 475474, 316022, 713952, 692584, 712941, 490295, 343421]
14863C43421J43436J59152J03051j07347q4893K30876q432C17707j9999J5653
14853C13361p4552J2260M49239o95K65121D30310J98076m7975j4455k48562K58523
14842E75917A33605Q74903B23492K53588M19432j28090j81535K94548j86621k65284
14832D29530K09699l7295L01214k43421k2432J6830J26573l7219n0676L00550
14822I93353n2429O3572k32031J55635j0008k79614J02475k5437P0815j94636
14812E91695k17616K03558j6418j7169L68O1129M16462C10644N13167j04288m2930
14801F76593K49357p2405j7577j98059j1605J30374J35209k64390k23222Q1911
14791D86186J34183j8418K58394n0145J02633l06914M47164m40378N16438l28477
$$ y = [343421, 486857, 646009, 749060, 641713, 556820, 787696, 779264, 317707, 297708, 313361, 238809, 251069, 700308, 699613, 964734, 430310, 628386, 580411, 565956, 317394, 575917, 133605, 1008508, 223492, 477080, 896512, 768422, 586887, 881435, 694814, 429530, 639229, 601934, 903148, 659727, 637295, 654125, 780698, 743479, 692803, 993353, 940924, 1004496, 772465, 928100, 918092, 638478, 740953, 715516, 786331, 591695, 374079, 577637, 561219, 544050, 544418, 605547, 1022009, 310644, 823811, 719523, 676593, 925950, 853545, 835968, 637909, 626304, 756678, 891887, 627497, 404275, 486186, 620369, 601951, 860345, 810200, 912833, 605919, 1053083, 612705, 1129143, 800666]
14781H00666k49567K67596C46254L08501K53538C40193M14471j3570L2573k42467
14771E31200P1810R4048O016O7094j86451j35481j07727M11482M1278q4196j1855
14760F97218j50078n1930p8086K84367N2557K00235j25018L183k92697O2535L35873
14749I38159j53304K4234k43218K2733K34470j90193R1212K6993j64968J89027
14739G75145k48523K20415O4758o1071N6311l03002L02283j60931J10648l74699
14729C81334J60699P2642K49069M3045N6815j21178j97729L31025k07336K7041
14719G95427J28335J0236j61653J8430n3030o8367N85108k3063o566k00693M59090
14708A483254m5015l6594R6376m2836j16033l51016L30094l73527n3487J10021
$$ y = [800666, 551099, 818695, 346254, 654755, 908293, 340193, 754664, 741094, 773667, 531200, 603010, 697058, 703074, 770168, 583717, 448236, 340509, 751991, 793269, 709073, 697218, 547140, 495210, 417124, 701491, 754048, 954283, 829265, 832448, 539751, 602286, 938159, 784855, 809089, 565871, 588604, 823074, 632881, 724093, 751086, 586118, 775145, 526622, 747037, 811795, 750724, 807035, 504033, 806316, 645385, 756033, 381334, 542033, 614675, 863744, 906789, 963604, 842426, 644697, 975722, 768386, 795427, 923762, 933998, 772345, 790775, 737745, 669378, 1254486, 1231423, 1224857, 1024164, 1483254, 1438239, 1401645, 1498021, 1455185, 1339152, 988136, 1318230, 944703, 891216, 1001237]
14698A001237M8280k55515O1446L7512K27725k68935K00871k49078M69063m97875
14688G74731L21042K19122K1400K38267l95541K75290J82185k73557K66409k86754
14678A342594k6571k82091J02677J4263k11991L02094l71265J6138R4832j68966
14668H11714J21390J75492N1867j91888R4417p8822J80300j38539k00252n8926
14658G66753M05793j03678p4784K33593l72411N47461l14390l89337L66213J00926
14648A166139n09258j27245N76720k8790N661l12695K62983J27894J11537j50249
14638A122697J16108n8585l0826K00760L1139L7275j66224J01288p3635J05909
14628A385906o9334j52576j90051J36560r235J84103n1255K52884l16334J89773
$$ y = [1001237, 1049517, 794002, 855448, 892960, 1120685, 851750, 1052621, 803543, 1272606, 774731, 1095773, 1314895, 1336295, 1574562, 1179021, 1454311, 1636496, 1362939, 1629348, 1342594, 1316023, 1033932, 1136609, 1150872, 938881, 1240975, 869710, 885848, 980680, 811714, 933104, 1108596, 1160463, 968575, 1062992, 984170, 1164470, 1025931, 825679, 766753, 1172546, 1068868, 994084, 1227677, 855266, 1402727, 1088337, 699000, 1065213, 1166139, 656881, 529636, 1106356, 1077566, 1083227, 770532, 1033515, 1161409, 1272946, 1122697, 1238805, 1180220, 1149394, 1350154, 1381293, 1418568, 1252344, 1353632, 1279997, 1385906, 1316572, 1163996, 973945, 1110505, 1101270, 1285373, 1234118, 1487002, 1170668, 1360441]
14618A360441l32731n4526M17734m9818m850l2768K27712l06193p9006M96168
14608A642163o0208k29551M87393j29502k13767L657M568J47256o1434l17291
14598A273284l2738J52573K89182M9911j38926n0977Q188l4487j54747J51258
14588A512521J80786K85183l23665j25673J73635j0895K05031l69210J72834n6923
14578A643624k3772K1720L8926n9207M65388o57090L26275K7241O1479J35194
14568A979778O6438l7697O287k48668J5819K1125K85165K36432k07766l8884J86599
14557B264628K24494J43330n63524L23859J3668j57410M87875n8159q4485P4068
14547B668344j31J54594p0330L89143M10316k32667O3597O68801L25665K73261
$$ y = [1360441, 1027710, 973184, 1390918, 1341100, 1336250, 1303482, 1531194, 1225001, 1145995, 1642163, 1581955, 1352404, 1839797, 1710295, 1496528, 1500185, 1504753, 1652009, 1590575, 1273284, 1240546, 1393119, 1682301, 1732212, 1593286, 1542309, 1550497, 1516010, 1361263, 1512521, 1693307, 1978490, 1654825, 1529152, 1702787, 1691892, 1896923, 1527713, 1700547, 1643624, 1619852, 1641572, 1680498, 1621291, 2086679, 1429589, 1755864, 1783105, 1844584, 1979778, 2046216, 2008519, 2014806, 1766138, 1781957, 1803082, 2088247, 2324679, 2116913, 2078029, 2264628, 2489122, 2632452, 2068928, 2392787, 2406455, 2249045, 2736920, 2678761, 2594276, 2668344, 2668213, 2822807, 2752477, 3141620, 3551936, 3319269, 3382866, 4051667, 4377332, 4650593]
14537D650593J015410M67379J418400K447178L725839O479369R547573K504415
14529C2256156j2410308q101784m132681j777594o53117L5207q1903j206752o99724
14520C227500k71463j78040P5502m40640J51954k12429L80541m7092j78864l5662
14510B471307K83397l97691K06861k4140J93824j6662k9559J88114l04106K41933
14500B813278L04385n01731j41731J98856L0621N24084m73452L57314r7022j61631
14490B852971L85761Q8863k55492J01891N8658j366J65503j8883m6600o7397K48853
14479C512762n3385j17012R0127K11203J08159m56780O37212l41017J15449n672
14469C701046J40360J91504r6957j13893L05219j34793L49881j40932j31078J67041
$$ y = [4650593, 5666003, 6133382, 7551782, 9998960, 13724799, 20204168, 29751741, 32256156, 19845848, 11744064, 7611383, 5833789, 5180672, 5215879, 5133976, 3927224, 3227500, 2956037, 2777997, 2853499, 2412859, 2564813, 2352384, 2732925, 2685833, 2506969, 2471307, 2754704, 2357013, 2563874, 2539734, 2733558, 2716896, 2687337, 2875451, 2571345, 2813278, 3117663, 2615932, 2474201, 2673057, 2703678, 3227762, 2754310, 3111624, 3014602, 2852971, 3238732, 3327595, 3072103, 3173994, 3232652, 3231286, 3396789, 3377906, 3331306, 3263909, 3512762, 3459377, 3342365, 3432492, 3643695, 3751854, 3295074, 3932286, 3591269, 3706718, 3701046, 3841406, 4032910, 3935953, 3822060, 4127279, 3992486, 4342367, 4201435, 4070357, 4237398]
14459D237398M2351K56148k08082J08353J87103q7108p8423J42832j7269K17116
14449D800419m00197N73726k77144j68318N68920J10368r2995J06751j68780j56981
14439D895769O26686k04284K63370q2165J51608L04088j21768j84060K55059n5984
14429E848319l8651J01647L75023J78095l03642J71878J80150M34778j23646j00610
14419F723341j85442L33239J07981K56215m16l13712P22750m60493M42176J07228
14409G732867M9604K85080J6132j36034J98625L32127M32278p0246P5853K29355
14399I145641K08823J71291r3681J17331L69302l61026J37766K94621K27192L40354
14389A0557614K7368M56790j46604J0934L36800N07299k8923N7467J38991j69687
$$ y = [4237398, 4279749, 4535897, 4327815, 4436168, 4623271, 4536163, 4457740, 4600572, 4583303, 4800419, 4400222, 4973948, 4696804, 4528486, 5097406, 5207774, 5114779, 5221530, 5052750, 4895769, 5522455, 5318171, 5581541, 5499376, 5650984, 5955072, 5833304, 5649244, 5904303, 5848319, 5809668, 5911315, 6286338, 6464433, 6160791, 6332669, 6512819, 6947597, 6823951, 6723341, 6537899, 6871138, 6979119, 7235334, 7234918, 6921206, 7643956, 7183463, 7625639, 7732867, 7782471, 8067551, 8083683, 7947649, 8146274, 8478401, 8910679, 8840433, 8916286, 9145641, 9354464, 9525755, 9432074, 9549405, 9918707, 9557681, 9695447, 9990068, 10217260, 10557614, 10584982, 11041772, 10895168, 10906102, 11242902, 11750201, 11721278, 11778745, 11917736, 11748049]
14379A1748049N65956M2425L77975P7427J77036M74447J65659Q6650K82995L32346
14369A4330965k7297M43921M20442K72629L01986K73787L73552K08458M67852
14360A7066295K95008J72916M15283M03926M5930M54514M53022K53653j3221J257321
14350B0804647J88493J08586R67204K16013R74785R5726P45069P41215M2573R58187
14340B5842498K12538M96227Q77353N47762O19516P89660Q34507O17087O02000
14331C1439148J083852J255750O32558Q30115R07595Q94093J200486J489472O25853
14322D0358922J373745J539608O51872J747253J465541J341539J582537J238701
14314E1299718K023344J934407J542698J909237J960146J833352K360619K706685
$$ y = [11748049, 12314005, 12356430, 12734405, 12811832, 12988868, 13463315, 13628974, 13715624, 13998619, 14330965, 14303668, 14747589, 15168031, 15440660, 15742646, 16016433, 16389985, 16598443, 17066295, 17361303, 17534219, 17949502, 18353428, 18399358, 18853872, 19306894, 19560547, 19547326, 20804647, 20993140, 21101726, 22068930, 22284943, 23259728, 23355454, 24100523, 24841738, 24884311, 25842498, 26055036, 26551263, 27428616, 27976378, 28595894, 29385554, 30220061, 30837148, 31439148, 32523000, 33778750, 34411308, 35241423, 36149018, 37043111, 38243597, 39733069, 40358922, 41732667, 43272275, 43924147, 45671400, 47136941, 48478480, 50061017, 51299718, 53323062, 55257469, 56800167, 58709404, 60669550, 62502902, 64863521, 67570206]
14306F7570206K411904K462983K771848K743988L090318K925518L403438L490600
14298I0870803L504631L752493M083955M603608M511578N248597N190753M879372
14290A26645790O213178O272634O409805O961567P613675P880453P866385Q959277
14282A84822764R457517J0019254R880053J1106032J1654085J1992369J2879288
14275B61811362J3375921J4045126J4469153J4921255J4863728J5269432J4921140
14268C63677117J4488074J3798896J2670665J1351720J1045436J0508996R142987
14261D46683891P412552N808042N124823L138389K93974j124947q61202l387343
14253D63088179q704190q077870r543528j2067920j2587770j2329678j3936316
$$ y = [67570206, 69982110, 72445093, 75216941, 77960929, 81051247, 83976765, 87380203, 90870803, 94375434, 98127927, 102211882, 106815490, 111327068, 116575665, 121766418, 126645790, 132858968, 139131602, 145541407, 152502974, 160116649, 167997102, 175863487, 184822764, 194280281, 204299535, 214179588, 225285620, 236939705, 248932074, 261811362, 275187283, 289232409, 303701562, 318622817, 333486545, 348755977, 363677117, 378165191, 391964087, 404634752, 415986472, 427031908, 437540904, 446683891, 454096443, 459904485, 465029308, 468167697, 468461671, 467336724, 466475522, 463088179, 454383989, 446306119, 436762591, 424694671, 412106901, 399777223, 385840907]
14246C85840907j2903033j3272792j4000234j4326150j3706313j4139186j3722160
14239B89771039j2915228j2576365j2193123j1576904j0827943r733732r903720
14232B10044024j0501144j0319599r721277q751061q308811p730203p668096p028261
14224A40015572n975728n904922n874993n496558n025618m616814m702105l920051
14216I8498783l496748m125774l390224l881847k887353l103399k907398k416372
14208G2289668k876696k368568j809146k475785j824912k260208j899437j681367
14200E5093549j770668j772200j128203j752384j290766j352698j739017q42138
14192D3445475j017209j078419j244328j467193j185902m84455j123073o07799
$$ y = [385840907, 372937874, 359665082, 345664848, 331338698, 317632385, 303493199, 289771039, 276855811, 264279446, 252086323, 240509419, 229681476, 219947744, 210044024, 199542880, 189223281, 179502004, 170750943, 162442132, 154711929, 147043833, 140015572, 134039844, 128134922, 122259929, 116763371, 111737753, 107120939, 102418834, 98498783, 95002035, 90876261, 87486037, 83604190, 80716837, 77613438, 74706040, 72289668, 69412972, 67044404, 65235258, 62759473, 60934561, 58674353, 56774916, 55093549, 53322881, 51550681, 50422478, 48670094, 47379328, 46026630, 44287613, 43445475, 42428266, 41349847, 40105519, 38638326, 37452424, 36967969, 35844896, 35237097]
14184C5237097j053187r77992j224213l03225r85161q07747o53356o73369n99976
14175B7958871n99435p38940p42001k16511q12803q07553J3197q02595n05707
14166B2746523m03207n65207o90718l30441m38944k87536l35026l19632n39738
14157A8836074n58872r4590j75021m02517o71221O859l34601l84973l51540n8617
14147A5810981m81982j13348m12118k76959M2897k23583m80097m38812j28520
14138A3298459k19470k97207j08179l02433l21880M21760k92282k85902m23615
14129A1469251k98829J23493l85777O5611o79734K41038K8404j48478l07748m02684
14119I704547j74079L62250k97387k80277K7643k12608l1357n38145J21974Q8630
$$ y = [35237097, 34183910, 33205918, 31981705, 31678480, 30693319, 29885572, 29232216, 28558847, 27958871, 27359436, 26620496, 25878495, 25661984, 24849181, 24041628, 24054825, 23252230, 22746523, 22343316, 21778109, 21087391, 20756950, 20318006, 20030470, 19695444, 19375812, 18836074, 18277202, 18182612, 18007591, 17605074, 16933853, 16940712, 16606111, 16221138, 15869598, 15810981, 15328999, 15215651, 14803533, 14526574, 14569471, 14345888, 13865791, 13426979, 13298459, 13078989, 12781782, 12673603, 12371170, 12049290, 12471050, 12178768, 11892866, 11469251, 11170422, 11293915, 10908138, 10973749, 10294015, 10535053, 10563457, 10414979, 10107231, 9704547, 9530468, 9892718, 9595331, 9315054, 9342697, 9130089, 9098732, 8560587, 8682561, 8771191]
14109H771191k39275p0554j5892l18158j33275k42285j87900J70297k49755k64850
14099G219544K53591P610l83521j78803L3617N5639K08128k73476J39424m98011
14089F583742N0581k7726j79785K3346m21287M53670k32062l45780k03445M38130
14079F139384k73006o1703J4991l98825J50256o3396J15227j35817o3447j99819
14069E223845j21264K15690m40583O13148l38429q4798j02090k5783J19720o50129
14059D409327J85304j41731k14249L61665K2027k10175m022K57696l59640M6476
14049D352678P8144l34698J15940J99711m5008j07583K1326n07350M06195o0978
14039D118377l45149J43473K8562R0126l26707j40348K06126j76982j84289k11795
$$ y = [8771191, 8531916, 8461362, 8445470, 8127312, 7994037, 7751752, 7563852, 7734149, 7484394, 7219544, 7473135, 7480745, 7097224, 6918421, 6952038, 7007677, 7215805, 6942329, 7081753, 6583742, 6634323, 6606597, 6426812, 6450158, 6028871, 6482541, 6250479, 5904699, 5701254, 6139384, 5866378, 5804675, 5819666, 5420841, 5571097, 5507701, 5622928, 5487111, 5423664, 5223845, 5102581, 5318271, 4877688, 5490836, 5152407, 5067609, 4965519, 4939736, 5059456, 4409327, 4594631, 4452900, 4238651, 4600316, 4622343, 4412168, 4408146, 4665842, 4306202, 4352678, 4430822, 4096124, 4212064, 4411775, 4366767, 4259184, 4280510, 3773160, 4179355, 4118377, 3773228, 3916701, 3945263, 4035389, 3708682, 3568334, 3774460, 3597478, 3413189, 3201394]
14029C201394K18022k2198k4490j97075n3059K74164J03255k365m83107K59751
14019C274292J59928K7364l13269J98952k74890J56422O8446Q8688m33241l893
14009B948799O8388p1294j10779K68553k46569J95486m36508J72442l25942K11590
13999B674166j50853o6439n204K51450k19845P117J8500l7763j37663L03254o3096
13988B573624k07932J18177j4699k21452L7758K55488k05677L35537J64799j1762
13978B823861J64201K87385O21100R86122J284354L278451N566399R772793Q438511
13969C3223177r797295q108682m931940k709108j388582j057672n60095p57482
13961C912321j09248n2925n01976O0262l22170J6906J0130k27167p5172R8805
$$ y = [3201394, 3419416, 3397218, 3372728, 3175653, 3122594, 3396758, 3500013, 3497648, 3014541, 3274292, 3434220, 3461584, 3148315, 3347267, 3072377, 3228799, 3297245, 3385933, 2952692, 2948799, 3017187, 2945893, 2835114, 3103667, 2857098, 3052584, 2616076, 2788518, 2462576, 2674166, 2523313, 2456874, 2451670, 2703120, 2483275, 2490392, 2508892, 2471129, 2333466, 2636720, 2573624, 2365692, 2483869, 2469170, 2247718, 2285476, 2540964, 2335287, 2670824, 2835623, 2823861, 2988062, 3275447, 3896547, 4882669, 6167023, 9445474, 15011873, 24784666, 33223177, 23425882, 15317200, 10385260, 7676152, 6287570, 5229898, 4669803, 3912321, 3803073, 3750148, 3248172, 3308434, 2986264, 3003170, 3013300, 2786133, 2710961, 2809766]
13951B809766m47013J38192J17599j12164j10554m0882J05292j29524J11109m32237
13941B009584L78190k15693J3151R087k14578k03996K37245K08061l44560k79059
13931A597432M32875l07840j9664L26894k64577N5491M608j48636Q9715j28139
13921A638159J70024k7995L5406j00483J8641j50905n7000K04656k36627L69580
13911A863456k52131k82942L06449j10996K02359l74411r8143M80340k02773m6646
13901A484562J18164J37586k80530l1852M10798o56964L4487N47068J6884m47371
13891A332832J28096k4614r8223M40689m5177k89644k21159P473J97461J49985
13881A577719r414L9620j26731o81888M90320k5344O1589J45467k39999L37581
$$ y = [2809766, 2362753, 2500945, 2618544, 2506380, 2395826, 2354944, 2460236, 2330712, 2441821, 2009584, 2387774, 2172081, 2185232, 2194319, 1979741, 1775745, 2012990, 2221051, 1876491, 1597432, 2030307, 1722467, 1702803, 2029697, 1765120, 1820611, 1825219, 1676583, 1766298, 1638159, 1808183, 1780188, 1815594, 1715111, 1733752, 1582847, 1525847, 1730503, 1493876, 1863456, 1611325, 1328383, 1634832, 1523836, 1726195, 1351784, 1253641, 1733981, 1531208, 1484562, 1602726, 1740312, 1459782, 1427930, 1838728, 1181764, 1216251, 1763319, 1780203, 1332832, 1460928, 1436314, 1338091, 1778780, 1733603, 1443959, 1222800, 1230273, 1427734, 1577719, 1568305, 1607925, 1481194, 799306, 1289626, 1264282, 1325871, 1471338, 1231339, 1568920]
13871A568920r4420l69314J69930K63809k15261r1140M1717J23464o08684N56061
13861A345082k5986O0471k29621k11014L76437J03080l72269J60174o0554L55418
13851A501218m77731R4558Q4140J42951k25117o7186O2673j36930j02250j25729
13841G50597J46178K2120N3433Q8282l92480L85392J97643k8531o006j14250L92396
13830A494774n70896j15315J01007K21327J50748p1834l7191r6646j23930m5233
13820I06811J47115O9917m4467p663k98015K97342j66382J19619j92606J40148
13810I71819p627j65809O11632m43774Q8138l09240P3882j44133L49443j90788
13800H33543j05734O2972m1870L24991q1827k49030k6979L07206k15353K03397
$$ y = [1568920, 1474500, 1105186, 1275116, 1538925, 1323664, 1232524, 1274241, 1397705, 789021, 1345082, 1319096, 1379567, 1149946, 938932, 1315369, 1418449, 1046180, 1206354, 1145800, 1501218, 1023487, 1118045, 1202185, 1345136, 1120019, 1052833, 1115506, 978576, 876326, 750597, 896775, 918895, 972328, 1060610, 668130, 1053522, 1251165, 1222634, 1216628, 1102378, 1494774, 923878, 808563, 909570, 1130897, 1281645, 1209811, 1172620, 1075974, 952044, 906811, 1053926, 1123843, 1079376, 1071713, 773698, 1071040, 904658, 1024277, 831671, 971819, 964192, 798383, 1410015, 966241, 1054379, 745139, 819021, 674888, 1024331, 833543, 727809, 790781, 748911, 1073902, 992075, 743045, 716066, 1023272, 807919, 1011316]
13790A011316j10612J52290l16263J29646k69184M12252j70365m3739J01931n2288
13780H44984p4292J65663j54168C56331N03043k6073n0496j04453j58102N09876
13770A030126m41085m491J20328K3439j34423J89218K89148m33917N8984M36182
13760A133509j10867p2097m27929L51861O0420k49878J70305n9002m0222J5256
13750G71356k62458K85046j78506L99540J0040j55777l69971R2089J76847k32285
13740E35921J06186P5289l46177L31528k19458l9219N0511J70401K96550C51339
13729D66288n8021K11835r5544J32079L46841m24507q4643L10931C95087L05461
13719G00548J20841K96386l60897l70860K5449J76230J7207K04893l8015q3513
$$ y = [1011316, 900704, 1052994, 736731, 866377, 597193, 1009445, 839080, 795341, 897272, 844984, 770692, 936355, 782187, 356331, 859374, 833301, 782805, 678352, 520250, 1030126, 589041, 584550, 704878, 728317, 593894, 783112, 1072260, 638343, 697327, 1133509, 1022642, 950545, 522616, 874477, 934897, 685019, 855324, 796322, 756100, 771356, 508898, 793944, 615438, 1014978, 1025018, 869241, 499270, 591359, 768206, 535921, 642107, 717396, 371219, 702747, 483289, 444070, 494581, 664982, 961532, 351339, 466288, 408267, 620102, 524558, 656637, 1003478, 578971, 494328, 805259, 395087, 700548, 821389, 1117775, 756878, 386018, 411467, 587697, 604904, 809797, 771782, 688269]
13709F88269M4352l4719k81095L21476j85955j25502J85745j72264j3971M27459
13699H53795C35359J01861J86112j47406k6893L29612J837k13570o6998R0763
13689E90677k57655K48473J76252j81485J35543j27622k0318L06898l10482N3669
13679F13950J72217B74255n5L26460Q3298q9149j6850M17636l52570J2819j15427
13668E40417K52585j39946j28206j15773m8533L23334j70942L90499k17630k35289
13658D50516j11085J75195k18864N44530l75469A43288K06649O6281J27937O9481
13648F13636n770j12979p8753J32379B62207N9154J39154j6911j12700K45353
13638E76257J0887K040k31890P4410O9972B48164K85279L3539k46433K25326P1173
$$ y = [688269, 732621, 697902, 416807, 738283, 552328, 426826, 612571, 440307, 426336, 853795, 335359, 437220, 623332, 475926, 449033, 778645, 780482, 566912, 499914, 590677, 333022, 581495, 757747, 576262, 711805, 584183, 563865, 870763, 560281, 613950, 786167, 274255, 274200, 600660, 683958, 594809, 577959, 995595, 643025, 655844, 540417, 793002, 653056, 524850, 409077, 360544, 683878, 512936, 903435, 685805, 450516, 339431, 514626, 295762, 840292, 464823, 143288, 349937, 416218, 544155, 613636, 607866, 494887, 416134, 548513, 262207, 321361, 460515, 443604, 330904, 576257, 587144, 589184, 357294, 431704, 501676, 248164, 533443, 566982, 320549, 545875, 617048]
13627F17048k19727j66346K6670L40091p5745N0167j65489J65434j84911n6881
13617C30311K882L5029J12378J12718M8702l03066j3573K68208k04415N3648J32946
13606E75768M9161r8453p2127A55784N15576k84074J37685j07581K1090j81667
13596B56813L94575B63265q3990K18218A30843P6204O0376J32634l5289j34946
13586B29822K67481r13B41375K56946B45606J39539O0498j41840L00057j98000
13576D05860j64173K88458A67611K04393L577L2328j96675J98325K14153k17246
13566D06466O4090I9266K6373J97804L38510B38580O7005G2332A9992O47965k05738
13555D62219k24576M6895F4252K93352m0131J46429o1518I3335N87726k34586
$$ y = [617048, 397321, 230975, 257645, 597736, 521991, 572158, 406669, 572103, 387192, 330311, 333193, 368222, 480600, 593318, 642020, 338954, 325381, 593589, 389174, 442822, 575768, 624929, 526476, 454349, 155784, 671360, 387286, 524971, 417390, 438480, 256813, 651388, 263265, 179275, 397493, 130843, 207047, 267423, 400057, 364768, 229822, 497303, 496390, 241375, 498321, 245606, 385145, 445643, 303803, 603860, 405860, 241687, 530145, 167611, 372004, 375581, 407909, 211234, 409559, 623712, 406466, 470556, 99266, 125639, 323443, 661953, 238580, 305585, 72332, 19992, 667957, 462219, 237643, 284538, 64252, 357604, 317473, 463902, 402384, 93335, 681061, 446475]
13545D46475A22606Q0085k1946O1578A05249J59176h9255B92373o7607J9042K66022
13534E09830A89353Q590n2746k8163J01537J25121J29990j89755r0255j3024J27356
13523C08004q598o3832L42835A74336G8789L59780q9322j05581K00294J07596
13513E51556K198B73431p0669L51524j67072j4633F8784L44293o4468L97979H0461
13501A34694K58N14885k18287p5412j44336J63868p2135j46208O8201N2822K07877
13490D86227k39306K8798M8684J20012j73126J03739j39041K55977H1018j3773
13480F7245l0767J01792b78843B71565J65117O2864j55930A25002J14836N9959
13470B99797I9245A9289L82023q2526p1267C9065L43609j73406J26422A33459
$$ y = [446475, 122606, 202691, 180745, 242323, 105249, 264425, -89255, 292373, 224766, 243808, 509830, 189353, 197943, 145197, 117034, 218571, 343692, 473682, 283927, 193672, 180648, 308004, 299406, 235574, 578409, 174336, 78789, 438569, 349247, 243666, 443960, 551556, 553754, 273431, 202762, 554286, 387214, 372581, 68784, 413077, 348609, 746588, 80461, 134694, 134952, 649837, 431550, 356138, 211802, 375670, 303535, 157327, 225528, 278350, 486227, 246921, 275719, 324403, 444415, 271289, 375028, 235987, 491964, 81018, 67245, 36478, 138270, -278843, 271565, 436682, 499546, 343616, 125002, 239838, 299797, 99245, 19289, 401312, 318786, 247519, 39065, 382674, 209268, 335690, 133459]
13459A1797a32415A73936C1661K07750K02892j87479j10149J41939M796g5854
13448C44587a57873A88088j2078P7786R6012J48569a25293F4600K50493A33119
13437C95283l7169A44358G0879J63888J04537I0333J70458K7145q0898m9806F9276
13425D63752A77507L14924F7651b18307A07158K78578A90644Q9772p8355I4299
13414C48555A0506R2452K05607M4060r9174P2510A50956Q8536K99621D0981K67446
13403C08427D4411J49742O1591p0982c37305B47660I4317J9934m04C7494K72279
13392C09773r4704e0805n1760B86943h551j26239D22560A06076C6461J67780k5936
13381A78305K77264r0211j12442r8166K97086a9671B13355I581a8288A60334J62590
$$ y = [11797, -132415, 173936, 31661, 239411, 442303, 254824, 144675, 286614, 291410, -75854, 344587, -157873, 188088, 176010, 253796, 349808, 498377, -125293, 64600, 315093, 133119, 395283, 358114, 144358, 70879, 234767, 339304, 90333, 260791, 287936, 207038, 157232, 69276, 463752, 177507, 492431, 67651, -218307, 107158, 385736, 190644, 280416, 202061, 94299, 348555, 10506, 102958, 308565, 352625, 253451, 325961, 150956, 239492, 539113, 40981, 308427, 44411, 194153, 255744, 184762, -337305, 247660, 94317, 114251, 113847, 37494, 309773, 215069, -50805, -102565, 286943, -8551, -134790, 422560, 106076, 36461, 204241, 178305, 455569, 365358, 252916, 154750, 451836, -19671, 213355, 9581, -18288, 160334, 322924]
13370C22924B7462b56231B75859R1246A01734M25368r2405G8819L8383Q2888J2738
13359B12828J99189j74064b4732A54797J42795N1149j72058L5404Q3704K9180
13349C24971j03302q0967L38782k08386D0254J73574K49646F6836K51065P1946
13339C89847O9738g9308A26951e2004A47429K981K3140L86295A92088K01381J4918
13328D08387j30474Q0719J17419q4209j94544G9539J60069K02213g3815C30361
13317D41873L13128l35545k08381J83768A67297b6092A25381E1033N5825L24425
13307D31283A10693J81258p6168K9023m1824K42898j08860J31198a3014C94328
13296H2014M39346A12170h1324A88286P971d5248D73824B9708f838l6855B40446
$$ y = [322924, 27462, -256231, 275859, 367105, 101734, 527102, 434697, 78819, 117202, 200090, 212828, 412017, 237953, -24732, 154797, 297592, 348741, 176683, 212087, 295791, 324971, 221669, 140702, 479484, 271098, 40254, 213828, 463474, 66836, 317901, 389847, 459585, -79308, 126951, -52004, 147429, 150410, 173550, 559845, 192088, 393469, 408387, 277913, 358632, 476051, 391842, 197298, 79539, 239608, 441821, -73815, 330361, 441873, 755001, 419456, 211075, 394843, 167297, -26092, 125381, 51033, 106858, 431283, 110693, 291951, 215783, 244806, 202982, 445880, 337020, 468218, -13014, 394328, 82014, 521360, 112170, -81324, 188286, 196257, -45248, 473824, 29708, -6838, -43693, 240446]
13284B42291J53754j14836h9075K1614I5939l9312J90993J90198I1956J66323
13274B58279A17591M54885B74393E9800b06188E07226A01320L1527K04080D7219
13263a3115A88989B3219O7833c8481B21886F0894J82431D082f9542j735A7157
13251B52193r8800g9945C39394j67268H951K19540L05511B7384K72924a16543
13240c8463j21973C5052K57818j16730a63244I8275d6416B062L0327b7128H4163
13228B37503N639A11056K32539f135p9641n6975A93903m2330n8848R7723J80274
13217C70722o5606k5186A10827B7063K82718J47846k17631H9036D1251K0569c8706
13205C4271O583a58328D1812b45921B63353D6971F344J30303a4973p7892d405
$$ y = [242291, 396045, 281209, -89075, -67461, 95939, 56627, 247620, 437818, 91956, 258279, 117591, 572476, 274393, 59800, -206188, 507226, 101320, 132847, 336927, 47219, -13115, 188989, 23219, 91052, -38481, 221886, 60894, 243325, 4082, -69542, -71277, 17157, 252193, 153393, -79945, 339394, 172126, 8951, 228491, 534002, 27384, 300308, -116543, -38463, -160436, 35052, 292870, 176140, -163244, 98275, -46416, 2062, 32389, -27128, 84163, 237503, 243142, 111056, 343595, -6135, -85776, -142751, 193903, 151573, 92725, 190448, 370722, 305116, 279930, 110827, 27063, 309781, 457627, 239996, 89036, 41251, 61820, -38706, 34271, 40854, -158328, 41812, -245921, 263353, 46971, 6344, 136647, -14973, -92865, -4405]
13193a9254n7n9858A1941e0803I6380f0819A12390e2151o6967A17486K47835I9688
13180B23175F1140a15052A21113K23691G3511J53548o9982A7197K39661b08224
13169f3348A38689c8296q6339A94131K4880a28772B84386h8086m0621B94821C8215
13157d7189o6785A53594d4590j08126A74941l9077L1099F1622a35689D5957j0710
13146C5247a73676f9738g229E3368K21354a40645D7541a15345B07685H990a70411
13134H3684J25561p7234A1478i4206J7738C47065G6998B4571a40944A73472H0859
13122A56777b4115G5991N5355a05015A38028c6362A30623P6427J11806m5081C6861
13110a09042C48250j47673H5492J51429J61521j46851C5608a19291I0806J08803
$$ y = [-19254, -19311, -79169, 11941, -50803, 96380, -60819, 112390, -52151, -119118, 117486, 365321, 99688, 223175, 61140, -115052, 121113, 344804, 73511, 227059, 157077, 17197, 256858, -208224, -63348, 138689, -38296, -124635, 194131, 219011, -128772, 284386, -88086, -128707, 294821, 38215, -47189, -113974, 153594, -44590, -152716, 174941, 135864, 166963, 61622, -135689, 45957, 35247, -173676, -69738, -7229, 53368, 274722, -140645, 47541, -115345, 207685, 8990, -170411, 83684, 209245, 132011, 11478, -94206, -76468, 347065, 76998, 24571, -140944, 173472, 80859, 156777, -24115, 75991, 131346, -105015, 138028, -36362, 130623, 207050, 318856, 273775, 36861, -109042, 348250, 200577, 85492, 236921, 398442, 251591, 35608, -119291, 90806, 199609]
13100A99609a6278E1411M1068J9082B842J29985Q8078q6556R8093j15360a7699
13088A51268E5066h5149m2021N8479D63383j45227F6192O8252J34575N1515I8803
13076a64218C39978A30975A5048J24950J95125b07516A63016G4138J81634a3330
13065C79919e0181D19175b41681A86469H2632J70066j05816a06523C39835l429
13055C36406d8103A64568G4548Q0093J51428C9074J72632I3772J10053G1674g6465
13043B78932g1474A95440P9064j17764a6057A8146c0225D5260a07468C70581b2606
13031g7005A01038P1281l04H839b0084l9681k5279B85096q0924c19453A56688
13019B20759B305h56k1306A17925J1103O5777a46721c3788F1963b37776L5504
$$ y = [199609, -16278, 51411, 92479, 111561, 2842, 132827, 220905, 134349, 232442, 117082, -17699, 151268, 55066, -85149, -127170, -68691, 463383, 318156, 66192, 134444, 269019, 320534, 98803, -164218, 339978, 130975, 15048, 139998, 335123, -207516, 163016, 74138, 255772, -13330, 379919, -50181, 419175, -241681, 186469, 82632, 252698, 146882, -106523, 339835, 336406, -48103, 164568, 74548, 154641, 306069, 39074, 211706, 93772, 203825, 71674, -76465, 278932, -71474, 195440, 274504, 156740, -16057, 18146, -30225, 45260, -107468, 370581, -22606, -77005, 101038, 172319, 172015, 8839, -20084, -59765, -85044, 285096, 204172, -319453, 156688, 220759, 2305, -856, -22162, 117925, 129028, 194805, -146721, -33788, 61963, -237776, -202272]
13008b02272A11510J7792a91488m8639a00898E3776J48445a81757a1696B59214
12997h0656b4052j57852g4730m3227C64209l7815l316g2987C37040B0870c11344
12985E9220K27119j23801E4621a3448A98472E2027K02710a08956D70227A98083
12974B9070K68782q3920h0312E7263M7242K2601a81201a43j71429C50351j08839
12963B41512b57702D3476a35896b8176E5191g0071a5531L271D4257K46253j43280
12952A47230K6018a62243J2344A60397Q5026H4037N9887A124J12821a68574I697
12940C27858A32841a16336A68853B7536J91367b3261D1175R1690b9585A80652
12929B95319a46013B53127m2185b86063a33776C21000a62359A19096N049C1066
$$ y = [-202272, 111510, 129302, -191488, -240127, -100898, 53776, 202221, -181757, -11696, 259214, -80656, -24052, -181904, -74730, -117957, 364209, 326394, 323078, -72987, 337040, 20870, -311344, 59220, 286339, 162538, 54621, -13448, 198472, 52027, 254737, -108956, 470227, 198083, 29070, 297852, 213932, -80312, 57263, 104505, 127106, -181201, -143, -171572, 350351, 241512, -257702, 43476, -135896, -28176, 55191, -70071, -15531, -12260, 44257, 290510, 147230, 173248, -162243, -149899, 160397, 245423, 84037, 143924, 1124, 113945, -168574, 9697, 327858, 132841, -116336, 168853, 27536, 218903, -23261, 41175, 132865, -29585, 180652, 295319, -146013, 253127, 210942, -286063, -133776, 321000, -162359, 119096, 124145, 31066]
12918A07176f5155m3734A50455A433R6862e1315j915H5252k4155a86295I5285
12906b34037E5189J52734L2413B348M4114J06557e8921D5921K8552a4429A75893
12894A11267n0718J72406A8090J73714a51760n0060J3041B30115b5548a0028B29829
12882a16831B88372a56936g8040A54960l1382C6769P08a35454l4018o2052c4713
12870D0154a39162C9546a11616E67083c272m7626A38982J05631c50C17600h919
12858c9074r989J2822D53206e8509j16135f4690j04667E9444b26804A20539E1494
12846a8363C3465a7597B79756C2125J89783a67451P8211j01336H1013J34176g4128
12834H6867b61636A96266a4981F3561L3919B0755h7343a7717o4412I7756C0960
$$ y = [107176, -65155, -108889, 150455, 1433, 98295, -51315, -53230, 85252, 61097, -186295, 95285, -234037, 55189, 207923, 240336, 2348, 46462, 153019, -58921, 45921, 74473, -14429, 175893, 111267, 60549, 232955, 18090, 191804, -151760, -201820, -188779, 230115, -25548, -10028, 229829, -116831, 288372, -156936, -78040, 154960, 123578, 36769, 37477, -135454, -169472, -231524, -34713, 40154, -139162, 39546, -111616, 567083, -3272, -50898, 138982, 244613, -350, 317600, -8919, -39074, -49063, -36241, 453206, -58509, -174644, -64690, -169357, 59444, -226804, 120539, 51494, -18363, 33465, -17597, 279756, 32125, 221908, -167451, -89240, -190576, 81013, 215189, -74128, 86867, -261636, 196266, -14981, 63561, 97480, 20755, -87343, -17717, -82129, 97756, 30960]
12822A34637a13088j32923Q8745B0042A870J23513K36435B3644K91602h949l77211
12811c86160A43028c2069K720k11245N1071j7969f3498b2708k24137i2221A04836
12799A83722K1146i2493M566G7711J50861A755b22F3161a29406o7513F6125L09307
12787C75432B9056J80151E6825f9332A65711Q2654h0363k16789A85103a1910A36718
12775A23145n7010g9841B31039I1956g0908B79617G7254B292c7086c405n5748
12764e9153A17930J33984a03069K8281b3778C94839j88817c52901h5657J4452
12754g1205A42119L58039c7451j92125A16541a96468f5078C76258c88563J60231
12744b28332b1002m88503A38103a3789H3450J20157F9713J44967a07022k03595
$$ y = [134637, -113088, -246011, -157266, 20042, 1870, 125383, 361818, 23644, 315246, -8949, -386160, 143028, -32069, -29349, -240594, -189523, -207492, -63498, -22708, -246845, -92221, 104836, 183722, 204868, -92493, -87927, 77711, 228572, 1755, -222, 63161, -129406, -196919, 66125, 375432, 29056, 209207, 56825, -69332, 165711, 248365, -80363, -297152, 185103, -11910, 136718, 123145, 66135, -79841, 231039, 91956, -70908, 279617, 77254, 2292, -37086, -3405, -59153, 117930, 251914, -103069, -74788, -23778, 394839, 206022, -352901, -85657, -71205, 142119, 500158, -37451, -229576, 116541, -196468, -65078, 376258, -388563, -228332, -21002, -509505, 138103, -13789, 83450, 203607, 69713, 214680, -107022, -310617]
12734c10617J15173L3273C27934C1938J54577f7169A3733K29337D7670K88035
12724C35705a90289e3844E0272i5847F009a05104C9981O1408J39090A18433a71153
12712f5203G971K77026a8629A9133P3099J01595A7874Q771a08532A7071J26202
12701A43273n2409i6887B651M388J46412D16b33045j29894F9067J3332B8740J26606
12689A55346b40071B95570r0973a34920k6271D2705i2151D7805L2298J31470c0972
12677B0452P2743b22264E8314m788e0299j26566I1776h5927A94047l7126c30775
12665a74496A30838D1527A4313J42651R9143F7717R1639Q2968c3275j48525q618
12654a90418F2714a05473D5240K570J22159M2121f1199D43628e6834B16340l1976
$$ y = [-310617, -195444, -162171, 327934, 31938, 186515, -67169, 13733, 243070, 47670, 335705, -190289, -53844, 50272, -95847, 6009, -105104, 39981, 101389, 240479, 118433, -171153, -65203, 7971, 284997, -18629, 19133, 92232, 193827, 17874, 26645, -108532, 17071, 143273, 90864, -96887, 2651, 7039, 153451, 416, -233045, -362939, 69067, 82399, 28740, 155346, -240071, 295570, 204597, -134920, -161191, 42705, -92151, 47805, 80103, 211573, -30972, 20452, 93195, -222264, 58314, 53526, -50299, -176865, 91776, -85927, 194047, 156921, -330775, -174496, 130838, 41527, 14313, 156964, 256107, 67717, 159356, 242324, -33275, -181800, -190418, 62714, -105473, 45240, 47810, 169969, 212090, -61199, 443628, -56834, 216340, 184364]
12643A84364c921p1958B85963A3000N30217b9615E4879J90200p7189K3340c3463
12631B10597F9265a72266J892H7634b1505A67754I624J040L63343j22849B3541
12619A31033g9858E0433K2050K1810J54039d5627n2706C74660A74346l6821K47474
12608C84999e7095j66939h1110k2414C33471a1485I1387P3618M6646c9679B6306
12596H4769e52825a52046A27005a39278l9023k3388f7295p6660j14002A63946
12585A28977O9175F7820q65M24392B19013o4199j1582c5280j71992B375L4111
12574C6486P3413a44814H0561c2068A51657O5404J6183b2102n2164m7970A79288
12562f6346G3916b40226h0885h812j1532D14184G339L1888h9296P095A10351c16911
$$ y = [184364, -3921, -75879, 285963, 13000, 543217, -29615, 54879, 245079, 167890, 191230, -33463, 210597, 69265, -172266, -170374, 87634, -21505, 167754, 9624, 10664, 374007, 251158, 23541, 131033, -79858, 50433, 72483, 94293, 248332, -45627, -98333, 374660, 174346, 137525, 384999, -57095, -224034, -81110, -103524, 333471, -11485, 91387, 165005, 211651, -39679, 26306, 84769, -552825, -152046, 127005, -139278, -178301, -201689, -67295, -143955, -257957, 163946, 128977, 198152, 67820, 66955, 491347, 219013, 154814, 143232, -35280, -207272, 2375, 36486, 109899, -144814, 80561, -32068, 151657, 217061, 233244, -22102, -74266, -122236, 179288, -66346, 73916, -240226, -80885, -8812, -20344, 414184, 7339, 39227, -89296, -82201, 110351, -316911]
12549D3895a22423E3352a37895r8836I6309m2341Q9827b23450C9840F941J68706
12538A75647D0608J84211N96b58940M8759C70950a89258A0328a51913b0051B56388
12526B95078e5810o8289A79477e8356A38531N9458a06822A3399a63393D9760h0620
12514a51352A06943f0587I1204a74937R927b52j39524A22069L45464j12190a29108
12502C31037A46750O836b08594A35925K736B157K29589d5992j55942Q7059F0622
12490a74951B42199a19617o2544C11157G1186L397J2321j0956c6961A85985L1749
12479B17734a50203P1674A33393a61986c7107A27361n5486k4606A2062R6875d0518
12467B35659b94333C55605a15239A6333J81991h6635A59960c30116N1857E6902
$$ y = [43895, -122423, 53352, -137895, -236731, 96309, 53968, 143795, -223450, 39840, 6941, 175647, 40608, 224819, 225415, -258940, -210181, 370950, -189258, 10328, -151913, -20051, 256388, 295078, -55810, -124099, 179477, -58356, 138531, 197989, -106822, 13399, -163393, 49760, -80620, -151352, 106943, -60587, 91204, -174937, -165010, -252, -139776, 122069, 467533, 355343, -129108, 331037, 146750, 153586, -208594, 135925, 138661, 2157, 231746, -45992, -201934, -114875, 60622, -174951, 242199, -119617, -182161, 311157, 71186, 74583, 86904, 75948, -36961, 185985, 217734, -150203, -78529, 133393, -161986, -37107, 127361, 71875, 47269, 12062, 108937, -40518, 235659, -294333, 355605, -115239, 16333, 198324, -86635, 159960, -330116, -278259, 56902]
12456h8088j02254d7845j46684g2940D7079J58142G8843f0889A54925a5021A2463
12444D60540I9483Q1711l8983E281O8970B1832L53509d5253C24845B1498J58909
12433A80407H41b52484B43238a63602f7998A95577b03689b5907A81443b05748
12422d96053a32876j10593A32089J08460f0092K9544j68982P8873F608J31571
12412A38179L54557g9128j06333p7752H4118c0010B70482g853j38534B56938C1071
12400f2649p8923A2024L53910d62518G5514a94456n0212M7431h9915j64253B69847
12388I3703d9713C32347E404a11301A65883B3351R3999J42333c12732f1904A55655
12376E8298R876N2479h7225A02631c596k8612C90165i3662a8089D8937i5347l92757
$$ y = [-88088, -190342, -47845, -194529, -72940, 47079, 205221, 78843, -60889, 154925, -15021, 12463, 460540, 99483, 181194, 142211, 5281, 74251, 21832, 375341, -45253, 324845, 21498, 180407, 841, -252484, 243238, -163602, -67998, 195577, -203689, -25907, 181443, -205748, -496053, -132876, -243469, 132089, 240549, -60092, -30548, -199530, -120657, 6608, 138179, 492736, -79128, -185461, -263213, 84118, -30010, 270482, -7853, -146387, 256938, 31071, -62649, -141572, 12024, 365934, -462518, 75514, -194456, -244668, -197237, -89915, -254168, 269847, 93703, -49713, 332347, 5404, -111301, 165883, 23351, 117350, 259683, -312732, -61904, 155655, 58298, 68174, 120653, -87225, 102631, -3596, -32208, 390165, -93662, -18089, 48937, -95347, -488104]
12364d88104I3593a32543C44698A23430b18783A06460j2614K9963a01027c4226
12353A37232f8827H3467K02390b9881G9355j6086a8798B00750Q8490i8032I838
12341A94404m6299a7837k32100J01578M4056A9406b7802g136H1806K3243a66803
12329A87024a16459A13610a4763A64415J03810b80012A39083a02976D40339j23552
12319C16787g6301H2274d9179D56901k14441c7431D56284a35611A42015J31026
12309B73041b68242a19330B67300c4884a0600C75045j83685b0175C02290K7991
12299C30281j46856P0007a7093j3919C02459a04353D47073A6134b8597r8631A30996
12287a02692j17235A06079i2608B91927l2100m9515a41853B46601A09325L5946
$$ y = [-488104, 93593, -132543, 344698, 123430, -218783, 106460, 93846, 123809, -101027, -34226, 137232, -68827, 83467, 285857, -29881, 79355, 63269, -18798, 200750, 289240, -98032, 9838, 194404, 148105, -17837, -249937, -148359, -104303, 19406, -27802, -7136, 81806, 105049, -166803, 187024, -116459, 113610, -14763, 164415, 268225, -280012, 139083, -102976, 440339, 316787, -76301, 82274, -49179, 456901, 242460, -37431, 456284, -135611, 142015, 273041, -268242, -119330, 267300, -34884, -10600, 375045, 191360, -20175, 302290, 330281, 183425, 253432, -17093, -31012, 302459, -104353, 447073, 16134, -28597, -127228, 130996, -102692, -219927, 106079, -92608, 291927, 259827, 210312, -141853, 246601, 109325, 145271]
12277A45271m3512K39337Q3814A21460a03916A16819L0109a57222k2254q3956
12267b63432e2721I2612J74172a29115C52500n9693d4200A93891d2865B38155
12256A23422A1559b7028j84210A17091a55564I7217L4686a9902A96983m4892E3162
12244a06013C66974I8201k6868K08901e1126D88740j59353a93376C16691E6182
12233b2701A45489K32412A39587P9166O8903G1426a16312K7839B11362b42683
12222B3021J75776q8989Q8064d01A75201L08569g2793k10955a9432j52238f4406
12210F9293J69369J3351o5107q8699R7010L36824a4027D30M82853j53641A36034
12198F10206k3489A42803L25221j88336A13181E4250J80303J55577A28585R1550
$$ y = [145271, 101759, 341096, 424910, 121460, -103916, 116819, 146928, -157222, -179476, -263432, -52721, 92612, 266784, -129115, 352500, 292807, -44200, 193891, -42865, 238155, 123422, 11559, -27028, -211238, 117091, -155564, 97217, 131903, -19902, 196983, 152091, 53162, -106013, 366974, 98201, 71333, 280234, -51126, 488740, 329387, -193376, 316691, 56182, -22701, 145489, 377901, 139587, 218753, 287656, 71426, -116312, -88473, 211362, -242683, 23021, 198797, 109808, 197872, -401, 175201, 483770, -72793, -283748, -19432, -171670, -64406, 69293, 238662, 252013, 186906, 98207, 195217, 532041, -14027, 430, 483283, 329642, 136034, 610206, 586717, 142803, 468024, 279688, 113181, 54250, 234553, 390130, 128585, 220135]
12188B20135a06030c8271B73861l8187J36581k3559E0873M33099A41738n2499
12178H9239m0127a01614D3184J93276K19011A36075L16241e9339C96172A27926
12167a04828C71464A83860g5238C60175j07092A04190J8852M0952n0409M5886
12157A59471J90923A36690J80739j26187a35640B25257K6291A01014L09398j20547
12147B89865O6766j75187m9284N7719q7939g4355E4887J11627i3024e970j2567
12136a8537G5280j9726R4352J20393k6023A7062M9750K66900j08085i0718G8876
12124g4067B40356B8721J92694e2235B54672b75571A21811F0887K13079c5874
12113a345A0387J23826P9448n8035R1271A08707J06507K42416D0069A44Q0911
$$ y = [220135, -106030, -38271, 273861, 235674, 372255, 348696, 50873, 483972, 141738, 89239, 49112, -101614, 43184, 236460, 455471, 136075, 452316, -59339, 396172, 127926, -104828, 371464, 183860, -75238, 360175, 253083, 104190, 123042, 163994, 113585, 159471, 350394, 136690, 317429, 191242, -135640, 225257, 251548, 101014, 410412, 289865, 356631, 181444, 132160, 189879, 101940, -74355, 54887, 166514, -93024, -5970, -18537, 75280, 55554, 149906, 270299, 244276, 17062, 66812, 333712, 225627, -90718, 78876, -74067, 240356, 28721, 221415, -52235, 254672, -275571, 121811, 60887, 273966, -35874, -1345, 10387, 134213, 213661, 155626, 246897, 108707, 215214, 457630, 40069, 144, 81055]
12102H1055A1081a38160A04261J78395j30121F3432r855J77002A03538K70858
12092C74396j33063q9764P746R0157a06552A92246a7198k68851B00658J62620
12082C63278d8379j50324A65802L28377G0516l532E996L9209R922k1363L2043
12071F5807N0966c01919J46274I4498M4938A1191b0301A0192D06e0001l18115
12060c68116b7188k65085a4217k0278D17172c080m2883I4970a96033A70789h6533
12048b27494H8450N6023N7406H9871c8188P411E3977O6562E8814a30434j03248
12037b33682a0120A04400G472R2000b3390B54459A02421J02163c08174f186A2164
12025b97603a33863A2049C819J34961J16391b50502B771J575K42521c0345j2977
$$ y = [81055, 11081, -138160, 104261, 282656, 152535, 63432, 53577, 230579, 103538, 374396, 241333, 151569, 159315, 249472, -106552, 192246, -17198, -286049, 200658, 363278, -48379, -198703, 165802, 494179, 70516, 66984, 5996, 45205, 55127, 33764, 65807, 116773, -301919, -155645, 94498, 139436, 11191, -20301, 10192, 406, -50001, -368116, -27188, -292273, -14217, -34495, 417172, -3080, -45963, 94970, -196033, 170789, -86533, -227494, 88450, 144473, 201879, 89871, -38188, -30777, 53977, 120539, 58814, -130434, -233682, -10120, 104400, 7472, 99472, -23390, 254459, 102421, 204584, -308174, -6186, 12164, -297603, -133863, 12049, 3819, 138780, 255171, -250502, 2771, 4346, 246867, -30345, -43322]
12014d3322C6692b43764c3660j24767j9131A22982J62017k7049B9281Q6518n4033
12003F1766R6502g9733B38045m3084g2538B11939I3620K64180j44903O9304j31555
11992A50646b39282A31719b69796e8112B8656L1863K07085A15493b52034m8255
11982c00289a36007I9241e7741n0967c4772j38534C92089i1949D50785A15733
11971a84878A42337i0014r1491Q2990A2346e185I1403K9735a81055A04039J06199
11960B10238H6796h282I4702d7988A29830a03400A1533J55025j7018c65449B36810
11948h4764B58583C9564d52589E4694b54451d4000p8629M5086k64220a4738j19785
11937a34523c6817A88223a57062J6273f4994q5729B18303a16717G2750K42969
$$ y = [-43322, 36692, -243764, -33660, -158427, -177558, 122982, 284999, 257950, 29281, 115799, 61766, 158268, -79733, 238045, 194961, -72538, 211939, 93620, 357800, 212897, 282201, 150646, -239282, 131719, -269796, -58112, 28656, 60519, 267604, 115493, -252034, -300289, -136007, 99241, -57741, -108708, -34772, -173306, 392089, -91949, 450785, 115733, -184878, 142337, -90014, -181505, -98515, 12346, -5185, 91403, 121138, -181055, 104039, 210238, 86796, -8282, 94702, -47988, 129830, -103400, 11533, 166558, 149540, -365449, 236810, -84764, 258583, 39564, -452589, 54694, -254451, -44000, -122629, -77543, -341763, -14738, -134523, -36817, 188223, -157062, -140789, -64994, -150723, 218303, -116717, 72750, 315719]
11927C15719B4836C470J13213m2632a19621N3119m2534J1919b0268H367d2678
11915a8285l9532p4655j32058A6307i9370H5939j6326B1101b11965A32227K8038
11904A60265k8365e3008A78706d404j49337f1312b1285B07890p4359K5381B603
11892D7895B1898n848J32974e5707M835G0763B7496g894l15923A70298a39135
11880B2683K19595b36722e5359l25675J58516h4175A45023d88907C126J98421
11870B01547a60542l1526r3751E9464c85309a36424b275k94097j06183B3121r846
11859A3275a10051B96323D182J139a15549b6743J065A08648d7749p8431A17N8095
11847E8212O5161a0700A1134N9014a13218L444A32622e6623A2142c16812h070
$$ y = [315719, 24836, 3470, 116683, 74051, -119621, -66502, -109036, -97117, -20268, 8367, -42678, -18285, -57817, -132472, -264530, 16307, -99370, 85939, 69613, 21101, -211965, 132227, 160265, 131900, -53008, 178706, -4404, -153741, -61312, -21285, 207890, 133531, 158912, 2603, 47895, 21898, 16050, 149024, -55707, -50872, 70763, 27496, -7894, -323817, 170298, -139135, 22683, 242278, -236722, -55359, -381034, -222518, -84175, 145023, -488907, 3126, 201547, -160542, -192068, -285819, 59464, -385309, -136424, -2275, -296372, -402555, 23121, 13275, -110051, 296323, 4182, 5321, -115549, -26743, -25678, 108648, -47749, -126180, 117, 58212, 123373, -10700, 11134, 70148, -113218, -109774, 132622, -56623, 12142, -316812, -8070]
11835d3257j21551K2219C00002a80737P4594j79702h0865k28411J13589b5813
11824b03034f1889l194p7446C1476f2694k08871g0957L4819J06A29979i8644d948
11811f1247K1641B23034p8579K3599c5002J1083k99933N8895a20607j37065f1251
11799d89243e079j15940n3101A27516a47554A12910E787c53069a64550c5465k15722
11788b51187I885a80470A88410c9704A02025B8259J13665A1585N3288a00196B54340
11776B16139g625D2483j8963d0240A19324c83918B4146c72115g2992C57444G8296
11764a22272F2057A2019J89752a86168E2561a65038C35161a46197C27323a16585
11753A06123D3494j1489Q720J86492a30668A01778e32757a05592a9473j33776
$$ y = [-43257, -164808, -142589, 300002, -180737, -106143, -285845, -80865, -309276, -195687, -25813, -203034, -61889, -65083, -142529, 31476, -62694, -271565, -70957, -36138, -36032, 129979, -98644, -4948, -61247, -39606, 223034, 144455, 168054, -35002, -23919, -323852, -264957, -120607, -257672, -61251, -489243, -5079, -121019, -174120, 127516, -147554, 112910, 5787, -353069, -164550, -35465, -251187, 9885, -180470, 188410, -39704, 102025, 28259, 141924, 11585, 64873, -100196, 254340, 216139, -7625, 42483, 23520, -40240, 119324, -383918, 24146, -372115, -72992, 357444, 78296, -122272, 62057, 12019, 201771, -186168, 52561, -165038, 335161, -146197, 327323, -116585, 106123, 43494, 32005, 40725, 227217, -130668, 101778, -532757, -105592, -19473, -153249]
11743a53249N9241c2935j72444C31462N789A01105k4389E458O2593J08979c27541
11731A4823J450Q2715A8208a93527A06726g1863b8000n504B62136F5891M4930
11720A10821K28391a60065F1548a10922j68705A05727m0082Q9609R2625c24961
11709i7615p2348C98288f0624B66591e3877A64022a52407e0261o4741k46036A1624
11697C20101A18273a43130B6543a89518B16365i1793D5656b39559i62A74962a0908
11685h6113A5672b45725B27987D5703A7708f7895A91878o3434M5412b2893m0393
11674f3286G9333J03834C4789i0152A53645d0968j99347J01166A66647F4426b6781
11662H8494J01537M8573g3426r8101E7210B1327L14134b37124B26413A0211a9449
$$ y = [-153249, -94008, -32935, -205379, 331462, 337251, 101105, 76716, 5458, 68051, 177030, -327541, 14823, 16273, 98988, 18208, -193527, 106726, -71863, -28000, -33504, 262136, 65891, 110821, 339212, -160065, 61548, -110922, -279627, 105727, 65645, 155254, 247879, -324961, -97615, -169963, 398288, -60624, 266591, -53877, 164022, -152407, -50261, -115002, -361038, 11624, 320101, 118273, -143130, 26543, -189518, 216365, -91793, 45656, -239559, -962, 174962, -10908, -86113, 15672, -245725, 227987, 45703, 17708, -67895, 191878, 128444, 173856, -22893, -63286, 79333, 183167, 34789, -90152, 153645, -40968, -240315, -139149, 166647, 64426, -26781, 88494, 190031, 238604, -73426, -171527, 57210, 21327, 335461, -237124, 226413, 10211, -19449]
11650B88216b75784g716j85983B7166a12339N0432m4251r9023A63319F5400J20673
11639A86073h6093j09830N3542B57778A19687a93884b0715m346r5961E2994c71596
11627a85310A18122J7930h8926L9784j94183G2697g7357k87331J02439J01165
11617a61084E2859b98201A03477b10028o162A27736n2313b34983R9915D5436g7655
11605I1970J38659a20797B4682K53370d3369m7219G608b13025f5055j24861A79147
11593a80763B05881i7307K7422A80887a58104n4245E2037b05145A24076B3366
11582b7881j09851j66537a07314j61145i7339K383B39664e2485A08699i2454j68875
11571b61329l272B15039f877B05475A9484K23319H3952B8939J94655H1610i0887
$$ y = [288216, -275784, -7716, -193699, 27166, -112339, -61907, -106158, -205181, 163319, 65400, 186073, -86093, -195923, -142381, 257778, 119687, -193884, -20715, -25061, -121022, 52994, -371596, -185310, 118122, 136052, -88926, -49142, -243325, 72697, -77357, -364688, -262249, -161084, 52859, -298201, 103477, -210028, -216190, 127736, 75423, -234983, -135068, 45436, -77655, 91970, 230629, -120797, 24682, 278052, -43369, -90588, 7608, -213025, -65055, -189916, 179147, -180763, 205881, -97307, -69885, 180887, -158104, -212349, 52037, -205145, 124076, 23366, -27881, -137732, -304269, -107314, -268459, -97339, -94956, 239664, -52485, 108699, -92454, -261329, -264601, 215039, -6877, 205475, 19484, 242803, 83952, 28939, 223594, 81610, -90887]
11559b58699A8743J86073J01303d5675r7025D84511j89922a91584G7288J05571
11549A82859k0558a3889k20157A78943j8400i2345B93148A44565a43691b2064
11538B57600A13155f6358A93367b79298B18340N7391J64314j72052D8285J1708
11528E9993J63000e3431B89948q9994c4952D23605A42547c5452J1040B11293f8318
11516A1644Q0814J01090O4233q0809J26938C905b68541B0819K7345J23529a43620
11504A61219i5999A14a02734j08566O7768b6298n859A58137D705N955J92062a9829
11491C83917j84155o7553b4040j5254B18413a27482e8207A61446n8602J38005
11481B40849D6801c37956a30002B03688B2341N4350j8563f5459B58009A6804N08732
$$ y = [-258699, 18743, 204816, 306119, -45675, -142700, 484511, 294589, -191584, 77288, 182859, 162301, -13889, -234046, 178943, 160543, -92345, 293148, 144565, -143691, -22064, 257600, 113155, -66358, 193367, -279298, 218340, 275731, 440045, 267993, 48285, 59993, 222993, -53431, 289948, 199954, -34952, 423605, 142547, -35452, -24412, 211293, -68318, 11644, 92458, 193548, 257781, 176972, 303910, 3905, -268541, 20819, 48164, 171693, -143620, 161219, -95999, 114, -102734, -211300, -143532, -26298, -32157, 158137, 4705, 10660, 202722, -19829, 383917, 199762, 132209, -24040, -39294, 218413, -127482, -58207, 161446, 102844, 240849, 46801, -337956, -130002, 203688, 22341, 76691, 58128, -65459, 258009, 16804, 525536]
11470E25536B00015d309D29319a23831F5662J62744b3194F3592J23227a8093A87778
11458A65455Q9103k7765a22601C90094A07187A5899c7037B94220j35024R6581
11448B55777I7716B6601J40480a27553D47098A30261M47737H5917K9121e6116
11437A7032b0142A12165l8212e4890B31090G9552K28162G3926d5323C6820J64558
11426B01378I1469a19849C05344D2605i4753R810C8461L1106a59118B15800J52755
11415C68555a0043n1935A75771c5728r3865H6193B4393J22285D6588i7290j51316
11404b48606o337k2791A71264d2151a4858j1062q0560a6329A38043m0661h656
11392b24521O510M957A3928a51993k1158a2686C2404a46112O8718j3730B7108
$$ y = [525536, 200015, -4309, 429319, -123831, 65662, 228406, -23194, 63592, 186819, -18093, 187778, 165455, 254558, 226793, -122601, 390094, 107187, 15899, -37037, 294220, 159196, 255777, 97716, 26601, 167081, -127553, 447098, 130261, 577998, 85917, 115038, -56116, 17032, -20142, 112165, 73953, -54890, 231090, 79552, 307714, 73926, -45323, 36820, 201378, 91469, -119849, 305344, 42605, -94753, -84943, 38461, 69567, -159118, 215800, 368555, -10043, -61978, 175771, -35728, -129593, 86193, 24393, 146678, 46588, -97290, -248606, -254943, -277734, 171264, -42151, -14858, -25920, -106480, -16329, 138043, 97382, -8656, -224521, -218011, -213054, 13928, -151993, -173151, -12686, 32404, -146112, -77394, -91124, 27108]
11380c16202A56014l2595a80923A74965F0457J35292d8804j09062j20521B46800
11369c73669i9288j4441B484K9141g8248e427j08406F2828j3307Q2382a90523
11357D89666A82028D4127K73490c1119q0432B31752a50513A03563J52161G1317
11346A09094J73050c05868F3409a67889F1689b14135c4882j24768k2396L1681
11336a50365A51363Q3891k5610b97625D2532i5810k24574f2917j30009B26424
11325c32116I2625J82382c63770F3845k2416a7175B31727d02485a47305m6155
11315a93460c9705n5006d6943C2563a33958o2921R6524d2782A78321b09265O9711
11304a39554A9398G710i6048B61452G0609c5702A3312a38053j952M6351n9348
$$ y = [-316202, 156014, 123419, -180923, 174965, 60457, 195749, -48804, -157866, -278387, 246800, -373669, -99288, -113729, 2484, 31625, -78248, -5427, -113833, 62828, 49521, 131903, -190523, 489666, 182028, 44127, 317617, -31119, -111551, 231752, -150513, 103563, 255724, 71317, 109094, 282144, -305868, 63409, -167889, 61689, -214135, -34882, -159650, -182046, -150365, 151363, 235254, 209644, -297625, 42532, -95810, -320384, -62917, -192926, 226424, -332116, 92625, 275007, -363770, 63845, 41429, -17175, 231727, -402485, -147305, -193460, -39705, -94711, -46943, 32563, -133958, -196879, -100355, -42782, 178321, -209265, -139554, 19398, 7710, -96048, 261452, 70609, -35702, 13312, -138053, -140005, -93654, -153002]
11293a53002j6248D0940a4156B40317f7619A42651k4017a32533I4240b32756k4012
11282b56768m06901B55696h5500G2641a0640A38868c05765H2375C8070n480a00678
11270E0068a90112B5210K50505F5388a39993K3337d9298k23758B00209f9833j18905
11259a88738A85056a52275A37237o5747M2673b17230e5346E2678a10128C2297
11248b59911J4722j0288h8459j01695B45109O1536d0730D4098b24637N7077K9896
11237a37664e3518I2711Q1603A2665a34651a6787j98629K8848l1603A00412J241
11226A01653D0634J85916D3192P1887a95562B26429b34704F3664a86253A52757
11215A10365g1825m8642k1942C14091I6122l7037a97325A57544b22783g0319o9636
$$ y = [-153002, -169250, 40940, -14156, 240317, -67619, 142651, 118634, -132533, 94240, -232756, -256768, -663669, 255696, -85500, 72641, -10640, 138868, -305765, 82375, 38070, 32590, -100678, 50068, -190112, 25210, 275715, 65388, -139993, -116656, -49298, -273056, 200209, -69833, -188738, 185056, -152275, 137237, 71490, 114163, -217230, -55346, 52678, -110128, 32297, -259911, -245189, -255477, -88459, -190154, 245109, 306645, -40730, 44098, -224637, -167560, -137664, -53518, 92711, 174314, 12665, -134651, -16787, -215416, -186568, -218171, 100412, 101653, 40634, 226550, 43192, 115079, -195562, 226429, -234704, 63664, -186253, 152757, 110365, -71825, -120467, -142409, 314091, 96122, 59085, -197325, 157544, -222783, -70319, -139955]
11204a39955B15392f0612k32559B12626I4163g1013A86402a95207G5703b43916
11193a31492j06782e1509B45915c33984a44765B40778H6228b15213m1202J6055
11183b40360B14868b05754N5231d7970n5319e0647j96729Q2792B79944G7961J20058
11172A98019I5824b70373c522l04634E6088J01428k4584l9913b36777o2830C43953
11160b37844R0387D1909r482J6233B875b22398A11471K2633B1436c79698A44181
11148B06305a96751B68626C3684h5575G8214L1480e7844D7177K80739E8067a69430
11136E0651J3610L3727a1043A03868i3180j06216j07670a20581l91474K24833
11126b87222F3267K75257C0582L6991K86682A43065n6751a31048M0221c0919r4782
$$ y = [-139955, 215392, -60612, -293171, 212626, 94163, -71013, 186402, -195207, 75703, -243916, -131492, -238274, -51509, 245915, -333984, -144765, 240778, 86228, -215213, -256415, -240360, 214868, -205754, -150523, -47970, -103289, -50647, -247376, -164584, 279944, 77961, 198019, 95824, -270373, -3522, -308156, 56088, 157516, 132932, 93019, -236777, -299607, 343953, -237844, -147457, 41909, 32427, 48660, 2875, -222398, 111471, 134104, 21436, -379698, 144181, 206305, -196751, 268626, 33684, -85575, 78214, 109694, -57844, 47177, 327916, 58067, -169430, 50651, 64261, 97988, -11043, 103868, -93180, -199396, -307066, -120581, -512055, -287222, 63267, 338524, 30582, 67573, 354255, 143065, 86314, -131048, -90827, -30919, -125701]
11115a25701a3066b300H9359F611K79784f2020b3315j13426a1644F2186J29360
11104A91546R745B0328K7237A7489n86O7230f6966A15645J17581J60690j29383
11093B64533f1973C03193C128M29355a19458A70202L35914k46725E1125a65827
11082b6505j52231B834a1144H5710J85948P3446J15368p5948H8936K12815j07234
11071A94517q1534c2594B54185m0120L65325H1911K62081j31226a41005A80350
11060D11060g1066A43030L81380j20052o2335O3975p7508K27083k23180M4642
11050C77035j76179L97069j37313J00658J12444A95474K59478L17484j75949k5092
11040E71395J10166M15226E40744J31268m8199K55510j12886j8547J25788J23940
$$ y = [-125701, -13066, -2300, 89359, 6611, 286395, -62020, -23315, -136741, -11644, 62186, 191546, 201291, 20328, 47565, 17489, 16903, 84133, -66966, 115645, 233226, 393916, 264533, -61973, 303193, 3128, 432483, -119458, 170202, 506116, 259391, 51125, -165827, -26505, -178736, 2834, -11144, 85710, 271658, 345104, 460472, 384524, 88936, 301751, 194517, 112983, -32594, 254185, 214065, 579390, 81911, 343992, 212766, -141005, 180350, 411060, -71066, 143030, 524410, 404358, 342023, 405998, 328490, 555573, 332393, 377035, 200856, 597925, 460612, 561270, 673714, 195474, 454952, 772436, 596487, 571395, 681561, 1096787, 540744, 672012, 623813, 879323, 766437, 747890, 873678, 997618]
11030I97618O2638q1834j75606J93347j84592J22739j93702J83491j85115o5603
11020F73381K07542j54402J98458K81306n12826J63960j25798k6491K84781K648
11010I92559l47908O72909l88787L8166J13447n12406K22318L32248C78805O32890
11000A011695m10071N4671j02693j525J35957L8647Q2877L4205p1443j51423L9362
10989F60259l0590L65890l33104r2149Q6656J2377M9863M3625j41473k25590N15140
10978I10904l8536R20m21632L02103l2247L15910m12183L46868M4522j71592L83486
10967A228523k45315K54623q9326K29800m1501L08315J9205K9069j683K22616
10957A914326K06736L35046N2652L53978K3655J10660P0143P2755k28604m2206
$$ y = [997618, 1060256, 978422, 802816, 996163, 811571, 934310, 740608, 924099, 738984, 673381, 880923, 726521, 924979, 1206285, 693459, 857419, 731621, 705130, 989911, 992559, 644651, 1317560, 928773, 966939, 1080386, 567980, 790298, 1122546, 378805, 1011695, 601624, 656295, 553602, 552077, 688034, 726681, 809558, 843763, 772320, 620897, 660259, 629669, 995559, 662455, 570306, 656962, 669339, 719202, 762827, 621354, 395764, 910904, 872368, 873288, 451656, 753759, 721512, 1037422, 625239, 972107, 1016629, 845037, 1228523, 983208, 1237831, 1148505, 1378305, 1336804, 1645119, 1664324, 1693393, 1691710, 1914326, 2121062, 2456108, 2508760, 2862738, 2886393, 2997053, 3067196, 3139951, 2911347, 2869141]
10947B869141l56159j02736k79338q9334j63239k1171j86340k71406N18400m89570
10937A428248J20185J76014k36594l44950n0382n35745J34989J14646l17778K06742
10927F95375B03532J72033A62530R9529p6231C9187a92522E6836N5115a5608F8968
10915C7115l266R1169K4382J53608F6063a7012j43058A48736J60659h3228C35338
10903F1586f2081r4527F2575k5927a01995j16745N7856F6945h0848K3914k46996
10892c03930B1995a04213r8379A47131J31880f0986j93406D9587a0134k6619J5024
10881b1729n5434B05427C7520J30993G210a0514p5065E0367O0231J94456B4457
10869A28416L9246J95883A72860k1392n2050a73488h2746A82676a13401C54131
$$ y = [2869141, 2512982, 2410246, 2130908, 2041574, 1878335, 1857164, 1670824, 1399418, 1917818, 1428248, 1548433, 1724447, 1487853, 1142903, 1092521, 556776, 691765, 806411, 488633, 695375, 203532, 375565, 162530, 262059, 185828, 39187, -192522, 56836, 111951, -15608, 68968, 37115, 33849, 125018, 149400, 303008, 66063, -17012, -160070, 148736, 309395, -83228, 335338, 61586, -62081, -156608, 62575, 36648, -101995, -218740, -160884, 66945, -80848, -56934, -303930, 21995, -104213, -202592, 147131, 279011, -60986, -254392, 49587, -10134, -36753, -21729, -77163, 205427, 37520, 168513, 7210, -10514, -85579, 50367, 110598, 305054, 24457, 128416, 167662, 363545, 172860, 151468, 99418, -173488, -82746, 182676, -113401, 354131]
10858E11K12662I1919k4345a18026k82697E7087J19958b10236E5900b9836A09160
10846f0056G7686c24060k3790B38836l060E5374c93088M4464a08907j5034K663
10835a21278B61212g549A82046D1559a08523B29581a02863A20083k5201a00396
10824a57435O1031j95269i4031j03077b7989k24296H7201h8095j704J7312A01679
10812B05828d808l91364J97844P252D2972J06353p1728J42778d8155k9970G559
10800B71487c0313O421k08645J15147B7960b42504B39454b02278n8093G302h1958
10788A25409d9048B4837J25831E1239K70033a08580e3891H4564e3116r3624j80656
10777c27396o8754C7690c30353B98758F0946b85190q105H6845c78303A73393K03823
$$ y = [511, 213173, 91919, 67574, -118026, -400723, 57087, 177045, -210236, 55900, -29836, 109160, -60056, 77686, -324060, -347850, 238836, 235776, 55374, -393088, -348624, -108907, -123941, -121278, 261212, -7549, 182046, 41559, -108523, 229581, -102863, 120083, 94882, -100396, -157435, -96404, -291673, -94031, -197108, -27989, -252285, 87201, -88095, -89799, -72487, 101679, 205828, -4808, -396172, -198328, -191076, 42972, 149325, 77597, 220375, -48155, -78125, 7559, 271487, -30313, -23892, -232537, -117390, 27960, -242504, 239454, -202278, -260371, 7302, -81958, 125409, -49048, 24837, 150668, 51239, 321272, -108580, -53891, 84564, -53116, -146740, -327396, -396150, 37690, -330353, 298758, 60946, -285190, -293295, 86845, -378303, 173393, 377216]
10766C77216d1257A4196b9435a3051m22148B6381K45958b448A03529A8865J40941
10755A59806c13369J22265b7042k67823E5222B415a39071f6846k2643j2761i057
10743A8745C865J8627a09963j76239i8045o6581N2526p5044h1069A54223f5567
10731A11175a28357M3997A6497b8548A98500g0588C5987a39231A21261C6469h009
10719d98005e2379l21593J13867A3172b74423N9808i8385C2226J5334K37507g2778
10707C7067M48974a56481o8873a01175k68479i281m75865b3138k24170A24291
10696B12848h9785A2664a93794B38850j12114a17170A33390F2872J8238b9501
10685E9763c64663c6199r7275a2399j40736I4923a38128a8119D824a26429b4807
$$ y = [377216, -41257, 14196, -29435, -13051, -435199, 26381, 272339, -2448, 103529, 18865, 159806, -313369, -191104, -27042, -294865, 55222, 2415, -139071, -66846, -89489, -102250, -9057, 18745, 3865, 22492, -109963, -286202, -98045, -164626, -112100, -187144, -81069, 154223, -65567, 111175, -128357, -84360, 16497, -28548, 198500, -70588, 35987, -139231, 121261, 36469, -8009, -498005, -52379, -373972, -260105, 13172, -274423, -214615, -98385, 32226, 47560, 285067, -72778, 37067, 486041, -156481, -225354, -101175, -369654, -9281, -485146, -23138, -247308, 124291, 212848, -89785, 12664, -193794, 238850, 126736, -117170, 133390, 62872, 81110, -29501, 59763, -364663, -36199, -133474, -12399, -153135, 94923, -138128, -18119, 4824, -126429, -24807]
10673F4466c4973A70185a79572M7022A448d2382m9427C03383b58246a15612p3673
10662a89285j79444I8817c36028n5620A30680a23780E064a22106A13599g1463
10651A49589F830a11348d2304a2083B4513K50926B6517c28024L7362g2972l974
10640g6946K2146m139C45113I4956a40563N6790j23157h5837k5920F1333J78246
10629B39579a41126A9579a54028F3532a72334A26981E4564K42481j21563a38708
10618E1227B5450b82318N3450J6488n915g2973B68365I593J00432d15534P9076
10607c36458q133a43697N4148A06841i365p4892j71494a16865o8078j49701b8551
10595a11067B43557a02291r5531m7925j51418J20516a15168A9705J68800c3485
$$ y = [64466, -34973, 170185, -179572, -132550, 1448, -42382, -91809, 303383, -258246, -115612, -189285, -368729, 98817, -336028, -391648, 130680, -123780, 5064, -122106, 113599, -71463, 149589, 6830, -111348, -42304, -12083, 24513, 275439, 26517, -328024, -290662, -72972, -76946, -54800, -58939, 345113, 94956, -140563, -83773, -206930, -85837, -111757, 61333, 239579, -141126, 19579, -154028, 63532, -172334, 126981, 54564, 297045, 175482, -138708, 51227, 25450, -282318, -228868, -212380, -218295, -72973, 268365, 9593, 110025, -415534, -336458, -344591, -143697, -89549, 106841, -9365, -84257, -255751, -116865, -184943, -334644, -28551, -111067, 243557, -102291, -197822, -245747, -397165, -276649, -115168, 19705, 188505, -33485]
10584c35362L5210J13168I886e77B90176a15324n3534b2594A97836H4600J24480
10573B09080o2516J1987B1314j210N3377a57351o6441d2250I2614b14090K6062
10562a88028j91739a27622M2391K0916H851b32146A34064i3002M532l26852b0683
10550c45179a59161g5915a4293C04407C2320M899g8938A64760d27328A8165c00178
10538e1796B8271K01477c3008j69132Q3785l552m6858Q3879c9389J2048j33756
10527a61097A62471b31454c4570H7296b12595i7992A83709a45728n735m0634g9469
10515b0882k10224h3060B0270c01702A5126N4476b36794e4337C82529G8874A335
10503B8587g1729q3738l0784j59778J51201b1032M781l9934p3040A8030b8280
$$ y = [-335362, -300152, -186984, 9886, -577, 290176, -115324, -168858, -22594, 197836, 84600, 209080, 146564, 158551, 21314, 20104, 73481, -157351, -223792, -42250, 92614, -214090, -188028, -379767, -127622, -85231, -64315, 8851, -232146, 134064, -93002, -88470, -415322, -20683, -345179, -159161, -75915, -14293, 304407, 32320, 37219, -78938, 164760, -427328, 18165, -300178, -51796, 28271, 229748, -33008, -202140, -118355, -121907, -168765, -84886, -39389, -27341, -161097, 162471, -231454, -34570, 87296, -212595, -97992, 183709, -145728, -151463, -192097, -79469, -20882, -231106, -83060, 20270, -301702, 15126, 69602, -236794, -54337, 382529, 78874, 1335, 28587, -71729, -155467, -186251, -346029, -194828, -21032, -16251, -56185, -129225, 18030, -28280]
10491i6934B13494o3722c79418B13194r0291K6962G3195a66728c240l48999C14363
10479a16351A07738a1802I1741a85892n5966h6511B69485b29861B03823d4532
10468E9850P2965e222C26344o6689h0221A25981N5099B8711K14438j1746B0871
10456E1046O8952J64384c33791I2213D3506M0820R7354b08838J7919R219Q4795
10445i6905C25380G532f1569A73612a92891D13331D1812b07646d7617j15786q2908
10434b46311B3611b39360j44117A2181a95057A24384b18018C76767b16785C33472
10423b01077g1261A96460g3507A27251M1267h8923A25043E3619b84779c5556j34516
10412a70072a5462p6930K114r2478h6353A1980A064J1488J04158j5842K58513
$$ y = [-96934, 213494, 149772, -379418, 213194, 122903, 149865, 73195, -166728, -3240, -352239, 314363, -116351, 107738, -11802, 91741, -185892, -241858, -86511, 269485, -229861, 203823, -44532, 59850, 132815, -5222, 326344, 259655, -80221, 125981, 181080, 28711, 243149, 231403, 20871, 51046, 119998, 284382, -333791, 92213, 43506, 84326, 181680, -208838, -190919, -181700, -96905, 325380, 7532, -61569, 173612, -192891, 413331, 41812, -207646, -47617, -163403, -246311, 23611, -239360, -383477, 12181, -195057, 124384, -218018, 376767, -216785, 333472, -201077, -71261, 196460, -73507, 127251, 168518, -88923, 125043, 53619, -284779, -35556, -170072, -15462, -92392, -90278, -182756, -86353, 11980, 1064, 12552, 116710, 100868, 359381]
10401C59381B2417c9114l10962e3541B83612f3889j86375K5812B71788d7543m3334
10390i0877B6225D976a87905h9251J166j20068B5038d2246B86207l0842c12942
10378h0858k46609A82580R0246j0503g0279A25240L17964k01050J13905E4526
10367A16638J80680J67660G6126a76069B54989J53856m8933A31275L73644C701
10356F99379B0362M58395k4243j96315L509K10745k11949P1029o2075L07387p5261
10345E01584k36714M6470P6808o5680n6644K69822B21940K13307n9122K4379A72141
10333B21420L24387L3419Q6305B33949K6596K6140J9298q0897Q2715r1951H8724
10321C43951F5434K60442h7438C97553A34782J00514l2658a06222A24908E6546
$$ y = [359381, 22417, -39114, -350076, -53541, 283612, -63889, -250264, -224452, 271788, -47543, -90877, 26225, 4976, -187905, -89251, -88085, -208153, 25038, -42246, 286207, 255365, -312942, -80858, -327467, 182580, 272826, 262323, -70279, 125240, 443204, 242154, 356059, 54526, 116638, 297318, 464978, 76126, -176069, 254989, 408845, 359912, 131275, 504919, 3701, 699379, 20362, 478757, 454514, 258199, 261708, 472453, 260504, 331533, 269458, 576845, 501584, 264870, 311340, 388148, 322468, 265824, 535646, 221940, 435247, 376125, 400504, 172141, 221420, 545807, 579226, 665531, 233949, 260545, 286685, 305983, 225086, 307801, 215850, 88724, 343951, 65434, 325876, -87438, 397553, 134782, 235296, 202638, -106222, 124908, 56546]
10310A15659P2913J22711a0892C15449j23270J87105L5631D7378Q6576j73a53482
10298H0751a72632B67905a98973B46074a62183A46111b0702E2836B4923J13346
10288A38269j352N4676a51992B41608a88003P9488B21681G0247j4591M2544b80939
10276a12004A9824a59291M1176c1369j9303k29408J09153C926g6496n0784I2107
10264a20488c3134j4810k4221k15763A52373p0812c4536j08245B7457B820b30585
10252B91939A10104K6322c9098A94574a65358m9317H6411J06473A7769O3723h2085
10240g8705b1215n3165D80698j31809F131K45228j23693b992D8263B1220J14713
10229A35933a70224H7329O2539b10444B19195A3955b98539q669j08162e0772q5089
$$ y = [115659, 188572, 311283, -10892, 315449, 192179, 379284, 414915, 47378, 133954, 133781, -153482, 80751, -172632, 267905, -198973, 246074, -162183, 146111, -20702, 52836, 24923, 138269, 136917, 191593, -151992, 241608, -188003, -108515, 221681, 70247, 55656, 98200, -280939, -112004, 19824, -159291, -118115, -31369, -50672, -280080, -170927, 3926, -76496, -127280, 92107, -120488, -33134, -47944, -72165, -287928, 152373, 81561, -34536, -142781, 27457, 2820, -230585, 291939, 110104, 136426, -39098, 194574, -165358, -214675, 86411, 192884, 17769, 81492, -82085, -78705, -21215, -74380, 480698, 348889, 6131, 251359, 127666, -2992, 48263, 21220, 135933, -170224, 87329, 149868, -210444, 219195, 13955, -298539, -307208, -415370, -50772, -135861]
10218a35861l443a8043p3750j0114R807A31578c23853E2616k6012e6107A31375
10206a47469K5465A27601b06805d923I6811P0759B4994a86528C8592O1223b89962
10194E5647L77785A54491d9428k37591a11321B57585G1275a49699j68637B109
10183A8568J30519b71478A45225O2810a53154J8868d9559D569g4486q636A02962
10171i3663b0267j15946k9805j71166A35723j8513a71787P4614B5784a78366K4519
10160a53847p8259H2605g4984o5190j28546G8452J29810a19649B3269i1150m4098
10149a35248c8913k18545O9320J0625c4326A35826Q3625C878L4842a59103j3045
10138a72148N614I546Q486c19245A11120B800a55902A91628b26898j24075J58349
$$ y = [-135861, -139304, -18043, -91793, -101907, -92100, 131578, -323853, 52616, 26604, -56107, 131375, -147469, -122004, 127601, -206805, -4923, 96811, 167570, 24994, -186528, 38592, 99815, -289962, 55647, 433432, 154491, -49428, -287019, -111321, 257585, 71275, -149699, -318336, 2109, 18568, 149087, -271478, 145225, 208035, -153154, -134286, -49559, 4569, -74486, -83122, 102962, -93663, -20267, -136213, -166018, -337184, 135723, 117210, -171787, -97173, 25784, -178366, -153847, -232106, 82605, -74984, -140174, -268720, 78452, 208262, -119649, 23269, -91150, -135248, -38913, -257458, -188138, -177513, -34326, 135826, 219451, 3878, 38720, -159103, -172148, -166534, 9546, 18032, -319245, 111120, 2800, -155902, 191628, -226898, -350973, -192624]
10127a92624B36641e8373F6461c67658A24178L1800b74050G5202a71338M7130
10117a24208j49809a18345N030j07046i8383O947B63481d3349m55614h2219D6288
10105c2215l7815j82753J09119f9948A8345b56523C7598J1487h5818l4014N652
10094a14180A42866i8882j14688i9054I8097Q967N07c48166J04330B47247j16851
10083A30396b7781o6178k55853J15768H6042h3439B27079a63186N3741d6100A95125
10071d2350A52938c24980c2326p3768J5919A90299c7654B3164a29863F9082L28008
10060C97090b86661b9082F0410b66724A57317c00084g1142K5368j36253f7573
10049f1361m88680b58018A83491E9019a38156j20A82030c71041e9048A08704a63627
$$ y = [-192624, 236641, -58373, 66461, -367658, 124178, 155978, -274050, 75202, -171338, -124208, -274017, -118345, -113315, -220361, -98383, -91436, 263481, -43349, -498963, -82219, 46288, -32215, -70030, -252783, -143664, -69948, 18345, -256523, 37598, 49085, -85818, -119832, -114180, 142866, -98882, -213570, -99054, 98097, 107064, 107571, -348166, -243836, 247247, 130396, -27781, -93959, -349812, -234044, 86042, -83439, 227079, -163186, -109445, -46100, 195125, -42350, 152938, -324980, -32326, -106094, -90175, 190299, -37654, 23164, -129863, 69082, 397090, -286661, -29082, 60410, -266724, 157317, -300084, -71142, -45774, -182027, -67573, -61361, -550041, -258018, 183491, 59019, -138156, -138276, 182030, -371041, -59048, 108704, -163627]
10037B6461b75744H1258i9681B06791a98077a5389n6161E414J68632d1516B6534
10025b27372j86156a26346j25711N1002i3578A21688D6586J1306e4353E8233l695
10014E4538b70524a6575k3466p5443j16756I7557a36158R754C7499i7423l05353
10003d02776a03904A10122B2806e3336k82628J61445K7601d2265j05358J6374
9993a31249O652E3963d85552A96403a79989k2899A564b9319e872j15213A75183
9981A21640b58920J24582C0118J926H72P4842e7343C6387a31756A90098a37619
9969a51856d2722j9274j17863A25526g9407j5118c3262A38383J09405j86b6242
9957i1940L6040C6018a81665P4404I6974b9314a78C8730K90773O3125d28032K04812
$$ y = [26461, -275744, 81258, -99681, 206791, -198077, -15389, -71550, 5414, 174046, -41516, 26534, -227372, -413528, -126346, -252057, -201055, -93578, 121688, 46586, 57892, -54353, 58233, 54538, -270524, -16575, -40041, -115484, -232240, 97557, -136158, -126404, 37499, -97423, -402776, -103904, 110122, 22806, -53336, -335964, -174519, -146918, -42265, -147623, -131249, -124597, 53963, -485552, 196403, -179989, -202888, 1564, -29319, -5872, -121085, 175183, 121640, -258920, -134338, 30118, 32044, 872, 75714, -57343, 36387, -131756, 190098, -137619, -151856, -42722, -61996, -179859, 125526, -79407, -94525, -33262, 138383, 247788, 247602, -26242, -91940, -55900, 36018, -181665, -107261, 96974, -29314, -178, 38730, 329503, 392628, -428032, -223220]
9945b23220D40993a92285J5596B34414a58301H0841A769a31063D00860b4017j73967
9934a97984m2209j61284j1029b2431B00075f6489j3194a889k40458a6136j74591
9923a90727A04134b72862A02319m3205h2770o0521j43537R7023N885N1315j23699
9912b56304B7656N03560b21747j85503a88364B03331h0143j80764J19787b1536
9901B16516G2876C6404L7375J39551K11836h6158j0190B0112c42826A15943m4347
9890G1596B7806b76571A8080b17135H6470A2137N5521a29898l658n6287m8144
9879b37987A18R6501a41456k43867a26756A84342g5376l3660c9468j17335B55994
9867b549m00002a5961j83478j15409Q4565l9534c9260f085k26993D2125a45225
$$ y = [-223220, 440993, -192285, -176689, 234414, -158301, 80841, 1769, -131063, 400860, -24017, -197984, -240193, -401477, -412506, -22431, 200075, -66489, -79683, -1889, -242347, -16136, -190727, 104134, -272862, 102319, 59114, -82770, -143291, -286828, -189805, -183920, -132605, -256304, 27656, 531216, -221747, -407250, -188364, 203331, -80143, -260907, -141120, -21536, 216516, 72876, 36404, 73779, 213330, 425166, -86158, -96348, 20112, -342826, 115943, 71596, 27806, -276571, 18080, -217135, 86470, 12137, 67658, -129898, -133556, -189843, -237987, 118, 96619, -141456, -385323, -126756, 184342, -75376, -109036, -39468, -156803, 255994, -2549, -402551, -15961, -199439, -314848, -230283, -269817, -39260, -6085, -233078, 42125, -145225]
9855a09841L1215j673F0325b63603D4745b33355B7544a40190j10671B3344e8890
9843a46284j95447J8575b7656G0629c63393E3623b03983P4931B1549b19761d1
9831f1708m14440J07056d7340A2835c33618A55198d45267B19437b47069B0468
9820b32447d7072B7684K18619b0661l13765a3125j34808E9406a43014L0621m9287
9809a61680D7109a71552k77293D0231a90525f0843E036a35490o5248b7172j94059
9798b21231B33579k141a77232m1156A02854i7456c9778m7499A72450o3950k8986
9787G9514a95708k5398L5112M2312B2406a48931C8536b63678e0384j16720j16286
9776b83390e5671A39059L00485b16764j65779J35527i9091o9380I179b76981O3105
$$ y = [-109841, -78626, -80299, 60325, -263603, 44745, -233355, 27544, -140190, -250861, 23344, -58890, -146284, -341731, -323156, -27656, 70629, -363393, 53623, -203983, -129052, 21549, -219761, -41, -61708, -476148, -369092, -47340, 12835, -333618, 155198, -445267, 219437, -247069, 20468, -232447, -47072, 27684, 246303, -20661, -334426, -13125, -147933, 59406, -143014, -112393, -161680, 47109, -171552, -448845, 40231, -190525, -60843, 5036, -135490, -200738, -27172, -221231, 233579, 231438, -177232, -218388, 102854, -97456, -39778, -87277, 172450, 108500, 79514, -195708, -221106, -185994, -143682, 22406, -148931, 38536, -263678, -50384, -167104, -283390, -55671, 139059, 439544, -216764, -382543, -247016, -99091, -168471, 9179, -276981, -213876]
9765b13876A66281b65909N9821B35970C5052e1004j57685J6012j7371e4710B11352
9753a07960A19285g3941m2933K6226a8839I1290e4136B70666b37106j49945h9923
9741a18962k61102E7297L2371a47172b650A02550b59231A12469a22271k01500
9731c23771h0464B8034b05078c5389j06635c4433j31930r1295b1429G2094J33368
9720B05462O0991b83633k1452J23504j89280i5494j20573g6128b1444j85499M7525
9709a59418e4082q9401j64620c7935m301B5636a57497f6121k34312r9111a84128
9697b3767j89072F8257b00563B14629k5659a71620A31340N7145a09512m5040B78355
9685a63450j12471i2915l7626N4848D8938P1526N3142F4253J07184F6435a01022
$$ y = [-213876, 166281, -265909, -206088, 235970, 35052, -51004, -208689, -192677, -210048, -54710, 211352, -107960, 119285, -73941, -116874, -90648, -18839, 91290, -54136, 270666, -237106, -387051, -89923, -118962, -380064, 57297, 89668, -147172, -2650, 102550, -259231, 112469, -122271, -323771, -80464, 28034, -205078, -35389, -142024, -34433, -166363, -257658, -21429, 72094, 205462, 266453, -283633, -305085, -181581, -370861, -95494, -216067, -76128, -21444, -206943, -159418, -54082, -143483, -308103, -37935, -42236, 25636, -157497, -66121, -300433, -399544, -184128, -23767, -212839, 68257, -200563, 214629, 188970, -171620, 131340, 188485, -109512, -154552, 278355, -163450, -275921, -92915, -130541, -75693, 48938, 120464, 173606, 64253, 171437, 66435, -101022]
9673F204c7542B3157k482h2465E3282g9876D5565J836K79279i8097n6003a7341
9660b63290a01924K8771G4516A7482a45152A49863F3948j318a7966k5637C9796
9648G0299O1254a86253a3810k68103J06086b6286H5449c59219C4297P5414J12897
9637B22608A2498h132A86426B8863b61210i9277l61508i6453c6777j95471J12679
9626a19569K662j0418A83537r0476j1410K43733a02493B90257A2425b26159b0095
9614a84355B7751E785f7085j36340k5936J05218D89a73840A28175b93532B35373
9602a07518G5635O6947b18841k3092j91092b6732k149k53173m1647A52862b57265
9590i7898I4268a14677l00382a39681f4363G644a23755J3371C4720a59267I5488
$$ y = [6204, -37542, 23157, 20675, -82465, 53282, -79876, 45565, 47401, 326680, -98097, -154100, -17341, -263290, -101924, -73153, 74516, 17482, -145152, 149863, 63948, 62630, -17966, -43603, 39796, 70299, 131553, -186253, -13810, -281913, -175827, -26286, 85449, -359219, 34297, 109711, 222608, 12498, -8132, 186426, 28863, -261210, -99277, -460785, -96453, -36777, -232248, -119569, -116907, -127325, 183537, 93061, 81651, 325384, -102493, 290257, 12425, -226159, -20095, -184355, 27751, 5785, -67085, -203425, -229361, -124143, 489, -173840, 128175, -293532, 235373, -107518, 75635, 142582, -218841, -241933, -433025, -26732, -28881, -282054, -323701, 152862, -257265, -97898, 94268, -114677, -415059, -139681, -64363, 7644, -123755, -110384, 34720, -159267, 95488]
9578a58145A75199a84530B14907b5750I1265b86992i2131m8032j463A30979b05342
9566d207A46824b27817d1609C12511a1861l24716j9889c8044b559A70212a99178
9554c13563A11571a61566j0770G961a8090n5975n8518c3662k75700J14185B71557
9542a26696E7804b60783d9833o1782j7303f3401A08141k0513f5280B25115L3448
9531B58563a01926j00604A31663J62130f9068r4932m459r1122A36239Q566D4792
9519h2905A33888a80842b5316j77963a8185A33716m3018R6859A2429g21C03843
9507G9064e7077k84542F8667b10722e9810m41648d695e53m42149r5604A16530
9495E4302f2440B22362a21828d5793J9710H0546J18309a85703D70555c18911i1540
$$ y = [-158145, 175199, -184530, 214907, -25750, 91265, -286992, -92131, -140163, -141626, 130979, -205342, -4207, 146824, -227817, -41609, 312511, -11861, -336577, -356466, -38044, -2559, 170212, -199178, -313563, 111571, -161566, -172336, 7961, -18090, -74065, -132583, -33662, -309362, -195177, 271557, -126696, 57804, -260783, -49833, -111615, -128918, -63401, 108141, 87628, -65280, 225115, 258563, -101926, -202530, 131663, 293793, -69068, -164000, -168459, -259581, 136239, 144805, 44792, -82905, 133888, -180842, -25316, -203279, -18185, 133716, 90698, 187557, 12429, -721, 303843, 79064, -57077, -341619, 68667, -210722, -59810, -501458, -4695, -553, -442702, -538306, 116530, 54302, -62440, 222362, -121828, -45793, -26083, 80546, 198855, -185703, 470555, -318911, -91540]
9483b9585A58331E7875a53487B32407c3953F6046b8930p111A20143b16195a03777
9471a06610a7504j77712r8454J1996O3466L7724p9439d2913B7981b01907g8291
9459h8355A71199G5577d56279a50026m4568b8552Q248a908r3379j33836g6773
9447b27891J6388A36262d429l43968a67225B03381A8666g7364H2405j2994g4123
9435d45383a90223g5896k33119f1327j6769F612J12726b92833b6844j54817i0806
9423a14848A15990c69353A43841J9876a3064o3206a1471o000H3575a20860A2622
9411a1855E0829Q9817c34398C12484i8981n974N450j80923B7179f2517l0100H3138
9398e328A23981b95839A2211L2449a42211c2093l44598a78293j27072I0198h2945
$$ y = [-29585, 158331, 57875, -153487, 232407, -33953, 66046, -28930, -36041, 120143, -216195, -103777, -106610, -17504, -195216, -293670, -281674, -218208, -180484, -259923, -42913, 27981, -201907, -78291, -88355, 171199, 75577, -456279, -150026, -194594, -28552, -20304, -1908, -95287, -229123, -76773, -227891, -211503, 136262, -4429, -348397, -167225, 203381, 18666, -77364, 82405, 69411, -74123, -445383, -190223, -75896, -309015, -61327, -78096, 6612, 119338, -292833, -26844, -181661, -90806, -114848, 115990, -369353, 143841, 163717, -13064, -76270, -11471, -17471, 83575, -120860, 12622, -11855, 50829, 140646, -334398, 312484, -98981, -104955, -99505, -280428, 27179, -62517, -92617, 83138, -5328, 123981, -295839, 12211, 44660, -142211, -32093, -376691, -178293, -305365, 90198, -82945]
9386C59089a29400C5933a07984d0502I0314e5634B8915a25683c4905j40329r5052
9375b70286C3131h5619F9197C4511a98521j59959B8688J77606a62882L4482A00547
9363d9397E8407B6289b57096a05658k51757a25626D325K45092a31373b7226B17079
9351c46344A53672C6942j2122a13820N4707j15938j53435P5632B80597a48858
9340a48871B12123b12855F0133d37900A17257c55631F3400g873n482n6892F2605
9328A8623e8697C1222a53420j2352C51615b07224B09592a17147A10000L7963P8854
9317B26817A4805a53489P4838q8615G6090Q8919A9725a56043O0769A35785E6596
9305a39181E6446K40314a46298C27181a93499j20568Q231f5689j42871A52739
$$ y = [359089, -129400, 35933, -107984, -40502, 90314, -55634, 28915, -125683, -34905, -175234, -270286, 33131, -85619, 69197, 34511, -198521, -358480, 28688, 206294, -162882, -128400, 100547, -49397, 58407, 26289, -257096, -105658, -357415, -125626, 4325, 249417, -131373, -27226, 217079, -346344, 153672, 36942, 24820, -113820, -59113, -175051, -328486, -252854, 280597, -148858, -148871, 212123, -212855, 60133, -437900, 117257, -355631, 63400, -7873, -13355, -70247, 62605, 18623, -58697, 31222, -153420, -165772, 351615, -207224, 209592, -117147, 110000, 147963, 226817, 14805, -153489, -78651, -167266, 76090, 165009, 19725, -156043, -95274, 135785, 56596, -139181, 56446, 296760, -146298, 327181, -193499, -314067, -305836, -65689, -208560, 152739]
9294a21705A1764a97191o7542A21241b52558C52729d02911J17579a19808g872
9283I2629b80451h264J59k99084a40080B15533f6105c96o06q4268k27781b3560
9270i3221M4619l9572A06424J09725g7302r6066C03311e68967K31250a21732N3649
9259f8083C5715J62487K9714H1036a00844j01491B8298d2940A78991o333G3128
9247i3936A86351a29732N8746A58706a08798A47303B1191L8459a30789B09210
9236a11761j17569B96698h3528b2151l6433A37321a81923b7889j57132m6799i1097
9224G8594a00403F0236J32559K2536f1491j25378B00503r1054b58629J6667i6389
9212A3969b57756l4520h3110B52165D8470b41457A77083h6500j72415A61756b21572
$$ y = [-121705, 11764, -197191, -264733, 121241, -252558, 352729, -402911, -285332, -119808, -7872, 92629, -280451, -8264, -8105, -307189, -140080, 215533, -66105, -396, -1002, -85270, -313051, -23560, -93221, -48602, -88174, 106424, 216149, -77302, -173368, 303311, -568967, -337717, -121732, -68083, 35715, 198202, 227916, 81036, -100844, -202335, 28298, -42940, 178991, 172658, 73128, -93936, 186351, -129732, -70986, 158706, -108798, 147303, 21191, 59650, -130789, 209210, -111761, -229330, 296698, -83528, -22151, -58584, 137321, -181923, -27889, -185021, -231820, -91097, 78594, -100403, 60236, 192795, 215331, -61491, -186869, 200503, 109449, -258629, -241962, -96389, 13969, -257756, -292276, -83110, 252165, 48470, -241457, 177083, -86500, -258915, 161756, -221572]
9200a10582j28603C7176J994g2605n5616e1045r4637O2730m659k79703B87201
9188a59226N0805o2497L9795r0467c292C43006b2495D1962R8193b8630j83936
9177b12566j84129l505E7182Q7042c80771a12857f01A1928K08160L4761p8962
9166A75887H7641b51427O2989o9085a02296j85789a7984l44579D5783L56205d80219
9154a79653A31357C5595M3229a79549O8007r3945c5912m1832J3140j24832H0696
9142e4864j42631i5646M7549n6431m21193a94468A6986a58110F5525h0314C28338
9130a49427A60427d28691a58625b8894E0165L69076A45249c1116o8617m0654a7379
9118a79011G1274b9915j01846a1386m2528l23145J79238h3879k33232b5309j24019
$$ y = [-110582, -239185, 37176, 39170, -72605, -128221, -51045, -145682, -82952, -87611, -367314, 287201, -159226, -108421, -170918, -131123, -221590, -3292, 343006, -22495, 41962, 140155, -28630, -212566, -396695, -400200, 57182, 144224, -380771, -112857, -601, 11928, 220088, 254849, 175887, 87641, -251427, -188438, -257523, -102296, -288085, -17984, -362563, 45783, 401988, -480219, -179653, 131357, 35595, 78824, -179549, -111542, -205487, -35912, -77744, -64604, -189436, 80696, -54864, -197495, -95646, -48097, -104528, -525721, -194468, 16986, -158110, 65525, -80314, 328338, -149427, 160427, -428691, -158625, -28894, 50165, 419241, 145249, -31116, -99733, -140387, -17379, -179011, 71274, -29915, -131761, -11386, -53914, -377059, -197821, -83879, -317111, -25309, -149328]
9107a49328B44976l9253a56622K1344o209j28474h5955B83056c9382k7933b3045
9095c26784J19865e114C7094b35314J08250k25200J51340B37581B3804f2879J0393
9084e2486C32938j33750D7271K4532a41858q1992n5995M7944A49539E1553a3179
9072A86179b36204B02812a04224j6797c3373A3023a91968P9225A25505e5249m94890
9061e50139a5876p3586A86877F2025N1096a06343M2414G024b93285b6170A42646
9049c19099P4467J06639a5818j88088G1814h138A83166H6585c46411i2209D2435
9037A76352q1276b74654f7648p2385C3961J32757a20297l91123J94624F0150b16210
9025e7844m71704b22376r2966J06584c2079j10091j79435J02731r6521J29034
$$ y = [-149328, 244976, 205723, -156622, -135278, -141487, -269961, -85955, 283056, -39382, -67315, -23045, -326784, -206919, -5114, 37094, -235314, -127064, -352264, -200924, 237581, 23804, -62879, -52486, 332938, 199188, 47271, 71803, -141858, -223850, -279845, -231901, 149539, 51553, -13179, 186179, -236204, 202812, -104224, -121021, -33373, 13023, -191968, -112743, 125505, -55249, -550139, -15876, -89462, 186877, 62025, 113121, -106343, -63929, 7024, -293285, -26170, 142646, -319099, -244632, -137993, -15818, -203906, 71814, -8138, 183166, 86585, -346411, -92209, 42435, 176352, 95076, -274654, -67648, -140033, 33961, 166718, -120297, -511420, -316796, 60150, -216210, -57844, -529548, -222376, -315342, -208758, -32079, -142170, -321605, -218874, -315395, -186361]
9015a86361I9475b77447J03726M1435k5775C5748h8191j00106M2888B42652F7241
9003b20936o147C66882A05141J31354b61392C69964A25830a32680M896A54624
8992a8237C6320K10315a29945j38747g6976A01077o941D2170f0815j27818c4387
8980a05711b9948r5627M9840A92343I2751b39754f8730B71805b60874d2063m56727
8969d98790f1790a5559C1576Q2140E5469h168m16983a74005a183j41489j93392
8958c36064C28092b26810J10792E6638a40521r4771g4271A37541n0317J41514
8948B28738b64585h0763b4247k36712D37987b20838i3013n4202A65775b08179
8937a41183A7867J8585b09383E9949a73768D7429B264f02042a10870A22947E4236
$$ y = [-186361, 99475, -277447, -173721, -132286, -158061, 35748, -88191, -188297, -145409, 242652, 67241, -220936, -227083, 366882, 105141, 236495, -261392, 369964, 125830, -132680, -127784, 154624, -18237, 36320, 246635, -129945, -268692, -76976, 101077, 94136, 42170, -60815, -188633, -34387, -105711, -29948, -125575, -75735, 192343, 92751, -239754, -68730, 271805, -260874, -42063, -498790, -61790, -15559, 31576, 113716, 55469, -8168, -425151, -174005, -1183, -142672, -336064, 328092, -226810, -116018, 56638, -140521, -235292, -74271, 137541, 87224, 228738, -264585, -80763, -24247, -260959, 437987, -220838, -93013, -147215, 165775, -208179, -141183, 17867, 36452, -209383, 59949, -173768, 47429, 2264, -602042, -110870, 122947, 54236]
8925e1256A53546a13149B9678b78208B3082F556a24251B73556J06178J68001A48846
8913A7042O5136K27763H2178k5743N78895J52144N07046N94010J920986L324207
8903G133723J151084D101845A808369p49132k26076B87687L99482l06095E9582
8893C36605h1214A54896N6493L68054A71654D6470L11482c5672A0615L1929j3672
8882B8872b6752j3738B77001b72661L2156H4108J4804P6346i7880o1846P5719
8871h4007A15475c8182r0987A52178c1017A95246d4539k02225g715p0673j08606
8860a86994k70465a8532p0513D1273b86594c9194j09627l48207a38454j3821m7246
$$ y = [-51256, 153546, -113149, 29678, -278208, 23082, 6556, -124251, 273556, 379734, 547735, 148846, 17042, 82178, 309941, 82178, 56435, 635330, 787474, 1294520, 1888530, 3809516, 7133723, 8284807, 4101845, 1808369, 1059237, 833161, 287687, 687169, 381074, 59582, 336605, -81214, 154896, 211389, 579443, 171654, 46470, 357952, -35672, 10615, 42544, 28872, -26752, -40490, 277001, -272661, -240505, 84108, 98912, 175258, -97880, -159726, -84007, 115475, -38182, -129169, 152178, -31017, 195246, -44539, -246764, -7715, -78388, -186994, -457459, -18532, -89045, 41273, -286594, -39194, -148821, -497028, -138454, -152275, -199521]
$$ [...]
##END NTUPLES=NMR SPECTRUM
##END=
