
##TITLE=AC1083__5836542_VRjT2nScWd
##JCAMPDX= 6.0         $$ Bruker NMR JCAMP-DX V2.0
##DATA TYPE= NMR SPECTRUM
##DATA CLASS= NTUPLES
##ORIGIN= BRUKER
##OWNER= Administrator
$$ 1.72 TOPSPIN		Version 2.1
$$ 2012-03-26 20:36:13.187 -0500  Administrator@TOPSPIN
$$ Compression mode = diff/dup
##.OBSERVE FREQUENCY= 400.13188235
##.OBSERVE NUCLEUS= ^1H
##.ACQUISITION MODE= SIMULTANEOUS (DQD)
##.ACQUISITION SCHEME= undefined
##.AVERAGES= 64
##.DIGITISER RES= 22
##SPECTROMETER/DATA SYSTEM= spect
##.PULSE SEQUENCE= noesygpps1d.comp
##.SOLVENT NAME= COFFEE_meoh
##.SHIFT REFERENCE= INTERNAL, COFFEE_meoh, 1, 14.96809
##AUDIT TRAIL= $$ (NUMBER, WHEN, WHO, WHERE, PROCESS, VERSION, WHAT)
$$ ##TITLE= Audit trail, TOPSPIN		Version 2.1
$$ ##JCAMPDX= 5.01
$$ ##ORIGIN= Bruker BioSpin GmbH
$$ ##OWNER= Administrator
$$ $$ C:\Bruker\TOPSPIN/data/COFFEE/nmr/AC1083__5836542_VRjT2nScWd/12/pdata/1/auditp.txt
$$ ##AUDIT TRAIL=  $$ (NUMBER, WHEN, WHO, WHERE, PROCESS, VERSION, WHAT)
(   1,<2012-03-26 20:36:08.421 -0500>,<Administrator>,<TOPSPIN>,<go>,<TOPSPIN 2.1>,
      <created by zg
	started at 2012-03-26 20:24:36.750 -0500,
	POWCHK enabled, PULCHK disabled,
       configuration hash MD5:
       1A 1E CE 29 27 FD 77 03 67 4E F0 E3 C4 B2 CB 90
       data hash MD5: 64K
       3A 45 9E F1 B1 34 82 D2 C6 D8 BD 88 BB DD 06 8F>)
(   2,<2012-03-26 20:36:11.296 -0500>,<Administrator>,<TOPSPIN>,<proc1d>,<TOPSPIN 2.1>,
      <Start of raw data processing
       efp LB = 0.3 FT_mod = 6 PKNL = 1 PHC0 = 0 PHC1 = 0 SI = 128K 
       data hash MD5: 128K
       79 96 E3 5D 3B CF DD CF 0A 59 0C 81 60 E9 C8 34>)
(   3,<2012-03-26 20:36:12.437 -0500>,<Administrator>,<TOPSPIN>,<proc1d>,<TOPSPIN 2.1>,
      <pk PHC0 = 30.89355 PHC1 = 0 
       data hash MD5: 128K
       A3 A4 4D F5 40 51 BA AD F6 C6 DF 9B B5 61 4F A8>)
(   4,<2012-03-26 20:36:12.671 -0500>,<Administrator>,<TOPSPIN>,<proc1d>,<TOPSPIN 2.1>,
      <abs ABSG = 1 
       data hash MD5: 128K
       5E CA B4 9F 3A 77 AA CA FE A7 6E 76 D4 75 FA FD>)
(   5,<2012-03-26 20:36:12.734 -0500>,<Administrator>,<TOPSPIN>,<proc1d>,<TOPSPIN 2.1>,
      <abs ABSG = 2 
       data hash MD5: 128K
       78 D8 DA EA E3 DC B3 6F 1F C5 09 E3 EA F1 A1 04>)
(   6,<2012-03-26 20:36:12.937 -0500>,<Administrator>,<TOPSPIN>,<proc1d>,<TOPSPIN 2.1>,
      <abs ABSG = 3 
       data hash MD5: 128K
       90 8D 63 88 D6 7E 6F 24 86 CE AF 00 C8 D1 E2 DB>)
(   7,<2012-03-26 20:36:13.031 -0500>,<Administrator>,<TOPSPIN>,<proc1d>,<TOPSPIN 2.1>,
      <abs ABSG = 4 
       data hash MD5: 128K
       C0 67 27 80 22 7F 9E D5 19 B4 BE DE 6A 7D E1 59>)
(   8,<2012-03-26 20:36:13.078 -0500>,<Administrator>,<TOPSPIN>,<proc1d>,<TOPSPIN 2.1>,
      <abs ABSG = 5 
       data hash MD5: 128K
       A6 1F B0 D4 AE F6 57 76 F2 2B 19 4F 51 4E F3 73>)
$$ ##END=
$$ 
$$ $$ hash MD5
$$ $$ A9 A2 9B 21 F9 66 62 AA 29 40 5D F1 F9 D4 F2 7B
##$RELAX= 
##$RELAX= 
##$RELAX= 
##$RELAX= 
##$RELAX= 
##$RELAX= 
##$RELAX= 
##$RELAX= 
$$ Bruker specific parameters
$$ [...]
##$TP07= 0
##$TPNAME0= <>
##$TPNAME1= <>
##$TPNAME2= <>
##$TPNAME3= <>
##$TPNAME4= <>
##$TPNAME5= <>
##$TPNAME6= <>
##$TPNAME7= <>
##$TPOAL= (0..7)
0.5 0.5 0.5 0.5 0.5 0.5 0.5 0.5
##$TPOFFS= (0..7)
0 0 0 0 0 0 0 0
##$TUNHIN= 0
##$TUNHOUT= 0
##$TUNXOUT= 0
##$USERA1= <user>
##$USERA2= <user>
##$USERA3= <user>
##$USERA4= <user>
##$USERA5= <user>
##$V9= 5
##$VALIST= <valist>
##$VCLIST= <CCCCCCCCCCCCCCC>
##$VD= 0
##$VDLIST= <DDDDDDDDDDDDDDD>
##$VPLIST= <PPPPPPPPPPPPPPP>
##$VTLIST= <TTTTTTTTTTTTTTT>
##$WBST= 1024
##$WBSW= 4
##$XGAIN= (0..3)
0 0 0 0
##$XL= 0
##$YL= 0
##$YMAX_a= 14971887
##$YMIN_a= -6524020
##$ZGOPTNS= <>
##$ZL1= 120
##$ZL2= 120
##$ZL3= 120
##$ZL4= 120
##$ABSF1= 14.96809
##$ABSF2= -5.58444
##$ABSG= 5
##$ABSL= 3
##$ALPHA= 0
##$AQORDER= 0
##$ASSFAC= 0
##$ASSFACI= 0
##$ASSFACX= 0
##$ASSWID= 0
##$AUNMP= <proc_prof1d_extract.lims>
##$AXLEFT= 0
##$AXNAME= <>
##$AXNUC= <1H>
##$AXRIGHT= 0
##$AXTYPE= 0
##$AXUNIT= <>
##$AZFE= 0.1
##$AZFW= 0.1
##$BCFW= 0
##$BC_mod= 0
##$BYTORDP= 0
##$COROFFS= 0
##$CY= 15
##$DATMOD= 1
##$DC= 0
##$DFILT= <>
##$DTYPP= 0
##$F1P= 0
##$F2P= 0
##$FCOR= 0.5
##$FTSIZE= 131072
##$FT_mod= 6
##$GAMMA= 0
##$GB= 0
##$INTBC= 1
##$INTSCL= 1
##$ISEN= 128
##$LB= 0.3
##$LEV0= 0
##$LPBIN= 0
##$MAXI= 10000
##$MC2= 0
##$MEAN= 0
##$ME_mod= 0
##$MI= 0
##$NCOEF= 0
##$NC_proc= -3
##$NLEV= 6
##$NOISF1= 0
##$NOISF2= 0
##$NSP= 0
##$NTH_PI= 0
##$NZP= 0
##$OFFSET= 14.96809
##$PC= 1
##$PHC0= 30.89355
##$PHC1= 0
##$PH_mod= 1
##$PKNL= yes
##$PPARMOD= 0
##$PPDIAG= 0
##$PPIPTYP= 0
##$PPMPNUM= 2147483647
##$PPRESOL= 1
##$PSCAL= 4
##$PSIGN= 0
##$PYNMP= <proc.py>
##$REVERSE= no
##$SF= 400.130005012106
##$SI= 131072
##$SIGF1= 0
##$SIGF2= 0
##$SINO= 400
##$SIOLD= 131072
##$SPECTYP= <>
##$SREGLST= <1H.CDCl3>
##$SSB= 0
##$STSI= 131072
##$STSR= 0
##$SW_p= 8223.68421052632
##$SYMM= 0
##$S_DEV= 0
##$TDeff= 65536
##$TDoff= 0
##$TI= <>
##$TILT= no
##$TM1= 0
##$TM2= 0
##$TOPLEV= 0
##$USERP1= <user>
##$USERP2= <user>
##$USERP3= <user>
##$USERP4= <user>
##$USERP5= <user>
##$WDW= 1
##$XDIM= 131072
##$YMAX_p= 470947671
##$YMIN_p= -161644422
##$CURPLOT= <Network HP LaserJet P1505>
##$CURPRIN= <$Network HP LaserJet P1505>
##$DFORMAT= <normdp>
##$LAYOUT= <+/1D_H.xwp>
##$LFORMAT= <normlp>
##$PFORMAT= <normpl>
##$SURQMSG= 1
$$ End of Bruker specific parameters
$$ ---------------------------------
##NTUPLES= NMR SPECTRUM
##VAR_NAME=  FREQUENCY,     SPECTRUM/REAL,   SPECTRUM/IMAG
##SYMBOL=    X,             R,               I
##VAR_TYPE=  INDEPENDENT,   DEPENDENT,       DEPENDENT
##VAR_FORM=  AFFN,          ASDF,            ASDF
##VAR_DIM=   131072,        131072,          131072
##UNITS=     HZ,            ARBITRARY UNITS, ARBITRARY UNITS
##FACTOR=    0.0627417313425165, 1,          1
##FIRST=     8223.62146879498, 4544,         -120855
##LAST=      0,             7072,            -120991
##MIN=       0,             -161644422,      0
##MAX=       8223.62146879498, 470947671,    0
$$ Real data points
##PAGE= N=1
##DATA TABLE= (X++(R..R)), XYDATA
$$ [...]
60768A214471j3878j4000j4108j4789j5322j4583j2565j0715j0318j0882j0807
60757A072504r600q508q562q910p911n423k921j478o80K82J383K079K173J796
60743A026224J096L98K51Q59J850K989M588O650Q192Q204P068O281O837Q489J0521
60728A100497J2597J4709J6703J8085J8282J7283J6023J5647J6112J6141J4979
60717A277058J3548J3235J4076J4922J4905J3918J1966R166O218L998K650J619
60705A397279M86r08k810n216p447q798r334r297q397o698n596o387q265r315
60691A309297r192r100r208q336o517n673o672p700o874m953m008m638n916p046
60677A213464p644p326o350n843o074n463k872J34J140L66K28J792L848N461P116
$$ y = [1214471, 1200593, 1186593, 1172485, 1157696, 1142374, 1127791, 1115226, 1104511, 1094193, 1083311, 1072504, 1062904, 1054396, 1045834, 1036924, 1029013, 1023590, 1020669, 1019191, 1018511, 1018793, 1020176, 1022255, 1024428, 1026224, 1027320, 1027718, 1027969, 1028828, 1030678, 1033667, 1038255, 1044905, 1053097, 1061301, 1068369, 1074650, 1081487, 1089976, 1100497, 1113094, 1127803, 1144506, 1162591, 1180873, 1198156, 1214179, 1229826, 1245938, 1262079, 1277058, 1290606, 1303841, 1317917, 1332839, 1347744, 1361662, 1373628, 1382794, 1389012, 1393010, 1395660, 1397279, 1397765, 1396857, 1394047, 1388831, 1381384, 1372586, 1363252, 1353955, 1345558, 1338860, 1333264, 1326877, 1318612, 1309297, 1300105, 1291005, 1281797, 1273461, 1266944, 1261271, 1254599, 1246899, 1240025, 1235072, 1231064, 1226426, 1220510, 1213464, 1205820, 1198494, 1192144, 1186301, 1180227, 1174764, 1171892, 1172026, 1173166, 1173532, 1173760, 1175552, 1179400, 1184861, 1191977]
60662A191977Q834R240P681N598M645M675M748M870N389N448L720M05k784m684
60648A249762n657o554p641q778r906j1035j2232j3730j5603j7279j7935j7479
60636A105933j6670j6055j5396j4402j3468j3140j3212j2898j1807j0387r282
60625I59216q632q019p019n859n434o357p858q115o151l057p85j13l44o50o46
60610H90177J43K053M177M766L524K552L926O941Q913Q473O856O020O513P590
60596I62624Q612R694J1217J3154J4987J6271J7136J7992J8740J8860J8384J8007
60584A145678J7808J6742J4195J1263R467Q738P903O782O402P201Q313Q862Q747
60571A278101Q033O710N383M929N113M637L023J319M00k15j143j897j810j331
$$ y = [1191977, 1200811, 1210051, 1217732, 1223330, 1227975, 1232650, 1237398, 1242268, 1247657, 1253105, 1256825, 1257230, 1254446, 1249762, 1244105, 1237551, 1229910, 1221132, 1211226, 1200191, 1187959, 1174229, 1158626, 1141347, 1123412, 1105933, 1089263, 1073208, 1057812, 1043410, 1029942, 1016802, 1003590, 990692, 978885, 968498, 959216, 950584, 942565, 935546, 929687, 924253, 917896, 910038, 901923, 895772, 892715, 891930, 891817, 891473, 890823, 890177, 890320, 892373, 896550, 901316, 904840, 907392, 911318, 918259, 927172, 935645, 942501, 948521, 955034, 962624, 971236, 980930, 992147, 1005301, 1020288, 1036559, 1053695, 1071687, 1090427, 1109287, 1127671, 1145678, 1163486, 1180228, 1194423, 1205686, 1215153, 1223891, 1231794, 1238576, 1244978, 1252179, 1260492, 1269354, 1278101, 1286134, 1292844, 1298227, 1303156, 1308269, 1312906, 1315929, 1317248, 1317648, 1317433, 1316290, 1314393, 1312583, 1311252]
60557A311252j386k067k851l509l917l621k522j522j575k448l143l201k781j940
60543A274769o84N12R66L46j483m494p769r605r372q595r008j0053r699p345m389
60528A194097j992R7K228L830M420M579N149O231P434Q492R141R016Q207P407
60514A268336P063O853O403O002O089O459O429N659M435L327K767K818L080K997
60500A338717K224O98j409l550m910n187m964m764m163k712j295j237k073j820
60486A303555K08K355L228L763N393P498Q489Q804J0815J5626K1608K6578L0100
60473A448020L3025L5918L8924M2422M6624N0552N2209N0104M4435L6602K7745
60462A906580J7982P149l901j3315j9719k3296k4975k5066k3407k0429j7165j4151
$$ y = [1311252, 1309866, 1307799, 1304948, 1301439, 1297522, 1293901, 1291379, 1289857, 1288282, 1285834, 1282691, 1279490, 1276709, 1274769, 1274085, 1274597, 1275563, 1275909, 1274426, 1269932, 1262163, 1252558, 1243186, 1234591, 1225583, 1215530, 1205831, 1198486, 1194097, 1192105, 1192202, 1194430, 1198260, 1202680, 1207259, 1212408, 1218639, 1226073, 1234565, 1243706, 1252722, 1260929, 1268336, 1275399, 1282252, 1288655, 1294657, 1300746, 1307205, 1313634, 1319293, 1323728, 1327055, 1329822, 1332640, 1335720, 1338717, 1340941, 1341639, 1340230, 1336680, 1331770, 1326583, 1321619, 1316855, 1312692, 1309980, 1308685, 1307448, 1305375, 1303555, 1303763, 1306118, 1309346, 1313109, 1318502, 1326000, 1334489, 1343293, 1354108, 1369734, 1391342, 1417920, 1448020, 1481045, 1516963, 1555887, 1598309, 1644933, 1695485, 1747694, 1797798, 1842233, 1878835, 1906580, 1924562, 1931711, 1927810, 1914495, 1894776, 1871480, 1846505, 1821439, 1798032, 1777603, 1760438, 1746287]
60450A746287j1245q585o685n282l140L02M013O963R771J3677J8446K2679K6129
60437A813330L0322L6505M4021N1178N6902O1124O4326O7272P0403P2871P2816
60426B441070O9541O4949O1961O1812O3764O7185P2762Q1551R3925J09889J29554
60415C317963J52634J78021K04560K31954K60426K89744L18962L46673L70632
60406E671569L86980L90469L75986L40268K82799K05855J13956J3087q9714j86469
60396G504786k69196l32218l74158l97300m04847l99152l82650l59250l33474
60387D252541l08028k82870k56993k30679k05650j83321j63539j45299j28357
60378B347805j13672j02051r2861q4538p6254o8413o1315n4241m6651l9761l5611
$$ y = [1746287, 1735042, 1726457, 1719772, 1714490, 1711350, 1711652, 1715665, 1722628, 1732399, 1746076, 1764522, 1787201, 1813330, 1843652, 1880157, 1924178, 1975356, 2032258, 2093382, 2157708, 2224980, 2295383, 2368254, 2441070, 2510611, 2575560, 2637521, 2699333, 2763097, 2830282, 2903044, 2984595, 3078520, 3188409, 3317963, 3470597, 3648618, 3853178, 4085132, 4345558, 4635302, 4954264, 5300937, 5671569, 6058549, 6449018, 6825004, 7165272, 7448071, 7653926, 7767882, 7780969, 7691255, 7504786, 7235590, 6903372, 6529214, 6131914, 5727067, 5327915, 4945265, 4586015, 4252541, 3944513, 3661643, 3404650, 3173971, 2968321, 2785000, 2621461, 2476162, 2347805, 2234133, 2132082, 2039221, 1954683, 1878429, 1810016, 1748701, 1694460, 1647809, 1608048, 1572437]
60367A572437l4387l3873l2109k9617k8089k7629k6717k4728k2959k2622k2881
60356A266826k1933j9381j6545j4504j2825j0569p954o393o902q769j0076r393
60344A121582o949m130k185j456j459j336m72Q78J706J519J191J908L420M321
60330A118538M107L816M268M905N117N496O599P423O540M319K455J561O74q42
60316A174976k423l598m669n524n194l441j717j543k658l646l792l395k789k023
60302A128564j204l79P12K079L043L050K641K856L910N182O235P038P405P152
60288A178284O875P572R254J0702J0981J0521J0376J0954J1824J2309J1873J0371
60276A301896Q328O727O129O213O411O675P314Q266R062R350R207Q916Q642Q234
$$ y = [1572437, 1538050, 1504177, 1472068, 1442451, 1414362, 1386733, 1360016, 1335288, 1312329, 1289707, 1266826, 1244893, 1225512, 1208967, 1194463, 1181638, 1171069, 1163115, 1156722, 1149820, 1141051, 1130975, 1121582, 1114633, 1110503, 1108318, 1106862, 1105403, 1104067, 1103595, 1104473, 1106179, 1107698, 1108889, 1110797, 1114217, 1118538, 1122645, 1126461, 1130729, 1135634, 1140751, 1146247, 1152846, 1160269, 1166809, 1171128, 1173583, 1175144, 1175818, 1174976, 1172553, 1168955, 1164286, 1158762, 1153568, 1150127, 1148410, 1146867, 1144209, 1140563, 1136771, 1133376, 1130587, 1128564, 1127360, 1126981, 1127693, 1129772, 1132815, 1135865, 1138506, 1141362, 1145272, 1150454, 1156689, 1163727, 1171132, 1178284, 1185159, 1192731, 1201985, 1212687, 1223668, 1234189, 1244565, 1255519, 1267343, 1279652, 1291525, 1301896, 1310224, 1316951, 1323080, 1329293, 1335704, 1342379, 1349693, 1357959, 1367021, 1376371, 1385578, 1394494, 1403136, 1411370]
60262A411370P198N017J815j499m001n679p253r065j0574j1112j0819j0425j0284
60249A344689j0060r423q691q451q823r358r540r022p549n291l278k824m052n484
60235A242843n602m490l302k533j695o29r3n98j509j839j417o56K84J464K684
60220A222912L778N134P087Q921R509R003Q970J0549J3312J6243J8820K0518K0328
60207A375084J7988J5236J4459J6060J8239J9490K0253K1592K3279K4014K3234
60196A588928K1976K1992K4302K8422L2728L5771L7552L9351M2305M6433N1141
60185A970901N6132O1453O7084P2957P9160Q5759R2651R9878J07735J16173J24525
60174B934408J32345J40053J47913J54603J57967J57394J54603J51375J47304
$$ y = [1411370, 1418568, 1423585, 1425400, 1423901, 1419900, 1414221, 1406968, 1397903, 1387329, 1376217, 1365398, 1354973, 1344689, 1334629, 1325206, 1316515, 1308064, 1299241, 1289883, 1280343, 1271321, 1263772, 1258481, 1255203, 1252379, 1248327, 1242843, 1237241, 1232751, 1229449, 1226916, 1225221, 1224592, 1224499, 1223901, 1222392, 1220553, 1219136, 1218480, 1218764, 1220228, 1222912, 1226690, 1231824, 1238911, 1247832, 1257341, 1266344, 1275314, 1285863, 1299175, 1315418, 1334238, 1354756, 1375084, 1393072, 1408308, 1422767, 1438827, 1457066, 1476556, 1496809, 1518401, 1541680, 1565694, 1588928, 1610904, 1632896, 1657198, 1685620, 1718348, 1754119, 1791671, 1831022, 1873327, 1919760, 1970901, 2027033, 2088486, 2155570, 2228527, 2307687, 2393446, 2486097, 2585975, 2693710, 2809883, 2934408, 3066753, 3206806, 3354719, 3509322, 3667289, 3824683, 3979286, 4130661, 4277965]
60165D277965J40565J30559J18737J06573R3650P8556O1214M3461K7160J2587
60155E091027r94j3810k5348l5045m2253m5813m4832m0085l3622k6621j8459q254
60143D755891L633J6277K9517M3672N8587P3767Q9072J04329J18636J30832J40410
60132E564623J47368J51483J52453J50316J44946J35598J21844J04560Q5003O3402
60122F821596L9738J5513o896k6910m6159o5620q3563r7209j05525j09445j09867
60111F225653j06496r8700q6998p3338n9696m6287l1538j4169N016K3973M1611
60100E779031N8221P3972Q8005R9023J05977J08172J05681R9686R1561Q1614O9622
60089F760565N6425M3740L2319K1650J1749L867j062l331l125N01Q490K0555L5812
$$ y = [4277965, 4418530, 4549089, 4667826, 4774399, 4868049, 4946605, 5007819, 5051280, 5078440, 5091027, 5090033, 5076223, 5050875, 5015830, 4973577, 4927764, 4882932, 4842847, 4809225, 4782604, 4764145, 4755891, 4759524, 4775801, 4805318, 4848990, 4907577, 4981344, 5070416, 5174745, 5293381, 5424213, 5564623, 5711991, 5863474, 6015927, 6166243, 6311189, 6446787, 6568631, 6673191, 6758194, 6821596, 6861334, 6876847, 6869951, 6843041, 6796882, 6731262, 6647699, 6550490, 6444965, 6335520, 6225653, 6119157, 6020457, 5933459, 5860121, 5800425, 5754138, 5722600, 5708431, 5713447, 5737420, 5779031, 5837252, 5911224, 5999229, 6098252, 6204229, 6312401, 6418082, 6517768, 6609329, 6690943, 6760565, 6816990, 6860730, 6893049, 6914699, 6926448, 6930315, 6929253, 6925922, 6922797, 6923298, 6931788, 6952343, 6988155]
60076F988155N3768P3966R5560J18002J41477J66044J91239K17073K44425K73617
60066H563326L03477L32667L61136L89269M16271M40241M59414M72811M80317
60057A2218929M82420M78976M67791M45886M12951L72145L26473K75846K19047
60048A5700464J56907R1504K3497m7158j18284j85711k46503k99878l44884l79399
60038A4350555m02399m15320m19959m16136m02661l79950l50554l17244k81260
60029A0965072k42545k01414j59645j19602q2341m7275j4015J6223M1597O1211
60019A0217266P5013Q2991Q5450Q3298P6850O5205M8033K7350N806j6116l9320
60008A0711826o2964q4424j02635j19343j36221j52640j67187j79727j90775j99986
$$ y = [6988155, 7041923, 7115889, 7211449, 7329451, 7470928, 7636972, 7828211, 8045284, 8289709, 8563326, 8866803, 9199470, 9560606, 9949875, 10366146, 10806387, 11265801, 11738612, 12218929, 12701349, 13180325, 13648116, 14094002, 14506953, 14879098, 15205571, 15481417, 15700464, 15857371, 15948875, 15972372, 15925214, 15806930, 15621219, 15374716, 15074838, 14729954, 14350555, 13948156, 13532836, 13112877, 12696741, 12294080, 11914130, 11563576, 11246332, 10965072, 10722527, 10521113, 10361468, 10241866, 10159525, 10112250, 10098235, 10114458, 10156055, 10217266, 10292279, 10375270, 10460720, 10544018, 10620868, 10686073, 10734106, 10761456, 10767262, 10751146, 10711826, 10648862, 10564438, 10461803, 10342460, 10206239, 10053599, 9886412, 9706685, 9515910, 9315924]
59998I315924k06514k09979k10081k06065j97600j85638j71581j56066j39177
59989G633223j21061j01619q0227n6781l2528r003J3453L5246N6010P4687R1186
59978G502586J06888J22888J38040J49219J53583J50546J41597J28421J11473
59969H705241R0414O5473L7894R227j9348m7236p4418j01012j26185j47821j64023
59958H228206j74784j81260j83548j80458j71692j58931j44062j27479j08964
59949F797028q9253o9508m9634k8519n833J7399M0335O3417Q7367J11618J34580
59938G008997J55421J74796J93394K10163K22679K29212K29675K24412K13001
59929H861750J94972J71227J43809J14424Q3799N2160J9548j4119m8333q1243
$$ y = [9315924, 9109410, 8899431, 8689350, 8483285, 8285685, 8100047, 7928466, 7772400, 7633223, 7512162, 7410543, 7330316, 7273535, 7241007, 7232004, 7245457, 7280703, 7336713, 7411400, 7502586, 7609474, 7732362, 7870402, 8019621, 8173204, 8323750, 8465347, 8593768, 8705241, 8795655, 8861128, 8899022, 8908249, 8888901, 8841665, 8767247, 8666235, 8540050, 8392229, 8228206, 8053422, 7872162, 7688614, 7508156, 7336464, 7177533, 7033471, 6905992, 6797028, 6707775, 6638267, 6588633, 6560114, 6554281, 6571680, 6612015, 6675432, 6762799, 6874417, 7008997, 7164418, 7339214, 7532608, 7742771, 7965450, 8194662, 8424337, 8648749, 8861750, 9056722, 9227949, 9371758, 9486182, 9569981, 9622141, 9641689, 9627570, 9579237, 9497994]
59919I497994j10453j34760j54419j69562j79113j81710j77216j66980j52739
59910H071042j35488j15247r2008o6875m1748j7570O412L0998N5239P7262R6340
59899G868357J13034J27614J39645J48999J55884J59753J59580J55516J49047
59890I177429J41099J31298J19582J07323R6053Q6128P7438P0523O6070O4083
59880A0137026O4488O8149P6484R0314J09618J33956J62608J94598K29042K65167
59870A1531450L01879L37816L71998M03626M30957M51177M61909M61957M50123
59861A5202892M24273L82588L25258K54195J71807Q1072j3599j06849j93985k71695
59851A6255957l37465l89304m26286m48896m58574m57121m46450m28300m03776
$$ y = [9497994, 9387541, 9252781, 9098362, 8928800, 8749687, 8567977, 8390761, 8223781, 8071042, 7935554, 7820307, 7728299, 7661424, 7619676, 7602106, 7608518, 7639516, 7694755, 7772017, 7868357, 7981391, 8109005, 8248650, 8397649, 8553533, 8713286, 8872866, 9028382, 9177429, 9318528, 9449826, 9569408, 9676731, 9772784, 9858912, 9936350, 10006873, 10072943, 10137026, 10201514, 10269663, 10346147, 10436461, 10546079, 10680035, 10842643, 11037241, 11266283, 11531450, 11833329, 12171145, 12543143, 12946769, 13377726, 13828903, 14290812, 14752769, 15202892, 15627165, 16009753, 16335011, 16589206, 16761013, 16842085, 16828486, 16721637, 16527652, 16255957, 15918492, 15529188, 15102902, 14654006, 14195432, 13738311, 13291861, 12863561, 12459785]
59842A2459785l73260l37183k97080k55656k15285j76319j37381r7654n8247k0869
59832A0490851J4134M7457P8939J07139J30558J48280J59332J62489J56984J42667
59822A1638830J19529Q7829M8579L053m7802j02294j56699k06767k50671k88937
59812A0844650l21279l45481l60092l66461l67043l63041l54710l42567l27051
59803G696925l08123k86445k64110k42994k23025k02896j81855j60083j38356
59794E689038j18094j00718q6047p2448n9259m7859l9363l2993k8063k5823k7131
59783E051240k9643k9944k7862k6193k6292k6509k5429k4281k5101k8036l1597
59772D750353l4598l6999l9398m2236m5041m6471m5821m4359m4089m5079m5311
$$ y = [12459785, 12086525, 11749342, 11452262, 11196606, 10981321, 10805002, 10667621, 10569967, 10511720, 10490851, 10504985, 10552442, 10631381, 10738520, 10869078, 11017358, 11176690, 11339179, 11496163, 11638830, 11758359, 11846188, 11894767, 11897820, 11850018, 11747724, 11591025, 11384258, 11133587, 10844650, 10523371, 10177890, 9817798, 9451337, 9084294, 8721253, 8366543, 8023976, 7696925, 7388802, 7102357, 6838247, 6595253, 6372228, 6169332, 5987477, 5827394, 5689038, 5570944, 5470226, 5384179, 5311731, 5252472, 5204613, 5165250, 5132257, 5104194, 5078371, 5051240, 5021597, 4991653, 4963791, 4937598, 4911306, 4884797, 4859368, 4835087, 4809986, 4781950, 4750353, 4715755, 4678756, 4639358, 4597122, 4552081, 4505610, 4459789, 4415430, 4371341, 4326262, 4280951]
59761D280951m3464m0509l7675l4082k7940j9584j1797o647l225O73N445R614
59749D071760J2730J6651K3095L1198L8919M5998N3727O2200O9911P6125Q1494
59738D583808Q5761Q7056Q4565P9943P4774O8544O0697N2917M7217M3190L9424
59727E307896L6625L6904M0560M5923N2163N9951O9528Q0315R2640J07706J25452
59716F055663J44378J64002J85773K10828K38470K67508K97674L28778L59642
59707H252716L88872M15772M39367M56588M61756M47846M08904L42797K52659
59698A1867277J46026L2960p5339j68310k39078k86315l12402l20133l12232k92880
59688A0039574k67150k38405k07619j75227j42041j08345p3993l9886p816K1538
$$ y = [4280951, 4237487, 4196978, 4159303, 4125221, 4097281, 4077697, 4065900, 4059253, 4056028, 4056701, 4062146, 4071760, 4084490, 4101141, 4124236, 4155434, 4194353, 4240351, 4294078, 4356278, 4426189, 4502314, 4583808, 4669569, 4756625, 4841190, 4921133, 4995907, 5064451, 5125148, 5178065, 5225282, 5268472, 5307896, 5344521, 5381425, 5421985, 5467908, 5520071, 5580022, 5649550, 5729865, 5822505, 5930211, 6055663, 6200041, 6364043, 6549816, 6760644, 6999114, 7266622, 7564296, 7893074, 8252716, 8641588, 9057360, 9496727, 9953315, 10415071, 10862917, 11271821, 11614618, 11867277, 12013303, 12046263, 11970924, 11802614, 11563536, 11277221, 10964819, 10644686, 10332454, 10039574, 9772424, 9534019, 9326400, 9151173, 9009132, 8900787, 8826794, 8786908, 8779092, 8800630]
59678H800630M9023P5289J00381J25207J51365J78861K05949K32004K58670K87210
59668A0464589L16807L46902L79253M15719M55273M95316N35219N76739O21379
59659A4607196O68870P18059P67879Q17288Q65087R09716R48831R79725J000739
59650B2283390J011596J011737R99439R73963R37997Q96808Q55309Q16794P83621
59641C0570654P57285P37588P22792P10760O99081O84246O61928O28770N83580
59632C6756684N26774M59215L81920K96638K06532J16253L1038m4594j07471j55560
59622C8467429j87868k04460k05699j91139j60062j13484n4606J3481Q9775J74229
59612C7627596K65451L60602M57146N53511O47967P37586Q18315Q85536R34667
$$ y = [8800630, 8849653, 8924942, 9025323, 9150530, 9301895, 9480756, 9686705, 9918709, 10177379, 10464589, 10781396, 11128298, 11507551, 11923270, 12378543, 12873859, 13409078, 13985817, 14607196, 15276066, 15994125, 16762004, 17579292, 18444379, 19354095, 20302926, 21282651, 22283390, 23294986, 24306723, 25306162, 26280125, 27218122, 28114930, 28970239, 29787033, 30570654, 31327939, 32065527, 32788319, 33499079, 34198160, 34882406, 35544334, 36173104, 36756684, 37283458, 37742673, 38124593, 38421231, 38627763, 38744016, 38775054, 38730460, 38622989, 38467429, 38279561, 38075101, 37869402, 37678263, 37518201, 37404717, 37350111, 37363592, 37453367, 37627596, 37893047, 38253649, 38710795, 39264306, 39912273, 40649859, 41468174, 42353710, 43288377]
59603D3288377R61550R61977R30688Q61704P50839N98022M07136J84613o0706
59594D8884200l16838n69394q04081j009047j176196j301817j386153j431675
59586D0888999j441668j420700j375540j314031j242853j167208j092837j027171
59578C0806991r77985r51042r48613r68648j004386j045390j080406j100586j101508
59569B1628427j083541j050482j006846r55621q98503q37801p76856p18167o61982
59560A3638628o07507n54935n05514m60177m18983l81660l47692l16090k86021
59551I760049k57938k33130k11851j92820j75136j59773j48367j40967j36073
59542H103994j32563j30592j30543j32132j34720j37599j39711j39902j38001
$$ y = [43288377, 44249927, 45211904, 46142592, 47004296, 47755135, 48353157, 48760293, 48944906, 48884200, 48567362, 47997968, 47193887, 46184840, 45008644, 43706827, 42320674, 40888999, 39447331, 38026631, 36651091, 35337060, 34094207, 32926999, 31834162, 30806991, 29829006, 28877964, 27929351, 26960703, 25956317, 24910927, 23830521, 22729935, 21628427, 20544886, 19494404, 18487558, 17531937, 16633434, 15795633, 15018777, 14300610, 13638628, 13031121, 12476186, 11970672, 11510495, 11091512, 10709852, 10362160, 10046070, 9760049, 9502111, 9268981, 9057130, 8864310, 8689174, 8529401, 8381034, 8240067, 8103994, 7971431, 7840839, 7710296, 7578164, 7443444, 7305845, 7166134, 7026232, 6888231]
59533F888231j35035j31934j28540j24229j18769j12117j04138r5186q6288p8048
59523E773947o9889o1032n1598m2126l2722k3595j5639r301l480L158J0212J6331
59511E494266K1562K7231L3492L8743M1984M4393M7802N2695N8347O4096O9831
59500E994442P5915Q3005R1404J00388J08932J17291J26995J39130J53528J69620
59490G160650J86974K04665K21460K37152K52769K68920K84966L00181L14499
59481I432236L27503L37911L44793L48232L48084L43336L33592L19778L02205
59472A2437670K79202K49307K14004J76775J40036J04583P1405M1992J6645o008
59462A3725611k7136m6192o1346p0662p2783o7395n5426l8213j6347J0396M2033
$$ y = [6888231, 6753196, 6621262, 6492722, 6368493, 6249724, 6137607, 6033469, 5938283, 5851995, 5773947, 5704058, 5643026, 5591428, 5549302, 5516580, 5492985, 5477346, 5468045, 5464565, 5467723, 5477935, 5494266, 5515828, 5543059, 5576551, 5615294, 5657278, 5701671, 5749473, 5802168, 5860515, 5924611, 5994442, 6070357, 6153362, 6244766, 6345154, 6454086, 6571377, 6698372, 6837502, 6991030, 7160650, 7347624, 7552289, 7773749, 8010901, 8263670, 8532590, 8817556, 9117737, 9432236, 9759739, 10097650, 10442443, 10790675, 11138759, 11482095, 11815687, 12135465, 12437670, 12716872, 12966179, 13180183, 13356958, 13496994, 13601577, 13672982, 13714974, 13731619, 13725611, 13698475, 13652283, 13590937, 13520275, 13447492, 13380097, 13324671, 13286458, 13270111, 13280507, 13322540]
59451A3322540P7699J15660J53497J88479K18341K41393K55530K57752K45497
59442A5076388K18203J76864J22637N6898j7615r6862j76681k53109l21949l79574
59432A4405200m24566m57519m78822m87718m84075m70036m48896m22870l92826
59423A0337872l59788l25437k90847k55722k19672j83814j50226j19766r1236
59414H341364o3097l5133p828J9174M6661P4201J00233J24092J46626J68512J89225
59403I104030K08052K24589K37286K43170K40550K30923K16341J95839J66618
59394A1067398J28347Q3939L5909j5540o9816j23579j72853k16227k54222k86337
59384A0177019l10633l26288l34886l38749l38935l35320l27723l16387l01998
$$ y = [13322540, 13400239, 13515899, 13669396, 13857875, 14076216, 14317609, 14573139, 14830891, 15076388, 15294591, 15471455, 15594092, 15650990, 15633375, 15536513, 15359832, 15106723, 14784774, 14405200, 13980634, 13523115, 13044293, 12556575, 12072500, 11602464, 11153568, 10730698, 10337872, 9978084, 9652647, 9361800, 9106078, 8886406, 8702592, 8552366, 8432600, 8341364, 8278267, 8243134, 8235306, 8254480, 8301141, 8375342, 8475575, 8599667, 8746293, 8914805, 9104030, 9312082, 9536671, 9773957, 10017127, 10257677, 10488600, 10704941, 10900780, 11067398, 11195745, 11279684, 11315593, 11300053, 11230237, 11106658, 10933805, 10717578, 10463356, 10177019, 9866386, 9540098, 9205212, 8866463, 8527528, 8192208, 7864485, 7548098, 7246100]
59375G246100k85759k69034k52381k35310k17503j99862j83629j68835j54446
59366E279341j40040j26271j13550j01288q8998p7206o6416n6071m5462l5131
59356D428908k6098j8177j0294k255N192J2111J9730K8453L6568M1431M1308L6050
59344D592927K7332J8737J4312J5801K1601K8931L6561M5136N5452O6825P6575
59333E000190Q1342Q0102P6198P5013P9181Q7214R7091J09087J24035J40845J57784
59322F108082J74996J93662K13518K33437K54055K77569L04732L33950L63841
59313H457842L95065M29001M65894N05142N46428N89764O34715O79999P23464
59304A3427314P62340P93952Q16306Q27880Q27293Q13891P88525P53176P10118
$$ y = [7246100, 6960341, 6691307, 6438926, 6203616, 5986113, 5786251, 5602622, 5433787, 5279341, 5139301, 5013030, 4899480, 4798192, 4709194, 4631988, 4565572, 4509501, 4464039, 4428908, 4402810, 4384633, 4374339, 4372084, 4377276, 4389387, 4409117, 4437570, 4474138, 4515569, 4556877, 4592927, 4620259, 4638996, 4653308, 4669109, 4690710, 4719641, 4756202, 4801338, 4856790, 4923615, 5000190, 5081532, 5161634, 5237832, 5312845, 5392026, 5479240, 5576331, 5685418, 5809453, 5950298, 6108082, 6283078, 6476740, 6690258, 6923695, 7177750, 7455319, 7760051, 8094001, 8457842, 8852907, 9281908, 9747802, 10252944, 10799372, 11389136, 12023851, 12703850, 13427314, 14189654, 14983606, 15799912, 16627792, 17455085, 18268976, 19057501, 19810677, 20520795]
59295B0520795O61856O11207N60300N09722M59417M09998L62047L14529K65052
59286B4674923K11513J52244Q5122Q634p5892j64826k55561l47527m39089n25265
59276B3324276o00163o60675p06349p36844p51793p52921p43984p27637p03811
59267A6940099o72385o36255o00047n65799n31575m95207m58282m25091l97997
59258A2157461l75364l54276l33893l15118k98054k81528k65077k49975k37606
59249I446570k27548k17788k06588j93729j80271j67442j55654j44366j32847
59240G820337j20939j08910r6769q4222p1350n8800m7000l5565k3873j1966l88
59229G160555J0868K2491L4616M6220N6558O6865P9375R4349J09346J22135J33299
$$ y = [20520795, 21182651, 21793858, 22354158, 22863880, 23323297, 23733295, 24095342, 24409871, 24674923, 24886436, 25038680, 25123802, 25132436, 25056544, 24891718, 24636157, 24288630, 23849541, 23324276, 22724113, 22063438, 21357089, 20620245, 19868452, 19115531, 18371547, 17643910, 16940099, 16267714, 15631459, 15031412, 14465613, 13934038, 13438831, 12980549, 12555458, 12157461, 11782097, 11427821, 11093928, 10778810, 10480756, 10199228, 9934151, 9684176, 9446570, 9219022, 9001234, 8794646, 8600917, 8420646, 8253204, 8097550, 7953184, 7820337, 7699398, 7590488, 7493719, 7409497, 7338147, 7279347, 7232347, 7196782, 7172909, 7160943, 7160555, 7171423, 7193914, 7228530, 7274750, 7331308, 7398173, 7477548, 7571897, 7681243, 7803378, 7936677]
59218G936677J44768J56726J67423J75548J80898J82776J79650J71315J59959
59209I455740J48065J35924J21835J04001Q1688N5358K6350m040l5486o8083j00859
59198I920493j31959j60435j86537k09707k27797k39219k44726k46099k44110
59189H029904k38824k30941k21468k10586j97886j83458j68032j52485j37504
59180F288720j23158j08634r3212p7700o3590n0677l7211k2903r685J571J2986
59169E716507K6812M2396N7875P3250Q9843J07890J26752J46529J67563J89372
59159F744789K11838K36393K64201K94330L25584L58653L93920M28489M58349
59150I716546M82693N03027N18419N24723N18411M98189M62777M10434L41745
$$ y = [7936677, 8081445, 8238171, 8405594, 8581142, 8762040, 8944816, 9124466, 9295781, 9455740, 9603805, 9739729, 9861564, 9965565, 10047253, 10102611, 10128961, 10124921, 10089435, 10021352, 9920493, 9788534, 9628099, 9441562, 9231855, 9004058, 8764839, 8520113, 8274014, 8029904, 7791080, 7560139, 7338671, 7128085, 6930199, 6746741, 6578709, 6426224, 6288720, 6165562, 6056928, 5963716, 5886016, 5822426, 5771749, 5734538, 5711635, 5701950, 5703521, 5716507, 5743319, 5785715, 5843590, 5916840, 6006683, 6114573, 6241325, 6387854, 6555417, 6744789, 6956627, 7193020, 7457221, 7751551, 8077135, 8435788, 8829708, 9258197, 9716546, 10199239, 10702266, 11220685, 11745408, 12263819, 12762008, 13224785, 13635219, 13976964]
59141A3976964K60520J70942P5809k1998j18469k09715k92495l63217m18494m57269
59131A2602578m80619m89380m84172m67948m45704m20530l92223l60695l28382
59122H732925k97892k69422k41968k15467j90308j66347j43838j24053j07518
59113F976112r2875p8768o5850n5689m8601m3634l9947l7299l5817l5925l7912
59102F403795m1267m5180m9699n5278o1201o6011o9463p2471p4960p5749p4910
59091E717606p4103p3842p2496o8941o4249n9685n4927m9396m3560l7664l0834
59080E087909k2804j5031q725l121L056R804J6562K3329K9876L5433M0266M5967
59068E242521N2954N9365O3887O7926P3238P9056Q3499Q6589Q9803R3665R7661
$$ y = [13976964, 14237484, 14408426, 14484235, 14462237, 14343768, 14134053, 13841558, 13478341, 13059847, 12602578, 12121959, 11632579, 11148407, 10680459, 10234755, 9814225, 9422002, 9061307, 8732925, 8435033, 8165611, 7923643, 7708176, 7517868, 7351521, 7207683, 7083630, 6976112, 6883237, 6804469, 6738619, 6682930, 6634329, 6590695, 6550748, 6513449, 6477632, 6441707, 6403795, 6362528, 6317348, 6267649, 6212371, 6151170, 6085159, 6015696, 5943225, 5868265, 5792516, 5717606, 5643503, 5569661, 5497165, 5428224, 5363975, 5304290, 5249363, 5199967, 5156407, 5118743, 5087909, 5065105, 5050074, 5041349, 5038228, 5041284, 5051088, 5067650, 5090979, 5120855, 5156288, 5196554, 5242521, 5295475, 5354840, 5418727, 5486653, 5559891, 5638947, 5722446, 5809035, 5898838, 5992503, 6090164]
59057F090164J01549J04905J06106J03774R8834R3649Q9605Q6571Q3941Q0919
59047G040017P6752P2117O9256O9274P0321P0121O9312P0427P4388P9977Q6162
59036G848124R2813R9301J04262J06960J07511J05604J00033Q9391P2475M8531
59026H775005J8059j7078n5101r5155j35877j74371k07854k35413k56903k71508
59016G343804k79044k81462k80976k77468k69734k58504k46041k33281k19710
59007D997584k05871j93546j83060j72513j60373j47386j35363j25255j16810
58998C557407j09088j01175r3162q6282q1092p6191o9998o3273n8063n4492n0584
58987B714007m5276l9725l5242l1766k8946k7071k6044k4797k2611j9998j7571
$$ y = [6090164, 6191713, 6296618, 6402724, 6506498, 6605332, 6698981, 6788586, 6875157, 6959098, 7040017, 7116769, 7188886, 7258142, 7327416, 7397737, 7467858, 7537170, 7607597, 7681985, 7761962, 7848124, 7940937, 8040238, 8144500, 8251460, 8358971, 8464575, 8564608, 8653999, 8726474, 8775005, 8793064, 8775986, 8720885, 8625730, 8489853, 8315482, 8107628, 7872215, 7615312, 7343804, 7064760, 6783298, 6502322, 6224854, 5955120, 5696616, 5450575, 5217294, 4997584, 4791713, 4598167, 4415107, 4242594, 4082221, 3934835, 3799472, 3674217, 3557407, 3448319, 3347144, 3253982, 3167700, 3086608, 3010417, 2940419, 2877146, 2819083, 2764591, 2714007, 2668731, 2629006, 2593764, 2561998, 2533052, 2505981, 2479937, 2455140, 2432529, 2412531, 2394960]
58976B394960j4990j1837q725o621n466m078j357K697O931R987J1568J2704J4350
58963B400123J6030J6484J5450J4081J3555J3803J3655J1873Q200L880Q97K30
58951B528261J009J764K052K398L215M452N967P499Q566Q965R137R453R487Q443
58937B610668N991K394j757n741r306j3188j8056k2646k4441k2796k0041j8536
58925B462545j7971j6700j4379j1829r387o913m708k964j095J201L156M431O245
58912B391632R498J2994J5280J7158K0262K4093K6734K7909K8990L0279L0730
58901B635559L0333L0487L1647L2615L2678L2700L3595L5255L7430M0321M3850
58890C016470M7491N1130N5076N9127O2669O5708O8765P1992P5389P9484Q4565
$$ y = [2394960, 2379970, 2368133, 2359408, 2352787, 2347321, 2343243, 2341886, 2344583, 2351514, 2361501, 2373069, 2385773, 2400123, 2416153, 2432637, 2448087, 2462168, 2475723, 2489526, 2503181, 2515054, 2523254, 2527134, 2528031, 2528261, 2529270, 2531034, 2533086, 2535484, 2538699, 2543151, 2549118, 2556617, 2565183, 2574148, 2583285, 2592738, 2602225, 2610668, 2616659, 2619053, 2617296, 2611555, 2602249, 2589061, 2571005, 2548359, 2523918, 2501122, 2481081, 2462545, 2444574, 2427874, 2413495, 2401666, 2392279, 2385366, 2380658, 2377694, 2376599, 2377800, 2380956, 2385387, 2391632, 2401130, 2414124, 2429404, 2446562, 2466824, 2490917, 2517651, 2545560, 2574550, 2604829, 2635559, 2665892, 2696379, 2728026, 2760641, 2793319, 2826019, 2859614, 2894869, 2932299, 2972620, 3016470, 3063961, 3115091, 3170167, 3229294, 3291963, 3357671, 3426436, 3498428, 3573817, 3653301, 3737866]
58879C737866Q9660R3772R7698J03060J09768J16079J21049J25404J30149J35917
58869D860422J43427J52923J63303J73443J84177J97150K12065K27125K42039
58860F556074K58308K76342K94785L13197L33179L55844L80207M05152M31280
58851I604368M59606M89816N21008N53044N86134O19891O53632O86958P19449
58842A4893906P50214P77852Q00217Q14439Q18161Q10573P91024P56973P04840
58833B1918199O33010N42632M35721L14451J82641M6098q9433k19707l41217m50582
58823B2971813n45272o24037o86281p31858p61428p76029p76749p65886p47534
58814A6556739p25030o98478o66939o32437n98988n67847n36972n05522m75666
$$ y = [3737866, 3827526, 3921298, 4018996, 4122056, 4231824, 4347903, 4468952, 4594356, 4724505, 4860422, 5003849, 5156772, 5320075, 5493518, 5677695, 5874845, 6086910, 6314035, 6556074, 6814382, 7090724, 7385509, 7698706, 8031885, 8387729, 8767936, 9173088, 9604368, 10063974, 10553790, 11074798, 11627842, 12213976, 12833867, 13487499, 14174457, 14893906, 15644120, 16421972, 17222189, 18036628, 18854789, 19665362, 20456386, 21213359, 21918199, 22551209, 23093841, 23529562, 23844013, 24026654, 24072752, 23983319, 23763612, 23422395, 22971813, 22426541, 21802504, 21116223, 20384365, 19622937, 18846908, 18070159, 17304273, 16556739, 15831709, 15133231, 14466292, 13833855, 13234867, 12667020, 12130048, 11624526, 11148860]
58805A1148860m48780m23133l97176l72481l51066l31816l11870k90318k68608
58796G953612k48372k30553k15606k02779j89864j75129j59101j43476j29153
58787F259579j16180j04574r3954q3145p1395n9399m8197l7704k7103j6093m934
58776E596901O055J6534K6243L5456M4599N3280O0891O8370P7783Q9575J01729
58765F177416J12519J22676J33943J46820J60872J75968J91934K07968K23645
58756G653761K39874K57891K77970K99844L23467L48514L74016L99562M26156
58747A0601055M55141M86732N20288N55211N90943O26722O61862O95538P25998
58738A5919490P50980P69347P81139P85143P77451P53379P10314O48242N68359
$$ y = [11148860, 10700080, 10276947, 9879771, 9507290, 9156224, 8824408, 8512538, 8222220, 7953612, 7705240, 7474687, 7259081, 7056302, 6866438, 6691309, 6532208, 6388732, 6259579, 6143399, 6038825, 5944871, 5861726, 5790331, 5730932, 5682735, 5645031, 5617928, 5601835, 5596901, 5602956, 5619490, 5645733, 5681189, 5725788, 5779068, 5839959, 5908329, 5986112, 6075687, 6177416, 6289935, 6412611, 6546554, 6693374, 6854246, 7030214, 7222148, 7430116, 7653761, 7893635, 8151526, 8429496, 8729340, 9052807, 9401321, 9775337, 10174899, 10601055, 11056196, 11542928, 12063216, 12618427, 13209370, 13836092, 14497954, 15193492, 15919490, 16670470, 17439817, 18220956, 19006099, 19783550, 20536929, 21247243, 21895485, 22463844]
58729B2463844M71965L60367K35490J00919l7778j74476l04304m23646n29216
58720B2163165o18551o91044p46792p84844q04532q08508q02168p89532p71465
58711A5345729p48137p20956o91329o59595o26204n92327n58572n24705m91304
58702I732600m59872m30782m02992l76316l51875l29669l08101k86691k66935
58693F519367k49486k32963k16763k02444j90829j80100j68550j56913j46213
58684D775106j35576j24304j13859j05563r8115q9710q1022p3858o8302o3350
58674C821447n9068n6024n3915n2516n2530n3656n3580n1117m8590m8680n0390
58663C241381n0814m9529m8497m8603m9111m9856n1424n3488n5221n6856n8994
$$ y = [22463844, 22935809, 23296176, 23531666, 23632585, 23594807, 23420331, 23116027, 22692381, 22163165, 21544614, 20853570, 20106778, 19321934, 18517402, 17708894, 16906726, 16117194, 15345729, 14597592, 13876636, 13185307, 12525712, 11899508, 11307181, 10748609, 10223904, 9732600, 9272728, 8841946, 8438954, 8062638, 7710763, 7381094, 7072993, 6786302, 6519367, 6269881, 6036918, 5820155, 5617711, 5426882, 5246782, 5078232, 4921319, 4775106, 4639530, 4515226, 4401367, 4295804, 4197689, 4107979, 4026957, 3953099, 3884797, 3821447, 3762379, 3706355, 3652440, 3599924, 3547394, 3493738, 3440158, 3389041, 3340451, 3291771, 3241381, 3190567, 3141038, 3092541, 3043938, 2994827, 2944971, 2893547, 2840059, 2784838, 2727982, 2668988]
58652B668988o0995o1920o2114o2024o0703n7647n4769n3966n3892n1950m8424
58641B040584m5643m3834m1109l7275l4258l2601l0701k7993k5923k5121k4307
58630A671819k2926k2337k3265k4211k3652k2067k0655j9521j8145j6463j4512
58619A444065j2035r102o354m164k389j065l87J52J514L841O353Q679J1219J3995
58605A454322J6124J6771J5910J3937J1111P566L409j123n442q852j1208j2807
58593A499718j3474j2707j1008r831r612r111p430n268l414j565M07J723K512
58580A420940M417P948J1231J3139J5492J9846K4214K5953K6177K8037L1722L4647
58568A663763L5952L7430M0183M3464M6854N0674N4172N6192N7771O1343O7219
$$ y = [2668988, 2607993, 2546073, 2483959, 2421935, 2361232, 2303585, 2248816, 2194850, 2140958, 2089008, 2040584, 1994941, 1951107, 1909998, 1872723, 1838465, 1805864, 1775163, 1747170, 1721247, 1696126, 1671819, 1648893, 1626556, 1603291, 1579080, 1555428, 1533361, 1512706, 1493185, 1475040, 1458577, 1444065, 1432030, 1422928, 1416574, 1412410, 1410021, 1408956, 1408569, 1408721, 1410235, 1414076, 1420429, 1429108, 1440327, 1454322, 1470446, 1487217, 1503127, 1517064, 1528175, 1535741, 1539150, 1538027, 1532585, 1523733, 1512525, 1499718, 1486244, 1473537, 1462529, 1452698, 1443086, 1433975, 1426545, 1421277, 1417863, 1416298, 1416705, 1418428, 1420940, 1425357, 1433305, 1444536, 1457675, 1473167, 1493013, 1517227, 1543180, 1569357, 1597394, 1629116, 1663763, 1699715, 1737145, 1777328, 1820792, 1867646, 1918320, 1972492, 2028684, 2086455, 2147798, 2215017]
58557B215017P3604Q0121Q8102R7069J04371J09433J15216J23960J34196J43703
58547C284792J52984J63683J75502J86854J97290K07258K16289K23137K27206
58538E034995K28320K25340K16130J99021J73820J41621J04043O2607J8735k5556
58528F379076o7494j04831j37021j64366j86353k01769k10263k12768k10487k04375
58518D679349j95353j84146j71057j56789j43016j31125j20647j10047r8819q7924
58508C280426p8537p1286o6161o2204n7774n2234m6776m2723l9819l7287l5411
58497B690214l4575l3834l2274l1170l2818l7484m3072m7419m9661m9988m9588
58486B248331n0215n2332n4273n4435n3243n1552m8606m3696l8577l5694l4753
$$ y = [2215017, 2288621, 2368742, 2456844, 2553913, 2658284, 2767717, 2882933, 3006893, 3141089, 3284792, 3437776, 3601459, 3776961, 3963815, 4161105, 4368363, 4584652, 4807789, 5034995, 5263315, 5488655, 5704785, 5903806, 6077626, 6219247, 6323290, 6385897, 6404632, 6379076, 6311582, 6206751, 6069730, 5905364, 5719011, 5517242, 5306979, 5094211, 4883724, 4679349, 4483996, 4299850, 4128793, 3972004, 3828988, 3697863, 3577216, 3467169, 3368350, 3280426, 3201889, 3130603, 3064442, 3002238, 2944464, 2892230, 2845454, 2802731, 2762912, 2725625, 2690214, 2655639, 2621805, 2589531, 2558361, 2525543, 2488059, 2444987, 2397568, 2347907, 2297919, 2248331, 2198116, 2145784, 2091511, 2037076, 1983833, 1932281, 1883675, 1839979, 1801402, 1765708, 1730955]
58475A730955l3481l1193k9244k8377k7890k7183k6111k4286k1878k0346k0384
58464A440582k0153j7873j4985j4037j4573j4172j2713j2295j3390j4485j5269
58453A276637j6702j7958j6867j3811j1739j1661j1423r674p790o792n421k774
58441A144025k20P81P28P13Q20R20J332K027K714M015O767R962J1474J1079J0655
58426A207792J1190J1754J1711J1737J2120J2071J1147R621P393M380J666J62
58414A312744j412m870r366j2496j3976j5298j6234j5172j2860j2206j3885j5442
58402A169527j5267j4295j3273j1645r714q701q069o023l212k436m024m983l676
58389A064209j838q94Q3J512J999J427K035M647O963P359P488R280J2022J4138
$$ y = [1730955, 1697474, 1666281, 1637037, 1608660, 1580770, 1553587, 1527476, 1503190, 1481312, 1460966, 1440582, 1420429, 1402556, 1387571, 1373534, 1358961, 1344789, 1332076, 1319781, 1306391, 1291906, 1276637, 1259935, 1241977, 1225110, 1211299, 1199560, 1187899, 1176476, 1166802, 1159012, 1152220, 1146799, 1144025, 1143805, 1144586, 1145314, 1146027, 1146847, 1147767, 1149099, 1151126, 1153840, 1157855, 1164622, 1174584, 1186058, 1197137, 1207792, 1218982, 1230736, 1242447, 1254184, 1266304, 1278375, 1289522, 1299143, 1306536, 1310916, 1312582, 1312744, 1311332, 1306462, 1297096, 1284600, 1270624, 1255326, 1239092, 1223920, 1211060, 1198854, 1184969, 1169527, 1154260, 1139965, 1126692, 1115047, 1105333, 1096632, 1088563, 1082540, 1079328, 1076892, 1072868, 1067885, 1064209, 1062371, 1061477, 1061560, 1063072, 1065071, 1066498, 1068533, 1073180, 1080143, 1087502, 1094990, 1104270, 1116292, 1130430]
58375A130430J5510J6473J6756J6667J7176J7977J7722J6591J5938J5076J1663
58364A307979N871P43k312m823p302q026o956o729q059q073n197j946p35l83Q76
58349A254928K310K890L594N281O999Q271J0280J3125J4884J4906J4868J5147
58337A367483J3730J0314P722P315O664L900O41j571l900p016r011q979r011j0140
58323A368141j0097p659n283m634l475j56K702K514J174J519K695K715K550L943
58309A356649N782O278O242P090Q015Q158Q942J1259J3127J3031J2796J4173J5606
58296A487148J5434J5300J7096J9383K0155K0334K1392K2287K1843K1364K1870
58285A703606K1756K0112J9108J9961J9899J6572J2147R537P908N457L401L302
$$ y = [1130430, 1145940, 1162413, 1179169, 1195836, 1213012, 1230989, 1248711, 1265302, 1281240, 1296316, 1307979, 1313850, 1314593, 1312281, 1307458, 1300156, 1292130, 1285174, 1278445, 1270386, 1262313, 1257116, 1255170, 1254435, 1254052, 1254928, 1257238, 1260128, 1263722, 1269003, 1276002, 1284273, 1294553, 1307678, 1322562, 1337468, 1352336, 1367483, 1381213, 1391527, 1399249, 1406564, 1413228, 1417128, 1417769, 1416198, 1412298, 1405282, 1396271, 1387292, 1378281, 1368141, 1358044, 1350385, 1345102, 1340468, 1336993, 1336837, 1339539, 1342053, 1343227, 1344746, 1347441, 1350156, 1352706, 1356649, 1362431, 1368709, 1374951, 1382041, 1390056, 1398214, 1407156, 1418415, 1431542, 1444573, 1457369, 1471542, 1487148, 1502582, 1517882, 1534978, 1554361, 1574516, 1594850, 1616242, 1638529, 1660372, 1681736, 1703606, 1725362, 1745474, 1764582, 1784543, 1804442, 1821014, 1833161, 1842698, 1850606, 1856063, 1859464, 1862766]
58273A862766L656K806K388M171O545P605Q618J0908J2645J2327J2094J3979J6328
58260A976836J7561J9677K4202K8471K9981L0632L2624L4278L4204L5207L9299
58249B302972M2990M2722M0804M0674M0365L6506L1118K8425K7978K6670K4735
58238B685959K4250K4532K4196K4876K7967L0897L1566L2833L7587M3159M5947
58227C033769M7625N1194N5090N6983N9125O3813O7821O7805O7008O9958P4710
58216C714901P7249P9317Q4534R0892R4652R7962J04880J13259J18256J20619
58206D696521J24112J28076J29813J30804J33339J34791J32580J30806J34498
58197E875340J41530J47625J54466J65007J76121J84431J94113K09930K28064
$$ y = [1862766, 1866422, 1869228, 1871616, 1875787, 1882332, 1889937, 1898555, 1909463, 1922108, 1934435, 1946529, 1960508, 1976836, 1994397, 2014074, 2038276, 2066747, 2096728, 2127360, 2159984, 2194262, 2228466, 2263673, 2302972, 2345962, 2388684, 2429488, 2470162, 2510527, 2547033, 2578151, 2606576, 2634554, 2661224, 2685959, 2710209, 2734741, 2758937, 2783813, 2811780, 2842677, 2874243, 2907076, 2944663, 2987822, 3033769, 3081394, 3132588, 3187678, 3244661, 3303786, 3367599, 3435420, 3503225, 3570233, 3640191, 3714901, 3792150, 3871467, 3956001, 4046893, 4141545, 4239507, 4344387, 4457646, 4575902, 4696521, 4820633, 4948709, 5078522, 5209326, 5342665, 5477456, 5610036, 5740842, 5875340, 6016870, 6164495, 6318961, 6483968, 6660089, 6844520, 7038633, 7248563, 7476627]
58188G476627K43183K58725K80130L03601L22439L39059L59755L83051M04570
58179A0371140M27797M58282M92761N25989N62342O08011O57804P02786P44611
58170A5551523P88718Q30589Q63808Q94918R34472R80253J025687J077194J144987
58161B4092149J223944J303051J387366J490530J611929J741991J883621K046429
58153C6781010K226077K411805K607936K825087L058219L298144L555727L848663
58145F0612668M176015M535950M956048N472162O091069O812508P672518Q719434
58137A09048372R961127J1385495J3014859J4879715J6955061J9187442K1558957
58130B15991028K4048858K6589172K9180270L1921447L4539749L5727596L3338755
$$ y = [7476627, 7719810, 7978535, 8258665, 8562266, 8884705, 9223764, 9583519, 9966570, 10371140, 10798937, 11257219, 11749980, 12275969, 12838311, 13446322, 14104126, 14806912, 15551523, 16340241, 17170830, 18034638, 18929556, 19864028, 20844281, 21869968, 22947162, 24092149, 25316093, 26619144, 28006510, 29497040, 31108969, 32850960, 34734581, 36781010, 39007087, 41418892, 44026828, 46851915, 49910134, 53208278, 56764005, 60612668, 64788683, 69324633, 74280681, 79752843, 85843912, 92656420, 100328938, 109048372, 119009499, 130394994, 143409853, 158289568, 175244629, 194432071, 215991028, 240039886, 266629058, 295809328, 327730775, 362270524, 397998120, 431336875]
58123D31336875K5833309J3777487j85252j2932298k2489025k8427635l1267145
58116C75646316l1817953l0880314k9107990k6912658k4497923k1993065j9516448
58109A90919965j7142371j4897078j2809880j0922278r240660p724357o330908
58102A11852433n043133l854308k770289j845883j197283r56087j196154j875856
58094I3113440k825349l804177m609117n146981n415138n442219n269496m962602
58086E5638361m594570m208832l817622l432024l070225k739324k433882k155316
58078B9186566j913931j711045j536972j387416j265089j164899j074344r90162
58070A8142708r19581q63884q14740p67506p24491o84247o40877n95034n53529
$$ y = [431336875, 457170184, 470947671, 470762419, 457830121, 435341096, 406913461, 375646316, 343828363, 312948049, 283840059, 256927401, 232429478, 210436413, 190919965, 173777594, 158880516, 146070636, 135148358, 125907698, 118183341, 111852433, 106809300, 102954992, 100184703, 98338820, 97141537, 96185450, 94989296, 93113440, 90288091, 86483914, 81874797, 76727816, 71312678, 65870459, 60600963, 55638361, 51043791, 46834959, 43017337, 39585313, 36515088, 33775764, 31341882, 29186566, 27272635, 25561590, 24024618, 22637202, 21372113, 20207214, 19132870, 18142708, 17223127, 16359243, 15544503, 14776997, 14052506, 13368259, 12727382, 12132348, 11578819]
58061A1578819n17434m82069m48289m21680m00930l79383l58001l44265l37617
58052G889151l28665l14109l00343k90449k79399k64726k50900k40098k28603
58043E391859k15429k05135j99097j92522j82904j73426j65549j56012j43727
58034C758058j32417j24134j16621j08764j02306r7026r0661q4306q1355q0679
58024B739789p7712p2563o9786o9675o7530o2577n9785o1176o2550o0842n7988
58013B017605n5739n2899m9515m7680m6662m3053l7091l2960l1837l0580k8244
58002A561345k7464k8319k7336k4071k2315k3059k2565j9284j6483j5989j5315
57991A319145j3206j2205j3375j3924j2499j1616j2591j3139j2126j1790j3010
$$ y = [11578819, 11061385, 10579316, 10131027, 9709347, 9308417, 8929034, 8571033, 8226768, 7889151, 7560486, 7246377, 6946034, 6655585, 6376186, 6111460, 5860560, 5620462, 5391859, 5176430, 4971295, 4772198, 4579676, 4396772, 4223346, 4057797, 3901785, 3758058, 3625641, 3501507, 3384886, 3276122, 3173816, 3076790, 2986129, 2901823, 2820468, 2739789, 2662077, 2589514, 2519728, 2450053, 2382523, 2319946, 2260161, 2198985, 2136435, 2075593, 2017605, 1961866, 1908967, 1859452, 1811772, 1765110, 1722057, 1684966, 1652006, 1620169, 1589589, 1561345, 1533881, 1505562, 1478226, 1454155, 1431840, 1408781, 1386216, 1366932, 1350449, 1334460, 1319145, 1305939, 1293734, 1280359, 1266435, 1253936, 1242320, 1229729, 1216590, 1204464, 1192674, 1179664]
57980A179664j3265j1428r780r417q466o809p300j0069j0879p948n359o572r202
57967A063170r625q594q683r572r491q614q003p338o062m765l716k235o78n50
57953I75244j636j850p15Qk61j96J48q45k494j858J258L303K261M2j660l614n693
57936I61442n594k906o35o82j492j878l200n834p547p568q373j1009j2642j1315
57922H80767r452r682j0683j0187q997q815q819p490n512m149k930j365p44j775
57908G90167k723k087r73o34r3J570K968K880K703L982N539N530M493L922L509
57893H20753K066j74k161l612m434m112l029k665l216k914j026P51J333K245M697
57878H04502O928O663M407K316J181K98r71k937n537p677q116p646q437j0766
$$ y = [1179664, 1166399, 1154971, 1145191, 1135774, 1127308, 1120499, 1113199, 1103130, 1092251, 1084303, 1078944, 1072372, 1063170, 1053545, 1044951, 1036268, 1026696, 1017205, 1008591, 1000588, 993250, 987188, 982423, 978707, 976472, 975794, 975244, 973608, 971758, 971043, 971051, 970790, 970594, 970742, 969897, 967403, 965545, 966803, 970106, 972367, 972409, 970749, 967135, 961442, 955848, 952942, 952307, 951625, 950133, 948255, 945055, 939221, 931674, 924106, 915733, 904724, 892082, 880767, 871315, 861633, 850950, 840763, 831766, 822951, 814132, 806642, 801130, 796981, 794051, 792686, 791942, 790167, 787444, 785357, 784384, 783750, 783657, 785227, 788195, 791075, 793778, 797760, 803299, 808829, 813322, 817244, 820753, 822819, 822645, 820484, 816872, 812438, 808326, 805297, 802632, 799416, 796502, 795476, 796227, 797560, 799805, 804502, 811430, 818093, 822500, 824816, 825997, 826295, 825324, 822387, 816850, 809173, 801057, 793411, 784974, 774208]
57864G74208j2788j4059j6097j8601j8645j5285j1629j0242r757q259o841o973
57852F25032p219n742l756l373l832k789M1L164N704P346P347N927N061N842O677
57837F45430O136N557O621Q220Q428P860Q304R404R349P922O369N153L871K540
57823G41164J213n69k519l283k912l652o408q553p513m683l232l798m828n518
57809F84909n747m570j591J355K450K647L725N110N295M960N668O622N859L839
57795G20531K852L394M056M332M713M436K143j338l643m194m423m836m451l237
57781G20335k606l097l686l651l291k687j581m93l01q00j179j614k705l773l663
57766F85208k923l286n059o879p904q550r167r661j0296j1405j2491j2923j3015
$$ y = [774208, 761420, 747361, 731264, 712663, 694018, 678733, 667104, 656862, 647105, 638846, 632005, 625032, 617813, 612071, 608315, 604942, 601110, 598321, 598362, 601526, 607230, 614576, 621923, 627850, 632911, 638753, 645430, 651566, 657123, 663744, 671964, 680392, 688252, 696556, 705960, 715309, 723231, 729600, 734753, 738624, 741164, 742377, 741808, 739289, 736006, 733094, 729442, 723034, 714481, 706968, 702285, 699053, 695255, 690427, 684909, 679162, 674592, 673001, 674356, 676806, 679453, 683178, 688288, 693583, 698543, 704211, 710833, 716692, 720531, 723383, 726777, 730833, 735165, 739878, 744314, 746457, 745119, 741476, 737282, 732859, 728023, 723572, 720335, 717729, 714632, 710946, 707295, 704004, 701317, 699736, 699243, 698942, 698142, 696963, 695349, 692644, 688871, 685208, 682285, 678999, 673940, 667061, 659157, 650607, 641440, 631779, 621483, 610078, 597587, 584664, 571649]
57753E71649j3134j2541j0753r063q711q590p014m962m840o404o761m545j464
57740D72867O93K191L829N378O391O978P043O157M721M045M827O480Q079R008
57726E48687Q858P779O704O228N748M777M195M742N216M110K129R36J88j674m229
57711F04394n513n547o450q660r929r002p656p841q923r203q412p292o127m987
57697D98852m329m224l856k710j376n39J8Q29J950L171M297N035N403O187P873
57682E16581R271Q681O550N342O227P522P158N404M185M640O239P643P830O873
57668F10146N909N877O365O439O355P261R237J0952J1545J1527J1571J1545J1285
57655G26014J1318J2306J4390J7127J9382J9583J7358J4743J4322J6213J8280
$$ y = [571649, 558515, 545974, 535221, 526158, 517447, 508857, 501843, 496881, 492041, 485637, 478876, 474331, 472867, 473560, 475751, 479580, 484958, 491349, 498327, 505370, 511527, 516248, 520293, 525120, 531600, 539679, 548687, 557545, 565324, 572028, 578256, 584004, 588781, 592976, 597718, 602934, 607044, 609173, 610109, 610297, 608623, 604394, 598881, 593334, 586884, 578224, 568295, 559293, 551637, 543796, 534873, 525670, 517258, 509966, 503839, 498852, 494523, 490299, 486443, 483733, 482357, 481818, 481836, 482665, 484615, 487786, 492083, 497118, 502521, 508708, 516581, 525852, 534533, 541083, 546425, 552652, 560174, 567332, 572736, 576921, 581561, 587800, 595443, 603273, 610146, 616055, 621932, 628297, 634736, 641091, 648352, 657589, 668541, 680086, 691613, 703184, 714729, 726014, 737332, 749638, 764028, 781155, 800537, 820120, 837478, 852221, 866543, 882756, 901036]
57644I01036J9261J9958K1141K2299K3128K4473K6864K9624L2302L5500L9172
57633A194758M1613M1475L9703L8140L7243L6540L6540L8488M2490M7319N2165
57622A646474N7518O4159P2006Q0308Q8692R7824J08919J22428J37417J52675
57612B628420J68231J84855K02219K18769K33833K48337K62083K70865K67744
57603D685356K47685K10901J62300J08445N4826M738m0411q0248j14669j43517
57593E095406j66469j83186j93615j98104j97261j92061j84149j75330j66225
57584C439006j55904j43572j30249j18074j08037r9173q9813p9170o7812n7214
57574B389988m8674m2209l6573l0678k4529j8558j2753p076j895K724P470J2706
$$ y = [901036, 920297, 940255, 961396, 983695, 1006823, 1031296, 1058160, 1087784, 1120086, 1155586, 1194758, 1236371, 1277846, 1317549, 1355689, 1392932, 1429472, 1466012, 1504500, 1546990, 1594309, 1646474, 1703992, 1768151, 1840157, 1920465, 2009157, 2106981, 2215900, 2338328, 2475745, 2628420, 2796651, 2981506, 3183725, 3402494, 3636327, 3884664, 4146747, 4417612, 4685356, 4933041, 5143942, 5306242, 5414687, 5469513, 5474251, 5433840, 5353592, 5238923, 5095406, 4928937, 4745751, 4552136, 4354032, 4156771, 3964710, 3780561, 3605231, 3439006, 3283102, 3139530, 3009281, 2891207, 2783170, 2683997, 2594184, 2515014, 2447202, 2389988, 2341314, 2299105, 2262532, 2231854, 2207325, 2188767, 2176014, 2168938, 2167043, 2169767, 2177237, 2189943]
57562B189943J7889K2893K8856L6452M4488N1671N8750O6989P5628Q3228R0689
57551B767476J00173J11211J20785J27644J33698J40242J45483J47013J44394
57542C938119J37782J26052J08186Q5070N8351K8705l267l5589o5937r3270j17149
57531D167053j36475j50265j59041j64071j65872j64546j60838j55593j48806
57522B761546j40383j31251j22559j14362j06193r8342r1384q5078p9018p3771
57512A719205o9866o6039o0185n2290m4835l9888l6927l4160l0962k8130k6263
57501A229660k4869k3117k0877j8619j6536j4305j1788r518q027p092o256n580
57489A063076n074l881j278J777L680M774P068J0840J3614J3734J3000J4032J6491
$$ y = [2189943, 2207832, 2230725, 2259581, 2296033, 2340521, 2392192, 2450942, 2517931, 2593559, 2676787, 2767476, 2867649, 2978860, 3099645, 3227289, 3360987, 3501229, 3646712, 3793725, 3938119, 4075901, 4201953, 4310139, 4395209, 4453560, 4482265, 4478998, 4443409, 4377472, 4284202, 4167053, 4030578, 3880313, 3721272, 3557201, 3391329, 3226783, 3065945, 2910352, 2761546, 2621163, 2489912, 2367353, 2252991, 2146798, 2048456, 1957072, 1871994, 1792976, 1719205, 1649339, 1583300, 1523115, 1470825, 1425990, 1386102, 1349175, 1315015, 1284053, 1255923, 1229660, 1204791, 1181674, 1160797, 1142178, 1125642, 1111337, 1099549, 1090031, 1082004, 1074912, 1068656, 1063076, 1058002, 1054121, 1052843, 1054620, 1058300, 1063074, 1070142, 1080982, 1094596, 1108330, 1121330, 1135362, 1151853]
57476A151853J8190J8931K0623K3782K6613K8126K9886L3435L7662M0337M1328
57465A470766M2719M6039N0707N5277N9263O3364O8446P4713Q1606Q8279R4208
57454B195387R9515J04691J09900J14571J17622J17993J14936J07998R6974Q1903
57444C261490O3012M0723J6022r295l3189n4347p2395q7196r8535j06565j11773
57433B807952j14121j13025j08813j03359r8353r3499q7542q0496p3536o6969
57423A868239n9876n1862m3797l6538l0099k4497k0123j6746j3265r037m572l40
57411A557487M060Q875J3267J6316J8322K0430K3506K7860L3367L9222M4249M8163
57399A855124N2013N6857O2663O8927P5553Q2374Q8585R3544R7536J00853J02569
$$ y = [1151853, 1170043, 1188974, 1209597, 1233379, 1259992, 1288118, 1318004, 1351439, 1389101, 1429438, 1470766, 1513485, 1559524, 1610231, 1665508, 1724771, 1788135, 1856581, 1931294, 2012900, 2101179, 2195387, 2294902, 2399593, 2509493, 2624064, 2741686, 2859679, 2974615, 3082613, 3179587, 3261490, 3324502, 3365225, 3381247, 3371952, 3338763, 3284416, 3212021, 3124825, 3026290, 2919725, 2807952, 2693831, 2580806, 2471993, 2368634, 2270281, 2176782, 2089240, 2008744, 1935208, 1868239, 1808363, 1756501, 1712704, 1676166, 1646067, 1621570, 1601447, 1584701, 1571436, 1562399, 1557827, 1557487, 1561547, 1570422, 1583689, 1600005, 1618327, 1638757, 1662263, 1690123, 1723490, 1762712, 1806961, 1855124, 1907137, 1963994, 2026657, 2095584, 2171137, 2253511, 2342096, 2435640, 2533176, 2634029, 2736598]
57388B736598J01116R5828Q7133P5394O0267M1233J8456o720l2045n5532p6410
57377C045318r4407j08403j17158j21537j24334j26880j27296j23348j15878j07821
57367A878256j00779r4342q8161q2778p8353p4127o9547o4752n9929n5131n0729
57356A059628m6995m3398l9323l5342l2459l0360k7874k5251k4168k4917k5170
57345G04371k2715j8318j4691j3383j3738j4350j4383j3551j1902r947q535q212
57333E40646q766r351r153q056o775o145o258o483o196n269m030l093l008l551
57319D54512l665k741j784k293m023m998m031k147r72p94r72j265j663j622o76
57304D20866N10R22Q33J405K730L582L372L028L369L751L333K765L421N309O955
$$ y = [2736598, 2837714, 2933542, 3020675, 3096069, 3156336, 3197569, 3216025, 3209305, 3177260, 3121728, 3045318, 2950911, 2842508, 2725350, 2603813, 2479479, 2352599, 2225303, 2101955, 1986077, 1878256, 1777477, 1683135, 1594974, 1512196, 1433843, 1359716, 1290169, 1225417, 1165488, 1110357, 1059628, 1012633, 969235, 929912, 894570, 862111, 831751, 803877, 778626, 754458, 729541, 704371, 681656, 663338, 648647, 635264, 621526, 607176, 592793, 579242, 567340, 557393, 548858, 540646, 531880, 522529, 513376, 505320, 498545, 492400, 486142, 479659, 473463, 468194, 464164, 461071, 458063, 454512, 450847, 448106, 446322, 444029, 440006, 435008, 430977, 428830, 427858, 427064, 426092, 424827, 423164, 421542, 420866, 421376, 422298, 423131, 424536, 427266, 430848, 434220, 437248, 440617, 444368, 447701, 450466, 453887, 459196, 466151]
57289D66151P353P092P430Q859J0846J2351J2631J1968J1716J2984J5238J7003
57277F01622J7941J9233K1435K3101K2392J9346J5512J1951Q719O041M620M585
57265G76498N198N911O938Q416R876J0919J1711J2371J2661J2681J3240J4778
57253I01198J6607J7775J8189J8027J6807J4206J1531J0970J3021J5724J6954
57242A071009J6698J6432J6952J7692J7833J7256J6353J5645J5734J7076J9391
57231A258071K1690K3304K4658K6604K9106L1084L1794L1861L2569L4399L6754
57220A581894L9065M1407M3775M5407M5603M4897M4533M4672M3958M1158L6606
57209B052975L1504K6546K1893J7783J4061R512L048m481j0857j5190j8615k2006
$$ y = [466151, 473504, 480596, 488026, 496885, 507731, 520082, 532713, 544681, 556397, 569381, 584619, 601622, 619563, 638796, 660231, 683332, 705724, 725070, 740582, 752533, 761252, 767293, 771913, 776498, 781696, 787607, 794545, 802961, 812837, 823756, 835467, 847838, 860499, 873180, 886420, 901198, 917805, 935580, 953769, 971796, 988603, 1002809, 1014340, 1025310, 1038331, 1054055, 1071009, 1087707, 1104139, 1121091, 1138783, 1156616, 1173872, 1190225, 1205870, 1221604, 1238680, 1258071, 1279761, 1303065, 1327723, 1354327, 1383433, 1414517, 1446311, 1478172, 1510741, 1545140, 1581894, 1620959, 1662366, 1706141, 1751548, 1797151, 1842048, 1886581, 1931253, 1975211, 2016369, 2052975, 2084479, 2111025, 2132918, 2150701, 2164762, 2174274, 2177322, 2172841, 2161984, 2146794, 2128179, 2106173]
57197B106173k4448k4940k4274k3868k3612k2323j9655j6152j1983p118k414J099
57185A906485L860P165J0973J3890J5381J6275J6911J6657J5777J5914J7747J9749
57173B076784K0410K0316K0857K2034K2913K3495K4795K7470L1277L5492L9281
57162B365124M2215M4877M8178N1639N3405N2547N0266M8180M6587M5210M4289
57151B892517M3756M2498L9725L6274L3510L1794L1006L1432L2943L4480L5748
57140C285683L8397M3923N1109N7151O0756O2775O4399O6087O7861O9369P0105
57129C937615P0437P1583P3602P4578P3121P0472O8533O6936O4059O0078N6840
57118D687854N5076N3755N2080N0396M9019M7741M6632M6219M6763M7958M8965
$$ y = [2106173, 2081725, 2056785, 2032511, 2008643, 1985031, 1962708, 1943053, 1926901, 1914918, 1907800, 1905386, 1906485, 1910345, 1917510, 1928483, 1942373, 1957754, 1974029, 1990940, 2007597, 2023374, 2039288, 2057035, 2076784, 2097194, 2117510, 2138367, 2160401, 2183314, 2206809, 2231604, 2259074, 2290351, 2325843, 2365124, 2407339, 2452216, 2500394, 2552033, 2605438, 2657985, 2708251, 2756431, 2803018, 2848228, 2892517, 2936273, 2978771, 3018496, 3054770, 3088280, 3120074, 3151080, 3182512, 3215455, 3249935, 3285683, 3324080, 3368003, 3419112, 3476263, 3537019, 3599794, 3664193, 3730280, 3798141, 3867510, 3937615, 4008052, 4079635, 4153237, 4227815, 4300936, 4371408, 4439941, 4506877, 4570936, 4631014, 4687854, 4742930, 4796685, 4848765, 4899161, 4948180, 4995921, 5042553, 5088772, 5135535, 5183493, 5232458]
57107E232458M8152M3834L6323K8469K3195K1215K1709K3797K6466K8682L0740
57096E565040L3919L7744L9626L8490L6403L5165L3888L2027L1729L4276L7014
57085E955321L7218L6659L8463M1557M2425M0806L9299L8203L4919K8205J9555
57074F352630J0810L471n19l96J821L962O246Q248N749n373k4099m7048p4177
57061F241325j07162j44198j81468k18304k56408k95755l35925l79322m28203
57052C894580m81015n36737n99939o75863p63989b5381r74624j104488j249145
57043c353638j404862j575877j768636j982240k214676k473189k767331l098094
57035b0638543l467723l894268m400675m994162n670009o423712p237147q063017
$$ y = [5232458, 5280610, 5324444, 5360767, 5389236, 5412431, 5433646, 5455355, 5479152, 5505618, 5534300, 5565040, 5598959, 5636703, 5676329, 5714819, 5751222, 5786387, 5820275, 5852302, 5884031, 5918307, 5955321, 5992539, 6029198, 6067661, 6109218, 6151643, 6192449, 6231748, 6269951, 6304870, 6333075, 6352630, 6363440, 6366911, 6366392, 6365996, 6367817, 6371779, 6378025, 6386273, 6392022, 6386649, 6362550, 6315502, 6241325, 6134163, 5989965, 5808497, 5590193, 5333785, 5038030, 4702105, 4322783, 3894580, 3413565, 2876828, 2276889, 1601026, 837037, -25381, -1000005, -2104493, -3353638, -4758500, -6334377, -8103013, -10085253, -12299929, -14773118, -17540449, -20638543, -24106266, -28000534, -32401209, -37395371, -43065380, -49489092, -56726239, -64789256]
57027f4789256q846428r540949j0064558j0274691j0083040r612339r125514q700604
57019a41037379q026982o640569m381035j558457J321736L912751O101240P859375
57011a42449320R141431R912082J0195119J0068925R642740R040693Q375626P718593
57003f8354111P097375O519970N986711N486784N004892M537618M094289L682766
56995b5943706L304435K960759K652867K374790K117025J877423J660939J469917
56987g525551J302136J156333J031191R20333Q16621P20782O38683c68179A46252
56977F12890M29149L98973L69802L40238L14270K93198K73429K52737K32843K15091
56967C732620J98789J84372J73444J65170J56767J47725J39860J33428J26935
$$ y = [-64789256, -73635684, -83176633, -93241191, -103515882, -113598922, -123211261, -132336775, -141037379, -149064361, -155704930, -160085965, -161644422, -160322686, -156409935, -150308695, -142449320, -133307889, -123395807, -113200688, -103131763, -93489023, -84448330, -76072704, -68354111, -61256736, -54736766, -48750055, -43263271, -38258379, -33720761, -29626472, -25943706, -22639271, -19678512, -17025645, -14650855, -12533830, -10656407, -8995468, -7525551, -6223415, -5067082, -4035891, -3115558, -2298937, -1578155, -939472, -368179, 146252, 612890, 1042039, 1441012, 1810814, 2151052, 2465322, 2758520, 3031949, 3284686, 3517529, 3732620, 3931409, 4115781, 4289225, 4454395, 4611162, 4758887, 4898747, 5032175, 5159110]
56958E159110J20142J13589J05858R5000Q2052O9738N8523M7105L5836K6774K1547
56947E935274K1354K6951L6480M6455N6766O9243P7243O3425J6071n5675j30325
56936F163262j95058k50699k98884l34859l54301l58711l51348l33945l09740
56927C375717k84337k61107k39507k18877j99840j81577j62380j43829j29980
56918A554283j21715j15972j10993j07862j06313j03635r8804r3574q8663q2747
56908E24005p5792o9336o3059n5193m6547l9792l4496k7518j8740j1403o150q8
56896G5891O910J0489Q402L857J11l638q401j1993j2545j1762j1714j1515r879
56883B4213p997p271B195b984l229j544R60a850G149J1830J4014J6194J7741J8380
$$ y = [5159110, 5279252, 5392841, 5498699, 5593699, 5675751, 5745489, 5804012, 5851117, 5886953, 5913727, 5935274, 5956628, 5983579, 6020059, 6066514, 6123280, 6192523, 6269766, 6333191, 6349262, 6293587, 6163262, 5968204, 5717505, 5418621, 5083762, 4729461, 4370750, 4019402, 3685457, 3375717, 3091380, 2830273, 2590766, 2371889, 2172049, 1990472, 1828092, 1684263, 1554283, 1432568, 1316596, 1205603, 1097741, 991428, 887793, 788989, 695415, 606752, 524005, 448213, 378877, 315818, 260625, 214078, 174286, 139790, 112272, 93532, 82129, 75979, 75891, 82801, 93290, 101692, 105549, 105660, 102022, 93621, 81628, 69083, 57321, 45607, 34092, 24213, 16216, 8945, 2195, -2984, -6213, -7757, -6797, -1850, 7149, 18979, 32993, 49187, 66928, 85308]
56869H5308J8605J7460J2767M838k933q457j2976j7483k0374k0451j9168j7964
56857A9172C015a0247j0718r366p925n641l792k887j322J300K504P96j577j883
56843e0758l99J444L563N724O295M998M365O033Q067b205F410J0568J3249J4628
56829D4855J5271J6632J7805J7298J6327J6819J7402J4932R354L898P51q08k122
56816A88414l426m322m252k704j78J749K504L492N751Q273J0196J2781J7176K1972
56802B57426K5443K8593L3279L8474M1151L9975L5459K7529J6114L739n671j1012
56790E30499j4536j7817j9608j8341j4614j0168n821j453L001P371J1656J6188
56778D66357K1477K7773L4636M1316M7628N3563N7689N7113M9908L6801J9952
$$ y = [85308, 103913, 121373, 134140, 138978, 136045, 127588, 114612, 97129, 76755, 56304, 37136, 19172, 3015, -10247, -20965, -30331, -38256, -43897, -47689, -50576, -51898, -50598, -48094, -47298, -48875, -50758, -51157, -49713, -46150, -40426, -34131, -29133, -24768, -18735, -10668, -2205, 6410, 16978, 30227, 44855, 60126, 76758, 94563, 111861, 128188, 145007, 162409, 177341, 186695, 190593, 191344, 190536, 188414, 184988, 180666, 176414, 173710, 173532, 175281, 177785, 181277, 187028, 195301, 205497, 218278, 235454, 257426, 282869, 311462, 344741, 383215, 424366, 464341, 499800, 527329, 543443, 547182, 541511, 530499, 515963, 498146, 478538, 460197, 445583, 435415, 429594, 428141, 431142, 438513, 450169, 466357, 487834, 515607, 550243, 591559, 639187, 692750, 750439, 807552, 857460, 894261, 914213]
56767I14213J331j6878l1738m1183m5692m7162m6543m3460l7734l0332k2943j6850
56755E35029j1809o136J215Q803J4404J8242K2669K8433L3447L5718L5109L1429
56743G46553K3469J1435j892j3972k4457l3049l7962l8480l6903l5631l4169l1188
56731D93754k7468k4291k0650j5005q548l900j406P36L403O078Q728J1544J3259
56718D36234J2023P898K547l074q916j4315j8237k0746k2548k3486k3074k1879
56706C02427k0659j8962j6306j3882j3102j3157j2069r623p283n741m662m357
56694A62624n437p033p382o161m558l140j490K20J052P75J36k84l42J29Q97J124
56678A31130O80P37J693J777m29l353m436l721k956k066N45M411O610N441K303
$$ y = [914213, 915544, 898666, 866928, 825745, 780053, 732891, 686348, 642888, 605154, 574822, 551879, 535029, 523220, 517084, 518299, 527102, 541506, 559748, 582417, 610850, 644297, 680015, 715124, 746553, 770022, 781457, 779565, 765593, 741136, 708087, 670125, 631645, 594742, 559111, 524942, 493754, 466286, 441995, 421345, 406340, 397792, 393892, 392486, 393222, 396625, 402703, 411431, 422975, 436234, 448257, 456155, 458702, 455628, 446712, 432397, 414160, 393414, 370866, 347380, 324306, 302427, 281768, 262806, 246500, 232618, 219516, 206359, 194290, 184667, 177384, 171643, 166981, 162624, 157187, 150154, 142772, 136611, 132053, 128913, 127423, 127643, 128695, 129470, 129606, 129322, 128980, 129109, 130006, 131130, 131810, 132547, 134240, 136017, 135588, 132235, 127799, 124078, 121122, 119056, 119601, 124012, 130622, 136063, 138366]
56663A38366m57j736j432j7J283J344M59l21r76k237l811m476l765k186k04J550
56647A21384J808J69j521j188N91J690J704J897K422K204J477J837L452M468L666
56632A46060J793j1j279j612r36n26j782l838m310k706j106j132k194l144l746
56617A19531l928l276j885m35R26K412L493L395K644K435K640K306J827K449L552
56602A38086K956L61j756j456L05J455J172j28j626k236j333Q3K48j120k738l862
56586A28411m776n144l908j286R37J667J565J424J081L72l20r57j897k805k768
56571A11596j700m19N76J188R45k64j200p15L51O22P04J883L152K430M04q3J452
56554A20922K502J797R25J064J250Q67Q46J323R87j91m86K34j86k230l183j380
$$ y = [138366, 137909, 136173, 134741, 134724, 136007, 137351, 137810, 137489, 136513, 134276, 130465, 125989, 122224, 120038, 119834, 121384, 123192, 123361, 121840, 120652, 121243, 122933, 124637, 126534, 128956, 131160, 132637, 134474, 137926, 142394, 146060, 147853, 147842, 146563, 144951, 144015, 143489, 141707, 137869, 133559, 130853, 129747, 128615, 126421, 123277, 119531, 115603, 112327, 110442, 110007, 110933, 113345, 116838, 120233, 122877, 125312, 127952, 130258, 132085, 134534, 138086, 141042, 141403, 139647, 138191, 138496, 139951, 141123, 140995, 139369, 137133, 135800, 135883, 136131, 135011, 132273, 128411, 123635, 118491, 114583, 113297, 114234, 115901, 117466, 118890, 119971, 120343, 120023, 119066, 117169, 114364, 111596, 109896, 109477, 110053, 111241, 112186, 111922, 110722, 110007, 110358, 110980, 111684, 113567, 116719, 119149, 119553, 119470, 120922, 123424, 125221, 126146, 127210, 128460, 129327, 130173, 131496, 132483, 132292, 131806, 132040, 131854, 129624, 126441, 125061]
56538A25061J085J873J723K006J773m6j746j130R79K237K398K872L696L523K043
56523A48347M21l29OJ116J985J450Nk11J654L635L694K553K255L290M601N226
56507A79698M619K612L75%J826L588L503K679L032M498N962P315Q725R254Q177
56492B45863O544N753N608N252M776M409L595K423K437M162N387L964R90j003
56478C00160j742k830m686o172o663o451n656m473l819m102m173l102j896j786
56464B42609k095j764j655l023m705m511k710j656k256l157l189k439j088P35
56450B09096K054J909R98P29R48M63o01r28k66M52R91J852K505J725k26j707k092
56433B17902k238k441j864m04P09P51M35N60R90J456K042K484K129J026Q6j65
$$ y = [125061, 126146, 128019, 129742, 131748, 133521, 133475, 131729, 130599, 131578, 133815, 136213, 139085, 142781, 146304, 148347, 148768, 148439, 148445, 149561, 151546, 152996, 153001, 152790, 154444, 158079, 161773, 164326, 166581, 169871, 174472, 179698, 184317, 186929, 187304, 187304, 189130, 192718, 196221, 198900, 201932, 206430, 212392, 219707, 228432, 237686, 245863, 252407, 258160, 263768, 269020, 273796, 278205, 281800, 284223, 286660, 290822, 296209, 300173, 301163, 300160, 298418, 295588, 290902, 284730, 278067, 271616, 265960, 261487, 257668, 253566, 249393, 246291, 244395, 242609, 240514, 238750, 237095, 234072, 229367, 224856, 222146, 220490, 218234, 215077, 211888, 209449, 208361, 209096, 211150, 213059, 214057, 214786, 215734, 216197, 215596, 214668, 214402, 214854, 215845, 217697, 220202, 221927, 221701, 219994, 217902, 215664, 213223, 211359, 210955, 211664, 212415, 212850, 213410, 214400, 215856, 217898, 220382, 222511, 223537, 223623, 223458]
56417B23458p5K8K93Q04J429K331L793N453O407O201N214M214L961M751N889O207
56401B80358N668N582O441O683M932K441J698L127M754M846L520J881Q50P50J072
56386C34603P94l56j450j757j783j988j663l44P61K69j293k461k994l393l255
56371C13690k106j226k390m975o428n710m370m032m552m991m853l929k177k52
56357B61699P64N48j71m40K79J895L440L631K456J436J534J767R43l19p59n65
56341B78138o83q57k04Q17P69o96k475l358k611p3K960L985K112k62l52J407K591
56324B81208K560K619L040K622J191J65L69J124J710K106K127J324j48j597k515
56309B97905k318l96K334L209R86k033l037k433k199k019k35K417L521L103L445
$$ y = [223458, 223383, 223411, 223704, 224508, 225937, 228268, 232061, 237514, 243921, 250122, 255336, 259550, 263511, 268262, 274151, 280358, 286026, 291608, 298049, 304732, 309664, 312105, 313803, 316930, 321684, 326530, 330050, 331931, 332781, 333531, 334603, 335397, 335041, 333591, 331834, 330051, 328063, 326400, 326056, 326817, 327086, 325793, 323332, 320338, 316945, 313690, 311584, 310358, 307968, 302993, 296565, 290855, 286485, 282453, 277901, 272910, 268057, 264128, 261951, 261699, 262463, 263011, 262840, 262400, 262679, 264574, 268014, 271645, 274101, 275537, 277071, 278838, 279781, 279462, 278703, 278138, 277455, 276598, 276394, 277211, 277980, 277284, 274809, 271451, 268840, 268767, 271727, 275712, 277824, 277562, 277210, 278617, 281208, 283768, 286387, 289427, 292049, 293240, 293405, 293774, 294898, 296608, 298714, 300841, 302165, 302017, 300420, 297905, 295587, 295191, 297525, 300734, 301720, 299687, 296650, 294217, 292018, 289999, 289764, 292181, 295702, 298805, 302250]
56294C02250M831M973L234J921K425L176K760K340L351M964N386M196K218L87
56280C48412m20K11J464K081K101K441L047L282L873O111R024R886Q073N992N493
56265D11071N713N393N019N444O233O799P675R377J1048J1320R847P485N627N439
56251E13490O849Q418R004R144R775J0421J0110R176Q545Q149P901Q954J1712
56238F31648J3906J3360J1479J0896J0957R175O370N925Q173R845R560R578J1126
56225G61998J2165J1229R865R787J0798J2726J6051J9468K0388J9259J9744K3143
56213I46621K6366K7154K7594L0177L4025L7525M1382M6402N1200N4851N9093
56202A382390O5224P1491P6248Q1054Q7797R5163J01071J06476J13564J21774
$$ y = [302250, 307081, 312054, 315288, 317209, 319634, 322810, 325570, 327910, 331261, 336225, 341611, 345807, 348025, 348412, 347992, 348203, 349667, 351748, 353849, 356290, 359337, 362619, 366492, 372603, 381627, 391513, 399586, 405578, 411071, 416784, 422177, 427196, 432640, 438873, 445672, 453347, 462724, 473772, 485092, 494939, 502424, 508051, 513490, 520339, 528757, 537761, 546905, 556680, 567101, 577211, 586387, 594932, 603081, 610982, 619936, 631648, 645554, 658914, 670393, 681289, 692246, 701421, 707791, 713716, 721889, 731734, 741294, 750872, 761998, 774163, 785392, 795257, 805044, 815842, 828568, 844619, 864087, 884475, 903734, 923478, 946621, 972987, 1000141, 1027735, 1057912, 1091937, 1129462, 1170844, 1217246, 1268446, 1323297, 1382390, 1447614, 1519105, 1595353, 1676407, 1764204, 1859367, 1960438, 2066914, 2180478, 2302252]
56192B302252J28578J32889J35151J35428J33666J30661J26619J20197J10652
56183C456093R9208Q6548P1216N2697L3878J7828M038r600k2913l4216m3310n0937
56171C660530n6719o0316o3336o7409p1558p3862p4671p5713p7307p8834q0785
56160B880020q3802q6699q7960q8336q9564r1373r2027r1097q9435q7158q3744
56149A908825p9570p5472p1359o6855o2474n8690n4849n0474m6377m2990l9055
56138A260660l3754k8532k4989k2475j9867j7988j7939j8432j7354j4935j2931
56127A031464j1641j0092q435p728p699o807m384j364R34J778J530J823M008O934
56113I90321Q022P158P279J0097J3814J6427J8384K0268K0854J9841J9669K1863
$$ y = [2302252, 2430830, 2563719, 2698870, 2834298, 2967964, 3098625, 3225244, 3345441, 3456093, 3555301, 3641849, 3713065, 3765762, 3799640, 3817468, 3821506, 3811906, 3788993, 3754777, 3711467, 3660530, 3603811, 3543495, 3480159, 3412750, 3341192, 3267330, 3192659, 3116946, 3039639, 2960805, 2880020, 2796218, 2709519, 2621559, 2533223, 2443659, 2352286, 2260259, 2169162, 2079727, 1992569, 1908825, 1829255, 1753783, 1682424, 1615569, 1553095, 1494405, 1439556, 1389082, 1342705, 1299715, 1260660, 1226906, 1198374, 1173385, 1150910, 1131043, 1113055, 1095116, 1076684, 1059330, 1044395, 1031464, 1019823, 1009731, 1001296, 993568, 985869, 979062, 974678, 973314, 974248, 976026, 977556, 979379, 983387, 990321, 998343, 1005501, 1012780, 1022877, 1036691, 1053118, 1071502, 1091770, 1112624, 1132465, 1152134, 1173997]
56101A173997K4200K4412K4233K6486L0361L2983L3900L4697L5809L7001L9411
56090A517490M3768M7939M9565M9968N2171N6307O0346O4426P0946Q0752R2190
56079B185868J03818J15652J28139J41813J57178J73255J87338J97719K04830
56070C595610K08301K05599J96044J83536J72433J63175J54649J47690J42250
56061E169287J33758J16899R1483O0931K7050r219m3827p1663r2328j09895j27414
56050E145062j45107j62997j81059j97161k08266k13549k13671k08175j96758
56041C418319j81916j66991j52605j37914j23718j11146r8977q5750p2858o2217
56031B224227n2813m3110l4611k9145k4925j9529j4455j2211j1150q186m356k600
$$ y = [1173997, 1198197, 1222609, 1246842, 1273328, 1303689, 1336672, 1370572, 1405269, 1441078, 1478079, 1517490, 1561258, 1609197, 1658762, 1708730, 1760901, 1817208, 1877554, 1941980, 2012926, 2093678, 2185868, 2289686, 2405338, 2533477, 2675290, 2832468, 3005723, 3193061, 3390780, 3595610, 3803911, 4009510, 4205554, 4389090, 4561523, 4724698, 4879347, 5027037, 5169287, 5303045, 5419944, 5511427, 5572358, 5599408, 5590189, 5546362, 5474699, 5382371, 5272476, 5145062, 4999955, 4836958, 4655899, 4458738, 4250472, 4036923, 3823252, 3615077, 3418319, 3236403, 3069412, 2916807, 2778893, 2655175, 2544029, 2445052, 2359302, 2286444, 2224227, 2171414, 2128304, 2093693, 2064548, 2039623, 2020094, 2005639, 1993428, 1982278, 1974092, 1969736, 1967136]
56019A967136k005K50L062L301J903K339M204M285K886L230N308O209N956P278
56005B015342J0074J1656J2043J3593J6052J7357J8434K1622K5487K6987K7485
55994B216132L0362L4023L4187L2133L3273L8036M1585M2478M4154M7595N0022
55983B643980N1443N4993N9894O1470N9355N8530O0966O3168O3509O4924O8777
55972C311009P2626P5653Q0100Q5967R0480R3810R9123J06198J11307J13961J17355
55961D357589J21994J25662J29557J37111J46735J53450J57740J64843J75351
55952E670032J84912J93371K05239K20725K35443K49377K66881K87218L04848
55943G818046L19640L36905L56875L74723L91717M15144M46081M78392N10934
$$ y = [1967136, 1965131, 1965381, 1968443, 1971744, 1973647, 1975986, 1980190, 1984475, 1987361, 1990591, 1995899, 2002108, 2008064, 2015342, 2025416, 2037072, 2049115, 2062708, 2078760, 2096117, 2114551, 2136173, 2161660, 2188647, 2216132, 2246494, 2280517, 2314704, 2346837, 2380110, 2418146, 2459731, 2502209, 2546363, 2593958, 2643980, 2695423, 2750416, 2810310, 2871780, 2931135, 2989665, 3050631, 3113799, 3177308, 3242232, 3311009, 3383635, 3459288, 3539388, 3625355, 3715835, 3809645, 3908768, 4014966, 4126273, 4240234, 4357589, 4479583, 4605245, 4734802, 4871913, 5018648, 5172098, 5329838, 5494681, 5670032, 5854944, 6048315, 6253554, 6474279, 6709722, 6959099, 7225980, 7513198, 7818046, 8137686, 8474591, 8831466, 9206189, 9597906, 10013050, 10459131, 10937523, 11448457]
55934A1448457N49023N92525O34542O73302P13026P52058P83572Q09635Q40741
55925A7796881Q79829R21084R65550J021787J089326J158809J231381J319914
55917B6384561J427794J545325J670817J814947J979279K151591K328441K520972
55909D1823727K732412K952615L181797L436370L725474M047963M419020M870557
55901G1189935N417841O057897O808941P714455Q797581J0051473J1484952J3130191
55893A40653266J4993661J7057654J9345603K1913718K4755236K7788483L0903539
55886B97411160L3751826L5289196L3764219K7693204J7180511M235294q347265
55879D40978145j8482813k5415767k9352347l0880069l0672880k9369139k7452788
$$ y = [11448457, 11997480, 12590005, 13224547, 13897849, 14610875, 15362933, 16146505, 16956140, 17796881, 18676710, 19597794, 20563344, 21585131, 22674457, 23833266, 25064647, 26384561, 27812355, 29357680, 31028497, 32843444, 34822723, 36974314, 39302755, 41823727, 44556139, 47508754, 50690551, 54126921, 57852395, 61900358, 66319378, 71189935, 76607776, 82665673, 89474614, 97189069, 105986650, 116038123, 127523075, 140653266, 155646927, 172704581, 192050184, 213963902, 238719138, 266507621, 297411160, 331162986, 366452182, 400216401, 427909605, 445090116, 449325410, 440978145, 422495332, 397079565, 367727218, 336847149, 306174269, 276805130, 249352342]
55872B49352342k5214003k2835100k0465887j8208015j6100038j4163262j2432294
55865A19933743j0924856r621406q495769p535271o717029n998546n351396m779111
55857F0510359m287851l864060l493588l177171k911745k678272k462925k271733
55849C5363014k111039j970715j838584j715057j601771j491227j379338j274483
55841B1980800j183314j100010j018857r44672q81558q23753p66999p17325o79180
55832A3865132o45745o10046n75404n46093n17581m85162m53346m27853m06022
55823I197880l83150l60833l41652l22941l02960k86157k75468k66276k54388
55814F404055k42954k35060k26731k14105k00880j91545j83416j72324j60601
$$ y = [249352342, 224138339, 201303239, 180837352, 162629337, 146529299, 132366037, 119933743, 109008887, 99387481, 90891712, 83356441, 76639412, 70640866, 65289470, 60510359, 56222508, 52358448, 48864860, 45687689, 42775944, 40097672, 37634747, 35363014, 33251975, 31281260, 29442676, 27727619, 26125848, 24634621, 23255283, 21980800, 20797486, 19697476, 18678619, 17733947, 16852389, 16028636, 15261637, 14544312, 13865132, 13219387, 12609341, 12033937, 11487844, 10970263, 10485101, 10031755, 9603902, 9197880, 8814730, 8453897, 8112245, 7789304, 7486344, 7200187, 6924719, 6658443, 6404055, 6161101, 5926041, 5699310, 5485205, 5284325, 5092780, 4909364, 4737040, 4576439]
55805D576439j52478j46690j40158j34293j31294j28618j23300j17826j16072
55796C385710j17004j17557j17955j19191j18912j14762j08531j02645r6012q7398
55786B285743p9242p3974o9973o5051o0314n6959n3078m7432m2669m0950l9991
55775A656110l7100l3531l1251k9160k6018k3465k2435k0412j5773j1292r663
55764A396010r210p620o200o783q063q618j0017j3288j5994j6364j6666j8975
55752A258212k1452k2429k3973k7313k9089k6757k3651k3679k4687k2573j8665
55741I93944j7294j8481j8697j6955j4942j2693r151n789n051o203o798o866p721
55728H47303q247o553l920k827k438k86K748L445J459n55j327j759k033j788k542
$$ y = [4576439, 4423961, 4277271, 4137113, 4002820, 3871526, 3742908, 3619608, 3501782, 3385710, 3268706, 3151149, 3033194, 2914003, 2795091, 2680329, 2571798, 2469153, 2373141, 2285743, 2206501, 2132527, 2062554, 1997503, 1937189, 1880230, 1827152, 1779720, 1737051, 1696101, 1656110, 1619010, 1585479, 1554228, 1525068, 1499050, 1475585, 1453150, 1432738, 1416965, 1405673, 1396010, 1386800, 1379180, 1372980, 1366197, 1358134, 1349516, 1339499, 1326211, 1310217, 1293853, 1277187, 1258212, 1236760, 1214331, 1190358, 1163045, 1133956, 1107199, 1083548, 1059869, 1035182, 1012609, 993944, 976650, 958169, 939472, 922517, 907575, 894882, 885731, 879942, 874891, 868688, 861890, 855024, 847303, 839056, 832503, 828583, 825756, 823318, 823032, 825780, 829225, 830684, 830129, 828802, 827043, 825010, 823222, 820680]
55713H20680o166j1222j4314j4809j4993j5828j5901j4619j3320j2831j2286j0712
55701F63679q177n672n080q084j3553j7596j8145j7538j8463j9590j8314j5619
55689D97848j4545j5272j5441j4410j3475j2588j0476p785o729p568q321p924
55677C63314p023n939m498l589m207n157m309j992o70j323k554l162l375l550
55663C11966l682m107m911n058l853k588k909m325n225n349n188m129j671N46
55649B59517O69k95L2J575K333K070K470L811M395L291J197j294l885n365m802
55634B65719l681m237n853n942m138k692k435j545J005L525M220L569L044L366
55620B53925M643O673Q502R139Q988R152R388Q470O542N124M737M360L395K291
$$ y = [820680, 814514, 803292, 788978, 774169, 759176, 743348, 727447, 712828, 699508, 686677, 674391, 663679, 655502, 649830, 644750, 636666, 623113, 605517, 587372, 569834, 551371, 531781, 513467, 497848, 483303, 468031, 452590, 438180, 424705, 412117, 401641, 393856, 387127, 379559, 371238, 363314, 356291, 350352, 345854, 342265, 338058, 332901, 328592, 326600, 325930, 324607, 322053, 318891, 315516, 311966, 308284, 304177, 299266, 294208, 290355, 287767, 284858, 280533, 275308, 269959, 264771, 260642, 258971, 259517, 260186, 259891, 259923, 261498, 263831, 265901, 268371, 272182, 276577, 279868, 281065, 279771, 275886, 270521, 265719, 262038, 257801, 251948, 246006, 241868, 239176, 236741, 235196, 236201, 239726, 243946, 247515, 250559, 253925, 258568, 265241, 273743, 282882, 291870, 301022, 310410, 318880, 325422, 330546, 335283, 339643, 343038, 345329]
55606C45329J157l83j899k578k903l881m785l927j802q51j731k321j239J36L19
55591C18641J08Q41K040K465K220K227K446J979N11j254k405k530j984j629j963
55576C21713k535k730k793l390m489n645o952q616r940r976q944p839o932n874
55562B35058m994n022n642n691m830l887l663m367n874p415p569n932m149l910
55548A62113m512m084k630j794k001j979j120k33J81N79J012Q61J75k44q8N21
55532A46757J987M299N598M050J019j74J077J986R60J3J344L987N592N642N100
55517A89237M382L518L281M393O315Q147J0061J2684J5691J8210K0237K2499K5049
55504C43704K6795K6437K3401J8050J1316M098l037r513j4469j7395j8811j9650
$$ y = [345329, 346486, 346103, 344204, 341626, 338723, 334842, 330057, 326130, 324328, 323477, 321746, 319425, 318186, 318322, 318641, 318749, 319590, 321630, 324095, 326315, 328542, 330988, 332967, 333478, 332224, 329819, 327289, 325305, 323676, 321713, 319178, 316448, 313655, 310265, 305776, 300131, 293179, 284563, 274623, 264647, 255703, 247864, 240932, 235058, 230064, 225042, 219400, 213709, 208879, 204992, 201329, 196962, 191088, 183673, 176104, 170172, 166023, 162113, 157601, 153517, 150887, 149093, 147092, 145113, 143993, 143760, 143941, 144520, 145532, 146393, 146568, 146324, 146236, 146757, 148744, 153043, 158641, 162691, 163710, 163536, 164613, 166599, 167559, 167572, 168916, 172903, 178495, 184137, 189237, 193619, 197137, 200418, 204811, 211126, 219273, 229334, 242018, 257709, 275919, 296156, 318655, 343704, 370499, 396936, 420337, 438387, 449703, 453801, 450764, 441251, 426782, 409387, 390576, 370926]
55492C70926k0198k0272k0094j9969j9356j7379j4236j1197r150q115p966q563
55480A94431r197q998q071p311p093o931o407n582m592l580k863k441j735n28
55466A19102M85Q08R60J189N41j313k510j173J618L095K453J151K05m91n74O10
55450A26156K197K540J714J079M93j431m237n657n201m834n399n252l621k586
55436I5961l914o169o725n100k699q49l69j595l486m013k654j161r66j345j234
55421E3682j165k028l272l757l283k243r18J0l60j542j735m50O82O18N29J373
55405C6141J878Q20n67n84m3r03k912l961l168j505J88J812K755J994k92k485
55389B9168l158k145k03J553K163J660J041Q50M37o12j298n61R53J728J414Q67
$$ y = [370926, 350728, 330456, 310362, 290393, 271037, 253658, 239422, 228225, 219075, 210960, 202994, 194431, 185234, 176236, 168165, 160854, 153761, 146830, 140423, 134841, 130249, 126669, 123806, 121365, 119630, 119102, 119587, 120395, 121355, 122544, 123085, 121772, 119262, 118089, 119707, 122802, 125255, 126406, 126611, 126120, 125546, 126156, 128353, 130893, 132607, 133686, 134179, 132748, 128511, 122854, 117653, 112819, 107420, 102168, 98547, 95961, 92047, 85878, 79153, 74053, 71354, 70505, 70136, 68541, 65055, 61042, 58388, 57227, 56261, 54916, 53682, 52517, 50489, 47217, 43460, 40177, 37934, 37016, 37026, 36666, 35124, 33389, 32939, 33621, 34239, 34768, 36141, 38019, 38839, 38272, 37688, 37645, 36742, 33830, 29869, 26701, 25196, 25384, 27196, 29951, 31945, 31653, 29168, 26010, 23865, 23662, 25215, 27378, 29038, 30079, 30929, 31366, 30754, 29456, 28895, 29848, 31576, 32990, 33857]
55373C3857O62O13M18j16r95j420j19K696M628L684Q21j362j822j475j014j83
55357C8873R44J575J398Q89K70o54j460j122M56J992K411K075J887J877J464O94
55341E3569L25N49M02r77k860l540k441p36M52J378K361K309J08l056m618l733
55325C9492j862l43P98J492J164L23O73K652M412M323K966J660M91r32k115k475
55309E2719k426k491k288j493p32m53j23M02Q6j389k385j661o41j523l964n629
55293B6009n346l859k021k00R28P81J03J93R84J329R73P91J098J230Q66L66k43
55276B3982j355k664l124k302q66L71J065J064M41j64j09L09K01n77j215j122
55260A3935o67o55j393k222j884J45K514K934P59k227l956C257B98g42B80J748
$$ y = [33857, 34519, 35132, 35550, 35434, 34439, 33019, 32900, 35596, 40224, 43908, 44729, 43367, 41545, 40070, 39056, 38873, 39817, 41392, 42790, 43679, 43949, 43295, 41835, 40713, 41169, 43161, 45572, 47647, 49534, 51411, 52875, 53569, 53894, 54443, 54845, 53868, 51008, 47468, 45027, 44291, 44743, 46121, 48482, 50791, 50899, 47843, 43225, 39492, 37630, 37287, 38085, 39577, 40741, 41064, 41737, 44389, 48801, 53124, 56090, 57750, 58241, 57309, 55194, 52719, 50293, 47802, 45514, 44021, 43289, 42836, 42713, 43115, 43201, 41812, 39427, 37766, 37125, 35602, 31638, 26009, 20663, 16804, 14783, 14583, 15511, 16292, 16395, 16588, 17572, 18901, 19874, 20665, 21763, 22993, 23859, 24225, 23982, 22627, 19963, 16839, 14537, 13671, 14042, 15107, 16171, 16612, 16448, 16339, 16648, 16849, 16272, 15057, 13935, 13268, 12613, 11220, 8998, 7114, 7259, 9773, 12707, 13466, 11239, 7283, 3257, 298, -742, 280, 2028]
55244B028O99l24L33J636J457Ln48N47J731J733J105P75Q47J286K232L098K646
55227B1284O77j429k401k358j933j147J66J542K232K061J467R22N70K75r0l87
55211B1451m37m64r14j617j784j137l24J16M23O54J24j388k722k727j716o42L99
55194G295J608K228J336n63j944k077j380m69J85J36l97m42K38M35n99j504p27
55177C359R47J640J323J370J730R48j066k595k734k255A067j05K091L348K687
55162I088J138J10j60J39J100K213K189P93k84M77K256L057K328J321J113J300
55146B8178Q60l43j325j245n44m34j277k132k137j495p03K28J079J013r6r39n71
55129A8117L4m08j367j496r17n60j18J134K154J199j050j899m35J391J852J437
$$ y = [2028, 2727, 2403, 2736, 4372, 5829, 5832, 5284, 5831, 7562, 9295, 10400, 11175, 12022, 13308, 15540, 18638, 21284, 21961, 20532, 18131, 15773, 13840, 12693, 12859, 14401, 16633, 18694, 20161, 21083, 21653, 21928, 21838, 21451, 21014, 20550, 19636, 18019, 16235, 15098, 14774, 14890, 15313, 15967, 16091, 14703, 11981, 9254, 7538, 6896, 7295, 8903, 11131, 12467, 11904, 9960, 7883, 6503, 6034, 6219, 6355, 5958, 5516, 5754, 6189, 5590, 4086, 3359, 4306, 5946, 7269, 8639, 10369, 11317, 10251, 7656, 4922, 2667, 1067, 962, 3053, 6401, 9088, 10226, 10336, 10176, 10315, 11415, 13628, 15817, 16610, 16326, 16803, 19059, 22116, 24444, 25765, 26878, 28178, 29038, 28695, 27370, 26125, 25581, 25147, 23870, 21738, 19601, 18106, 17403, 17631, 18710, 19723, 19627, 18688, 18117, 18151, 17743, 16376, 14880, 13963, 13403, 13285, 14419, 16573, 17772, 16722, 14823, 14388, 15779, 17631, 19068]
55113A9068J118P14q4q04j212j831k715k934j860N5J954L011K395L73r26K48K488
55096A9058K871J207NJ48k35j852k543j004O52J94j335j691r01l16J4O16O28q54
55078A4662k412j835N25K116J711N91K49N90P65N53N53J510L393M904M543K554
55062C4972R80J251K687L873M329M085K919J085k71l93L40J483L087M489M291
55047F9207K566J239J182Q44p36j772p30O17k29k319k775j313k28m17n84k42m51
55030F3859j255j199m4N44k88j257j228p03l13K41R23Q24j72q88q98j243k107
55013E4796j783N51K777K506N23n42j35m9j065j586k62J846K734K014Q62O7o67
54996F2587j604k172j726m86Q00J767K442K545J569l23k067k702k206j158r7M74
$$ y = [19068, 20186, 20900, 20816, 20012, 18800, 16969, 14254, 11320, 9460, 9515, 11469, 14480, 16875, 17248, 16322, 16570, 19058, 21929, 23136, 23141, 23289, 23054, 21202, 18659, 17655, 18307, 18501, 17166, 15475, 14574, 14258, 14272, 14888, 15516, 14662, 12250, 10415, 10940, 13056, 14767, 15358, 15607, 16197, 16962, 17515, 18068, 19578, 22971, 27875, 32418, 34972, 35952, 37203, 39890, 43763, 48092, 52177, 55096, 56181, 55910, 55517, 55857, 57340, 60427, 64916, 69207, 71773, 73012, 74194, 75038, 74302, 72530, 71800, 72417, 72188, 69869, 67094, 65781, 65553, 65136, 64552, 64310, 63859, 62604, 61405, 61361, 61905, 61617, 60360, 59132, 58429, 58116, 58357, 59280, 60104, 59932, 59044, 58146, 56903, 54796, 53013, 53564, 56341, 58847, 59370, 58828, 58693, 58644, 57579, 55993, 55731, 57577, 60311, 62325, 63187, 63254, 62587, 60983, 58811, 57085, 56599, 57399, 59166, 61608, 64153, 65722, 65399, 63332, 60630, 58424, 57266, 57169, 57643]
54980E7643J31q70j525j190l64J95O68J765L386M481M322L291K425K425L119L576
54964H3478K991J620N29J75j09r38j884k281k276k216j750n92M35M35J00Q80K523
54947H1120L093J761L4n04l78j031k384k899j709M12K187K999K865K079J272J130
54931I0047J657K020J619Q75N23M32j05j076j701j802k281l643m906m765l248
54916G3646j445j08O07N59j15o19l77J14M40J458L755N582M673J908O15J751K518
54899I4962Q28j440j478L98J971K671L354L713K649Q06K42J513L112L960M591
54884A21852N557O333O359N847N166M507M396N455P284Q545Q483P688P194P508
54870B12174Q456R161Q289N305J464j322k716m155o764r928j2111j2390j1032
$$ y = [57643, 57774, 56904, 55379, 54189, 53825, 54020, 54688, 56453, 59839, 64320, 68642, 71933, 74358, 76783, 79902, 83478, 86469, 88089, 88618, 88793, 88684, 87746, 85862, 83581, 81305, 79089, 77339, 76747, 77182, 77617, 77717, 78597, 81120, 84213, 85974, 86008, 85504, 85126, 84095, 81711, 78812, 77103, 77515, 79702, 82701, 85566, 87645, 88917, 90047, 91704, 93724, 95343, 96218, 96741, 97173, 97068, 95992, 94291, 92489, 90208, 86565, 81659, 76894, 73646, 72201, 72093, 72700, 73259, 73144, 72525, 72148, 72262, 72702, 74160, 77915, 83497, 88170, 90078, 90693, 92444, 94962, 95790, 94350, 92872, 93270, 95241, 97912, 101266, 104979, 107628, 108434, 108676, 110189, 113301, 117261, 121852, 127409, 133742, 140101, 145948, 151114, 155621, 160017, 165472, 172756, 181301, 189784, 197472, 204666, 212174, 220630, 229791, 238080, 243385, 244849, 243527, 240811, 236656, 229892, 219964, 207853, 195463, 184431]
54857A84431r181q013p734p529o920o569p091p633o848m868l084k108j327m19
54843A05107P0k2J46J218K668L585L766L640L567L596L650L867M840P167J0424
54828A57289J3099J4157J4006J3227J1212P278K495j219l606o088r168j1366j1293
54815A90023r588q153q177r311j0171r473p235m844l503k913k206j593j853k630
54801A08373k743k037j405r69J20J790K656K133J424J560J836J201J79R3J050
54786A15261J773J200n10k399l594l880l746l852m350m888n041m437k839o16J167
54771G9249J798J753J721J338j79k404l871l714k277l54J167J424N29P0J155K472
54755G9877J891l07j691j190k08Pk2L73P05N51M33N86K75p66j511j075K99K165
$$ y = [184431, 175250, 167237, 159503, 151974, 145054, 138485, 131394, 123761, 116913, 112045, 108961, 106853, 105526, 105107, 105177, 105155, 105301, 106519, 109187, 112772, 116538, 120178, 123745, 127341, 130991, 134858, 139698, 146865, 157289, 170388, 184545, 198551, 211778, 222990, 230268, 232763, 231544, 227938, 221850, 212682, 201316, 190023, 180435, 172282, 164105, 154794, 144623, 135150, 127915, 123071, 119568, 116655, 114449, 112856, 111003, 108373, 105630, 103593, 102188, 101219, 101339, 103129, 105785, 107918, 109342, 110902, 112738, 113939, 114118, 114211, 115261, 117034, 118234, 117724, 115325, 111731, 107851, 104105, 100253, 95903, 91015, 85974, 81537, 78698, 78082, 79249, 81047, 82800, 84521, 85859, 85680, 83276, 79405, 75691, 73414, 73060, 74227, 75651, 76180, 76250, 77405, 79877, 81768, 81461, 79770, 78580, 78372, 78379, 78357, 78730, 79435, 79986, 80419, 81005, 81280, 80514, 79003, 77928, 78227, 80392]
54737H0392M308N771N255L235J954K317K687J855J217K451M752O238O672O951
54723A36055P166P139P886J0433J3728J5632J5668J5131J4780J4033J2250R448
54711B79349N931K319k55j126j079j428k486l672m475m448l194j438j127l002
54697B59869n017m724k421k24J286L217N627O984O754O434P373R044J0244J0685
54683C15131J0731J0542J0137R573Q665P189N543M440L773K605N16j846l665m719
54669C78615n149n292n871p612j0353j3088j4998j5968j6168j5709j4760j3466
54657B40181j1841j0094q708p727o499m806l598l662m222m068l506l762m737m979
54643A57972l818k106o98K00J08j584l945m628k631K49J622J178K96n3R6M99R20
$$ y = [80392, 84700, 90471, 95726, 98961, 100915, 103232, 105919, 107774, 108991, 111442, 116194, 122432, 129104, 136055, 143221, 150360, 158246, 168679, 182407, 198039, 213707, 228838, 243618, 257651, 269901, 279349, 285280, 287599, 287344, 286218, 285139, 283711, 281225, 277553, 273078, 268630, 265436, 263998, 262871, 259869, 254852, 250128, 247707, 247483, 248769, 251986, 257613, 264597, 271351, 277785, 285158, 294202, 304446, 315131, 325862, 336404, 346541, 356114, 364779, 371968, 377511, 381951, 385724, 388329, 388845, 386999, 383334, 378615, 373466, 368174, 362303, 354691, 344338, 331250, 316252, 300284, 284116, 268407, 253647, 240181, 228340, 218246, 209538, 201811, 195312, 190506, 186908, 183246, 179024, 174956, 171450, 167688, 162951, 157972, 154154, 152048, 151350, 151550, 151658, 150074, 146129, 141501, 138870, 139119, 140741, 141919, 142215, 142162, 142258, 142757, 143677]
54626A43677Q77Q9q54r76j30Q36J068O51M27J067K334L356L657L579L520L285
54610A66463K757K685L747N101N059L370J756J762K928L639L151K218K044K979
54596B09659M072L969K623J707K604M400N030M260L990N344P084P772P986R132
54582B79632J1114J2795J4113J6170J9178K1724K2434K1498K0182J9424J9145
54571D77409J8357J5628J0061K283n655j1788j5666j8189k0201k1604k1929k1309
54559C87397k0337j9081j6935j3845j0963r466r130q890q412q181q120p468o306
54546B40263n968p121q411q071o290m816m489m335l310j937j512k338l476m089
54532A74100m354m740m952m267k833j863k300l761n248o316o823o142l756o24
$$ y = [143677, 144554, 144643, 143789, 142813, 142683, 143519, 144587, 145238, 145665, 146732, 149066, 152422, 156079, 159658, 163178, 166463, 169220, 171905, 175652, 180753, 185812, 189182, 190938, 192700, 195628, 199267, 202418, 204636, 206680, 209659, 213731, 217700, 220323, 222030, 224634, 229034, 234064, 238324, 242314, 247658, 254742, 262514, 270500, 279632, 290746, 303541, 317654, 333824, 353002, 374726, 397160, 418658, 438840, 458264, 477409, 495766, 511394, 521455, 523738, 518083, 506295, 490629, 472440, 452239, 430635, 408706, 387397, 367060, 347979, 331044, 317199, 306236, 296770, 287640, 278750, 270338, 262157, 254037, 246569, 240263, 234295, 227174, 218763, 210692, 204402, 199586, 195097, 190762, 187452, 185515, 184003, 181665, 178189, 174100, 169746, 165006, 160054, 155787, 152954, 151091, 148791, 145030, 139782, 133466, 126643, 120501, 116745, 116121]
54518A16121J253J007k39j029j220j371j481j293j254j980l011l116j927m03N37
54503A00594R94J373J477Q93m2l75L91J690K454K088R54J20M68J851L138L325
54487A21393K514J551Q76L06j13J71J200K051K109K265L792O319Q082Q201P567
54472A68284P238P206P226P635Q552R297R486R761J0436J0385Q569N886L938K595
54458B76494M34k748n625p504q933j0019r921q682p823q302r196r326q819q144
54444A71886o969n234m133m540n289m540k321k40Q50J317J164j96k397l862l704
54429A31792k735k016j511q55m82r34j661j538m04P78J235J053N56j46o18R6K245
54412A24855M308M207J864k73J01K513M541M826M143L496K555P26j194j675m75
$$ y = [116121, 117374, 118381, 118142, 117113, 115893, 114522, 113041, 111748, 110494, 108514, 105503, 102387, 100460, 100057, 100594, 101588, 102961, 104438, 105331, 105289, 104914, 105305, 106995, 109449, 111537, 112491, 112611, 113079, 114930, 118068, 121393, 123907, 125458, 126334, 126640, 126527, 126698, 127898, 129949, 132058, 134323, 138115, 144434, 152516, 160717, 168284, 175522, 182728, 189954, 197589, 206141, 215438, 224924, 234685, 245121, 255506, 264075, 269961, 273899, 276494, 276928, 274180, 268555, 261051, 252118, 242099, 232178, 223496, 215673, 207371, 198175, 188849, 180030, 171886, 164917, 159683, 155550, 151010, 145721, 141181, 138860, 138620, 139470, 140787, 141951, 141755, 139358, 135496, 131792, 129057, 127041, 125530, 124675, 124193, 123259, 121598, 120060, 119656, 120434, 121669, 122722, 123278, 123132, 122514, 122610, 124855, 129163, 133370, 135234, 134961, 135062, 137575, 142116, 146942, 151085, 154581, 157136, 157862, 156668, 154993, 154518]
54397A54518R56J157J1j604k724k699j452J34O35m70k002k251r75L85M73n11j361
54380A42220j444j161j073j250j493j634j474r61o14j135k240k578j445J21P18
54365A24557M51L57M89M3p97q13K6N5j491k828j918O07K365K425J921J871K076
54348A29396K305K911L714L657K423J322J560K438K401J415J061K301M229N371
54334A66504N332M673L775K586J171q1r02j374j675j919k313k973l510l220k076
54319A63998j175j684l415m929n002l623j568M00J734K055J390K99o35j332k031
54304A44482k644k647j628K35K199L427L459K511J376R48J597K851L645L154J584
54289A64549J20j63O28J336J024m3o76m6J327J966J033n46j039j16O25j95j809
$$ y = [154518, 155474, 156631, 156642, 155038, 152314, 149615, 148163, 148297, 148932, 148462, 146460, 144209, 143234, 143619, 144092, 143581, 142220, 140776, 139615, 138542, 137292, 135799, 134165, 132691, 131730, 131116, 129981, 127741, 125163, 123718, 123839, 124557, 125008, 125365, 125854, 125897, 125100, 124287, 124313, 124368, 122877, 120049, 118131, 118738, 121103, 123528, 125449, 127320, 129396, 131701, 134612, 138326, 141983, 144406, 145728, 147288, 149726, 152127, 153542, 154603, 156904, 161133, 166504, 171836, 176509, 180284, 182870, 184041, 183960, 183058, 181684, 180009, 178090, 175777, 172804, 169294, 166074, 163998, 162823, 161139, 157724, 152795, 147793, 144170, 142602, 143002, 144736, 146791, 148181, 148480, 147845, 146513, 144482, 141838, 139191, 137563, 137798, 139997, 143424, 146883, 149394, 150770, 151718, 153315, 156166, 159811, 162965, 164549, 164669, 164506, 165134, 166470, 167494, 167451, 166775, 166729, 168056, 170022, 171055, 170509, 169470, 169354, 169979, 169784, 167975]
54272A67975k450j891j533k117k738k559k155k429l212l820m141m299l996l191
54258A27444k717l061l190j924r8K87j026k138j800r92r97j334q14L97J047O19
54242A09703l05j158j759j798r57L16J009N50r01k911m759n221l632j247l20j326
54226H5284k143p67K036L715K958Q15q89j274o33K29O90P26P12P85P80R51J968
54209I5943L596M218K652p7j879k156j925j786j316n19k02m68l97J48o1j428k257
54192I2086r04J792L599L604K521J082l85j258j015k54m3m01n41m68r27j768j794
54175I4926n61Q46J370J297J491K089K527K310J360N0p51k73J319K910L494K961
54159A17365J818O18k18m29J07J376K910L466J869j251l412k911r05K13k11j007
$$ y = [167975, 165525, 163634, 162101, 159984, 157246, 154687, 152532, 150103, 146891, 143071, 138930, 134631, 130635, 127444, 124727, 121666, 118476, 116552, 116454, 116741, 115715, 113577, 111777, 110785, 109788, 108454, 107640, 108037, 109084, 109703, 109398, 108240, 106481, 104683, 103726, 104042, 105051, 105601, 104700, 101789, 97030, 91809, 88177, 86930, 86610, 85284, 83141, 82374, 84410, 88125, 91083, 91898, 91009, 89735, 89102, 89331, 90021, 90747, 91459, 92244, 93024, 93975, 95943, 99539, 103757, 106409, 106332, 104453, 102297, 100372, 98586, 97270, 96751, 96549, 96081, 95684, 95832, 95771, 94343, 92086, 91182, 92974, 96573, 100177, 102698, 103780, 103395, 102137, 101122, 100868, 100825, 100424, 99883, 99415, 98488, 96720, 94926, 94365, 95211, 96581, 97878, 99369, 101458, 103985, 106295, 107655, 107705, 106954, 106681, 108000, 110910, 114404, 117365, 119183, 119801, 119583, 119154, 119261, 120637, 123547, 127013, 128882, 127631, 124219, 121308, 120403, 120616, 120405, 119398]
54143A19398j412j650j588o83N15N86n94j503j286q42j093j613j756j701j554
54128A03224p65O11J344O67n44j213j550k105k398j669k46Q79J199P14l12r42
54112I6894n6J764K223M03j473r63R53J198j058l423l549j653M21J212M19j197
54096I2115k351k361j737j240p53J04Q67Q35L25J96L72J4j127k470l465l654k462
54079G3208j40J577J185n39j586j403r86o35M43K169L141K611J393L49m50p63
54063G9574L3J540K300J841J264J070P2k296m131l242k49K101K282J189K82q9
54047H3541l37o29o66p3J182K554L214K766J532L6j366k326k428j560%J843L347
54030I0630L544K043P9n12L08P22j36o96N48K392K361K40j612j361K98J606J927
$$ y = [119398, 117986, 116336, 114748, 114065, 114580, 115166, 114572, 113069, 111783, 110941, 109848, 108235, 106479, 104778, 103224, 102459, 103070, 104414, 105081, 104537, 103324, 101774, 99669, 97271, 95602, 95356, 96235, 97434, 98148, 97836, 96894, 96838, 98602, 100825, 101228, 99755, 98792, 99745, 100943, 99885, 96462, 92913, 91260, 91681, 92893, 93312, 92115, 89764, 87403, 85666, 84426, 83673, 83777, 84644, 85479, 85804, 86000, 86372, 86386, 85259, 82789, 79324, 75670, 73208, 73068, 74645, 75830, 75291, 73705, 72302, 71316, 70681, 71124, 73293, 76434, 79045, 80438, 80787, 80337, 79574, 79607, 81147, 83447, 85288, 86552, 87622, 87694, 85398, 81267, 78025, 77776, 79877, 82159, 83348, 83630, 83541, 83204, 82575, 81909, 81836, 83018, 85572, 88786, 91552, 93084, 93120, 91754, 89428, 87000, 85440, 85440, 87283, 90630, 94174, 96217, 96296, 95784, 96092, 96814, 96678, 95982, 96530, 98922, 101283, 101523, 99911, 98550, 98848, 100454, 102381]
54013A02381J832J795J572P24o79j877k089j308l05L92J156K512M026M601L686
53998A18419J796r4j022k31K155M441M387J658j277j609P15L118L589K672K041
53983A40758K169K413K690L576M747M799L276J781K059L716M958N173N527P099
53969A94741R513J1475J1935J0658Q610P629Q677J0271R797O710L306J910K437
53956B97669L338L736L601K861J661R51J422K230J897L57j098j880k886m874p093
53941C01892q193p820o836o276o447o747o189m483k771k694m446o294o561n475
53927B20660m402l753k734j144j60p02j918k173j156k0M05N14Q55J098O83p3k41
53910B05739N29J557J803P05j391l334l897k797r72L60P91P03N52N44P49J121
$$ y = [102381, 104213, 106008, 107580, 108304, 107625, 105748, 103659, 102351, 102046, 102438, 103594, 106106, 110132, 114733, 118419, 120215, 120121, 119099, 118868, 121023, 125464, 129851, 131509, 130232, 128623, 129338, 132456, 136045, 138717, 140758, 142927, 145340, 148030, 151606, 156353, 161152, 164428, 166209, 168268, 171984, 176942, 182115, 187642, 194741, 204254, 215729, 227664, 238322, 246932, 254561, 263238, 273509, 283306, 290016, 293322, 295232, 297669, 301007, 304743, 308344, 311205, 312866, 313817, 315239, 317469, 319366, 319723, 318625, 316745, 313859, 308985, 301892, 293699, 285879, 279043, 272767, 266320, 259573, 253384, 248901, 246130, 243436, 238990, 232696, 226135, 220660, 216258, 212505, 209771, 208627, 208467, 207765, 205847, 203674, 202518, 202498, 202903, 203417, 204272, 205370, 206053, 205980, 205739, 206268, 207825, 209628, 210333, 208942, 205608, 201711, 198914, 197942, 198302, 199093, 199796, 200348, 200892, 201641, 202762]
53894B02762J477J619J424O91n94j739j776p63O9N4K40J957M720O647O655N274
53878B28717L599K463K544M063O180P476P296O014M226K480J579K044L191L701
53864B85573L125K007P64l54l49J832N390P895Q043O973O313O265O304O457O914
53849C53152P341P572Q045Q725Q561P123N745N779O380N468K532p56k586k664
53835D20417j927j457j746k467l029l520m643o331p307o747n610n363o080o791
53821C57399p143p491p776p562p145p345q249r034r114q525p261n327l514l089
53807B58824m312n977o787o557n894n252m692m174l731l485l480l392k724j587
53793A96780r26j413k460k952k677k337k487l129m107m970m742k835l47P18k46
$$ y = [202762, 204239, 205858, 207282, 207973, 207379, 205640, 203864, 203101, 203170, 203224, 203464, 205421, 210141, 216788, 223443, 228717, 232316, 234779, 237323, 241386, 247566, 255042, 262338, 268352, 272578, 275058, 276637, 278681, 281872, 285573, 288698, 290705, 291469, 291115, 290766, 292598, 297988, 305883, 313926, 320899, 327212, 333477, 339781, 346238, 353152, 360493, 368065, 376110, 384835, 393396, 400519, 406264, 412043, 418423, 423891, 426423, 425667, 423081, 420417, 418490, 417033, 415287, 412820, 409791, 406271, 401628, 395297, 387990, 381243, 375633, 370270, 364190, 357399, 350256, 342765, 334989, 327427, 320282, 312937, 304688, 295654, 286540, 278015, 270754, 265427, 261913, 258824, 254512, 248535, 241748, 235191, 229297, 224045, 219353, 215179, 211448, 207963, 204483, 201091, 198367, 196780, 195854, 194441, 191981, 189029, 186352, 184015, 181528, 178399, 174292, 169322, 164580, 161745, 161398, 162116, 161870]
53778A61870j620j499J78J742J562m74k867l676k255J31J673J910J738J746J536
53763A61695Q22L41R42K245K843J939M84L98K409M770M774J936j002j056J588
53748A85128M111M733M348M450M934M857M335M526O035Q152R583R446P822N828
53734B68288M922N596O778O999O107N356N757O766O838N077K127m42j335l44J557
53719C30047K704J850o85l091l835l287l046l767m525m464m057m135m511m470
53705B90728m010l771l930m060l877l397k620j777j720l076n028n819m723k807
53691B40113j544j191r48k46N11M35p10k099k780k934l502m447m333k325K82J485
53675B15767R40j35q54j229j201n68J64J02o94j275j257j145j063m29Q53K024
$$ y = [161870, 160250, 158751, 158929, 160671, 162233, 161759, 158892, 155216, 152961, 153092, 154765, 156675, 158413, 160159, 161695, 162517, 162858, 163800, 166045, 168888, 170827, 171311, 171709, 174118, 178888, 183662, 185598, 184596, 183540, 185128, 189239, 193972, 198320, 202770, 207704, 212561, 216896, 221422, 227457, 235609, 245192, 254638, 262460, 268288, 273210, 278806, 285584, 292583, 298690, 304046, 309803, 316569, 323407, 328484, 330611, 330169, 328834, 328490, 330047, 332751, 334601, 333916, 330825, 326990, 323703, 320657, 316890, 312365, 307901, 303844, 299709, 295198, 290728, 286718, 282947, 279017, 274957, 271080, 267683, 265063, 263286, 261566, 258490, 253462, 247643, 242920, 240113, 238569, 237378, 236430, 236184, 236695, 237130, 236420, 234321, 231541, 228607, 225105, 220658, 216325, 214000, 214282, 215767, 216707, 216572, 215718, 214489, 213288, 212720, 212884, 212986, 212292, 211017, 209760, 208615, 207552, 207123, 207976, 210000]
53659B10000K656L168L744L815L131K378K216K525L003L572L826L102J784J357
53645B50277K455L722L626K561K156L018M226M736M366L599L080L240L974M786
53631B99822N515O513P759Q428P805O245M706L737L252K881K231J296R30K112
53617C63232M311N387L974J283k21M18K029K949K519J240K79N92J897K609J466
53602C93964r67k915l253k283j033l27l59o20m45J7k06j534k983l322k500j349
53586C69885k93O85J304J175N52M4k76o48p45qJ219J850J531J075J196J553J441
53569C81540Q66N06Q48J681K444K965L730N051O141N802M338L660M811O352O414
53554D37149N494N545O802P459O656N813O222P042O941O464P171R015J0182R595
$$ y = [210000, 212656, 215824, 219568, 223383, 226514, 228892, 231108, 233633, 236636, 240208, 244034, 247136, 248920, 250277, 252732, 256454, 260080, 262641, 264797, 267815, 272041, 276777, 281143, 284742, 287822, 291062, 295036, 299822, 305337, 311850, 319609, 328037, 335842, 342087, 346793, 350530, 353782, 356663, 358894, 360190, 361120, 363232, 367543, 372930, 376904, 378187, 377966, 378384, 380413, 383362, 385881, 387121, 387400, 387992, 389889, 392498, 393964, 392997, 390082, 386829, 384546, 383513, 383186, 382827, 382207, 381762, 381779, 381573, 380039, 377056, 373734, 371234, 369885, 369592, 370277, 371581, 372756, 373308, 373352, 373076, 372428, 371683, 371675, 372894, 374744, 376275, 377350, 378546, 380099, 381540, 382406, 382912, 383760, 385441, 387885, 390850, 394580, 399631, 405772, 411574, 415912, 419572, 424383, 430735, 437149, 442643, 448188, 454990, 462449, 469105, 474918, 481140, 488182, 495123, 501587, 508758, 517773, 527955, 537550]
53540E37550Q319Q064R065J0025R772Q484P312P130P816Q594Q691P736N901M038
53526F48497L322M152N528N997N220M096L302K451J047l63n17R98L007L693K412
53511F92842M60k28P89J937J567n2j234j078m45o38j876l336m254m464m132l341
53495F72517k167j030o28j111j490o20J055J786J019N57K181M902O131N005L082
53480F91189J952J882K798M739O845P582O769O009O432P468Q479R924J1818J2818
53466G86704J2414J2495J4733J7694J8785J8331J9088K2010K5064K6548K7182
53455A001048K8041K8646K8484K8663L0416L3037L4945L6032L7519L9860M2223
53444A368914M3976M5416M6905M8241M9220N0144N1385N2905N4403N5612N6274
$$ y = [537550, 545869, 553933, 562998, 573023, 582795, 591279, 598591, 605721, 613537, 622131, 630822, 638558, 644459, 648497, 651819, 655971, 661499, 667496, 672716, 676812, 680114, 682565, 683612, 683249, 682732, 683730, 686737, 690430, 692842, 693302, 693074, 693863, 695800, 697367, 697315, 696081, 695003, 694558, 693920, 692044, 688708, 684454, 679990, 675858, 672517, 670350, 669320, 668692, 667581, 666091, 665471, 666526, 668312, 669331, 669888, 672069, 676971, 683102, 688107, 691189, 693141, 695023, 697821, 702560, 709405, 716987, 723756, 729765, 736197, 743665, 752144, 762068, 773886, 786704, 799118, 811613, 826346, 844040, 862825, 881156, 900244, 922254, 947318, 973866, 1001048, 1029089, 1057735, 1086219, 1114882, 1145298, 1178335, 1213280, 1249312, 1286831, 1326691, 1368914, 1412890, 1458306, 1505211, 1553452, 1602672, 1652816, 1704201, 1757106, 1811509, 1867121, 1923395]
53433A923395N6216N5627N5121N5233N5875N6388N6225N5575N5274N5862N6834
53422B537625N7069N6098N4657N3760N3526N3179N2066N0308M8406M6470M4200
53411C107364M1622L9439L8170L7028L4508L0403K6505K4533K3907K2583J9716
53400C445778J6256J2978R291M462j174o785j1898j6035j8580j9813k1251k4052
53388C369177k7779l1574l5577m0033m3860m5624m5588m5352m5726m6238m6563
53377B915263m6969m7391m7486m7658m8549m9174m7342m2581l7249l3763l1919
53366B435182k9983k7327k4653k2146j8940j4538r804o190m146k557J41M194Q301
53353B287534J1622J5297K0845K7515L2841L5822L7834M0058M2158M4200M7618
$$ y = [1923395, 1979611, 2035238, 2090359, 2145592, 2201467, 2257855, 2314080, 2369655, 2424929, 2480791, 2537625, 2594694, 2650792, 2705449, 2759209, 2812735, 2865914, 2917980, 2968288, 3016694, 3063164, 3107364, 3148986, 3188425, 3226595, 3263623, 3298131, 3328534, 3355039, 3379572, 3403479, 3426062, 3445778, 3462034, 3475012, 3484303, 3488765, 3487591, 3480806, 3468908, 3452873, 3434293, 3414480, 3393229, 3369177, 3341398, 3309824, 3274247, 3234214, 3190354, 3144730, 3099142, 3053790, 3008064, 2961826, 2915263, 2868294, 2820903, 2773417, 2725759, 2677210, 2628036, 2580694, 2538113, 2500864, 2467101, 2435182, 2405199, 2377872, 2353219, 2331073, 2312133, 2297595, 2287791, 2281601, 2277455, 2274898, 2275039, 2279233, 2287534, 2299156, 2314453, 2335298, 2362813, 2395654, 2431476, 2469310, 2509368, 2551526, 2595726, 2643344]
53342B643344N2678N6962N8478N8841O1041O5168O8937P1769P5497Q0904Q6291
53331C379910R0224R3562R7706J02467J06707J09909J12348J14642J17602J21417
53321D446494J24759J25927J25190J24466J24279J22843J19017J14381J10970
53312E538326J08381J04732R9489R3668Q7844Q1578P4559O7096N9598N2475M6243
53301F413989M0681L4379K6038J5916N151n770j6788k7175l6237m4939n5207o7464
53289F282574q0134r1698j01966j10868j17560j21517j23458j24265j23910j22378
53279E164820j20895j20863j21873j21966j20032j17030j14635j13484j13082
53270D100960j12634j11367j08484j03704r7834r2156q7198q2499p7583p2507
$$ y = [2643344, 2696022, 2752984, 2811462, 2870303, 2931344, 2996512, 3065449, 3137218, 3212715, 3293619, 3379910, 3470134, 3563696, 3661402, 3763869, 3870576, 3980485, 4092833, 4207475, 4325077, 4446494, 4571253, 4697180, 4822370, 4946836, 5071115, 5193958, 5312975, 5427356, 5538326, 5646707, 5751439, 5850928, 5944596, 6032440, 6114018, 6188577, 6255673, 6315271, 6367746, 6413989, 6454670, 6489049, 6515087, 6531003, 6536154, 6530384, 6513596, 6486421, 6450184, 6405245, 6350038, 6282574, 6202440, 6110742, 6008776, 5897908, 5780348, 5658831, 5535373, 5411108, 5287198, 5164820, 5043925, 4923062, 4801189, 4679223, 4559191, 4442161, 4327526, 4214042, 4100960, 3988326, 3876959, 3768475, 3664771, 3566937, 3474781, 3387583, 3305084, 3227501, 3154994]
53260C154994o7371o2055n6891n2816n0157m7866m4818m1365l8580l6374l3605
53249B623096l0012k6551k3564k0036j5477j1231q863q037p163n524l610j647
53237B461381R09M335Q063J1428J4400J7283K0154K2862K5467K8502L2633L7829
53225B685246M2921M6513M8400M9607N0925N2147N3001N3810N4623N4520N2730
53214C244443M9886M7295M5400M3809M2213M0268L7084L2115K6379K1634J8429
53203C648955J5926J3393J0610O905J401n412j1676j6418k0641k5543l0726l5218
53191C551556l9401m4631n1095n7125o0894o2308o2972o4514o7088o9495p0751
53180B901282p1104p1149p0489o8279o5025o2602o1957o1866o0730n8752n7294
$$ y = [3154994, 3087623, 3025568, 2968677, 2915861, 2865704, 2817838, 2773020, 2731655, 2693075, 2656701, 2623096, 2593084, 2566533, 2542969, 2522933, 2507456, 2496225, 2487362, 2479325, 2472162, 2466638, 2463028, 2461381, 2462290, 2466625, 2474688, 2486116, 2500516, 2517799, 2537953, 2560815, 2586282, 2614784, 2647417, 2685246, 2728167, 2774680, 2823080, 2872687, 2923612, 2975759, 3028760, 3082570, 3137193, 3191713, 3244443, 3294329, 3341624, 3387024, 3430833, 3473046, 3513314, 3550398, 3582513, 3608892, 3630526, 3648955, 3664881, 3678274, 3688884, 3695789, 3697190, 3691778, 3680102, 3663684, 3643043, 3617500, 3586774, 3551556, 3512155, 3467524, 3416429, 3359304, 3298410, 3236102, 3173130, 3108616, 3041528, 2972033, 2901282, 2830178, 2759029, 2688540, 2620261, 2555236, 2492634, 2430677, 2368811, 2308081, 2249329, 2192035]
53169B192035n6702n6155n5395n5141n5471n5068n2802m9253m5782m2808l9954
53158A627504l7370l5510l3743l0674k6493k3613k3853k5850k6680k5545k4307
53147A313866k4426k5195k5458k5413k5599k5306k3541k0935j9290j9329k0039
53136A059335k0200j9630j8815j8210j8078j8475j9130j9720k0137k0185j9428
53125H47327j7918j6684j6649j7367j7653j7261j6906j6809j6360j5410j4642
53114F63668j4309j3581j1767r339p343o377o653q135j0043j0977j0343r185q811
53101E36805r068q751p433n971n177m901m640m465m820n675o325o102n177m452
53087D53848m662n641o528o661o148n637n651o081o248n617m396l319k664j941
$$ y = [2192035, 2135333, 2079178, 2023783, 1968642, 1913171, 1858103, 1805301, 1756048, 1710266, 1667458, 1627504, 1590134, 1554624, 1520881, 1490207, 1463714, 1440101, 1416248, 1390398, 1363718, 1338173, 1313866, 1289440, 1264245, 1238787, 1213374, 1187775, 1162469, 1138928, 1117993, 1098703, 1079374, 1059335, 1039135, 1019505, 1000690, 982480, 964402, 945927, 926797, 907077, 886940, 866755, 847327, 829409, 812725, 796076, 778709, 761056, 743795, 726889, 710080, 693720, 678310, 663668, 649359, 635778, 624011, 614672, 607329, 600952, 594299, 586164, 576121, 565144, 554801, 545616, 536805, 527737, 518986, 511553, 505582, 500405, 495504, 490864, 486399, 481579, 475904, 469579, 463477, 458300, 453848, 449186, 443545, 437017, 430356, 424208, 418571, 412920, 406839, 400591, 394974, 390578, 387259, 384595, 382654]
53073C82654q20P3k16j651l038l210k014k96P80N19p40j890k135j744j500j712
53057C63060k220k902l577l709k922j782j329j873k773l314l282k746k015j743
53043C26873k394l495m056l730l140l118l980n317o012m953k533q79j557l471
53029B78238m261l421k536k641l013k844k335j636l66J064J275R7n96M94J940
53014B59459J631m7q71%J249J760J933K398K818K691K353K385K572K236J428J020
52998B85015J431J777Q40j316l408m692n647o465o042l802j571j761l902n028
52984B45429l871k455k803m097m502m078l973l987l029j428q80k078l939n125
52970A99184n111l813j574M39R83R4j131k099l049l948m172l524k593j883j354
$$ y = [382654, 381834, 381907, 381691, 380040, 377002, 373792, 371778, 371482, 372262, 372781, 372041, 370151, 368016, 366272, 364772, 363060, 360840, 357938, 354361, 350652, 347730, 345948, 344619, 342746, 339973, 336659, 333377, 330631, 328616, 326873, 324479, 320984, 316928, 313198, 310058, 306940, 302960, 297643, 291631, 286678, 284145, 283266, 281709, 278238, 273977, 270556, 268020, 265379, 262366, 259522, 257187, 255551, 255185, 256249, 257524, 257621, 257025, 257519, 259459, 261090, 261043, 260172, 260172, 261421, 263181, 265114, 267512, 270330, 273021, 275374, 277759, 280331, 282567, 283995, 285015, 286446, 288223, 289063, 287747, 284339, 279647, 274000, 267535, 261493, 257691, 256120, 254359, 250457, 245429, 241558, 239103, 236300, 232203, 227701, 223623, 219650, 215663, 212634, 211206, 210326, 208248, 204309, 199184, 194073, 190260, 188686, 189125, 190108, 190202, 189071, 186972, 183923, 179975, 175803, 172279, 169686, 167803, 166449]
52955A66449j002r99j094p45j67l70j748l258l582k583j162j21M27P51J138J678
52939A53612K210K469K412K291K270K084J305p2j295j371o6J689K708K746K510
52924A75502K494K391J715N06q12j824k168j718r34n21n35l22M62J361J868J922
52908A79387J519O25j06M09K121L451L171J853P78L05J38K98P48Q02J14l63N05
52891A95755K326L684L884L267K346J600J547J990J796N31m09L34J859K291J753
52876B24554K115L941N618N732M611L170J769P83P83J532J938J572J206J517K262
52861B63103L116M183N274N733N417M931M660M485M554N105N396M166J570o71
52847C21022j445j268p03N46K195K744J502J5kQ79P33r89l044m197m205l293j858
$$ y = [166449, 165447, 164448, 163354, 162609, 162442, 162072, 160324, 157066, 153484, 150901, 149739, 149618, 150045, 150796, 151934, 153612, 155822, 158291, 160703, 162994, 165264, 167348, 168653, 168581, 167286, 165915, 165849, 167538, 170246, 172992, 175502, 177996, 180387, 182102, 182608, 181796, 179972, 177804, 176086, 175152, 174631, 174096, 173774, 174236, 175597, 177465, 179387, 180906, 181531, 181425, 181834, 183955, 187406, 190577, 192430, 193208, 193513, 193651, 193949, 194697, 195499, 195613, 195250, 195755, 198081, 201765, 205649, 208916, 211262, 212862, 214409, 216399, 218195, 218726, 218317, 218651, 220510, 222801, 224554, 226669, 230610, 236228, 241960, 246571, 249741, 251510, 252293, 253076, 254608, 256546, 258118, 259324, 260841, 263103, 266219, 270402, 275676, 281409, 286826, 291757, 296417, 300902, 305456, 310561, 315957, 320123, 321693, 321022, 319577, 318309, 317606, 318152, 320347, 323091, 324593, 324608, 324606, 325485, 326218, 325229, 322185, 317988, 313783, 310490, 308632]
52830C08632n30K29O32R71Q74j16j520k246j922j272j127j473j536o69P76J581
52814C01284R78l53j144j235j482k115k369j919j437j223n43R51K260K386J718
52799B95757J190Q69L54k82p87j223j295j52K123L791L546K491K598L796M262
52784C17038L183J601N19k57j190k181k970l329k697p44J483K136O90j364k381
52769C09537k318k175k409k459j610K6J291R60q22k403k551k004k236l173l399
52754B84255k534j818j988k106j291l60n42j494j833j156k18O35J770K885K724
52739B76929R69n91n9J880K526O69j775k328j186o27j622k684k278r55k01l96
52723B68271j022k015l514m639m148k372j152j521k553k999k944l148l558l375
$$ y = [308632, 308102, 308331, 308963, 309934, 310808, 310692, 309172, 306926, 305004, 303732, 302605, 301132, 299596, 298927, 299703, 301284, 302262, 301909, 300765, 299530, 298048, 295933, 293564, 291645, 290208, 288985, 288442, 289393, 291653, 294039, 295757, 296947, 297816, 298170, 297888, 297101, 295878, 294583, 294431, 296554, 300345, 303891, 306382, 308980, 312776, 317038, 320221, 321822, 322341, 322084, 320894, 318713, 315743, 312414, 309717, 308973, 310456, 312592, 313282, 311918, 309537, 307219, 305044, 302635, 300176, 298566, 298592, 299883, 300843, 300021, 297618, 295067, 293063, 290827, 287654, 284255, 281721, 279903, 277915, 275809, 274518, 274158, 273616, 272122, 270289, 269133, 268915, 269550, 271320, 274205, 276929, 277898, 277307, 277248, 279128, 281654, 282323, 280548, 278220, 277034, 276407, 274785, 272101, 269823, 268868, 268667, 268271, 267249, 265234, 261720, 257081, 252933, 250561, 249409, 247888, 245335, 242336, 239392, 236244, 232686, 229311]
52709B29311k263p87J32j66j634l266l781l066k538l372m804n017l556j899j470
52694A91824k055k601k780k909k899k259j187p05j394k567l146k856k170j507
52680A60789j103j289k124k879k641j611r93j363j806j210J89J111Q49j7m36n7
52664A45409M76K23r39j948j569R7J668K194K170K345K296J113q61k070j718p72
52648A48114n81j215j686j442r88j098j841k515k379j331k5O66L10q00j893k334
52632A28962k031j303m59L64R60J080R94J546L027M253L644J322p42j066k15M50
52616A40786P19J177J497N00j985m298m513k353P05K782K903J557L21O07K304
52601A42709L763L531J962P93J141K368L132K923K095Q18r19k220j551J067L242
$$ y = [229311, 227048, 226261, 226393, 226227, 224593, 221327, 217546, 214480, 211942, 208570, 203766, 198749, 195193, 193294, 191824, 189769, 187168, 184388, 181479, 178580, 176321, 175134, 174429, 173035, 170468, 167322, 164466, 162296, 160789, 159686, 158397, 156273, 153394, 150753, 149142, 148149, 146786, 144980, 143770, 143959, 145070, 145919, 145902, 145466, 145409, 145885, 146108, 145169, 143221, 141652, 141749, 143417, 145611, 147781, 150126, 152422, 153535, 152674, 150604, 148886, 148114, 147533, 146318, 144632, 143190, 142202, 141104, 139263, 136748, 134369, 133038, 133013, 133679, 133989, 133189, 131296, 128962, 126931, 125628, 125169, 125533, 126493, 127573, 128567, 130113, 133140, 137393, 141037, 142359, 141617, 140551, 140336, 140786, 141505, 142682, 144179, 144679, 142694, 138396, 133883, 131530, 132235, 135017, 137920, 139477, 139798, 140405, 142709, 146472, 150003, 151965, 152758, 153899, 156267, 159399, 162322, 164417, 165235, 164316, 162096, 160545, 161612, 164854]
52586A64854K848R18L10J794L228K876J687J433K081K307J617O60L4j15J65M39
52570A87136N4p49o88O89J962J849J153J185J245k79k821l951k863j320p46n03
52554A81353J47M36l44j195p57P40K095K771K779J866O7j574j971j342n23M08
52538A84956J706K709K360Q52m47p31l62K59J316K748L805L834L070K231J786
52523B10092J796J989J882J276P36J079K258L295L484L063K524J910J228R94J610
52508B39216K544K829K289J670J455J204L62p55j222n72P34J794J950J147n1q04
52492B53790p87n69q54j289o91J208K917K742Q36j004j470q60r4M29O96N80J19
52475B55699j57J41O16O00J09k99l92l66k02L64J173J623J575J602K003K226J742
$$ y = [164854, 167702, 168620, 168930, 170724, 173952, 176828, 178515, 179948, 182029, 184336, 185953, 186613, 186647, 186532, 186697, 187136, 187190, 186441, 185753, 186442, 188404, 190253, 191406, 192591, 193836, 193557, 190736, 186785, 183922, 182602, 181856, 181353, 181500, 181936, 181592, 180397, 179640, 180380, 182475, 185246, 188025, 189891, 189958, 188384, 186413, 185071, 184548, 184956, 186662, 189371, 191731, 192583, 192136, 191405, 191043, 191302, 192618, 195366, 199171, 203005, 206075, 208306, 210092, 211888, 213877, 215759, 217035, 217771, 218850, 221108, 224403, 227887, 230950, 233474, 235384, 236612, 237606, 239216, 241760, 244589, 246878, 248548, 250003, 251207, 251569, 250814, 249592, 249020, 249754, 251548, 253498, 254645, 254594, 253790, 253003, 252434, 251580, 250291, 249600, 250808, 253725, 256467, 257303, 256299, 254829, 253969, 253875, 254304, 255000, 255580, 255699, 255542, 255683, 256299, 256899, 257008, 256709, 256317, 255951, 255749, 256113, 257286, 258909, 260484, 262086, 264089, 266315, 268057]
52458B68057Q89J51q64k692m554m793l034q41J68jm27o94p50j63J270K601K653
52441B56976J757J415K122K640J794r7j936l099l415k747j329J04J120J991K763
52426B60059K656J211o05j363r41m21l98l09M52J468J673O00q68j041Q52L367
52410B66392L958J726j550l578l885l359k513j487j032j871l193l209j388J032
52396B46043K801L725L792K694P84o60q22j86N38J360K282K633K001J079O33L01
52380B68998n50j390j261n89p87j914k184n45J499J769L99m94R8Q29K45j131k002
52363B60990k397l111l750l132j600r81j761k169r73N01O03R5Q10K536L361K709
52347B51731K008K352L138L360K747J469L1m29Q12K624L104K179J498J611J258
$$ y = [268057, 268946, 269097, 268233, 265541, 260987, 256194, 253160, 252319, 252487, 252486, 252059, 251365, 250615, 250452, 251722, 254323, 256976, 258733, 260148, 262270, 264910, 266704, 266607, 264671, 261572, 258157, 255410, 254081, 254185, 255305, 257296, 260059, 262715, 263926, 263321, 261958, 261017, 260596, 260198, 259889, 260341, 261809, 263482, 264082, 263214, 262173, 263025, 266392, 270350, 272076, 270526, 266948, 263063, 259704, 257191, 255704, 254672, 252801, 249608, 246399, 245011, 246043, 248844, 252569, 256361, 259055, 259839, 259179, 258357, 258171, 258709, 260069, 262351, 264984, 266985, 268064, 268697, 268998, 268448, 267058, 265797, 265208, 264421, 262507, 260323, 259778, 261277, 263046, 263445, 262951, 263049, 263878, 264123, 262992, 260990, 258593, 255482, 251732, 248600, 247000, 246019, 244258, 242089, 241116, 241617, 242220, 242315, 243125, 245661, 249022, 251731, 253739, 256091, 259229, 262589, 265336, 266805, 266836, 266407, 267219, 269843, 272947, 275126, 276624, 278235, 279493]
52332B79493L3l79J141L082L400K269J241P23J04l67K97K021L413L409K315J120
52316C03315N74P10Q18J80q28q80N02K170K983L350M201N229N369M478L400K764
52300C38335K698L315M378M854L958K370J420J399J651J932K440K865K674K253
52286C76542K470L223L654L761M385N442N672M493K910K045J918K189K943M006
52272D25653M529M064L363L261L510L527L617M529O080P243P550P637Q273R452
52258E02288J0609J1397J1897J2364J2900J3462J4082J5010J6528J8602K0719
52247F59858K2131K2326K1527K0755K1139K3022K5781K8500L0487L1332L1147
52236I38005L0837L1289L1941L1158K8641K6428K6422K7768K8085K6722K5068
$$ y = [279493, 279526, 279147, 280288, 283370, 286770, 289039, 290280, 291003, 291107, 290740, 291037, 293058, 296471, 299880, 302195, 303315, 303889, 304599, 305417, 305597, 304769, 303889, 304391, 306561, 309544, 312894, 317095, 322324, 327693, 332171, 335571, 338335, 341033, 344348, 348726, 353580, 357538, 359908, 361328, 362727, 364378, 366310, 368750, 371615, 374289, 376542, 379012, 382235, 385889, 389650, 394035, 399477, 405149, 409642, 412552, 414597, 416515, 418704, 421647, 425653, 430182, 434246, 437609, 440870, 444380, 447907, 451524, 456053, 462133, 469376, 476926, 484563, 492836, 502288, 512897, 524294, 536191, 548555, 561455, 574917, 588999, 604009, 620537, 639139, 659858, 681989, 704315, 725842, 746597, 767736, 790758, 816539, 845039, 875526, 906858, 938005, 968842, 1000131, 1032072, 1063230, 1091871, 1118299, 1144721, 1172489, 1200574, 1227296, 1252364]
52225A252364K3948K2650K0961K0169K0950K1616J9857J5613J1066Q174P057O508
52213A450933N315L133N80j510l060m554n842o029n094m616n874p730p689m988
52199A402975j502O18J241J701K715L730M117M390N779Q720J2133J4457J5262
52186A476336J5502J6224J7482J8808K0046K1251K2007K1658K0179J8322J6808
52175A684623J5759J4923J4049J2898J1251R117O781M562K672J171k04k113n061
52162A770428q694j1961j4099j5131j5449j5417j5513j6224j7327j7810j7100
52151A605703j6034j5968j7128j8507j9182j8941j7763j5703j3547j2541j2790
52140A427599j2725j0998q418p003p345p848o807m405k343j877k603l103k554
$$ y = [1252364, 1276312, 1298962, 1319923, 1340092, 1361042, 1382658, 1402515, 1418128, 1429194, 1437368, 1444425, 1450933, 1456248, 1459381, 1459961, 1458451, 1455391, 1450837, 1444995, 1438966, 1433872, 1429256, 1423382, 1415652, 1407963, 1402975, 1401473, 1402091, 1403332, 1405033, 1407748, 1411478, 1415595, 1419985, 1425764, 1434484, 1446617, 1461074, 1476336, 1491838, 1508062, 1525544, 1544352, 1564398, 1585649, 1607656, 1629314, 1649493, 1667815, 1684623, 1700382, 1715305, 1729354, 1742252, 1753503, 1762620, 1769401, 1773963, 1776635, 1777806, 1777602, 1775489, 1770428, 1761734, 1749773, 1735674, 1720543, 1705094, 1689677, 1674164, 1657940, 1640613, 1622803, 1605703, 1589669, 1573701, 1556573, 1538066, 1518884, 1499943, 1482180, 1466477, 1452930, 1440389, 1427599, 1414874, 1403876, 1395458, 1388455, 1381110, 1373262, 1366455, 1362050, 1359707, 1357830, 1355227, 1352124, 1349570]
52127A349570j543j176j562j759j263p64r08j172q75n80j357k973m073m096l761
52112A321708l575l150k230j336j005j377k736n235p775q544p317n858n373n024
52098A261173m039l591m918o714o568m512l108l993o068p400p404o618n635m989
52084A185616n191o046o422n347l153j213o91j545k641k832k134j587j872k493
52070A142449k687k510k425k292j577j97J420K779L287K435P64%J201L409N136
52055A151192O531Q677J1334J3184J4157J5738J8637K1781K4021K5421K6375K6792
52043A363840K6798K7120K8133K9451L0813L2368L3714L3921L3058L2508L3043
52032A704767L3690L3151L1371K9027K6566K4437K3098K1986J9670J5971J2634
$$ y = [1349570, 1348027, 1346851, 1345289, 1343530, 1342267, 1341503, 1340595, 1339423, 1338548, 1337968, 1336611, 1333638, 1329565, 1325469, 1321708, 1318133, 1314983, 1312753, 1311417, 1310412, 1309035, 1306299, 1301064, 1293289, 1284745, 1277428, 1271570, 1266197, 1261173, 1257134, 1253543, 1248625, 1241911, 1235343, 1230831, 1227723, 1223730, 1217662, 1210262, 1202858, 1196240, 1190605, 1185616, 1180425, 1174379, 1167957, 1162610, 1159457, 1158244, 1157553, 1156008, 1153367, 1150535, 1148401, 1146814, 1144942, 1142449, 1139762, 1137252, 1134827, 1132535, 1130958, 1130761, 1132181, 1134960, 1138247, 1140682, 1141446, 1141446, 1142647, 1146056, 1151192, 1157723, 1166400, 1177734, 1190918, 1205075, 1220813, 1239450, 1261231, 1285252, 1310673, 1337048, 1363840, 1390638, 1417758, 1445891, 1475342, 1506155, 1538523, 1572237, 1606158, 1639216, 1671724, 1704767, 1738457, 1771608, 1802979, 1832006, 1858572, 1883009, 1906107, 1928093, 1947763, 1963734, 1976368]
52021A976368J0762Q868N094L55k731l523m110o352r841j3014j4778j4725j3120
52008A919253j1270j0827j2053j3495j3863j3427j2959j2209j0381p679n303l893
51996A791894k754r05J681M162N836O694P232Q147R974J2519J4616J5059J3924
51983A888079J2515J1880J1966J2363J3037J3686J3305J1254Q226N276K561j01
51971B004047k239l645n448q532j1497j2327j1773j2657j5582j8063j8764j9748
51959A863772k2919k6703k8655k9336l0835l2673l2377k9782k7829k8580l0804
51948A543279l2260l2495l2349l2203l1878l1472l1325l1465l1657l1586l0914
51937A193675k9586k8173k7405k7285k7256k7180k7524k8432k9281k9344k8458
$$ y = [1976368, 1987130, 1995998, 2001092, 2001447, 1998716, 1995193, 1991083, 1984731, 1974890, 1961876, 1947098, 1932373, 1919253, 1907983, 1897156, 1885103, 1871608, 1857745, 1844318, 1831359, 1819150, 1808769, 1801090, 1795787, 1791894, 1789140, 1788235, 1789916, 1794078, 1799914, 1806608, 1813840, 1821987, 1831961, 1844480, 1859096, 1874155, 1888079, 1900594, 1912474, 1924440, 1936803, 1949840, 1963526, 1976831, 1988085, 1996311, 2001587, 2004148, 2004047, 2001808, 1998163, 1992715, 1984183, 1972686, 1960359, 1948586, 1935929, 1920347, 1902284, 1883520, 1863772, 1840853, 1814150, 1785495, 1756159, 1725324, 1692651, 1660274, 1630492, 1602663, 1574083, 1543279, 1511019, 1478524, 1446175, 1413972, 1382094, 1350622, 1319297, 1287832, 1256175, 1224589, 1193675, 1164089, 1135916, 1108511, 1081226, 1053970, 1026790, 999266, 970834, 941553, 912209, 883751]
51926H83751k6976k5483k4541k4281k4183k3563k2193k0333j8482j7266j7030
51915F39420j7184j6681j5506j4828j5101j5201j4344j3581j3904j4043j2173
51904D76874r076p322p554p894p171o437o670p152p065o870p075p174o887o943
51890C75584p529p387n844m307m320n249n456m847m550m769m755m509m833n640
51876C01589n813m888l667k905k515k262k220k237j777o85N09J217J265O57n21
51861B75747j780k377j975q89J96M43p92l138n001n038l743k768k765k870k371
51846B40879j710j392r43K55J659J974O56j468k981l082k163j451j771k592k640
51831B23230j607o38p58j521j746j166n19k78j25K58N96N27J36l22q58j529j974
$$ y = [883751, 856775, 831292, 806751, 782470, 758287, 734724, 712531, 692198, 673716, 656450, 639420, 622236, 605555, 590049, 575221, 560120, 544919, 530575, 516994, 503090, 489047, 476874, 467798, 460476, 452922, 445028, 437857, 431420, 424750, 417598, 410533, 403663, 396588, 389414, 382527, 375584, 368055, 360668, 354824, 350517, 346197, 340948, 335492, 330645, 326095, 321326, 316571, 312062, 307229, 301589, 295776, 290888, 287221, 284316, 281801, 279539, 277319, 275082, 273305, 272620, 273129, 274346, 275611, 276268, 275747, 273967, 271590, 269615, 268726, 268922, 269365, 268573, 265435, 260434, 255396, 251653, 248885, 246120, 243250, 240879, 239169, 237777, 236834, 237089, 238748, 240722, 241378, 239910, 236929, 233847, 231684, 230233, 228462, 225870, 223230, 221623, 220985, 220227, 218706, 216960, 215794, 215275, 214997, 214872, 215130, 215726, 216253, 216389, 216067, 215209, 213680, 211706]
51814B11706j708q82l62p70j634j883j140j86O1l61p04n92l19j33J17N59J037
51797B02806J480K018K515K551K182K083K488K662K069J355J310J479R72K57N82
51782B28809J719J919O32l36O11K463L054K044R43P24R01Q90Q83J057J068P46
51766B48127M85N54N66O4p99j325q00R77L242M511L946K362J188O65o2j136j591
51749B60974r99k99l30o11l95q4n38j548k011j404k77O63J331K170L502M865M914
51732B69923K758l56j676p4K397L115K258K120L576N070N242M814N007N468N052
51717C14694L897L456M572O447P692P718O934O049N480N042M039J869j120l535
51703C73234m224l661l522m607n780n564m259l460l664l519j831P98K848L604
$$ y = [211706, 209998, 209116, 208754, 207984, 206350, 204467, 203327, 203141, 203202, 202841, 202137, 201545, 201226, 201093, 201210, 201769, 202806, 204286, 206304, 208819, 211370, 213552, 215635, 218123, 220785, 222854, 224209, 225519, 226998, 227970, 228227, 228809, 230528, 232447, 233079, 232743, 233354, 235817, 238871, 240915, 241858, 242582, 243483, 244373, 245256, 246313, 247381, 248127, 248612, 249166, 249732, 249796, 248997, 247672, 246872, 247849, 251091, 255602, 259548, 261910, 263098, 263763, 263701, 262565, 260974, 259975, 259676, 259346, 258735, 258340, 258256, 257718, 256170, 254159, 252755, 252478, 253141, 254472, 256642, 260144, 265009, 269923, 272681, 272325, 270649, 270575, 272972, 276087, 278345, 280465, 284041, 289111, 294353, 299167, 304174, 309642, 314694, 318591, 322047, 326619, 333066, 340758, 348476, 355410, 361459, 366939, 371981, 376020, 377889, 376769, 373234, 369010, 365349, 361827, 357220, 351440, 345876, 341617, 338157, 334493, 330974, 329143, 329941, 332789, 336393]
51689C36393L183J754l42k076k409j401KJ090J720J888J704J564J734K031K417
51674C49252L346M761N374M159K050R15J066J240R62J226K403L182K432R69L17
51659C83654O77J206J627K431L699M780N136M812M102L229K425J850J454J116
51645D22198R26J095J663K401K927K944K578K372K612K733J952M66n99n71J74
51630D45871J066K002K751K607J387J54J09J171K405L419M308M559L230M94k060
51615D73473l249l673m593n938o421n531m447m515n497n991n358m433m209m464
51601D05154m208l176k321k755m471o208o523n083k965j565j246j292j028n36
51587C61777j78j06m12j147j779j436k26L58q12k815l561k078P41L146L625J665
$$ y = [336393, 339576, 341330, 340988, 338912, 336503, 335102, 335104, 336194, 337914, 339802, 341506, 343070, 344804, 346835, 349252, 352598, 357359, 362733, 366892, 368942, 369857, 370923, 372163, 373125, 374351, 376754, 379936, 382368, 383337, 383654, 384331, 385537, 387164, 389595, 393294, 398074, 403210, 408022, 412124, 415353, 417778, 419628, 421082, 422198, 423124, 424219, 425882, 428283, 431210, 434154, 436732, 439104, 441716, 444449, 446401, 446867, 446268, 445697, 445871, 446937, 448939, 451690, 454297, 455684, 455838, 455947, 457118, 459523, 462942, 467250, 471809, 475039, 475533, 473473, 470224, 466551, 461958, 456020, 449599, 444068, 439621, 435106, 429609, 423618, 418260, 413827, 409618, 405154, 400946, 397770, 395449, 392694, 388223, 382015, 375492, 370409, 367444, 365879, 364633, 363341, 362313, 361777, 361599, 361493, 361081, 359934, 358155, 356719, 356493, 356851, 356039, 353224, 349663, 347585, 348326, 351472, 355097, 356762]
51571C56762j550l679l549k457k172k369j583o0M06o41j703j912k094k690k607
51556C28102j283k7Ml61R6Q53O84k56r02r82o77N00K794M745M444K089k74j445
51538C38104j981k527k899l105l714m567m355k323K92J346Q0k211l498k833r89
51523C04820N39J062J084J136Q38l27j830k435j633j48R48J174P96L82K68K54
51507C06928J46L95J452K476J846m83k295j776J37J218Q38N1m13o17m41J56K25
51490C09843j146k952l198j809q30j387k213j907r37n17p86j190j543j746j344
51475B86338l88J08m49j082n11R60J841J517Q99J083J999K628K196J014J9m32
51459B97740q66j379q36J520M138M567K847J618K289L110K081jj201j543k349
$$ y = [356762, 355212, 351533, 347984, 345527, 343355, 340986, 339403, 339343, 339749, 339108, 337405, 335493, 333399, 330709, 328102, 326819, 326792, 326796, 326435, 326531, 327384, 328068, 327812, 326910, 325928, 325251, 325751, 328545, 333290, 337734, 339823, 339549, 338104, 336123, 333596, 330697, 327592, 323878, 319311, 314956, 312633, 312925, 314271, 314351, 312140, 308642, 305809, 304820, 305359, 306421, 307505, 308641, 309479, 309152, 307322, 304887, 303254, 303106, 304054, 305228, 306024, 306406, 306674, 306928, 307074, 307469, 308921, 311397, 313243, 312760, 310465, 308689, 308826, 310044, 310882, 310933, 310520, 309903, 309462, 309618, 309843, 308697, 305745, 302547, 300738, 299908, 298521, 296308, 294401, 293464, 292947, 292161, 290971, 289428, 287682, 286338, 285950, 286058, 285609, 284527, 284016, 284976, 286817, 288334, 289233, 290316, 292315, 294943, 297139, 298153, 298172, 297740, 296874, 295495, 294659, 296179, 300317, 304884, 307731, 309349, 311638, 314748, 316829, 316828, 315627, 314084, 311735]
51444C11735l294k522L32L306M640M524L899K960J629M16m3K84J073K111L257
51429C34307M365N412O289O452N431L697K246J386O92J73M95J764L069L620L411
51414C82809K541Q57j078j835p52J069K236K724L084K924J583j43n68O18J921
51399C97990K138J634J163O47j92r06r23m90k65k06K78J180J618R20k97n10J111
51382D04890L492M466L136J096P35K439M328M684L542J618r55l917n844n332k963
51367D15415r64q30k064l203l316k423j235o22q80j453j757j988k474k756k303
51352C87147j776k347l683m070k847j424j190j642j516q25o38j302j982j828q82
51337C59195J03J74j294m066p014q829q765o907m229k228j742k107k310k654m002
$$ y = [311735, 308441, 305919, 306251, 309557, 314197, 318721, 322620, 325580, 327209, 327625, 327582, 327866, 328939, 331050, 334307, 338672, 344084, 350373, 356825, 362256, 365953, 368199, 369585, 370277, 370450, 370945, 372709, 375778, 379398, 382809, 385350, 386207, 385129, 383294, 382542, 383611, 385847, 388571, 391655, 394579, 396162, 396019, 395451, 396069, 397990, 400128, 401762, 402925, 403572, 403380, 402474, 401551, 401061, 400796, 400590, 400868, 402048, 403666, 404586, 404289, 403779, 404890, 408382, 412848, 415984, 417080, 417815, 420254, 424582, 429266, 432808, 434426, 433471, 429554, 423710, 418378, 415415, 414451, 413621, 411557, 408354, 405038, 402615, 401380, 400758, 399878, 398425, 396668, 394680, 392206, 389450, 387147, 385371, 383024, 379341, 375271, 372424, 371000, 369810, 368168, 366652, 365827, 365189, 363887, 361905, 360077, 359195, 359298, 359472, 358178, 354112, 347098, 338269, 329504, 322597, 318368, 316140, 314398, 312291, 309981, 307327, 303325]
51322C03325n460m918k511j247k716m311k954Q0R46j123l059k815j736j464j417
51307B68620p58m63j524k890l072k552k618k795j611N33J403J00j536j327N96
51292B50106K317K470J283k15j317j916k179k202j935j324m01O04J232J033J19
51277B47675o53m85L49P08j70j995l902n171n482n027m459m212l876k856j606
51262B08838j298k117k814k378j177lJ026J820J626J33j402j469l72K60r4l44
51246B00235J71M67n77k397l309k465n86J017J585J180L49l56o86p86r66j436
51230A91440k096k455j921l97J336K260K151J764J777J872J159n49k255k766j987
51215A89333j010r21j678k284j942r35k85n73j174r27L12J250P82l07k16J256
$$ y = [303325, 297865, 292947, 290436, 289189, 286473, 282162, 279208, 279288, 280234, 279111, 276052, 273237, 271501, 270037, 268620, 267862, 267399, 265875, 262985, 259913, 257361, 254743, 251948, 250337, 250870, 252273, 252373, 250837, 249510, 250106, 252423, 254893, 256176, 255961, 254644, 252728, 250549, 248347, 246412, 245088, 244687, 245291, 246523, 247556, 247675, 247022, 246537, 246886, 247594, 247424, 245429, 241527, 236356, 230874, 225847, 221388, 217176, 213300, 210444, 208838, 207540, 205423, 202609, 200231, 199054, 199051, 200077, 201897, 203523, 203656, 202254, 200785, 200413, 200673, 200579, 200235, 200406, 200873, 200296, 197899, 194590, 192125, 191539, 192556, 194141, 195321, 195670, 195314, 194628, 193842, 192876, 191440, 189344, 186889, 184968, 184571, 185907, 188167, 190318, 192082, 193859, 195731, 196890, 196341, 194086, 191320, 189333, 188323, 187402, 185724, 183440, 181498, 180563, 180278, 179705, 178531, 177604, 177916, 179166, 179948, 179641, 179425, 180681]
51199A80681K189J293j51k81M12m1j740k574j465P5N34O73J746K953K529N94r65
51182A86462j193r18q03k81J089K509K915K270J226K40m30l82N82K051L288L785
51166B02410L342K072O04k51l37l08o08p23Q7J671L141L840L595K368M14j189
51150B20128j082Q24K911L490K650J890K142K880L138K758K123J367M32k67o3
51135B45321R99J931J788N45j071k210k341j558p73j036k238k930k007k18O28
51120B34830j94j619k268j901j199p03m40k64j11J0k5l88r65j210o86K03L98o54
51102B22814k193k836k107r97q59j914l097l308k534j635j260j198q10M0O46J96
51086A98948j137k124j761n23P0q07k356l091k409r68J57L44l58j389j951j570
$$ y = [180681, 182870, 184163, 184012, 183731, 184143, 184102, 182362, 179788, 178323, 178398, 178932, 179605, 181351, 184304, 186833, 187427, 186462, 185269, 184351, 183548, 183267, 184356, 186865, 189780, 192050, 193276, 193516, 193086, 192704, 193286, 195337, 198625, 202410, 205752, 207824, 208428, 208177, 207840, 207532, 206924, 206201, 206288, 207959, 211100, 214940, 218535, 220903, 221317, 220128, 219046, 219870, 222781, 226271, 228921, 230811, 232953, 235833, 238971, 241729, 243852, 245219, 245651, 245384, 245321, 246320, 248251, 250039, 250584, 249513, 247303, 244962, 243404, 242631, 241595, 239357, 236427, 234420, 234202, 234830, 234636, 233017, 230749, 228848, 227649, 226946, 226506, 226242, 226131, 226141, 226116, 225728, 224763, 223553, 222867, 223070, 223468, 222814, 220621, 217785, 215678, 214681, 213822, 211908, 208811, 205503, 202969, 201334, 200074, 198876, 198066, 198106, 198752, 198948, 197811, 195687, 193926, 193403, 193473, 192666, 190310, 187219, 184810, 183842, 183999, 184343, 183985, 182596, 180645, 179075]
51070A79075n71J40N9k45J90J395K233J821Q21P05J831K924K739J534M26j44n04
51053A94429p32n05P5L92K75L35J066K185L128L611L489K766K094K457L720M179
51037B22964K505k03j415j74J901K846K625K451K636K168N48j056j017P75K864
51022B40418L942L984L603L083K559K432K860L077K096J43j367j497q53o28j095
51007B62757j459j030m8O80P73P01J129J912K144J319Q8n57m68k35k14l24n42
50990B66626r37j315j452j488j498j009K20J273J070N6l37J31K95k44l92M14J001
50973B62414L71m89M9J969L831M607M162K642O38m80K89K125L159K641J546J130
50957B90604J700K806L880M545M683M319L335J787O00J161L583O107O993O430
$$ y = [179075, 178504, 178644, 178703, 178458, 178648, 180043, 182276, 184097, 184918, 185623, 187454, 190378, 193117, 194651, 195077, 194933, 194429, 193697, 193192, 193267, 193659, 193934, 194269, 195335, 197520, 200648, 204259, 207748, 210514, 212608, 215065, 218785, 222964, 225469, 225266, 223851, 223677, 225578, 228424, 231049, 233500, 236136, 238304, 238852, 237796, 236779, 237554, 240418, 244360, 248344, 251947, 255030, 257589, 260021, 262881, 265958, 268054, 268197, 266830, 265333, 264480, 263852, 262757, 261298, 260268, 260220, 260900, 261673, 262374, 263503, 265415, 267559, 268878, 268966, 268409, 267941, 267706, 267492, 267168, 266626, 265689, 264374, 262922, 261434, 259936, 258927, 259147, 260420, 261490, 261546, 261209, 261340, 261635, 261391, 260999, 261413, 262414, 262785, 262296, 262345, 264314, 268145, 272752, 276914, 279556, 280194, 279714, 280003, 282128, 285287, 287928, 289474, 290604, 292304, 295110, 298990, 303535, 308218, 312537, 315872, 317659, 318259, 319420, 323003, 329110, 336103, 342533]
50943C42533N767N519N305N232O065P889R682J0454J0261R926J0198J1121J1915
50930D51867J1746J0851J0371J0899J1851J2831J4542J7499K0707K2760K3630
50919F19554K4251K4871K5101K5196K6158K8637L2537L7188M1240M3380M4260
50908I72373M6617N1979N8299O2755O5891P0575P7446Q4106Q8875R2502R5744
50897A767162R7909R8901J00198J02267J03012J00383R4964Q8497Q1314P2907
50887B707514O3747N4689M5263L4396K2457J1222J899n769j2678j9373k5584l0116
50875B847667l1789l1144l0480l1339l2719l2752l1490l0851l2165l5006l8382
50864B489550m1971m5977n0454n5111n9526o3429o6788o9465p0935p0906p0079
$$ y = [342533, 348300, 353819, 359124, 364356, 370421, 378310, 387992, 398446, 408707, 418633, 428831, 439952, 451867, 463613, 474464, 484835, 495734, 507585, 520416, 534958, 552457, 573164, 595924, 619554, 643805, 668676, 693777, 718973, 745131, 773768, 806305, 843493, 884733, 928113, 972373, 1018990, 1070969, 1129268, 1192023, 1257914, 1328489, 1405935, 1490041, 1578916, 1671418, 1767162, 1865071, 1963972, 2064170, 2166437, 2269449, 2369832, 2464796, 2553293, 2634607, 2707514, 2771261, 2825950, 2871213, 2905609, 2928066, 2939288, 2941187, 2935418, 2922740, 2903367, 2877783, 2847667, 2815878, 2784734, 2754254, 2722915, 2690196, 2657444, 2625954, 2595103, 2562938, 2527932, 2489550, 2447579, 2401602, 2351148, 2296037, 2236511, 2173082, 2106294, 2036829, 1965894, 1894988, 1824909]
50853A824909o9504o9026o7400o4118o0114n6208n2120m7533m2976l8742l4206
50842A222962k9257k5210k2943k1088j7714j3194r654p921o683m706k406p34K39
50829A061691J190K691M769O808P803P326O227N767O235P014P884R264J1119J2573
50815A158361J2999J2871J3120J4044J5144J6006J6937J8635K1202K3821K5765
50804A348905K7415K9592L2113L4190L6399M0659M7487N4575N9466O2746O7219
50793A840766P4461Q3674R3464J03324J13315J23582J34392J45820J57487J69262
50783C039547J81734J94876K06714K14786K18880K21021K22642K23002K20483
50774D943685K14017K02909J86559J65138J39883J12365Q4048N6403L0415N827
$$ y = [1824909, 1755405, 1686379, 1618979, 1554861, 1494747, 1438539, 1386419, 1338886, 1295910, 1257168, 1222962, 1193705, 1168495, 1145552, 1124464, 1106750, 1093556, 1083902, 1075981, 1069298, 1064592, 1062186, 1061452, 1061691, 1062881, 1065572, 1070341, 1077149, 1084952, 1092278, 1098505, 1104272, 1110507, 1117521, 1125405, 1134669, 1145788, 1158361, 1171360, 1184231, 1197351, 1211395, 1226539, 1242545, 1259482, 1278117, 1299319, 1323140, 1348905, 1376320, 1405912, 1438025, 1472215, 1508614, 1549273, 1596760, 1651335, 1710801, 1773547, 1840766, 1915227, 1998901, 2092365, 2195689, 2309004, 2432586, 2566978, 2712798, 2870285, 3039547, 3221281, 3416157, 3622871, 3837657, 4056537, 4277558, 4500200, 4723202, 4943685, 5157702, 5360611, 5547170, 5712308, 5852191, 5964556, 6048604, 6105007, 6135422, 6141249]
50764F141249j7869l9533n6663o8025p4715p8252p8862p6349p1340o4932n8166
50753E456543n2753n1035n3872n9475o5648p2515q1680r3309j05544j16708j26539
50742D577465j35180j42350j47895j51963j54044j52779j47413j38861j28647
50733C278333j17359j04812r1400p8281o6126n4339m1946k8901j6092m286O417
50722B681208J5998K3923K9681L3735L7226M0430M1982M0233L5270K9023K3265
50711C031974J7985J2075N171j923q503j4851k1456k8107l4407m0756m7652n4134
50699B815416n8161n9157n9244o0872o3714o5021o3020n8833n4668n0998m6459
50688B175269m0151l3059k6816k1694j6525j0422l778K755R507J7172K5395L2923
$$ y = [6141249, 6123380, 6083847, 6027184, 5959159, 5884444, 5806192, 5727330, 5650981, 5579641, 5514709, 5456543, 5403790, 5352755, 5298883, 5239408, 5173760, 5101245, 5019565, 4926256, 4820712, 4704004, 4577465, 4442285, 4299935, 4152040, 4000077, 3846033, 3693254, 3545841, 3406980, 3278333, 3160974, 3056162, 2964762, 2886481, 2820355, 2766016, 2724070, 2695169, 2679077, 2674791, 2681208, 2697206, 2721129, 2750810, 2784545, 2821771, 2862201, 2904183, 2944416, 2979686, 3008709, 3031974, 3049959, 3062034, 3067205, 3065282, 3056779, 3041928, 3020472, 2992365, 2957958, 2917202, 2869550, 2815416, 2757255, 2698098, 2638854, 2577982, 2514268, 2449247, 2386227, 2327394, 2272726, 2221728, 2175269, 2135118, 2102059, 2075243, 2053549, 2037024, 2026602, 2022824, 2025579, 2035086, 2052258, 2077653, 2110576]
50676B110576L9280M5384N2324O0241O8684P7315Q5843R4070J02371J11304J20231
50665B967623J27218J31158J33083J34420J34616J31751J25163J16182J06321
50656D107535R5681Q3307O8388N1070L2647J4747k149j8978l6149n1944o3850
50645D280305p1034p4394p4674p1993o7071o1232n4922m7691m0013l3712l0049
50634C653520k8647k8943l1382l6238m2452m8773n5276o2518o9678p4612p5775
50623C099226p3394o8876o3601n8076n1755m3677l3517k1928r859K104J3810K5516
50611B715973L7919N1492O5502P8400Q9437R9234J08481J16761J23139J27026
50601C613364J27852J24744J17449J07296R6314Q5526P4577O2957N0986L9612
$$ y = [2110576, 2149856, 2195240, 2247564, 2307805, 2376489, 2453804, 2539647, 2633717, 2736088, 2847392, 2967623, 3094841, 3225999, 3359082, 3493502, 3628118, 3759869, 3885032, 4001214, 4107535, 4203216, 4286523, 4354911, 4405981, 4438628, 4453375, 4451226, 4432248, 4396099, 4344155, 4280305, 4209271, 4134877, 4060203, 3988210, 3921139, 3859907, 3804985, 3757294, 3717281, 3683569, 3653520, 3624873, 3595930, 3564548, 3528310, 3485858, 3437085, 3381809, 3319291, 3249613, 3175001, 3099226, 3025832, 2956956, 2893355, 2835279, 2783524, 2739847, 2706330, 2684402, 2674543, 2676647, 2690457, 2715973, 2753892, 2805384, 2870886, 2949286, 3038723, 3137957, 3246438, 3363199, 3486338, 3613364, 3741216, 3865960, 3983409, 4090705, 4187019, 4272545, 4347122, 4410079, 4461065, 4500677]
50591D500677K9437K0017J0173n59j0914j8962k4237k8070l1726l5115l7642l9226
50579D333853l9781l8662l5533l1148k6418k1293j5468r529m451l64L069N431
50567D119706N967N063M107L519K075j344o000r989j2303j3707j5490j7642j8452
50554D045510j6214j1229n650j115K877P734J3406J8109K0275J9968J8137J5114
50542D126922J0428L850l825j1493j9152k8273m0239n4485o8699q0889r0815r9284
50530C644046j06670j12495j16025j16854j15305j12329j08701j04174r8062r0670
50520B562761q3353p6868p0640o4119n7850n2476m7598m2513l7273l2015k6005
50509A972051j8689j1220n499j708J914O816J2746J8799K4734L0692L6398M1300
$$ y = [4500677, 4530114, 4550131, 4560304, 4559745, 4548831, 4529869, 4505632, 4477562, 4445836, 4410721, 4373079, 4333853, 4294072, 4255410, 4219877, 4188729, 4162311, 4141018, 4125550, 4116021, 4111570, 4111206, 4114275, 4119706, 4125673, 4130736, 4134843, 4138362, 4140437, 4139093, 4133093, 4123104, 4110801, 4097094, 4081604, 4063962, 4045510, 4029296, 4018067, 4012417, 4011302, 4014179, 4021913, 4035319, 4053428, 4073703, 4093671, 4111808, 4126922, 4137350, 4141200, 4137375, 4125882, 4106730, 4078457, 4038218, 3983733, 3915034, 3834145, 3743330, 3644046, 3537376, 3424881, 3308856, 3192002, 3076697, 2964368, 2855667, 2751493, 2653431, 2562761, 2479408, 2402540, 2331900, 2267781, 2209931, 2157455, 2109857, 2067344, 2030071, 1998056, 1972051, 1953362, 1942142, 1936643, 1934935, 1936849, 1943665, 1956411, 1975210, 1999944, 2030636, 2067034, 2108334]
50497B108334M5274M8862N2852N7605O2617O7033P0745P4759Q0085Q6562R3140
50486B847868R8975J03804J07594J10335J11953J12111J10484J07393J03632R9313
50476C913462R3794Q7252Q1397P7835P6567P6865P8578Q1468Q4279Q5975Q7181
50465D824653Q9014R1302R3437R6091J00177J04647J07496J08523J08957J08712
50455E833009J06449J02412R8367R4095Q6588P3847N7329L9476K0972J731j7553
50444F496722l6528n5955p5640r3182j06664j17035j25801j31808j32591j27950
50434E493568j19757j08909r4891p8134o0518m3466k7444j3307k269N603J1003
50423D961479J3246J0284J152j3189l1626n3474p6818r8357j16196j31344j45282
$$ y = [2108334, 2153608, 2202470, 2255322, 2312927, 2375544, 2442577, 2513322, 2588081, 2668166, 2754728, 2847868, 2946843, 3050647, 3158241, 3268576, 3380529, 3492640, 3603124, 3710517, 3814149, 3913462, 4007256, 4094508, 4175905, 4253740, 4330307, 4407172, 4485750, 4567218, 4651497, 4737472, 4824653, 4913667, 5004969, 5098406, 5194497, 5294674, 5399321, 5506817, 5615340, 5724297, 5833009, 5939458, 6041870, 6140237, 6234332, 6320920, 6394767, 6452096, 6491572, 6512544, 6514275, 6496722, 6460194, 6404239, 6328599, 6235417, 6128753, 6011718, 5885917, 5754109, 5621518, 5493568, 5373811, 5264902, 5170011, 5091877, 5031359, 4987893, 4960449, 4947142, 4944873, 4950476, 4961479, 4974725, 4985009, 4986161, 4972972, 4941346, 4887872, 4811054, 4712697, 4596501, 4465157, 4319875]
50412D319875j57269j65297j68641j68207j65050j59873j53526j46808j39831
50403B895373j32247j23865j14516j04070r3380q4462p8439p3618o6949n7569
50393A966258m7775m0193l5103l1077k7214k3620k0207j6269j1523o650k298J803
50381A706132O071R941J2532J4383J7343K2134K7038K9952L1105L2548L5313L8501
50369A982993M1272M4183M7839N1503N4225N6551N9827O4088O7937P0461P2098
50358B612977P3381P4009P3782P3481P3992P5075P5861P6194P6598P7201P7769
50347C440320P8678Q0667Q3180Q4229Q2586P9180P5335P0637O3961N5914M8362
50336D243049M1507L3396K2869J1237Pj1385k4081l7339m9487o0585p2073q4097
$$ y = [4319875, 4162606, 3997309, 3828668, 3660461, 3495411, 3335538, 3182012, 3035204, 2895373, 2763126, 2639261, 2524745, 2420675, 2327295, 2242833, 2164394, 2090776, 2023827, 1966258, 1918483, 1878290, 1843187, 1812110, 1784896, 1761276, 1741069, 1724800, 1713277, 1706627, 1704329, 1706132, 1712203, 1722144, 1734676, 1749059, 1766402, 1788536, 1815574, 1845526, 1876631, 1909179, 1944492, 1982993, 2024265, 2068448, 2116287, 2167790, 2222015, 2278566, 2338393, 2402481, 2470418, 2540879, 2612977, 2686358, 2760367, 2834149, 2907630, 2981622, 3056697, 3132558, 3208752, 3285350, 3362551, 3440320, 3518998, 3599665, 3682845, 3767074, 3849660, 3928840, 4004175, 4074812, 4138773, 4194687, 4243049, 4284556, 4317952, 4340821, 4352058, 4352065, 4340680, 4316599, 4279260, 4229773, 4169188, 4097115, 4013018]
50324D013018r5047j03857j10810j15604j16619j13148j06923j00126r2926q4132
50314B973826p3456o1876n0278l8978k8348j8856j0728m279l51M70j327n014j0916
50301B669889j9616l0110m0086m8275n5290o1861o7413p1105p3144p4119p3850
50290B055020p2011o9284o6701o4023o0005n4532m9301m5824m3509m0634l6690
50279A452506l2832k9920k7209k3467j8887j5086j3190j2520j1415r001n817k952
50267A250210q89P39K536M725P095R429J1768J4158J6391J8259J9896K1532K2965
50254A398814K3812K4181K4518K4734K4268K3385K3454K5260K7656K8899K8837
50243A677818K8678K8967K9065K8627K8147K7626K6056K2907J9147J5893J2907
$$ y = [4013018, 3917971, 3814114, 3703304, 3587700, 3471081, 3357933, 3251010, 3150884, 3057958, 2973826, 2900370, 2838494, 2788216, 2749238, 2720890, 2702034, 2691306, 2687027, 2686676, 2687146, 2685819, 2680805, 2669889, 2650273, 2620163, 2580077, 2531802, 2476512, 2414651, 2347238, 2276133, 2202989, 2128870, 2055020, 1983009, 1913725, 1847024, 1783001, 1722996, 1668464, 1619163, 1573339, 1529830, 1489196, 1452506, 1419674, 1389754, 1362545, 1339078, 1320191, 1305105, 1291915, 1279395, 1267980, 1258979, 1253162, 1250210, 1249321, 1250060, 1252596, 1257321, 1264416, 1273845, 1285613, 1299771, 1316162, 1334421, 1354317, 1375849, 1398814, 1422626, 1446807, 1471325, 1496059, 1520327, 1543712, 1567166, 1592426, 1620082, 1648981, 1677818, 1706496, 1735463, 1764528, 1793155, 1821302, 1848928, 1874984, 1897891, 1917038, 1932931, 1945838]
50232A945838R396N556K215o27l743p326j0756j3658j6319j9023k1822k4932k8450
50219A816349l1541l2885l2252l0853k9778k8916k7753k6368k5029k3528k1755
50208A505691k0303j9665j9295j8282j6768j5660j5119j4284j2628j0691r101
50197A333895p727o327n333n309n901o185n877n578n780o272o801p653r104j0573
50183A239475j1080j0486r736r667j0150j0727j1417j2167j2066j0150p137n163
50171A119529n280o027n355l240j442j001j187r88l97K09J050K415L676L730K372
50156A108064O26m20o97q77j281j318k07J772L101K528N74j115j971l164n593
50141A100022q180r181q669q460r556j0860j0735r005o822n373n207o198p409
$$ y = [1945838, 1955234, 1960790, 1963005, 1962378, 1958635, 1951309, 1940553, 1926895, 1910576, 1891553, 1869731, 1844799, 1816349, 1784808, 1751923, 1719671, 1688818, 1659040, 1630124, 1602371, 1576003, 1550974, 1527446, 1505691, 1485388, 1465723, 1446428, 1428146, 1411378, 1395718, 1380599, 1366315, 1353687, 1342996, 1333895, 1326168, 1319841, 1314508, 1309199, 1303298, 1297113, 1291236, 1285658, 1279878, 1273606, 1266805, 1259152, 1250048, 1239475, 1228395, 1217909, 1208173, 1198506, 1188356, 1177629, 1166212, 1154045, 1141979, 1131829, 1124692, 1119529, 1114249, 1108222, 1102867, 1099627, 1098185, 1097184, 1095997, 1095009, 1094612, 1094821, 1095871, 1098286, 1101962, 1105692, 1108064, 1108690, 1108270, 1107573, 1106696, 1105415, 1104097, 1103890, 1105662, 1108763, 1111291, 1111865, 1110750, 1108779, 1105615, 1100022, 1091842, 1082661, 1073992, 1065532, 1055976, 1045116, 1034381, 1025376, 1018554, 1013181, 1007974, 1001776, 994367]
50128I94367p466n880l780k781l303m545n686o393o382n504m341l808l935l755
50114I26808k733j557j117j298j360j037o55m92n90r40j304j089j3J209J460N04
50098I15796q11j752k564l919n854p476p691o220m000k499k434l292m107m415
50084H58762m143l021q71J730L743M793N432O145O687O633O143N818N996O467
50070I10314O708O370N692N434O146P608R235J0709J1760J1714J0226Q316P624
50057A017856Q352R089R053R349J1133J3565J4827J4672J4639J5796J7406J8066
50045A173803J7534J7047J8147K1162K4706K6927K7569K8337L0851L4831L8996
50034A459910M2929M7021N1151N4839N8538O3292O9085P4827Q0267Q6497R4029
$$ y = [994367, 986901, 981021, 977241, 974460, 971157, 966612, 960926, 954533, 948151, 942647, 938306, 934498, 930563, 926808, 924075, 922518, 921401, 920103, 918743, 917706, 917051, 916559, 915969, 915029, 913725, 912636, 912623, 913832, 915292, 915796, 914985, 913233, 910669, 906750, 900896, 893420, 885729, 879509, 875509, 873010, 870576, 867284, 863177, 858762, 854619, 851598, 850727, 852457, 856200, 860993, 866425, 872570, 879257, 885890, 892033, 897851, 903847, 910314, 917022, 923392, 929084, 934518, 940664, 948272, 957507, 968216, 979976, 991690, 1001916, 1010232, 1017856, 1026208, 1035297, 1044350, 1053699, 1064832, 1078397, 1093224, 1107896, 1122535, 1138331, 1155737, 1173803, 1191337, 1208384, 1226531, 1247693, 1272399, 1299326, 1326895, 1355232, 1386083, 1420914, 1459910, 1502839, 1549860, 1601011, 1655850, 1714388, 1777680, 1846765, 1921592, 2001859, 2088356, 2182385]
50023B182385J01765J08581J14706J20590J25445J27956J27539J23884J16294
50014C249145J04967R2271Q1022P1684O2778N4011M7213M3530M1259L7461L0807
50003C916148K1877J1307j154j5883l2471m9751o6291q0950r3260j03246j10704
49992C395622j14945j15584j13275j09231j04193r8282r1728q5089p8794p2873
49982B411628o7389o2651n8899n6016n3743n1811m9728m6811m2901l8766l5377
49971A847536l2825l0250k6908k3009j9466j6971j5409j3997j2022r455o883m911
49959A635430l806l645m252m751l883j477Q24J220jr04n19K40N59J138K640L938
49943A622751L427J450m0k0P60J431K063K844L602M598O661R787J2665J4277J5163
$$ y = [2182385, 2284150, 2392731, 2507437, 2628027, 2753472, 2881428, 3008967, 3132851, 3249145, 3354112, 3446383, 3527405, 3599089, 3661867, 3715878, 3763091, 3806621, 3847880, 3885341, 3916148, 3938025, 3949332, 3948178, 3932295, 3899824, 3850073, 3783782, 3702832, 3609572, 3506326, 3395622, 3280677, 3165093, 3051818, 2942587, 2838394, 2740112, 2648384, 2563295, 2484501, 2411628, 2344239, 2281588, 2222689, 2166673, 2112930, 2061119, 2011391, 1964580, 1921679, 1882913, 1847536, 1814711, 1784461, 1757553, 1734544, 1715078, 1698107, 1682698, 1668701, 1656679, 1647224, 1640341, 1635430, 1631624, 1627979, 1623727, 1618976, 1615093, 1613616, 1614440, 1615660, 1615659, 1614755, 1614236, 1614476, 1615035, 1616173, 1618813, 1622751, 1626178, 1627628, 1627588, 1627568, 1628328, 1629759, 1631822, 1634666, 1638268, 1642866, 1649527, 1659314, 1671979, 1686256, 1701419]
49928A701419J6323J7837J9509K1997K6007L0760L4627L7217L9705M2983M6583
49917B034967M9832N3242N8120O5215P4180Q4098R4282J04622J15302J26137J36526
49906B996523J46245J55898J65908J75300J82131J85028J83625J77717J67192
49897D535567J53166J38166J24386J12325J01562R2183Q4614P8448P2229O4177
49887E556823N2615L6169J4609j0586l7329o4553r1862j17726j39473j55737j67823
49876D875127j77692j85331j89419j89952j88674j86661j82963j76415j67694
49867C230326j58565j49699j40384j30130j19465j09121r9446r0842q3873p8336
$$ y = [1701419, 1717742, 1735579, 1755088, 1777085, 1803092, 1833852, 1868479, 1905696, 1945401, 1988384, 2034967, 2084799, 2138041, 2196161, 2261376, 2335556, 2419654, 2513936, 2618558, 2733860, 2859997, 2996523, 3142768, 3298666, 3464574, 3639874, 3822005, 4007033, 4190658, 4368375, 4535567, 4688733, 4826899, 4951285, 5063610, 5165172, 5257355, 5341969, 5420417, 5492646, 5556823, 5609438, 5645607, 5660216, 5649630, 5612301, 5547748, 5455886, 5338160, 5198687, 5042950, 4875127, 4697435, 4512104, 4322685, 4132733, 3944059, 3757398, 3574435, 3398020, 3230326, 3071761, 2922062, 2781678, 2651548, 2532083, 2422962, 2323516, 2232674, 2148801, 2070465]
$$ [...]
##END NTUPLES=NMR SPECTRUM
##END=
