
##TITLE=AC1083__5836542_VRjT2nScWd
##JCAMPDX= 6.0         $$ Bruker NMR JCAMP-DX V2.0
##DATA TYPE= NMR SPECTRUM
##DATA CLASS= NTUPLES
##ORIGIN= BRUKER
##OWNER= Administrator
$$ 1.72 TOPSPIN		Version 2.1
$$ 2012-04-16 19:09:16.062 -0500  Administrator@TOPSPIN
$$ Compression mode = diff/dup
##.OBSERVE FREQUENCY= 400.13188235
##.OBSERVE NUCLEUS= ^1H
##.ACQUISITION MODE= SIMULTANEOUS (DQD)
##.ACQUISITION SCHEME= undefined
##.AVERAGES= 8
##.DIGITISER RES= 22
##SPECTROMETER/DATA SYSTEM= spect
##.PULSE SEQUENCE= zg30
##.SOLVENT NAME= COFFEE_meoh
##.SHIFT REFERENCE= INTERNAL, COFFEE_meoh, 1, 14.98061
##AUDIT TRAIL= $$ (NUMBER, WHEN, WHO, WHERE, PROCESS, VERSION, WHAT)
$$ ##TITLE= Audit trail, TOPSPIN		Version 2.1
$$ ##JCAMPDX= 5.01
$$ ##ORIGIN= Bruker BioSpin GmbH
$$ ##OWNER= Administrator
$$ $$ C:\Bruker\TOPSPIN/data/COFFEE/nmr/AC1083__5836542_VRjT2nScWd/20/pdata/1/auditp.txt
$$ ##AUDIT TRAIL=  $$ (NUMBER, WHEN, WHO, WHERE, PROCESS, VERSION, WHAT)
(   1,<2012-04-15 14:02:50.375 -0500>,<Administrator>,<TOPSPIN>,<go>,<TOPSPIN 2.1>,
      <created by zg
	started at 2012-04-15 14:01:43.781 -0500,
	POWCHK enabled, PULCHK disabled,
       configuration hash MD5:
       1A 1E CE 29 27 FD 77 03 67 4E F0 E3 C4 B2 CB 90
       data hash MD5: 64K
       E4 FB 30 86 BC 10 50 F2 3E 29 28 FE FA BE 9D 0D>)
(   2,<2012-04-15 14:02:52.953 -0500>,<Administrator>,<TOPSPIN>,<proc1d>,<TOPSPIN 2.1>,
      <Start of raw data processing
       efp LB = 0 FT_mod = 6 PKNL = 1 PHC0 = 0 PHC1 = 0 SI = 32K 
       data hash MD5: 32K
       E2 B3 EF 94 A9 EE AF C5 39 21 28 70 4E 72 69 01>)
(   3,<2012-04-15 14:02:53.390 -0500>,<Administrator>,<TOPSPIN>,<proc1d>,<TOPSPIN 2.1>,
      <pk PHC0 = 213.5358 PHC1 = 0 
       data hash MD5: 32K
       E8 AD 3A E0 B3 72 24 14 5C CC 10 04 21 1D DD E6>)
(   4,<2012-04-15 14:02:53.484 -0500>,<Administrator>,<TOPSPIN>,<proc1d>,<TOPSPIN 2.1>,
      <abs ABSG = 1 
       data hash MD5: 32K
       9C 10 22 AB 84 C7 28 AA CD D0 82 7E 3E A0 0E BA>)
(   5,<2012-04-15 14:02:53.515 -0500>,<Administrator>,<TOPSPIN>,<proc1d>,<TOPSPIN 2.1>,
      <abs ABSG = 2 
       data hash MD5: 32K
       24 C7 71 EC 50 92 25 A0 D9 AE E3 93 82 EF D3 41>)
(   6,<2012-04-15 14:02:53.546 -0500>,<Administrator>,<TOPSPIN>,<proc1d>,<TOPSPIN 2.1>,
      <abs ABSG = 3 
       data hash MD5: 32K
       01 3C 2C 4C 98 CF 43 10 CC 90 E4 22 B9 3D 49 1F>)
(   7,<2012-04-15 14:02:53.578 -0500>,<Administrator>,<TOPSPIN>,<proc1d>,<TOPSPIN 2.1>,
      <abs ABSG = 4 
       data hash MD5: 32K
       86 CD 56 07 02 4C 54 96 87 C2 83 8D 0A 2C EB 82>)
(   8,<2012-04-15 14:02:53.609 -0500>,<Administrator>,<TOPSPIN>,<proc1d>,<TOPSPIN 2.1>,
      <abs ABSG = 5 
       data hash MD5: 32K
       67 97 4B 5A 43 D3 07 DB 8D EB 27 39 5E AC 15 C5>)
(   9,<2012-04-15 14:02:57.218 -0500>,<Administrator>,<TOPSPIN>,<audit>,<TOPSPIN 2.1>,
      <user comment:
       ICON-NMR User ID: COFFEE
       data hash MD5: 32K
       67 97 4B 5A 43 D3 07 DB 8D EB 27 39 5E AC 15 C5>)
$$ ##END=
$$ 
$$ $$ hash MD5
$$ [...]
##$TP= (0..7)
150 150 150 150 150 150 150 150
##$TP07= 0
##$TPNAME0= <>
##$TPNAME1= <>
##$TPNAME2= <>
##$TPNAME3= <>
##$TPNAME4= <>
##$TPNAME5= <>
##$TPNAME6= <>
##$TPNAME7= <>
##$TPOAL= (0..7)
0.5 0.5 0.5 0.5 0.5 0.5 0.5 0.5
##$TPOFFS= (0..7)
0 0 0 0 0 0 0 0
##$TUNHIN= 0
##$TUNHOUT= 0
##$TUNXOUT= 0
##$USERA1= <user>
##$USERA2= <user>
##$USERA3= <user>
##$USERA4= <user>
##$USERA5= <user>
##$V9= 5
##$VALIST= <valist>
##$VCLIST= <CCCCCCCCCCCCCCC>
##$VD= 0
##$VDLIST= <DDDDDDDDDDDDDDD>
##$VPLIST= <PPPPPPPPPPPPPPP>
##$VTLIST= <TTTTTTTTTTTTTTT>
##$WBST= 2048
##$WBSW= 25
##$XGAIN= (0..3)
0 0 0 0
##$XL= 0
##$YL= 0
##$YMAX_a= 499775
##$YMIN_a= -602860
##$ZGOPTNS= <>
##$ZL1= 120
##$ZL2= 120
##$ZL3= 120
##$ZL4= 120
##$ABSF1= 14.98061
##$ABSF2= -5.57192
##$ABSG= 5
##$ABSL= 3
##$ALPHA= 0
##$AQORDER= 0
##$ASSFAC= 0
##$ASSFACI= 0
##$ASSFACX= 0
##$ASSWID= 0
##$AUNMP= <proc_prof1d_extract_pilot.lims>
##$AXLEFT= 0
##$AXNAME= <>
##$AXNUC= <1H>
##$AXRIGHT= 0
##$AXTYPE= 0
##$AXUNIT= <>
##$AZFE= 0.1
##$AZFW= 0.1
##$BCFW= 0
##$BC_mod= 0
##$BYTORDP= 0
##$COROFFS= 0
##$CY= 15
##$DATMOD= 1
##$DC= 0
##$DFILT= <>
##$DTYPP= 0
##$F1P= 0
##$F2P= 0
##$FCOR= 0.5
##$FTSIZE= 32768
##$FT_mod= 6
##$GAMMA= 0
##$GB= 0
##$INTBC= 1
##$INTSCL= 1
##$ISEN= 128
##$LB= 0
##$LEV0= 0
##$LPBIN= 0
##$MAXI= 10000
##$MC2= 0
##$MEAN= 0
##$ME_mod= 0
##$MI= 0
##$NCOEF= 0
##$NC_proc= -8
##$NLEV= 6
##$NOISF1= 0
##$NOISF2= 0
##$NSP= 0
##$NTH_PI= 0
##$NZP= 0
##$OFFSET= 14.98061
##$PC= 1
##$PHC0= 213.5358
##$PHC1= 0
##$PH_mod= 1
##$PKNL= yes
##$PPARMOD= 0
##$PPDIAG= 0
##$PPIPTYP= 0
##$PPMPNUM= 2147483647
##$PPRESOL= 1
##$PSCAL= 4
##$PSIGN= 0
##$PYNMP= <proc.py>
##$REVERSE= no
##$SF= 400.13
##$SI= 32768
##$SIGF1= 0
##$SIGF2= 0
##$SINO= 400
##$SIOLD= 32768
##$SPECTYP= <>
##$SREGLST= <1H.CDCl3>
##$SSB= 0
##$STSI= 32768
##$STSR= 0
##$SW_p= 8223.68421052632
##$SYMM= 0
##$S_DEV= 0
##$TDeff= 65536
##$TDoff= 0
##$TI= <>
##$TILT= no
##$TM1= 0
##$TM2= 0
##$TOPLEV= 0
##$USERP1= <user>
##$USERP2= <user>
##$USERP3= <user>
##$USERP4= <user>
##$USERP5= <user>
##$WDW= 1
##$XDIM= 32768
##$YMAX_p= 466448205
##$YMIN_p= -694231
##$CURPLOT= <Network HP LaserJet P1505>
##$CURPRIN= <$Network HP LaserJet P1505>
##$DFORMAT= <normdp>
##$LAYOUT= <+/1D_H.xwp>
##$LFORMAT= <normlp>
##$PFORMAT= <normpl>
##$SURQMSG= 1
$$ End of Bruker specific parameters
$$ ---------------------------------
##NTUPLES= NMR SPECTRUM
##VAR_NAME=  FREQUENCY,     SPECTRUM/REAL,   SPECTRUM/IMAG
##SYMBOL=    X,             R,               I
##VAR_TYPE=  INDEPENDENT,   DEPENDENT,       DEPENDENT
##VAR_FORM=  AFFN,          ASDF,            ASDF
##VAR_DIM=   32768,         32768,           32768
##UNITS=     HZ,            ARBITRARY UNITS, ARBITRARY UNITS
##FACTOR=    0.250966925370066, 1,           1
##FIRST=     8223.43324360095, -139527,      -49358
##LAST=      0,             -149832,         52012
##MIN=       0,             -694231,         0
##MAX=       8223.43324360095, 466448205,    0
$$ Real data points
##PAGE= N=1
##DATA TABLE= (X++(R..R)), XYDATA
$$ [...]
19469G9977I368K69935b09767F9185J3694K378c4152F1707b39385A69752a87511
19457c59800b1506A14089i2782c523o3525A3840J60184b19512B3471J85388D2773
19445a41879G9742a12166c9037q8954e4829g515A48882a05005j72785j87500a61685
19433b58700n848I0280a16788j33576C9592J40609a85491B37837a7870B97286
19422A89927b17763j37116e0739j26410A62134D3129K32287b03952J3593A97604
19411b8513B74374j14564a58726l31140a37505F2136K4644m3130c57293A90670
19400a25449L7467A72986J62286a88900H0434a58104b5599A46884R915n3787R5717
19389A98729a6733C4075h0695A15171a26435j2918A90579a5759F3965a96743b1764
$$ y = [79977, 9368, 279303, -209767, 69185, 82879, 85257, -34152, 61707, -239385, 169752, -187511, -359800, -21506, 114089, -92782, -3523, -67048, 13840, 174024, -219512, 23471, 208859, 42773, -141879, 79742, -112166, -39037, -127991, -54829, -7515, 148882, -105005, -277790, -465290, -161685, -258700, -264548, 90280, -116788, -250364, 39592, 180201, -185491, 237837, -17870, 297286, 189927, -217763, -354879, -50739, -177149, 162134, 43129, 275416, -203952, -190359, 197604, -28513, 274374, 159810, -158726, -489866, -137505, 62136, 86780, 43650, -357293, 190670, -125449, -87982, 172986, 335272, -188900, 80434, -158104, -25599, 146884, 156799, 103012, 198729, -16733, 34075, -80695, 115171, -126435, -139353, 190579, -15759, 63965, -196743, -21764]
19377A16396a38936c2346C9112b69318R893I7411m2476b95036L8910M8072h6564
19365H9790b33142B39404c61773J01180j02362d9765a6341k62051a5203I3387
19354b61492M2989A73874c02507A31631d9710k61594A66973f5464o9860F8792
19343I4026h0407G5560a58538A29037c58274A90037b57102J22305J2703M9224
19333g2870A53784c10473f8538j08719A02659B0063h0865B68008d13298F8666
19322a39212n8702d9756A26745j8180b65761d6031J5394r7167b1836C8313c31790
19310f378k95862C83562A71507b80806g6124G7684a44283k00252O3137a09136
19299a31695d2892r6437j00207m123r3737a16646p7880h1478k11311J37054B50501
$$ y = [116396, -138936, -32346, 39112, -269318, -259425, 97411, 54935, -295036, -256126, -208054, -86564, 89790, -233142, 239404, -361773, -260593, -362955, -49765, -16341, -278392, -15203, 93387, -261492, -218503, 173874, -302507, 131631, -49710, -311304, 166973, -65464, -135324, 68792, 94026, -80407, 75560, -158538, 129037, -358274, 190037, -257102, -134797, -122094, -72870, 153784, -310473, -68538, -177257, 102659, 20063, -80865, 268008, -413298, 68666, -139212, -197914, -49756, 126745, 108565, -265761, -46031, -30637, -127804, -21836, 38313, -331790, -6378, -302240, 383562, 171507, -280806, -76124, 77684, -144283, -344535, -281398, -109136, -131695, -42892, -139329, -239536, -243659, -337396, -116646, -194526, -81478, -292789, -155735, 250501]
19287a89223c1166k02266k07137i0767j78450a12747A7446a30868c3792k00798
19277b34590A23205J42071B4967a7828j21092a8813A09403d17709E2744c6925
19266c4562B52802b67043B12672r1103J72676e6994G4835e70301b32126A37312
19255b19039N8204I3304a35318o4586A4735a58885j83848J33795R5086E149c8442
19243I214J61345h8240q682C93425a56557j01354d2939A11431M919b51116G6997
19231A20915a1569C4665b26708K7537E8999a67281q8006R1589A5334i841m8571
19220e8412q022j51118f3974f092I3096b91273i5254o6836j16436I4290e04514
19208b24921B39034D8585a37617J4814R88k23595a15679j52631g5214A11567c20135
$$ y = [-189223, -31166, -233432, -440569, -90767, -269217, -112747, 17446, -130868, -33792, -234590, 123205, 265276, 24967, -17828, -138920, -18813, 109403, -417709, 52744, -36925, -34562, 252802, -267043, 212672, 121569, 294245, -56994, 74835, -570301, -232126, 137312, -219039, -160835, 93304, -135318, -199904, 14735, -158885, -342733, -208938, -113852, 5149, -38442, 9214, 170559, -88240, -96922, 393425, -156557, -257911, -42939, 111431, 116350, -251116, 76997, 120915, -11569, 34665, -226708, -199171, 58999, -167281, -255287, -163698, 15334, -9841, -58412, -66434, -217552, -63974, -6092, 93096, -291273, -95254, -162090, -278526, 94290, -504514, -224921, 239034, 48585, -137617, -122803, -121815, -345410, -115679, -268310, -75214, 111567, -320135]
19196A33204k0757a93357D866c69045D4749b9944D008a00374d1800A3151c83017
19184H676a23111l1206d7360C0372b25137H0313A2204a67872F8605c4226K270
19173c1956p845q4775k41179a16887B65085a21395k35053A40963a78582m4727
19163b23309J11351j46862E2576a420H8569b42074a06831M3474l6946D8499M8005
19152I6504j8036B622b98509B03433b22056A6802a33688r5999f6011A02631i3432
19140f5941J8152E5093a70461A25975b09397N7484C2468a89721A43556b595E3269
19128d9128a2175I1613a10300l09202a70631A50627f5227A57931a79412A65429
19117g1873k2580q0868g3673j68179R779A23856b52444P8818K7393C9397c1608
$$ y = [133204, 112447, -193357, 4866, -369045, 44749, -29944, 4008, -100374, -41800, 13151, -383017, 8676, -123111, -154317, -47360, 30372, -225137, 80313, 12204, -167872, 68605, -34226, -31956, -39801, -124576, -365755, -116887, 265085, -121395, -356448, 140963, -178582, -223309, -111958, -258820, 52576, -1420, 88569, -242074, -106831, -63357, -100303, 48499, 96504, 78468, 2622, -298509, 203433, -222056, 16802, -133688, -229687, -66011, 102631, -93432, -65941, -47789, 55093, -170461, 125975, -209397, -151913, 32468, -189721, 143556, -2595, 53269, -49128, -12175, 91613, -110300, -419502, -170631, 150627, -65227, 157931, -179412, 165429, -71873, -94453, -175321, -73673, -241852, -232073, 123856, -252444, -173626, -146233, 39397, -31608]
19105G0840b08291H4041C0340K2284K2392B7188d6825q2032H7834d03241F6858
19093F9713B4649H650b43843D0435c4480k32407B01555c15710A08535c47281g2136
19081b22379a03755l1288B01782a12291j64588N7073d5012A33706A8740L31771
19071C50511c1739A45425a69008A01169J11431a18982A28419c79970B15351b04735
19060A10220J03958a56452B75911O4921h2436C6101d5197A8441J99085b37612
19049A60845G8241J94842r6525b13578L0629A33876F5869j7553n544a12188j3254
19038a25442m3091j72298e5199A15398e3208b1921C5676e8979j45279B6338K5120
19027E1458R2600A7943a49368l8283D113Q2167P0197p1285a86863R1324j494k80003
$$ y = [70840, -208291, 84041, 30340, 52624, 75016, 27188, -46825, -128857, 87834, -403241, 66858, 69713, 24649, 8650, -243843, 40435, -34480, -266887, 201555, -315710, 108535, -347281, -72136, -222379, -103755, -135043, 201782, -112291, -276879, -219806, -45012, 133706, 18740, 350511, -31739, 145425, -169008, 101169, 212600, -118982, 128419, -379970, 215351, -204735, 110220, 214178, -156452, 275911, 340832, -82436, 36101, -45197, 18441, 217526, -237612, 160845, 78241, 273083, 176558, -213578, -182949, 133876, 65869, 48316, 42772, -112188, -125442, -168533, -340831, -55199, 115398, -53208, -21921, 35676, -58979, -204258, 26338, 51458, 144058, 17943, -149368, -187651, 4113, 86280, 156477, 85192, -186863, -95539, -97033, -377036]
19015c77036a10124n965B8860g1910E6363b0923j32932D23913a9513L875A1959
19003a33760O0075C8240a12550j00274A40490a812j16j53612k20280J56928f2915
18991f3214b2597H354d0025j60722L7629j5749b4425D2965a40931j15252o6837
18980c23020a31941D0946b25601a08561m8878k88126b17095C8082K25032d0833
18969G4619K19372K604E4637a86162A33979M107a57605B22236F9767J12679O8226
18958B50672k7411J06231j53592L89903j55272l0882q6165c0908B0197c702m21480
18947d25182R5671B70489d85302a7675m4517A56304d7681a0795j28369F7600k1786
18936D5814b88123B291a42905B07903c55318K6576j0332B50303a10648A40804
$$ y = [-377036, -110124, -116089, 28860, -71910, 56363, -20923, -153855, 423913, -19513, -15638, 11959, -133760, -73685, 38240, -112550, -212824, 140490, -1812, -1928, -155540, -375820, -218892, -62915, -63214, -22597, 8354, -40025, -200747, -163118, -178867, -24425, 42965, -140931, -256183, -323020, -131941, 40946, -225601, -108561, -157439, -445565, -217095, 38082, 263114, -40833, 74619, 293991, 296595, 54637, -186162, 133979, 138086, -157605, 222236, 69767, 182446, 250672, 223261, 329492, 175900, 565803, 410531, 379649, 293484, -30908, 20197, -3702, -425182, -329511, 270489, -485302, -17675, -62192, 156304, -47681, -10795, -139164, 67600, 45814, -288123, 2291, -142905, 207903, -355318, -328742, -339074, 250303, -110648, 140804]
18925I9026M4127d5777Q771m2158l1530C11661A4841N9477A8182L0658J79931
18914B28771E4819h6298n942E787b69675J18666A53203a74526C25306E8488a56140
18902E5756b41861p2912h6930L82k2850K8161C3694d4905C22969H9749K48305
18891C38054O1703I8091k9265k0524f3105k89443f6403a1976l201k39621g540
18879b36682o3765J00676E681a60404P1017A09852a89222h4935k29196R4352j1674
18868b31453d9481j68385d6099E3980c20717R3598A05689b40248B25606a03680
18857e8555k1338k0729B22929g4948m2106l954D71378a64679h0411j26891A13323
18845e1776B73279b08831p0365A90872a80515L5475c9278I579M89231a15025A56390
$$ y = [99026, 143153, -45777, -37006, -79164, -110694, 311661, 14841, 74318, 18182, 48840, 228771, 54819, -86298, -92240, 5787, -269675, -151009, 153203, -174526, 325306, 58488, -156140, 55756, -241861, -314773, -86930, -86548, -109398, -81237, 33694, -44905, 322969, 89749, 338054, 399757, 98091, 68826, 48302, -63105, -352548, -66403, -11976, -15177, -254798, -7540, -236682, -300447, -199771, 5681, -160404, -89387, 109852, -189222, -84935, -314131, -219779, -231453, -49481, -217866, -46099, 53980, -320717, -227119, 105689, -240248, 225606, -103680, -58555, -79893, -100622, 222929, -74948, -117054, -121008, 471378, -164679, -80411, -207302, 113323, -51776, 273279, -208831, -279196, 190872, -180515, -145040, -39278, 9579, 498810, -115025, 156390]
18833E8644d9180J6158C21430a6711A51128e4166B78081c39044B39277a29207
18822c0027k48398i9356k18669c7421l3133k45735a18559M5899A0877i9352D7394
18810H9650a78175A37788a59914D8610q040c2491F2063R4281D8152b22254A11700
18798c2048A23720a90316B32539e6517A41648c8790A26191r393e8203B57351G9131
18786B32096b15851i1793k73791I1288h1400b7841B27249h1865j41468C46861
18775b81519i6983m5390b0988j01577A25986c19486D2892J86037A9785g9857l02467
18764c82324a08119c904k85850F6468g8392k1110n6741G4296a47197A18296f266
18752a39506o2958C0130a97873f797k86197j68504A70611C5043i2964n193q6129
$$ y = [58644, -49180, -33022, 321430, -16711, 151128, -54166, 278081, -339044, 239277, -129207, -30027, -278425, -99356, -318025, -37421, -70554, -316289, -118559, -72660, 10877, -99352, 47394, 89650, -178175, 137788, -159914, 48610, 40570, -32491, 62063, 156344, 48152, -222254, 111700, -32048, 123720, -190316, 232539, -56517, 141648, -38790, 126191, 116798, -58203, 257351, 79131, 232096, -215851, -91793, -365584, 91288, -81400, -27841, 227249, -81865, -223333, 346861, -281519, -96983, -142373, -20988, -122565, 125986, -319486, 42892, 228929, 19785, -79857, -382324, -108119, -3904, -289754, 66468, -78392, -99502, -156243, 74296, -147197, 118296, -6266, -139506, -202464, 30130, -197873, -6797, -292994, -461498, 170611, 35043, -92964, -98157, -184286]
18741a84286h863G1147a1590r0350L8500A37779e7782j23147k28449a40993D1318
18729b48182M3675o0728B2749R4156a55888A36711C6021J05153b6922l80545A02347
18717a43835q6563G842Q5451J57295A07352a09397n4574A3997i5033A4732f1049
18705g7219j6704k23156D8916b208A74109a37328I2118a49354j05262r4594A63091
18693A45004h3790J9095l59707B41020a8988j96732Q6675j7809j74642i9691c6420
18681c22349R2366B44971i8346l4925j47998d7025q0004F7740N8662m6909a39387
18669a50251l19740a31963I5638L86740B11363d4351k32000d1513q6237c1257
18658f5166A65139K35D4255L61427b46863R1456E2801J77067h9915L6608D315
$$ y = [-184286, -8863, 71147, -11590, -101940, -63440, 137779, -57782, -180929, -409378, -140993, 41318, -248182, -204507, -265235, 22749, 116905, -155888, 136711, 36021, 141174, -26922, -407467, 102347, -143835, -230398, 7842, 93293, 250588, 107352, -109397, -163971, 13997, -95033, 14732, -61049, -77219, -93923, -317079, 48916, -2208, 174109, -137328, 92118, -149354, -254616, -349210, 163091, 145004, -83790, -64695, -424402, 241020, -18988, -215720, -129045, -146854, -321496, -99691, -36420, -322349, -229983, 244971, -98346, -133271, -281269, -47025, -127029, 67740, 126402, 79493, -139387, -150251, -469991, -131963, 95638, 482378, 211363, -44351, -276351, -41513, -127750, -31257, -65166, 165139, 165374, 44255, 405682, -246863, -155407, 52801, 229868, -89915, -53307, 4315]
18646A56730a04688p8571I8629J08902d17285A50512a45712K9003D42639A9484
18635F8291M5828c25801b8376A20958c8262A06560a01654p6381N2427e4071A95649
18623F5300a59252b2711k02694A01694b57184H6804a05002k44611d9651j12337
18613a61988K0940f1481n7574c985o6814j86506e4588A22567A0921a04639g571
18601a54378K2810k51942B358b19253C8764J42892c71358C9834i3223A60799c5975
18589e14856a83648E76J88993F2438R0139a03609I4625k3779b35468Q719g2616
18577H8738c7382o6650M1217k96732N9380P9235L9825A65389J08894c7807j17658
18566a55465i042l0984A0910b04495i8192j16066l3973D3440a37739K39C5296
$$ y = [156730, -104688, -183259, 98629, 207531, -417285, 150512, -145712, -116709, 442639, 19484, 68291, 114119, -325801, -28376, 120958, -38262, 106560, -101654, -178035, -125608, -54071, 195649, 65300, -159252, -22711, -225405, 101694, -257184, 86804, -105002, -349613, -49651, -161988, -141048, -61481, -119055, -3985, -70799, -257305, -54588, 122567, 10921, -104639, -7571, -154378, -131568, -383510, 2358, -219253, 38764, 181656, -371358, 39834, -93223, 160799, -35975, -514856, -183648, 576, 189569, 62438, 152577, -103609, 94625, 70846, -235468, -226749, -72616, 88738, -37382, -104032, -62815, -359547, -300167, -220932, -181107, 165389, 274283, -37807, -155465, -9042, -40026, 10910, -204495, -98192, -214258, -248231, 43440, -137739, -137500, 35296]
18554a23202E8616i4697D3872J72057a76362f0475D22226d0295A07276j4987J70190
18543B62479b30501f7585K6427A20999b61750P2273M1104F9745a16135B29723
18532a18282c7564A86219J85270a96927j50896J00549B56093j23350f10616h8419
18521a70183A07270M3485f5758n0817C0531b25069A45678d06188A30084n4818
18511G5266g8325k2450m7947f3381A58709E8240L9252b08458n307b5082k56756
18500b81838J05166C40052a30780B025a28029A86870c30055k7615a04063A83420
18489G1724j875J46019g1319d920p6952k49849p8953A68a54820k44484H7674l8187
18477D9487a6829j18903j35383R0877B1575a20550j8474A09523J20056e1456n5680
$$ y = [-123202, 58616, -94697, 43872, 215929, -176362, -60475, 422226, -40295, 107276, 92289, 262479, -230501, -67585, -41158, 120999, -261750, -189477, -148373, 69745, -116135, 229723, -118282, -37564, 186219, 371489, -196927, -347823, -247274, 256093, 132743, -610616, -88419, -170183, 107270, 150755, -65758, -116575, 30531, -225069, 145678, -406188, 130084, 75266, -78325, -100775, -148722, -63381, 158709, 58240, 97492, -208458, -213765, -25082, -281838, -176672, 340052, -130780, 2025, -128029, 186870, -330055, -357670, -104063, 183420, 71724, 69849, 215868, -71319, -4920, -81872, -331721, -410674, 168, -154820, -399304, 87674, 49487, -16829, -135732, -271115, -180238, 21575, -120550, -139024, 109523, 229579, -51456, -107136]
18466a07136M4827H3712c03183a07259B00081n0715I330b0848j81353A8849K5099
18455D3948G464P0721d05195a34901C74430D4093h8531M0501j42034N2851o6231
18444b03444A7173L03610F067J26508k7567c6721I4771h4444K3200k8914k48804
18433c38962J16287L5924g5254A8604O884e0783E9764J0979a80888Q2814B09126
18421H1948K01615d9145o1226q3816h0417p5931j52593e7054k116a4617D9467
18409a65475B1572L188c88611b9216L637q0049I1529R670D3325a39283B167a39876
18396i8706B18943n2890a28626o3795A64671a3630j78082B09022Q89C3280K8776
18385F2056b28203B06434o2584a15957A7544M7707j380h1516j291F8471d2821
$$ y = [-107136, -62309, 83712, -303183, -107259, 200081, 149366, 9330, -20848, -202201, 18849, 43948, 7464, 78185, -405195, -134901, 374430, 44093, -88531, -48030, -190064, -137213, -203444, 17173, 320783, 6067, 132575, 105008, -36721, 94771, -84444, -61244, -90158, -338962, -222675, -186751, -75254, 18604, 25488, -50783, 59764, 70743, -180888, -98074, 209126, 81948, 283563, -49145, -110371, -194187, -80417, -156348, -308941, -57054, -59170, -14617, 49467, -165475, 21572, 24760, -388611, -29216, -25579, -105628, 91529, 101199, 43325, -139283, 2167, -139876, -98706, 218943, 166053, -128626, -192421, 164671, -13630, -191712, 209022, 209911, 33280, 62056, -228203, 206434, 143850, -115957, 17544, 65251, 63871, -81516, -82807, 68471, -42821]
18373a11867D4815a91046a6857g290l53146f1987B705L3062A698c0071A53823
18361A21390N7028g1028B6775J49319b91491a27977e0213j95533a10434K6183
18351h4251k71263C63357B3809K16737q3969J7315a90275g4184B33163N7520A40575
18339g8705l53376d9140n9310A0215h5588A97045a4172j54112f4649j93238A39071
18327A50232C341J37774a53946N4880l411k0356e1714j6429j11678O9840I0035
18315c78156a52989B70779b47324A97436a53031A23559j5734c56684d9440n8035
18305a07475F3970P4979J57534K4219b10536Q7928k06531a8843D0208A8110a96898
18293b1017l10707h1757j25950f6263A13159J5422J9804J10335b27325B38025
$$ y = [-111867, 44815, -191046, -16857, -7290, -360436, -61987, 2705, 35767, 1698, -30071, 153823, 121390, 178418, -71028, 26775, 176094, -291491, -127977, -50213, -245746, -110434, -84251, -355514, 363357, 23809, 240546, 156577, 173892, -190275, -74184, 233163, 290683, 140575, -78705, -432081, -49140, -108450, 10215, -85588, 197045, -14172, -168284, -64649, -257887, 139071, 150232, 3341, 141115, -153946, -99066, -102477, -122833, -51714, -68143, -179821, -109981, 90035, -378156, -152989, 270779, -247324, 197436, -153031, 123559, 107825, -356684, -49440, -107475, 63970, 138949, 296483, 320702, -210536, -122608, -329139, -18843, 40208, 18110, -196898, -21017, -331724, -81757, -207707, -66263, 113159, 128581, 148385, 258720, -227325, 238025]
18282a49286k984B9662j1159a78163f480A12748a60412A5984M1092J30451b4085
18270B44052h405m0118J046J8299k67175d2243H3552L7176a50644B77840b79325
18258a44406l9868A76089e4908d116k41676j02736g6609q9226k07836A01167a31139
18246c59960a16512M3079A5178c8389o6391A9045Q4729K957a0530I325c07500
18234b3272p3141c3402B48143q1260b38346B39349q4086b24205C8523K20212A03610
18222a8776j7404p8277A18454c34405A07327b7301E9897J2235b335C7017a95380
18210c61110F6001N5190l4578J23001B8424i8688C74N1586N8205k6827b58599
18198a3094k30788N9634N5240E5760i5531I0543c97691A60023a96647o6608a20988
$$ y = [-149286, -152270, 29662, 18503, -178163, -6480, 112748, -160412, 15984, 57076, 187527, -24085, 244052, -8405, -48523, -47477, -29178, -296353, -42243, 83552, 120728, -150644, 277840, -279325, -144406, -184274, 176089, -54908, -4116, -245792, -348528, -76609, -165835, -373671, 101167, -131139, -359960, -116512, -73433, 15178, -38389, -104780, 19045, 103774, 106731, -10530, 9325, -307500, -23272, -96413, -33402, 248143, 166883, -238346, 239349, 155263, -224205, 38523, 258735, 103610, -18776, -36180, -114457, 118454, -334405, 107327, -27301, 59897, 72132, -2335, 37017, -195380, -361110, 66001, 121191, 86613, 209614, 28424, -98688, 374, 51960, 110165, 83338, -258599, -13094, -243882, -184248, -129008, 55760, -95531, 90543, -397691, 160023, -196647, -263255, -120988]
18186A34428b31755C63525j80770M1402a41183i047o362f576k02236e326l8260
18175d3586J0877D71889a57924j3281j94539J75798B47039H5232B2189a28275
18164c33593e3225C0147f3869E3828N8750N1562c05995J52434A73789C8909a27597
18152c18459F5291L4545c38022B63099B7620Q1581M8672a77176D9224a18219F58
18140A98984i0585k6294A95124q7281f2491A79758c23619B40638e9606H5410a43371
18128h4297p320B92361b40767g4531A42905a03765I336a71996A4083a24392o0181
18117a84573a5571j51576B30192J7961c6337A59846n0148a86235f9600F1388d19712
18105A59824O739g3989j2084B58037A26706b45882a04607E7585J03755e5235k54965
$$ y = [134428, -231755, 363525, 182755, 224157, -141183, -9047, -15409, -6576, -208812, -5326, -43586, -32709, 471889, -157924, -171205, -365744, -189946, 247039, 85232, 22189, -128275, -333593, -53225, 30147, -63869, 53828, 112578, 164140, -305995, -153561, 173789, 38909, -127597, -318459, 65291, 99836, -338022, 263099, 27620, 109201, 157873, -177176, 49224, -118219, 658, 198984, -90585, -116879, 195124, 107843, -62491, 179758, -323619, 240638, -59606, 85410, -143371, -84297, -91617, 292361, -240767, -74531, 142905, -103765, 9336, -171996, 14083, -124392, -184573, -15571, -167147, 230192, 248153, -36337, 159846, 109698, -186235, -69600, 61388, -419712, 159824, 166563, -73989, -86073, 258037, 126706, -245882, -104607, 57585, 161340, -55235, -310200]
18094c10200B6342a20367B764L37515A51189J8667B4739d0937j85843h702m3483
18083e2185C8826a91872d9781p8955n9065g6100j07375P7904F9590a11138A81073
18071b42808O650B40817b14864E3185K958J4262J11176b04782l7119A14489b81619
18059a47659A0408i8848E5138Q5786c1730A80980q4691a6169E7290M3484a56401
18047b21168A1814a25027J7777n6636I5286M5228J30745c0890j99120G6916L50334
18036D27250d1280B34928F2505f7110j34482I5174k3381b2432C4634L842b69956
18024c43391A26167b93699H4608k2441f2334D5644R7818b1627B5692a52239G2791
18012b99619J02488B9319a79039I4057b9875j68836N1605A43888R5092F9927B5888
$$ y = [-310200, 26342, -120367, 2764, 340279, 151189, 169856, 24739, -40937, -226780, -8702, -52185, 38826, -191872, -49781, -128736, -187801, -76100, -183475, -105571, 69590, -111138, 181073, -242808, -236158, 240817, -214864, 53185, 56143, 70405, 181581, -204782, -241901, 114489, -281619, -147659, 10408, -98848, 55138, 140924, -31730, 180980, 96289, -16169, 57290, 100774, -156401, -221168, 11814, -125027, -107250, -163886, 95286, 140514, 271259, -30890, -230010, 76916, 427250, -41280, 234928, 62505, -67110, -201592, 95174, 71793, -22432, 34634, 38476, -269956, -343391, 126167, -293699, 84608, 62167, -62334, 45644, 143462, -21627, 25692, -152239, 72791, -299619, -197131, 29319, -179039, 94057, -29875, -198711, -147106, 143888, 238980, 69927, 25888]
18000A90479b3207A74192a52244C1581M9476L04220b74027C5914j6723b45340
17989b59632A26340J29688D222d5265j4486H8549g4995o6519d1269G0801a818
17977a72953c3167k91056P1132B47487b02849F2336b32294N7372A46781D6596
17966B27470b94026J02447J8138d8238A85464f7166r4168a5091A43405C4601K17745
17955B52346b45391h7863D9399A6237a7472D779J70551E6374e56978B22974c32152
17943h3380C25306Q412d6468j7185k24750a11422A34183J01868A04861g7262B61503
17931c6398r3536C22866a8124r4705F5821M80j1041L8819a39072A37968B8218
17919h8657A3794c07742A54402a9458A08755a14169B0368K0197K51134a32019
$$ y = [190479, -23207, 174192, -152244, 31581, 81057, 385277, -274027, 35914, 19191, -245340, -259632, 126340, 256028, 4222, -45265, -59751, 88549, -74995, -141514, -41269, 70801, -1818, -172953, -33167, -324223, -253091, 247487, -202849, 62336, -232294, -174922, 146781, 46596, 227470, -294026, -191579, -173441, -48238, 185464, -67166, -161334, -15091, 143405, 34601, 252346, -245391, -87863, 49399, 16237, -17472, 4779, 175330, 56374, -556978, 222974, -332152, -83380, 325306, 333718, -46468, -63653, -288403, -111422, 134183, 236051, 104861, -77262, 261503, -36398, -129934, 322866, -18124, -112829, 65821, 66301, 55260, 94079, -139072, 137968, 28218, -88657, 13794, -307742, 154402, -19458, 108755, -114169, 20368, 40565, 291699, -132019]
17908b06911A87815J63404j22398A13634d8351B17790a52387b6674r6809D475
17897D04375e6686D328a21411A0203m493f5443A50950P4894D5194O5138f2671
17885B13284k9876R418a87388P09G7092a38810A40499D3908J24976h4914j19409
17874b04323n9272K926e2562H9019b12358G3092d5557j88882B50226b248A05269
17862E6315J50463d5822B21382g3804j91212j54536F0648d1501n8212A21684j9067
17851A02617m9188a27426A24134D2956J43307p6672a56220C15211o817a14084
17840I2169a03214G7732J84449q4278o2165J6315n9949a29053e9886k09018A3508
17828h8641E9104L4657M0029a03967E7210L66648c05916d3449b0497j44092r5620
$$ y = [-206911, 187815, 351219, 228821, 113634, -48351, 217790, -152387, -26674, -123483, 4475, 404375, -56686, 4328, -121411, 10203, 5710, -65443, 150950, 225844, 45194, 110332, -62671, 213284, 183408, 192826, -187388, -186679, 77092, -138810, 140499, 43908, 168884, -84914, -204323, -263595, -260669, -52562, 89019, -212358, 73092, -45557, -234439, 250226, -2248, 105269, 56315, 206778, -45822, 221382, -73804, -265016, -419552, 60648, -41501, -99713, 121684, 102617, 53429, -127426, 124134, 42956, 186263, 109591, -156220, 315211, 308394, -114084, 92169, -103214, 77732, 262181, 177903, 115738, 132053, 72104, -129053, -59886, -268904, 13508, -88641, 59104, 93761, 133790, -103967, 57210, 423858, -305916, -43449, -20497, -164589, -260209]
17817b60209Q6914B88371A43527J67449j0847e6271j28390A92683p8269h0519
17806C05903E2702i7803C44819a38940j12680i0992A47422O6805a92303b2019
17795B55678a10030j1547d1406B48469K3530b98393B13636c8037B03990n6893
17785A47097a6345j80280e7493B42865K01763A82464H9069P663Q6228B3040a13468
17773C96848j17806M1788a99818O2768A33105b40464h9830A25231b6008I1798
17762C96812A6535J80834K30909B4933L08841b47342N1548q4174H1615I470J32537
17751A42007f1281j2827D03840b50033A70974J84786j27098a73523C14662j07377
17741B07285N1187A15265a0593A13828O9183n9400b5366A90308K2649c80295J86312
$$ y = [-260209, -173295, 288371, 143527, 310976, 300129, -56271, -184661, 192683, 114414, -80519, 305903, 52702, -97803, 344819, -138940, -251620, -90992, 147422, 214227, -192303, -22019, 255678, -110030, -121577, -41406, 248469, 271999, -298393, 213636, -38037, 203990, 147097, -16345, -196625, -57493, 242865, 444628, 182464, 89069, 96732, 182960, 23040, -113468, 396848, 279042, 320830, -199818, -137050, 133105, -240464, -89830, 125231, -26008, 91798, 396812, 16535, 197369, 428278, 24933, 333774, -247342, -195794, -279968, 81615, 9470, 142007, -61281, -74108, 403840, -250033, 170974, 355760, 228662, -173523, 314662, 207285, 258472, 115265, -10593, 113828, 183011, 123611, -25366, 190308, 212957, -380295, -193983]
17730a93983B85277h8353A58438K25247l8562A1942P8308J7386N3292G9750a23339
17718C91021c09250A69124C3936a54761L7717A98117C8828b9726j9482o075A38805
17706B24939a31991B34829M3650A20462q691l4470e6874B03815e3022j56422C80810
17694h9414J4351k24410A34681K89295j73066q9977a17627A1279i9470A47524
17683C78050c0477k26634I2099D3689K50923E996d8826k9024A83439C4490K0543
17672E5033L88166g1484F4423J39187f3616F9721a9767A74133c7406r535k22144
17661b69085C96059a70967c0718B01780G5010b14141A21450a87854g09l3829o6413
17650a00951I786L77627a04085A95761e0165B27854b02983F7862b5541j66615
$$ y = [-193983, 285277, -88353, 158438, 383685, 345123, 11942, 90250, 107636, 160928, 79750, -123339, 391021, -309250, 169124, 33936, -154761, -117044, 198117, 38828, -29726, -49208, -55283, 138805, 224939, -131991, 234829, 278479, 120462, 111771, 77301, -56874, 203815, -53022, -209444, 380810, -89414, -75063, -299473, 134681, 423976, 250910, 160933, -117627, 11279, -99470, 147524, 378050, -30477, -257111, 92099, 43689, 294612, 5996, -48826, -77850, 183439, 34490, 55033, 443199, -71484, 64423, 203610, -63616, 69721, -19767, 174133, -37406, -46941, -269085, 396059, -170967, -30718, 201780, 75010, -214141, 121450, -187854, -709, -34538, -100951, 9786, 387413, -104085, 195761, -50165, 227854, -202983, 67862, -25541, -192156]
17640a92156A15800J13701m1214a8817E8308J54216p1425a75451b4974k7162A77694
17628B28428g6027C04297i3259A59356c27376F081J21339N7518J27469K0413O7855
17617D00675g7179A70111B4524b04659K174A29800J24476i358B65064k8686e3916
17605B47146I7685J51482o511i3283D5402a86787B2227c8380G0142a78683B81786
17593A6963a70229n6386H5127L2301E7179b15583B70255j34223J11525r0504a54087
17581a1131p1989A36763b70221A83336f5945B61438c4110A2526J03082D1164a99216
17569B4852L65240g6601B95046A32141o3188i2300L5350k1258C15936A05162C0071
17557C01599M9009j42756O7018Q2858j7031A21157M05683e8166a1455j511m1994
$$ y = [-192156, 115800, 229501, 188287, -18817, 58308, 212524, 141099, -175451, -24974, -52136, 177694, 228428, -76027, 304297, -93259, 159356, -327376, 6081, 127420, 184938, 312407, 332820, 400675, -77179, 170111, 24524, -204659, -202485, 129800, 254276, -9358, 265064, 236378, -53916, 247146, 97685, 249167, 242656, -93283, 45402, -186787, 22227, -38380, 70142, -178683, 281786, 16963, -170229, -226615, 85127, 117428, 57179, -215583, 270255, 136032, 247557, 157053, -154087, -11131, -83120, 136763, -270221, 183336, -65945, 261438, -34110, 12526, 115608, 41164, -199216, 24852, 390092, -76601, 295046, 132141, 68953, -92300, -56950, -78208, 315936, 105162, 30071, 301599, 350608, 207852, 274870, 357728, 340697, 121157, 526840, -58166, -11455, -12966, -54960]
17546e4960C29433p3632o0780m8678K92475A97357j656n0352l4709c8793A07754
17534A90260j7448K4748L4755M8655l40M4746j23617K76850B29026J9312O1021
17523C09359C8279J90815Q1801M2609A40451H200K70894q7571K65142J60987k50505
17512C67147R9346l7208J25847N37314k49312j47790K21829k93074k32184m5706
17502C46209Q0131l8918A12683J96796l656j4950R9182L53848K34134J86638k73262
17491H91413l94584Q2132n3388A61857L72244B61937L48292B89192K099j40519
17481A50772M7362N9492K68843j82193J8370G9780K37636q4741E5566J66719M6096
17470B68381p1693K52901j93148A05906J05708J01576K9791j01297o4507N757
$$ y = [-54960, 329433, 255801, 195021, 146343, 438818, 197357, 195701, 145349, 110640, -38793, 107754, 190260, 172812, 197560, 232315, 280970, 280630, 325376, 201759, 478609, 229026, 248338, 309359, 38279, 229094, 310895, 353504, 140451, 8200, 279094, 191523, 456665, 617652, 367147, 466493, 429285, 555132, 1092446, 843134, 695344, 917173, 624099, 391915, 346209, 426340, 387422, 112683, 309479, 305823, 290873, 390055, 743903, 978037, 1164675, 891413, 496829, 578961, 525573, 161857, 534101, 261937, 610229, 289192, 291291, 150772, 198134, 257626, 526469, 344276, 362646, 79780, 317416, 232675, 55566, 222285, 268381, 196688, 449589, 256441, 105906, 211614, 313190, 342981, 241684, 177177, 182934]
17460A82934K38565M8843G9616J31825K48897A01547D185N46210B42825P2316
17450C15141J63974A46043J59526m5143J57792I5715Q9499L6194K14238e5621
17439A47583J11034j03978L98293j77712j30864J63423J94435k12841K2237N1116
17429D62726k167P7264B17553L05009P3231B22396K26136q0381M525j57979L59554
17418E74251k45076F8627N45323j06824A91172J55817p880n1070j05784h1355
17407C28099m4740A30783M7283J56770F1360A5568M07884j1377l8143j21128L29984
17396E82788G6982K57230A10199P4362J79359n0934J47815K96558a350B31161
17385D94066A11054d2131I1855Q6720K56886A98766a22633M3697A82369a52146
$$ y = [182934, 421499, 470342, 79616, 211441, 460338, 101547, 4185, 550395, 242825, 315141, 479115, 146043, 305569, 260426, 418218, 95715, 185214, 221408, 435646, -55621, 147583, 258617, 154639, 552932, 375220, 244356, 407779, 602214, 389373, 411610, 462726, 460559, 537823, 217553, 522562, 595793, 222396, 448532, 368151, 372676, 214697, 574251, 329175, 68627, 613950, 507126, 191172, 346989, 339109, 288039, 182255, -81355, 328099, 283359, 130783, 178066, 334836, 61360, 15568, 423452, 412075, 373932, 252804, 582788, 76982, 334212, 110199, 184561, 363920, 312986, 460801, 757359, -1350, 231161, 494066, 111054, -42131, 91855, 178575, 435461, 198766, -122633, -78936, 182369, -152146]
17374E2064K38848j39168F4094k4917J46518M43715B59636N9380n3105a07289
17363h848B70223E8480k7815J68185I4591L75321E9115l192L2501J83547p23R7256
17351C68504A54859j7635J98640o0611e9978A1380M03985j49482A31808n4377
17341G7431l5710M1427J93856r9416K7318E9028K88517o0126j38954n5634J6231
17330A09062J83457l7117J67798B2291M52943L3790A72542G1593J00791B2634
17319A9106d8339E08077A53991K98648G0209K6536J4332J58159j15307f6324B86011
17307C50759J45758B05570K46786p6221A34493k997L29487a20284H52429A90024
17296B94081Q4293Q1218A85217K36557A66369p6361R4425J31887A08821k4291
$$ y = [52064, 290912, 151744, 64094, 39177, 185695, 629410, 259636, 319016, 265911, -107289, -8848, 270223, 58480, 30665, 198850, 94591, 469912, 59115, 55923, 88424, 271971, 271248, 368504, 154859, 137224, 335864, 275253, -59978, 11380, 415365, 265883, 131808, 77431, 41721, 83148, 277004, 177588, 204906, 59028, 347545, 287419, 148465, 92831, 109062, 292519, 255402, 423200, 22291, 475234, 509024, 172542, 71593, 172384, 22634, 19106, -48339, 508077, 153991, 452639, 70209, 96745, 111077, 269236, 153929, -66324, 286011, 350759, 496517, 205570, 452356, 376135, 134493, 131496, 460983, -120284, 852429, 190024, 294081, 378374, 459592, 185217, 421774, 166369, 90008, 184433, 316320, 108821, 84530]
17286H4530K2658K24208K21376j86843L23071k23400k23986G1175L1881M43331
17276E46387k8165A67483J1140E7913c8496B81207J39319J05944B38075j10541
17266A27534f453B23158F4104K12521a21119D03284A24372J55829J342P966K10574
17255E00083k24673m8944o188O7787D0620K23661e8158D01297J37526j06703A28673
17243D38751A39528K97036j66371P4520m9669M7125A07226J63577R5584J2620
17233C79007K1518J23036j93850O6959q0718A48332R3196K12504A01606K46379
17223C47985K93007q7060B25723M16549G1446L36017G2847M92531k70936H0661
17212D05065H2094L32006r3984K08925A41276l4367N2178J23734K19656B48778
$$ y = [84530, 107188, 331396, 552772, 365929, 689000, 465600, 241614, 71175, 103056, 546387, 518222, 167483, 178623, 57913, -38496, 281207, 420526, 526470, 238075, 127534, -6453, 223158, 64104, 276625, -121119, 403284, 124372, 280201, 281543, 289509, 500083, 275410, 226466, 220278, 288065, 40620, 264281, -58158, 401297, 538823, 432120, 128673, 438751, 139528, 436564, 270193, 344713, 295044, 342169, 107226, 270803, 366387, 379007, 400525, 523561, 329711, 396670, 315952, 148332, 241528, 454032, 101606, 347985, 640992, 553932, 225723, 642272, 71446, 407463, 72847, 565378, 294442, 80661, 405065, 82094, 414100, 320116, 529041, 141276, 106909, 159087, 282821, 502477, 248778]
17201D06656j78046K40772l6135J13806A92681L11121j15707L11976l01411n1930
17191C46730G3450J42086E5082J19515K39427M6092j68386N4601P0382j01418
17181C15295L43561L0062j69197j57756Q4182b7292C86645B5059M03303r3499
17171C34863N7139j06741K70533k59071E0716J02117P1181L22311B65218K81809
17161E47027j76849A75796K5262K59219j96515Q8078j67884N31533C48204A43453
17150C72232n7528P3658j2292P9766K2625R1443r4029j98140M94115l19611n056
17139D47183P1634N5587k63853J04600J40122j73895A50069K77765R5435j11953
17129D11316j55457K28366j24665L0283J84463P6809n8391j38764j35451L14032
$$ y = [406656, 228610, 469382, 433247, 547053, 192681, 503802, 388095, 700071, 398660, 346730, 73450, 215536, 55082, 174597, 414024, 460116, 291730, 346331, 416713, 315295, 658856, 688918, 519721, 361965, 446147, -27292, 386645, 25059, 428362, 334863, 392002, 285261, 555794, 296723, 50716, 152833, 224014, 546325, 265218, 547027, 370178, 175796, 201058, 460277, 263762, 351840, 183956, 715489, 348204, 143453, 372232, 314704, 388362, 376070, 455836, 478461, 569904, 475875, 277735, 771850, 452239, 447183, 518817, 574404, 310551, 415151, 555273, 381378, 150069, 427834, 523269, 411316, 255859, 484225, 359560, 389843, 574306, 651115, 592724, 453960, 318509, 632541]
17119F32541j40068J8749j94223M07990k57001K45494C30478N00515D03702M10297
17109H13999C32768K27745J00888A50653L15653j40099J9594K07743R8656N9164
17099G11364J53071D05086K38521j83276K23754j85670J18820L6594l2069K90416
17089I12176k57698q1824L79188l47032P7982k03586L51063l56048L58958C96430
17078E35334r64o1866k0531J59374B69093O2404K19161J16283B28225M36843j48281
17067E16787L5384P2642k8126O2859O2144M9260N5344j76371K91388k71159J64806
17056H34958l30460J44219r8947o8178L41649J23517q2104j79223j67093K30138
17046G48476J5695P6368J34345l7426k30150k57089L54002k8532J49549j02634
$$ y = [632541, 492473, 511222, 316999, 724989, 467988, 713482, 330478, 830993, 403702, 813999, 332768, 560513, 661401, 150653, 466306, 326207, 345801, 553544, 652200, 711364, 864435, 405086, 643607, 460331, 684085, 498415, 617235, 653829, 621760, 912176, 654478, 572654, 951842, 604810, 682792, 479206, 830269, 474221, 833179, 396430, 535334, 534370, 472504, 451973, 611347, 269093, 331497, 550658, 666941, 228225, 665068, 516787, 552171, 624813, 596687, 659546, 721690, 770950, 826294, 649923, 941311, 670152, 834958, 504498, 648717, 549770, 481592, 823241, 946758, 864654, 685431, 518338, 748476, 764171, 840539, 974884, 937458, 707308, 450219, 804221, 775689, 925238, 822604]
17036H22604r4141J90290l72624L44594O9476l98858J8524K08289K20578l20247
17026F88485N5260J58546r8282K60961l37997K43779k40198K53949J14547L2494
17016A131544l25502j76910L06561L3258m9022j93463j21094M05227Q9324E40868
17005H57157k50515L20851J60358j14130k39855L38072j12047r7607K05933k33474
16995H34743N8296L09582j83074j18749m6860J09456L5345j01871O2576J91161
16985A150605o2866J17015m99488M75676j2702r482k05753J57454l40847M84765
16975A254377j50751R1450J9656J09206j45771J38542J08692l68003K45769j33147
16965A170020J36697j59503J24174j26545J66255j59082O7027K88307m25136K25668
$$ y = [822604, 728463, 918753, 546129, 890723, 960199, 561341, 579865, 788154, 1008732, 688485, 743745, 902291, 804009, 1064970, 726973, 970752, 730554, 984503, 1099050, 1131544, 806042, 629132, 935693, 968951, 919929, 726466, 605372, 1010599, 1099923, 540868, 857157, 606642, 927493, 1087851, 973721, 733866, 1071938, 959891, 862284, 1068217, 834743, 893039, 1202621, 1019547, 900798, 853938, 963394, 998739, 896868, 959444, 1150605, 1087739, 1204754, 705266, 1180942, 1168240, 1158758, 953005, 1110459, 769612, 1254377, 1103626, 1195076, 1214732, 1323938, 1178167, 1316709, 1425401, 1057398, 1303167, 1170020, 1306717, 1147214, 1271388, 1144843, 1311098, 1152016, 1219043, 1507350, 1082214, 1307882]
16955A307882k903K43196k83662K68244j05011K33172j87518J01042j49796J90305
16945A614951j0223p0379K80743m87194M37663k50768m1724l91847L69853L92553
16935A843628j35902J27574l61932J34753l30464P7911L97507P6713Q2533l67110
16925A545211K45308K34626m33931K37928K60252l89021R0372n9165M53210j77902
16915B006888j61894K09329j53053n3741L45976l53952K8744J5015J13888k57885
16905A739315J92341M05012k74215R7212j24872R0619K08934R6693k78833K65663
16895B417869l05170q2K18356j64143L1362M60329k43248k48062L51267K22707
16885B741185k06579J68303K1686q4253p0735N3246J01148j15273l16847R05232
$$ y = [1307882, 1304979, 1548175, 1264513, 1532757, 1427746, 1660918, 1473400, 1574442, 1424646, 1614951, 1604728, 1534349, 1815092, 1327898, 1765561, 1514793, 1473069, 1081222, 1451075, 1843628, 1707726, 1835300, 1473368, 1608121, 1277657, 1355568, 1753075, 1829788, 1912321, 1545211, 1790519, 2025145, 1591214, 1829142, 2089394, 1700373, 1790745, 1731580, 2184790, 2006888, 1844994, 2054323, 1901270, 1847529, 2193505, 1839553, 1868297, 1883312, 1997200, 1739315, 1931656, 2336668, 2062453, 2159665, 2034793, 2125412, 2334346, 2431039, 2152206, 2417869, 2112699, 2112617, 2330973, 2166830, 2198192, 2658521, 2415273, 2167211, 2518478, 2741185, 2534606, 2702909, 2724595, 2640342, 2569607, 2622853, 2724001, 2608728, 2291881, 3197113]
16875C197113r0884k67902K78144k35203J92466k4988R2324J3527J16822K7993
16865C299412Q6113l57595P25737l91104o588J51504n49161N16182l5227L0861
16855C470134R6550J20465J213J57245q0572m9078L02699j07717k3547J95789
16845D083181k28799M01363j84036L05715J71080j88603k07562J80017M32865
16836D765221J78606k17020R7398J14369M9506Q8570j15074N96386j03134r8536
16826E356292j04367K67387J63879L89650P0641m63748O14137o1159J67566O1685
16816F461963l65897N19050j98868N77730j48095N95451n09773M28255J6803J56942
16806G533561L12747K0316q191K37503P9678M28897p3832M25155J63325K08998
$$ y = [3197113, 3106229, 2838327, 3116471, 2881268, 3073734, 3048746, 3141070, 3154597, 3271419, 3299412, 3385525, 3027930, 3753667, 3362563, 3355975, 3507479, 2958318, 3474500, 3439273, 3470134, 3566684, 3687149, 3688362, 3845607, 3765035, 3715957, 4018656, 3910939, 3887392, 4083181, 3854382, 4255745, 4071709, 4377424, 4548504, 4359901, 4152339, 4332356, 4765221, 4943827, 4726807, 4824205, 4938574, 4988080, 5076650, 4961576, 5557962, 5454828, 5356292, 5251925, 5519312, 5683191, 6072841, 6143482, 5679734, 6293871, 6232712, 6400278, 6461963, 6096066, 6615116, 6416248, 6993978, 6845883, 7441334, 6931561, 7359816, 7376619, 7533561, 7846308, 7866624, 7858433, 8095936, 8175614, 8604511, 8530679, 8955834, 9119159, 9328157]
16796I328157j582M32868j07663L15216J64025N18884K67013j34193M22868O765
16786A1212358M13852j92232P78858J12319M26614J66250N31320K6177P45667
16777A4221183J2473L99025P64786J48343M09495M58667N65296K74400L73147
16768A7626815P74232M87966N60846P84419J15268P64461N75956P20762N45653
16759B2956378O04818O77706J082788P84878Q59493N10366J156131R64763J239441
16750C0836762R02636J004077J358538J238532J185561J199085J140304J566424
16742D0431919J594455J476505J628738K306097J592335J599319J989706K709511
16734E5328585J706948K420345K143507K682006K341003K640292K731630K682084
$$ y = [9328157, 9326575, 9759443, 9651780, 9966996, 10131021, 10649905, 10916918, 10782725, 11205593, 11212358, 11626210, 11433978, 12212836, 12325155, 12751769, 12918019, 13449339, 13475516, 14221183, 14233656, 14632681, 15397467, 15545810, 15955305, 16413972, 16979268, 17253668, 17626815, 18401047, 18889013, 19449859, 20234278, 20349546, 21114007, 21689963, 22410725, 22956378, 23561196, 24238902, 25321690, 26106568, 26966061, 27476427, 28632558, 29597321, 30836762, 31739398, 32743475, 34102013, 35340545, 36526106, 37725191, 38865495, 40431919, 42026374, 43502879, 45131617, 47437714, 49030049, 50629368, 52619074, 55328585, 57035533, 59455878, 61599385, 64281391, 66622394, 69262686, 71994316, 74676400]
16726G4676400K909478K720789K779389L413207K989883L226386L098938L110757
16718I8925227K967089K761583K973953K950080K474646K433218K043164J501097
16710A19030057J967333J317406R15597J214430J07350j91619m09887o38093j248808
16701A22063766j557143j358372k336945k185477k335181k709914k813337k674064
16693A04093333l251814k896250l215349l302163l212690k951758l089767k758426
16685G9415116l216260k622721l064522k743040k591966k060805k832765k047667
16677E8235370k516268k144698k138154j920107j610363k182776j602789j675746
16669D2444469j649820j393969j361010j451161j197165j387843j103552j151338
$$ y = [74676400, 77585878, 80306667, 83086056, 86499263, 89489146, 92715532, 95814470, 98925227, 101892316, 104653899, 107627852, 110577932, 113052578, 115485796, 117528960, 119030057, 120997390, 122314796, 123230393, 124444823, 124552173, 124360554, 123950667, 123312574, 122063766, 120506623, 119148251, 116811306, 114625829, 112290648, 109580734, 106767397, 104093333, 100841519, 97945269, 94729920, 91427757, 88215067, 85263309, 82173542, 79415116, 76198856, 73576135, 70511613, 67768573, 65176607, 63115802, 60283037, 58235370, 55719102, 53574404, 51436250, 49516143, 47905780, 45723004, 44120215, 42444469, 40794649, 39400680, 38039670, 36588509, 35391344, 34003501, 32899949, 31748611]
16661C1748611j248336r08886p11301j214963q07865p12029j351293n37859n30290
16652B3725789j120964o22650n00213r02940l48426m99845o21056o20033o95004
16643A7794658o2357o14607m39035o63973l64839k08209m84487o98309k09005
16634A4049837m72819j866n61354r1182o73260k1541m08632l21482j01941l10732
16624A1085028k14821n94371l3865l37548j31044k32908j09000l38769J9168m97136
16614H614734M79619o93108l72253M2849j93802m7722J91387n76868Q3452m06444
16604G121844l08982J94794J33552j55333m66215Q4713l18055m5677P8531k58924
16594F060248l7796j70805J0774m3731o73618K45311K6958K17540o40412K55386
$$ y = [31748611, 30500275, 29591389, 28880088, 27665125, 26857260, 26145231, 24793938, 24256079, 23725789, 22604825, 21982175, 21481962, 20579022, 20230596, 19730751, 19109695, 18489662, 17794658, 17732301, 17117694, 16678659, 16014686, 15649847, 15441638, 14957151, 14258842, 14049837, 13577018, 13575152, 13013798, 12922616, 12249356, 12227815, 11819183, 11497701, 11395760, 11085028, 10870207, 10275836, 10241971, 9904423, 9773379, 9540471, 9431471, 9092702, 9111870, 8614734, 9094353, 8401245, 8028992, 8071841, 7878039, 7830317, 8021704, 7444836, 7528288, 7121844, 6812862, 7007656, 7141208, 6985875, 6519660, 6604373, 6286318, 6240641, 6319172, 6060248, 6022452, 5851647, 5862421, 5818690, 5145072, 5390383, 5417341, 5634881, 4994469, 5249855]
16584E249855k57385k07480R3994j49726K34705l39335J4081L1742k72757J11104
16574D508798R2359m18854k50856N64132k84277k35883j55452j44355K49268k89318
16564C635562J62869j12515k4085j17997q1030J34867n7233k14770k17011K59624
16554C368281N3710k35084N9435m42360N57742l77052J905j98139P3935L6522
16544B898895k4164k69184J46406j35645M9179O3233O7978R3084l9976j07527
16534B742279l68470O9561j44669L9800j5530J01636m39392N31700l9918J35656
16524B612653k01858m08268J19361J80888J89018l41136p5628O2602j43358j11245
16514A883029J53864M64179o89709J26931j19366K9578J81909k28168l6323J10780
$$ y = [5249855, 4992470, 4784990, 4878984, 4729258, 4963963, 4624628, 4638709, 4670451, 4397694, 4508798, 4601157, 4182303, 3931447, 4495579, 4211302, 3975419, 3819967, 3675612, 3924880, 3635562, 3798431, 3685916, 3661831, 3543834, 3462804, 3597671, 3540438, 3325668, 3108657, 3368281, 3421991, 3186907, 3246342, 2803982, 3361724, 2984672, 2986577, 2788438, 2862373, 2898895, 2874731, 2605547, 2751953, 2616308, 2665487, 2728720, 2796698, 2889782, 2849806, 2742279, 2373809, 2443370, 2298701, 2338501, 2322971, 2424607, 1985215, 2516915, 2476997, 2612653, 2410795, 2002527, 2121888, 2302776, 2491794, 2150658, 2075030, 2137632, 1994274, 1883029, 2036893, 2501072, 1811363, 1938294, 1818928, 1848506, 2030415, 1802247, 1765924, 1876704]
16504A876704j06902L80363o48312j49343P13728k33829J06854j52270R382k90943
16494A505432L8749K73470p5322m0699l44628L26818J1579r2225k46206m023K86762
16483A639707k94522K12240j75458K56728n41829L80590k41117o3169L55611K9267
16473A558048k62460R027N4339J06383j78691o2310j09356K41700l44088M48670
16463A461262k80101J303J23871k41838j23121l2056L56105Q1813q3381K33492
16453A497349n23054L79492l75932J27589k20708M41158l13555p1240M3793K4933
16443A009825j19753j30834J60319L93827p6654k38727J19183l679j48822J63571
16433A128256J38317k35568n12780M69532K13576O4803l8093l68119K14020m00177
$$ y = [1876704, 1769802, 2150165, 1501853, 1352510, 2066238, 1832409, 1939263, 1786993, 1796375, 1505432, 1544181, 1817651, 1742329, 1701630, 1357002, 1683820, 1695399, 1603174, 1356968, 1352945, 1639707, 1345185, 1557425, 1381967, 1638695, 1096866, 1477456, 1236339, 1173170, 1528781, 1558048, 1295588, 1304615, 1358954, 1465337, 1286646, 1224336, 1114980, 1356680, 1012592, 1461262, 1181161, 1182464, 1306335, 1064497, 941376, 909320, 1265425, 1347238, 1263857, 1497349, 974295, 1353787, 977855, 1105444, 884736, 1325894, 1012339, 941099, 984892, 1009825, 890072, 759238, 919557, 1313384, 1236730, 998003, 1117186, 1113507, 964685, 1128256, 1266573, 1031005, 518225, 987757, 1201333, 1266136, 1228043, 859924, 1073944, 673767]
16423F73767K36528J18916j53577q6531k04957N37660l28917J28731j18540n9606
16413G43474j42456p954J78520O8082O922J85342N4598P294q0811m14212J71156
16402G69955O36J34909m6602k72563L43534l08686N1771J4738J54402j38459j2852
16391F90783K32070j31043K71920j31658j19649K02895D25491M53266j89292k48568
16381D40897J93731J87940m1047J0264J86859l69562k32456J83706K97492k54620
16371F03204j21254K31258j86363K56602J3304l40472Q8053k52883J83191J64045
16361F38685j40565J78421J23935j62636n0849r0635j95534J94015J48535j94782
16351D48590j90930K77009K70986J02102D28862M97195B81763L4470M80930k37158
$$ y = [673767, 910295, 1029211, 875634, 789103, 584146, 1121806, 792889, 921620, 803080, 743474, 601018, 593064, 771584, 839666, 846588, 1031930, 1086528, 1093822, 1013011, 598799, 769955, 770591, 905500, 858898, 586335, 929869, 621183, 672954, 687692, 842094, 703635, 690783, 922853, 791810, 1063730, 932072, 812423, 1015318, 425491, 878757, 689465, 440897, 634628, 822568, 781521, 791785, 978644, 609082, 376626, 560332, 857824, 603204, 481950, 713208, 526845, 783447, 796751, 456279, 544332, 291449, 474640, 638685, 498120, 676541, 800476, 637840, 586991, 496356, 300822, 494837, 643372, 448590, 257660, 534669, 805655, 907757, 428862, 926057, 281763, 316233, 797163, 560005]
16341E60005J98717m4946k95321K789J4121j35237J93501J29213k85612K82253
16331F19483r6637q7456K54714j40885j65369J65291K7618A05477L76266L4247
16321E15990Q4594j0355j86908A71653N76675k33626J60153B40216L81385k22612
16311C98989J29308j64515Q2395J41971j02585j78460A09838Q11590A07113M76496
16301E83609A81119L20106O1138p4364A3953J41803J58643L91883k19002k35938
16291B51342L16663k83650K0307A48402K19986o7979P8498j04652H9886K06659
16281B96545l7311L07801Q1772A60804M18216B65695m3091E7735L25209K42822
16271F25766j65986J86439k70276j50297K42722B04845M8049P9578p6243G2214
$$ y = [560005, 758722, 713776, 418455, 421244, 435365, 300128, 493629, 622842, 337230, 619483, 522846, 435390, 690104, 549219, 383850, 549141, 576759, 105477, 481743, 515990, 600584, 590229, 403321, 171653, 748328, 514702, 674855, 240216, 621601, 398989, 528297, 363782, 446177, 588148, 485563, 307103, 109838, 921428, 107113, 583609, 181119, 501225, 562363, 487999, 13953, 155756, 314399, 706282, 487280, 251342, 568005, 284355, 304662, 148402, 368388, 300409, 378907, 274255, 89886, 296545, 259234, 567035, 648807, 160804, 579020, 265695, 222604, 57735, 382944, 625766, 459780, 646219, 375943, 225646, 468368, 204845, 252894, 332472, 256229, 72214]
16260D34042E8662b17C80931L32061B97528L3207p4308k060J91740o5837j44776
16249B35494J554k0610J0359N7990J05546p1942J58760k17373K011R3423p0223
16238B84989a10278A99933j3595r806J05898A09043K92935l8888m5076P1469o1007
16227C28476j58325K45376j70493R1377j39259D7550K31005a21528B56193L75306
16217F31499A18732K41761C5823J76163n9250J50129J05883A90644Q8727J62613
16207D41984A4217K20509J08187M2113A52214k6782C1738J50450h390A12015K31241
16196C43256o6975q560D793K34062A08204m7680Q7257J38543o8277p7615j876
16185A38556K43925j66633k994L3422g9050B34281a3909C51276a6309G2149L15100
$$ y = [434042, 58662, -217, 380931, 712992, 297528, 330735, 256427, 254367, 446107, 380270, 235494, 237048, 216438, 226797, 284787, 390333, 318391, 477151, 259778, 261789, 355212, 284989, -110278, 199933, 186338, 176532, 282430, 109043, 401978, 363090, 318014, 389483, 328476, 170151, 415527, 245034, 336411, 197152, 47550, 278555, -121528, 256193, 631499, 118732, 360493, 35823, 211986, 152736, 302865, 408748, 190644, 279371, 441984, 14217, 234726, 342913, 385026, 152214, 125432, 31738, 182188, -8390, 112015, 343256, 276281, 267721, 4793, 238855, 108204, 60524, 147781, 286324, 218047, 140432, 138556, 382481, 215848, 212854, 246276, -79050, 234281, -13909, 351276, -16309, 72149, 387249]
16174C87249I5131K58657j33563A8538M91909B54027F9692J42183O65b5733B36408
16162B67797A25986h2133F6635Q0982J85363r5915G7041K4396J39110p7940J47741
16151C10348E5393J4900L51270j85606J26274F4941J81969O4036J4282j57432
16141A67796K2904J04638M5455k7495A46021l3572a6136C31317h7909I543L71135
16130C80678j56394G4475M16084A13423e7350B84401A36639K38744j48045L0303
16120B57641c34380a2896C53153j35631a353G7637j147j8996P0269a55712B98022
16108E4235O2867l1288Q0264F0977a93601j5047A97339c6412C44073a74628C63586
16096b00904a6351B02775q2818J26007A11717h5327o8449B12008c78346P4665
$$ y = [387249, 95131, 353788, 220225, 18538, 510447, 254027, 69692, 211875, 212540, -25733, 236408, 267797, 125986, -82133, 66635, 147617, 332980, 237065, 77041, 101437, 240547, 162607, 310348, 55393, 70293, 421563, 235957, 362231, 64941, 246910, 310946, 325228, 167796, 190700, 295338, 340793, 313298, 146021, 112449, -16136, 331317, -87909, 9543, 380678, 224284, 74475, 490559, 113423, -57350, 284401, 136639, 375383, 227338, 257641, -334380, -12896, 353153, 217522, -1353, 77637, 76490, 57494, 127763, -155712, 298022, 54235, 117102, 85814, 166078, 60977, -193601, -208648, 197339, -36412, 344073, -174628, 363586, -200904, -16351, 202775, 119957, 245964, 111717, -85327, -153776, 212008, -378346, -303681]
16086c03681R9321B82312A13571m245a60930F35K19659P5500L5228p9128o0615
16075A91279J41146l4000H4525j6304c2294A4032a49694d268n2632j03581A04127
16063I4631C5672L94053A82936A2109F86i1338E8561b72733a17110A102K52667
16052B53769e2392N00o0905A99838A6746P7303B3634a00804B39712H6558J9345
16041A05903N8763M8228L8240i9691G7529J06181g8129A37568m9216a68553F849
16029i802F5142J28336c24959J39873A71937b5198A17814a06450A82548a08461
16018b27136D7815J2430C135R0232M9076d0016j58678G8506k7836R6979f8625
16006F2149a08520I1087c1152B29046G5440k9966O8359P5791G6147c09065A52177
$$ y = [-303681, -204360, 282312, 113571, 109326, -160930, 635, 220294, 295794, 331022, 251894, 191279, 332425, 298425, 84525, 68221, -32294, 14032, -149694, -4268, -56900, -160481, 104127, 94631, 35672, 429725, 182936, 12109, 686, -91338, 58561, -272733, -117110, 1102, 253769, -52392, -51892, -112797, 199838, 16746, 94049, 23634, -100804, 239712, 86558, 105903, 164666, 212894, 251134, -99691, 77529, 183710, -78129, 137568, 88352, -168553, 6849, -9802, 65142, 193478, -324959, -185086, 171937, -25198, 117814, -106450, 182548, -108461, -227136, 47815, 60245, 3135, 93367, 142443, -40016, -198694, 78506, 50670, 147649, -68625, 62149, -108520, 91087, -31152, 229046, 75440, 45474, 113833, 189624, 76147, -309065, 152177]
15994c79845a03842J6321a3498l9021B63437A6377J19869F2676B2699K40815a63668
15982h3886l3558j09806B28158a01487A62856k4787G305L98194A65960m7339L20429
15971D39050J74391M75040j38935N839k15943j78352B50885C3014j0022J56153
15961A79145d404C98556C5438A0131a02971A24302b25596A08865e4115r2285L0714
15950a15686e6647P408I8315P2368O4255d7170D9387J69503C2182a72491A64653
15938A08414Q0624i1112j60399F6156b45467J19882G8708R5406a25068p6828E7156
15926D2993R4578m4161K7283P7958A7526J09124K54829A4002R6358m0929O7381
15915A36812a68366E6127e9272A65469a5595A64250a52887C12081e55112C7755
$$ y = [-379845, -103842, -87521, -13498, -52519, 263437, 16377, 136246, 62676, 22699, 263514, -163668, -83886, -117444, -227250, 228158, -101487, 162856, 138069, 7305, 405499, 165960, 118621, 439050, 613441, 1088481, 949546, 955385, 739442, 561090, 250885, 33014, 22992, 179145, -4404, 398556, 35438, 10131, -102971, 124302, -225596, 108865, -54115, -146400, -115686, -56647, -49239, 98315, 170683, 234938, -47170, 49387, 218890, 32182, -172491, 164653, 108414, 189038, -91112, -251511, 66156, -245467, -125585, 78708, 174114, -125068, -201896, 57156, 42993, 137571, 93410, 120693, 198651, 17526, 126650, 381479, 14002, 110360, 69431, 136812, -168366, 56127, -59272, 165469, -15595, 164250, -152887, 312081, -555112, 37755]
15904D432c11482a55636B52406J6041F1434a15852k48352A77347a64157A73963
15893f1671j62991j08694a32604A3897J6411i4683k08186B653J69041K55868H2649
15881F7205J83468a27757A44040h9579H6458b92580O2732R8857L6659B17466D5956
15869A95263b75776A45966j3309K6880a80118D0236M6004n048f7625A6354K89234
15858C05588a270A91245c9696A14437J77503m1404B9972a27756j00903P0444M7624
15847a10591A27424h8449B48259J48962a96205A37155a39745M2145c3948B06185
15836i7274j51899A68978b03395P3452B20581j04702b81995A53988b9662A37930
15825a19279o0770C1153g370A50697m0585d2238A17301b9121j58537Q2819A29132
$$ y = [4432, -311482, -155636, 252406, 268447, 61434, -115852, -364204, 177347, -164157, 173963, -61671, -224662, -333356, -132604, 13897, 30308, -94683, -302869, 2653, 171694, 427562, 82649, 67205, 250673, -127757, 144040, -89579, 86458, -292580, -229848, -130991, -94332, 217466, 45956, 195263, -275776, 145966, 132657, 159537, -180118, 40236, 86240, 81192, -67625, 16354, 305588, -1270, 191245, -39696, 114437, 291940, 250536, 29972, -127756, -228659, -158215, -110591, 127424, -88449, 248259, 397221, -196205, 137155, -139745, -97600, -33948, 206185, -97274, -249173, 168978, -203395, -129943, 220581, 115879, -281995, 153988, -29662, 137930, -119279, -180049, 31153, -7370, 150697, 110112, -42238, 117301, -29121, -187658, -104839, 129132]
15813A43459A235K711K23024j01709h9223c4111j03506M6312E1349a57713A54461
15801a55153a4267j06653j8200B1079K9035c04627A33247K20930A26871G924K06274
15790B14198F7219b19830G0356A2671b1408H0925J20443f1468F0527a92972j71592
15779c64564A4849R5149a34968A09360b02541d5555n8159o7431r6257A42652j5875
15768A26777a03955q6033A07848L6814m689a09022a8002B02989i6850M3656j6429
15757f9623q8766f2010J0859B48988A0579Q5910e7680A2279J49546f2311f535
15745G9228C5321c7356C3056J13051a53367A86164K6161A0765a61775k9428A7813
15733B59110g7405B06034A964K98188R1508b35490p9118I2108l8367C726L26278
$$ y = [143459, 1235, 3946, 226970, 125261, -89223, -34111, -137617, -91305, 51349, -157713, 154461, -155153, -14267, -120920, -139120, 21079, 50114, -304627, 133247, 354177, 126871, 7924, 214198, 67219, -219830, 70356, 12671, -21408, 80925, 201368, -61468, 60527, -192972, -364564, 14849, 109998, -134968, 109360, -202541, -45555, -103714, -171145, -267402, 142652, 126777, -103955, -189988, 107848, 144662, 139973, -109022, -18002, 202989, -96850, -53194, -69623, -158389, -62010, -51151, 248988, 10579, 96489, -57680, 12279, 161825, -62311, -6535, 79228, 35321, -37356, 33056, 146107, -153367, 186164, 212325, 10765, -161775, -191203, 17813, 259110, -77405, 206034, 1964, 300152, 391660, -235490, -314608, 92108, 53741, 3726, 330004]
15722C30004b76333a35137l53208a87603h7732a0156o5321n42214b7691D650J27173
15711A31823a11991A1603J34546o7951a18750E0671b35677C7300i533j33735J1737
15700a31531N9934o9983o1502m149K6299F5655c02643J47394A75389a70288j9274
15689a89562B4460h4417A27488a96030f0435r8699F2906B1958K89741j33116e6338
15677a57959d9540J4657l1953p2176b3795m9369A87756H2158e7498n6861H9101
15665a56263C8736c18134J25997k2959E6427J57318a68007I6188C361a1276m40747
15654d52023A68008A4165c90546a60215C90753b92403l1399A2587a37253A7958
15643f9778B90906n6398e3920B7292Q9612J46468a44197A05948a57634p8310J986
$$ y = [330004, -276333, -135137, -488345, -187603, -87732, -10156, -75477, -617691, -27691, 4650, 131823, -111991, 11603, 146149, 78198, -118750, 50671, -235677, 37300, -9533, -143268, -131531, -71597, -141580, -203082, -207231, -180932, 65655, -302643, -155249, 175389, -170288, -189562, 24460, -84417, 127488, -196030, -60435, -159134, 62906, 21958, 311699, 178583, -56338, -157959, -49540, -34883, -66836, -139012, -23795, -73164, 187756, 82158, -57498, -114359, 89101, -156263, 38736, -318134, -192137, -215096, 56427, 213745, -168007, 96188, 3361, -11276, -452023, 168008, 14165, -390546, -160215, 390753, -292403, -323802, 12587, -137253, 17958, -69778, 290906, 234508, -53920, 27292, 116904, 263372, -144197, 105948, -157634, -235944, -233958]
15632b33958M9145R1771B9744d2236I5607K6124b28482A60518D3343e585l64533
15621c70118i8954b105p984k03202H287J45665h3860k49301J26418c9892j65748
15610b05640j66343A52097i492B12167K97670f2736k01540M0422B31951a14972
15599a81256A18273d61712A48709F1247a46715D6407c270j29395r4772h5208B2653
15587E9653b35087C7261i0974o0949O8577E0369a04347C32862a45536C6976f286
15575I3518a93536f7434H0682Q9172d3617r354F0432m029e11621a46312m2867
15564a89179J6253j72517D327Q8584l4293b11036L3457C61698h7263o7564E6824
15552B24296k5712G9518M4718b44477A68869a30244N1799A08103k9817Q4807O4905
$$ y = [-233958, -184813, -93042, 29744, -42236, 95607, 121731, -228482, 160518, 43343, -5585, -370118, -98954, -2105, -10089, -213291, 8287, 153952, -83860, -333161, -206743, -39892, -205640, -371983, 152097, -9492, 212167, 509837, -62736, -264276, -223854, 231951, -114972, -181256, 118273, -461712, 148709, 61247, -146715, 46407, -3270, -132665, -227437, -85208, 22653, 59653, -235087, 37261, -90974, -151923, -83346, 50369, -104347, 332862, -145536, 36976, -6286, 93518, -193536, -67434, 80682, 169854, -43617, -52971, 60432, 56403, -511621, -146312, -189179, -172926, -345443, 4327, 92911, 58618, -211036, -177579, 361698, -87263, -154827, 56824, 224296, 198584, 79518, 124236, -244477, 168869, -130244, -78445, 108103, 78286, 163093, 227998]
15541B27998a172A39421e3195j20051E2376i8914b9884B56791q1230D6408K09218
15530B55626M5989b20447D8933h0157r2909K6653A00478C9696a3968j53389A81122
15518A968L46637i542E91902A02852C1365a89619I8997B8572Q5357c69837a19779
15506A36000a9145l5508D33667i8180B15219n3366J6403F4491I293i0149D50537
15494G4492a27035g331l3552D4448J68258I0048L18189A72462F6484M24566j80159
15483C10891p4749A09983q145a93747C06872J9124j60801a21551A5679M8957q328
15472E6308A895K04660g8951A4986g9939A60567h2978A438a90090j12910C0817
15460E85832B10532J41118o5734r2758K24976j4446j94789N2130A03977M6660
$$ y = [227998, -1172, 139421, -53195, -173246, 52376, -98914, -29884, 256791, 175561, 46408, 255626, 301615, -220447, 48933, -80157, -173066, -146413, 100478, 39696, -13968, -167357, 181122, 1968, 348605, -9542, 591902, 102852, 31365, -189619, 98997, 28572, 113929, -369837, -119779, 136000, -19145, -54653, 433667, -98180, 215219, 161853, 178256, 64491, 9293, -90149, 450537, 74492, -127035, -7331, -40883, 44448, 212706, 90048, 408237, 172462, 66484, 491050, 310891, 236142, 109983, 101838, -193747, 306872, 325996, 165195, -121551, 15679, 64636, 56308, 1895, 206555, -78951, 14986, -79939, 160567, -82978, 1438, -190090, -303000, 30817, 585832, 210532, 351650, 285916, 193158, 418134, 403688, 208899, 261029, 103977, 150637]
15450A50637a0867G4397h3491I7146f9848H0036k5125J47844E1144M07851A496
15438C0540J38196E2907h1209N318j19315M4324B62741J45008a80801A0863K46192
15427B57055M77071C47552K68416J71851j79129m539B81560A24553J44610j18771
15417A50392o704b05341M7734C21563a312j01316L9731C39836d938B62336A9534
15405c2103H2237j3142Q6416l7320h5266j1090c470H115J07452E7405M105n81
15393F0929a84201C22506j13079o7175A2161N09846b9582o8231G9483Q2095L1397
15382A92975g4766A59122m3652Q2308e3209A58142o2442B0296L43400a97737e0593
15370d2304D3675a57904K8282K122k55914J52385h6486A34825h7476q9427C90874
$$ y = [150637, -10867, 74397, -83491, 97146, -69848, 80036, 54911, 202755, 51144, 458995, 1496, 30540, 168736, 52907, -81209, -75891, -195206, -150882, 262741, 407749, -180801, 10863, 257055, 734126, 347552, 615968, 787819, 608690, 604151, 281560, 124553, 269163, 150392, 143688, -205341, -157607, 321563, -1312, -102628, -62897, 339836, -4938, 262336, 19534, -32103, 82237, 69095, 155511, 118191, -85266, -96356, -3470, 8115, 115567, 57405, 61510, 60929, -184201, 322506, 209427, 142252, 12161, 522007, -29582, -97813, 79483, 161578, 192975, -74766, 159122, 115470, 197778, -53209, 158142, 95700, 20296, 363696, -197737, -50593, -42304, 43675, -157904, -129622, -127500, -383414, -231029, -86486, 134825, -87476, -176903, 390874]
15358A10425M0720K910C5946J52087n6276K29010C4888N5851J65110I6380a3770
15346a19392N0402D3305a05595B04400o2068J04446a8593p9043B76220d9644A39631
15334C34079j00271H4761a16811k2994A72448J35298o6259P5341A35050J34446
15324B69496K6845J09952A12735L7739q173N4645B9312a5588l8841j2193F6918
15312B09484n49f940j24763B12373J19434G5909J07655L0619P4602h8826d3694
15300B54830F8006c03299K6532H1530a7609A98477L28494B20200P6418e4198B31300
15288B87544A2475a25092B7802J01729b27225b2821A50083A2143L72427A54099
15277F392J51330a14581F0182d7684j36323L653B11225D9224B0261N81f6769D08191
$$ y = [110425, 151145, 154055, 35946, 188033, 131757, 360767, 34888, 90739, 255849, 96380, -13770, -119392, -68990, 43305, -105595, 204400, 142332, 246778, -18593, -97636, 276220, -49644, 139631, 334079, 233808, 84761, -116811, -139805, 172448, 307746, 241487, 316828, 135050, 269496, 296341, 406293, 112735, 150474, 142301, 196946, 29312, -15588, -54429, -66622, 66918, 209484, 208935, -6940, -131703, 212373, 331807, 75909, 183564, 214183, 288785, -88826, -43694, 254830, 68006, -303299, -276767, 81530, -17609, 198477, 526971, 220200, 296618, -54198, 231300, 287544, 12475, -125092, 27802, 129531, -227225, -22821, 150083, 12143, 384570, 154099, 6392, 157722, -114581, 60182, -47684, -184007, -180354, 211225, 49224, 20261, 20842, -66769, 408191]
15264A25562b15765Q6365B01438j073h2067L994A23831D8110K13701j27705k1934
15253A12172b13446b0817A8048K94200r6002f1074I4982H68J60336B5754K38112
15242B63866B4573J98966H0003K307K17808c01013A21958K13115n7452a78472
15231B62447i495C32086L76764q8162N04858O30840l31978M30471n46699n62790
15221G45390a58399C30736A58601o9249a61538B12833b98305J08624g248m1706
15211d8954A95693c8804C2127o469h4176G5593N4880d9980C53832A40132l9151
15200A00981f2488A68022B414K00042c3055R593C34372b1016H190O1927h4435
15188i5786j0248L4293C50649b1053j39855E9395K03779a68080B3332a71546A11937
$$ y = [125562, -215765, -129400, 201438, 200365, -82067, -78073, 123831, 48110, 261811, 134106, 112172, -213446, -20817, 18048, 312248, 216246, -61074, 94982, 868, 161204, 25754, 263866, 24573, 223539, 80003, 82310, 300118, -301013, 121958, 335073, 277621, -178472, 262447, -9495, 332086, 708850, 620688, 1125546, 1756386, 1424408, 1854879, 1308180, 745390, -158399, 330736, 158601, 89352, -161538, 212833, -298305, -189681, -7248, -48954, 195693, -38804, 32127, 25658, -84176, 75593, 130473, -49980, 353832, 140132, 100981, -62488, 168022, 2414, 202456, -33055, -23462, 334372, -21016, 8190, 70117, -84435, -95786, -106034, -71741, 350649, -21053, -160908, 59395, 263174, -168080, 23332, -171546, 111937]
15176A9078b12251a01973D3633d3133B22333c6620A9488J08695a41089G1938J33128
15165B05066B8503J4983d9150A76074a03017A15833A7629c2480A96103J49847
15155C45950r5023I3256J15434A5308b83849e4553j82936B76455k5558o4416h7983
15143g102A50886N6627a43269H4886M3190b035r1838D812J20870a82794B8999
15131C3476b370A7704a42136C85738A46586N8463r1732J81932C9569L33584j70112
15120B03041P2496i8169A62255a9976m5334A9308M04690H8887j7217b24629E2543
15108A27422K57204j39713J0995P1293R9422K1852M0110A13806J81035n6415e7446
15096A99956b21276C890K11533a16639N6669B36024I6739O3488D0383H127J0095
$$ y = [19078, -212251, -101973, 43633, -43133, 222333, -36620, 19488, 128183, -141089, 71938, 205066, 28503, 43486, -49150, 176074, -103017, 115833, 17629, -32480, 196103, 345950, 250927, 93256, 208690, 15308, -283849, -54553, -237489, 276455, 250897, 186481, -87983, -7102, 150886, 207513, -143269, 84886, 128076, -2035, -93873, 4812, 125682, -182794, 28999, 33476, -2370, 17704, -142136, 385738, 146586, 205049, 113317, 295249, 39569, 373153, 203041, 275537, -98169, 162255, -19976, -65310, 19308, 423998, 88887, 71670, -224629, 52543, 127422, 384626, 244913, 255908, 327201, 426623, 448475, 488585, 113806, 294841, 238426, -57446, 199956, -221276, 3890, 215423, -116639, -59970, 236024, 96739, 160227, 40383, 8127, 18222]
15085A8222a48137B63042H0343g9167m3532N6894A57977b26007E4320L32545m6362
15074C40503d9878K2172q8232M9487B29584I4621J98378A42903R3035D9291a14453
15062A07274L39568A07394e1308C05216o5863b4647C64184R149A60547F9613N5881
15051A25494L72944A28493M5058j4207K32358j01282j40916C4771L6694L93824
15041D65289A66138p0300K7015J80070r6849K45331j90880n2038I5847K87615
15031C83462H9250J24770O2598P4603j50806l5007m834J44591K4174G4534J85100
15020B59634J46318a16350D06997j90517L10918k12526J80089L58278K3927j27642
15010G49524j52285m889N7115A83504E1899M22356j02185J23980M5939p5351k04101
$$ y = [18222, -148137, 263042, 80343, -79167, -122699, -65805, 157977, -226007, 54320, 386865, 340503, -49878, -27706, -115938, -66451, 229584, 94621, 292999, 142903, 235938, 49291, -114453, 107274, 446842, 107394, -51308, 305216, 239353, -24647, 364184, 373333, 160547, 69613, 125494, 498438, 128493, 173551, 159344, 391702, 290420, 149504, 34771, 71465, 465289, 166138, 95838, 122853, 302923, 206074, 451405, 260525, 208487, 95847, 383462, 89250, 214020, 276618, 351221, 200415, 165408, 160574, 305165, 329339, 74534, 259634, 405952, -116350, 406997, 216480, 527398, 314872, 494961, 853239, 877166, 749524, 597239, 592350, 649465, 183504, 51899, 474255, 372070, 496050, 541989, 466638, 262537]
14999B62537p7940N46528A80010Q9542L1283J26503K5128q3232E9809M91407A97802
14987F47422B35077K96404j48662L48291B48680M12763E4437N36449b2272D23088
14976D09101A81683L89707A84711M07397k9740Q6123k52106A8308L23554J76778
14966E18640J98486k18925J46753k35003N6115Q7058m8266J14702I1405K71194
14956C62599J73800J79433k78387m6723J62436J29553C20058O4597j22326C5730
14945C82453r2387J91437M1565j72288D9866J87407L44967A57969J17137O4120
14935C39226A26567M17857j34695B01907L5118K25187r6879L20599C38975J34711
14925D73686K04394l11250K33868B19656M11063k53570P6470O673J13376p2520
$$ y = [262537, 184597, 731125, 180010, 269552, 300835, 427338, 452466, 369234, 59809, 551216, 197802, 647422, 235077, 531481, 382819, 731110, 248680, 661443, 54437, 590886, -22272, 423088, 409101, 181683, 571390, 184711, 592108, 562368, 648491, 396385, 18308, 341862, 518640, 717126, 498201, 644954, 409951, 466066, 553124, 504858, 619560, 91405, 362599, 536399, 715832, 437445, 390722, 553158, 682711, 320058, 384655, 262329, 35730, 382453, 290066, 481503, 523068, 350780, 49866, 237273, 582240, 157969, 275106, 339226, 126567, 544424, 409729, 201907, 237025, 462212, 365333, 685932, 338975, 473686, 678080, 366830, 600698, 219656, 630719, 377149, 453619, 460292, 573668, 501148]
14915E01148Q9751L00737K29101R6437L442j57062L42728P9094k19898l52773
14905I12705J57426J13560J61612K09757J53170o5066N0833k09269n57481M58266
14895A385513k95421k31219j32436B33847K58757L40973k41947k29250j64870
14886A97510J38938k6371j1164q7447M88116B8937L09866L18473k73171M2689
14876D26794J2043r8326j17302L38368B02172M19107j67520M87500j67201j83404
14866E90654o079K02038k90893N53563l82959j23346J00458K18862m24998L9851
14856D77151J1676k27121K59783m1670p8408Q3635J07842P9688B43200M79797
14846G22997j6091l07285J68005k23988j384R5647Q7083M5823q053p5371j76081
$$ y = [501148, 590899, 891636, 1120737, 1217174, 1220616, 1063554, 1406282, 1485376, 1265478, 912705, 1070131, 1183691, 1345303, 1555060, 1708230, 1643164, 1693997, 1484728, 927247, 1385513, 1090092, 858873, 726437, 233847, 492604, 833577, 591630, 362380, 197510, 336448, 310077, 298913, 211466, 699582, 28937, 338803, 657276, 384105, 426794, 438837, 340511, 223209, 561577, 202172, 621279, 453759, 941259, 774058, 590654, 584575, 786613, 495720, 1049283, 666324, 542978, 643436, 862298, 437300, 477151, 488827, 261706, 521489, 479819, 401411, 485046, 592888, 672576, 243200, 722997, 706906, 399621, 567626, 343638, 342254, 437901, 524984, 570807, 562754, 487383, 311302]
14835C11302N59968C71167A84245K97003j71275k8204O20367k71958P1700K6131
14825G28009J10388K80432l23796J68585k86447L24963k72136j34189M4214j04034
14815E35989O1759k76096L2178J95278K9819J48783p7194A19810M61559J5305
14805E96674J93232k5376k49870K7855o0485J23556J51096P7127j17469J53564
14795H69904j60634k6359P3488j54945M35584m08071K40885j46776L9672p1081
14785F91667L954k85836J93642j02502J75176j80416J20067J70041l28228L93203
14775H50768k91221n0980L6569K84547k93565j79102K55471J03525j1879k17293
14765D86840M2894P4693j18432j95728P56652n01897N33642k52611O3110P5977
$$ y = [311302, 871270, 371167, 184245, 481248, 309973, 281769, 902136, 630178, 701878, 728009, 838397, 1118829, 795033, 963618, 677171, 1002134, 729998, 595809, 640023, 535989, 597748, 321652, 353830, 549108, 578927, 727710, 650516, 119810, 581369, 596674, 789906, 764530, 514660, 542515, 482030, 605586, 756682, 833809, 716340, 869904, 709270, 682911, 756399, 601454, 1037038, 628967, 869852, 723076, 762748, 691667, 695621, 409785, 603427, 500925, 676101, 495685, 615752, 785793, 457565, 850768, 559547, 508567, 545136, 829683, 536118, 357016, 612487, 716012, 704133, 486840, 529734, 604427, 485995, 290267, 1046919, 545022, 1078664, 826053, 889163, 965140]
14755I65140m39038J63157j18407k76969Q8698Q3554J93238j36472J56974k5582
14745F54293j94333j76060M55228o7060j29163J74271l13298R6601J05155j33073
14735D72561M07768l62856Q6198A62056M66796p3737j38703J43725K21660L12089
14725A093886D26533M44109m11270N87909l31773J65575j24544j38119j45220
14716D73200L09630o930Q5701J94818K41153J58697m2559L8910J52121l79767
14706A224974r6437j12616l8892J33498m40057K73928L287J43088l04620M5124
14696H31277J35869k99374J83358k54843J80657O4706L8544J96331J53483l00194
14686I29814M35569L75969n72793P00374m20327k74646k12562n9480j80922J14656
$$ y = [965140, 526102, 689259, 570852, 293883, 382581, 466135, 659373, 522901, 679875, 654293, 459960, 283900, 739128, 672068, 542905, 717176, 403878, 500479, 605634, 472561, 880329, 517473, 603671, 162056, 628852, 555115, 416412, 560137, 781797, 1093886, 426533, 870642, 459372, 1047281, 715508, 881083, 756539, 618420, 473200, 782830, 775900, 861601, 1056419, 1297572, 1456269, 1413710, 1452620, 1604741, 1224974, 1128537, 1015921, 977029, 1110527, 670470, 944398, 947685, 1090773, 786153, 831277, 967146, 667772, 851130, 596287, 776944, 841650, 880194, 1076525, 1230008, 929814, 1365383, 1741352, 1168559, 1868933, 1448606, 1173960, 961398, 901918, 720996, 835652]
14676H35652L10152l1246k57444k7470q7468K39029l00286m9533J02849P8122
14666H12357J68386j34322k52215K18830k01156L37152k47275j52311M00839J30910
14656A081195k47083J15652L7204N6296k41841n7217Q7712K07286j08724J83349
14646A113829l18419J62960o3409J73865O7073m81024M95504l8013j89522J44836
14636A067680R4876K63746m237j19261M3707l37251K00098j55740M2773J79483
14626A275874k66163K74147r7910K19025l22284J20081p9022N8833j96927P3754
14616A059408K5375J75013m67102K95622J34189r0041l03783N94333j29931k20754
14606A072329K58010k38344J71094j56307K00555l00787L88818J4684K8232m96871
$$ y = [835652, 1145804, 1114558, 857114, 829644, 742176, 981205, 680919, 631386, 734235, 812357, 980743, 846421, 594206, 813036, 611880, 949032, 701757, 549446, 950285, 1081195, 834112, 949764, 986968, 1043264, 801423, 744206, 831918, 1039204, 930480, 1113829, 795410, 958370, 894961, 1068826, 1135899, 654875, 1150379, 1112366, 922844, 1067680, 1162556, 1426302, 1422065, 1302804, 1346511, 1009260, 1209358, 1053618, 1096391, 1275874, 1009711, 1283858, 1185948, 1404973, 1082689, 1202770, 1123748, 1182581, 985654, 1059408, 1084783, 1259796, 792694, 1088316, 1222505, 1132464, 828681, 1423014, 1293083, 1072329, 1330339, 1091995, 1263089, 1106782, 1307337, 1006550, 1395368, 1410052, 1438284, 941413]
14596I41413P7376M35957m18459l27143L90715M30384m58477J01923M73285l40928
14586A306046M05643j81259K1269L3513l54361M40820j16681L10371j55051P8588
14576A788898j85552j02673r4881J78444k29606P71979n58807K90003m92553L90598
14566A755850q2096k74655K52552l349q2043L02273K43089m20883R3471K83732
14556B067941J20942j17239j01346j35822J12897J71596J11334n1349k58056K27264
14546B148162K08515K13665J03352O5903K56948K92299J60736M4498L64110P53222
14536D611410O33232J307086K617243L323322O754039R946620K593892j4399737
14528A7387107p260876l943485j879357k80845m75604J89708J042946n17825j227102
$$ y = [941413, 1018789, 1454746, 1036287, 709144, 1099859, 1530243, 1071766, 1173689, 1646974, 1306046, 1711689, 1530430, 1551699, 1585212, 1230851, 1671671, 1554990, 1865361, 1710310, 1788898, 1603346, 1500673, 1405792, 1584236, 1354630, 2126609, 1567802, 1857805, 1365252, 1755850, 1673754, 1399099, 1651651, 1648302, 1566259, 1868532, 2111621, 1690738, 1784209, 2067941, 2188883, 2071644, 1970298, 1834476, 1947373, 2118969, 2230303, 2178954, 1920898, 2148162, 2356677, 2570342, 2673694, 2739597, 2996545, 3288844, 3449580, 3494078, 3858188, 4611410, 5244642, 6551728, 9168971, 12492293, 19246332, 29192952, 31786844, 17387107, 10126231, 6182746, 4303389, 4022544, 3546940, 3736648, 4779594, 4261769, 3034667]
14519C034667m69593k69933R9954j27701M0483J17160j14686j14686j66095L3349
14509B062919o2406K17655k95074J51349O8105p7680J12832K89346J52332m57058
14499B162320J71791L11798j17995J49004k60135K93568j18573k0713Q3996j59369
14489B495692L57005n46175N92666k26871M5835j34234Q8556L72553j4156p6404
14479B954467M21820j70899j06978j60614J77664J17693Q9473j10412K51291M2732
14469C506237o8341N7859q9034K22719k55069K37241j78691L93374k48760l5860
14459C541675K91605K5688l577N9384J55415k44339P1429K69429K0877l95574
14449C792012M38195q7317J54567L6763k02455K50984J68788k2305r022P1610
$$ y = [3034667, 2565074, 2295141, 2395095, 2267394, 2307877, 2425037, 2310351, 2195665, 2029570, 2062919, 2000513, 2218168, 1923094, 2074443, 2142548, 2064868, 2177700, 2467046, 2619378, 2162320, 2334111, 2645909, 2527914, 2676918, 2416783, 2710351, 2591778, 2571065, 2655061, 2495692, 2852697, 2306522, 2899188, 2672317, 2718152, 2583918, 2672474, 3045027, 3030871, 2954467, 3376287, 3205388, 3098410, 2937796, 3115460, 3233153, 3322626, 3212214, 3463505, 3506237, 3437896, 3495755, 3406721, 3629440, 3374371, 3611612, 3432921, 3826295, 3577535, 3541675, 3833280, 3858968, 3855391, 3914775, 4070190, 3825851, 3897280, 4166709, 4187586, 3792012, 4230207, 4142890, 4297457, 4334220, 4131765, 4382749, 4551537, 4529232, 4520210, 4591820]
14439D591820r0134L9403L31222j03361k4601K70161p9074K12758m4901K61020
14429E364313j11956q6495P6733L6124l60K11753r2113J88888J71553M16780m54444
14418E720776K94958J95881l84776L11414q2819L71984l33000N76722J55038L43034
14408G169212m15870K23386K07544J43393J84400j69983L91905K77101k22863
14399G788225L86195l45518K15290j43223J17703N15192j05293N32898j33354
14390H828115M7266L10143L37765J28381j23269J64928k50543J30514L76354n6520
14380I893134N06224J78709Q7822M5852L51884K03701L11495J62764K16645m4031
14370A1914199K64996k569N89823J44689K49458K29159P68242m59393O70120j27708
$$ y = [4591820, 4501686, 4541089, 4872311, 4768950, 4744349, 5014510, 4935436, 5148194, 5103293, 5364313, 5252357, 5165862, 5242595, 5278719, 5278359, 5490112, 5397999, 5586887, 5758440, 6175220, 5720776, 6015734, 6211615, 5826839, 6138253, 6055434, 6427418, 6094418, 6671140, 6826178, 7169212, 6753342, 6976728, 7184272, 7327665, 7512065, 7342082, 7733987, 8011088, 7788225, 8174420, 7828902, 8044192, 7900969, 8018672, 8533864, 8428571, 8961469, 8828115, 8875381, 9185524, 9523289, 9651670, 9528401, 9693329, 9442786, 9573300, 9949654, 9893134, 10399358, 10578067, 10665889, 10711741, 11063625, 11267326, 11578821, 11741585, 11958230, 11914199, 12179195, 12176626, 12766449, 12911138, 13160596, 13389755, 14157997, 13698604, 14368724, 14241016]
14360A4241016K45896O95460K28716K81714K84320K37002J20863O42421N5767
14351A7033175M90749L84174M87950K25142Q33180O9375K31681L79421M80043
14342B0614890N36518L02134N13531P43355N51662L06265J049237Q0586O82252
14333B5380430P23499P53210N62723Q07256P55553P55317J089905L98232Q90398
14324C2116523J067594J063956Q72091R49517J025122J280326J011067J300302
14316D0686498J246582J426272J534278J537536J875116J149205J733395J768116
14308E2956998J709524K097280K167366K420605K404849K131705K639908K406190
14300G0934425L110592K859873K965168L386153L672021L598941M049513M064319
$$ y = [14241016, 14486912, 15182372, 15411088, 15692802, 15977122, 16214124, 16334987, 16977408, 17033175, 17523924, 17908098, 18396048, 18621190, 19454370, 19523745, 19755426, 20134847, 20614890, 21151408, 21453542, 21967073, 22710428, 23262090, 23568355, 24617592, 24698178, 25380430, 26103929, 26857139, 27419862, 28227118, 28982671, 29737988, 30827893, 31226125, 32116523, 33184117, 34248073, 35120164, 36069681, 37094803, 38375129, 39386196, 40686498, 41933080, 43359352, 44893630, 46431166, 48306282, 49455487, 51188882, 52956998, 54666522, 56763802, 58931168, 61351773, 63756622, 65888327, 68528235, 70934425, 74045017, 76904890, 79870058, 83256211, 86928232, 90527173, 94576686, 98641005]
14292I8641005M537726M982909N581442N146626N785508O227412O631845O980211
14284A44514684P453194P987447Q496976Q823045R601185J0431297J0796124J1507782
14276B19611734J2158570J2810214J3681625J3789120J3991541J5065751J4939981
14269C16048536J5349627J5628273J5178381J4921923J4401381J3091829J2444199
14262D17064149J1122746J0776044R716187Q152855L500165K012210J809543K018604
14254D66172503K75702r438312o296233p549250j0962023j3038654j3730314j4405642
14246C91027777j4821019j5037182j5264688j5278471j5102924j4527110j4064070
14239B86932313j4459925j3079267j2580022j1985541j3329956j2441978j0891571
$$ y = [98641005, 103178731, 108161640, 113743082, 118889708, 124675216, 130902628, 137534473, 144514684, 151967878, 159955325, 168452301, 177275346, 186876531, 197307828, 208103952, 219611734, 231770304, 244580518, 258262143, 272051263, 286042804, 301108555, 316048536, 331398163, 347026436, 362204817, 377126740, 391528121, 404619950, 417064149, 428186895, 438962939, 448679126, 456831981, 460332146, 462344356, 464153899, 466172503, 466448205, 457009893, 450713660, 443164410, 432202387, 419163733, 405433419, 391027777, 376206758, 361169576, 345904888, 330626417, 315523493, 300996383, 286932313, 272472388, 259393121, 246813099, 234827558, 221497602, 209055624, 198164053]
14232A98164053r880242r974306r430760q580718q029386p848009p110266o680442
14224A30629924o070406n385371n716181n199999m723568m915917m241008l837392
14216I0540082l630286l785390l294564l177997l053313k849681k692601k624560
14208F5431690k791213j898085k119314j842376k520878j576717j948011j352690
14200D9382406j811417j327963j226901j379016j278333j319555j624325p34232
14192C8680664o52931j144985q25891j283400j480602j205843p5867o81604j135032
14183C0194509p00873r41581q37141n33638l98528j197336m37251m97795o35193
14174B4015173n90604o41229m90347q84651j61752r30089J26876n58120o69954
$$ y = [198164053, 188283811, 178309505, 168878745, 160298027, 152268641, 144420632, 137310366, 130629924, 124559518, 119174147, 113457966, 108257967, 103534399, 98618482, 94377474, 90540082, 86909796, 83124406, 79829842, 76651845, 73598532, 70748851, 68056250, 65431690, 62640477, 60742392, 58623078, 56780702, 54259824, 52683107, 50735096, 49382406, 47570989, 46243026, 45016125, 43637109, 42358776, 41039221, 39414896, 38680664, 38027733, 36882748, 36056857, 34773457, 33292855, 32087012, 32011145, 31329541, 30194509, 29493636, 28552055, 27714914, 27181276, 26782748, 25585412, 25148161, 24650366, 24015173, 23424569, 22783340, 22292993, 21408342, 21246590, 20316501, 20443377, 19885257, 19215303]
14165A9215303o04175j66743k56110m79968m41701k23785n9740n79280m32707
14156A5971094k63188l27977l47337m37050n4523l77406o5195n43942n0252k85280
14146A3218944m80206P6805k91248j15615k88200o6113l51031n54283J09213j61674
14136A1096592L5923l19227m20943k6369j57052n5206k65963l7196m3012k54512
14126I553035j11745j87625j0297k64269k23376j92480J01868l01991P7168j79117
14116H261171p1838m08541L7327q3105j90513Q8652o2968k53545n7175l15192
14106F944273L80732k52020j44592k47970P6330k35235L16992k81425M04277r64820
14096E996542L30117n62888M13905o68768L02735o1567J8284j24720j77832J16312
$$ y = [19215303, 18611128, 18444385, 18188275, 17708307, 17266606, 17042821, 16983081, 16403801, 15971094, 15707906, 15379929, 15032592, 14595542, 14541019, 14163613, 14098418, 13554476, 13504224, 13218944, 12738738, 12815543, 12524295, 12408680, 12120480, 12054367, 11703336, 11149053, 11258266, 11096592, 11132515, 10813288, 10392345, 10365976, 10208924, 10153718, 9887755, 9850559, 9807547, 9553035, 9441290, 9253665, 9243368, 8979099, 8755723, 8563243, 8665111, 8363120, 8440288, 8261171, 8189333, 7780792, 7818119, 7735014, 7544501, 7633153, 7570185, 7316640, 7259465, 6944273, 7325005, 7072985, 6928393, 6680423, 6756753, 6521518, 6838510, 6557085, 6961362, 5996542, 6326659, 5763771, 6177676, 5508908, 5811643, 5750076, 5768360, 5643640, 5465808, 5582120]
14086E582120j48181M4266l04660k8948j74200K93839K8319j67647m3612l0383
14076E050913k90237O0649l52342K42350k28863K80522k37685K2165P569k14125
14066D340916L48364l33657m3527n6174j60687l0561k8624o9414K6870K23032
14056D216538k68353K12924l50949l55468L70204N3792m48438O7898K57293j77498
14046C577943j33106M27753J7303n11725R9373O5064K37449n04183R1284k88534
14036C078621J51112j02508R693R4890k98196K69835l55000K17658n1529r7924
14026B916652k15249J70310L43256l66205N8917r1093K96750k04938j121l44406
14016B562873j6877O4541N3534K44159j01784l24964J37648l36875K44444K24215
$$ y = [5582120, 5433939, 5478205, 5173545, 5144597, 4970397, 5264236, 5292555, 5124908, 5081296, 5050913, 4760676, 4821325, 4468983, 4711333, 4482470, 4762992, 4525307, 4547472, 4555041, 4340916, 4689280, 4355623, 4312096, 4255922, 4095235, 4064674, 4036050, 3966636, 3993506, 4216538, 3948185, 4161109, 3810160, 3454692, 3824896, 3878688, 3430250, 3498148, 3755441, 3577943, 3444837, 3872590, 3889893, 3378168, 3477541, 3542605, 3780054, 3275871, 3367155, 3078621, 3229733, 3127225, 3136918, 3231808, 2933612, 3203447, 2848447, 3066105, 3014576, 2916652, 2701403, 2871713, 3214969, 2848764, 2907681, 2816588, 3113338, 2908400, 2907279, 2562873, 2545996, 2610537, 2664071, 2908230, 2806446, 2481482, 2619130, 2282255, 2526699, 2750914]
14006B750914k62010l11352J19502K06269l07593K52697l37239R2037k11435Q5792
13996B077582J12279l29884m5799L86286k02486L31430l64187L49595m46794K45704
13986B113726k64565K96623j40898o5083Q7913j4788K81015K00950J49074J57553
13976B801520M02261J211527J317367L018605N657686J0178231R013957j2045683
13968B1555471p931053m747210k514494r75392j016016m49930m12288k97242j52032
13959C059814k861p93288O88878k95062N4037m40158m187M4306j75029p8869L1385
13948B088966m34295K41030j67711K26249j70912L51636l57489M7223q3058j52365
13938A589274M79721j21800j56492R5589j02139k9361n6590J3664k26240J90426
$$ y = [2750914, 2488904, 2177552, 2297054, 2503323, 2195730, 2448427, 2111188, 2203225, 1991790, 2077582, 2189861, 1859977, 1814178, 2200464, 1997978, 2329408, 1965221, 2314816, 1868022, 2113726, 1849161, 2145784, 2004886, 1939803, 2027716, 2012928, 2293943, 2494893, 2643967, 2801520, 3203781, 4415308, 5732675, 8751280, 14408966, 24587197, 33601154, 21555471, 13624418, 8877208, 6362714, 5387322, 4371306, 3921376, 3509088, 3211846, 3059814, 3056953, 2263665, 2952543, 2657481, 2711518, 2271360, 2267173, 2311479, 2136450, 2057581, 2088966, 1654671, 1895701, 1727990, 1954239, 1783327, 2134963, 1777474, 1824697, 1741639, 1589274, 2068995, 1947195, 1790703, 1886292, 1784153, 1754792, 1698202, 1711866, 1485626, 1676052]
13928A676052j24596J73708q2736k31880K17040k96932K05574K2349J07635l38426
13918A327788n5540Q3047L00621j36150N4932j58628l95274M80037J14560l05038
13908A310355k44918q4112K66151Q3789J27119j43657k9346O2903k24266O4644
13898A188662j14986L08020q3195J30696n9775O3130l32404L66728k57848j21524
13888A087504P2447J12376k70153P3356P6204J35900j41526Q2352n03595L91329
13878A116194j35211M46311m12738M00021k62926M22352m89584J57882j43319
13869A098982j37426n957K71341J1667l27444N13622o72119M11137j03951L83843
13859A443695j98954J60332l79315J2174q7668Q6326k70300K14589K19488m03714
$$ y = [1676052, 1551456, 1725164, 1642428, 1410548, 1627588, 1330656, 1536230, 1558579, 1666214, 1327788, 1272248, 1355295, 1655916, 1519766, 1574698, 1416070, 1020796, 1500833, 1615393, 1310355, 1065437, 981325, 1247476, 1331265, 1458384, 1314727, 1285381, 1348284, 1124018, 1188662, 1073676, 1381696, 1298501, 1429197, 1369422, 1432552, 1100148, 1466876, 1209028, 1087504, 1159951, 1272327, 1002174, 1075530, 1151734, 1287634, 1146108, 1228460, 724865, 1116194, 980983, 1427294, 1014556, 1414577, 1151651, 1574003, 1084419, 1242301, 1098982, 961556, 955599, 1226940, 1238607, 911163, 1424785, 752666, 1163803, 1059852, 1443695, 1244741, 1405073, 1025758, 1037932, 950264, 1036590, 766290, 980879, 1200367, 796653]
13849G96653J13142L49766l10382j30313L31574j36460Q9192n2828j6519M2065
13839A075890l90060J88950j1305J6411j12360K87272l14259O7194J39067J28158
13829A074958K4397l21205J07799J29175j29763k64909K88741m31813O16686k16519
13819H77547k17829k5292K13995K63946n51181J88658j2099j07000l1548M73173
13809A072370M184J27706k50656k14767J27604r1162K09078j2603D34532L53289
13799G87821l7621K19499j65617k92365K62666m5549J5598j22387l3601O4655
13789F53099k37788J94857J86330m0748O7925j01581J47210k08547K12687j40955
13779G32489j76579k03348N82253q3840l80227J74632J48340o5678k2261q2659
$$ y = [796653, 909795, 1259561, 949179, 818866, 1150440, 1013980, 1103172, 1050344, 1033825, 1075890, 685830, 874780, 863475, 879886, 767526, 1054798, 740539, 807733, 946800, 1074958, 1099355, 778150, 885949, 1015124, 885361, 620452, 909193, 477380, 1094066, 877547, 659718, 634426, 848421, 1112367, 561186, 749844, 737745, 630745, 599197, 1072370, 1076554, 1204260, 953604, 738837, 866441, 775279, 984357, 971754, 434532, 787821, 750200, 969699, 804082, 511717, 774383, 728834, 744432, 622045, 588444, 653099, 415311, 610168, 796498, 755750, 823675, 722094, 869304, 660757, 873444, 732489, 555910, 352562, 934815, 850975, 470748, 645380, 793720, 728042, 705781, 623122]
13769F23122o5103j02836j19546K02378J78742r424l48154K80691O038Q3557k88911
13758D40554L25943k77946K54450j04008k73365N6692K3519K18500m5050j66569
13748D52720J90148K73641m43314k3858J63452J77910l04226P0417p6608j4175
13738D66107K31064B54684L48245k5856j19680k00090L09135J06440j83946r4051
13728C94881j90342K55869L65012k95845K3261K01304k01584j50204J46643J5322
13718E64317q3691O8274J10960k14154J71393A82268K44315A40978J74099K20711
13708E35788j02258q2080J92830O4330k79645J24196q6819L5386M89052l44136
13698E46644m6612J77449k93378J9411P6335q256j70748K46663j3222R2657A78597
$$ y = [623122, 558019, 455183, 335637, 538015, 716757, 707333, 359179, 639870, 645908, 729465, 440554, 766497, 488551, 743001, 638993, 365628, 422320, 445839, 664339, 619289, 452720, 642868, 916509, 473195, 449337, 612789, 790699, 486473, 556890, 480282, 466107, 697171, 254684, 602929, 577073, 457393, 257303, 566438, 672878, 488932, 394881, 204539, 460408, 825420, 529575, 552836, 754140, 552556, 402352, 548995, 564317, 480626, 548900, 659860, 445706, 617099, 182268, 426583, 140978, 315077, 535788, 433530, 351450, 544280, 608610, 328965, 453161, 366342, 401728, 890780, 546644, 500032, 677481, 384103, 403514, 479849, 471593, 300845, 547508, 534286, 626943, 178597]
13686D19243r4723J18182J66525k03480L07299l11902P9363B05607K64350J45480
13676F15437J27095j92668j46984j01229K01115P0672L9990k59244l4533J72117
13666D91768M02055l68271j40906J5031M5698p5338j1255Q0571m5247M0384A45411
13654D65619r9294n6132L77010B70890P7154E4660L33268n5752J29915m906P0928
13643E28113J76244j07096j93744J04429l7377j45934q3435L96373k99148j48451
13633A89974G2372L28907J4476A28372J67062l8985K90745k21991o2043A27733
13622C08151K73976n806j68082L41779A1734O38693k88382j31567J30647J91778
13612E52903B76049l6867L84720j20923B14877L25703k09869a02668D87825j74660
$$ y = [419243, 324520, 442702, 609227, 405747, 713046, 401144, 480507, 205607, 469957, 615437, 742532, 549864, 402880, 301651, 502766, 573438, 613428, 354184, 319651, 491768, 893823, 525552, 384646, 399677, 445375, 370037, 358782, 439353, 394106, 434490, 145411, 465619, 366325, 310193, 687203, 270890, 348044, 54660, 387928, 332176, 462091, 457185, 528113, 704357, 597261, 403517, 507946, 470569, 324635, 241200, 637573, 338425, 189974, 72372, 401279, 415755, 128372, 295434, 256449, 547194, 325203, 263160, 127733, 308151, 582127, 576321, 408239, 750018, 11734, 650427, 362045, 230478, 361125, 552903, 276049, 239182, 623902, 502979, 214877, 540580, 330711, -102668, 487825, 313165]
13602C13165k4210o7146N8394K17251j0219A73781P7038M1198K4922K28087j09241
13591D35785Q2888j67878K84199k85375A66836R3420E1139M835J91661j6672q1536
13580A49427J49230R2596A22363J75592J56160A56702J64604L5642J06914j1657
13570D52205j48758J02580o0844A41803a15154B78342Q2877H8245J19520G254
13559C36719j63590M86007B46177l4359K98424B20559A10131K7044E3864K96226
13549C50090E1374J16590J17341J73593A15141K02128B7538L95964r7039K12109
13539E38572k39110j919j07058D6871P5045A4535L5287R9961L98056k09304K58056
13528E96591h6324J3385C45548A07269Q9075M04010D8056P5886L86519B18282
$$ y = [313165, 288955, 221809, 280203, 497454, 487235, 173781, 250819, 292017, 316939, 545026, 435785, 518673, 350795, 634994, 349619, 166836, 260256, 51139, 55974, 247635, 230963, 149427, 298657, 391253, 122363, 297955, 454115, 156702, 321306, 356948, 463862, 452205, 303447, 406027, 345183, 141803, -115154, 278342, 361219, 88245, 207765, 7254, 336719, 173129, 659136, 246177, 211818, 510242, 220559, 110131, 137175, 53864, 350090, 51374, 167964, 285305, 458898, 115141, 317269, 27538, 423502, 326463, 538572, 299462, 297543, 190485, 46871, 121916, 14535, 49822, 149783, 547839, 338535, 596591, -86324, -72939, 345548, 107269, 196344, 600354, 48056, 123942, 510461, 218282]
13517B59409J77125f9218D38671E8463L32646H0792J95689L1251H9328M34836
13507E24164c6874C01877j21203K28003A51678A9896L83736n688A71419G5495
13496B31204o2513K31198j12383c2298A13920J8091M41608j69777b1723A6344
13485a54819C80109F0108L7186P9375n2588M2018l5019n095N9218a14623C15577
13473B15482M0082J17863F8779K62176k0081b461A07493J32875A00637m29D1693
13461C03957R5971D3864M69681k05383J30600A8496J72708L6237d8300C45081
13450A71185J4484N3178J40186M7569M9384A6954K64436a48050B21001q4977m9488
13439H6536N5998C5568J26470d5699B63759M4314A46295J81923K792K0100j55217
$$ y = [259409, 436534, -69218, 438671, 58463, 391109, 80792, 276481, 307732, 89328, 524164, -36874, 301877, 180674, 408677, 151678, 19896, 403632, 397944, 171419, 75495, 231204, 168691, 399889, 287506, -32298, 113920, 132011, 573619, 403842, -21723, 16344, -154819, 380109, 60108, 97294, 176669, 124081, 166099, 131080, 125985, 185203, -114623, 315577, 215482, 255564, 373427, 68779, 330955, 310874, -2461, 107493, 240368, 100637, 100208, 41693, 303957, 399928, 43864, 513545, 308162, 438762, 18496, 191204, 227441, -48300, 345081, 171185, 185669, 238847, 379033, 426602, 475986, 16954, 281390, -148050, 221001, 136024, 86536, 142534, 35568, 162038, -45699, 263759, 308073, 146295, 328218, 331010, 351110, 195893]
13428A95893J2872A6046M24020A54740J62234j55891C2013L63561b7536B31549
13417B74536K9113j24040m1573a66850B28928B0274b3911A80681o0315n5938M42637
13406E07065j5153B36662a4986A90215K29167B8775J34825F5228a25777C28554
13395A20363M19583A69437J72745i5895C82575a1497B97134D4692P1561L05719
13385D21972m035a38318C0356N5033i5980A53905o935J14733a8482H0188M1156
13374A21344M5150B5919J68257o5675m6998Q0750O0344F1555R2848j1985N5171
13363A97589L6122f6995E745K57630K2518a6275A25941J73638a3191A17478L69988
13352D87466H2311K74522O912A4328J27962P6651k3108J31735G8188L14234j69108
$$ y = [195893, 208765, 16046, 440066, 154740, 316974, 161083, 32013, 395574, -27536, 231549, 274536, 303649, 179609, 138036, -166850, 228928, 20274, -23911, 180681, 120366, 64428, 507065, 491912, 236662, -14986, 190215, 419382, 28775, 163600, 65228, -125777, 328554, 120363, 539946, 169437, 342182, -95895, 382575, -11497, 297134, 44692, 116253, 421972, 417937, -138318, 30356, 85389, -95980, 153905, 146970, 261703, -18482, 80188, 121344, 166494, 25919, 194176, 128501, 81503, 162253, 222597, 61555, 154403, 142418, 197589, 233711, -66995, 5745, 263375, 285893, -16275, 125941, 299579, -13191, 117478, 487466, 82311, 356833, 363745, 14328, 142290, 218941, 195833, 327568, 78188, 392422, 223314]
13341B23314O5433A8966O1311J49723j1404I3119P6607j3533L07624G0732J54246
13330B24978o9995M2861a15292r1279F53797B31313B6205J74876K37226H554K92752
13319C01306b4953B09258K75631I4664d9277a540G4280f3375D06498j90088J7688
13308B34098a58165H2923J21174B6636J61199P9323b7409j26905D34322j82331
13298B51991A11283K89588j55109a39681C08072j0697f2468B88532c55126C26209
13287e7546A42630J37571O6490j6446C0303a195E424J29536E2039N7765i0169
13275B69173D4748Q5827F3492J00731f7016B27392j8864k8077L0035J3917o9566
13264A54837C2269K20426j5368b37993J00289A04771d6029C5264d362F9453a39396
$$ y = [223314, 288747, 18966, 80277, 230000, 218596, 93119, 169726, 156193, 463817, 70732, 224978, 154983, 197844, -115292, -206571, 653797, 231313, 26205, 201081, 438307, 8554, 301306, -24953, 209258, 484889, 94664, -49277, -1540, 74280, -63375, 406498, 216410, 234098, -158165, 82923, 204097, 26636, 187835, 267158, -27409, -154314, 434322, 251991, 111283, 400871, 245762, -139681, 308072, 297375, -62468, 288532, -355126, 326209, -57546, 142630, 280201, 346691, 330245, 30303, -1195, 5424, 134960, 52039, 109804, -90169, 269173, 44748, 130575, 63492, 164223, -67016, 227392, 208528, 180451, 210486, 224403, 154837, 32269, 252695, 237327, -237993, -137704, 104771, -46029, 35264, -4362, 69453, -139396]
13252A74787L1551a65564P7980A87024J3902a32302d8372k41064a37056d2171
13241G6575J09322i6961A06760a08161A35384b05152F2693K41314C9532J70954
13231B10486m7316f8371E10357o0090b01890Q9282A72788J10588D8126i1933j84953
13220b76886C4521P0973b13921F1811K5543M6723L7502K10518j30704J14614f7085
13208b5741D57025b71702a06794C76674j50585E279L5146N5276B1757J28085o2209
13197H7633Q0143o2145R3032o8491a7630C30458H7237Q2114I394h0662a5855A14618
13184C73653A83678i5231A33467J56584a58E4728a8743I4768a38639j2583j94249
13173c45471I9924c45448B31296b22881A1296K07797c1200k03648d0317A29731
$$ y = [174787, 206338, -165564, -87584, 187024, 200926, -132302, -48372, -289436, -137056, -42171, 76575, 185897, -96961, 106760, -108161, 135384, -205152, 62693, 304007, 39532, 210486, 163170, -68371, 510357, 450267, -201890, -112608, 172788, 283376, 48126, -91933, -276886, 34521, 105494, -213921, 61811, 87354, 134077, 171579, 382097, 251393, 366007, -67085, -25741, 457025, -271702, -106794, 376674, 226089, 5279, 40425, 95701, 21757, 149842, 87633, 167776, 105631, 198663, 130172, -17630, 330458, 87237, 169351, 9394, -80662, -15855, 114618, 373653, 183678, -95231, 133467, 290051, -158, 54728, -18743, 94768, -138639, -151222, -345471, 99924, -345448, 231296, -222881, 11296, 219093, -31200, -234848, -40317, 129731]
13162D8664A351K27435b27711O0685n6372A16214b0876j0747a4289o645A40939
13150e9931D1309J07163n5975c10334h0780C89592A25490o2008b00784A33421
13139H9973b21164a8262I9542B3639J83583o7059C1607J45796b78404N6569a09725
13127H4907C7261a5670B46619a91020B0482L5647c5136A41689b74926A40246L12682
13116D52928k17769o2629e1985a2726r6471A5397K17630H6177K54404R3487A20316
13104H2446N005J663a3623r8210M9310D7540a33299A68990o6038J07969D6339
13092c3371j00146B23102c30751f8423B92964l0623D5613b80172a01466B13300
13081C1698K93791p5553b1052D2403a49675B13900B0795K2410M3344d1413A18113
$$ y = [48664, 1351, 228786, -227711, -167026, -223398, 116214, -20876, -31623, -14289, -20934, 140939, -59931, 41309, 148472, 92497, -310334, -80780, 389592, 125490, 63482, -200784, 133421, 89973, -221164, -18262, 99542, 23639, 207222, 140163, 31607, 177403, -278404, -221835, -109725, 84907, 37261, -15670, 246619, -191020, 20482, 56129, -35136, 141689, -274926, 140246, 452928, 235159, 172530, -51985, -12726, -109197, 15397, 233027, 86177, 340581, 434068, 120316, 82446, 87451, 89114, -13623, -111833, -62523, 47540, -133299, 168990, 102952, 210921, 46339, -33371, -133517, 223102, -330751, -68423, 292964, 262341, 45613, -280172, -101466, 213300, 31698, 325489, 249936, -21052, 42403, -149675, 213900, 20795, 43205, 86549, -41413, 118113]
13069a18806L418m8268f8007C5374J37118g9701H8149Q4724f6903A47087j2624
13058A34463A3091J12674n5642R8316D0222P7677Q1859b71051B94145a54124C44611
13046E0007c7209l591d179j53835A22022R9225a4100B76520k595A30815b7498
13034A25316i8100A08341K18448p5224A0842K3979L84140b23801B00364I8437
13023e8904b1231A28282E9378O1526h7036B77556n1135I3820c54344B42628F4475
13011a44331B493J37470E9800A1428J65243K0787D2105J44534a50951A53216D9419
12999A99768F1125a00150B1322M31334A75060a07345B89024a44744E6712K580
12989E9292J565J04156p9467d3264E4561e4052i4j54670E2790e8875o9941G5910
$$ y = [-118806, -115388, -163656, -68007, 35374, 172492, -79701, 88149, 172873, -66903, 147087, 134463, 13091, 125765, 70123, 168439, 40222, 117899, 199758, -271051, 294145, -154124, 344611, 50007, -37209, -40800, -4179, -158014, 122022, 221247, -14100, 276520, 273925, 130815, -27498, 125316, -98100, 108341, 326789, 251565, 10842, 34821, 418961, -223801, 200364, 98437, -58904, -21231, 128282, 59378, 120904, -87036, 277556, 226421, 93820, -354344, 242628, 64475, -144331, 2493, 139963, 59800, 11428, 176671, 197458, 42105, 186639, -150951, 153216, 49419, 199768, 61125, -100150, 21322, 452656, 175060, -107345, 289024, -144744, 56712, 59292, 60857, 165013, 85546, -43264, 54561, -54052, -94, -154764, 52790, -58875, -128816, 75910]
12976A59939b3085A0003j039f7884A8811Q9020e3155k06064A26002b7116r910
12965c7026n7027k9680C7595N2793c62480g1132R099m6696r0267c7148o0407A65478
12952a22870J4151f301H746c12407R3338h9738B5698e5051j86526A06108J22567
12941B28675c63458I1367e7468j53774A12186f2109A89787a68145A00862a05385
12930H5473e0562j55809l0272a02615C31256b1038k33227g7833q5755A21476e62382
12918G1942a17345b6763H1810L36245j36806A09241E0803J64236a02028K2396
12908g9632j55304a6174j17005C8527J56107H0993g5516j6912E590a93418A18785
12896a49156k28127A01964b13201P4396l00659b7568j44649a3156B05149J2033
$$ y = [159939, -23085, 10003, 8964, -67884, 18811, 107831, -53155, -259219, 126002, -27116, -37026, -94053, -123733, 37595, 90388, -362480, -71132, -62033, -108729, -198996, -37148, -97555, 165478, -122870, -108719, -6301, 8746, -312407, -219069, -89738, 25698, -55051, -241577, 106108, 228675, -363458, 91367, -57468, -211242, 112186, -62109, 189787, -168145, 100862, -105385, 85473, -50562, -206371, -236643, -102615, 331256, -21038, -254265, -77833, -163588, 121476, -562382, 71942, -117345, -26763, 81810, 418055, 281249, 109241, 50803, 215039, -102028, -79632, -234936, -16174, -133179, 38527, 194634, 80993, -75516, -92428, 5590, -193418, 118785, -149156, -377283, 101964, -213201, -138805, -439464, -27568, -172217, -13156, 205149, 217182]
12886B17182b43233a06771j43289A85748n1864n179b75126H7653P9133a08371
12875i3782L4648C561a10980j41988e0291B12284r5079K0181J59720e1173A01925
12863b3897K723l7415E5767N7363P9202c61874F0285j1871e6650k74867B46370
12851A20261b0624C47297n1297a63461f0830F2009a80285k6701A56350E3957a89597
12839D620d5439a993k54123H5664P1090l0869j2998f6332E2164b81718h6525C19650
12826a63305a0718l33146e5913G3390A4604J86798q4902O7267J1686a38272A20229
12814a40825e3958E1051i665A8182g4055K8588m1521L600j20040B16320K21443
12803D37763g7278j4625A06793Q3326n941h8707K5849D0090a19721G9608J60235
$$ y = [217182, -243233, -106771, -250060, 185748, 133884, 128705, -275126, 87653, 166786, -108371, -93782, -59134, 3561, -110980, -252968, -50291, 212284, 117205, 137386, 297106, -51173, 101925, -23897, -21174, -58589, 55767, 113130, 192332, -361874, 60285, 48414, -56650, -331517, 246370, 120261, -20624, 347297, 296000, -163461, -60830, 62009, -180285, -206986, 156350, 53957, -189597, 4620, -45439, -1993, -256116, 85664, 156754, 125885, 112887, -66332, 52164, -281718, -86525, 319650, -163305, -10718, -343864, -55913, 73390, 14604, 201402, 116500, 183767, 195453, -138272, 120229, -140825, -53958, 51051, -9665, 18182, -74055, -45467, -86988, -83388, -203428, 216320, 437763, -77278, -91903, 106793, 190119, 184178, -88707, -62858, 40090, -119721, 79608, 239843]
12792B39843a84020J5001L9241A24212i9338C16301a72031A4246i4171b3972A56034
12780C79613f2260K7930F7319P2378c6218N279p3141E5486a46982e4792a5945
12768C8451a76976n3943C69413A1225a9201A54607n4216f1254k1197A67541a8712
12756G5312d4259A49108m1152a66714j31482A37751a01759j00442A25791a88075
12745A75164b88527f204j12900j18533A16469a32247F1683K3117J36904j6504
12735B05200E2361P6958l8942b69869A71535c7414C26190b31286e1922j5510j53373
12724b20805B45721A7396c3793A88072a5707A68695L21763d1852B25114b7671
12713a20050I0441h0657B6746b09343K6681A9329a71770G2112j7148a88392B5453
$$ y = [239843, -184020, -169019, -129778, 124212, -99338, 316301, -172031, 14246, -94171, -23972, 156034, 379613, -62260, -34330, 67319, 139697, -36218, -30939, -104080, 55486, -146982, -54792, -15945, 38451, -176976, -230919, 369413, 11225, -19201, 154607, 100391, -61254, -82451, 167541, -18712, 75312, -44259, 149108, 107956, -166714, -298196, 137751, -101759, -202201, 125791, -188075, 175164, -288527, -6204, -119104, -237637, 116469, -132247, 61683, 84800, 221704, 205200, 52361, 129319, 90377, -269869, 171535, -37414, 326190, -231286, -51922, -67432, -220805, 245721, 17396, -33793, 188072, -15707, 168695, 490458, -41852, 225114, -27671, -120050, 90441, -80657, 26746, -209343, -182662, 19329, -171770, 72112, 54964, -188392, 25453]
12701I2363a67751b8282o5167A2578K51813D5064J51633C8388K0769b19770B20134
12689A95082H5078A6748a13110H6760O7798J90257b6033j85118B45425m2929c76166
12677H2920b21287R8789a1902A26275C3172b7203G1974a75897B71867B0367J99965
12666B20332A07131M2040O519J49407d0018j13089l9966g1542H1547f1593m3237
12655a04830I2263D0601R1758a55130A21850J62221j02548Q9338A31340h9573
12644B64440p3526Q3835a5009k6772o6649N3556F2275b619j21251M9283b8365
12632A05349b8792j09407B50970b49352C35077a61149B4320a91612B18672a99247
12621A24567Q3336d71100H434i875C21888g2712A63023h7947D2479K82247I6249
$$ y = [92363, -167751, -28282, -93449, 12578, 264391, 45064, 196697, 38388, 59157, -219770, 220134, 195082, 85078, 16748, -113110, 86760, 154558, 344815, -26033, -211151, 245425, 202496, -376166, 82920, -221287, -122498, -11902, 126275, 33172, -27203, 71974, -175897, 271867, 20367, 220332, 107131, 149171, 155690, 305097, -40018, -153107, -193073, -71542, 81547, -61593, -104830, 92263, 40601, 132359, -155130, 121850, 284071, 181523, 270861, 131340, -89573, 264440, 190914, 274749, -15009, -41781, -108430, -54874, 62275, -2619, -123870, -74587, -28365, 105349, -28792, -138199, 250970, -249352, 335077, -161149, 24320, -191612, 218672, -199247, 124567, 207903, -471100, 8434, -9875, 321888, -72712, 163023, -87947, 42479, 324726, 96249]
12609D24347A79093P8731a29530C60314a245k967C8152K18681j14447K97973c61133
12597g6018j86830F9826a14644A5007J64865B0902L3013K14684a54702M9493C62887
12585A16071J05336B1347d422j56638g3628b0491A23339a02158C6309d8537n214
12574e3751J9603l6298A64966j4311J47027b13874C1535d58463J66291B14569
12563c55539A10405d6934j84455a0297j12251A66537C2586L4614a75443e185j68456
12552a73641O8413A83544a08121F349b58536L0011a11049b4845m0094j48314J1516
12541b01737A44126m3852A849M1495a0951A80732D5295b77951R3454a8944j35496
12530a54440o2715R5354C315b34456a00620A75535A3990P0993a04726G0599J5088
$$ y = [424347, 179093, 257824, -129530, 360314, -1245, -4212, 38152, 256833, 142386, 440359, -361133, -76018, -262848, 69826, -114644, 15007, 179872, 20902, 53915, 268599, -154702, -105209, 362887, 116071, 221407, 21347, -4422, -161060, -73628, -20491, 123339, -102158, 36309, -48537, -53751, -34148, -70446, 164966, 150655, 297682, -213874, 31535, -458463, -292172, 214569, -355539, 110405, -46934, -231389, -10297, -122548, 166537, 32586, 67200, -175443, -5185, -173641, -105228, 183544, -108121, 6349, -258536, -228525, -111049, -24845, -64939, -213253, -201737, 144126, 100274, 1849, 43344, -10951, 180732, 45295, -277951, -184497, -18944, -154440, -217155, -121801, 3315, -234456, -100620, 175535, 13990, 84983, -104726, 70599, 85687]
12519H5687B5417b66392d6954D4361a44370C95661H6551a2151H5205b35388E7801
12507d6763E7389K31659c3888j31976c1242l9318j02442N837f7711b6768J1248
12496a5520A16415a04814k63367f9335o8257B72196j14083a79484F818J10309
12486A17127M8330K35646E2504K5815e5298j09390C6044d6343k28588q3675A65646
12474A55090G7035e4403o0872B24611E1716g3335D4319a32329B48J23589Q3058
12463B06895J41859j52455b00184A93165n5656B602K45330A7649R2656L8088D7522
12451A44139a25474p5771G0544a54887I6419a23448D6100a53111j73368J12566
12441b13913P5903J1908e1547A50756a08300b7646k96117a0447j05931A35864
$$ y = [85687, 25417, -266392, -46954, 44361, -144370, 395661, 86551, -12151, 85205, -235388, 57801, -46763, 57389, 289048, -33888, -165864, -31242, -70560, -173002, -167165, -67711, -26768, -15520, 116415, -104814, -368181, -69335, -137592, 272196, 158113, -179484, 6818, 117127, 165457, 401103, 52504, 78319, -55298, -164688, 36044, -46343, -274931, -358606, 165646, 155090, 77035, -54403, -115275, 224611, 51716, -73335, 44319, -132329, 248, 123837, 206895, 348754, 196299, -200184, 193165, 137509, 2602, 247932, 17649, 110305, 148393, 47522, 144139, -125474, -201245, 70544, -154887, 96419, -123448, 46100, -153111, -326479, -213913, -138010, -126102, -51547, 150756, -108300, -27646, -323763, -10447, -116378, 135864]
12430A24196J93282a75698H4634f5601A37883e9317A17070f2482k27819Q250J24228
12419a57823A04969a30546e9916k55438e0571p002m08664c073k46573K717A5730
12407c450E0218J32778G0502J28010a80639C34094c20325a22532C26905d7337
12396b28213B5320J32458a44209F6260K83922i9506B1506a88021K9292A6117a61603
12384F7584A7907b23524O9333G0646f8878O912B74131F5642c68651a24650B57005
12372B2884b19820i8408j14308h2096b4772A20545c21442A28392a56789e1231
12361d1156A13364J61602G7039J63142A11294J70240G2076b6512k1420J6673q601
12350c9860a6697B89002a61731c7045j557k83500A82720c005A55916f3309j1129
$$ y = [124196, 317478, -175698, 84634, -65601, 137883, -59317, 117070, -62482, -290301, -282051, -157823, 104969, -130546, -59916, -315354, -50571, -57573, -466237, -3073, -249646, -246929, 15730, -3450, 50218, 182996, 70502, 198512, -180639, 334094, -320325, -122532, 326905, -47337, -228213, 25320, 157778, -144209, 66260, 350182, -99506, 21506, -188021, -158729, 16117, -161603, 67584, 17907, -223524, -154191, 70646, -68878, -61966, 274131, 65642, -368651, -124650, 257005, 22884, -219820, -98408, -212716, -82096, -24772, 120545, -321442, 128392, -156789, -51231, -41156, 113364, 274966, 77039, 240181, 111294, 281534, 72076, -26512, -47932, -31259, -39860, -16697, 289002, -161731, -37045, -38602, -322102, 182720, -3005, 155916, -63309, -74438]
12339g4438A26592c14460J40439G1360d00272a80024I0922M9461b52419A48992
12328A69556d66327C4354J9139K11661B7345c14919A31969A6080c8143k00538
12318b38681F3334M37379J1628A28194e0298B11713G127f7923C14188J2538I3888
12306A74167J67691F4184L81906A75014J27840k2620q7139m3958b9265C48344
12295B07777a13365D04160A90549o6340n3602a81624F5193b68110f7364o7711
12285a35075B11525L6025j00560f0810C8143K01064k6689J22805A54444P5184
12275B29628m892m969L4038j0683b03512B03940j01313a17497B25830a68751D4447
12263E0459K43889b81005A03981l0452K0623J59494j5684q2563K89767A93398
$$ y = [-74438, 126592, -314460, -174021, 71360, -400272, -180024, 90922, 140383, -252419, 148992, 169556, -466327, 34354, 53493, 265154, 27345, -314919, 131969, 16080, -38143, -238681, 63334, 500713, 512341, 128194, -50298, 211713, 7127, -67923, 314188, 326726, 93888, 174167, 341858, 64184, 446090, 175014, 302854, 280234, 193095, 149137, -29265, 348344, 207777, -113365, 404160, 190549, 124209, 70607, -181624, 65193, -268110, -67364, -135075, 211525, 247550, 146990, -60810, 38143, 239207, 212518, 335323, 154444, 229628, 224736, 219767, 253805, 243122, -203512, 203940, 102627, -117497, 225830, -168751, 44447, 50459, 294348, -281005, 103981, 73529, 94152, 253646, 237962, 155399, 445166, 193398]
12252a05496A23943m9024L4999C2334L34894E5412M6433a14261I5322K12501J41304
12241D49127j88230E7631J55338g6098A85934Q3350n4537H3658J99922g2374K2435
12230d9939B39256H9594J98281r5882n7266b58905R3293j30040J23920D2266b50538
12218A70111b1576A62138M73849G9809J25090n0071J48288F7583J21801N5233
12208B44617K38228A16406K77020d8927B64246d5129A00620L78826k8552j19175
12198C31719b4466B57495A13001b73190A252J87447L6346p7880N1308J19096a02084
12186B03129g2859A54689b2389F8611K26730r0585Q2064C3128a0153C23343K0898
12175C44241A21497R2349k2936a39827N6555h251F4385k0961N3261a73898c7471
$$ y = [-105496, 123943, 74919, 109918, 32334, 367228, 55412, 101845, -114261, 95322, 307823, 449127, 260897, 57631, 212969, -76098, 185934, 269284, 214747, 83658, 283580, -72374, -49939, 239256, 89594, 287875, 191993, 134727, -258905, -165612, -295652, -171732, 42266, -250538, 170111, -21576, 162138, 635987, 79809, 204899, 154828, 303116, 67583, 189384, 244617, 482845, 116406, 393426, -48927, 264246, -45129, 100620, 479446, 450894, 331719, -24466, 257495, 113001, -273190, 1252, 188699, 225045, 147165, 198473, 317569, -102084, 203129, -72859, 154689, -22389, 68611, 295341, 204756, 286820, 33128, -10153, 323343, 344241, 121497, 213846, 190910, -139827, -83272, -8251, 64385, 43424, 96685, -173898, -37471]
12163C01224p2828i8806I4060M44260A90561K27736H012K86208F4493K23387j08489
12152A79391K47549A78357m8613J9808D9927K12126j28344h9085I0265N1555R9463
12141B41283a23692G2413M3790a51850q1068F4435L5567j4593K9619b08732A38998
12129f6603A47776a4620A52250i805A5349J45718c4580G8784J04224Q044I2386
12117A17365d32741I9955P3762K9362d5344J4125E6806d4737G395K33446D4776
12105I3321J43351L82882C03096D8569O0691b4107A39168L7952b8502E1940d1822
12093A11375J63743J07652I7977N8799d9641A95136O4770a89174A81819d3271
12082B05849J15599A21370m4538m447O32K5484L7111a54980c8925A19033C4730
$$ y = [301224, 228396, -98806, 94060, 538320, 190561, 418297, 8012, 294220, 64493, 287880, 179391, 426940, 178357, 129744, 149552, 49927, 262053, 133709, -89085, 90265, 141820, 241283, -123692, 72413, 116203, -151850, -232918, 64435, 100002, 85409, 115028, -208732, 138998, -66603, 147776, -14620, 152250, -9805, 15349, 161067, -34580, 78784, 183008, 191052, 92386, 117365, -432741, 99955, 173717, 203079, -45344, -31219, 56806, -44737, 7395, 240841, 44776, 93321, 236672, 619554, 303096, 48569, 109260, -24107, 139168, 177120, -28502, 51940, -41822, 111375, 275118, 382770, 97977, 156776, -49641, 195136, 259906, -189174, 181819, -43271, 205849, 321448, 121370, 76832, 72385, 73017, 98501, 135612, -154980, -38925, 119033, 34730]
12070a8713A24705E6303J32701c6158B08819D0363n9P4186k3530b5627C2357M63857
12058D96214i3102I058M8447J3520J31515j9709A8967i2677c3944A33749l2925
12047A00824M1446o6920d0412j3080A53067c0157j17023H2594b25298A58295b02932
12035B09057b53382C0746j1470f9745A01667L6672A4116N1574J9684g2734j76754
12024b49488F3581a27770k7309G5795l1217h5058F1122a65364G6003J38830a17784
12012a23246o7328g8454B23333a80669Q2260a1620G2005a23127F2517a05522B93291
12000g4642F2656b44420F7780d5604C14855a00178c059B34277H0342b4450B45410
11988E68891G9554b01659R4129M8119E5257H486b2197B08673c6496j24659m0041
$$ y = [-18713, 124705, 56303, 189004, -36158, 208819, 40363, 40304, 114490, 90960, -25627, 32357, 496214, -93102, 9058, 57505, 71025, 202540, 182831, 18967, -92677, -33944, 133749, 100824, 142270, 75350, -40412, -53492, 153067, -30157, -147180, 82594, -225298, 158295, -202932, 209057, -253382, 30746, 19276, -69745, 101667, 138339, 14116, 65690, 85374, -72734, -249488, 63581, -127770, -155079, 75795, 44578, -85058, 61122, -165364, 76003, 214833, -117784, -123246, -190574, -78454, 223333, -180669, -98409, -11620, 72005, -123127, 62517, -105522, 293291, -74642, 62656, -244420, 67780, -45604, 314855, -100178, -3059, 234277, 80342, -24450, 245410, 568891, 79554, -201659, -107530, -59411, 55257, 8486, -22197, 208673, -36496, -161155, -201196]
11977b01196h2192k32001a27499A85619E4934a73866E6622b43252a15885m6417
11967a62302D2814J465K10171a30211M9384r3831F9316j9777L10829a17027D46457
11955B2173P3983a51434b3069j20089p3077L1668M1893B15236b03588L8272B59308
11943a42983A61007D3624a18404o0556j3732F2080B3206a87352A10462K38126
11933C48588F8265a69672b7220O109B32293b33489k03885c9178A58827A4786h2863
11921a64999P917B39302E4612P9961d3435b0916l5015C74540j33154b16675d7961
11909A32752F4706a57909A15618e1868B41377a80717A69129L6910n3152A1655
11898a25112m2702c4625l2008j57495A89859q4794a09490B9731h8170j66333B52519
$$ y = [-201196, -82192, -314193, -127499, 185619, 54934, -173866, 56622, -243252, -115885, -162302, 42814, 44279, 254450, -130211, -80827, -174658, 69316, 49539, 360368, -117027, 446457, 22173, 96156, -151434, -23069, -143158, -216235, -184567, -142674, 215236, -203588, -165316, 259308, -142983, 161007, 43624, -118404, -178960, -192692, 62080, 23206, -187352, 110462, 348588, 68265, -169672, -27220, -21111, 232293, -233489, -437374, -39178, 158827, 14786, -82863, -164999, -157082, 239302, 54612, 134573, -43435, -20916, -55931, 374540, 241386, -216675, -47961, 132752, 64706, -157909, 115618, -51868, 241377, -180717, 169129, 206039, 152887, 11655, -125112, -167814, -34625, -66633, -224128, 189859, 105065, -109490, 29731, -88170, -254503, 252519]
11886f8075A28140b60406k0767i4456F9883a5540j69669E3799d6737j94869A56376
11874B44605a47391A82506o4127d097A27854a95070F6751a80218C43835D178b0243
11862a41688f0564p5245K3058B12468a57799H8094f3313I4589K3934E1427c23416
11850E672d7276B20762b98263J39765P1165A54419c2779j98217C17351C1820c07465
11838b59887A61463P180l5309J06904a09588N112J1821j5508j8149j77288B38025
11826a84344L0390o0056i2456q2238m4231C07911B1401J05904j0938e6009H21
11814A19155i3813j05700O4503e9040l1598A23732h7811G497b06762j01355c2353
11802A94322c17197B08001a57930I5147a0434q6097p7649j91868B27791C8914
$$ y = [-68075, 128140, -260406, -281173, -94456, 69883, -15540, -185209, 53799, -46737, -241606, 156376, 244605, -147391, 182506, 118379, -4097, 127854, -195070, 66751, -180218, 343835, 4178, -20243, -141688, -60564, -135809, -112751, 212468, -157799, 88094, -63313, 94589, 118523, 51427, -323416, 5672, -47276, 220762, -298263, -158498, -87333, 154419, -32779, -230996, 317351, 31820, -307465, -259887, 161463, 168643, 133334, 240238, -109588, -104476, -92655, -108163, -126312, -303600, 238025, -184344, -153954, -214010, -92456, -174694, -218925, 307911, 21401, 127305, 116367, -56009, 821, 119155, -93813, -199513, -135010, -59040, -90638, 123732, -87811, 7497, -206762, -308117, -32353, 194322, -317197, 208001, -157930, 95147, -10434, -96531, -174180, -366048, 227791, 38914]
11791b10740c7547A38100f7039C2655O9672a36916j1150F2696L591a05790B72149
11779a01636n4045J7417n0602l06006d5509r2659B16339c1144B1754K57860D21
11767A55404a01469A72899a45692d5839F2632L61b8373q5043o2229B70846o7776
11756B03070L72881a86669e5759q3433D1833b17747J1021j71649i5164k35296
11746c30460J33252K0703D14551G0657a832A64222L9208I265a31271E4749R1533
11735A46282a74274c9949F8587a42023h996B79811C6360K46680f7878l14119a9768
11723A7656J3911L28669a8519H9162K82029b03511D8456J89291J63477A26107
11712h4244r1394H9944J8498g0424I6602b92571A23540J4085a03197o5357b0598
$$ y = [-210740, -37547, 138100, -67039, 32655, 102327, -136916, -148066, 62696, 66287, -105790, 272149, -101636, -155681, -138264, -188866, -494872, -45509, -138168, 216339, -31144, 21754, 279614, 421, 155404, -101469, 172899, -145692, -45839, 62632, 62993, -28373, -113416, -175645, 270846, 203070, 575951, -186669, -55759, -139192, 41833, -217747, -206726, -378375, -95164, -330460, -197208, -176505, 414551, 70657, -1832, 164222, 203430, 9265, -131271, 54749, 146282, -174274, -39949, 68587, -142023, -8996, 279811, 36360, 283040, -67878, -381997, -19768, 17656, 31567, 360236, -18519, 89162, 371191, -203511, 48456, 237747, 401224, 126107, -84244, -175638, 89944, 108442, -70424, 96602, -292571, 123540, 137625, -103197, -168554, -20598]
11700b17253a5688A14520c84348A58912J74052g5488a6849A07794h6733C405Q2777
11689H6182K28113b65503j8596A38177a31724C07746j35507b3241B65034h4951
11678H6760M4102m7313J91589d4780F9951f4921l67176B21468b60250D3648j0726
11667C2922i9294E5840c4412A35814a30848j28196D9664g7074J0405A56005f9595
11655a66621f5343q9480E6407d8767I11J79714b8768F0926a06696M6451A4713
11643C08439D7369P7516L1294a36258K1371d7564B58574c7980o8127F1863J21150
11632A83013a26533L7022K8378k99462c3053B25543n1030p6304b67976C0838J19224
11621A50062E5986a47601N951j93978G3633b42525a8800B0113J53121F9534D354
$$ y = [-217253, -15688, 114520, -384348, 158912, 332964, -75488, -16849, 107794, -86733, 3405, 86182, 314295, -265503, -284099, 138177, -131724, 307746, 172239, -23241, 265034, -84951, 86760, 130862, 83549, 275138, -44780, 69951, -64921, -432097, 221468, -260250, 43648, 32922, -99294, 55840, -34412, 135814, -130848, -259044, 49664, -77074, -66669, 156005, -69595, -166621, -65343, -154823, 56407, -48767, 911, 180625, -28768, 60926, -106696, -60245, 14713, 308439, 47369, 124885, 156179, -136258, -114887, -47564, 258574, -37980, -106107, 61863, 183013, -126533, -89511, -61133, -360595, -33053, 225543, 174513, 98209, -267976, 30838, 150062, 55986, -147601, -141650, -335628, 73633, -242525, -18800, 20113, 173234, 69534, 4354]
11609F7994R4598R5427j06523o7057C7153G478f0351C39716I7402a57387B31601
11597a15133n5091C36163b11357D8245f9686A19111l2373f0247b09A73070K498
11586A75568J65426j32545m3776K83798k23191A07493L96211c09178B63262d9387
11575b34057J01351A57891m914C3224a6363A10327a70022k7436A5335J30430K89976
11564D35741G5899J0857b02054B47588B6606b52926f5101D7561J47561f3687j43567
11553b07254c7675A16212Q4489G0684P7697c9206C08154j25239b51946G2561Q1627
11542A54188c8568l15947I413M9465c58491J44904C2657P2344a15750M2898A31009
11530a36519N1637C15348j29374a39931A03855f443A51041m9283a45222k09315
$$ y = [67994, 162592, 258019, 151496, 84439, 37153, 7478, -60351, 339716, 97402, -157387, 231601, -115133, -170224, 336163, -211357, 48245, -69686, 119111, 86738, -60247, -209, 173070, 175568, 340994, 208449, 164673, 448471, 225280, 107493, 503704, -309178, 263262, -49387, -234057, -132706, 157891, 152977, 33224, -16363, 110327, -170022, -197458, 15335, 145765, 435741, 75899, 86756, -202054, 247588, 26606, -252926, -65101, 47561, 195122, -63687, -207254, -37675, 116212, 200701, 70684, 148381, -39206, 308154, 182915, -251946, 72561, 154188, -38568, -354515, 9413, 58878, -358491, -213587, 32657, 105001, -115750, -72852, 131009, -136519, -84882, 315348, 185974, -139931, 103855, -6443, 151041, 101758, -145222, -354537]
11520c54537A90918E5588J16116b01654A30238N2010q7906a29215F2919M3195
11510A06114h8681o5394C84766A55658K1484A1599a17594l57815B97426D5596
11499b1732k94485B20205L25477a12437A5524Q2677i8411k4407B21499g2644C05313
11487A5666O0438L30128e0039C43919e6130A69413b7979A06481J24365J6525D5699
11475C8469R2505J98817j33836a10383n4856p4650B16737r1059K19928D0441L23890
11464C64331A55121N6871p0742E0968J31989P0822b4342E2448J40041Q0270D7339
11452A11307K20319A56154Q8631J33630A88986p7059L25822A50535F9234L03079
11442C72313a19117A86375C2221K99020G0725P2591J29980b6406A81902D9796
$$ y = [-354537, 190918, 55588, 171704, -201654, 130238, 182248, 94342, -129215, 62919, 106114, -88681, -154075, 384766, 155658, 177142, 11599, -117594, -475409, 297426, 45596, -21732, -316217, 220205, 545682, -112437, 15524, 98201, -98411, -122818, 221499, -72644, 305313, 15666, 76104, 406232, -50039, 343919, -56130, 169413, -27979, 106481, 230846, 247371, 45699, 38469, 130974, 329791, 195955, -110383, -165239, -239889, 216737, 125678, 345606, 40441, 364331, 155121, 211992, 141250, 50968, 182957, 253779, -24342, 52448, 192489, 272759, 47339, 111307, 331626, 156154, 244785, 378415, 188986, 111927, 437749, 150535, 69234, 372313, -119117, 186375, 32221, 331241, 70725, 143316, 273296, -26406, 181902, 49796]
11431e9975A21760n5291g3512I0549a55668C1927L4029K29982A1530J57681J8673
11420A87884a9444B47050a32613n3177H3203J71730D5945c09506a13880J3280
11410a00600B27453a92313E6423J4035a23636j5484a3036m9730H2920J7926J22563
11399B23409h0429l97133h474D026f4120I4678g2834I3654k0635N4700m9904a58043
11386C3423b53751C03019c2510k57616d9998E6090P7372a13644M7468j21825C95263
11374g469k18642B27682a55735n5407c9198A9543i9676M8894K0064A8988K73639
11363B92627I6656c63009J74674e3659k04638F018k447L0383J78877b57326l2890
11352b90216a13108B09367k1389c64443A91722b5590A29090e04380b37486G4736
$$ y = [-59975, 121760, 66469, -73512, 90549, -155668, 31927, 65956, 295938, 11530, 169211, 187884, -19444, 247050, -132613, -185790, 83203, 254933, 45945, -309506, -113880, -100600, 227453, -192313, 56423, 70458, -123636, -139120, -13036, -62766, 82920, 100846, 223409, -80429, -477562, -8474, 4026, -64120, 94678, -72834, 93654, 73019, 127719, 77815, -158043, 33423, -253751, 303019, -32510, -290126, -49998, 56090, 133462, -113644, -66176, -188001, 395263, -7469, -226111, 227682, -155735, -211142, -39198, 19543, -99676, -50782, -30718, 18988, 292627, 96656, -363009, -188335, -53659, -258297, 6018, 3571, 33954, 212831, -257326, -290216, -113108, 209367, 187978, -364443, 191722, -25590, 129090, -504380, -237486, 74736]
11341b66319B27641a28878G4333e7209F0169b58701E8087b26557g3014c588j78735
11330a82323k7962B7804kc85544A05660c92238G4723e0898l2577G8059b2745F9032
11317E4180a97737A25249c87288a71614h1040r3876F0591a62413j87128i6252
11306c42290a66050C418M68913a44343B87505i3046C13984C5112c8642C0140g4919
11294c16747A71775a49941e0054j46837Q6554K0794A61717A6880O2754A5299J08059
11283A23358a35247M2477F2283b19850N072E7637J32483L2104J5634e18510d4643
11271b49688b5998B2750i8318A04501d7050n9843e0686A45897a64102j8292j64502
11260c46896f0816k536B07248O8472g9871q1540A83293A1581b21168C7216J80989
$$ y = [-266319, 227641, -128878, 74333, -57209, 60169, -258701, 58087, -226557, -73014, -3588, -182323, -210285, 27804, 27802, -385544, 105660, -392238, 74723, -50898, -83475, 78059, -22745, 69032, 54180, -197737, 125249, -387288, -171614, -81040, -174916, 60591, -162413, -349541, -96252, -342290, -166050, 3418, 472331, -144343, 287505, -93046, 313984, 35112, -38642, 30140, -74919, -316747, 171775, -149941, -50054, -196891, -110337, -89543, 161717, 16880, 79634, 15299, 123358, -135247, -92770, 62283, -219850, -214778, 57637, 190120, 222224, 237858, -518510, -44643, -249688, -25998, 22750, -98318, 104501, -47050, -106893, -50686, 145897, -164102, -182394, -346896, -60816, -63352, 207248, 275720, -79871, -161411, 183293, 11581, -221168, 37216, 218205]
11249B18205c1504A09331f3308I6195b04164k3816L9436l2552A40159c0216B0820
11237A29140k0384O1606b55661J3530H0353b24337f2690j29280B12709a51217
11226B12320b00098L8110n002Q0943A77431K04187i3194m3028B7371b293j80938
11215a83231O1485B54387E5640d4377G9885a49967o9458N7529I228b54399B94708
11203H7724f2518A60467D5313a9484I7137l5581B281a18205A25773D7325d3505
11191f9570b1317j82980b7528j13901a2465j77943e743j50562B38863g4526A48490
11179A32287A0251J12124R9616a79298B01786a6289j62428Q270o7519B25406b18853
11167b00770A42873a98712g2132B97093G7544b67881C4870d8083j13056J1126
$$ y = [218205, -31504, 109331, -63308, 96195, -204164, -227980, -188544, -221096, 140159, -30216, 20820, 129140, 108756, 170362, -255661, -242131, 80353, -224337, -62690, -191970, 212709, -151217, 212320, -200098, -161988, -166990, -86047, 177431, 381618, -93194, -136222, 27371, -2293, -183231, -121746, 254387, 55640, -44377, 79885, -149967, -219425, -161896, 9228, -254399, 294708, 87724, -62518, 160467, 45313, -19484, 97137, 61556, 2281, -118205, 125773, 47325, -43505, -69570, -21317, -204297, -27528, -141429, -12465, -190408, -5743, -156305, 238863, -74526, 148490, 132287, 10251, 122375, 221991, -179298, 201786, -16289, -178717, -170447, -237966, 225406, -218853, -200770, 142873, -198712, -72132, 297093, 77544, -267881, 34870, -48083, -161139, -150013]
11157a50013L4086j80835B517a55432q5468A9047O8290J990a22891L6388l1350
11146a17853L4505l0293A02384J60418b9559o5307A49873g4733d814l05599H8663
11134H8157a97632F1178E978a65995b9377q6475k78518N8886C9699b61185J23683
11123a37502e1287j08505L4206F9060c9467j64949H0136i3235B9327K15084J6305
11112B60716b09885N5871C79K53539f1550B1826a46717e8950A17676b83970B2359
11100a24482B52417b3741m2094l8253M3111m0j28743h1813I297b14449A67292
11088B92791b39524A89227a4625j03570A81885P094B3168P0412a87017d1118A66119
11076B01384m6271l8443k7862R8467L14138h2726B4954R9718D7445K44739c10524
$$ y = [-150013, -115927, -296762, 2517, -155432, -240900, 19047, 87337, 89327, -122891, -86503, -117853, -83348, -113641, 102384, 262802, -29559, -94866, 149873, -74733, -4814, -310413, 88663, 88157, -197632, 61178, 5978, -165995, -29377, -115852, -394370, -335484, 39699, -261185, -137502, -51287, -159792, -125586, 69060, -39467, -204416, 80136, -93235, 29327, 244411, 260716, -209885, -154014, 379, 253918, -61550, 21826, -146717, -58950, 117676, -283970, 22359, -124482, 252417, -23741, -65835, -104088, -60977, -61017, -189760, -81813, 9297, -214449, 167292, 292791, -239524, 189227, -14625, -118195, 181885, 188979, 23168, 93580, -187017, -41118, 166119, 201384, 155113, 116670, 88808, 187275, 501413, -82726, 24954, 124672, 47445, 292184, -310524]
11064B79417A28912J60109J40187C3170K24849D7443J53510g3042C15851J7055
11054C32906h9790C94187l1961j33799J05387N405J12103o3746J72658J42685
11044G02919k86420M01704A86047K40527K5007K98632j82801j26491M50169B87438
11033I32194C50856K24269K75171k6199n0519L215k95464P7921J92512j7492o3326
11022F70944L34206J094m30647L97586j60815J89456j89932l3020p1562j5037
11012F92273P6537L36959l35416l35920K00682J61142M759j26800j28677j49412
11002C96127M50004k31212K8915j99549q3610O5346L00414r8436j56789L02605
10992G73815j15480J92689D11840O7210O208J1346L13134j88067K14200K26611
$$ y = [279417, 128912, 289021, 429208, 33170, 258019, 47443, 200953, -73042, 315851, 332906, -89790, 394187, 362226, 228427, 333814, 339219, 451322, 387576, 560234, 702919, 416499, 818203, 186047, 426574, 451581, 750213, 567412, 440921, 891090, 287438, 932194, 350856, 575125, 850296, 824097, 773578, 776793, 481329, 559250, 751762, 734270, 670944, 1005150, 1006244, 575597, 973183, 812368, 1001824, 811892, 778872, 707310, 692273, 768810, 1105769, 770353, 434433, 635115, 796257, 801016, 674216, 545539, 396127, 846131, 614919, 643834, 444285, 360675, 426021, 726435, 627999, 471210, 773815, 658335, 851024, 411840, 479050, 485258, 496604, 809738, 621671, 835871, 1062482]
10982A062482k73374p1660C10043L91808O0349l1132j70997o8170L90302l4697
10972H47506l79716M90009k65008l1374K39948o3410P2000K40145k25665q897
10962I15538K09266J70188j38384J86361l0085L97929K12615L73537k19825J57092
10952B234232K91842J61295j04657q4920k52329k38838m48741M27412o60798L76058
10942A700556l42845r6330L34718m15630K81407m8304k43342J18805M95664p90777
10932I93922K21637E87198K98761l51663j59974M1291M6680j00697a60428A30402
10921G7340f3514k11188B10016b348A00304k7501K9022K22953M5845A74952o2884
10910A12068K24452b6382B65283C7051c45091I5869e30903a38741E10972A51229
$$ y = [1062482, 789108, 717448, 310043, 701851, 762200, 731068, 560071, 491901, 882203, 847506, 467790, 957799, 692791, 661417, 901365, 837955, 909955, 1150100, 924435, 915538, 1124804, 1294992, 1156608, 1342969, 1312884, 1710813, 1923428, 2296965, 2077140, 2234232, 2526074, 2687369, 2582712, 2497792, 2245463, 2006625, 1557884, 1985296, 1324498, 1700556, 1357711, 1261381, 1596099, 1180469, 1461876, 1413572, 1170230, 1289035, 1784699, 993922, 1215559, 587198, 885959, 534296, 374322, 415613, 462293, 361596, -160428, 130402, 77340, -63514, -274702, 210016, -2348, 100304, 72803, 101825, 324778, 370623, 174952, 112068, 336520, -26382, 265283, 37051, -345091, 95869, -530903, -138741, 510972, 151229]
10899A84355b68816B369R5662a6555p4378k73354l7691d2676k31476A85299G4787
10887D1711c73960j1543a32003k4783o2625a00946L7059A97467b49148A87343
10876b07034n844B9524H433f2883r237J6228G917a48436M8228j08275d2644j17079
10864a59723F1894a42827d438r9386J6989L0555J0482F1230h0259F5605A0439
10852c2628j31296e2823G4468h6263B78442a16026Q260F9307a24242C38815c23588
10840B958L4198g1281H8790a98257b1088A10127J03166g7275C4231a11735A35699
10828a46890D3953J46102a30563k07400d3636b1639A53098a52118D9631c19804
10817A3346a67962N1350C4084e16884e5233l07093g2773H9950c3708k0082F3629
$$ y = [184355, -268816, 2369, 98031, -16555, -90933, -364287, -401978, -42676, -274152, 185299, 74787, 41711, -373960, -385503, -132003, -156786, -219411, -100946, -63887, 197467, -249148, 187343, -207034, -212878, 29524, 8433, -62883, -72120, -55892, 7917, -148436, -100208, -208483, -42644, -159723, 61894, -142827, -4438, -103824, -86835, -56280, -45798, 61230, -80259, 65605, 10439, -32628, -163924, -52823, 74468, -86263, 278442, -116026, -107766, 69307, -124242, 338815, -323588, 2958, 37156, -71281, 88790, -198257, -21088, 110127, 213293, -77275, 34231, -111735, 135699, -146890, 43953, 190055, -130563, -337963, -43636, -21639, 153098, -152118, 49631, -319804, 13346, -167962, -116612, 34084, -516884, -55233, -362326, -72773, 89950, -33708, -53790, 63629]
10805A3826a48779a5001a749C84644G3413e7754J6793J2226j96487b4786q3413
10794a08199m5905h737j30592c1679j81048A6470e2863B77642F8576c16193A00970
10782g2237A0042b17162P1620A57330b86771N1767L255D6844c5662A79764p747
10771A72017a70217A2420R450J14693c82115g8924j41541G6296h8260d1038r7567
10760a38605k91889I8443a16338o6966A88746E0031a9183q6531M8270j83075B49183
10748c251A20048a28185o3107E53149A82557a52858E9042J56036d3529k39500
10738b83029g5028A25748A3802g9189b2148n1653l7634p8370b5644A49883a5228
10726E8186p703a38256e2412A8698a20805D1543P5138b06381Q3862I930R2718
$$ y = [13826, -148779, -15001, -1749, 384644, 73413, -57754, -40961, -28735, -225222, -24786, -108199, -154104, -8737, -139329, -31679, -212727, 16470, -52863, 277642, 68576, -316193, 100970, -72237, 10042, -217162, -145542, 157330, -286771, -235004, -231749, 46844, -35662, 179764, 172017, -170217, 12420, 21870, 136563, -382115, -78924, -220465, 76296, -88260, -41038, -138605, -430494, 98443, -116338, -183304, 188746, 50031, -19183, -105714, -57444, -240519, 249183, -3251, 120048, -128185, -191292, 553149, 182557, -152858, 59042, 215078, -43529, -283029, -75028, 125748, 13802, -79189, -22148, -73801, -111435, -189805, -25644, 149883, -15228, 58186, 50483, -138256, -52412, 18698, -120805, 41543, 116681, -206381, -122519, 9930, 102648]
10715A02648a13532j51729G3997L9248a1477k30998B19903e55046A30785a74062
10704e5237j73828a10643C8924O8539C2979a33077C0785K1244a07526L1081k8531
10693a04976I7286a05628M9483j02622d989A54251C9697d00706H9343a34110j40695
10682b74805F888N3678J37778a18778N6605l8497A75284F2411b04755F369b01598
10670d13919a82713B50125p794a92510m4393g3934K4886K2357A90043h1257A03977
10658A86602A8049b74600A5457Q673a56646l12409K02996J14564J877j82784A51840
10646a13019j86261J13964E4985b31754Q4717c6279m33016D9246a38564c3481
10635b12714A31664D1133c16406o5172g5214B4932c04176B96481A18678e3793
$$ y = [102648, -113532, -265261, 73997, 113245, -11477, -242475, 219903, -555046, 130785, -174062, -55237, -229065, -110643, 38924, 107463, 32979, -133077, 30785, 52029, -107526, -76445, -104976, 97286, -105628, -56145, -158767, -4989, 154251, 39697, -400706, 89343, -134110, -274805, 6888, 60566, 198344, -118778, -62173, -100670, 175284, 62411, -204755, 6369, -201598, -413919, -182713, 250125, 242331, -192510, -236903, -73934, -49048, -26691, 190043, -81257, 103977, 186602, 18049, -274600, 15457, 24130, -156646, -469055, -266059, -151495, -149618, -332402, 151840, -113019, -299280, -185316, 54985, -231754, -147037, -36279, -469295, 49246, -138564, -33481, -212714, 131664, 41133, -316406, -381578, -75214, 24932, -304176, 296481, 118678, -53793]
10624a81006n894A43995e0429D4380h8809A23797A6496K1493d37519B9122M7240
10613G6362f1711B99707a66483P2511r6377N1340l81308A84098c24105G0236b4585
10601a72659A67932f0625j90714c1552e437A29458C7964a66028L6044o5875C1229
10589c42821A12348l9125b14680r4334J41145l37614K01819A5124N4040j419J7884
10578H5629b94402d0481k3549B47024A8482b65350g7102E67699e2869l78178c6385
10566A48910G786J51168b04518I0030a73685C54880I7129c07599B99714A19451
10555a95979n2123a0679A37347b12319f5740M623b051A06174c4438A46044b05837
10543b11493I0228J05047A0698c0416j0946o2518A28723a96797B22608f1892B74535
$$ y = [-181006, -186900, 143995, -50429, 44380, -88809, 123797, 16496, 37989, -437519, 29122, 76362, -61711, 299707, -166483, -93972, -190349, -139009, -520317, 184098, -324105, 70236, -24585, -172659, 167932, -60625, -251339, -31552, -5437, 129458, 37964, -166028, -129984, -195859, 31229, -342821, 112348, 73223, -214680, -309014, -167869, -505483, -303664, 15124, 69164, 67745, 85629, -294402, -40481, -64030, 247024, 18482, -265350, -77102, 567699, -52869, -431047, -36385, 148910, 7786, 158954, -204518, 90030, -173685, 354880, 97129, -307599, 299714, 119451, -195979, -248102, -10679, 137347, -212319, -65740, -61117, -2051, 106174, -34438, 146044, -205837, -211493, 90228, 195275, 10698, -30416, -41362, -103880, 128723, -196797, 222608, -61892, 274535]
10531B57641a0643E4241f1277B0255J91260e5536l3503r8162h450k18547J05373
10520a21624L3858l1435k07344E6132d4137m82330a48133g761A30049a68787A78145
10508B43364I3234J53237b5608j93286N5175C832b32045H6686b73042J28976J7519
10497a26547A31222b7931k39576B05836m2032a10231A26456B542c21694o5067
10487c86761B03261N6863A22328K9777e6303G1371a8853E8617g182k96986D8421
10475H8213c68685A45262b30332O9938A36239e9928k05195A44156K5001a30580
10464a2748r4227A75997a71162L8519B98178j7697j08131L10758k09479C3271
10453B1662N58770A95628e0821k00282R2637g1521k17134d2333G3505J3682A9821
$$ y = [257641, -10643, 54241, -61277, 20255, 211515, -55536, -89039, -187201, -8450, -226997, -121624, -87766, -119201, -326545, 56132, -44137, -526467, -148133, -7761, 130049, -168787, 178145, 243364, 93234, 246471, -25608, -218894, -163719, 3832, -232045, 86686, -273042, -144066, -126547, 131222, -27931, -267507, 205836, 163804, -110231, 126456, 2542, -321694, -386761, 203261, 260124, 122328, 152105, -56303, 71371, -18853, 58617, -7182, -304168, 48421, 88213, -368685, 145262, -230332, -160394, 136239, -59928, -265123, 144156, 169157, -130580, -12748, -106975, 175997, -171162, -132643, 298178, 280481, 172350, 483108, 273629, 33271, 21662, 580432, 195628, -50821, -251103, -158466, -71521, -288655, -42333, 73505, 87187, 19821]
10441f1601B51398c71655H6853C8806L7073b34029A26622J3225k4795b6915r8891
10430a25806L2446A64896D1043a44694G6830c12625A40458a09517G2448J59533
10420B31981f1528j79284C76645B0932J64902a13845e5442j31768P9738A47978
10409a00698p5909c3165H500K1497K5630N406L19580a5187q7678c3103l07336
10398c40439R3428A54016b47833j14A2630Q3291O8544b16828F8870j5432d6127
10386I6612b86359I9444J16754a25974e8743k26126j29917a24040l6388E9332
10375a79398H3269c38I6841J06814L30864A49492A3363a02508A50097c723j4939
10364a8662C45817c6559C6328K58381b6874D3969L69950j15887r124A28744L0329
$$ y = [-61601, 251398, -371655, 86853, 38806, 75879, -234029, 126622, 139847, 115052, -26915, -125806, -93360, 164896, 41043, -144694, 76830, -312625, 140458, -109517, 72448, 231981, -61528, -240812, 376645, 20932, 185834, -113845, -55442, -187210, -107472, 147978, -100698, -176607, -33165, 8500, 29997, 55627, 61033, 380613, -15187, -102865, -33103, -340439, -247011, 154016, -247833, -247947, 12630, 95921, 164465, -216828, 68870, 53438, -46127, 96612, -286359, 99444, 216198, -125974, -58743, -284869, -414786, -124040, -160428, 59332, -179398, 83269, -338, 96841, 203655, 534519, 149492, 13363, -102508, 150097, -3723, -18662, 345817, -36559, 36328, 294709, -26874, 43969, 413919, 298032, 288908, 128744, 159073]
10353A59073j7300o7475L16254M7995A90229J68677K88143k92865A28108J15416
10343B43524J31236j24446b0740C82968a344G1043k9634L19602j65925J2845j1660
10332A96271K62303L18644k09973j11220r4428j69988G7374J15243n9722Q4089
10322B16984I9756M8335K16486A32065J38912I7879Q8940q7252A3257a09847C233
10310A74618n8261J61942b23388E1232J5501M82358k55836B3129b3376m538A28358
10298A53767b21537C08665c1970n9517A18844a15699A16318N25e4966A63199a59417
10286a19977H4070e4763B2044e2512I4422J71022O1246a45377C35122q3357g184
10274b26573E6041L8033a95146O4691B57011d10913B2047b08399M7420A73377
$$ y = [159073, 141773, 74298, 390552, 438547, 190229, 358906, 647049, 354184, 128108, 243524, 374760, 250314, -20740, 382968, -1344, 71043, 41409, 361011, 195086, 207931, 196271, 458574, 777218, 567245, 456025, 361597, 191609, 77374, 192617, 132895, 216984, 99756, 148091, 364577, 132065, 270977, 97879, 186819, 99567, 13257, -109847, 3233, 174618, 116357, 278299, -223388, 51232, 66733, 549091, 293255, 23129, -23376, -27914, 128358, 153767, -221537, 308665, -31970, -91487, 118844, -115699, 116318, 116843, -54966, 163199, -159417, -119977, 84070, -54763, 22044, -52512, 94422, 265444, 326690, -145377, 335122, 251765, -7184, -226573, 56041, 94074, -195146, -130455, 257011, -410913, 22047, -208399, -160979, 173377]
10263A10402a96468b7519k80999C40908e43581A14410c28445c4214A05283K68492
10253C73775g1876J9064j7584k71791A86907c60034A42136J7023b90080a1267
10242c69744G3252h8252E9490J12610P7186J56993i438C23022H8609L00131A44788
10230A16233c4483l06413a6941H0262N4542a52464D4931a99302I9154A0912a7457
10218b74365k21490b00003C1350a73498B64933j13142b56260J24001I0174b416
10207D6667b12568P4374j08387i7228F5707a48374H0854K56723a10453j90554
10197c01007a07506E8840a09437p3016k83858a00117k03234j28846A99865b11914
10186A675b92169a12199p2516B14604b51235A3145c6186D2092b31148e6259k7801
$$ y = [110402, -196468, -27519, -308518, 340908, -543581, 114410, -328445, -34214, 105283, 373775, -71876, -52812, -70396, -342187, 186907, -360034, 142136, 159159, -290080, -11267, -369744, 73252, -88252, 59490, 172100, 249286, 406279, -9438, 323022, 88609, 388740, 144788, 116233, -34483, -340896, -16941, 80262, 134804, -152464, 44931, -199302, 99154, 10912, -17457, -274365, -495855, -200003, 31350, -173498, 264933, 151791, -256260, -132259, 90174, -2416, 46667, -212568, -138194, -246581, -97228, 65707, -148374, 80854, 337577, -110453, -301007, -107506, 58840, -109437, -182453, -466311, -100117, -303351, -432197, 199865, -211914, 1675, -292169, -112199, -184715, 214604, -251235, 13145, -36186, 42092, -231148, -56259, -84060]
10175h4060k98055I7162j9104a21063l43197a2565j20121p3331j27629A2140a91856
10163B21413a64201k12811G487a22619j17390H7235L32827f9414I3024b7169B20220
10151B8846J38713f2533G6722J29054d2755l713j68332E6372f323f72B3182J13993
10139A37175C6978b04921b3822r2480N3916j672j85294D53023a51682A4298h123
10127A3775j204J71567a84625A2665J7728c1162j36236B7069i641p2780M933K1858
10115e5630I6899I71J45130c89402p9029G6160d5577k63564M4134N4357O2044
10104a48606M3717L9015j67819J06725B667R5075L8197a22349J575M7518j67948
10093b41204K0603G7690d6859j21537B797a30308I0505D4187i1747m8623e7172
$$ y = [-84060, -382115, 97162, 78058, -121063, -464260, -12565, -132686, -206017, -333646, 12140, -191856, 221413, -164201, -377012, 7487, -122619, -240009, 87235, 420062, -69414, 93024, -27169, 220220, 28846, 167559, -62533, 76722, 205776, -42755, -46468, -214800, 56372, -6323, -672, 23182, 137175, 36978, -204921, -23822, -116302, -62386, -64058, -249352, 453023, -151682, 14298, -8123, 13775, 12571, 184138, -184625, 12665, 30393, -31162, -167398, 27069, -9641, -82421, -77488, -55630, 96899, 971, 146101, -389402, -468431, 76160, -45577, -309141, -265007, -210650, -148606, -104889, -65874, -233693, -126968, 2667, 97742, 135939, -122349, -120774, -73256, -241204, -220601, 77690, -46859, -168396, 2797, -130308, 90505, 44187, -91747, -140370, -57172]
10081E854J4914a56173F5633a17028c8718E7342i7385l14174a32621J776q7918
10070b18763A35014K30637b2974k28878a0415o1825B85947o1221e3011j89725
10060b42736P3226K2549d0258D7026Q7659J0393a65425F5318i5270c4351A65847
10048b1117B48302D6026c14591R3607J6417f6303D6875l72A5291d7249j24777
10037a72026k36o6303c9156n699k88787d9807B83411d34110a61540j416k00641
10026c63597J25994A53447h4876I7091a40040h187l45956b9686o9638j6632k32836
10015c48792J56932N4848A82816C6004J05586b75636O0525h5756q1761b1482k88554
10004c10036o0908k8414C3321J06898D5902b9518E6639l058e7642B67746b68322
$$ y = [5854, 20768, -156173, 65633, -117028, -38718, 57342, -97385, -411559, -132621, -130845, -218763, 135014, 365651, -22974, -251852, -10415, -72240, 285947, 224726, -53011, -242736, -169510, -146961, -40258, 47026, 134685, 145078, -165425, 65318, -95270, -34351, 165847, -21117, 248302, 46026, -314591, -220984, -204567, -66303, 46875, 46503, 15291, -47249, -172026, -172262, -238565, -39156, -44855, -333642, -49807, 283411, -434110, -161540, -162956, -363597, -237603, 153447, -84876, 97091, -140040, -8187, -354143, -29686, -99324, -115956, -348792, -191860, -137012, 182816, 36004, 141590, -275636, -215111, -85756, -167517, -21482, -310036, -370944, -399358, 33321, 140219, 45902, -29518, 56639, 53581, -57642, 267746, -268322]
9992i1184A02270c72614B6013K6078a82159N038j02887B00499N7985j06643a23104
9980a3928j50011B91302c26626h5677A99778o446c92051i8186a3001p7071k41450
9969c31522a19986n082l8953j9845N8930C57092i9502d7889j74080I6378c31818
9957a34926b8613A98803D4353M1863d31022h8336p0095D7163O01N609K08121a93193
9944b53661B7180a43547q9374j4599I44a82152N8990k2134E1463h0345B82510
9932b35861M1208k11766C5898g7344l58852J33295G2415a09890H7146h9871B3831
9920g6562k78896A93061P2530a79731j38436J17945k6344f6208E228a76027G6252
9908d4437F3791b24828B6498g7492k094a5607C2457O3654a73913B03285c78513
$$ y = [-91184, 102270, -372614, 26013, 52091, -182159, -177121, -280008, 200499, 258484, 151841, -123104, -13928, -163939, 291302, -326626, -85677, 199778, 193332, -392051, -98186, -13001, -90072, -331522, -119986, -125068, -164021, -183866, -124936, 357092, -99502, -47889, -221969, 96378, -331818, -134926, -28613, 198803, 44353, 86216, -431022, -88336, -158431, 47163, 47764, 53373, 261494, -193193, -253661, 27180, -143547, -232921, -247520, 944, -182152, -123162, -145296, 51463, -80345, 282510, -235861, -194653, -406419, 35898, -77344, -436196, -302901, 72415, -109890, 87146, -89871, 23831, -76562, -355458, 193061, 265591, -179731, -318167, -200222, -226566, -66208, 5228, -176027, 76252, -44437, 63791, -224828, 26498, -77492, -79586, -15607, 32457, 96111, -173913, 203285, -378513]
9896a2504B984J44087D931c71275l7662a94463j83440J30440C07479a9157G3458
9884a08437K163C5921c75756e0727B19945a83906h2986j62793B549g11j40689
9873a41400k61877a88882C76878c8281D5505c91018a18193j35740j47846J29221
9863b72558A45566d77050g0267B9052d9128n7867j9239H4061J91153A5177N1434
9852F6611k9654a57798e8213a5960C42666A25555a97379E0503Q7350o8548c08746
9840h8151k57868e9266l02187a2480n21013C3799a94844k20141h1924A35401i51
9828a72795Q529j56074I3277h0314B0185b4880f768j87899d0469j06810k2707
9817a69986f2290B44149a34344p1563k4731C29308b61498l825I4503b54230E6886
$$ y = [-12504, 2984, 147071, 4931, -371275, -408937, -194463, -377903, -247463, 307479, -19157, 73458, -108437, -106274, 35921, -375756, -50727, 219945, -183906, -82986, -245779, 2549, -711, -141400, -403277, -188882, 376878, -38281, 45505, -391018, -118193, -253933, -401779, -272558, 145566, -477050, -70267, 29052, -49128, -106995, -126234, 84061, 275214, 15177, 66611, 36957, -157798, -58213, -15960, 342666, 125555, -197379, 50503, 137853, 69305, -308746, -88151, -346019, -59266, -361453, -12480, -533493, 33799, -194844, -414985, -81924, 135401, -951, -172795, -164266, -320340, 93277, -80314, 20185, -24880, -6768, -194667, -40469, -147279, -169986, -62290, 244149, -134344, -205907, -230638, 329308, -261498, -265323, 94503, -254230, 56886]
9805D0822c4425C7969c84084d6237m9679L0848m6171N4681K0856k5362A83529
9793c0320j08777k09377f1273m6703c1608F5607a51684O1144A8621J69997a31858
9781B77827a6571j57532j5919i2018A37812C0462r606c0992o7651k02955C15036
9769g9712B6483c68526c1345F3091b96638a29694C5354P4446n136a33019a6724
9757b26048A59038b68417m3432E8002f4405I0133A373d8568l0042D1737N6782
9746I8519b97859f6862o9807G4358l3900g4026m1809j77404A78516q7938R0516
9735A81094a40021j4416A73803a2145k25672c2658l16229e2273j34062h1845a3723
9723A14964a51100r3359A76215h2991B04062b11056A21952i2641J8893p0073p878
$$ y = [40822, -34425, 37969, -384084, -46237, -95916, -65068, -111239, -56558, -35702, -61064, 183529, -30320, -139097, -348474, -61273, -107976, -31608, 65607, -151684, -90540, 18621, 188618, -131858, 277827, -16571, -174103, -190022, -92018, 137812, 30462, 20856, -30992, -98643, -301598, 315036, -79712, 26483, -368526, -31345, 63091, -296638, -129694, 35354, 109800, 104664, -133019, -16724, -226048, 159038, -268417, -311849, 58002, -64405, 90133, 1373, -48568, -78610, 41737, 98519, -297859, -66862, -136669, 74358, 40458, -74026, -115835, -293239, 178516, 90578, 181094, -140021, -154437, 173803, -12145, -237817, -32658, -348887, -52273, -186335, -81845, -13723, 114964, -151100, -244459, 176215, -82991, 204062, -211056, 121952, -92641, -73748, -143821, -151699]
9712a51699l30949b15169B88261C8797b71912e4800k46856O3661h7897j33828
9702b21725H0922G742g403j71247o1161A37939a72548A72135b00875R5891P291
9691i7693c186j89957M9522A64299a58336d1715l6061k7055M0882B62824i0721
9679a96296k38589a3132k0437k04936f5118A59982h9198k94563d8555a2560j27908
9668a40468j8290A90582g3970n9628d2285m61252c2159A17724a00405b8901k5180
9657e4081E7428a28553O1977k2437c5881A22733a81174A22262a1571l83954H1860
9645a37574J9171C39041k9711O1568f8040I7971a98136R3390o7415R95j33391
9634c04557C4821a48395A07254a96270D4674b96477a16773H6043a55328B11396
$$ y = [-151699, -482648, -215169, 288261, 38797, -271912, -54800, -301656, -237995, -87897, -221725, 80922, 7742, -7403, -178650, -239811, 137939, -172548, 172135, -200875, -104984, -97693, -3186, -193143, -143621, 164299, -158336, -41715, -77776, -104831, -63949, 262824, -90721, -196296, -434885, -13132, -33569, -238505, -65118, 159982, -89198, -383761, -48555, -12560, -140468, -158758, 190582, -73970, -133598, -42285, -503537, -32159, 117724, -100405, -28901, -54081, 57428, -128553, -66576, -89013, -35881, 122733, -181174, 122262, -11571, -395525, 81860, -137574, -118403, 339041, 309330, 370898, -68040, 97971, -198136, -104746, -172161, -171166, -304557, 34821, -148395, 107254, -196270, 44674, -296477, -116773, 86043, -155328, 211396]
9623D8415c95722N5533C6001J55565b09101P3294L577c6709p6037D1844b83423
9611c98952a26855j02166A35824g0006A13788B0889a88851M3164q9492e0474J9157
9600c1317r4662B23986A0938b91008i5901D6743h341j10820G2298a34785H67J28410
9588A29277N0267A9236a53479E0846a52897O6595k60034J28944A68398b28704
9577I837K42333b14295C45000A36100K08827a14066I250i7771k10882L6361P0100
9566b02192f3504A44096g5946k05830d0108B51128a04382A98341d4666a0770j03713
9555a14483L1146J6093a1639p2262D7556O956L3007a34055A6179d08635A20766
9543A55490J64526a45692F9493a30879F0398J46022l4407d99244d6580k05977
$$ y = [48415, -395722, -340189, 36001, 191566, -209101, -135807, -132230, -36709, -112746, 41844, -283423, -398952, -126855, -229021, 135824, -70006, 113788, 20889, -188851, -145687, -235179, -50474, -31317, -125979, 223986, 10938, -291008, -95901, 46743, -8341, -119161, 72298, -134785, 867, 129277, 179544, 19236, -153479, 50846, -152897, -86302, -346336, -217392, 168398, -228704, 9837, 252170, -214295, 345000, 136100, 344927, -114066, 9250, -97771, -308653, -272292, -202192, -63504, 144096, -75946, -281776, -40108, 251128, -104382, 198341, -44666, -10770, -114483, -83337, -67244, -11639, -83901, 47556, 54512, 87519, -134055, 16179, -408635, 120766, 155490, 320016, -145692, 69493, -130879, 60398, 206420, 172013, -499244, -46580, -252557]
9533b52557a12574l8204f4201B86734D2111a8914n5367K7039k05649g5795l4123
9522a09918D6889j8657J13518e45074A86795D1968a7312j81002d8285j54662M6237
9511a56710A93964B8798J03474B9567P3695I042a36054A2279K08922a33400j60441
9500b93841P4434B04208b86906d3914B1837O5910e26542K02610B48546a92068
9489a47607I2876L5256Q220o1712O6716B1820J82118d84302G6592b8423m48646
9478d77069f6911j15194B07080b87421J24066c5326j45804k98842E339b00315
9467b0726B61703A29778C9665h1521A46761E4706b96839j53566A82090b65419
9456c9768l61195J07548Q8389b0070n4959K3787j0659J401H215b0510B51102a25743
$$ y = [-252557, -112574, -150778, -64201, 286734, 42111, -18914, -74281, -47242, -252891, -75795, -109918, 46889, 28232, 141750, -545074, 186795, 41968, -17312, -198314, -48285, -202947, -156710, 193964, 28798, 132272, 29567, 103262, 9042, -136054, 12279, 221201, -133400, -293841, -219407, 204208, -286906, -43914, 21837, 87747, -526542, -323932, 248546, -192068, -147607, 92876, 128132, 136352, 74640, 141356, 21820, 203938, -484302, 76592, -28423, -477069, -66911, -182105, 207080, -287421, -163355, -35326, -181130, -479972, 5339, -200315, -20726, 261703, 129778, 39665, -81521, 146761, 54706, -296839, -450405, 182090, -265419, -39768, -400963, -293415, -205026, -20070, -75029, -51242, -61901, -60500, 8215, -20510, 251102, -125743]
9443a08412A15427J02863b09677A42187c33526a07363A81827a92819f699j57277
9433a63976N2740r8397g5562k9421B35391a11335l1331c762C9247d30011a09663
9421b01747j26003h5830p6134d5269k39993A08679a33930k60412B04796F1326
9410B8709c00040d1190p6606j48808A91964h4609J4581A07906a38275k28257B5813
9398b9188o28554A15403h9180A16385N03i376k21795B00465k2123F8180L05057
9387C73237A46688a51818l6983j9045j73313b7016I969a26858M2759b2290j08503
9376a30793E4850B5209b49356a21428A04757a36977a4835j2459A4567a09941A48792
9364A33282b03741C37223D3401a11345D592d2533B07539b5884k7998j94656a18422
$$ y = [-108412, 115427, 218290, -209677, 142187, -333526, -107363, 181827, -192819, -6699, -163976, -111236, -209633, -75562, -104983, 235391, -111335, -142666, -3762, 39247, -430011, -109663, -201747, -327750, -85830, -161964, -45269, -285262, 108679, -133930, -394342, 204796, 61326, 28709, -300040, -41190, -117796, -266604, 191964, -84609, -70028, 107906, -138275, -366532, 25813, -29188, -657742, 115403, -89180, 116385, 116888, -9376, -231171, 200465, 178342, 68180, 373237, 146688, -151818, -188801, -207846, -381159, -27016, 9969, -126858, -84099, -22290, -130793, 54850, 25209, -249356, -121428, 104757, -136977, -14835, -27294, 14567, -109941, 148792, 133282, -203741, 337223, 43401, -111345, 4592, -42533, 207539, -25884, -53882, -248538, -118422]
9352b17045C4986a74898E0989g9849p9286f0212j46449Q8999L9726A2510a69494
9340A78438a6867B1353J3894e0681j49443C9647F252K08968C7122a5914B00868
9328A45869n0495a95790E064J08991e555l53248C38049A17166a48335I2521b84753
9316D8427B2218b14589N2891j60120b5199o9293k5652K2714i568j2919A5808c78732
9303b14057n3218e2397P620C32628b4967j54705n7381B87418g237n2512F8377
9291A8689c1410A28061K4344k3912b61800J20857B3628h6712m2896c8579o8705
9280a07284B54502a08651L9463p6729a8237j69188b8578q816G8939c70193A80202
9268d8928r8463q3935j6512H7046L281a90916f5065A48d8583k1169C4082L2845
$$ y = [-217045, 34986, -174898, 50989, -79849, -159135, -60212, -206661, -117662, -77936, 12510, -169494, 178438, -16867, 21353, 35247, -50681, -200124, 39647, 6252, 215220, 37122, -15914, 200868, 145869, 95374, -195790, 5064, 114055, -5555, -358803, 338049, 117166, -148335, 92521, -284753, 48427, 22218, -214589, -161698, -321818, -25199, -94492, -120144, -97430, -9568, -22487, 15808, -378732, -214057, -267275, -52397, -44777, 332628, -24967, -179672, -237053, 287418, -7237, -59749, 68377, 18689, -31410, 128061, 152405, 128493, -261800, -140943, 23628, -86712, -129608, -38579, -107284, 254502, -108651, -69188, -145917, -18237, -187425, -28578, -37394, 78939, -370193, 180202, -48928, -147391, -231326, -247838, 87046, 90327, -190916, -65065, 148, -48583, -69752, 34082, 66927]
9256F6927a16170F61K67283a3642k52868P2195N6625a1899B1553Q3485a68127
9244b17644h6279I1718f8639A13156J29457j03910a20584B34313a7685C3566d24692
9232b20112a01265A41159l5521Q5418c8391j2264G9218b76980D4761K26325H7261
9220a1137k118j76557R808E7972a53967J5297o932P714C15602c31302P5900I9017
9207e4850l5045B4775g3480o396B53047C0375c5255l00280a13420B04062A8723
9195g141l73003F4644P190K29697G8137a62935R13r1040J20656A6495J63186b84794
9182E4745b02064o4565M7247a5525k2029j92645J03263K9705k21979A15459d32618
9170b19154B01092D1819a82709N3905a6253j3679A13966a9471r1417I8893e5870
$$ y = [66927, -116170, 661, 267944, -13642, -266510, -194315, -137690, -11899, 21553, 105038, -168127, -217644, -86279, 91718, -68639, 113156, 242613, 138703, -120584, 234313, -17685, 33566, -424692, -220112, -101265, 141159, 105638, 191056, -38391, -50655, 79218, -276980, 44761, 271086, 87261, -11137, -13255, -189812, -180004, 57972, -153967, -138670, -145602, -137888, 315602, -331302, -255402, 99017, -54850, -89895, 24775, -73480, -79876, 253047, 30375, -35255, -335535, -113420, 204062, 18723, -7141, -380144, 64644, 71834, 301531, 78137, -162935, -162022, -253062, -132406, 16495, 179681, -284794, 54745, -202064, -266629, -219382, -15525, -37554, -230199, -126936, -97231, -319210, 115459, -432618, -219154, 201092, 41819, -182709, -128804, -16253, -29932, 113966, -19471, -110888, 98893, -55870]
9158c76237h5064A93013d62304L2705B664a80215f5893j79761A60275D1461a21037
9146b24109F4121a39443c3134k17571f0562j63841Q8483A30441C9166d68212a34244
9134b84952N9405C05876B2308l516K14563d29808e4396A27080a16899d6754F6550
9122b93061C4286b07572A5984a69361n9957a9250j63948F1800O6264b46026a06300
9110B0007e5906l48993R7856N2431f1875b8924q9671k14925P2627m2907a0202
9098c0888D1264c02999R7235l2446J2416h6343n3065J4305I7634K9523C5913J07095
9086A43008g4253j00366l616N9344C75772a66099F7289f5266p4659k4881J9368
9075a45438d9370j37358B69007c17969F1670G203b77626K0693Q0165C2366f4823
$$ y = [-376237, -85064, 193013, -462304, -429599, 2664, -180215, -65893, -245654, 160275, 41461, -121037, -224109, 64121, -139443, -33134, -250705, -60562, -224403, -135920, 130441, 39166, -468212, -134244, -284952, -225547, 305876, 22308, 18792, 233355, -429808, -54396, 127080, -116899, -46754, 66550, -293061, 34286, -207572, 15984, -169361, -229318, -19250, -183198, 61800, 128064, -246026, -106300, 20007, -55906, -404899, -307043, -254612, -61875, -28924, -118595, -333520, -260893, -303800, -10202, -30888, 41264, -302999, -205764, -238210, -225794, -86343, -139408, -125103, 97634, 127157, 35913, 143008, -74253, -174619, -178235, -118891, 375772, -166099, 67289, -65266, -139925, -164806, -145438, -49370, -186728, 269007, -317969, 61670, 7203, -277626, -256933, -176768, 32366, -64823]
9063C4395d1497D1891G201a5825f453A33564a66227O3066A36834e7732E2470a68194
9050e0572j8787j51246A4056a23660L9848L9207j05582r5497C7054a15947o8415
9039a84362a9220n1630A52786b58181C21097a25551j35687N1054J8053A67560
9028b29568G9154J95794d226C7016r04P1390a47018I9606i2274j30253a01530
9016A41478J0075a4662G6257J5172M7857D919h8742m088l3282F9859F809d98285
9003a7308j57801N0689B3139b25961P6358G198b13216g5330j53661A10962a03721
8991a53991f5776A02432a18834e7277k10428c4648j31564k5663b9724j18601j13839
8980b62164R2779B66515G6968a21794C02185d4307A2629a58059K8812B91892a29293
$$ y = [34395, -41497, 41891, 7201, -15825, -6453, 133564, -166227, -103161, 136834, -57732, 52470, -168194, -50572, -69359, -220605, 14056, -123660, -83812, -44605, -150187, -245684, 37054, -115947, -184362, -19220, -70850, 152786, -258181, 321097, -125551, -261238, -210184, -192131, 167560, -229568, 79154, 274948, -4226, 37016, 36112, 107502, -147018, 99606, -92274, -222527, -101530, 141478, 151553, -14662, 76257, 91429, 139286, 4919, -88742, -92830, -126112, 69859, 6809, -498285, -17308, -175109, -124420, 23139, -225961, -149603, 7198, -213216, -75330, -228991, 110962, -103721, -153991, -65776, 102432, -118834, -57277, -267705, -34648, -166212, -191875, -29724, -148325, -262164, -169385, 266515, 76968, -121794, 302185, -44307, 12629, -158059, -129247, 291892, -129293]
8968a07345j03394P8779q9982P4163P3069b4613j14659E991J12273b69440B34496
8956B39259b0350p513r0861A3898i341A13782D1782K806i9309k6040J9810j88915
8944b94454c0328I8382B0274c9666A89709f3432m03798F8143D676L6159g9796
8932D1851g9177j02196c6732l4059e642j51458P5994A06144C0943b0300B15924
8920E8752a68867B90689a36018j84A532K52908P1804i0052L9269E6210K55883
8909C12093A11317K5845K19395N23012O34677Q12625L104672k067750A643548
8899G38383k26176B39679m7880e8191G5849a25146B6929d09074r398A26516K01896
8888C28412C9201a50661C427M1216K19115F7393a85793P1129A26356c03503A32230
$$ y = [-107345, -210739, -131960, -221942, -147779, -74710, -24613, -139272, 5991, 118264, -269440, 234496, 239259, -20350, -27863, -118724, 13898, -9341, 113782, 41782, 44588, -99309, -125349, -105539, -294454, -30328, 98382, 20274, -39666, 189709, -63432, -467230, 68143, 4676, 40835, -79796, 41851, -79177, -181373, -36732, -70791, -5642, -157100, -81106, 106144, 30943, -20300, 215924, 58752, -168867, 290689, -136018, -136202, 1532, 254440, 326244, -90052, -50783, 56210, 312093, 111317, 137162, 356557, 879569, 1514246, 2326871, 5431543, 3363793, 1643548, 738383, 512207, 239679, 191799, -58191, 75849, -125146, 26929, -409074, -418472, 126516, 328412, 39201, -150661, 3427, 44643, 263758, 67393, -185793, -114664, 126356, -303503, 132230]
8876a02059l14801f6559a3538E7164A3490J33819c14073c8290r1069C6757J46723
8865A83480c0875J0844l28909g9395G4872c10203i9365r257A72304J75443a07361
8853d3491m0867k47678A71204a20025c2092A64007j0077h4232G0627a21775j42066
8842b63841l14157b46473D4485a96473H5004b72105A28728a88871B18362b92800
$$ y = [-102059, -416860, -66559, -13538, 57164, 13490, 147309, -314073, -38290, -129359, 36757, 183480, -30875, -20031, -348940, -79395, 74872, -310203, -99365, -108622, 172304, 347747, -107361, -43491, -84358, -332036, 171204, -120025, -32092, 164007, 153930, -84232, 70627, -121775, -263841, -577998, -246473, 44485, -196473, 85004, -272105, 128728, -188871, 218362, -292800]
$$ [...]
##END NTUPLES=NMR SPECTRUM
##END=
