
##TITLE=AC1083__5836542_VRjT2nScWd
##JCAMPDX= 6.0         $$ Bruker NMR JCAMP-DX V2.0
##DATA TYPE= NMR SPECTRUM
##DATA CLASS= NTUPLES
##ORIGIN= BRUKER
##OWNER= Administrator
$$ 1.72 TOPSPIN		Version 2.1
$$ 2012-04-16 19:09:23.656 -0500  Administrator@TOPSPIN
$$ Compression mode = diff/dup
##.OBSERVE FREQUENCY= 400.13188235
##.OBSERVE NUCLEUS= ^1H
##.ACQUISITION MODE= SIMULTANEOUS (DQD)
##.ACQUISITION SCHEME= undefined
##.AVERAGES= 64
##.DIGITISER RES= 22
##SPECTROMETER/DATA SYSTEM= spect
##.PULSE SEQUENCE= noesygpps1d.comp
##.SOLVENT NAME= COFFEE_meoh
##.SHIFT REFERENCE= INTERNAL, COFFEE_meoh, 1, 14.96857
##AUDIT TRAIL= $$ (NUMBER, WHEN, WHO, WHERE, PROCESS, VERSION, WHAT)
$$ ##TITLE= Audit trail, TOPSPIN		Version 2.1
$$ ##JCAMPDX= 5.01
$$ ##ORIGIN= Bruker BioSpin GmbH
$$ ##OWNER= Administrator
$$ $$ C:\Bruker\TOPSPIN/data/COFFEE/nmr/AC1083__5836542_VRjT2nScWd/22/pdata/1/auditp.txt
$$ ##AUDIT TRAIL=  $$ (NUMBER, WHEN, WHO, WHERE, PROCESS, VERSION, WHAT)
(   1,<2012-04-15 14:16:27.921 -0500>,<Administrator>,<TOPSPIN>,<go>,<TOPSPIN 2.1>,
      <created by zg
	started at 2012-04-15 14:04:56.203 -0500,
	POWCHK enabled, PULCHK disabled,
       configuration hash MD5:
       1A 1E CE 29 27 FD 77 03 67 4E F0 E3 C4 B2 CB 90
       data hash MD5: 64K
       8C E3 8F 31 40 CF 36 07 66 04 77 0D 03 6F 9D 80>)
(   2,<2012-04-15 14:16:30.812 -0500>,<Administrator>,<TOPSPIN>,<proc1d>,<TOPSPIN 2.1>,
      <Start of raw data processing
       efp LB = 0.3 FT_mod = 6 PKNL = 1 PHC0 = 0 PHC1 = 0 SI = 128K 
       data hash MD5: 128K
       AD 5F 07 CD C3 36 24 05 F0 C0 5F A7 CC DF 3C A5>)
(   3,<2012-04-15 14:16:31.984 -0500>,<Administrator>,<TOPSPIN>,<proc1d>,<TOPSPIN 2.1>,
      <pk PHC0 = 36.51306 PHC1 = 0 
       data hash MD5: 128K
       D2 E6 8A 22 F6 B5 D7 90 0D 6A EA 7D 1B 08 B5 B0>)
(   4,<2012-04-15 14:16:32.500 -0500>,<Administrator>,<TOPSPIN>,<proc1d>,<TOPSPIN 2.1>,
      <abs ABSG = 1 
       data hash MD5: 128K
       B9 B3 55 F7 28 21 06 A8 04 EA 2A 67 92 CD 77 F4>)
(   5,<2012-04-15 14:16:32.578 -0500>,<Administrator>,<TOPSPIN>,<proc1d>,<TOPSPIN 2.1>,
      <abs ABSG = 2 
       data hash MD5: 128K
       6C EF 60 CE B3 09 21 A8 3B 1E 6F 9D 4C 89 C9 8F>)
(   6,<2012-04-15 14:16:32.625 -0500>,<Administrator>,<TOPSPIN>,<proc1d>,<TOPSPIN 2.1>,
      <abs ABSG = 3 
       data hash MD5: 128K
       E5 06 24 C0 65 03 76 A3 C6 98 B4 22 14 6F 72 2B>)
(   7,<2012-04-15 14:16:32.703 -0500>,<Administrator>,<TOPSPIN>,<proc1d>,<TOPSPIN 2.1>,
      <abs ABSG = 4 
       data hash MD5: 128K
       2D 7F DD 1C 4B 49 9E DA 93 B5 4D 32 7E CF E3 D2>)
(   8,<2012-04-15 14:16:32.750 -0500>,<Administrator>,<TOPSPIN>,<proc1d>,<TOPSPIN 2.1>,
      <abs ABSG = 5 
       data hash MD5: 128K
       1E 51 53 F7 F4 4F 07 1C D8 7D 40 13 1A 31 29 CB>)
(   9,<2012-04-15 14:16:32.984 -0500>,<Administrator>,<TOPSPIN>,<audit>,<TOPSPIN 2.1>,
      <user comment:
       ICON-NMR User ID: COFFEE
       data hash MD5: 128K
       1E 51 53 F7 F4 4F 07 1C D8 7D 40 13 1A 31 29 CB>)
$$ [...]
##$TP07= 0
##$TPNAME0= <>
##$TPNAME1= <>
##$TPNAME2= <>
##$TPNAME3= <>
##$TPNAME4= <>
##$TPNAME5= <>
##$TPNAME6= <>
##$TPNAME7= <>
##$TPOAL= (0..7)
0.5 0.5 0.5 0.5 0.5 0.5 0.5 0.5
##$TPOFFS= (0..7)
0 0 0 0 0 0 0 0
##$TUNHIN= 0
##$TUNHOUT= 0
##$TUNXOUT= 0
##$USERA1= <user>
##$USERA2= <user>
##$USERA3= <user>
##$USERA4= <user>
##$USERA5= <user>
##$V9= 5
##$VALIST= <valist>
##$VCLIST= <CCCCCCCCCCCCCCC>
##$VD= 0
##$VDLIST= <DDDDDDDDDDDDDDD>
##$VPLIST= <PPPPPPPPPPPPPPP>
##$VTLIST= <TTTTTTTTTTTTTTT>
##$WBST= 2048
##$WBSW= 25
##$XGAIN= (0..3)
0 0 0 0
##$XL= 0
##$YL= 0
##$YMAX_a= 11735649
##$YMIN_a= -7408728
##$ZGOPTNS= <>
##$ZL1= 120
##$ZL2= 120
##$ZL3= 120
##$ZL4= 120
##$ABSF1= 14.96857
##$ABSF2= -5.583961
##$ABSG= 5
##$ABSL= 3
##$ALPHA= 0
##$AQORDER= 0
##$ASSFAC= 0
##$ASSFACI= 0
##$ASSFACX= 0
##$ASSWID= 0
##$AUNMP= <proc_prof1d_extract.lims>
##$AXLEFT= 0
##$AXNAME= <>
##$AXNUC= <1H>
##$AXRIGHT= 0
##$AXTYPE= 0
##$AXUNIT= <>
##$AZFE= 0.1
##$AZFW= 0.1
##$BCFW= 0
##$BC_mod= 0
##$BYTORDP= 0
##$COROFFS= 0
##$CY= 15
##$DATMOD= 1
##$DC= 0
##$DFILT= <>
##$DTYPP= 0
##$F1P= 0
##$F2P= 0
##$FCOR= 0.5
##$FTSIZE= 131072
##$FT_mod= 6
##$GAMMA= 0
##$GB= 0
##$INTBC= 1
##$INTSCL= 1
##$ISEN= 128
##$LB= 0.3
##$LEV0= 0
##$LPBIN= 0
##$MAXI= 10000
##$MC2= 0
##$MEAN= 0
##$ME_mod= 0
##$MI= 0
##$NCOEF= 0
##$NC_proc= -2
##$NLEV= 6
##$NOISF1= 0
##$NOISF2= 0
##$NSP= 0
##$NTH_PI= 0
##$NZP= 0
##$OFFSET= 14.96857
##$PC= 1
##$PHC0= 36.51306
##$PHC1= 0
##$PH_mod= 1
##$PKNL= yes
##$PPARMOD= 0
##$PPDIAG= 0
##$PPIPTYP= 0
##$PPMPNUM= 2147483647
##$PPRESOL= 1
##$PSCAL= 4
##$PSIGN= 0
##$PYNMP= <proc.py>
##$REVERSE= no
##$SF= 400.13000481996
##$SI= 131072
##$SIGF1= 0
##$SIGF2= 0
##$SINO= 400
##$SIOLD= 131072
##$SPECTYP= <>
##$SREGLST= <1H.CDCl3>
##$SSB= 0
##$STSI= 131072
##$STSR= 0
##$SW_p= 8223.68421052632
##$SYMM= 0
##$S_DEV= 0
##$TDeff= 65536
##$TDoff= 0
##$TI= <>
##$TILT= no
##$TM1= 0
##$TM2= 0
##$TOPLEV= 0
##$USERP1= <user>
##$USERP2= <user>
##$USERP3= <user>
##$USERP4= <user>
##$USERP5= <user>
##$WDW= 1
##$XDIM= 131072
##$YMAX_p= 247615682
##$YMIN_p= -401342322
##$CURPLOT= <Network HP LaserJet P1505>
##$CURPRIN= <$Network HP LaserJet P1505>
##$DFORMAT= <normdp>
##$LAYOUT= <+/1D_H.xwp>
##$LFORMAT= <normlp>
##$PFORMAT= <normpl>
##$SURQMSG= 1
$$ End of Bruker specific parameters
$$ ---------------------------------
##NTUPLES= NMR SPECTRUM
##VAR_NAME=  FREQUENCY,     SPECTRUM/REAL,   SPECTRUM/IMAG
##SYMBOL=    X,             R,               I
##VAR_TYPE=  INDEPENDENT,   DEPENDENT,       DEPENDENT
##VAR_FORM=  AFFN,          ASDF,            ASDF
##VAR_DIM=   131072,        131072,          131072
##UNITS=     HZ,            ARBITRARY UNITS, ARBITRARY UNITS
##FACTOR=    0.0627417313425165, 1,          1
##FIRST=     8223.62146879498, 1499,         -42525
##LAST=      0,             3417,            -42273
##MIN=       0,             -401342322,      0
##MAX=       8223.62146879498, 247615682,    0
$$ Real data points
##PAGE= N=1
##DATA TABLE= (X++(R..R)), XYDATA
$$ [...]
62045A797260K6314K7161K7373K7088K7006K7652K8988L0630L2143L3120L3501
62034B118236L3922L5317L7846M0547M2326M2920M2657M1739M0297L8873L8185
62023B552865L8477L9554M1296M3545M5584M6430M5811M4265M2186L9526L6657
62012C016196L4736L4532L5423L6197L6500L6773L7119L7080L6478L5638L4581
62001C411253L2691K9524K5484K1324J7368J3532R830O429L337L64k692n952r454
61988C553038j3021j6236j8789k0725k2220k3191k3414k2999k2421k1986k1469
61977C326567k0439j8882j7308j6222j5574j4852j3643j1995j0250q732p650p091
61965C163929o887o603n951n159m713m707m721m376l781l312l190l368l633l678
$$ plain form
62045 1797260 1823574 1850735 1878108 1905196 1932202 1959854 1988842 2019472 2051615 2084735 2118236
62034 2118236 2152158 2187475 2225321 2265868 2308194 2351114 2393771 2435510 2475807 2514680 2552865
62023 2552865 2591342 2630896 2672192 2715737 2761321 2807751 2853562 2897827 2940013 2979539 3016196
62012 3016196 3050932 3085464 3120887 3157084 3193584 3230357 3267476 3304556 3341034 3376672 3411253
62001 3411253 3443944 3473468 3498952 3520276 3537644 3551176 3561006 3567435 3570772 3571136 3568444 3562492 3553038
61988 3553038 3540017 3523781 3504992 3484267 3462047 3438856 3415442 3392443 3370022 3348036 3326567
61977 3326567 3306128 3287246 3269938 3253716 3238142 3223290 3209647 3197652 3187402 3178670 3171020 3163929
61965 3163929 3157042 3150439 3144488 3139329 3134616 3129909 3125188 3120812 3117031 3113719 3110529 3107161 3103528 3099850
61951C099850l387l154l668n043o385o614n668m554m216m681n375n936o555p674
61937C026940r597j2291j5445j8668k1697k4435k6902k9223l1629l4222l6716
61926B766115l8539l9295l9075l8257l7155l5895l4557l3256l2032l0737k9186
61915B378131k7434k5885k4921k4407k3776k2694k1495k0683k0205j9507j8330
61904B128794j7049j6132j5583j5135j4714j4352j3844j2891j1594j0422r575
61893A977503q690p405n989n080m796m496l466j654M76K505M228N504O395P445
61879A962480R273J1742J3963J5416J6648J8446K0683K2543K3702K4576K5528
61868B165000K6480K7486K9024L1422L4521L8160M2457M7278N2037N6545O1614
$$ plain form
61951 3099850 3096463 3093309 3089641 3084598 3078213 3071599 3065931 3061377 3057161 3052480 3047105 3041169 3034614 3026940
61937 3026940 3017343 3005052 2989607 2970939 2949242 2924807 2897905 2868682 2837053 2802831 2766115
61926 2766115 2727576 2688281 2649206 2610949 2573794 2537899 2503342 2470086 2438054 2407317 2378131
61915 2378131 2350697 2324812 2299891 2275484 2251708 2229014 2207519 2186836 2166631 2147124 2128794
61904 2128794 2111745 2095613 2080030 2064895 2050181 2035829 2021985 2009094 1997500 1987078 1977503
61893 1977503 1968813 1961408 1955419 1950339 1945543 1941047 1937581 1935927 1936403 1938908 1943136 1948640 1955035 1962480
61879 1962480 1971753 1983495 1997458 2012874 2029522 2047968 2068651 2091194 2114896 2139472 2165000
61868 2165000 2191480 2218966 2247990 2279412 2313933 2352093 2394550 2441828 2493865 2550410 2612024
61857B612024O8231P6495Q5951R6641J08913J22457J36389J50525J65759J82885
61847C806270K01638K21275K41632K63131K86064L10186L34818L58950L81244
61838F405208M00039M13123M17431M09250L84993L41981K79001J97187J00922
61829I349135k412j04340j97524k76816l39273l84060m12288m26348m28959m22536
61819F354579m09044l90124l67364l42504l17135k92113k67596k43812k21442
61810C503445k01033j82500j65568j50321j36796j24386j12312j00571q9800q0287
61800B159871p1688o3683n6278m9308m2298l5204k8755k3661j9762j6384j3218
61789A739632j0451q131n983l922k413k037k812m131n362o344p249q105q614q402
$$ plain form
61857 2612024 2680255 2756750 2842701 2939342 3048255 3170712 3307101 3457626 3623385 3806270
61847 3806270 4007908 4229183 4470815 4733946 5020010 5330196 5665014 6023964 6405208
61838 6405208 6805247 7218370 7635801 8045051 8430044 8772025 9051026 9248213 9349135
61829 9349135 9346723 9242383 9044859 8768043 8428770 8044710 7632422 7206074 6777115 6354579
61819 6354579 5945535 5555411 5188047 4845543 4528408 4236295 3968699 3724887 3503445
61810 3503445 3302412 3119912 2954344 2804023 2667227 2542841 2430529 2329958 2240158 2159871
61800 2159871 2088183 2024500 1968222 1918914 1876616 1841412 1812657 1788996 1769234 1752850 1739632
61789 1739632 1729181 1721050 1715067 1711145 1708732 1706695 1703883 1699752 1694390 1688046 1680797 1672692 1664078 1655676
61775A655676p327n560l509j623n7J500L374N318O668P112O884O197M974L378
61761A683005J961R40j35j478k427k383j875j744j581j09L007O763J0463J4540
61747A708947J9331K4061K7839L1031L4768L9495M4671M9732N4671N9790O5373
61736B159709P1563P8196Q4822R1203R7725J05090J13640J23190J33368J43937
61726C202443J55051J67385J81788J98520K17075K37070K59037K83963L12205
61717E214537L43248L76457M11743M49470M89945N32941N77460O21957O64777
61708I682535P04109P37118P59286P64782P47504P01789O22969N08692L61036
61699A5589820J87901K228j81060l48791m91798o04948o86201p36380p59363p61091
$$ plain form
61775 1655676 1648349 1642789 1639280 1637657 1637600 1639100 1642474 1647792 1654460 1661572 1668456 1674653 1679627 1683005
61761 1683005 1684966 1685906 1685771 1684293 1681866 1679483 1677608 1675864 1674283 1674174 1677181 1683944 1694407 1708947
61747 1708947 1728278 1752339 1780178 1811209 1845977 1885472 1930143 1979875 2034546 2094336 2159709
61736 2159709 2231272 2309468 2394290 2485493 2583218 2688308 2801948 2925138 3058506 3202443
61726 3202443 3357494 3524879 3706667 3905187 4122262 4359332 4618369 4902332 5214537
61717 5214537 5557785 5934242 6345985 6795455 7285400 7818341 8395801 9017758 9682535
61708 9682535 10386644 11123762 11883048 12647830 13395334 14097123 14720092 15228784 15589820
61699 15589820 15777721 15779949 15598889 15250098 14758300 14153352 13467151 12730771 11971408 11210317
61689A1210317p47295p22028o88151o48431o05539n61394n17149m73739m32118
61680E814473l93107l57269l24832k95516k68721k44139k21850k01774j83467
61671C323798j66784j52128j39562j28237j17329j07105r8350r1103q4673p8663
61661B159864p3214o8482o4547o1625n9595n7541n4615n1176m8217m5736m2803
61650A532313l9219l5995l3881l2410l0904k9414k8121k6618k4541k2339k0703
61639A208168j9685j8979j8616j8695j8771j8192j6970j5739j4982j4603j4241
61628A018695j3687j3105j2960j3465j3979j3493j1972j0651j0511j0999j0875
61617H82998r925q978q575q455q325q198p910p093n951n284n411n641n308m790
$$ plain form
61689 11210317 10463022 9740994 9052843 8404412 7798873 7237479 6720330 6246591 5814473
61680 5814473 5421366 5064097 4739265 4443749 4175028 3930889 3709039 3507265 3323798
61671 3323798 3157014 3004886 2865324 2737087 2619758 2512653 2414303 2323200 2238527 2159864
61661 2159864 2086650 2018168 1953621 1891996 1832401 1774860 1720245 1669069 1620852 1575116 1532313
61650 1532313 1493094 1457099 1423218 1390808 1359904 1330490 1302369 1275751 1251210 1228871 1208168
61639 1208168 1188483 1169504 1150888 1132193 1113422 1095230 1078260 1062521 1047539 1032936 1018695
61628 1018695 1005008 991903 978943 965478 951499 938006 926034 915383 904872 893873 882998
61617 882998 873073 864095 855520 847065 838740 830542 822632 815539 809588 804304 798893 793252 787944 783154
61603G83154m879n499n768n227m359l752l349k781k052j431r14k52N40J054R81
61588G45466N48L34P42J674K607K994K743K225J733J087J45n87l95N84J397J560
61572G64857J602K011K436K451K461K955L429K990J706L65q33k302l855m715m838
61557G70720n070n689n984n783o133p620r070r037p818o857o618o384n846n625
61543F77186n957o051n165l697k631k399k640k830k684k128j191n7R79J748K461
61528F44944L497M802N666N508M817M739N677O872P575Q003Q685R545J0236J0938
61514G41504J2087J3492J4481J4870J5291J6479J8528K0767K2181K2184K1326
61503I33190K0850K1286K1840K1625K0842K0182J9570J8489J7147J6300J6006
$$ plain form
61603 783154 778275 772776 767008 761781 757422 753670 750321 747540 745488 744057 743143 742891 743431 744485 745466
61588 745466 746014 746348 747090 748764 751371 754365 757108 759333 761066 762153 762298 761711 761316 761900 763297 764857
61572 764857 766459 768470 770906 773357 775818 778773 782202 785192 786898 787263 786430 784128 780273 775558 770720
61557 770720 765650 759961 753977 748194 742061 734441 725371 716334 708516 701659 695041 688657 682811 677186
61543 677186 671229 665178 660013 656316 653685 651286 648646 645816 643132 641004 639813 639756 640735 642483 644944
61528 644944 648441 653243 658909 664417 669234 673973 679650 686522 694097 702100 710785 720330 730566 741504
61514 741504 753591 767083 781564 796434 811725 828204 846732 867499 889680 911864 933190
61503 933190 954040 975326 997166 1018791 1039633 1059815 1079385 1097874 1115021 1131321 1147327
61492A147327J5537J4588J3638J3005J2345J1310R905Q081N745L358J695P14m68
61479A256780k247l978n136o082p142p766p401o487n766n056l547j064J743M231
61465A201082O216P783R292J1365J4251J7428K0394K3597K7858L3039L8116M2593
61453A453014M7113N2455N8624O5208P2030P9143Q6573R4461J03090J12409J21799
61442B345919J30615J38817J46710J54111J59964J62761J61247J54810J43474
61433C698428J27536J07270Q3008N5531K6327k676k9608n3092p2433q7551r8693
61422C754047j06096j09968j10677j08818j05029r9787r3392q6076p8114o9838
61412B786252o1496n3056m4312l5326k6651j8852j1901n294J225P411J3061J8403
$$ plain form
61492 1147327 1162864 1177452 1191090 1204095 1216440 1227750 1237655 1245736 1251481 1254839 1256534 1257248 1256780
61479 1256780 1254533 1250555 1245419 1239337 1232195 1224429 1217028 1210541 1204775 1199719 1196172 1195108 1196851 1201082
61465 1201082 1207298 1215081 1224373 1235738 1249989 1267417 1287811 1311408 1339266 1372305 1410421 1453014
61453 1453014 1500127 1552582 1611206 1676414 1748444 1827587 1914160 2008621 2111711 2224120 2345919
61442 2345919 2476534 2615351 2762061 2916172 3076136 3238897 3400144 3554954 3698428
61433 3698428 3825964 3933234 4016242 4071773 4098100 4095424 4065816 4012724 3940291 3852740 3754047
61422 3754047 3647951 3537983 3427306 3318488 3213459 3113672 3020280 2934204 2856090 2786252
61412 2786252 2724756 2671700 2627388 2592062 2565411 2546559 2534658 2529364 2530589 2538000 2551061 2569464
61400B569464K3688K8635L2632L5443L7416L9002M0254M0913M0776L9902L8558
61389B966683L7111L5902L5144L4863L4941L5205L5504L5671L5481L4639L2996
61378C354140L0793K8473K6177K3506K0075J6187J2662R923P475M496P48l306
61366C531349p161j0719j4081j7179j9770k1704k3001k3679k3632k2822k1496
61355C326105k0048j8575j6697j4069j0951q022n682l929k926l027l956m565m180
61342C209478l739m762p240r412r847q847p419n653k859J262O476J2767K0421
61329C190626K9289L8696M8266N8306O9225Q0950R3175J05721J18308J30290J41019
61318D103871J50439J58880J66211J71367J72863J69597J61132J47411J28537
$$ plain form
61400 2569464 2593152 2621787 2654419 2689862 2727278 2766280 2806534 2847447 2888223 2928125 2966683
61389 2966683 3003794 3039696 3074840 3109703 3144644 3179849 3215353 3251024 3286505 3321144 3354140
61378 3354140 3384933 3413406 3439583 3463089 3483164 3499351 3512013 3521936 3529411 3533907 3534655 3531349
61366 3531349 3524188 3513469 3499388 3482209 3462439 3440735 3417734 3394055 3370423 3347601 3326105
61355 3326105 3306057 3287482 3270785 3256716 3245765 3237743 3232061 3228132 3225206 3222179 3218223 3213658 3209478
61342 3209478 3205739 3200977 3193737 3184325 3174478 3165631 3158212 3152559 3149700 3150962 3157438 3170205 3190626
61329 3190626 3219915 3258611 3306877 3365183 3434408 3515358 3608533 3714254 3832562 3962852 4103871
61318 4103871 4254310 4413190 4579401 4750768 4923631 5093228 5254360 5401771 5530308
61309E530308J04906P7361M7201J6178j3603m0359o3674q4609j04208j22112j37074
61298E210315j48601j57253j63369j66502j66542j64449j61200j56702j50468
61289C775229j42866j34857j26830j18595j10215j01973r3728q5102p6288o7803
61279B716972n9556n1014m2302l4174k6782j9463j2072n492k73M386R583J5213
61267B495026K0208K3851K6248K7816K8949K9917L0668L0802L0125K8937K7543
61256B800090K5767K3309K0339J7386J4936J3294J2406J1533R627O479K959l04
61244B957821l857q376j3294j7360k0259k2659k4938k6814k8387l0368l3001l5496
61232B693012l6963l7341l7021l6138l4673l2859l1048k9312k7465k5258k2446
$$ plain form
61309 5530308 5635214 5712575 5759776 5775954 5762351 5721992 5658318 5573709 5469501 5347389 5210315
61298 5210315 5061714 4904461 4741092 4574590 4408048 4243599 4082399 3925697 3775229
61289 3775229 3632363 3497506 3370676 3252081 3141866 3039893 2946165 2861063 2784775 2716972
61279 2716972 2657416 2606402 2564100 2529926 2503144 2483681 2471609 2466117 2465844 2470230 2479813 2495026
61267 2495026 2515234 2539085 2565333 2593149 2622098 2652015 2682683 2713485 2743610 2772547 2800090
61256 2800090 2825857 2849166 2869505 2886891 2901827 2915121 2927527 2939060 2948687 2955166 2958125 2957821
61244 2957821 2953964 2945588 2932294 2914934 2894675 2872016 2847078 2820264 2791877 2761509 2728508 2693012
61232 2693012 2656049 2618708 2581687 2545549 2510876 2478017 2446969 2417657 2390192 2364934 2342488
61221B342488j8980j5346j2440j0781j0005r292q148o726n656n639o877q728j0173
61208B213697j0699j0511r796q273n722k563M96L071N124O711Q227J0541J4285
61195B214588J9024K3677K7880L2413L8119M4805N1547N7626O2839O6995O9708
61184B709221P0686O9774O6528N9978M9291L4623J7072k144k2132m1843n9706
61173B951348p4209q4900r2365r7275r9739r9700r7535r3969q9578q4658p9479
61162A957941p4321o9191o3785n7863n1701m6012m1398l7805l4587l1184k7608
61151A422486k4203k1013j7744j4381j1394r065o879m087p22K376M640O396Q162
61138A334572R725J0366R864Q858Q049P435O474M826K686M92j382k701l451m052
$$ plain form
61221 2342488 2323508 2308162 2295722 2284941 2274936 2265644 2257496 2250770 2245114 2239475 2232598 2223870 2213697
61208 2213697 2202998 2192487 2182691 2174418 2168696 2166133 2166629 2169700 2174824 2181535 2189762 2200303 2214588
61195 2214588 2233612 2257289 2285169 2317582 2355701 2400506 2452053 2509679 2572518 2639513 2709221
61184 2709221 2779907 2849681 2916209 2976187 3025478 3060101 3077173 3075029 3052897 3011054 2951348
61173 2951348 2877139 2792239 2699874 2602599 2502860 2403160 2305625 2211656 2122078 2037420 1957941
61162 1957941 1883620 1814429 1750644 1692781 1641080 1595068 1553670 1515865 1481278 1450094 1422486
61151 1422486 1398283 1377270 1359526 1345145 1333751 1324686 1317807 1313720 1312998 1315374 1320014 1326410 1334572
61138 1334572 1344297 1354663 1364527 1373385 1381434 1388869 1395343 1400169 1402855 1403347 1401965 1399264 1395813 1391761
61124A391761n204p236r670j1712j3145j4419j5882j7275j8199j8767j9413k0237
61112A220602k0886k1061k0801k0330j9976k0214k1346k2865k3638k3052k1759
61101I84674k0929k0889k0944k0426j9418j8338j7195j5620j3571j1721j0970
61090G94653j1608j2959j4039j4508j4782j5158j5228j4504j3248j2099j1094
61079F45426r723q040o939o904p073o160m009j738m17r1m2M21J441K602L349L590
61063F05693L811M460N425O311P005P592P932P839P644P988Q934R709R572Q651
61049G08566P707P308P413P522P060N728L664J233j274l561n109n444m828m239
61035G31746m437n179n620n297m480l706l325l419l934m678n383n847o005n909
$$ plain form
61124 1391761 1386557 1379321 1369651 1357939 1344794 1330375 1314493 1297218 1279019 1260252 1240839 1220602
61112 1220602 1199716 1178655 1157854 1137524 1117548 1097334 1075988 1053123 1029485 1006433 984674
61101 984674 963745 942856 921912 901486 882068 863730 846535 830915 817344 805623 794653
61090 794653 783045 770086 756047 741539 726757 711599 696371 681867 668619 656520 645426
61079 645426 635703 627663 620724 613820 606747 600587 596578 594840 594423 594332 594290 594711 596152 598754 602103 605693
61063 605693 609504 613964 619389 625700 632705 640297 648229 656068 663712 671700 680634 690343 699915 708566
61049 708566 716273 723581 730994 738516 745576 751304 754968 756201 754927 751366 746257 740813 735985 731746
61035 731746 727309 722130 716510 711213 706733 703027 699702 696283 692349 687671 682288 676441 670436 664527
61021F64527n736n816o460p567q480q476p518o341n583n033m080k787j964k030
61007E86656k311j874p10M07R73J148J215J202J098J042J098J206J413J906K707
60992E97176L561M205M542M600M457M263M145M153M336M711N086N255N484O339
60978F62313P706Q592Q464Q252R132J0832J2179J3004J4232J6063J7505J8051
60966H06325J8553J9784K1182K1881K2121K2732K3866K5084K6270K7641K9188
60955A064627L0756L2441L4308L6157L8053M0611M4109M7828N1051N4264N8539
60944A532744O3998O9874P5799Q2062Q8538R4428R9415J04359J10522J18514J28256
60933B568509J39507J52167J66266J81918J99323K18927K41671K68811L01233
$$ plain form
61021 664527 658791 652975 646515 638948 630468 621992 614474 608133 602550 597517 593437 590650 588686 586656
61007 586656 584345 582471 581761 582168 583141 584289 585504 586706 587804 588846 589944 591150 592563 594469 597176
60992 597176 600737 604942 609484 614084 618541 622804 626949 631102 635438 640149 645235 650490 655974 662313
60978 662313 670019 678611 687075 695327 704459 715291 727470 740474 754706 770769 788274 806325
60966 806325 824878 844662 865844 887725 909846 932578 956444 981528 1007798 1035439 1064627
60955 1064627 1095383 1127824 1162132 1198289 1236342 1276953 1321062 1368890 1419941 1474205 1532744
60944 1532744 1596742 1666616 1742415 1824477 1913015 2007443 2106858 2211217 2321739 2440253 2568509
60933 2568509 2708016 2860183 3026449 3208367 3407690 3626617 3868288 4137099 4438332
60924D438332L39046L81983M29944M83177N42572O10148O88745P81023Q89265
60915I584235J015972J163017J329156J508173J686641J836686J907876J836373
60907B1868129J582207J172192P05129L03677N0235m0901n420R8265J95833J98722
60897B6128068L1884l18336p81683j237540j580785j766894j809867j751708j635762
60888A5277377j495884j354359j221863j100025r86537q79273p77511o81898n94303
60879F185724n16872m50669l95466l50314l13569k82726k55526k31281k10231
60870C179070j91899j75202j59920j46588j34911j23768j13083j04184r7787r2890
60860A838838q8266q3797p9628p5168o9913o4364n9279n4734n0587m7058m4110
$$ plain form
60924 4438332 4777378 5159361 5589305 6072482 6615054 7225202 7913947 8694970 9584235
60915 9584235 10600207 11763224 13092380 14600553 16287194 18123880 20031756 21868129
60907 21868129 23450336 24622528 25327657 25631334 25681569 25640668 25635248 25733513 25929346 26128068
60897 26128068 26159952 25841616 25059933 23822393 22241608 20474714 18664847 16913139 15277377
60888 15277377 13781493 12427134 11205271 10105246 9118709 8239436 7461925 6780027 6185724
60879 6185724 5668852 5218183 4822717 4472403 4158834 3876108 3620582 3389301 3179070
60870 3179070 2987171 2811969 2652049 2505461 2370550 2246782 2133699 2029515 1931728 1838838
60860 1838838 1750572 1666775 1587147 1511979 1442066 1377702 1318423 1263689 1213102 1166044 1121934
60849A121934m1037l7483l4100l1494k9276k6936k4799k3216k1627j9471j7370
60838H15125j6215j5630j4550j2907j1473j0374r031p540o781o923o938n919m146
60825F86698k502j528j284j549j941k248k731l754n104o178o743p010p114p057
60811F29955p085p482q008q137p820p392o852n900m723l923l520k804j421M6R59
60796E55893J498K245L257M082M445M584N005O030P548R053J0118J0788J1465
60783F36011J2382J3397J4196J4504J4178J3372J2414J1345R769P507N143L476
60771G67694K614K068J580J269J063N69l96j563k528k981k820k441k738m187o017
60756G51186o944o700o211o304o934p755q630r344r512r135q752q731q871q846
$$ plain form
60849 1121934 1080897 1043414 1009314 977820 948544 921608 896809 873593 851966 832495 815125
60838 815125 798910 783280 768730 755823 744350 733976 724945 717405 710624 703701 696763 690844 686698
60825 686698 684196 682668 681384 679835 677894 675646 672915 669161 664057 657879 651136 644126 637012 629955
60811 629955 622870 615388 607380 599243 591423 584031 577179 571279 566556 562633 559113 556309 554888 554934 555893
60796 555893 557391 559636 562893 566975 571420 576004 581009 587039 594587 603640 613758 624546 636011
60783 636011 648393 661790 675986 690490 704668 718040 730454 741799 751568 759075 764218 767694
60771 767694 770308 772376 773956 775225 776288 776857 776461 774898 772370 769389 766569 764128 761390 757203 751186
60756 751186 744242 737542 731331 725027 718093 710338 701708 692364 682852 673717 664965 656234 647363 638517
60742F38517q530p780o514n158m338l897k989j442k18K0qO90J826K321J998J855
60726F06353K730M385O024P135P756Q282R033R827J0046R441Q617Q398Q868R406
60712G16301R523R260Q879Q558Q394Q332Q107P513O617N571M387L159K272K010
60698H08883K161K347K496K582K134P51j030k044j899j416j468j887j937j443
60684H08230j003j259k353l972n555o499o492n877n452n765o594p192p058o380
60670G36779n730n475n546n676n537m759l202j370k33k97j034j506j398j126j073
60655F92817j135j012o20j25K10J64k49p06r35j032j197j266r19m21n25j467k453
60638F79129k597k001j520j685k288k963l657m519n621o938q247r074r100q728
$$ plain form
60742 638517 629987 622207 615693 610535 606197 602300 599311 597869 597651 597671 597663 598353 600179 602500 604498 606353
60726 606353 609083 613468 619492 626627 634383 642665 651698 661525 671571 681012 689629 698027 706895 716301
60712 716301 725824 735084 743963 752521 760915 769247 777354 784867 791484 797055 801442 804601 806873 808883
60698 808883 811044 813391 815887 818469 820603 821354 820324 818280 816381 814965 813497 811610 809673 808230
60684 808230 807227 805968 803615 799643 794088 787589 781097 775220 769768 764003 757409 750217 743159 736779
60670 736779 731049 725574 720028 714352 708815 704056 700854 699484 699251 698954 697920 696414 695016 693890 692817
60655 692817 691682 690670 690050 689925 690135 690299 690050 689344 688409 687377 686180 684914 683995 683574 683049 681582 679129
60638 679129 676532 674531 673011 671326 669038 666075 662418 657899 652278 645340 637093 628019 618919 610191
60624F10191q822r641j0384j0178r244q508q253p757o466m892l953l781l703l209
60610E11400k360j350k37P40J134R51Q77J483K506L366L998M609M872M242L097
60595E39328K686L503M468M253L000J957J810K145K515L105M096N008N240M857
60581E87971M493M563M912N119M975M774N161O466Q128R106R031Q610Q667R232
60567F81208R867J0450J1035J1245J0597R362Q437Q177P927O927N182L190J270
60554G84874m78j882k848l643m612n685o405o468o008n397m868m358l641k648
60540G25933j752j599k541m251n894o732o671o261o104o115n582m165k524j597
60526F64145j414j163l38P72J759K536K988K833K221J838J992K180J925J552J579
$$ plain form
60624 610191 601369 591728 581344 571166 561922 553414 545161 537404 530938 526046 522093 518312 514609 511400
60610 511400 509040 507690 507453 508193 509327 510278 511155 512638 515144 518510 522508 527117 531989 536231 539328
60595 539328 542014 545517 549985 554238 557238 559195 561005 563150 565665 568770 572866 577874 583114 587971
60581 587971 592464 597027 601939 607058 612033 616807 621968 628434 636562 645668 654699 663309 671976 681208
60567 681208 691075 701525 712560 723805 734402 743764 752201 760378 768305 775232 780414 783604 784874
60554 784874 784396 782514 779666 776023 771411 765726 759321 752853 746845 741448 736580 732222 728581 725933
60540 725933 724181 722582 720041 715790 709896 703164 696493 690232 684128 678013 672431 668266 665742 664145
60526 664145 662731 661568 661230 662002 663761 666297 669285 672118 674339 676177 678169 680349 682274 683826 685405
60511F85405J874J995J893J717J310P10O61J744L198L548K424Q74j14o43j203
60496G05393j842k355k712k902k733k091j132q7Q77J606K217L254N063P066Q360
60481G17982R057J0218J2305J4573J6315J7828J9680K1803K3919K6074K7949K8272
60469I45975K5936K1439J6331J1436O373P40n041j0083j3564j4955j4383j2844
60457I57360j1283r462o425k242J571L837N085O565Q475J0006J0813J1516J2702
60444I98518J4243J5885J7800K0166K2653K4955K7492L0978L5385M0040M4796
60433A292911N0381N7224O4556P1359P7688Q4353R1483R8349J04720J11523J19841
60422B224388J29860J41364J54624J69936J86330K01179K11119K12985K04146
$$ plain form
60511 685405 687279 689274 691167 692884 694194 694904 695565 697309 700507 704055 706479 707353 707239 706596 705393
60496 705393 703551 701196 698484 695582 692849 690758 689626 689539 690416 692022 694239 697493 702556 709622 717982
60481 717982 727039 737257 749562 764135 780450 798278 817958 839761 863680 889754 917703 945975
60469 945975 971911 993350 1009681 1021117 1027490 1028230 1023189 1013106 999542 984587 970204 957360
60457 957360 946077 936615 930190 927948 929519 933356 938441 945006 953481 963487 974300 985816 998518
60444 998518 1012761 1028646 1046446 1066612 1089265 1114220 1141712 1172690 1208075 1248115 1292911
60433 1292911 1343292 1400516 1465072 1536431 1614119 1698472 1789955 1888304 1993024 2104547 2224388
60422 2224388 2354248 2495612 2650236 2820172 3006502 3207681 3418800 3631785 3835931
60413C835931J82727J48194J01879M6990j2004p0272j23385j67685k00476k20537
60403C521362k28766k27900k21116k10689j97886j83595j68671j53770j39323
60394A789646j25720j13253j01896r1402q1596p2481o4178n6927n0942m6022m1498
60383I43731l6906l2529k8940k6181k3845k1848k0456j9527j8391j6704j4939
60372F83465j3701j2977j2413j1857j1221j0165q599p217o920p524p702o439m234
60359E62496k512k114k638l093k906k274j753j592j430p62L66J365J857K141K603
60344E49754K985K733J950J431J628K093K200J977J874K054K366K772L380M134
60330E83331M813N224N163M383L027J767J084N96k54j112j096l17m8j020k337
$$ plain form
60413 3835931 4018658 4166852 4268731 4315721 4303717 4233445 4110060 3942375 3741899 3521362
60403 3521362 3292596 3064696 2843580 2632891 2435005 2251410 2082739 1928969 1789646
60394 1789646 1663926 1550673 1448777 1357375 1275779 1203298 1139120 1082193 1031251 985229 943731
60383 943731 906825 874296 845356 819175 795330 773482 753026 733499 715108 698404 683465
60372 683465 669764 656787 644374 632517 621296 611131 602532 595315 588395 580871 573169 566730 562496
60359 562496 559984 557870 555232 552139 549233 546959 545206 543614 542184 541422 541788 543153 545010 547151 549754
60344 549754 552739 555472 557422 558853 560481 562574 564774 566751 568625 570679 573045 575817 579197 583331
60330 583331 588144 593368 598531 602914 605941 607708 608792 609388 609134 608022 606926 606609 606561 605541 603204
60315F03204k675j986j332j379j781j911j590j033n36l19l81m57k78J17M79O66
60299E88808P49R69J657K908M186M660M214L806M312N336N736N138M295M015M386
60284F45175N094N872O356O128N254M451M325M660M774M331L509K608J833J364
60270G05734J292J460J650J935K581L543M376M729M701M474L765K107l03k470
60256G39574l587l903m220m778n076m778m214l799l465l015k666k738l075l208
60242F87052l037k910l035l187l043k486j549l60P42J308J158N70O3N7O44J496
60226F73483K018J881J426J329J853K668L387L956M423M647M481M124M087M742
60212G18505N984P221P808P653P398P763Q684R359R370R392J0495J2845J5581
$$ plain form
60315 603204 600529 598543 597211 595832 594051 592140 590550 589517 588981 588662 588281 587824 587546 587663 588142 588808
60299 588808 589557 590526 592183 595091 599277 603937 608151 611957 616269 621605 627341 632479 636774 640789 645175
60284 645175 650269 656141 662497 668625 673879 678330 682655 687315 692089 696420 699929 702537 704370 705734
60270 705734 707026 708486 710136 712071 714652 718195 722571 727300 732001 736475 740240 742347 742044 739574
60256 739574 735987 732084 727864 723086 718010 713232 709018 705219 701754 698739 696073 693335 690260 687052
60242 687052 684015 681105 678070 674883 671840 669354 667805 667445 668187 669495 670653 671223 671286 671343 671987 673483
60226 673483 675501 677382 678808 680137 681990 684658 688045 692001 696424 701071 705552 709676 713763 718505
60212 718505 724489 731710 739518 747171 754569 762332 771016 780375 789745 799137 809632 822477 838058
60199H38058J7888J9796K1652K3281K4194K4516K5144K6842K9559L2853L6523
60188A120306M0398M3981M6959M9897N3728N8434O2955O6593O9857P3544P7556
60177A764208Q1113Q3704Q5252Q5686Q4947Q3174Q0406P6214P0225O2803N4740
60166B612472M6341L7452K8307J9643J1880M766j989q210j3564j7848k0783k2001
60154B676466k1552j9980j7608j4050q882k409M569J1658J9135K7369L6264M5251
60142B736231N3639O1036O7498P3209P7971Q1199Q2500Q1974P9784P5687O9285
60131C540013O0639N0328L8993K7094J5077L395p778j8681k9505l9889m8989n6031
60119C534666o0690o2892o2561n9739n4825m8346m0490l1236k0957j0465k73R763
$$ plain form
60199 838058 855946 875742 897394 920675 944869 969385 994529 1021371 1050930 1083783 1120306
60188 1120306 1160704 1204685 1251644 1301541 1355269 1413703 1476658 1543251 1613108 1686652 1764208
60177 1764208 1845321 1929025 2014277 2099963 2184910 2268084 2348490 2424704 2494929 2557732 2612472
60166 2612472 2658813 2696265 2724572 2744215 2756095 2760861 2758872 2750662 2737098 2719250 2698467 2676466
60154 2676466 2654914 2634934 2617326 2603276 2594394 2591985 2596554 2608212 2627347 2654716 2690980 2736231
60142 2736231 2789870 2850906 2918404 2991613 3069584 3150783 3233283 3315257 3395041 3470728 3540013
60131 3540013 3600652 3650980 3689973 3717067 3732144 3735539 3727761 3709080 3679575 3639686 3590697 3534666
60119 3534666 3473976 3411084 3348523 3288784 3233959 3185613 3145123 3113887 3092930 3082465 3082192 3091955
60107C091955J9733K9108L7285M4345N0586N5537N8255N8502N6897N3749M8593
60096C604545M1304L2893K4671J7023R665K742l001p046r501j0556r963p316k590
60083C682870L863J1765K1202L2361M4970N8220P1410Q4592R8371J13109J28664
60072D351397J44816J61531J78608J95476K11546K26550K40273K52171K61501
60063F223869K67673K70236K68704K62599K51662K35928K15768J91852J64832
60054H353123J34999J02545O8134L2723l308m0138p7246j12705j44370j71382
60044H142375j93846k11403k23101k28620k28716k24155k14926k00983j83290
60035F233335j63495j42746j21185r8625p5317n2076k9852r301R257K5641L9631
$$ plain form
60107 3091955 3111688 3140796 3178081 3222426 3273012 3328549 3386804 3445306 3502203 3555952 3604545
60096 3604545 3645849 3678742 3703413 3720436 3730101 3732843 3729842 3722796 3713295 3702739 3692776 3685460 3682870
60083 3682870 3686733 3698498 3719700 3752061 3797031 3855251 3926661 4011253 4109624 4222733 4351397
60072 4351397 4496213 4657744 4836352 5031828 5243374 5469924 5710197 5962368 6223869
60063 6223869 6491542 6761778 7030482 7293081 7544743 7780671 7996439 8188291 8353123
60054 8353123 8488122 8590667 8658801 8691524 8688216 8648078 8570832 8458127 8313757 8142375
60044 8142375 7948529 7737126 7514025 7285405 7056689 6832534 6617608 6416625 6233335
60035 6233335 6069840 5927094 5805909 5707284 5631967 5579891 5550039 5540738 5549995 5575636 5615267
60024E615267N0875N8807O2623O1780N6666M8540L8448K6474J2470k817j8006
60013F011127l2368m6167n9606p2184q3372r3250j01971j09167j14536j18521
60003E179985j21682j23550j22979j19662j14560j08562j01345r2083q0841o8729
59993D125992n6791m5077l2972k0121o971N612J7208K8229L9316N0357O0371O8391
59981D233544P4174P7901P9521P8626P4794O7781N7626M4918L0825J6418J947
59970D838075j2940k8302m3569n8015p1086q2176r0585r5962r8487r8379r5609
59959D062965r0298q3096p4722o5442n5370m5040l5086k5360j4938l123R829K3091
59947C603410L6051M8555O0705P2614Q4205R5081J04661J12524J18444J21999
$$ plain form
60024 5615267 5666142 5724949 5787572 5849352 5906018 5954558 5993006 6019480 6031950 6029133 6011127
60013 6011127 5978759 5932592 5872986 5800802 5717430 5624180 5522209 5413042 5298506 5179985
60003 5179985 5058303 4934753 4811774 4692112 4577552 4468990 4367645 4275562 4194721 4125992
59993 4125992 4069201 4024124 3991152 3971031 3964060 3969672 3986880 4015109 4054425 4104782 4165153 4233544
59981 4233544 4307718 4385619 4465140 4543766 4618560 4686341 4743967 4788885 4819710 4836128 4838075
59970 4838075 4825135 4796833 4753264 4695249 4624163 4541987 4451402 4355440 4256953 4158574 4062965
59959 4062965 3972667 3889571 3814849 3749407 3694037 3648997 3613911 3588551 3573613 3570490 3580319 3603410
59947 3603410 3639461 3688016 3748721 3821335 3905540 4000621 4105282 4217806 4336250 4458249
59937D458249J22408J19025J11935J01849Q9374P4652N7841L9735K1509L772j3774
59926E186575l1437m8594o3983p6835q7136r4767r9052r9508r6568r1057q3375
59915D314263p3771o2996n1901m0431k7813j3930K04J3594K6204L8290M9402N8766
59903D229881O6384P2953P8634Q2562Q3897Q2929Q0649P7434P2769O6342N8879
59892E053313N1493M4617L8148L2488K8573K6677K6015K6135K8100L3486M2479
59881E431524N3879O6820Q1639R8825J17976J38211J58989J80105K01232K21871
59871F751071K41356K58539K71789K79602K80948K74815K59917K35396K01522
59862I054955J59308J09827N4526l886o1697j15441j62729k02030k32415k53781
$$ plain form
59937 4458249 4580657 4699682 4811617 4913466 5002840 5077492 5135333 5175068 5196577 5200349 5186575
59926 5186575 5155138 5106544 5042561 4965726 4878590 4783823 4684771 4585263 4488695 4397638 4314263
59915 4314263 4240492 4177496 4125595 4085164 4057351 4043421 4043625 4057219 4083423 4121713 4171115 4229881
59903 4229881 4296265 4369218 4447852 4530414 4614311 4697240 4777889 4855323 4928092 4994434 5053313
59892 5053313 5104806 5149423 5187571 5220059 5248632 5275309 5301324 5327459 5355559 5389045 5431524
59881 5431524 5485403 5552223 5633862 5732687 5850663 5988874 6147863 6327968 6529200 6751071
59871 6751071 6992427 7250966 7522755 7802357 8083305 8358120 8618037 8853433 9054955
59862 9054955 9214263 9324090 9378616 9374730 9313033 9197592 9034863 8832833 8600418 8346637
59852H346637k66850k72444k70954k62821k49293k32273k13355j93178j71766
59843F213703j49156j25592j01389p7029n3317l0964r879J0730L1168N0483O7224
59832E825982Q0804R1512R9262J02990J01424R4053Q1014O2521L8859J0777k0379
59821F568819n2874q4876j14845j41836j65254j84250j97813k05766k09231k09578
59811E002496k07129k01388j92433j81378j69397j56852j43704j30355j17585
59802C502275j05750r4441q3115p1915o1738n3498m7367m2762l8984l5825l3578
59791B833302l2502l2301l2151l1243k9346k6820k4059k1151j8117j5267j3073
59780B557272j1772j1362j1951j3769j6828k0776k5050k8983l1814l2963l2449
$$ plain form
59852 8346637 8079787 7807343 7536389 7273568 7024275 6792002 6578647 6385469 6213703
59843 6213703 6064547 5938955 5837566 5760537 5707220 5676256 5666377 5677107 5708275 5758758 5825982
59832 5825982 5906786 5998298 6097560 6200550 6301974 6396027 6477041 6539562 6578421 6589198 6568819
59821 6568819 6515945 6431069 6316224 6174388 6009134 5824884 5627071 5421305 5212074 5002496
59811 5002496 4795367 4593979 4401546 4220168 4050771 3893919 3750215 3619860 3502275
59802 3502275 3396525 3302084 3218969 3147054 3085316 3031818 2984451 2941689 2902705 2866880 2833302
59791 2833302 2800800 2768499 2736348 2705105 2675759 2648939 2624880 2603729 2585612 2570345 2557272
59780 2557272 2545500 2534138 2522187 2508418 2491590 2470814 2445764 2416781 2384967 2352004 2319555
59769B319555l0826k8646k6114k3231j9948j6140j1694o787j916K504O389R884
59757B173030J3135J6162J8863K1259K3855K7438L2093L6718M0075M2154M3831
59746B488613M5238M5325M3342L9900L6148L2462K8508K4181J9891J6080J2994
59735B832682J0831R822J0157J1997J5397K0112K5684L1819L8582M6183N4893
59724C108159O5052P6775Q9613J02956J16733J31254J46457J62062J78434J96276
59714D373771K15073K32593K46254K54100K53878K42219K15909J74132J19326
59705F327255N6687o837o4255j10856j45134j67371j78156j78868j72455j62126
59695E197884j49415j34370j17279r9066q0334o1338m2832k5861j0516M184J8985
$$ plain form
59769 2319555 2288729 2260083 2233969 2210738 2190790 2174650 2162956 2156169 2154253 2156757 2163146 2173030
59757 2173030 2186165 2202327 2221190 2242449 2266304 2293742 2325835 2362553 2402628 2444782 2488613
59746 2488613 2533851 2579176 2622518 2662418 2698566 2731028 2759536 2783717 2803608 2819688 2832682
59735 2832682 2843513 2853335 2863492 2875489 2890886 2910998 2936682 2968501 3007083 3053266 3108159
59724 3108159 3173211 3249986 3339599 3442555 3559288 3690542 3836999 3999061 4177495 4373771
59714 4373771 4588844 4821437 5067691 5321791 5575669 5817888 6033797 6207929 6327255
59705 6327255 6383942 6377105 6312850 6201994 6056860 5889489 5711333 5532465 5360010 5197884
59695 5197884 5048469 4914099 4796820 4697754 4617420 4556082 4513250 4487389 4476873 4481057 4500042
59684D500042L3799M8404O2864P7183R1329J05679J20702J36124J51324J66521
59674E493971J82671K00178K18622K37960K58784K81134L04146L27435L51777
59665G856678L77656M03982M29087M52363M74055M93765N09979N20934N25498
59656A2043997N23373N14944N00982M82496M61112M39548M20966M07408L99243
59647A6194069L96230L98377M05176M14578M23472M29052M29325M22608M07168
59638A9920055L81552L45159K98730K44408J85087J23616O2797N894m3702q3658
59628B1439938j12939j30823j36519j30173j13390q7880n4292j3120L3946Q4828
59618B0779576J38793J96150K56152L16534L75353M32118M86257N35218N74867
$$ plain form
59684 4500042 4533841 4582245 4645109 4722292 4813621 4919300 5040002 5176126 5327450 5493971
59674 5493971 5676642 5876820 6095442 6333402 6592186 6873320 7177466 7504901 7856678
59665 7856678 8234334 8638316 9067403 9519766 9993821 10487586 10997565 11518499 12043997
59656 12043997 12567370 13082314 13583296 14065792 14526904 14966452 15387418 15794826 16194069
59647 16194069 16590299 16988676 17393852 17808430 18231902 18660954 19090279 19512887 19920055
59638 19920055 20301607 20646766 20945496 21189904 21374991 21498607 21561404 21567298 21523596 21439938
59628 21439938 21326999 21196176 21059657 20929484 20816094 20728214 20673922 20660802 20694748 20779576
59618 20779576 20918369 21114519 21370671 21687205 22062558 22494676 22980933 23516151 24091018
59609B4091018O01228O10952O00382N65405N02824M11754K93856J53188l525j66978
59599B7660104l26805m73705o00526p02167p75774q21515q42442q42732q25987
59590B1448451p95412p55075p10188o66222o28159o00353n86079n86490n99827
59581A5520646o21362o44212o61264o67861o63181o48846o26539n97529n63877
59572I825975n28413m93014m57842m22755l88572l56319l26156k97809k71432
59563F283663k47298k25088k04320j85063j67569j51556j36543j22647j10376
59554D733203r9842r0775q3015p6446p0812o6277o3741o3832o5777o8130p0367
59543C914189p2904p5661p7695p8420p8218p7527p6134p3756p0588o6873o2511
$$ plain form
59609 24091018 24692246 25303198 25903580 26468985 26971809 27383563 27677419 27830607 27827082 27660104
59599 27660104 27333299 26859594 26259068 25556901 24781127 23959612 23117170 22274438 21448451
59590 21448451 20653039 19897964 19187776 18521554 17893395 17293042 16706963 16120473 15520646
59581 15520646 14899284 14255072 13593808 12925947 12262766 11613920 10987381 10389852 9825975
59572 9825975 9297562 8804548 8346706 7923951 7535379 7179060 6852904 6555095 6283663
59563 6283663 6036365 5811277 5606957 5421894 5254325 5102769 4966226 4843579 4733203
59554 4733203 4633361 4542586 4459571 4383125 4312313 4246036 4182295 4118463 4052686 3984556 3914189
59543 3914189 3841285 3765624 3687929 3609509 3531291 3453764 3377630 3303874 3233286 3166413 3103902
59532C103902n7527n2315m7040m1348l5192k9301k4212j9391j4058q467l469R19
59520B772501N445J0135J3934J6309J8194K0679K3421K5205K5776K6118K7044
59509B984761K8416K9936L1911L4754L8351M2463M7347N3336O0063O6763P3290
59498C491391Q0309Q8414R7520J07204J17240J27595J38223J49081J60100J71036
59488D728113J81454J90953J99310K06338K11783K15334K16661K15483K11736
59479F577165K05575J97092J86346J73772J60143J45634J29404J10924R1494P3578
59469H051127N8586M6133L5532K7063K1386J8718J9247K3583L1864M2810N4458
59458H430507O5630P5981Q4691Q9876Q9332Q1506O5816M2611J3065k1177n8516
$$ plain form
59532 3103902 3046375 2994060 2947020 2905672 2870480 2841179 2816967 2797576 2783518 2775051 2771582 2772501
59520 2772501 2777946 2788081 2802015 2818324 2836518 2857197 2880618 2905823 2931599 2957717 2984761
59509 2984761 3013177 3043113 3075024 3109778 3148129 3190592 3237939 3291275 3351338 3418101 3491391
59498 3491391 3571700 3660114 3757634 3864838 3982078 4109673 4247896 4396977 4557077 4728113
59488 4728113 4909567 5100520 5299830 5506168 5717951 5933285 6149946 6365429 6577165
59479 6577165 6782740 6979832 7166178 7339950 7500093 7645727 7775131 7886055 7977549 8051127
59469 8051127 8109713 8155846 8191378 8218441 8239827 8258545 8277792 8301375 8333239 8376049 8430507
59458 8430507 8496137 8572118 8656809 8746685 8836017 8917523 8983339 9025950 9039015 9017838 8959322
59447H959322r7638j37399j76532k13291k45368k70629k88223k98765l03162l01718
59437F626597k94624k82803k67586k49880k30296k09959j90315j72013j54538
59428D574583j37205j19961j03026q6356o9962n4397m0276k7268j4185l33J3686
59417C935300K6856L9220N1777O4951P7962R0069J01751J13875J26115J37130
59407D765006J46097J53114J58038J60022J58496J53562J44856J30936J10728
59398F080855Q5023N5779K4404q520m2155p5011j05575j32728j55649j73905j87626
59387E364892j97094k02325k03448k01170j96338j89265j80178j70043j60068
59378C664963j50453j40439j29718j18955j08740r8828q8889p9379p1059o3976
$$ plain form
59447 8959322 8861684 8724285 8547753 8334462 8089094 7818465 7530242 7231477 6928315 6626597
59437 6626597 6331973 6049170 5781584 5531704 5301408 5091449 4901134 4729121 4574583
59428 4574583 4437378 4317417 4214391 4128035 4058073 4003676 3963400 3936132 3921947 3921614 3935300
59417 3935300 3962156 4001376 4053153 4118104 4196066 4286135 4387886 4501761 4627876 4765006
59407 4765006 4911103 5064217 5222255 5382277 5540773 5694335 5839191 5970127 6080855
59398 6080855 6165878 6221657 6246061 6237541 6195386 6120375 6014800 5882072 5726423 5552518 5364892
59387 5364892 5167798 4965473 4762025 4560855 4364517 4175252 3995074 3825031 3664963
59378 3664963 3514510 3374071 3244353 3125398 3016658 2917830 2828941 2749562 2678503 2614527
59368B614527n7445n0846m4103l7478l1234k5490k0215j5313j0736o458k371J619
59356B314457N439Q901J2008J5026J8320K2076K6091K9547L1209L0343K7605K4846
59344B565868K3872K5466K9377L4892M1229M7774N4315O1025O7903P4297P9240
59333C105258Q2624Q5834R0900R8879J09390J21737J35862J51796J68796J85971
59323D337047K03606K22889K44241K66790K89774L13441L37946L62162L84361
59314F962257M03491M18965M29653M33978M30909M20193M01989L77085L47403
59305A0625923L15457K83119K51254K20365J90863J62762J35687J09234Q2780
59296A2377444N5190K5429o488l9749p4003j09516j45871j81224k13287k40632
$$ plain form
59368 2614527 2557082 2506236 2462133 2424655 2393421 2367931 2347716 2332403 2321667 2315209 2312838 2314457
59356 2314457 2319896 2328797 2340805 2355831 2374151 2396227 2422318 2451865 2483074 2513417 2541022 2565868
59344 2565868 2589740 2615206 2644583 2679475 2720704 2768478 2822793 2883818 2951721 3026018 3105258
59333 3105258 3187882 3273716 3364616 3463495 3572885 3694622 3830484 3982280 4151076 4337047
59323 4337047 4540653 4763542 5007783 5274573 5564347 5877788 6215734 6577896 6962257
59314 6962257 7365748 7784713 8214366 8648344 9079253 9499446 9901435 10278520 10625923
59305 10625923 10941380 11224499 11475753 11696118 11886981 12049743 12185430 12294664 12377444
59296 12377444 12432634 12458063 12451575 12411826 12337823 12228307 12082436 11901212 11687925 11447293
59286A1447293k62907k80394k93887l04569l13428l20761l26416l30295l32432
59277H682204l32694l30696l26004l18375l07911k95038k80297k64152k47049
59268E979988k29487k11836j94173j76485j59005j42150j26194j11085r6548q2319
59258D450706o8481n5615m4281l4267k4760j5396o662R72P700J3671J8346K1225
59246D263158K2709K3443K3244K1519J8408J4479R523K887m912j2056j7261k0844
59234D344297k3609k5617k6556k6479k5452k3025j8816j3180o714O05R137J8627
59222D183218K8265L7694M7415N7891O8630P8524Q7024R4567J01685J07939J12216
59211E005068J14028J13843J11869J07128R8348Q5415O9254N0648L0070Q709j1281
$$ plain form
59286 11447293 11184386 10903992 10610105 10305536 9992108 9671347 9344931 9014636 8682204
59277 8682204 8349510 8018814 7692810 7374435 7066524 6771486 6491189 6227037 5979988
59268 5979988 5750501 5538665 5344492 5168007 5009002 4866852 4740658 4629573 4533025 4450706
59258 4450706 4382225 4326610 4282329 4248062 4223302 4207906 4201244 4202216 4209916 4223587 4241933 4263158
59246 4263158 4285867 4309310 4332554 4354073 4372481 4386960 4396483 4399370 4394458 4382402 4365141 4344297
59234 4344297 4320688 4295071 4268515 4242036 4216584 4193559 4174743 4161563 4154849 4155454 4164591 4183218
59222 4183218 4211483 4249177 4296592 4354483 4423113 4501637 4588661 4683228 4784913 4892852 5005068
59211 5005068 5119096 5232939 5344808 5451936 5550284 5635699 5704953 5755601 5785671 5794380 5783099
59200E783099k7982m0796n0226n7033o1828o5055o7098o8432o9589p0724p1421
59189E132915p1364p1022p1114p1548p1484p0396o8411o5593o1724n6868n1434
59178D401957m5361l7947k8825j8483p469M410J7674L2348M8075O4696Q2309J00928
59166D614312J20365J40356J60575J80734K00619K19836K37342K51491K60552
59157F386182K63021K57583K43342K20219J88845J49935J04195N2819k244n8638
59147G805259j13902j65527k11192k49109k78013k97228l07240l09862l07051
59138E566135k99533k87347k71513k54078k36361k18174j99265j80546j63215
59129C456103j47475j32853j19311j07173r6270q5969p5977o6631n8356n1221
$$ plain form
59200 5783099 5755117 5714321 5664095 5607062 5545234 5480179 5413081 5344649 5275060 5204336 5132915
59189 5132915 5061551 4990529 4919415 4847867 4776383 4705987 4637576 4571983 4510259 4453391 4401957
59178 4401957 4356596 4318649 4289824 4271341 4263872 4268282 4285956 4318304 4366379 4431075 4513384 4614312
59166 4614312 4734677 4875033 5035608 5216342 5416961 5636797 5874139 6125630 6386182
59157 6386182 6649203 6906786 7150128 7370347 7559192 7709127 7813322 7866141 7863897 7805259
59147 7805259 7691357 7525830 7314638 7065529 6787516 6490288 6183048 5873186 5566135
59138 5566135 5266602 4979255 4707742 4453664 4217303 3999129 3799864 3619318 3456103
59129 3456103 3308628 3175775 3056464 2949291 2853021 2767052 2691075 2624444 2566088 2514867
59119B514867m5023l9462l4191k8888k3398j7815j2494p807l727J91M258Q250
59107B314761J1839J5089J8229K1249K4299K7960L2462L6924M0303M2859M5704
59096B631678M9040N1959N4096N6128N8246N9331N8374N5846N2907M9850M6015
59085C223470M0821L4254K6726J8846J1149L825l005q898j3505j7252k0741k3495
59073C272195k4367k3331k1710k0175j7757j3471p788j675M832J2112J9856K7536
59061C206257L5375M3782N2382O0548O8531P7055Q6125R5090J03663J12044J20171
59050D061023J27766J34956J42205J49542J56454J62442J67171J70088J70343
59041E441990J67185J60182J49117J33780J13755Q8461N7875K3350j2776m8567
$$ plain form
59119 2514867 2469844 2430382 2396191 2367303 2343905 2326090 2313596 2305789 2302062 2302253 2306511 2314761
59107 2314761 2326600 2341689 2359918 2381167 2405466 2433426 2465888 2502812 2543115 2585974 2631678
59096 2631678 2680718 2732677 2786773 2842901 2901147 2960478 3018852 3074698 3127605 3177455 3223470
59085 3223470 3264291 3298545 3325271 3344117 3355266 3359091 3356086 3347188 3333683 3316431 3295690 3272195
59073 3272195 3247828 3224497 3202787 3182612 3164855 3151384 3143596 3141921 3146753 3158865 3178721 3206257
59061 3206257 3241632 3285414 3337796 3398344 3466875 3543930 3630055 3725145 3828808 3940852 4061023
59050 4061023 4188789 4323745 4465950 4615492 4771946 4934388 5101559 5271647 5441990
59041 5441990 5609175 5769357 5918474 6052254 6166009 6254470 6312345 6335695 6322919 6274352
59031F274352q3012j15240j43959j68063j87135k01102k10114k14935k16669k15722
59021D518401k11885k05641j98263j90197j80704j69773j59056j49804j41155
59012B911923j31865j22555j14659j07929j00850r3147q6085q0314p5000o9421
59002A930098o4024n9441n5540n1899m8401m4989m1478l7946l4842l2390l0307
58991A428841k8218k6078k4108k2587k1656k1057k0279j9102j7769j6460j5099
58980A196428j3839j3047j2495j1303r169o884n111l554j923p25j59P48K717M889
58966A126573O063O513P181P858P735P140P054P205O389M592L102K447J881J114
58952A202847R14J553K165K246K537L740N336O377O634O385N810N078M454L892
$$ plain form
59031 6274352 6191340 6076100 5932141 5764078 5576943 5375841 5165727 4950792 4734123 4518401
59021 4518401 4306516 4100875 3902612 3712415 3531711 3361938 3202882 3053078 2911923
59012 2911923 2780058 2657503 2542844 2434915 2334065 2240918 2154833 2074519 1999519 1930098
59002 1930098 1866074 1806633 1751093 1699194 1650793 1605804 1564326 1526380 1491538 1459148 1428841
58991 1428841 1400623 1374545 1350437 1327850 1306194 1285137 1264858 1245756 1227987 1211527 1196428
58980 1196428 1182589 1169542 1157047 1145744 1136575 1129691 1124580 1121026 1119103 1118378 1118219 1118967 1121684 1126573
58966 1126573 1132636 1139149 1146330 1154188 1161923 1169063 1176117 1183322 1189711 1194303 1197405 1199852 1201733 1202847
58952 1202847 1203761 1205314 1207479 1209725 1212262 1216002 1221338 1227715 1234349 1240734 1246544 1251622 1256076 1259968
58938A259968K976J526j22j513k345k433j952j593j794k076j760j073o35k33Q58
58923A247799K542M000N053O281P797R035R786J0371J0811J0933J1275J2655J4790
58910A363128J6566J7739J9057K0608K1556K1861K2699K4587K6424K7182K7331
58899A608738K7843K8861L0075L1476L2932L3928L4450L5355L7172L9336M1209
58888A981375M3095M5622M8829N2446N6417O0581O4568O8522P3195P8832Q4748
58877B658230R0492R6557J03362J10370J17028J23780J31416J40001J49231J59272
58867C879739J70540J83020J96409K10586K25576K41458K58615K77506K97893
58858E941342L18996L40537L62874L85903M08775M31017M52767M73432M91187
$$ plain form
58938 1259968 1262944 1264470 1264348 1262835 1260490 1258057 1256105 1254512 1252718 1250642 1248882 1247809 1247174 1246941 1247799
58923 1247799 1250341 1254341 1259394 1265675 1273472 1282507 1292293 1302664 1313475 1324408 1335683 1348338 1363128
58910 1363128 1379694 1397433 1416490 1437098 1458654 1480515 1503214 1527801 1554225 1581407 1608738
58899 1608738 1636581 1665442 1695517 1726993 1759925 1793853 1828303 1863658 1900830 1940166 1981375
58888 1981375 2024470 2070092 2118921 2171367 2227784 2288365 2352933 2421455 2494650 2573482 2658230
58877 2658230 2748722 2845279 2948641 3059011 3176039 3299819 3431235 3571236 3720467 3879739
58867 3879739 4050279 4233299 4429708 4640294 4865870 5107328 5365943 5643449 5941342
58858 5941342 6260338 6600875 6963749 7349652 7758427 8189444 8642211 9115643 9606830
58849I606830N04444N12604N14590N07943M90381M61253M20381L66624K99226
58840A3684276K20032J32932M1603n0939j41045k24534k98350l61200m12428m51378
58830A2138969m78097m93755m99953m98087m89476m75562m57699m36979m14295
58821G895066l90344l65727l41251l17772k95591k74442k54449k36529k21212
58812E197749k07595j94222j80764j68098j56876j46729j36839j26770j16627
58803C763229j06847r7886q9940q2851p6361p0240o4170n7928n1748m6040m0625
58792B978593l4788k8345k2027j6472j1492o604j658L555R528J6248K2781K8319
58780B937638L3175L8207M3686M9448N5525O1980O8472P4741Q1203Q8474R6553
$$ plain form
58849 9606830 10111274 10623878 11138468 11646411 12136792 12598045 13018426 13385050 13684276
58840 13684276 13904308 14037240 14078843 14027904 13886859 13662325 13363975 13002775 12590347 12138969
58830 12138969 11660872 11167117 10667164 10169077 9679601 9204039 8746340 8309361 7895066
58821 7895066 7504722 7138995 6797744 6479972 6184381 5909939 5655490 5418961 5197749
58812 5197749 4990154 4795932 4615168 4447070 4290194 4143465 4006626 3879856 3763229
58803 3763229 3656382 3558496 3468556 3385705 3309344 3239104 3174934 3117006 3065258 3019218 2978593
58792 2978593 2943805 2915460 2893433 2876961 2865469 2858865 2857207 2860762 2870290 2886538 2909319 2937638
58780 2937638 2970813 3009020 3052706 3102154 3157679 3219659 3288131 3362872 3444075 3532549 3629102
58769C629102J05010J13608J22230J30732J39460J49441J61329J74533J88091
58760D913536K02035K17124K33688K51531K70778K91750L14068L36685L58963
58751G390158L81100M03323M25177M45692M63734M78050M87169M89386M82812
58742A1446601M65639M36587L94975L40425K73094J94526J07930J7251p3818j61889
58732A3441321k43656l16279l77830m27224m64115m89122n03578n08797n05881
58723I604839m96290m81789m63538m42045m18330l94211l70913l48232l25761
58714E863730l04048k83824k64948k47099k30797k16602k03914j91585j79375
58705C741538j67852j57231j47208j37674j28672j19845j10853j02091r4292q7569
$$ plain form
58769 3629102 3734112 3847720 3969950 4100682 4240142 4389583 4550912 4725445 4913536
58760 4913536 5115571 5332695 5566383 5817914 6088692 6380442 6694510 7031195 7390158
58751 7390158 7771258 8174581 8599758 9045450 9509184 9987234 10474403 10963789 11446601
58742 11446601 11912240 12348827 12743802 13084227 13357321 13551847 13659777 13677028 13603210 13441321
58732 13441321 13197665 12881386 12503556 12076332 11612217 11123095 10619517 10110720 9604839
58723 9604839 9108549 8626760 8163222 7721177 7302847 6908636 6537723 6189491 5863730
58714 5863730 5559682 5275858 5010910 4763811 4533014 4316412 4112498 3920913 3741538
58705 3741538 3573686 3416455 3269247 3131573 3002901 2883056 2772203 2670112 2575820 2488251
58695B488251q1492p5848p0612o5545o0518n5895n1955m8316m4573m1022l8016
58684A854459l5215l2293k9758k8094k6650k4581k2344k1067k0777k0577k0303
58673A572800k0583k1318k1510k0755j9762j9163j8974j9334k0543k2072k2733
58662A346053k2261k1843k2482k3737k4554k4576k4097k3377k2637k2185k2030
58651A092274k1698k0856j9816j9104j8743j8343j7638j6660j5482j4099j2657
58640H97178j1642j1581j2303j2785j2172j0937j0376j0868j1401j1032r980q842
58628G63259p622o243n194m782m389l392k244j604j029K83J880K395J345m85k215
58613G29963l370l493k391q06J93N01P48J027R30O85J010J789K089J660J253J227
$$ plain form
58695 2488251 2406759 2330911 2260299 2194754 2134236 2078341 2026386 1978070 1933497 1892475 1854459
58684 1854459 1819244 1786951 1757193 1729099 1702449 1677868 1655524 1634457 1613680 1593103 1572800
58673 1572800 1552217 1530899 1509389 1488634 1468872 1449709 1430735 1411401 1390858 1368786 1346053
58662 1346053 1323792 1301949 1279467 1255730 1231176 1206600 1182503 1159126 1136489 1114304 1092274
58651 1092274 1070576 1049720 1029904 1010800 992057 973714 956076 939416 923934 909835 897178
58640 897178 885536 873955 861652 848867 836695 825758 815382 804514 793113 782081 772101 763259
58628 763259 755637 749394 744200 739418 735029 731637 729393 727789 726760 727043 728923 731318 732663 732178 729963
58613 729963 726593 723100 720709 719903 720096 720597 721345 722372 723302 723987 724997 726786 728875 730535 731788 733015
58597G33015R34m7j100j471j154m20P46K296L777M855N712O634P605Q570R699
58582G79651J1157J2881J4644J6163J7275J8317K0040K2660K5288K6896K7590
58571I92562K8352K9810L1915L4488L7336M0117M2836M6252N1014N6666O2291
58560A453639O7736P3480P9676Q6313R3858J02574J11552J19596J26753J33817
58550B448994J40605J46044J49631J51174J49280J41854J28448J10491Q8877O2978
58540C718376L2860R30k9559n6758q0228r9744j14969j25787j32328j35039j34946
58529B842808j33112j29667j24175j17118j09991j03577r7150q9840q1884p3985
58519A782309o6378n9105n2506m6845m1963l7815l4704l2618l0859k8690k5999
$$ plain form
58597 733015 733949 733902 732802 731331 730177 729757 730503 732799 736576 741431 747143 753777 761382 769952 779651
58582 779651 790808 803689 818333 834496 851771 870088 890128 912788 938076 964972 992562
58571 992562 1020914 1050724 1082639 1117127 1154463 1194580 1237416 1283668 1334682 1391348 1453639
58560 1453639 1521375 1594855 1674531 1760844 1854702 1957276 2068828 2188424 2315177 2448994
58550 2448994 2589599 2735643 2885274 3036448 3185728 3327582 3456030 3566521 3655398 3718376
58540 3718376 3751236 3752166 3722607 3665849 3585621 3485877 3370908 3245121 3112793 2977754 2842808
58529 2842808 2709696 2580029 2455854 2338736 2228745 2125168 2028018 1938178 1856294 1782309
58519 1782309 1715931 1656826 1604320 1557475 1515512 1477697 1442993 1410375 1379516 1350826 1324827
58508A324827k3150k0701j9191j8579j7957j6604j5246j5246j6653j8124j8893
58497A124483j9592k0823k2113k2804k2903k2524k1452j9795j8251j7168j6099
58486I00959j4704j3337j2360j1589j0789r985r059p772o455n788n813n957o168
58473G81183o914p958q326p830p404p558p715p537p664q520r548j0210j0655j0847
58459F62497j0271r165q735r306r541q457p018o482o320n166l134j746j834k726
58445E72596l369l317k653j675p17R1Q00J242J155Q08Q81J484J927J817J614J746
58429E74430J975K038K162K461K618K533K547K606K115J064M56R04J732K028J872
58414F03541J790J691J132J62p81j445j863k221k867l947m980n370n361n643o076
$$ plain form
58508 1324827 1301677 1280976 1261785 1243206 1225249 1208645 1193399 1178153 1161500 1143376 1124483
58497 1124483 1104891 1084068 1061955 1039151 1016248 993724 972272 952477 934226 917058 900959
58486 900959 886255 872918 860558 848969 838180 828195 819136 811364 804909 799121 793308 787351 781183
58473 781183 774269 766311 757985 750155 742751 735193 727478 719941 712277 703757 694209 683999 673344 662497
58459 662497 652226 643061 634326 625020 615479 607022 600004 593522 587202 582036 578902 577156 575322 572596
58445 572596 569227 565910 563257 561582 560865 560956 561756 562998 564153 564961 565842 567326 569253 571070 572684 574430
58429 574430 576405 578443 580605 583066 585684 588217 590764 593370 595485 596549 597005 597909 599641 601669 603541
58414 603541 605331 607022 608154 608316 607535 606090 604227 602006 599139 595192 590212 584842 579481 573838 567762
58399E67762n855n018m501m511m127k934j727j079n51J02K46l52p58l03L59M22
58383E37175K04L69Q11J184J679K491L296L941M794N847O306N782M924M324L697
58368E86824K732J778J081L20n21q29m37K7L42J087K326L227L491L843M523M741
58352F14555M309M244M922N259M704M373N106N905N657M932M623M202K803R63
58338F76557k45q92j649k425k824l131l670l975l630l059k687k256j689j511j570
58323F41344q21Q01J825J558J274J886K280J469N77R31J722J481O12M69J104J723
58307F60235K387L426M125L801L258L606M498N064N522O333O852O548O371P250
58293G29276Q255Q003O863O065N674N141M793N029N054M143L054K639K203R82
$$ plain form
58399 567762 561907 556889 552388 547877 543750 540816 539089 538010 537459 537561 537807 537455 536697 536394 536753 537175
58383 537175 537379 537748 538559 539743 541422 543913 547209 551150 555944 561791 568097 573879 578803 583127 586824
58368 586824 589556 591334 592415 592735 592214 591385 590948 590975 591317 592404 594730 597957 601448 605291 609814 614555
58352 614555 618864 623108 628030 633289 637993 642366 647472 653377 659034 663966 668589 672791 675594 676557
58338 676557 676312 675420 673771 671346 668522 665391 661721 657746 654116 651057 648370 646114 644425 642914 641344
58323 641344 640523 641324 643149 644707 645981 647867 650147 651616 652193 653124 654846 656327 656939 657408 658512 660235
58307 660235 662622 666048 670173 673974 677232 680838 685336 690400 695922 702255 709107 715655 722026 729276
58293 729276 737531 745534 752397 758462 764136 769277 774070 779099 784153 788296 791350 793989 796192 797174
58279G97174j04rM86L25L22J623L334L897L765M402N666O442O897P905R104R661
58263H60890J0075J1182J2321J2503J2305J2621J2801J2126J1747J2802J3980
58252I95353J3534J2376J2533J3741J4348J4414J4994J5427J4336J2523J1864
58241A145443J2034J1312R948R807J1117J2385J3109J3944J4668J4595J4441J5357
58229A298160J6676J7080J7103J8137J9903K1398K3074K5536K7500K7845K8156
58218A540568L0252L2825L3818L4373L6758L9921M1218M1224M2671M5635M7965
58207A967228M9583N2151N5141N6538N6896N8697O2211O5791O9451P4152P8525
58196B646364Q0610Q1940Q5596R1161R5919R9982J05544J12197J17782J22819
$$ plain form
58279 797174 797070 797061 797547 797872 798194 799817 803151 807048 810813 815215 820881 827323 834220 842125 851229 860890
58263 860890 870965 882147 894468 906971 919276 931897 944698 956824 968571 981373 995353
58252 995353 1008887 1021263 1033796 1047537 1061885 1076299 1091293 1106720 1121056 1133579 1145443
58241 1145443 1157477 1168789 1178737 1188544 1199661 1212046 1225155 1239099 1253767 1268362 1282803 1298160
58229 1298160 1314836 1331916 1349019 1367156 1387059 1408457 1431531 1457067 1484567 1512412 1540568
58218 1540568 1570820 1603645 1637463 1671836 1708594 1748515 1789733 1830957 1873628 1919263 1967228
58207 1967228 2016811 2068962 2124103 2180641 2237537 2296234 2358445 2424236 2493687 2567839 2646364
58196 2646364 2726974 2808914 2894510 2985671 3081590 3181572 3287116 3399313 3517095 3639914
58186C639914J29273J36185J41664J47736J57522J69099J78267J86065J97002
58177E082727K10889K23540K34990K49700K68665K88511L08577L31724L57870
58168G557193L83788M09571M38232M68944M97983N26252N58162N93540O28820
58159A2062485O65847P10433P62429Q16519Q72699R35958J005764J076887J151133
58150B0060154J237116J337954J450936J579592J733437J916143K128554K383121
58142C3827007K697845L073700L495789L959967M481173N075093N753634O539069
58134F8903277P453225Q484056R591180J0758759J2028604J3490679J5261086
58127A45970866J7384989J9559932K0851619J9874019J5619230Q355027k87544
$$ plain form
58186 3639914 3769187 3905372 4047036 4194772 4352294 4521393 4699660 4885725 5082727
58177 5082727 5293616 5517156 5752146 6001846 6270511 6559022 6867599 7199323 7557193
58168 7557193 7940981 8350552 8788784 9257728 9755711 10281963 10840125 11433665 12062485
58159 12062485 12728332 13438765 14201194 15017713 15890412 16826370 17832134 18909021 20060154
58150 20060154 21297270 22635224 24086160 25665752 27399189 29315332 31443886 33827007
58142 33827007 36524852 39598552 43094341 47054308 51535481 56610574 62364208 68903277
58134 68903277 76356502 84840558 94431738 105190497 117219101 130709780 145970866
58127 145970866 163355855 182915787 203767406 223641425 239260655 247615682 247328138
58120B47328138q208119j3940099j7107321j8137631j7747412j6609282j5220532
58113A40357742j3859387j2610156j1453849j0353131r280577q221837p188031
58106F7390774o215633n337579m560181l873657l270505k742406k271258j838603
58098C7280952j439561j076532p42061m16673p9982K84656O86445J098097J411670
58089C7007011J444425J040614K09720q31844j777451k409902k688330k696828
58081B9297415k546497k325720k097379j897485j730256j581248j439879j304343
58073A4374608j172402j041471r16695q07394p15226o34653n64037n06874m62391
58064G553465m24301l89716l61080l38350l17077k95498k76470k60828k45341
$$ plain form
58120 247328138 239120019 225179920 208072599 189934968 172187556 155578274 140357742
58113 140357742 126498355 113888199 102434350 92081219 82800642 74578805 67390774
58106 67390774 61175141 55837562 51277381 47403724 44133219 41390813 39119555 37280952
58098 37280952 35841391 34764859 34022798 33606125 33526143 33810799 34497244 35595341 37007011
58089 37007011 38451436 39492050 39701770 38869926 37092475 34682573 31994243 29297415
58081 29297415 26750918 24425198 22327819 20430334 18700078 17118830 15678951 14374608
58073 14374608 13202206 12160735 11244040 10436646 9721420 9086767 8522730 8015856 7553465
58064 7553465 7129164 6739448 6378368 6040018 5722941 5427443 5150973 4890145 4644804
58055D644804k28684k13438k00756j88556j76242j65943j57873j49502j40345
58046C023465j32788j27178j20905j13210j06281j00716r4488q7306q1475p7457
58036A981661p2931o7114o1893n7916n3770m9711m7802m7602m6018m2403l9474
58025A395027l8292l6710l3914l2096l2162l1993l0508k9552l0063l0096k8346
58014A041295k6280k5144k4138k2890k2506k2783k1699j8955j6777j5977j4633
58003H09513j1952r820r062p828n483m461o080p882p568o539o999q227q343p485
57989G01784o812o249n451n187n765n837m539l156k997l367l232l049l351l291
57975F39501k245j235j157j221n77R5J2l02l52p94j874k453j928j477k028k662
$$ plain form
58055 4644804 4416120 4202682 4001926 3813370 3637128 3471185 3313312 3163810 3023465
58046 3023465 2890677 2763499 2642594 2529384 2423103 2322387 2227899 2140593 2059118 1981661
58036 1981661 1908730 1841616 1779723 1721807 1668037 1618326 1570524 1522922 1476904 1434501 1395027
58025 1395027 1356735 1320025 1286111 1254015 1221853 1189860 1159352 1129800 1099737 1069641 1041295
58014 1041295 1015015 989871 965733 942843 920337 897554 875855 856900 840123 824146 809513
58003 809513 797561 787741 778679 770851 765368 760907 754827 746945 739377 732838 725839 717612 709269 701784
57989 701784 694972 688723 683272 678085 672320 666483 661944 658788 655791 652424 649192 646143 642792 639501
57975 639501 637256 636021 634864 633643 633066 633161 633173 632871 632519 631725 629851 627398 625470 623993 621965 619303
57959F19303k400j863j733j291p7O35l01j917k576k230j783j441j139j445k624
57944E97118l784m075l797l481k995k473k718l689m044l160k171j985j856j049
57930E55841l37n66j231j715k498l755m324l486k423k416k959l054l007l360l366
57915E17344k227p59k05l29j46L22M82M26M27K0j003j723j397p42o33o70l05k27
57897E08655j112k128k276k210l010m114m229l523l045k699j691m61k88j125j571
57882D75173r93j79J20o1n34j125j308p96l51q83j979k417k021j869k739m312
57866D53726n896p014p336o942o589o957p642p556o209m065j899k87N91J141J980
57851C89046L018L479L278L489M824O427P033O539N680M892M420M682N431N376
$$ plain form
57959 619303 616903 615040 613307 612016 611939 612574 612273 610356 607780 605550 603767 602326 601187 599742 597118
57944 597118 593334 589259 585462 581981 578986 576513 573795 570106 566062 562902 560731 558746 556890 555841
57930 555841 555504 554938 553707 551992 549494 545739 541415 537929 535506 533090 530131 527077 524070 520710 517344
57915 517344 515117 514358 514153 513824 513678 514000 514482 514908 515335 515355 514352 512629 511232 510490 509857 509187 508882 508655
57897 508655 507543 505415 503139 500929 497919 493805 489576 486053 483008 480309 478618 478157 477869 476744 475173
57882 475173 474180 474001 474121 474060 473526 472401 471093 470297 469946 469063 467084 464667 462646 460777 458038 453726
57866 453726 447830 440816 433480 426538 419949 412992 405350 397794 391585 387520 385621 385334 385925 387066 389046
57851 389046 392064 395543 398821 402310 407134 413561 420594 427133 432813 437705 442125 446807 452238 457614
57837D57614L845K084J657K138J821K94j185j734j816k061k404k684l091l678
57823D50800m118m154l842l316k794k679l136l725l885l622l222k675j831r18
57809D06883k92K1J95K98M43Q54J432J811K090K839L988M570M051L112K484J912
57793D36691R89N9n34j273k487l439l359k755k518k500k101j614j680j940j577
57778D09962q34o72j175j583j683j955k471k807l037l682m636n167n054m795m711
57763C65700m632m526m571m589m204l592l374l763m410m975n273n000m080l063
57749C05648k576k455k070j307o38l73m09m75k04P23K005K826K994L305M230N088
57733C16312N270N452O392P317O873N191L617K723J884P26l41j034j575k058k304
$$ plain form
57837 457614 461459 463543 465200 467338 469159 469453 468268 466534 464718 462657 460253 457569 454478 450800
57823 450800 446682 442528 438686 435370 432576 429897 426761 423036 419151 415529 412307 409632 407801 406883
57809 406883 406591 406612 406807 407105 407548 408402 409834 411645 413735 416574 420562 425132 429183 432295 434779 436691
57793 436691 437680 437739 437205 435932 433445 430006 426647 423892 421374 418874 416773 415159 413479 411539 409962
57778 409962 409128 408456 407281 405698 404015 402060 399589 396782 393745 390063 385427 380260 375206 370411 365700
57763 365700 361068 356542 351971 347382 343178 339586 336212 332449 328039 323064 317791 312791 308711 305648
57749 305648 303072 300617 298547 297240 296602 296229 295820 295345 295141 295864 297869 300695 303689 306994 311224 316312
57733 316312 321582 327034 333426 340743 347616 352807 356424 359147 361031 361757 361416 360382 358807 356749 354445
57718C54445k346k308k084j833k332l804n021m702l402k678k808k807k339k045
57704C13936k024j682j123j069j269n50J124K323K406K505L534M608M486L438
57690C30643K627K423K355K206K172K259K255K109J996J995K015J843J324P53
57676C58975Q02J634K343K075J353J401K363L284L777M397N247N577N233N245
57662D03706O225P288P431P142P633R046J0346J0811J0784J1038J1841J2793J3347
57649E29431J3478J3728J4460J5317J5842J6368J7659J9760K1925K3640K5104
57638G26712K6617K8272L0254L2793L5718L8722M1976M5862N0132N4261N8527
57627A169846O3730O9852P6122Q2503Q9937R8713J07775J16166J24011J31459
$$ plain form
57718 354445 352099 349791 347707 345874 343542 339738 334717 330015 326613 323935 321127 318320 315981 313936
57704 313936 311912 310230 309107 308038 306769 306219 307343 309666 312072 314577 318111 322719 327205 330643
57690 330643 333270 335693 338048 340254 342426 344685 346940 349049 351045 353040 355055 356898 358222 358975
57676 358975 359777 361411 363754 365829 367182 368583 370946 374230 378007 382404 387651 393228 398461 403706
57662 403706 409931 417219 424650 431792 439425 448471 458817 469628 480412 491450 503291 516084 529431
57649 529431 542909 556637 571097 586414 602256 618624 636283 656043 677968 701608 726712
57638 726712 753329 781601 811855 844648 880366 919088 961064 1006926 1057058 1111319 1169846
57627 1169846 1233576 1303428 1379550 1462053 1551990 1650703 1758478 1874644 1998655 2130114
57617B130114J37665J41677J43387J42736J38733J30251J17387J01213Q2671O2458
57607C328292M1478K0331j611k5695n2254p9714j05285j26176j40438j47429j47956
57596B563543j43761j36583j27538j17252j06387r5824q6162p7180o8219n9290
57586A545347n1275m4769l9213l3687k8086k2789j7687j2465p534l581k95L421
57574A287387P918J2414J6332K0034K4020K8318L3001L8404M4459N0494N6105
57563A618886O1639O7572P3908Q0344Q6483R1783R5909R8994J00846J00130R5306
57552B571800Q6253P3840N8048L8037J4401j0171l3106n3586p1427q5824r6203
57541B492062j03254j07944j10235j09701j06794j02616r7937r3107q8352q3514
$$ plain form
57617 2130114 2267779 2409456 2552843 2695579 2834312 2964563 3081950 3183163 3265834 3328292
57607 3328292 3369770 3390101 3388490 3362795 3310541 3230827 3125542 2999366 2858928 2711499 2563543
57596 2563543 2419782 2283199 2155661 2038409 1932022 1836198 1750036 1672856 1604637 1545347
57586 1545347 1494072 1449303 1410090 1376403 1348317 1325528 1307841 1295376 1287842 1284261 1283966 1287387
57574 1287387 1295305 1307719 1324051 1344085 1368105 1396423 1429424 1467828 1512287 1562781 1618886
57563 1618886 1680525 1748097 1822005 1902349 1988832 2080615 2176524 2275518 2376364 2476494 2571800
57552 2571800 2658053 2731893 2789941 2827978 2842379 2832208 2799102 2745516 2674089 2588265 2492062
57541 2492062 2388808 2280864 2170629 2060928 1954134 1851518 1753581 1660474 1572122 1488608
57531A488608p8078p2035o6172o0995n6139n1265m6718m2722l8867l5045l1919
57520I08653k9650k7253k4118k1225j9665j8836j7434j5541j4249j3718j2957
57509F94007j1433r632q058o749n776n263m842l904k446j060j52L60O96J195K301
57494F39244M014N660O727P472Q171Q441Q113Q130R458J1587J3282J4403J5814
57481G60516J7782J9784K1712K3909K5986K7159K7976L0283L4768L9806M3592
57470A073273M6496N0283N5651O1628O7075P1803P6117P9944Q2786Q4217Q4052
57459A833325Q2076P7764P0416N9523M5031K7451Q024j1315k8710m3367n5573
57448B064645o5655p3368p8466q1235q2106q1136p8320p4082o9025o3554n8022
$$ plain form
57531 1488608 1410530 1338495 1272323 1211328 1155189 1103924 1057206 1014484 975617 940572 908653
57520 908653 879003 851750 827632 806407 786742 767906 750472 734931 720682 706964 694007
57509 694007 682574 672942 664884 658135 652359 647096 642254 638350 635904 634844 634692 635052 635748 636943 639244
57494 639244 643258 648918 655645 663117 671288 679729 687842 695972 705430 717017 730299 744702 760516
57481 760516 778298 798082 819794 843703 869689 896848 924824 955107 989875 1029681 1073273
57470 1073273 1119769 1170052 1225703 1287331 1354406 1426209 1502326 1582270 1665056 1749273 1833325
57459 1833325 1915401 1993165 2063581 2123104 2168135 2195586 2203610 2192295 2163585 2120218 2064645
57448 2064645 1998990 1925622 1847156 1765921 1683815 1602679 1524359 1450277 1381252 1317698 1259676
57437A259676n2848m8124m3508l8875l4578l0778k7066k3225j9649j6591j3644
57426I10790j0575p860n587k728J410N751Q675J0198J1676J3727J5850J7900K0477
57413I89704K3749K7160L0508L4161L8053M1672M5281M9886N5540O0802O4475
57402A460991O6907O8902P0206O9809O7081O1843N3822M2684K8474J1694o696
57391A995717k5188m2178n6855o9190p8965q5481q8539q9054q8131q6087q2763
57380A203286p8326p3217o7774o2359n7445n3106m8801m4239l9968l6633l3960
57369F07458l1189k8284k5925k4358k2941k1051j8867j6958j5469j4076j2603
57358C75737j1341j0707j0721j0961j0911j0394r646r041q755q636q357p744o956
$$ plain form
57437 1259676 1206828 1158704 1115196 1076321 1041743 1010965 983899 960674 941025 924434 910790
57426 910790 900215 892355 886768 884040 885450 891201 899876 910074 921750 935477 951327 969227 989704
57413 989704 1013453 1040613 1071121 1105282 1143335 1185007 1230288 1280174 1335714 1396516 1460991
57402 1460991 1527898 1596800 1667006 1736815 1803896 1865739 1919561 1962245 1990719 2002413 1995717
57391 1995717 1970529 1928351 1871496 1802306 1723341 1637860 1549321 1460267 1372136 1286049 1203286
57380 1203286 1124960 1051743 983969 921610 864165 811059 762258 718019 678051 641418 607458
57369 607458 576269 547985 522060 497702 474761 453710 434843 417885 402416 388340 375737
57358 375737 364396 353689 342968 332007 321096 310702 301056 292015 283260 274624 266267 258523 251567
57345B51567o326o020n892n646n118m431m053m473n580o432o062m557k982k205
57331A81790k193k468k672k487j664n35P8j01l26N3N39K33p73j452j211m72L3
57314A66372mm87j172j851k444k907k955k265j174o33j059j711j782j515j591
57299A42822j861j584o45K36M60K5p50j399j408p95l04m52p72o67m81q28j324
57282A30273j159n99o75j450j859j350n11O2M16N46J77m84o93k25L85Q72J574
57265A25300K513L142L254L210L003K206J164J012J988K835K551J707J308J352
57251A56545J375J523K074K581K484K147K311K925L304L260L290L884N130O798
57237A99631Q359R240R529J0070J1412J3130J4567J5801J7292J9103K1125K3522
$$ plain form
57345 251567 245241 239221 233329 227683 222565 218134 214081 209608 204028 197596 191534 186977 183995 181790
57331 181790 179597 177129 174457 171970 170306 169771 169849 169748 169422 169475 170014 170247 169474 168022 166811 166339 166372
57314 166372 166368 165881 164709 162858 160414 157507 154552 152287 151113 150480 149421 147710 145928 144413 142822
57299 142822 140961 139377 138732 138968 139428 139453 138703 137304 135896 135101 134797 134345 133573 132906 132425 131597 130273
57282 130273 129114 128515 127840 126390 124531 123181 122670 122732 123148 123694 123871 123387 122694 122469 122854 123726 125300
57265 125300 127813 130955 134209 137419 140422 142628 143792 144804 146792 149627 152178 153885 155193 156545
57251 156545 157920 159443 161517 164098 166582 168729 171040 173965 177269 180529 183819 187703 192833 199631
57237 199631 207990 217230 226759 236829 248241 261371 275938 291739 309031 328134 349259 372781
57225C72781K6294K8695K9898L0048L0033L0335L0744L0938L0669K9431K6679
57214F96545K2491J7499J2156O513P97m398q694j2385j6041j9848k3432k6281
57202F44922k8147k9064k9147k8453k7133k5554k4109k2891k1684k0217j8424
57191C70099j6473j4668j3103j1451r348p107n592n122n045m729m432m577m757
57178B63695m248l113j994j193p72j127k409l657l655k546j502r78m46K50P03
57163B37008J113K246L965N176N620O398Q268J0582J2522J4135J5642J6888J8069
57150C57632J9800K1850K2977K2771K2504K3343K4793K5842K6474K7122K7511
57139F22619K7175K6479K6187K6559K7451K8708K9904L0474L0592L0992L1480
$$ plain form
57225 372781 399075 427770 457668 487716 517749 548084 578828 609766 640435 669866 696545
57214 696545 719036 736535 748691 755204 756001 751603 742909 730524 714483 694635 671203 644922
57202 644922 616775 587711 558564 530111 502978 477424 453315 430424 408740 388523 370099
57191 370099 353626 338958 325855 314404 305056 297949 292357 287235 282190 277461 273029 268452 263695
57178 263695 259447 256334 254340 253147 252375 251248 248839 245182 241527 238981 237479 236501 236055 236305 237008
57163 237008 238121 240367 244332 249508 255128 261526 269794 280376 292898 307033 322675 339563 357632
57150 357632 377432 399282 422259 445030 467534 490877 515670 541512 567986 595108 622619
57139 622619 649794 676273 702460 729019 756470 785178 815082 845556 876148 907140 938620
57128I38620L0820K8693K6520K5507K5046K3996K2285K0292J7870J5115J3012
57117A187776J2086J1436J0272R275R205R344Q754Q053Q363R330R783R649R725
57104A313051J0171J0656J1385J2574J3447J3113J1789J0055P615M118L14l002
57092A415286o363j0544j5060j9266k4048l0656l8599m6424n3887o1726p0034
57081A038679p8639q8280r9592j11630j23273j35207j48650I0416h6446j90676
57071b77122k05730k21649k37134k52713k70214k90018l11468l35592l64558l98652
57061c164850m36462m77972n24676n76763o33007o93645p60677q35292r17809
57052i021153j010233j116064j237268j374231j528883j705159j906501k136058
$$ plain form
57128 938620 969440 998133 1024653 1050160 1075206 1099202 1121487 1141779 1159649 1174764 1187776
57117 1187776 1199862 1211298 1221570 1230845 1240050 1249394 1258148 1266201 1274564 1283894 1293677 1303326 1313051
57104 1313051 1323222 1333878 1345263 1357837 1371284 1384397 1396186 1406241 1413856 1417974 1418288 1415286
57092 1415286 1408923 1398379 1383319 1364053 1340005 1309349 1270750 1224326 1170439 1108713 1038679
57081 1038679 960040 871760 772168 660538 537265 402058 253408 90416 -86446 -277122
57071 -277122 -482852 -704501 -941635 -1194348 -1464562 -1754580 -2066048 -2401640 -2766198 -3164850
57061 -3164850 -3601312 -4079284 -4603960 -5180723 -5813730 -6507375 -7268052 -8103344 -9021153
57052 -9021153 -10031386 -11147450 -12384718 -13758949 -15287832 -16992991 -18899492 -21035550
57044b1035550k399342k703548l054414l457305l921629m461017n090028n825143
57036e1947976o688114p701497q876651j0205507j1660182j3197170j4769438
57029a25046535j6344286j7900500j9389050k0707186k1758738k2568005k3289600
57022b67003900k4015733k4517652k4196613k2362035j8650105j3267701o905624
57015d00919363m22959N472795J0388930J4234362J7109515J9189529K0644892
57008c14302299K1601170K2131177K2274597K2066466K1546860K0748246J9688612
57001a64245171J8390062J6903669J5309520J3692442J2120508J0641129R285316
56994f7902525Q069480O997047O063169N258549M569765L980161L473829L038703
$$ plain form
57044 -21035550 -23434892 -26138440 -29192854 -32650159 -36571788 -41032805 -46122833 -51947976
57036 -51947976 -58636090 -66337587 -75214238 -85419745 -97079927 -110277097 -125046535
57029 -125046535 -141390821 -159291321 -178680371 -199387557 -221146295 -243714300 -267003900
57022 -267003900 -291019633 -315537285 -339733898 -362095933 -380746038 -394013739 -400919363
57015 -400919363 -401342322 -395869527 -385480597 -371246235 -354136720 -334947191 -314302299
57008 -314302299 -292701129 -270569952 -248295355 -226228889 -204682029 -183933783 -164245171
57001 -164245171 -145855109 -128951440 -113641920 -99949478 -87828970 -77187841 -67902525
56994 -67902525 -59833045 -52835998 -46772829 -41514280 -36944515 -32964354 -29490525 -26451822
56986b6451822K665612K346137K072391J837561J635509J460522J307986J174604
56978a1951500J057686R54861Q64578P85744P16647O55029N99506N49879N05785
56969e261785M65965M29320L95857L65914L38991L13956K90128K67619K46726
56960b147309K27377K09229J92095J76122J61381J47386J33349J19048J05019
56951f76303R1661P8584O5253N1876L9018K6496J3241j450j6710k9937l7874l8481
56939d34626l2330k1908r020O546K4749M1774N0149M3672K2617n861l2270n0080
56927c96588n7840n7732n2885m5748l7956l0735k4954k0919j8438j7154j6731
56916g77680j6736j6530j5499j3497j0984q560o388m237k020O7K048M380P304
$$ plain form
56986 -26451822 -23786210 -21440073 -19367682 -17530121 -15894612 -14434090 -13126104 -11951500
56978 -11951500 -10893814 -9938953 -9074375 -8288631 -7571984 -6916955 -6317449 -5767570 -5261785
56969 -5261785 -4795820 -4366500 -3970643 -3604729 -3265738 -2951782 -2661654 -2394035 -2147309
56960 -2147309 -1919932 -1710703 -1518608 -1342486 -1181105 -1033719 -900370 -781322 -676303
56951 -676303 -584642 -506058 -440805 -388929 -349911 -323415 -310174 -311624 -328334 -358271 -396145 -434626
56939 -434626 -466956 -488864 -497884 -491338 -466589 -424815 -374666 -330994 -308377 -314238 -346508 -396588
56927 -396588 -454428 -512160 -565045 -610793 -648749 -679484 -704438 -725357 -743795 -760949 -777680
56916 -777680 -794416 -810946 -826445 -839942 -850926 -859486 -865874 -870111 -872131 -872064 -870016 -865636 -858332
56903h58332J0316J2648J4070J4869J5327J5646J6101J6594J6246J4193J0776
56892g01546P350M785K771P29j226k486k659j815m54O34R14P35R89K027L366M603
56876f81283N964P711R572J1236J2954J5086J7262J8444J7725J4829J0041M063
56864e36396k067p206j0448j1441j0614r070p880p299o777n776m289k631j006
56851f22900N23J903L016L655L660L259L068L420L896L942L757M070N158O691
56837e72882Q408J0294J2104J3388J4198J5062J6213J7389J8481J9712K1045K2133
56825c84455K2894K3456K3253K1216J7152J2200P542L424o4k245k691k095j488
56812b61901j008k34P57J503K026K752L710M630N734P782J1124J5218J9060K1718
$$ plain form
56903 -858332 -848016 -835368 -821298 -806429 -791102 -775456 -759355 -742761 -726515 -712322 -701546
56892 -701546 -694196 -689411 -686640 -685911 -687137 -689623 -692282 -694097 -694551 -693917 -693003 -692268 -691279 -689252 -685886 -681283
56876 -681283 -675319 -667608 -658036 -646800 -633846 -618760 -601498 -583054 -565329 -550500 -540459 -536396
56864 -536396 -538463 -545669 -556117 -567558 -578172 -587242 -595122 -602421 -609198 -614974 -619263 -621894 -622900
56851 -622900 -622377 -620474 -617458 -613803 -610143 -606884 -603816 -600396 -596500 -592558 -588801 -584731 -579573 -572882
56837 -572882 -564474 -554180 -542076 -528688 -514490 -499428 -483215 -465826 -447345 -427633 -406588 -384455
56825 -384455 -361561 -338105 -314852 -293636 -276484 -264284 -256742 -253318 -253382 -255627 -258318 -260413 -261901
56812 -261901 -262909 -263143 -262386 -260883 -258857 -256105 -252395 -247765 -242031 -234249 -223125 -207907 -188847 -167129
56798a67129K2448K0839J7084J1926O231O93m058p341q605p960o483n574n549
56785a33478n177l196n6K650M457O570R958J3942J7400K0325K3323a7089A0954
56771C9356K7170K3895J7966R687M93p979j4589j8709k0268j9908j8554A805a2837
56757b5148r722o542k632J327M306O113P656R909a853A3891J7650J8345J8044
56744F7930J6733J3723Q253O57p467j4390j9350k2313B0399b391k1162j9068j6676
56731e9297j4075j1546r168o562l515m67K102M390O779R117J1028J2557J3704
56718d4953J3675J1520P376K381k492o822j0188j2139j2809j2791j2377j1475
56706i1094j0281r263q493p652o789o323o218n840m835l491k109p15M11O90R8
$$ plain form
56798 -167129 -144681 -123842 -106758 -94832 -88601 -87908 -91966 -99307 -107912 -115872 -122355 -127929 -133478
56785 -133478 -138655 -141851 -141907 -139257 -134800 -128230 -118272 -104330 -86930 -66605 -43282 -17089 10954
56771 39356 66526 90421 108387 118074 118567 110588 95999 77290 57022 37114 18560 1805 -12837
56757 -25148 -34870 -41412 -44044 -42717 -38411 -32298 -24642 -14733 -1853 13891 31541 49886 67930
56744 67930 84663 98386 106639 107296 99829 85439 66089 43776 20399 -2391 -23553 -42621 -59297
56731 -59297 -73372 -84918 -94086 -100648 -104163 -104630 -102528 -98138 -91359 -82242 -71214 -58657 -44953
56718 -44953 -31278 -19758 -12382 -10001 -12493 -19315 -29503 -41642 -54451 -67242 -79619 -91094
56706 -91094 -101375 -110638 -119131 -126783 -133572 -139895 -146113 -151953 -156788 -160279 -162388 -163103 -162692 -162002 -161904
56691a61904n54n84j90O3L6r8k69l94k27K68O77O32L26J60J90K26K77M79P59Q43
56671a59284O13K41o1k04k43l09m92p60j014j193j174p55K1O11M44k88o83j71
56653a64701Q24J404J149L99j95k27J65M18O9o38r34l77O30J298J233N70l78j281
56635a60572j752j562r89o27o45n15K80J456K220K302K239K476K689K393J876
56620a48731J904K638L460L877L982L837L227K173J229P79N68K84J09J79O3o08
56604a21030j380j536j207j133j507j748j488j114j130j511j847j804j307n31
56590a40273J91O35R04J203J520J791K127K541K633K089J348J313K261L524M245
56575a11948M155L564K936K576K451K277J974J913K394L040L096K345J418J120
$$ plain form
56691 -161904 -162458 -163042 -163232 -163169 -163133 -163231 -163500 -163894 -164121 -163853 -163176 -162544 -162218 -162058 -161868 -161642 -161365 -160886 -160127 -159284
56671 -159284 -158671 -158430 -158491 -158695 -158938 -159247 -159739 -160499 -161513 -162706 -163880 -164635 -164614 -164003 -163559 -163847 -164530 -164701
56653 -164701 -163877 -162473 -161324 -160925 -161120 -161347 -161182 -160764 -160695 -161333 -162267 -162644 -162014 -160716 -159483 -158913 -159291 -160572
56635 -160572 -162324 -163886 -164875 -165502 -166147 -166662 -166382 -164926 -162706 -160404 -158165 -155689 -153000 -150607 -148731
56620 -148731 -146827 -144189 -140729 -136852 -132870 -129033 -125806 -123633 -122404 -121625 -121057 -120773 -120664 -120485 -120422 -121030
56604 -121030 -122410 -123946 -125153 -126286 -127793 -129541 -131029 -132143 -133273 -134784 -136631 -138435 -139742 -140273
56590 -140273 -140082 -139447 -138543 -137340 -135820 -134029 -131902 -129361 -126728 -124639 -123291 -121978 -119717 -116193 -111948
56575 -111948 -107793 -104229 -101293 -98717 -96266 -93989 -92015 -90102 -87708 -84668 -81572 -79227 -77809 -76689
56561g6689J701K769L602L609K769J658R23P31R04J265J684J929J856J596J328
56546d8365J070Q36P46P14L77l18q55q04l90p6Qj66p28j362j166J92J724K358
56528d6205K409K816L358K921J404M3l37k14k12r4N04J243J553J401J119R49J061
56511b6281J552K157K412K263K069J941J664J365J567K381L248A1L731L557L046
56496A0345K291J808J979K654L435L961L842K949J825J215J080P64K14J55Q21
56481C9338J396J181M83j75r30k007k845k701j763r84r73j518k083k376k439k443
56465A9161k393k068j456j016j065j096m17O09Q26p4j142j580j575j340n38O67
56449E503J036j76j916A791f14k210k193j533k56M22j29j006j137o89m71n59l79
$$ plain form
56561 -76689 -74988 -72219 -68617 -65008 -62239 -60581 -59658 -58927 -58023 -56758 -55074 -53145 -51289 -49693 -48365
56546 -48365 -47295 -46459 -45713 -44999 -44622 -44940 -45795 -46599 -46989 -47065 -47057 -47223 -47951 -49313 -50479 -50287 -48563 -46205
56528 -46205 -43796 -40980 -37622 -34701 -33297 -33254 -33591 -33805 -34017 -34111 -33607 -32364 -30811 -29410 -28291 -27342 -26281
56511 -26281 -24729 -22572 -20160 -17897 -15828 -13887 -12223 -10858 -9291 -6910 -3662 11 3742 7299 10345
56496 10345 12636 14444 16423 19077 22512 26473 30315 33264 35089 36304 37384 38148 38362 38517 39338
56481 39338 40734 41915 42398 42223 41293 39286 36441 33740 31977 30993 30020 28502 26419 24043 21604 19161
56465 19161 16768 14700 13244 12228 11163 10067 9650 10259 11085 11011 9869 8289 6714 5374 4836 5503
56449 5503 6539 6363 4447 1791 -614 -2824 -5017 -6550 -6806 -6384 -6513 -7519 -8656 -9345 -9816 -10375 -10754
56432a0754K04O44O16M81O57R74J036R70J298a746A213L385L500L415K888J915
56416A6316J203J413K225K758K754K668K786K973L251L866M674N101M890M335
56402F1213L765L329L221L454L493K827J876J524J857K256K634L396M103L540
56388A02488J592k32p32m53m74q82j256j593j808j233K52J272M11j763l292l222
56372H9075k388j914j940j956j648j166q88j041j417j578j477j485j731j844j639
56357F4963j469j556j617j472j435j619j579j092o06l01L69J531K053R98p57j473
56341E4938p97Q4L61M97J127K013K428J995Q85l79j220j355j013o59n63o86p18
56324E6938k38P54J407P68q02j768j297k55J54j28m29m35p1R15K295K973K230
$$ plain form
56432 -10754 -10550 -9906 -9290 -8809 -8152 -7178 -6142 -5172 -3874 -1746 1213 4598 8098 11513 14401 16316
56416 16316 17519 18932 21157 23915 26669 29337 32123 35096 38347 42213 46887 51988 56878 61213
56402 61213 64978 68307 71528 74982 78475 81302 83178 84702 86559 88815 91449 94845 98948 102488
56388 102488 104080 103848 103116 102663 102189 101307 100051 98458 96650 95417 95669 96941 97352 95589 92297 89075
56372 89075 86687 84773 82833 80877 79229 78063 77175 76134 74717 73139 71662 70177 68446 66602 64963
56357 64963 63494 61938 60321 58849 57414 55795 54216 53124 52518 52217 52586 54117 56170 57168 56411 54938
56341 54938 54141 54225 54586 55083 56210 58223 60651 62646 63531 63152 61932 60577 59564 58905 58342 57656 56938
56324 56938 56700 57454 58861 59629 58827 57059 55762 55507 55661 55533 55104 54669 54598 55513 57808 60781 63011
56307F3011R28M56R25J390J509J781K321K493J906J050P29J374K746L975M171
56292I0765L438K842K867K634J370l8j28J009J881J651R04M24L98Q39J745K603
56276A15204K691K114J847K479L516M105L927L337L040L564M651N370N266M997
56262A66108N280N715N486M800M546M793M825M623N032O232P121O770N619M664
56248B41614M146L696L328L562M596N770O006M830K860J216M42K83M50J028J926
56233B85753K537K532K498L248M810O547P913Q641Q622Q206Q294R494J1447J3347
56219C83889J4781J5747J6384J7179J8747K0960K2880K4080K5327K7280K9505
56208F16759L1531L4049L7909M2591M6836N0287N3532N7006O0861O5463P0916
$$ plain form
56307 63011 63939 64395 65320 66710 68219 70000 72321 74814 76720 77770 78499 79873 82619 86594 90765
56292 90765 94203 97045 99912 102546 103916 103878 103750 104759 106640 108291 109195 109619 110017 110856 112601 115204
56276 115204 117895 120009 121856 124335 127851 131956 135883 139220 142260 145824 150475 155845 161111 166108
56262 166108 171388 177103 182589 187389 191935 196728 201553 206176 211208 217440 224561 231331 236950 241614
56248 241614 245760 249456 252784 256346 260942 266712 272718 277548 280408 281624 282066 282349 282799 283827 285753
56233 285753 288290 290822 293320 296568 301378 307925 315838 324479 333101 341307 349601 359095 370542 383889
56219 383889 398670 414417 430801 447980 466727 487687 510567 534647 559974 587254 616759
56208 616759 648290 682339 720248 762839 809675 859962 913494 970500 1031361 1096824 1167740
56197A167740P6538Q1675Q6561R1449R5573R8077R9347J00212J00390R8868R5239
56186B191669Q9435Q0956O9809N7567M5848L4224K1329P566n109j5854k5420l4080
56174B517940m0989m5895m9622n2517n4020n4274n4618n5847n7335n8396n9367
56163A935060o0784o2532o4248o5718o6632o6738o6407o6104o5439o3767o1517
56152A225174n9712n8216n5842n2295m8613m5529m2714l9884l7301l4900l2153
56141G18015k9158k6695k4936k3167k1026j8972j7299j5798j4463j3525j2689
56130E00287j1403r911q917q358p632o869o645o578n694m064k656j569n2J775
56116D21714K843K889K776K945L075L300M137N231N786O207P521R204R642Q778
$$ plain form
56197 1167740 1244278 1325953 1412514 1503963 1599536 1697613 1796960 1897172 1997562 2096430 2191669
56186 2191669 2281104 2362060 2431869 2489436 2535284 2569508 2590837 2598403 2593294 2577440 2552020 2517940
56174 2517940 2476951 2431056 2381434 2328917 2274897 2220623 2166005 2110158 2052823 1994427 1935060
56163 1935060 1874276 1811744 1747496 1681778 1615146 1548408 1482001 1415897 1350458 1286691 1225174
56152 1225174 1165462 1107246 1051404 999109 950496 904967 862253 822369 785068 750168 718015
56141 718015 688857 662162 637226 614059 593033 574061 556762 540964 526501 512976 500287
56130 500287 488884 478973 470056 461698 454066 447197 440552 433974 428280 424216 421560 419991 419939 421714
56116 421714 424557 427446 430222 433167 436242 439542 443679 448910 454696 460903 468424 477628 487270 496048
56102D96048Q272Q779R258R243R541J0149R818Q390P344P309P176O600P030R121
56088F14078J1322J2399J3412J5678J8612K1098K3505K6753L0747L5103M0265
56077H62972M6584N3265N9403O5014P0210P4341P6774P7437P6019P1967O5911
56066A599897N9745N4581M9931M5275M0823L6192L0081K2041J3040L783n699j4404
56054A935286k0547k4271k7984l3040l8354m3328m9578n8008o6335p1488p2885
56043A429468p1707o8617o3913n8532n3068m6954m0005l3522k8618k4760k1158
56032I18614j8205j6294j4660j2669j0959j0082r452q555p865p549o855n604m713
56019G85152m390l621k216j325j125j87J854L369L570L892N310O749P541Q787
$$ plain form
56102 496048 504320 513099 522357 531600 541141 551290 561108 569498 576842 584151 591327 597927 604957 614078
56088 614078 625400 637799 651211 666889 685501 706599 730104 756857 787604 822707 862972
56077 862972 909556 962821 1022224 1087238 1157448 1231789 1308563 1386000 1462019 1533986 1599897
56066 1599897 1659642 1714223 1764154 1809429 1850252 1886444 1916525 1938566 1951606 1955389 1949690 1935286
56054 1935286 1914739 1890468 1862484 1829444 1791090 1747762 1698184 1640176 1573841 1502353 1429468
56043 1429468 1357761 1289144 1225231 1166699 1113631 1066677 1026672 993150 964532 939772 918614
56032 918614 900409 884115 869455 856786 845827 835745 826293 817738 809873 802324 795469 789865 785152
56019 785152 780762 777141 774925 773600 772475 772288 774142 777511 781081 784973 790283 797032 804573 813360
56005H13360J0800J1832J1118J0570J1582J2622J2089J1059J1032J1345J1022
55994I38431J1021J2333J3906J4549J4927J5814J6486J6644J7622J9860K1637
55983A113230K2070K2732K4460K5561K5253K5677K8119L0478L1132L1955L4580
55972A415247L6966L7067L6845L9057M2774M5630M7975N1272N4818N7497O0417
55961A925565O4526O8118O9918P1959P6106Q0532Q3060Q5078Q8615R2518R5229
55950B801224R8335J03584J09325J13680J18119J24239J30365J35256J41481J51007
55940D026615J61277J69991J79531J91966K04162K13313K22974K37754K56018
55931E863601K73988K92935L15907L41113L65145L89250M15976M43355M68904
$$ plain form
56005 813360 824160 835992 847110 857680 869262 881884 893973 905032 916064 927409 938431
55994 938431 949452 961785 975691 990240 1005167 1020981 1037467 1054111 1071733 1091593 1113230
55983 1113230 1135300 1158032 1182492 1208053 1233306 1258983 1287102 1317580 1348712 1380667 1415247
55972 1415247 1452213 1489280 1526125 1565182 1607956 1653586 1701561 1752833 1807651 1865148 1925565
55961 1925565 1990091 2058209 2128127 2200086 2276192 2356724 2439784 2524862 2613477 2705995 2801224
55950 2801224 2899559 3003143 3112468 3226148 3344267 3468506 3598871 3734127 3875608 4026615
55940 4026615 4187892 4357883 4537414 4729380 4933542 5146855 5369829 5607583 5863601
55931 5863601 6137589 6430524 6746431 7087544 7452689 7841939 8257915 8701270 9170174
55922I170174M95495N26777N60928N95474O33593O78739P28126P78696Q33821
55913A5001823Q96588R63093J030921J107281J199491J305001J420961J555423
55905B4480582J718419J911792K140202K420571K764365L160698L594422M071201
55897D6262252M608362N216215N911614O735424P728368Q900092J0245354J1767995
55889A07375676J3454147J5245278J7060282J8742877J9829044J9395956J6428917
55882B27532177J0634939K955826m832356j1125153j5206877j7214976j7678849
55875A75064731j7155626j6100930j4832659j3519430j2224739j0976689r793822
55868H0460836q677847p626596o656533n792121n039144m386870l828398l359963
$$ plain form
55922 9170174 9665669 10192446 10753374 11348848 11982441 12661180 13389306 14168002 15001823
55913 15001823 15898411 16861504 17892425 18999706 20199197 21504198 22925159 24480582
55905 24480582 26199001 28110793 30250995 32671566 35435931 38596629 42191051 46262252
55897 46262252 50870614 56086829 61998443 68733867 76462235 85362327 95607681 107375676
55889 107375676 120829823 136075101 153135383 171878260 191707304 211103260 227532177
55882 227532177 238167116 241122942 236290586 225165433 209958556 192743580 175064731
55875 175064731 157909105 141808175 126975516 113456086 101231347 90254658 80460836
55868 80460836 71782989 64156393 57499860 51707739 46668595 42281725 38453327 35093364
55860C5093364k966927k629212k337456k089804j877936j690183j523758j380675
55852A8597413j255583j139884j033891r43076q65655p94830p29957o74649o26654
55843A0533234n79986n34962m96548m64540m34278m05307l80900l60428l40066
55834F536219l19684l01876k85700k68320k51154k37617k26351k13308j99028
55825D233181j87333j78240j68531j58150j49882j43580j36609j29137j23554
55816B858165j19500j14633j09341j05695j02825r8320r3128r0090q8598q5555
55806A850480q0667p6041p1489o5109n7757n2279m8809m5136m1044l7983l5291
55795A238875l0994k5899k2647k1346k0033j8858j9757k2514k4974k6609k8161
$$ plain form
55860 35093364 32126437 29497225 27159769 25069965 23192029 21501846 19978088 18597413
55852 18597413 17341830 16201946 15168055 14224979 13359324 12564494 11834537 11159888 10533234
55843 10533234 9953248 9418286 8921738 8457198 8022920 7617613 7236713 6876285 6536219
55834 6536219 6216535 5914659 5628959 5360639 5109485 4871868 4645517 4432209 4233181
55825 4233181 4045848 3867608 3699077 3540927 3391045 3247465 3110856 2981719 2858165
55816 2858165 2738665 2624032 2514691 2408996 2306171 2207851 2114723 2024633 1936035 1850480
55806 1850480 1769813 1693772 1622283 1557174 1499417 1447138 1398329 1353193 1312149 1274166 1238875
55795 1238875 1207881 1181982 1159335 1137989 1117956 1099098 1079341 1056827 1031853 1005244 977083
55784I77083k8583k6283k2733k0894k0601j9376j7178j6229j6604j6092j4442
55773G58068j3733j4432j4741j4133j4035j4770j5066j4728j4792j4946j3834
55762E98858j1915j1073j1473j1624j1361j1810j2629j2279j0960j0343j0472
55751D72919r827q310p294o831n655l894k975k902k359j351r78q20N81K746L632
55736D26682K857J827Q73q54k786l279k635k877m397n595n933o530p565p902p456
55721C74430p334p439o583m977l962l358j950m87j154l826n949o495p030q371
55707C05515r259q987q446p911o570m923m817o223o855n863n109n745o298n475
55693B13034m340m239m756n068n409n963o079n622n406n517n027l983l725m547
$$ plain form
55784 977083 948500 922217 899484 878590 857989 838613 821435 805206 788602 772510 758068
55773 758068 744335 729903 715162 701029 686994 672224 657158 642430 627638 612692 598858
55762 598858 586943 575870 564397 552773 541412 529602 516973 504694 493734 483391 472919
55751 472919 463092 454782 447488 440657 435002 431108 428133 425231 422872 421521 420543 419723 420304 423050 426682
55736 426682 429539 431366 432239 431385 428599 425320 422685 419808 415411 409816 403883 397353 389788 381886 374430
55721 374430 367096 359657 353074 348097 344135 340777 338827 338340 337186 333360 327411 320916 313886 305515
55707 305515 296256 287269 278823 270912 264342 259419 254602 248379 241524 235661 230552 224807 218509 213034
55693 213034 208694 204455 199699 194631 189222 183259 177180 171558 166152 160635 155608 151625 147900 143353
55679A43353n035m423l581k990j934n10j40j061j479l50R87J070L22l04q56j460
55663A21609j576j287j549k321k205r02r7q36j911k022j712j819j817j102l09
55648A00144J1N54J746K523J998J056Q49R59M92j69n8P29J348J455J183O87L93
55631A15900Q60J724J873J183Q45J369J748J379J203J926K579K139J215Q43P41
55616A37527J82m97o05m58p05r15k24J171K203K344J933J448J111R58P78M30K89
55599A46970P76J395J193L02j49J53K49l32p85m82L8K23L33M69M8j072k132k792
55581A44405l619m660m969m343m033m713n225m446l168k815l389l959m246m488
55567H6332m548m311m287m705m773l832k595k200k621k949k704k072j386r93j100
$$ plain form
55679 143353 138318 133895 130314 127324 125390 124880 124740 123679 122200 121850 122837 123907 124229 123925 123069 121609
55663 121609 120033 118746 117197 114876 112671 111769 111672 110836 108925 106903 105191 103372 101555 100453 100144
55648 100144 100155 100709 102455 104978 106976 108032 108881 109840 110332 110163 110105 110834 112182 113637 114820 115507 115900
55631 115900 116760 118484 120357 121540 122385 123754 125502 126881 128084 130010 132589 134728 135943 136786 137527
55616 137527 137709 137212 136607 136149 135444 134529 134305 135476 137679 140023 141956 143404 144515 145473 146251 146681 146970
55599 146970 147746 149141 150334 150636 150487 150640 150889 150557 149772 149290 149328 149551 149884 150353 150401 149329 147197 144405
55581 144405 140786 136126 131157 126814 122781 118068 112843 108397 105229 102414 99025 95066 90820 86332
55567 86332 81784 77473 73186 68481 63708 59876 57281 55081 52460 49511 46807 44735 43349 42356 41256
55552D1256j243o38M78P91k30j449j721j338j066p75k3Q54J209R57K85p63j758
55535C4826j810q08J72K93Nj5k4m82j102j427j612j851j821j306o62r6O13J241
55517B4134J026p6j127j629k021k284j626k45L22n10j230n65O31J022Q14P57N79
55500A7972r6m90O1O58J95q68j516j861k282k031m88J244J726J344J384J751J518
55483A8221Q89P16O68j39j187j156k42R5m10m91N14J819K632K982K986K596K137
55466C2630J984J822J316J070J726K485K086Q89L74Q21J121P33O7r48k800m671
55450D0705m778k951j267j322k335k739k311j859j838k275l285m703C334b227
55435f688l152k066j128k64L24K94l79j120j141m37Q8j89p31p04k65j62n33r10
$$ plain form
55552 41256 40013 39375 39853 40644 40414 38965 37244 35906 34840 34065 34042 34896 36105 37062 37347 36584 34826
55535 34826 33016 32208 32380 32673 32678 32663 32639 32157 31055 29628 28016 26165 24344 23038 22376 22280 22893 24134
55517 24134 25160 25084 23957 22328 20307 18023 16397 16152 16474 15964 14734 14169 14800 15822 16636 17393 17972
55500 17972 17876 17386 17447 18105 18300 17432 15916 14055 11773 9742 9254 10498 12224 13568 14952 16703 18221
55483 18221 19110 19826 20494 20355 19168 18012 17770 17865 17455 16964 17478 19297 21929 24911 27897 30493 32630
55466 32630 34614 36436 37752 38822 40548 43033 45119 46008 46382 47203 48324 49057 49124 48176 45376 40705
55450 40705 35927 32976 31709 30387 28052 25313 23002 21143 19305 17030 13745 9042 3334 -2227
55435 -6688 -9840 -11906 -13034 -13298 -12974 -12680 -13059 -14179 -15320 -15757 -15669 -15858 -16589 -17293 -17558 -17720 -18253 -19163
55417a9163j170j521j763j392m41M82R21Q51L50l51p92p74o34n41n6R27J492Q56
55399b2719k99o92j42N68J132J829K497K517J781P68j90r00r55l59n7q09j865
55382a7895j869q00J26K40r8n24r32q93l3J063J432J150J036J133P68jl01J09
55364a6289N00M21J49j15l94l73K26P85M88k44l29J70K62o6K44J277J765J065
55346a0458J5n88r26j132q11j61j71r93j406o96K25L37l4j18K1M0J59N53P22L29
55326a5093o7Q5L74J30n01q96p98l13L33N79j61j448j913r72K87N88R1k21j3L50
55306a9579O70R86J091P32Q0m63p38p34m15M8K66J24l1M9K52M70P21P37J91n24
55286a6067n88k1J41n94j395j380q26m38j85K91P49O16p5p05p96l55K27L57k54
$$ plain form
55417 -19163 -20333 -21854 -23617 -25009 -25450 -24968 -24047 -23196 -22846 -23197 -23989 -24763 -25397 -25938 -25994 -25067 -23575 -22719
55399 -22719 -23018 -23710 -23852 -23284 -22152 -20323 -17826 -15309 -13528 -12760 -12950 -13850 -14805 -15164 -15221 -16030 -17895
55382 -17895 -19764 -20564 -20438 -20198 -20296 -20820 -21752 -22645 -22678 -21615 -20183 -19033 -17997 -16864 -16096 -16097 -16398 -16289
55364 -16289 -15789 -15368 -15219 -15334 -15728 -16101 -15875 -15090 -14602 -14846 -15175 -15005 -14743 -14809 -14565 -13288 -11523 -10458
55346 -10458 -10443 -11031 -11957 -13089 -13900 -14061 -14232 -15225 -16631 -17327 -17102 -16765 -16799 -16917 -16896 -16856 -16697 -16144 -15422 -15093
55326 -15093 -15160 -15075 -14701 -14571 -15072 -15968 -16766 -17079 -16746 -16167 -16328 -17776 -19689 -20661 -20374 -19786 -19695 -19916 -19929 -19579
55306 -19579 -18909 -17923 -16832 -16100 -16020 -16483 -17221 -17955 -18370 -18322 -18056 -17932 -17963 -17914 -17662 -17192 -16471 -15734 -15543 -16067
55286 -16067 -16655 -16676 -16535 -17129 -18524 -19904 -20730 -21168 -21353 -21062 -20313 -19697 -19772 -20477 -21273 -21628 -21401 -21044 -21298
55267b1298j041j058k29M90M39K3j66j93k56j14L25N30J21m48n91m51m37m65l00
55248b5119j29j92k00K06P70J006Q81O16J99l98q03n97J32R52J508J510Q06j76
55230a9028n60o8N30M44j40n69o97p08n27L3P16J128J262J306J162O06j71o67
55212a5948n56R9Q65J050K36j120k073k292k234k124j574n40K60L22J6k08m21
55195b6242n08J53J490K177J348O7o2P75J014J23p90p39l9N61Q34Q49N76J77J04
55176a8132N20R72R01K97l62o07m70m63r51j528j372m09M28M43J29L70J110J601
55158a7523J565J380J260J038P36O06N84K53m63j070j099o00M1M34L22k49q58
55141a3643r89n40J05M54L06j27l86k05J62K41k1k29k11j94k57q1L99O91M14j21
$$ plain form
55267 -21298 -22339 -23397 -23626 -23136 -22697 -22674 -22840 -23033 -23289 -23403 -23078 -22548 -22427 -22875 -23466 -23917 -24354 -24819 -25119
55248 -25119 -25248 -25440 -25640 -25434 -24664 -23658 -22777 -22161 -21962 -22360 -23163 -23760 -23628 -22676 -21168 -19658 -18852 -19028
55230 -19028 -19588 -19656 -19126 -18682 -18822 -19391 -20088 -20796 -21323 -21290 -20574 -19446 -18184 -16878 -15716 -15110 -15281 -15948
55212 -15948 -16504 -16405 -15540 -14490 -14254 -15374 -17447 -19739 -21973 -24097 -25671 -26211 -25951 -25629 -25613 -25821 -26242
55195 -26242 -26750 -26597 -25107 -22930 -21582 -21515 -21577 -20802 -19788 -19665 -20455 -21194 -21233 -20672 -19838 -18989 -18413 -18236 -18132
55176 -18132 -17612 -16640 -15739 -15442 -15804 -16411 -16881 -17344 -18295 -19823 -21195 -21604 -21176 -20733 -20604 -20234 -19124 -17523
55158 -17523 -15958 -14578 -13318 -12280 -11544 -10938 -10354 -10101 -10564 -11634 -12733 -13333 -13292 -12858 -12536 -12785 -13643
55141 -13643 -14632 -15172 -15067 -14613 -14307 -14434 -14820 -15025 -14863 -14622 -14643 -14872 -15083 -15277 -15534 -15615 -15216 -14525 -14111 -14232
55121a4232m17m04k04K26Q19J166R93N16m7p28j327j321p16l35o45r43m45M79
55103a7565R48R03Q36P27K12m10m70l0K14O5l9L3j8j26J25N99O20P0l97m08m03
55082a4514p51j062p72Q5R93J462J255N19j67k95JJ65O8Q5L64O44Q40J239J834
55063h007K067J551O32n3k65j34J94O11R39J058c71E67O91K13l51D64EQ1M37K53
55043G76j93B14i2n42j119j333q03j03J89M09J030g24H81J262J342J580J122J74
55025F361j28M69Q41K81m96o12l01k26l45k73m8J43M77J031J297Q18j9n02n42
55006H226n36n65l91RM63R77J520J656J047J32l07k04j40l00k40J06M2q25j737
54987H933j629n22N30P86N09K96K87L02L25M20M16J37k04k36p8k35p86j132q47
$$ plain form
55121 -14232 -14649 -15053 -15257 -15031 -14212 -13046 -12053 -11537 -11584 -12312 -13639 -14960 -15676 -16011 -16656 -17599 -18044 -17565
55103 -17565 -16617 -15714 -14878 -14151 -13939 -14349 -14819 -14849 -14635 -14570 -14609 -14576 -14594 -14720 -14595 -13996 -13376 -13306 -13703 -14111 -14514
55082 -14514 -15265 -16327 -17099 -17014 -16021 -14559 -13304 -12785 -12952 -13247 -13246 -13081 -13013 -12928 -12564 -11920 -11080 -9841 -8007
55063 -8007 -5940 -4389 -3757 -3810 -4075 -4209 -4015 -3404 -2465 -1407 -371 567 1258 1471 1120 464 5 86 523 776
55043 776 583 214 -92 -634 -1753 -3086 -3889 -3992 -3803 -3394 -2364 -724 881 2143 3485 5065 6187 6361
55025 6361 6233 6702 7543 7824 7328 6716 6415 6189 5844 5571 5523 5666 6143 7174 8471 9289 9270 8768 8226
55006 8226 7690 7125 6734 6743 7206 8183 9703 11359 12406 12538 12231 12027 11887 11587 11347 11453 11495 10670 8933
54987 8933 7304 6782 7312 8098 8607 8903 9190 9492 9817 10237 10653 10790 10586 10350 10272 10037 9251 8119 7272
54968G272l21j69l44l19O6M48N63M97L39Q4m4L05J051J556J430J054J044J380
54950A5892J433Q43jm23l24l20r62j847j862n08J212J675M75j020j185R3J484
54933A4655J784R87j87j269k190k746k509j446k36L57K71O2R0J84J64K78P99J382
54915A0430J301M03n04m37O52J842K312K194K156K377K401J903J183P21O47Q64
54899C0445J282J639J566J218J437K682M213M938M813M596M575M418M236M667
54885G6725N740O638O862O811O828O539N613M414L336K101K89j956m170o044p257
54870A12469p475o950o466o290n844m883m122m064m066l436k701k776l407l482
54856D6507k580j290k19M43O19M29L63P68J299J537J739K304L038L696M719O430
$$ plain form
54968 7272 6951 6782 6438 6119 6185 6633 7196 7693 8032 8116 8072 8377 9428 10984 12414 13468 14512 15892
54950 15892 17325 18168 18167 17744 17420 17100 16138 14291 12429 11921 13133 14808 15283 14263 13078 13171 14655
54933 14655 16439 17426 17239 15970 13780 11034 8525 7079 6843 7200 7471 7533 7623 7807 7971 8249 9048 10430
54915 10430 11731 12134 11630 11193 11845 13687 15999 18193 20349 22726 25127 27030 28213 28934 29581 30445
54899 30445 31727 33366 34932 36150 37587 40269 44482 49420 54233 58829 63404 67822 72058 76725
54885 76725 82465 89103 95965 102776 109604 116143 121756 126170 129506 131607 131896 129940 125770 119726 112469
54870 112469 104994 98044 91578 85288 79444 74561 70439 66375 62309 58873 56172 53396 49989 46507
54856 46507 43927 42637 42418 42861 43480 43909 44272 45040 46339 47876 49615 51919 54957 58653 63372 69802
54840F9802P954Q156P324O724O613N948M145J855j68j910l519m773n571o156o611
54825H9813o735o576o437o264n692m810m121l762l420l008k740k512k075j686
54811B9975j737j815j154n6L29k41p73p27q09j483j935j323j98K66j35o24o07
54794A6953k39mk13p03r11n93l74j018k106k383j506n01j83j70P7K77Q7p5J80
54775F595L32k01r48r77k51M57O98O63N72M46L73M48O03Q26J243J661J442L66
54757A4348q01j134o71j31J81N45J075J498J656J743J959K285K597K782K732K439
54741C3103K089J942K136K656L332L889M136M137M097M229M870O319Q134R095
54727I4164Q560P499P233P457O715M709K723J513K11j991m333n565n516m814l922
$$ plain form
54840 69802 77756 85912 93236 99960 106573 112521 116666 118521 118353 116443 112924 108151 102580 96424 89813
54825 89813 83078 76502 70065 63801 58109 53299 49178 45416 41996 38988 36248 33736 31661 29975
54811 29975 28238 26423 25269 25213 25542 25301 24528 23801 22992 21509 19574 18251 18053 18319 18184 17560 16953
54794 16953 16714 16710 16497 15794 14883 14290 13916 12898 10792 8409 6903 6402 6219 6049 6126 6403 6490 6415 6595
54775 6595 6927 6726 5778 4801 4550 5007 5705 6368 6940 7386 7759 8207 8810 9636 10879 12540 13982 14348
54757 14348 13547 12413 11742 11611 11792 12337 13412 14910 16566 18309 20268 22553 25150 27932 30664 33103
54741 33103 35192 37134 39270 41926 45258 49147 53283 57420 61517 65746 70616 76935 85069 94164
54727 94164 102724 110223 117456 124913 131628 136337 139060 140573 140784 138793 134460 128895 123379 118565 114643
54712A14643l280l464m309m671m015l342l560l824k845j074p5j48j20N92J253
54697H1761J300J258J724K531L348M326N641O991P980Q635R199R785J0311J0545
54683A65335J0234R414Q394P132M986J663j987m788o645q335j0053j1102j1063
54670A53185j0464r995r727r364q760p940o982o093n460m971m349l545k716j956
54656F0863j424j491k255l036l020k285j604j314j077p21n07m29n8O41J010O07
54640D3900j34n03l39R1N72R03P93K27l11l78j79k38o40r14o88j47K41L31M43
54621D3030Q61J370J478J124Q52J106J623J844J669J473J479J603J767K006K228
54606F5513K262K158K161K319K433K449K495K532K263J546P33M29R13J867K611
$$ plain form
54712 114643 111363 107899 103590 98919 94904 91562 88002 84178 81333 80259 80184 80036 79916 80508 81761
54697 81761 83061 84319 86043 88574 91922 96248 101889 108880 116860 125495 134694 144479 154790 165335
54683 165335 175569 184983 193377 200509 205495 207158 205171 200383 193738 185403 175350 164248 153185
54670 153185 142721 132726 122999 113635 104875 96935 89953 83860 78400 73429 69080 65535 62819 60863
54656 60863 59439 57948 55693 52657 49637 47352 45748 44434 43357 42636 42129 41700 41642 42283 43293 43900
54640 43900 43766 43263 42924 43015 43587 44490 45283 45510 45199 44821 44642 44404 43764 42850 42162 42015 42256 42587 43030
54621 43030 43891 45261 46739 47863 48715 49821 51444 53288 54957 56430 57909 59512 61279 63285 65513
54606 65513 67775 69933 72094 74413 76846 79295 81790 84322 86585 88131 88864 89293 90206 92073 94684
54591I4684K668K172J641J409J447J726K368L281M061M565N201O256P288P694
54577A46461P611P692Q078Q161P383N848M013K146K41j761l773n597p112q419
54563A70972r550j0092r534q081o673n903n391m558l482k639k187k032k139k297
54549I6414k052j356q59r29r95n42j77p19j782k274k079k049k452k685k497k387
54533G0580k533k385j795j521k110l033l409l092k535k095j878j872j908j754
54519C8660j469j319j344j295j033n52J93R66J000j25j511j775q89k38p06j683
54503B6880k211k075j412l03O97O32n23j364p15Q33J796J655J070O94N82N59N13
54486B7308M40N46J055J715J940J691J626K034K361K266K314K909L330K817K013
$$ plain form
54591 94684 97352 99524 101165 102574 104021 105747 108115 111396 115457 120022 125223 131479 138767 146461
54577 146461 154072 161764 169842 178003 185386 191234 195247 197393 197634 195873 192100 186503 179391 170972
54563 170972 161422 151330 141796 133715 127042 121139 115748 111190 107708 105069 102882 100850 98711 96414
54549 96414 94362 93006 92147 91218 90223 89681 89504 88785 87003 84729 82650 80601 78149 75464 72967 70580
54533 70580 68047 65662 63867 62346 60236 57203 53794 50702 48167 46072 44194 42322 40414 38660
54519 38660 37191 35872 34528 33233 32200 31648 31841 32807 33807 33682 32171 30396 29507 29269 28563 26880
54503 26880 24669 22594 21182 20879 21576 22208 21685 20321 19606 20439 22235 23890 24960 25654 26236 26795 27308
54486 27308 27748 28294 29349 31064 33004 34695 36321 38355 40716 42982 45296 48205 51535 54352 56365
54471E6365K146L164L810L474K807K511K479K416K377K386K129J389L06r64k379
54456H4416l595m042l698l303l465l923l986l484k851k504k457k480k370k054
54442D0204j598j211j140j374j514j112k71L23J70l71n64l28j87k92r5O26J184
54425C2450Q48j41r20j029n87J48Q30J016P26O63J219J603Q23p11j508r40J19
54408C4609P08R02J117J227R97P46R42J417J576J116J74r59j831j915j129j37
54392C9560L30K03j31m84p93q40n17k42m30p53o14k35m56j335j806j128J18R20
54374C1367J083R32M59l54q04j09J205J603M81j001j419p73j12j2p3K53Q91J249
54356C4866Q49j82j105j188m22N18J020J005O58K37K15J042K368L074K603J796
$$ plain form
54471 56365 58511 61675 65485 68959 71766 74277 76756 79172 81549 83935 86064 87453 87759 86795 84416
54456 84416 80821 76779 73081 69778 66313 62390 58404 54920 52069 49565 47108 44628 42258 40204
54442 40204 38606 37395 36255 34881 33367 32255 31984 32307 32477 32106 31542 31214 31027 30735 30640 31266 32450
54425 32450 33298 33157 32237 31208 30621 30769 31599 32615 33341 34004 35223 36826 37649 36938 35430 34490 34609
54408 34609 35317 36219 37336 38563 39560 40306 41248 42665 44241 45357 45531 44572 42741 40826 39697 39560
54392 39560 39890 40093 39962 39478 38685 37845 37328 37086 36656 35903 35289 35054 34598 33263 31457 30329 30447 31367
54374 31367 32450 33382 33841 33487 32683 32574 33779 35382 35863 34862 33443 32670 32558 32546 32473 32726 33617 34866
54356 34866 35715 35533 34428 33240 32818 33336 34356 35361 36019 36256 36471 37513 39881 42955 45558 47354
54340D7354J776K440K814K594K464K894L467L612L350K993K593J986J116J05p84
54325H0774j305j510j780k238k390j830j048q83j264j364r55p85j314j891j715
54310E8502r73n21p69j358j625j201l69M1m77j298j302l70M23L54p1k12l95j185
54292D7194k143k261j297L5J062J692K068K307K530K806L004L019K868K446J578
54277F6908O36M91J419K482K629J945J177N23k51r43j130j055j323j789j778j407
54261F8534j576k475l096k727j941j595j665j715j871k484l243l413k824k004
54247C5905j478j390j665k052k070j422m63Q9r1p13j345j720j619r28K3N27J96
54230A9784n61r52o59j01O5l50r29j125p97k28L21Q83J505J881J596P41J9jM89
$$ plain form
54340 47354 49130 51570 54384 56978 59442 62336 65803 69415 72765 75758 78351 80337 81453 81558 80774
54325 80774 79469 77959 76179 73941 71551 69721 68673 67790 66526 65162 64207 63422 62108 60217 58502
54310 58502 57529 57008 56239 54881 53256 52055 51686 51727 51250 49952 48650 48280 48703 49057 48986 48774 48379 47194
54292 47194 45051 42790 41493 41528 42590 44282 46350 48657 51187 53993 56997 60016 62884 65330 66908
54277 66908 67544 68035 69454 71936 74565 76510 77687 78210 77959 77016 75886 74831 73508 71719 69941 68534
54261 68534 66958 64483 61387 58660 56719 55124 53459 51744 49873 47389 44146 40733 37909 35905
54247 35905 34427 33037 31372 29320 27250 25828 25365 25454 25363 24650 23305 21585 19966 19038 19061 19588 19784
54230 19784 19223 18271 17612 17511 17576 17226 16297 15172 14375 14147 14468 15351 16856 18737 20333 21074 21093 21092 21581
54211B1581Q54P67L54k48r92j554j410m85O03J298J687J987J872R52l26j011r07
54194B5022p60j030j169n81L31N75j36j063j265m78P12J317P92l95j155r38k47
54177A9532J43J21Q3K17M19O74J042J327J244Q38M17J38j8l1O3m4n37j048j059
54158B3521o82m91n91m42K05Q12P58J71k96k60J44O08R29J026R36P51N26K58M1
54139B7924K2J50J56o8k82k00O5J63k7k03N8Q28J627J689O64q64j728j346m04
54120B8224j07p59j458j325o04j86l47n56m27k07j07K21R87J594J314M11j62p2
54102B6434J10Qm9J65K19j60m23K8Q09J021M67k65p36r98j072p66j53L21M19L60
54082B5739L30K07p1k05M6M29M93J55l07o57r03j092j168j075q46n54k42l5j32
$$ plain form
54211 21581 22435 23202 23556 23308 22316 20762 19352 18867 19470 20768 22455 24442 26314 27266 26940 25929 25022
54194 25022 24262 23232 22063 21482 21813 22388 22252 21189 19924 19446 20158 21475 22267 21872 20717 19779 19532
54177 19532 19675 19796 19879 20096 20515 21189 22231 23558 24802 25640 26057 26195 26177 26146 26209 26165 25628 24580 23521
54158 23521 22839 22348 21757 21315 21520 22332 23090 23261 22965 22705 22849 23457 24386 25412 26348 27099 27625 27883 27924
54139 27924 27946 28096 28252 28184 27902 27702 27767 27930 27903 27700 27758 28586 30213 31902 32566 31702 29974 28628 28224
54120 28224 28117 27358 25900 24575 23971 23785 23438 22882 22455 22248 22141 22362 23349 24943 26257 26668 26506 26434
54102 26434 26544 26552 26503 26668 26887 26727 26304 26332 27141 28162 28629 28364 27628 26630 25558 24792 24639 24960 25379 25739
54082 25739 26069 26276 26205 26000 26046 26475 26968 27123 26816 26159 25256 24164 22996 21921 21075 20521 20279 20244 20112
54063B0112n27q06n34J02L09l08j100j113l38L23K70j15j81J81O46R31R03N71
54045A9326K09J68L58L53J39J66M77M35k12p70o56l18l79n07j40K63j18q78p69
54026A7147L20J114Q94M50O15R97Q78M28J93P4k57m59N2J015J560J403J028P23
54008B8175K27n61j108q89p0O92R57P98N68N44P56J049J260J310J163Q02L76J99
53990C6248M48R13J187J084P64M98M27N68Q56J209J600K076K632L077L196L029
53974E9812K853K851K927K979L123L442L659L407K902K906L832N127N824N506
53960A11150M445L133K097J893K569L202K675J082k95o36m74o18r12p87m36n65
53944A27523j200j646j602j555j877k213k096j743j830k577l361l355k483j593
$$ plain form
54063 20112 19585 18779 18245 18347 18656 18348 17248 16135 15797 16120 16390 16275 16094 16275 16921 17852 18755 19326
54045 19326 19535 19703 20061 20414 20553 20719 21196 21631 21419 20649 19993 19675 19296 18789 18649 18912 18794 17916 17147
54026 17147 17467 18581 19475 19925 20540 21537 22415 22843 23036 23110 22853 22394 22446 23461 25021 26424 27452 28175
54008 28175 28402 27841 26733 25844 25774 26466 27423 28221 28789 29333 30089 31138 32398 33708 34871 35673 36049 36248
53990 36248 36696 37609 38796 39880 40644 41142 41569 42137 42993 44202 45802 47878 50510 53587 56783 59812
53974 59812 62665 65516 68443 71422 74545 77987 81646 85053 87955 90861 94693 99820 105644 111150
53960 111150 115595 118728 120825 122718 125287 128489 131164 132246 131951 131315 130841 130223 129311 128524 128088 127523
53944 127523 126323 124677 123075 121520 119643 117430 115334 113591 111761 109184 105823 102468 99985 98392
53930I8392j489j949k029j350n42k49l30m07n85j018j291r69m36m59j050j561
53914H2678j652j492j118m16L17O02N56P47J199J361J121J061J457J793J575R23
53898I0712J32p39j501j744j443j091r16n71N7M33K50Q9N91J462J907J701J300
53881I0629J122J253J691K371L083L608L854L686L026K260K071K473K555J606
53867A25288J35q53j126j144j072o84j39J3k18k7J081K499L247L223L173L531
53851A36927L826L483K768K521L064L843M244M224L930L242K248J657K000K701
53837A80678K737K058J497J338R77J77m28n42q70j954l148l546l301l189l362
53822A69122l433l379l548l909m116m158m322m535m499m273m160m046l554k809
$$ plain form
53930 98392 96903 94954 92925 91575 91033 90784 90454 90047 89462 88444 87153 86184 85748 85289 84239 82678
53914 82678 81026 79534 78416 78000 78317 78919 79475 80222 81421 82782 83903 84964 86421 88214 89789 90712
53898 90712 90844 90105 88604 86860 85417 84326 83410 82839 82896 83329 83579 83668 84259 85721 87628 89329 90629
53881 90629 91751 93004 94695 97066 100149 103757 107611 111297 114323 116583 118654 121127 123682 125288
53867 125288 125423 124570 123444 122300 121228 120544 120405 120418 120200 120173 121254 123753 127000 130223 133396 136927
53851 136927 140753 144236 147004 149525 152589 156432 160676 164900 168830 172072 174320 175977 177977 180678
53837 180678 183415 185473 186970 188308 189285 189462 189034 188492 187622 185668 182520 178974 175673 172484 169122
53822 169122 165689 162310 158762 154853 150737 146579 142257 137722 133223 128950 124790 120744 117190 114381
53808A14381k362k297k100j570j248j684k666l476l576k927j962j390j717k714
53794H2692l539l512k651j493o33m80j066j950k465k220j388m78N3R6j32l34m71
53777F0029p06r90j032p79o22p88q60l77L75O67L70O7J28K40O4j59j3M06O04L40
53757E6964j48n34p58r51j152j195q81j67Q12J831K619K867K387J388M73K34Q45
53740F4634J957K923L214K831K355K358K756L013K902K738K804K986L132L284
53726A03887L377L126K562K207K344K508K194J644J428J451J128L28m46q29r29
53711A25980q68n70j88j75o54j138j171r49j035j583k188k351j986j376q41m50
53695A08457j25N7j61q60j682k109j885j146k52L58L68r6n18n51m15m99p54q23
$$ plain form
53808 114381 112019 109722 107622 106052 104804 103120 100454 96978 93402 90475 88513 87123 85406 82692
53794 82692 79153 75641 72990 71497 70864 70384 69318 67368 64903 62683 61295 60817 60870 60966 60834 60500 60029
53777 60029 59323 58333 57301 56522 55900 55112 54252 53875 54250 54917 55287 55354 55482 55722 55786 55627 55614 56020 56624 56964
53757 56964 56816 56282 55524 54573 53421 52226 51345 51178 51990 53821 56440 59307 61694 63082 63555 63789 64634
53740 64634 66591 69514 72728 75559 77914 80272 83028 86041 88943 91681 94485 97471 100603 103887
53726 103887 107264 110390 112952 115159 117503 120011 122205 123849 125277 126728 127856 128184 127738 126909 125980
53711 125980 125112 124542 124354 124179 123525 122387 121216 120267 119232 117649 115461 113110 111124 109748 108907 108457
53695 108457 108332 108389 108228 107368 105686 103577 101692 100546 100294 100652 101020 100924 100406 99855 99440 98941 98187 97364
53677I7364o51n81q36j225j443j417j274j141j064j021r75r52j013j145j201j096
53661H0329q63m90J17Q68J329J125M60N0M63J536K469K553J882J258J236J446
53645I5768J210N99L82R19J749K322K536K406J862J245J264K007K665K704K652
53630A22290L062L402K918K022J782K253K427J819J090R12J150J441J792K210
53616A50570K284J663N98k94n96l02K65O07M69J36O0J57j36j020j912k072j404
53599A49073n12q9k94o22m82O5L12j40q20j061q52o09l96n2K32P5l76n49k53J74
53579A42824M59O36O71M53J26r8l80r67j497j251j23J206K125K550K541K147J682
53562A53104J571J802K040K250K551K595J933J029R41J787K483K316J867J884
$$ plain form
53677 97364 96713 96132 95296 94071 92628 91211 89937 88796 87732 86711 85736 84784 83771 82626 81425 80329
53661 80329 79466 78976 79093 79961 81290 82415 82875 82925 83388 84924 87393 89946 91828 93086 94322 95768
53645 95768 96978 97577 97959 98878 100627 102949 105485 107891 109753 110998 112262 114269 116934 119638 122290
53630 122290 125352 128754 131672 133694 135476 137729 140156 141975 143065 143977 145127 146568 148360 150570
53616 150570 152854 154517 155115 154821 154225 153923 154188 154795 155264 155400 155460 155617 155481 154461 152549 150477 149073
53599 149073 148561 148472 148178 147556 147074 147139 147451 147311 146491 145430 144578 143969 143573 143521 143753 143828 143452 142903 142650 142824
53579 142824 143283 143919 144590 145043 145169 145071 144691 143724 142227 140976 140853 142059 144184 146734 149275 151422 153104
53562 153104 154675 156477 158517 160767 163318 165913 167846 168875 169816 171603 174086 176402 178269 180153
53548A80153K181K270K296K634L169L659M307N232N860N568M625L795L331K969
53534B32049K688K764L203L681M050M430M774M785M262L315K314J713J774K238
53520B78040K541K455K243K067J802J585J891K639K858J959P83N97J377J971J789
53505C06597J392J347J384J070O12N09P54R17Q84J009J473J872J669J014O56R70
53489C24129J391J244Q08R30J631J903J130%m58j00N89J441K528L471L714L382
53473C47733L219L554L931L820L297K842K842L383M218M932N361N810O601P528
53459D09071Q093Q238Q379Q761R210R598J0111J0866J1682J2397J3110J3875J4485
53446E47876J4801J5091J5692J6500J7140J7618J8396J9687K0999K1710K1948
$$ plain form
53548 180153 182334 184604 186900 189534 192703 196362 200669 205901 211761 217329 221954 225749 229080 232049
53534 232049 234737 237501 240704 244385 248435 252865 257639 262424 266686 270001 272315 274028 275802 278040
53520 278040 280581 283036 285279 287346 289148 290733 292624 295263 298121 300080 300863 301460 302837 304808 306597
53505 306597 307989 309336 310720 311790 312402 312911 313665 314582 315466 316475 317948 319820 321489 322503 323159 324129
53489 324129 325520 326764 327572 328502 330133 332036 333166 333166 332708 332608 333197 334638 337166 340637 344351 347733
53473 347733 350952 354506 358437 362257 365554 368396 371238 374621 378839 383771 389132 394942 401543 409071
53459 409071 417164 425402 433781 442542 451752 461350 471461 482327 494009 506406 519516 533391 547876
53446 547876 562677 577768 593460 609960 627100 644718 663114 682801 703800 725510 747458
53435G47458K2472K3632K4846K5292K4847K4023K3286K2907K3166K4092K5009
53424A011030K5039K4230K3575K3669K3919K3485K2463K1571K1115K0844K0581
53413A261521K0383K0159J9760J9313J9018J8601J7543J5946J4595J3986J3642
53402A454467J2698J0937Q887P125N685M238K625J032l41j639l241n259p379r203
53388A480632j0633j1826j2913j3873j4604j5065j5448j6151j7420j8960k0162
53377A313577k0710k0735k0432j9923j9492j9445j9565j9260j8414j7606j7185
53366A100810j6621j5305j3461j1772j0485r488q878q662q193o767m722l164k486
53353I80806j927p91P24K225L898O040Q310J0133J1518J2945J4558J5970J6886
$$ plain form
53435 747458 769930 793562 818408 843700 868547 892570 915856 938763 961929 986021 1011030
53424 1011030 1036069 1060299 1083874 1107543 1131462 1154947 1177410 1198981 1220096 1240940 1261521
53413 1261521 1281904 1302063 1321823 1341136 1360154 1378755 1396298 1412244 1426839 1440825 1454467
53402 1454467 1467165 1478102 1486989 1494114 1499799 1504037 1506662 1507694 1507353 1505714 1502473 1497214 1489835 1480632
53388 1480632 1469999 1458173 1445260 1431387 1416783 1401718 1386270 1370119 1352699 1333739 1313577
53377 1313577 1292867 1272132 1251700 1231777 1212285 1192840 1173275 1154015 1135601 1117995 1100810
53366 1100810 1084189 1068884 1055423 1043651 1033166 1023678 1014800 1006138 997945 991178 986456 983292 980806
53353 980806 978879 978088 978812 981037 984935 990975 999285 1009418 1020936 1033881 1048439 1064409 1081295
53340A081295J7457J8043J8927K0272K2010K3784K5240K6542K8225L0407L2440
53329A344642L3679L4325L5181L6620L8231L9511M0513M1593M2848M4059M5025
53318A776227M5712M6205M6697M7381M8163M8563M8159M6976M5298M3305M1163
53307B283849L9164L7424L5572L3120K9980K6314K2201J7990J4522J2260J0332
53296B562728P421L525j10k934n910r922j4344j7957k0570k2991k5782k8842l1907
53283B392405l4795l7270l9188m0676m1809m2429m2580m2767m3274m3617m3162
53272A940838m2071m1047m0394l9863l9226l8487l7574l6316l4695l2861l1022
53261A527282k9542k8790k8517k7741k5783k3105k0696j8895j7387j6072j5226
$$ plain form
53340 1081295 1098752 1116795 1135722 1155994 1178004 1201788 1227028 1253570 1281795 1312202 1344642
53329 1344642 1378321 1412646 1447827 1484447 1522678 1562189 1602702 1644295 1687143 1731202 1776227
53318 1776227 1821939 1868144 1914841 1962222 2010385 2058948 2107107 2154083 2199381 2242686 2283849
53307 2283849 2323013 2360437 2396009 2429129 2459109 2485423 2507624 2525614 2540136 2552396 2562728
53296 2562728 2570149 2573674 2573564 2570630 2564720 2554798 2540454 2522497 2501927 2478936 2453154 2424312 2392405
53283 2392405 2357610 2320340 2281152 2240476 2198667 2156238 2113658 2070891 2027617 1984000 1940838
53272 1940838 1898767 1857720 1817326 1777463 1738237 1699750 1662176 1625860 1591165 1558304 1527282
53261 1527282 1497740 1468950 1440433 1412692 1386909 1363804 1343108 1324213 1306826 1290754 1275528
53250A275528j4879j4685j4365j3818j2889j1482r893q568p571o635n599m419
53238A150725l003j414n1Q45J582K503L398L992M656N858P239Q056Q436R344J1232
53223A213398J3535J5553J7062J7978J8236J8255J8783J9903K0709K0377J9081
53212A412870J7676J6767J6349J6015J5319J4203J3066J2186J1212R640P647N892
53200A568842M554L242J826O12m08j769l749o040q299j0487j2385j3578j4197
53187A508164j5040j6505j8058j9140k0001k1139k2412k3306k3736k3934k3885
53176A281008k3428k2703k2022k1389k0675k0107k0070k0351k0142j8986j7454
53165A053681j6562j6654j7076j6968j6156j5093j4095j3038j1863j0949j0620
$$ plain form
53250 1275528 1260649 1245964 1231599 1217781 1204892 1193410 1183517 1174949 1167378 1160743 1155144 1150725
53238 1150725 1147722 1146308 1146257 1147102 1148684 1151187 1154585 1158577 1163233 1169091 1176330 1184386 1192822 1202166 1213398
53223 1213398 1226933 1242486 1259548 1277526 1295762 1314017 1332800 1352703 1373412 1393789 1412870
53212 1412870 1430546 1447313 1463662 1479677 1494996 1509199 1522265 1534451 1545663 1555303 1562950 1568842
53200 1568842 1573396 1576638 1578464 1579076 1578668 1576899 1573150 1567110 1558811 1548324 1535939 1522361 1508164
53187 1508164 1493124 1476619 1458561 1439421 1419420 1398281 1375869 1352563 1328827 1304893 1281008
53176 1281008 1257580 1234877 1212855 1191466 1170791 1150684 1130614 1110263 1090121 1071135 1053681
53165 1053681 1037119 1020465 1003389 986421 970265 955172 941077 928039 916176 905227 894607
53154H94607j0598j0402j0049r970j0335j0865j1246j1295j0893j0241r996j0629
53142G68088j1707j2371j2495j2695j3191j3403j2897j2056j1513j1434j1687
53131F32639j2211j2840j3110j2667j1715j0859j0698j1521j3086j4599j5232
53120D94101j4825j3892j3000j2395j2069j1820j1367j0759j0481j0647j0482
53109C62364r363p984p537p931p990p369o987p284p495p114o825p111p144o143
53095B58087m894m714n484n922n416m522l833l428l334l638m054m115l910l957
53081A96866m256m152l211j874r67q76j240j318p44J4R9o82j618k054k069j897
53065A70021j316k33N96K92q57j588j179j38O17P23M03K9j39p0j0j97n46p16n49
$$ plain form
53154 894607 884009 873607 863558 853588 843253 832388 821142 809847 798954 788713 778717 768088
53142 768088 756381 744010 731515 718820 705629 692226 679329 667273 655760 644326 632639
53131 632639 620428 607588 594478 581811 570096 559237 548539 537018 523932 509333 494101
53120 494101 479276 465384 452384 439989 427920 416100 404733 393974 383493 372846 362364
53109 362364 353001 345017 337480 329549 321559 314190 307203 299919 292424 285310 278485 271374 264230 258087
53095 258087 253193 248479 242995 237073 231657 227135 223302 219874 216540 212902 208848 204733 200823 196866
53081 196866 192610 188458 185247 183373 182406 181530 180290 178972 178228 178242 178341 177659 176041 173987 171918 170021
53065 170021 168705 168472 169068 169360 168503 166915 165736 165598 166215 166938 167341 167370 167231 167161 167151 166954 166408 165692 165143
53046A65143k44r9j74j83K47J081J709J543P31m9m19n17m07O4O52P13O5o71r89
53027A68196j189j719k448k971l170l066k647k214k261k626k468j615j084j577
53013A37141k282k150j538j527k096k345k077j883j789j120J49J031Q23j56j211
52998A18970j917j960j296o22q14j704k166j659q66o13r20j414j897k102j658
52983I7362o99L3Q7k53o69j315k191k650k152j118m72n66r18q90k70O60J358J431
52965H6768R17J52n84j052r36k19M22J93q09j641j689j232p61l45Q9M25N69O16
52947H0883N20J05m39n49jP42J144J150R21N27J27q8k38o12r40n04O58J396Q28
52928H5630m87j328j335j031p68m75k50l68o10l29O06J443J473R56P21J070J476
$$ plain form
53046 165143 164899 164800 164626 164443 164690 165771 167480 169023 169754 169705 169286 168769 168362 168426 169078 169791 169856 169185 168196
53027 168196 167007 165288 162840 159869 156699 153633 150986 148772 146511 143885 141417 139802 138718 137141
53013 137141 134859 132709 131171 129644 127548 125203 123126 121243 119454 118334 118483 119514 120337 120181 118970
52998 118970 117053 115093 113797 113175 112361 110657 108491 106832 105966 105353 104433 103019 101122 99020 97362
52983 97362 96663 96696 96783 96530 95861 94546 92355 89705 87553 86435 85963 85397 84479 83589 83319 83979 85337 86768
52965 86768 87685 87837 87253 86201 85265 85046 85468 85661 84852 83211 81522 80290 79529 79184 79273 79698 80267 80883
52947 80883 81403 81508 81069 80520 80519 81261 82405 83555 84476 85003 85130 85042 84804 84192 83252 82748 83406 84802 85630
52928 85630 85143 83815 82480 81449 80681 80206 79956 79588 78978 78649 79255 80698 82171 83127 83848 84918 86394
52911H6394J408J062R81J192J160P42N77J119J789J712J056Q29J372J959K001
52896A05353J864K062K417K512K448K580K908L231L507L588L042J812O78M37Q24
52881A39263Q63J48q24j415j438j029m64j50l04o97j010j319j845k372k416j963
52865A23028j555j559j809j930j676r66j8N92N02J18J64O33Q33M86J08Q3N2l03
52847A16783n72l02P5j90r00j012l1J316K007J772J058L50o7j2N00J047J030K21
52829A23073r67j777j786j268q78q45o33L85J936K944K701J629O68K98M56J001
52813A26937J719K063J535M25l47k96J59L78K64J32K05M67P64Q39N71K71L74P32
52795A37192O80P1l63l9O07Q16O32O67J080J517J770J866J627R52M58J018K519
$$ plain form
52911 86394 87802 88864 89845 91037 92197 92939 93516 94635 96424 98136 99192 100021 101393 103352 105353
52896 105353 107217 109279 111696 114208 116656 119236 122144 125375 128882 132470 135512 137324 138002 138439 139263
52881 139263 140126 140274 139450 138035 136597 135568 135104 134954 134650 133953 132943 131624 129779 127407 124991 123028
52865 123028 121473 119914 118105 116175 114499 113533 113515 114107 114609 114727 114891 115524 116357 116843 116951 117034 117086 116783
52847 116783 116211 115909 115984 115794 114894 113882 113851 115167 117174 118946 120004 120354 120287 120275 120775 121822 122852 123073
52829 123073 122106 120329 118543 117275 116397 115552 114919 115304 117240 120184 122885 124514 125182 125480 125936 126937
52813 126937 128656 130719 132254 132679 132332 132036 132195 132573 132837 132969 133174 133641 134405 135244 135815 136086 136460 137192
52795 137192 137872 137943 137580 137541 138148 138964 139596 140263 141343 142860 144630 146496 148123 149075 149533 150551 153070
52778A53070L802M008L357K484J665J024Q02R91J135R20N85M65M89M53L74K45
52762A75869j66q92j501j648j657k034k696l106l019k634k182j774j571j697j957
52747A47335k072k142k527l169l456k947j980j342j396j803k030j934j724j453
52733A17360r31j90K59l3q42j487j658j606j556j377r51m99k79k77l86o52j148
52716A03747j711k051k023j701j350j290j604j903j724j135o91o59o95m32k3J87
52700H4942J82K02K99L00K0n96j394j957j921j464j166j293j517j505j370j263
52684G0499j075q06q60j390j822j511p14k71n08r79j210j116p61k64J0l22j108
52667E5792j680j580r65k57K62M44K01l14p16p24m06m6J15O2K3L15R32J378J158
$$ plain form
52778 153070 156872 160880 164237 166721 168386 169410 170212 171203 172338 173258 173843 174308 174797 175250 175624 175869
52762 175869 175703 174811 173310 171662 170005 167971 165275 162169 159150 156516 154334 152560 150989 149292 147335
52747 147335 145263 143121 140594 137425 133969 131022 129042 127700 126304 124501 122471 120537 118813 117360
52733 117360 116429 116239 116498 116465 115623 114136 112478 110872 109316 107939 106988 106489 106210 105933 105547 104895 103747
52716 103747 102036 99985 97962 96261 94911 93621 92017 90114 88390 87255 86564 85905 85210 84778 84755 84942
52700 84942 85124 85326 85625 85925 85945 85349 83955 81998 80077 78613 77447 76154 74637 73132 71762 70499
52684 70499 69424 68618 67758 66368 64546 63035 62321 62050 61542 60563 59353 58237 57476 57212 57222 56900 55792
52667 55792 54112 52532 51567 51310 51572 52016 52217 51903 51187 50463 50057 50011 50126 50188 50211 50526 51458 52836 53994
52648E3994L69m44r69j317j522j314n84K42N80L69J21L35R27J325J049K84k11
52631E3234J68J220K128K243J664J059J058J755K620K847K012N30n89o00K97J141
52615G2787J084J58q05j050o51l25n36j033j294j158q69o37m94n02q36j552k380
52598E9907k893k802k124j149k75J68Q0l52q00j036j129j268j434j395j126j002
52582D1370j319j784j812j266n41N9N87J086J369J327J168J138J273J513J752
52567D5920J697J072J08n86q01r25j124r46j00Q61J209R95P74O75M16L1j14l1
52549D9131j82o83j019p28kO14Q20O77M13K40K07J75N7N4M20J011J329J055L58
52530E3947k55l03L82J371J778J067j97q08k31Q41J342R86L79J56L50N28M13K44
$$ plain form
52648 53994 54363 53919 52950 51633 50111 48797 48213 48455 49035 49404 49525 49860 50787 52112 53161 53445 53234
52631 53234 53402 54622 56750 58993 60657 61716 62774 64529 67149 69996 72008 72538 71949 71349 71646 72787
52615 72787 73871 74029 73224 72174 71523 71198 70662 69629 68335 67177 66308 65671 65177 64675 63839 62287 59907
52598 59907 57014 54212 52088 50939 50664 50832 50912 50560 49760 48724 47595 46327 44893 43498 42372 41370
52582 41370 40051 38267 36455 35189 34648 34707 35294 36380 37749 39076 40244 41382 42655 44168 45920
52567 45920 47617 48689 48797 48211 47410 46485 45361 44415 44315 45176 46385 47380 48154 48829 49245 49276 49162 49131
52549 49131 48949 48266 47247 46519 46517 47131 47951 48628 49041 49281 49488 49663 49720 49774 50194 51205 52534 53589 53947
52530 53947 53692 53389 53771 55142 56920 57987 57790 56982 56751 57592 58934 59920 60299 60455 60805 61333 61746 61990
52512F1990M52J037J470J389J189J556K475L106K789J840J095Q32N27l02j323
52497H0122j679r43M27J611K165K128J688J082O76P52J103J203Q86N44N59Q53
52481I3177J101J119Q42K81k83l87J17Q28J256J274R33K97l77o34l99j22j17j02
52463I8804J93M83M55M17P56J144R70L16k04m25o82j029j133r59q02o49k50J23
52445I7528j60j020j502j104m59l34n80n94k95L3M19J074J790K038J724J287J106
52428A00951J109J059Q91O55L82J21P1M28J118J729J827J382P15N3o37j282j443
52411A09129q13K81J158J490J384R60L21j24J22R58J629J567J008O16O89R31Q01
52394A22107J22n95n41M01J290J192L77p9K17N97N57M77P74J001M69o14j286r59
$$ plain form
52512 61990 62442 63479 64949 66338 67527 69083 71558 74664 77453 79293 80388 81220 81747 81445 80122
52497 80122 78443 77500 77927 79538 81703 83831 85519 86601 87277 88029 89132 90335 91221 91765 92324 93177
52481 93177 94278 95397 96239 96520 96237 95850 95967 96795 98051 99325 100258 100555 100178 99544 99145 99023 98906 98804
52463 98804 98997 99480 99935 100352 101108 102252 103222 103538 103334 102909 102227 101198 100065 99106 98304 97655 97405 97528
52445 97528 97368 96348 94846 93742 93283 92949 92369 91775 91480 91513 91932 93006 94796 96834 98558 99845 100951
52428 100951 102060 103119 104010 104665 105047 105168 105239 105667 106785 108514 110341 111723 112438 112491 111854 110572 109129
52411 109129 108316 108597 109755 111245 112629 113589 113910 113786 113908 114866 116495 118062 119070 119686 120375 121306 122107
52394 122107 122229 121634 121093 121494 122784 123976 124353 124274 124491 125088 125645 126122 126896 127897 128366 127752 126466 125507
52376A25507O3J138J921K356K423K038J226L22j31J28O86Q02K39n00q08o58m60
52359A36292m57m70j91L23N49j1j165k032k044j596j446j589j382o94k11l72o16
52342A22888j35J005J892J812R08j8k11M45J356J824J706J341R55M74m7k69L9
52325A35965P63J609K230K223J500O74N27R70J097M75k35k63K43O57Q40J156J733
52308A52164K291K551K475K162J785J508J276Q84L98J86M24P98J027J225J538
52293A72692J754J625J289J086J135J376J696J804J395O87M50J124K298L323L988
52278A97722M166L437J777K39N5J129K116K055J297Q61J285K302L191L387K995
52263B28014K713K976L387L359L069L150L570L622L168L091M004N134N258M468
$$ plain form
52376 125507 125570 126708 128629 130985 133408 135446 136672 136994 136863 136991 137677 138479 138718 138218 137410 136752 136292
52359 136292 135835 135365 135174 135497 136046 136035 134870 132838 130794 129198 127752 126163 124781 124087 123876 123504 122888
52342 122888 122753 123758 125650 127462 128370 128352 128141 128586 129942 131766 133472 134813 135768 136242 136195 135926 135965
52325 135965 136728 138337 140567 142790 144290 144964 145491 146461 147558 148033 147798 147535 147778 148435 149275 150431 152164
52308 152164 154455 157006 159481 161643 163428 164936 166212 167096 167494 167680 168104 168902 169929 171154 172692
52293 172692 174446 176071 177360 178446 179581 180957 182653 184457 185852 186539 186989 188113 190411 193734 197722
52278 197722 201888 205325 207102 207341 207396 208525 210641 212696 213993 214854 216139 218441 221632 225019 228014
52263 228014 230727 233703 237090 240449 243518 246668 250238 253860 257028 260119 264123 269257 274515 278983
52249B78983M178N222O667P108O594O492P430Q376Q159P168O780P514Q744R885
52235C79300J0860J1433J1215J0654J0882J2130J3273J3549J3727J4735J6077
52224E17835J6698J6682J6824J6994J6305J4807J3739J3924J4896J5757J5919
52213F90380J4956J2767J0276Q992R345J0076R769Q374O807N672M908M220L343
52200G99885K148Q70k2m26p86j438k135k485k499k388k204j971j840j752j318
52185G81639m97lm92j499j785p76Q50K177L176M496O337P993Q692Q540Q398Q793
52169H36039R326R345Q923Q773R292J0032J0254R678Q594P389O153M777L305K114
52155I43994J520J255N58r61k883m592o076p628r106j0031j0355j0524j0697j0532
$$ plain form
52249 278983 283161 288383 295050 302158 308752 315244 322674 331050 339209 346377 353157 360671 369415 379300
52235 379300 390160 401593 412808 423462 434344 446474 459747 473296 487023 501758 517835
52224 517835 534533 551215 568039 585033 601338 616145 629884 643808 658704 674461 690380
52213 690380 705336 718103 728379 737371 746716 756792 766561 774935 781742 787414 792322 796542 799885
52200 799885 802033 802903 802881 802455 801669 800231 798096 795611 793112 790724 788520 786549 784709 782957 781639
52185 781639 781142 781139 780647 779148 777363 776587 777437 779614 782790 787286 793623 801616 810308 818848 827246 836039
52169 836039 845365 854710 863633 872406 881698 891730 901984 911662 920256 927645 933798 938575 941880 943994
52155 943994 945514 946769 947327 946366 943483 938891 932815 925187 916081 906050 895695 885171 874474 863942
52141H63942r928r401r392r670r802r826j0013j0182r846r009q313q220q339p877
52127G34124o688n528n146n300n041l968k775k385k842l430l605l397k962k330
52113F78727j591j018q30j035j543k205k709k725k228j541j064j035j434j939
52099F55830k175k142k246k642k897k652k248k228k509k647k637k778k916k639
52085F20474k156k094k420k484k277k653l900n050n164m548m047l750l158k225
52071E74548j456j212j435j887k252k253k039k137k652k917k429j703j569j939
52057E46668j960j229k55K94K72O4K77J344L023M443N046N289N953O970P529P250
52041E90978O696O657P423Q866J0694J2558J4174J5450J6305J6535J6189J5928
$$ plain form
52141 863942 854014 844613 835221 825551 815749 805923 795910 785728 775882 766873 758560 750340 742001 734124
52127 734124 727436 721908 716762 711462 706421 702453 699678 697293 694451 691021 687416 684019 681057 678727
52113 678727 677136 676118 675288 674253 672710 670505 667796 665071 662843 661302 660238 659203 657769 655830
52099 655830 653655 651513 649267 646625 643728 641076 638828 636600 634091 631444 628807 626029 623113 620474
52085 620474 618318 616224 613804 611320 609043 606390 602490 597440 592276 587728 583681 579931 576773 574548
52071 574548 573092 571880 570445 568558 566306 564053 562014 559877 557225 554308 551879 550176 548607 546668
52057 546668 544708 543479 543224 543518 543790 543854 544131 545475 548498 552941 557987 563276 569229 576199 583728 590978
52041 590978 597674 604331 611754 620620 631314 643872 658046 673496 689801 706336 722525 738453
52029G38453J6471J7632J8414J8139J7196J6502J6599J7209J7579J7140J6134
52018I27468J5393J5250J4981J3763J1894J0372R416Q247O417M485L079K049R50
52005A043764k27j266k217l225m256n404o945q693r756r546q611p865p367o629
51991I61757n753n417n688n816n297m440l589k551j187K4N84P08R45J384J747
51976I27411K058K602L365M003M466N125O050O645O319N325M573M609N028M956
51962I92535L982K541J378P80M19j77j174k446l801n036n973o654p409q526r918
51947I50521j1272j2445j3469j4364j5158j5995j6961j7860j8471j8903j9320
51936G76303j9493j9103j8454j8229j8472j8495j8019j7680j7998j8513j8522
$$ plain form
52029 738453 754924 772556 790970 809109 826305 842807 859406 876615 894194 911334 927468
52018 927468 942861 958111 973092 986855 998749 1009121 1018537 1026784 1033201 1037686 1040765 1042814 1043764
52005 1043764 1043537 1042271 1040054 1036829 1032573 1027169 1020224 1011531 1001775 992229 983618 975753 968386 961757
51991 961757 956004 950587 944899 939083 933786 929346 925757 923206 922019 922043 922627 923335 924280 925664 927411
51976 927411 929469 932071 935436 939439 943905 949030 955080 961725 968044 973369 977942 982551 987579 992535
51962 992535 996517 999058 1000436 1001216 1001635 1001458 1000284 997838 994037 989001 983028 976374 968965 960439 950521
51947 950521 939249 926804 913335 898971 883813 867818 850857 832997 814526 795623 776303
51936 776303 756810 737707 719253 701024 682552 664057 646038 628358 610360 591847 573325
51925E73325j8150j7936j7823j7334j6555j6040j5879j5601j5110j4872j4973
51914C93052j4739j3664j2175j1051j0491j0114r573q753p647o436n555n416n959
51901B71479o638o878o562o121o045o214n931m803l360k433k158k091k035k130
51887B08080k241k034j665j693k096k204j849j755k398l200l429l190k863k253
51873A75210j154k66n72j918l038l039k198j339j026j449k407l261l308k488j398
51858A46349o66n16q51j336j488j063m41k64p08j389j928k169j970j214j53O98
51842A30891J063J034P02N9p27j313j562j639j688j682j585j330p22K46J071J112
51826A23930M10l75q51j212j558j549r94l72k91p32j151j140p22j24L98O25N47
$$ plain form
51925 573325 555175 537239 519416 502082 485527 469487 453608 438007 422897 408025 393052
51914 393052 378313 364649 352474 341423 330932 320818 311245 302492 294845 288409 282854 277438 271479
51901 271479 264841 257963 251401 245280 239235 233021 227090 222287 218927 216494 214336 212245 210210 208080
51887 208080 205839 203805 202140 200447 198351 196147 194298 192543 190145 186945 183516 180326 177463 175210
51873 175210 174056 173790 173218 171300 168262 165223 163025 161686 160660 159211 156804 153543 150235 147747 146349
51858 146349 145683 145167 144316 142980 141492 140429 139988 139724 139016 137627 135699 133530 131560 130346 130193 130891
51842 130891 131954 132988 133690 133749 133022 131709 130147 128508 126820 125138 123553 122223 121501 121747 122818 123930
51826 123930 124340 123965 123114 121902 120344 118795 117801 117429 117138 116406 115255 114115 113393 113269 113667 114292 114839
51809A14839L63K23J13R5L88R75J334R32k7o88m89K06N95M35K73O59J422J998
51791A23646K235K436K597K248J289M02J80L08K17P2L12N71P1r51j310o27L9k02
51773A33533p37n23K96P45N55M12P73J299J505J347R93N25M6k42k06R6M98P66
51755A41681P36O20R01J612J970J213l19j488j602r91l26M2R6K3J74O86J045N49
51737A46622o19j324q18K72O98pj177j867j654p29L90J279J863K290K550K474
51721A50243K121J838J717J459J002Q64J407K088K071J398R25J120J553J651J431
51706A72888J229J197J341J645J870J600Q90M98J045K143K868K935K913L278L796
51691B02136M040M054M125M198L928L307K824K855L091K784J619J18q42q78l15
$$ plain form
51809 114839 115202 115425 115538 115633 116021 116996 118330 119262 119235 118547 118058 118264 118859 119294 119567 120226 121648 123646
51791 123646 125881 128317 130914 133162 134451 134853 135033 135341 135558 135630 135942 136513 136584 135633 134323 133696 133735 133533
51773 133533 132796 132273 132569 133314 133869 134281 135054 136353 137858 139205 140198 140723 140769 140527 140321 140417 140915 141681
51755 141681 142417 143037 143938 145550 147520 148733 148414 146926 145324 144333 144007 144049 144145 144168 144342 145028 146073 146622
51737 146622 146003 144679 143861 144133 144831 144824 143647 141780 140126 139397 139787 141066 142929 145219 147769 150243
51721 150243 152364 154202 155919 157378 158380 159244 160651 162739 164810 166208 167133 168253 169806 171457 172888
51706 172888 174117 175314 176655 178300 180170 181770 182660 183158 184203 186346 189214 192149 195062 198340 202136
51691 202136 206176 210230 214355 218553 222481 225788 228612 231467 234558 237342 238961 239079 238237 237359 237044
51676B37044K94P00R57J143J288J469J711J845J602R93L84J57L24O13Q01Q56P58
51659B52939L37m63j292j554j079l82NK44Q47J666J820R00l67j000r05o13k74
51642B50829L61J069J153M37l87p18p84j072j519j682j406q95l82j9Q7O1K41P67
51624B46141J342J648J729J756J751J853K423L414M027L549K292J103K00q03j888
51609B70537k461k293j871j613j429j328j723k660l367l160k459k304l063m129
51595B36677m809m960m779m379l729k841j968j618k158l274m059l993l538l426
51581A87146l562l215k229j379j305j661j685j280j013j221j589j655j393j121
51567A62838j076j230j398j423j217q23l64Q8N24Q45P79J83o04r44o50l79q96
$$ plain form
51676 237044 237338 238038 238995 240138 241426 242895 244606 246451 248053 249046 249430 249587 249911 250524 251325 252181 252939
51659 252939 253276 252813 251521 249967 248888 248506 248511 248755 249602 251268 253088 253988 253621 252621 251716 251103 250829
51642 250829 251190 252259 253412 253849 253462 252744 251960 250888 249369 247687 246281 245386 245004 244985 245072 245133 245374 246141
51624 246141 247483 249131 250860 252616 254367 256220 258643 262057 266084 269633 271925 273028 273228 272425 270537
51609 270537 268076 265783 263912 262299 260870 259542 257819 255159 251792 248632 246173 243869 240806 236677
51595 236677 231868 226908 222129 217750 214021 211180 209212 207594 205436 202162 198103 194110 190572 187146
51581 187146 183584 180369 178140 176761 175456 173795 172110 170830 169817 168596 167007 165352 163959 162838
51567 162838 161762 160532 159134 157711 156494 155671 155307 155395 155919 156764 157543 157726 157122 156178 155528 155149 154253
51550A54253j987k433j374N35J721J368K07n14m40k07l33n74l87L47J302K155
51534A53639K704K785K437K080K147K540K820K931L340M231N068N249M824M175
51520B00970L333K153R20J60j18m35r89j393j378j230j237j270j279j616k365
51505A94226k754j973m26N40K36o79j151q70j26Q58K044L193L851L743L003K115
51489B05830J658J874K328K264J557J016J378K249K519J795Q09L37K62O3k95m00
51473B25244r4L89Q77J362J658J449Q25M26P20J435J870J620P82l69j529k294
51457B34371k302j639r07o95j078j675k147k456k717k905k835k399j764j299j259
51442B06294j577j950k130k084j876j457p64P4O65O98L08k0J00O35J254J609J508
$$ plain form
51550 154253 152266 149833 148459 148994 150715 152083 152290 151776 151336 151129 150796 150222 149835 150182 151484 153639
51534 153639 156343 159128 161565 163645 165792 168332 171152 174083 177423 181654 186722 191971 196795 200970
51520 200970 204303 206456 207376 207536 207418 206983 205994 204601 203223 201993 200756 199486 198207 196591 194226
51505 194226 191472 189499 189073 189613 189849 189170 188019 187149 187023 187881 189925 193118 196969 200712 203715 205830
51489 205830 207488 209362 211690 213954 215511 216527 217905 220154 222673 224468 225277 225614 225876 225939 225644 225244
51473 225244 225150 225539 226416 227778 229436 230885 231710 232136 232856 234291 236161 237781 238563 238194 236665 234371
51457 234371 232069 230430 229523 228828 227750 226075 223928 221472 218755 215850 213015 210616 208852 207553 206294
51442 206294 204717 202767 200637 198553 196677 195220 194456 194530 195195 195893 196201 196181 196281 196916 198170 199779 201287
51425B01287R75L14J9M91J673K990L724L583K947K478K472K746L199M032N165
51410B38095N775N193M085L954N184O395O193M889L846L654L739L534L112K732
51396C00380K435K225K092J872J491J208J167R47K09m87l91J65K50k8M03J626
51380C15564K211J222m50j552k206l174m247m557m007l302k845k543k441k675
51366B84998k978l035l108l542l924l642l072l199m134m909m781l950k867j736
51352B36121p80k81n7L98J142J710J938K154K456K424J770P06m72j573k211k038
51336B43407j470j513k581m026n044n415n282m825m451m628n263n771n975o230
51322A80933o540o318n379m337l627k985k315k208k908l561l299k500k092k171
$$ plain form
51425 201287 202262 202576 202595 203086 204759 207749 211473 215056 218003 220481 222953 225699 228898 232930 238095
51410 238095 243870 249063 253148 257102 262286 268681 274874 279763 283609 287263 291002 294536 297648 300380
51396 300380 302815 305040 307132 309004 310495 311703 312870 313817 314026 313539 313148 313313 313563 313535 313938 315564
51380 315564 317775 318997 318547 316995 314789 311615 307368 302811 298804 295502 292657 290114 287673 284998
51366 284998 282020 278985 275877 272335 268411 264769 261697 258498 254364 249455 244674 240724 237857 236121
51352 236121 235341 235060 235003 235401 236543 238253 240191 242345 244801 247225 248995 249701 249229 247656 245445 243407
51336 243407 241937 240424 237843 233817 228773 223358 218076 213251 208800 204172 198909 193138 187163 180933
51322 180933 174393 168075 162696 158359 154732 151747 149432 147224 144316 140755 137456 134956 132864 130693
51308A30693k194k088k197k345j920r46k78n33j336j815j495o62q8k75q22p95
51292A10904N7Q45P19qm31l39k13k59k71k85n74r52q06K3R61J447J499J407J351
51273A15075J405J539J562J375J385K124L392M180L707K245Q35L69R71J973K458
51258A44595K089J398J076J128J041O17O3o04j603k751l405l286k908k829k970
51243A31651k976k871k900k990k810k304j813j616j617j511j171q21q57j411k084
51228A01899k300j946j471j292j291j091o02l5N23J174J770J748P30p73j584j008
51212I4451L30J057M44r34j920j930j281o39l92m73n03j48N33J032Q73J17o19
51195H9998p23q7Q62J455J225J99j049j792j678j050o75j019j696j796r16K48
$$ plain form
51308 130693 128499 126411 124214 121869 119949 119003 118725 118192 116856 115041 113546 112884 112796 112521 111699 110904
51292 110904 110961 111806 112525 112517 112086 111747 111534 111275 111004 110719 110145 109193 108387 108410 109371 110818 112317 113724 115075
51273 115075 116480 118019 119581 120956 122341 124465 127857 132037 135744 137989 138824 139193 140164 142137 144595
51258 144595 146684 148082 149158 150286 151327 151944 152007 151403 149800 147049 143644 140358 137450 134621 131651
51243 131651 128675 125804 122904 119914 117104 114800 112987 111371 109754 108243 107072 106251 105394 103983 101899
51228 101899 99599 97653 96182 94890 93599 92508 91906 91871 92394 93568 95338 97086 97816 97043 95459 94451
51212 94451 94781 95838 96282 95348 93428 91498 90217 89578 89186 88713 88210 88062 88595 89627 90500 90617 89998
51195 89998 89275 89188 90050 91505 92730 92929 91880 90088 88410 87360 86685 85666 83970 82174 81258 81506
51179H1506O27O3n41l88K15L43l07j005q61J19R67Q62J53j3Q34J811J801R42L00
51160H7428L29M37J46j90j35Q5J06J32N30J079J212Q17K89j7k7K06N52Q28R94
51141I4801J156J275J163R23Q93J043R43N85N35R56J182P97L31K43L7p35j312
51124A04816p65L68P76L79K96Q30R61J15q38q86j83N45R90J146Q48R9o56j112
51106A07729j481j946k191j940j518j395j465j281p87m29o27j330j986j905r17
51091H6531K83P69M01j78n10p51r94q48p9Q37J249J102P83N01K42J24L40Q14J160
51072I1776J099P42M62N04O98O67L42K8j61o07j522k379k492j997j599j545j491
51055H2525j282j105q69k35O08J010Q54P33R38J020O68K86K76L99K98J16J70N21
$$ plain form
51179 81506 82133 82196 81655 81267 81482 81825 81518 80513 79652 79771 80738 81600 81753 81740 82574 84385 86186 87128 87428
51160 87428 87757 88194 88340 88150 88015 88100 88206 88338 88868 89947 91159 91976 92265 92248 92221 92427 92979 93807 94801
51141 94801 95957 97232 98395 99318 100211 101254 102197 102782 103317 104273 105455 106252 106583 106826 106863 106128 104816
51124 104816 104051 104419 105195 105574 105870 106700 107661 107776 106938 106052 105869 106414 107404 108550 109398 109497 108841 107729
51106 107729 106248 104302 102111 100171 98653 97258 95793 94512 93725 93296 92669 91339 89353 87448 86531
51091 86531 86814 87583 87984 87806 87296 86545 85551 84703 84624 85461 86710 87812 88595 89096 89338 89462 89802 90616 91776
51072 91776 92875 93617 94079 94583 95281 95948 96290 96318 96157 95550 94028 91649 89157 87160 85561 84016 82525
51055 82525 81243 80138 79269 79034 79642 80652 81506 82239 83177 84197 84865 85151 85427 85826 86124 86240 86410 86931
51037H6931J149J996K543K152J106N88J094J680J375N55J93L83N52N42N88N41
51021A03968J33k39J14J034J542J010k36j392j732r21N51J457J092L58P87K441
51005A09967L658L113J382J3l34k55m26p77r16q36q25q19l01Q98K037K171J307
50988A19057L45m8n4n8j07j54l07m62k38L72Q32Q36P04O74M69Kj96J67M97K54
50968A22585j24L3N40Q43J008J321J393Q23K67P02J797K274J817J359J458J619
50952A39715J496J536K029K485K483K305K269K217K103K250K592K494J919J925
50938A69818L247M998N667N014M190M164M844N660O376P151Q108R046R565R529
50924B57377R444R968J1060J2000J2466J3043J4317J5947J7154J7832J8632K0065
$$ plain form
51037 86931 88080 90076 92619 94771 95877 96465 97559 99239 100614 101169 101362 101745 102297 102839 103427 103968
51021 103968 104101 103862 103976 105010 106552 107562 107326 105934 104202 103281 103832 105289 106381 106739 107526 109967
51005 109967 113625 116738 118120 118133 117799 117544 117118 116341 115425 114589 113764 112945 112644 113542 115579 117750 119057
50988 119057 119402 119354 119300 119242 119135 118981 118674 118212 117974 118346 119178 120014 120718 121392 121861 121863 121667 121834 122331 122585
50968 122585 122461 122494 123034 123877 124885 126206 127599 128422 128689 129391 131188 133462 135279 136638 138096 139715
50952 139715 141211 142747 144776 147261 149744 152049 154318 156535 158638 160888 163480 165974 167893 169818
50938 169818 173065 178063 183730 188744 192934 197098 201942 207602 213978 221129 229237 238283 247848 257377
50924 257377 266821 276789 287849 299849 312315 325358 339675 355622 372776 390608 409240 429305
50912D29305K2041K4201K6333K8346L0205L2066L4269L7093M0467M3862M6598
50901G94786M8387M9605N0819N2041N2734N2584N1861N0847M9229M6389M2119
50890A341401L6807L1038K5245J9620J4186Q892L756j183n911j0278j3863j6389
50878A433321j8198j9941k1665k2679k2505k1542k0579k0085k0246k1192k2753
50867A201936k4265k5220k5946k7187k9072l0968l2292l3020l3415l3673l3981
50856H72897l4542l5270l5598l4844l2828l0096k7524k5632k4171k2418k0014
50845E49960j7402j5376j4230j3547j2715j1488j0009q565p410o635o034n170
50833D21379l814k252j017k90K51Q92J468J743J944K484L295L848M072M585N780
$$ plain form
50912 429305 451346 475547 501880 530226 560431 592497 626766 663859 704326 748188 794786
50901 794786 843173 892778 943597 995638 1048372 1100956 1152817 1203664 1252893 1299282 1341401
50890 1341401 1378208 1409246 1434491 1454111 1468297 1477189 1480945 1479762 1473851 1463573 1449710 1433321
50878 1433321 1415123 1395182 1373517 1350838 1328333 1306791 1286212 1266127 1245881 1224689 1201936
50867 1201936 1177671 1152451 1126505 1099318 1070246 1039278 1006986 973966 940551 906878 872897
50856 872897 838355 803085 767487 732643 699815 669719 642195 616563 592392 569974 549960
50845 549960 532558 517182 502952 489405 476690 465202 455193 446628 439218 432583 426549 421379
50833 421379 417565 415313 414296 414006 414257 415149 416617 418360 420304 422788 426083 429931 434003 438588 444368
50818D44368P108P808Q019Q523R552J0523J0996J1308J2019J3172J4382J5420
50806E73198J6445J7791J9678K1921K4001K5607K7174K9533L2937L6798M0500
50795H65583M4099M8020N2351N6831O1397O6344P1936P8078Q4433R0789R7103
50784A616964J03165J08417J12405J15376J17941J19920J20017J17139J11631
50775B642975J04477R5625Q4059O9610N3718L7981K2817Q025n964j8387k9151
50764C065785l8669m6668n1997n3931n3159n1127m8747m6091m3180m0552l8887
50753B552777l8428l9130m1197m4827m9412n3715n7306o1237o6544p2478p7126
50742A951377p9642q0817q1377q0877p8714p5214p1035o6213o0630n4878m9763
$$ plain form
50818 444368 451476 459284 467303 475826 485378 495901 506897 518205 530224 543396 557778 573198
50806 573198 589643 607434 627112 649033 673034 698641 725815 755348 788285 825083 865583
50795 865583 909682 957702 1010053 1066884 1128281 1194625 1266561 1344639 1429072 1519861 1616964
50784 1616964 1720129 1828546 1940951 2056327 2174268 2294188 2414205 2531344 2642975
50775 2642975 2747452 2843077 2927136 2996746 3050464 3088445 3111262 3119287 3113323 3094936 3065785
50764 3065785 3027116 2980448 2928451 2874520 2821361 2770234 2721487 2675396 2632216 2591664 2552777
50753 2552777 2514349 2475219 2434022 2389195 2339783 2286068 2228762 2167525 2100981 2028503 1951377
50742 1951377 1871735 1790918 1709541 1628664 1549950 1474736 1403701 1337488 1276858 1221980 1172217
50731A172217m5204m0440l5189k9905k4929k0145j5529j1446q188n562l193r65
50719I31522Q74J946K093J619J112Q52N18l13j618l036m338n545o711p836q806
50704I02333r272q962q347q494r808j1217j1267r862q260p452p171o500m911k453
50690G88357M49L160N138O428P665R387J1515J3651J5615J7558J9656K1897K4188
50677I44664K6607K9461L3008L7045M1069M4842M8625N2662N6712O0422O3837
50666A438954O7170P0189P2265P2967P2227O9952O5966O0364N3582M5941L7380
50655B126957K7756J7152N916n350j5841k4857l2150l7758m1602m3491m3561m2341
50643A890830m0328l7768l4887l1996k9302k6907k5043k4059k4041k4729k5936
$$ plain form
50731 1172217 1127013 1086573 1051384 1021479 996550 976405 960876 949430 941242 935680 932487 931522
50719 931522 932396 934342 936435 938054 939166 940018 940536 940223 938605 935569 931231 925686 918975 911139 902333
50704 902333 893061 884099 875752 867258 857450 846233 834966 825104 816844 809392 802221 795721 790810 788357
50690 788357 788806 791966 797104 803532 811197 820584 832099 845750 861365 878923 898579 920476 944664
50677 944664 971271 1000732 1033740 1070785 1111854 1156696 1205321 1257983 1314695 1375117 1438954
50666 1438954 1506124 1576313 1648578 1721545 1793772 1863724 1929690 1990054 2043636 2089577 2126957
50655 2126957 2154713 2171865 2177781 2172431 2156590 2131733 2099583 2061825 2020223 1976732 1933171 1890830
50643 1890830 1850502 1812734 1777847 1745851 1716549 1689642 1664599 1640540 1616499 1591770 1565834
50632A565834k7807l0479l3747l7181m0385m2998m4615m4945m4057m2334m0165
$$ plain form
50632 1565834 1538027 1507548 1473801 1436620 1396235 1353237 1308622 1263677 1219620 1177286 1137121
$$ [...]
##END NTUPLES=NMR SPECTRUM
##END=
