
##TITLE=AC1084_CANE01_5818974_GdcpBjHsnk
##JCAMPDX= 6.0         $$ Bruker NMR JCAMP-DX V2.0
##DATA TYPE= NMR SPECTRUM
##DATA CLASS= NTUPLES
##ORIGIN= BRUKER
##OWNER= Administrator
$$ 1.72 TOPSPIN		Version 2.1
$$ 2012-03-24 23:33:01.453 -0500  Administrator@TOPSPIN
$$ Compression mode = diff/dup
##.OBSERVE FREQUENCY= 400.13188235
##.OBSERVE NUCLEUS= ^1H
##.ACQUISITION MODE= SIMULTANEOUS (DQD)
##.ACQUISITION SCHEME= undefined
##.AVERAGES= 8
##.DIGITISER RES= 22
##SPECTROMETER/DATA SYSTEM= spect
##.PULSE SEQUENCE= zg30
##.SOLVENT NAME= COFFEE_meoh
##.SHIFT REFERENCE= INTERNAL, COFFEE_meoh, 1, 14.98061
##AUDIT TRAIL= $$ (NUMBER, WHEN, WHO, WHERE, PROCESS, VERSION, WHAT)
$$ ##TITLE= Audit trail, TOPSPIN		Version 2.1
$$ ##JCAMPDX= 5.01
$$ ##ORIGIN= Bruker BioSpin GmbH
$$ ##OWNER= Administrator
$$ $$ C:\Bruker\TOPSPIN/data/COFFEE/nmr/AC1084_CANE01_5818974_GdcpBjHsnk/10/pdata/1/auditp.txt
$$ ##AUDIT TRAIL=  $$ (NUMBER, WHEN, WHO, WHERE, PROCESS, VERSION, WHAT)
(   1,<2012-03-24 23:32:54.078 -0500>,<Administrator>,<TOPSPIN>,<go>,<TOPSPIN 2.1>,
      <created by zg
	started at 2012-03-24 23:31:47.546 -0500,
	POWCHK enabled, PULCHK disabled,
       configuration hash MD5:
       1A 1E CE 29 27 FD 77 03 67 4E F0 E3 C4 B2 CB 90
       data hash MD5: 64K
       F8 7D 65 DE DB DC 95 A4 D0 6F D2 63 5E AF 69 39>)
(   2,<2012-03-24 23:32:56.937 -0500>,<Administrator>,<TOPSPIN>,<proc1d>,<TOPSPIN 2.1>,
      <Start of raw data processing
       efp LB = 0 FT_mod = 6 PKNL = 1 PHC0 = 0 PHC1 = 0 SI = 32K 
       data hash MD5: 32K
       3E 42 15 45 12 2D 2A 63 82 A3 E9 29 68 A2 FF D2>)
(   3,<2012-03-24 23:32:57.296 -0500>,<Administrator>,<TOPSPIN>,<proc1d>,<TOPSPIN 2.1>,
      <pk PHC0 = 217.0459 PHC1 = 0 
       data hash MD5: 32K
       C1 72 F3 95 DB 80 EA B6 34 55 7F 4A 14 FB 7A E6>)
(   4,<2012-03-24 23:32:57.375 -0500>,<Administrator>,<TOPSPIN>,<proc1d>,<TOPSPIN 2.1>,
      <abs ABSG = 1 
       data hash MD5: 32K
       5E 08 11 F1 65 12 42 9A 91 CB 9A 6B 1B B8 C8 77>)
(   5,<2012-03-24 23:32:57.406 -0500>,<Administrator>,<TOPSPIN>,<proc1d>,<TOPSPIN 2.1>,
      <abs ABSG = 2 
       data hash MD5: 32K
       B4 E6 B7 BA 0E 0D 63 D3 98 35 C1 38 9A 51 31 C4>)
(   6,<2012-03-24 23:32:57.437 -0500>,<Administrator>,<TOPSPIN>,<proc1d>,<TOPSPIN 2.1>,
      <abs ABSG = 3 
       data hash MD5: 32K
       5C A9 40 A0 FC 5B 69 A0 51 EC 59 5B F4 F6 6C 6C>)
(   7,<2012-03-24 23:32:57.468 -0500>,<Administrator>,<TOPSPIN>,<proc1d>,<TOPSPIN 2.1>,
      <abs ABSG = 4 
       data hash MD5: 32K
       7B D5 0B 2B BA C8 36 FD 64 91 E1 28 5F 64 3B 0E>)
(   8,<2012-03-24 23:32:57.671 -0500>,<Administrator>,<TOPSPIN>,<proc1d>,<TOPSPIN 2.1>,
      <abs ABSG = 5 
       data hash MD5: 32K
       76 63 D0 86 0C 16 66 C6 E7 0D 12 BC E7 ED C1 26>)
$$ ##END=
$$ 
$$ $$ hash MD5
$$ $$ F8 82 75 9F 92 4D BC 4D 1A 64 D0 8D 4A 69 88 0D
##$RELAX= 
##$RELAX= 
##$RELAX= 
##$RELAX= 
##$RELAX= 
##$RELAX= 
##$RELAX= 
$$ Bruker specific parameters
$$ --------------------------
$$ [...]
##$TP= (0..7)
150 150 150 150 150 150 150 150
##$TP07= 0
##$TPNAME0= <>
##$TPNAME1= <>
##$TPNAME2= <>
##$TPNAME3= <>
##$TPNAME4= <>
##$TPNAME5= <>
##$TPNAME6= <>
##$TPNAME7= <>
##$TPOAL= (0..7)
0.5 0.5 0.5 0.5 0.5 0.5 0.5 0.5
##$TPOFFS= (0..7)
0 0 0 0 0 0 0 0
##$TUNHIN= 0
##$TUNHOUT= 0
##$TUNXOUT= 0
##$USERA1= <user>
##$USERA2= <user>
##$USERA3= <user>
##$USERA4= <user>
##$USERA5= <user>
##$V9= 5
##$VALIST= <valist>
##$VCLIST= <CCCCCCCCCCCCCCC>
##$VD= 0
##$VDLIST= <DDDDDDDDDDDDDDD>
##$VPLIST= <PPPPPPPPPPPPPPP>
##$VTLIST= <TTTTTTTTTTTTTTT>
##$WBST= 2048
##$WBSW= 25
##$XGAIN= (0..3)
0 0 0 0
##$XL= 0
##$YL= 0
##$YMAX_a= 508478
##$YMIN_a= -603010
##$ZGOPTNS= <>
##$ZL1= 120
##$ZL2= 120
##$ZL3= 120
##$ZL4= 120
##$ABSF1= 14.98061
##$ABSF2= -5.57192
##$ABSG= 5
##$ABSL= 3
##$ALPHA= 0
##$AQORDER= 0
##$ASSFAC= 0
##$ASSFACI= 0
##$ASSFACX= 0
##$ASSWID= 0
##$AUNMP= <proc_prof1d_extract_pilot.lims>
##$AXLEFT= 0
##$AXNAME= <>
##$AXNUC= <1H>
##$AXRIGHT= 0
##$AXTYPE= 0
##$AXUNIT= <>
##$AZFE= 0.1
##$AZFW= 0.1
##$BCFW= 0
##$BC_mod= 0
##$BYTORDP= 0
##$COROFFS= 0
##$CY= 15
##$DATMOD= 1
##$DC= 0
##$DFILT= <>
##$DTYPP= 0
##$F1P= 0
##$F2P= 0
##$FCOR= 0.5
##$FTSIZE= 32768
##$FT_mod= 6
##$GAMMA= 0
##$GB= 0
##$INTBC= 1
##$INTSCL= 1
##$ISEN= 128
##$LB= 0
##$LEV0= 0
##$LPBIN= 0
##$MAXI= 10000
##$MC2= 0
##$MEAN= 0
##$ME_mod= 0
##$MI= 0
##$NCOEF= 0
##$NC_proc= -8
##$NLEV= 6
##$NOISF1= 0
##$NOISF2= 0
##$NSP= 0
##$NTH_PI= 0
##$NZP= 0
##$OFFSET= 14.98061
##$PC= 1
##$PHC0= 217.0459
##$PHC1= 0
##$PH_mod= 1
##$PKNL= yes
##$PPARMOD= 0
##$PPDIAG= 0
##$PPIPTYP= 0
##$PPMPNUM= 2147483647
##$PPRESOL= 1
##$PSCAL= 4
##$PSIGN= 0
##$PYNMP= <proc.py>
##$REVERSE= no
##$SF= 400.13
##$SI= 32768
##$SIGF1= 0
##$SIGF2= 0
##$SINO= 400
##$SIOLD= 32768
##$SPECTYP= <>
##$SREGLST= <1H.CDCl3>
##$SSB= 0
##$STSI= 32768
##$STSR= 0
##$SW_p= 8223.68421052632
##$SYMM= 0
##$S_DEV= 0
##$TDeff= 65536
##$TDoff= 0
##$TI= <>
##$TILT= no
##$TM1= 0
##$TM2= 0
##$TOPLEV= 0
##$USERP1= <user>
##$USERP2= <user>
##$USERP3= <user>
##$USERP4= <user>
##$USERP5= <user>
##$WDW= 1
##$XDIM= 32768
##$YMAX_p= 440657058
##$YMIN_p= -737159
##$CURPLOT= <Network HP LaserJet P1505>
##$CURPRIN= <$Network HP LaserJet P1505>
##$DFORMAT= <normdp>
##$LAYOUT= <+/1D_H.xwp>
##$LFORMAT= <normlp>
##$PFORMAT= <normpl>
##$SURQMSG= 1
$$ End of Bruker specific parameters
$$ ---------------------------------
##NTUPLES= NMR SPECTRUM
##VAR_NAME=  FREQUENCY,     SPECTRUM/REAL,   SPECTRUM/IMAG
##SYMBOL=    X,             R,               I
##VAR_TYPE=  INDEPENDENT,   DEPENDENT,       DEPENDENT
##VAR_FORM=  AFFN,          ASDF,            ASDF
##VAR_DIM=   32768,         32768,           32768
##UNITS=     HZ,            ARBITRARY UNITS, ARBITRARY UNITS
##FACTOR=    0.250966925370066, 1,           1
##FIRST=     8223.43324360095, -15782,       28842
##LAST=      0,             45120,           10604
##MIN=       0,             -737159,         0
##MAX=       8223.43324360095, 440657058,    0
$$ Real data points
##PAGE= N=1
##DATA TABLE= (X++(R..R)), XYDATA
$$ [...]
$$ plain form
19476 -49075 -189492 -168154 -49215 -103091 -219380 -21791 -154076 -9840 -44279 -117769 -139744
19465 -139744 -122090 -200366 -180670 -135649 -108415 81181 135362 -103410 20201 158722 56353
19453 30534 -246004 51006 -188017 92648 -4207 -191653 -61827 -98323 1145 102857 105170
19442 105170 -184463 -243997 143327 -19325 -118125 -250094 -61688 106061 -29253 -160210
19432 -160210 26011 -225721 -38016 -152826 76974 -241020 -112641 -197680 -325150 -466256
19422 -466256 -292205 -83652 10089 138464 207656 -97458 -248859 -308835 -88843 -17760 26955
19410 -370044 -102513 -98245 -49294 -375559 -41647 149605 -55267 -74668 181429 121085 -96796
19398 -205254 -146881 -98383 247632 -69826 239353 -278602 -172760 -216668 -311728 -285221 -27758
$$ packed form
19476d9075j40417K1338d9215n3876j16289b1791j32285i840l4439p3490k1975
19465a39744J7654p8276J9696M5021K7234H1181N4181a03410B0201J38521E6353
19453C0534b46004E1006a88017I2648d207j87446f1827l6496A145J01712K313
19442A05170a84463n9534A43327a9325r8800j31969f1688A06061b9253j30957
19432a60210B6011b25721c8016j14810G6974b41020a12641q5039j27470j41106
19422d66256J74051h3652A0089J28375O9192i7458j51401n9976h8843a7760B6955
19410c70044a02513M268M8951l26265d1647A49605e5267j9401A81429o0344i6796
19398b05254N8373M8498B47632f9826B39353b78602J05842m3908r5060K6507b7758
$$ plain form
19386 58203 -335514 -77144 -253705 118461 -262314 -106984 -1281 46781 93520 -311358 -252612
19375 -252612 -176958 -94371 249553 15631 35303 -245563 -204846 -82930 -124014 -596662 187998
19363 96857 2852 -1626 142148 -212208 3648 -249998 48079 -280246 -287802 -330767 -176664
19352 -176664 -242205 -94689 133475 129172 25242 -470580 18306 -98215 194482 16878 4724
19340 54471 -274560 -134194 8704 357265 -185882 175473 113349 81574 -28813 -111616 -202336
19329 -202336 -279899 131144 -40123 -268197 -104036 -162103 81570 310136 75216 6812 -28223
19317 -171944 -360371 -89995 -118566 -53149 -347895 -301173 -40153 134673 16276 -292279 -12788
19305 -5364 43946 -130437 123963 -133820 87740 60315 91260 -15045 -358221 166669 -10938
$$ packed form
19386E8203c35514g7144j76561A18461b62314a06984a281D6781M6739c11358N8746
19375b52612P5654Q2587B49553A5631J9672b45563M0717h2930m1084m72648A87998
19363I6857B852a626A42148b12208C648b49998D8079b80246p556m2965J54103
19352a76664o5541i4689A33475m303B5242d70580A8306i8215A94482A6878D724
19340E4471b74560a34194H704L48561a85882A75473o2124l1775b8813q2803r0720
19329b02336p7563A31144d0123k28074a04036n8067H1570K28566G5216F812b8223
19317a71944j88427h9995k8571e3149k94746M6722d0153A34673A6276b92279a2788
19305e364D3946a30437A23963a33820H7740k7425L0945a5045l43176A66669a0938
$$ plain form
19293 -208125 -167175 -229211 -185848 -165841 135952 16068 -135194 -110187 -32259 66475 -373175
19281 135648 -158318 -205553 -245379 -40719 -31951 -531969 -27983 65003 -161787 -286028 -276921
19270 -276921 -107606 112958 -86619 127686 64665 -133496 -67803 56388 -109627 -80768
19260 -80768 -54205 -259401 106666 192312 170875 -273550 91149 103106 -237662 -234639 -313764
19249 -313764 15759 -79133 149260 -322922 -117687 17420 -169878 -191736 -206272 -51787 -120465
19238 -120465 -424334 50074 -52883 -278657 -438209 -192489 -42009 103258 50846 110074
19228 110074 -11735 -198209 -233006 280549 35292 -11705 -57391 7633 224773 211297 -340974
19216 175102 -93719 83653 -181487 -111762 -148357 -8522 -370660 -21542 61291 -39783 -265354
$$ packed form
19293b08125M0950o2036M3363K0007A35952A6068a35194K5007c2259F6475c73175
19281A35648a58318m7235l9826d0719Q768n00018b7983F5003a61787j24241R107
19270b76921a07606A12958h6619A27686o3021a33496O5693E6388a09627K8859
19260h0768K6563k05196A06666Q5646k1437b73550I1149J1957b37662L023p9125
19249c13764A5759g9133A49260c22922a17687A7420a69878k1858j4536e1787o8678
19238a20465l03869E0074e2883k25774j59552a92489d2009A03258E0846N9228
19228A10074a1735j86474l4797B80549C5292a1705m5686G633K17140j3476c40974
19216A75102i3719H3653a81487O9725l6595h522l62138b1542F1291c9783k25571
$$ plain form
19205 -265354 117350 -298978 124180 -116194 93754 -202527 -33480 -257885 -88440 253281
19194 -46100 -3419 -138380 -180700 -106310 -587407 -200416 -84602 -193216 -100538 -223255 -451613
19183 -451613 -169195 -36838 -440915 299658 171972 -42392 -38964 -91767 229282 -511209
19172 91953 -47723 -176380 -159428 -102732 36271 -121373 -277117 -386977 -94075 220910 88950
19160 -4943 -146941 -313184 -99938 -228233 -271330 -269398 152562 -319814 106869 -136610 -78932
19149 -78932 -334075 -232590 -111201 39530 -196731 -61989 -177325 80868 -51049 142091
19138 -98145 -59386 -66943 -58574 46917 24421 -335988 144661 40943 35080 -47801 104803 -108531
19125 -86564 -26074 171061 -6883 -64395 -37915 4872 299310 144708 -29293 -125659 -154194
$$ packed form
19205b65354A17350b98978A24180a16194I3754b02527c3480k24405h8440B53281
19194d6100c419j34961m2320P4390m81097b00416h4602j08614R2678j22717k28358
19183d51613a69195c6838m04077B99658j27686d2392L428n2803B29282e11209
19172I1953d7723j28657J6952N6696C6271a21373j55744j09860i4075B20910H8950
19160d943j41998j66243i9938j28295m3097J932A52562c19814A06869a36610N7678
19149g8932k55143J01485a11201C9530a96731f1989j15336H0868e1049A42091
19138i8145L8759p557Q369D6917k2496c35988A44661D0943n863d7801A04803a08531
19125h6564b6074A71061f883n7512K6480D872K94438A44708b9293r6366k8535
$$ plain form
19114 -154194 -262053 -43362 -171710 -73128 -33399 15563 74805 -29968 1605 -322903 -100704
19102 -77145 -123344 -148744 -241241 156105 -44444 121119 -144348 -155167 333954 -5284 -6686
19091 -6686 -13761 -36883 -430381 -133561 -46280 24844 -180478 -28085 -360370 13935 77319
19080 77319 -99475 -107180 34909 -339661 -70543 -25929 -98429 132001 -244527 -133875 59360
19068 -253688 -174452 178515 71559 -211603 147728 -228746 -110875 -137108 113941 123892
19058 123892 -363079 42629 531452 -156045 -74980 73533 79869 -439864 125993 56508 26068
19046 89785 28945 -40380 -220907 50655 169949 75000 -137440 -326448 181654 -126862
19035 -29890 -177993 -114279 -104850 -304515 884 -71934 -38092 -287723 299243 -10304 -126656
$$ packed form
19114a54194j07859d3362j28348g3128c3399A5563N9242b9968A605c22903a00704
19102g7145m6199k5400r2497A56105d4444A21119a44348j0819C33954e284j402
19091f686p075k3122l93498a33561d6280B4844a80478b8085l32285A3935O3384
19080G7319i9475p705C4909c39661g0543b5929p2500A32001b44527J10652E9360
19068b53688P9236A78515G1559b11603A47728b28746a10875k6233A13941R951
19058A23892c63079D2629M88823a56045g4980G3533O336d39864A25993E6508B6068
19046H9785B8945d0380j80527E0655J19294G5000a37440j89008A81654a26862
19035b9890j48103O3714R429j99665H84g1934L3842k49631B99243a0304j16352
$$ plain form
19024 -126656 -90452 -150683 -190247 -14932 -4230 -94289 -51457 32144 -94007 108537 -78113
19012 105995 -4428 -141813 -12076 -83300 195597 57421 -134049 -198751 41345 165082 -155468
19000 87922 76912 -322851 85381 -282760 354904 205405 -226955 6093 15960 -9088 21025
18988 -57641 -180674 -52464 44523 -244230 -93835 -230378 92871 -53640 -13232 227984 -78500
18976 -325973 -186792 -213667 129488 -13737 66385 -55610 -129050 -159481 18712 -109345 -241422
18965 -241422 316107 -190174 106448 136236 172861 -151751 -316541 447475 -49811 109680
18954 287796 401224 36421 -193973 -130806 163331 -155100 -198873 -214028 164543 -325124
18943 -87075 219229 -301513 -86852 266852 92673 -98815 -238268 89030 -267415 24206 -91904
$$ packed form
19024a26656L6204o0231l9564a4932d230r0059M2832C2144i4007A08537g8113
19012A05995d428j37385a2076p1224A95597E7421a34049o4702D1345J23737a55468
19000H7922j1010c22851H5381b82760C54904j49499b26955F093R867i088B1025
18988e7641j23033e2464D4523b44230i3835j36543I2871e3640a3232B27984g8500
18976c25973J39181k6875A29488a3737F6385e5610p3440l0431A8712a09345j32077
18965b41422C16107a90174A06448K9788L6625a51751j64790D47475d9811A09680
18954B87796J13428C6421a93973O3167A63331a55100m3773j5155A64543c25124
18943h7075B19229c01513h6852B66852I2673i8815j39453H9030b67415B4206i1904
$$ plain form
18931 -255538 -300221 -36975 -264008 -82022 47084 -51988 78739 -293033 -104790 -104436 -125795
18920 -125795 249963 -66076 161568 193709 179529 -261099 -157411 -1509 20055 -123353 -112310
18909 -112310 -17261 -2481 -174303 174418 -47400 -225825 -130570 158095 165603 270016 29490
18897 -343436 29493 -287342 258213 0 135084 409803 271598 83482 146252 140075 112248
18886 112248 279406 -93158 132440 -119480 21843 -215716 -173981 -41735 -143999 67836
18875 -63969 22289 -107398 -290850 -114710 -595292 -42389 -7564 -86145 -304543 -62498 206543
18863 -98879 52814 -172731 43003 -212909 -152395 -149004 -168493 -138066 179919 227290 -151817
18851 125911 32975 -165570 -60615 18066 -22663 78097 89487 -99373 -90323 11083 -104874
$$ packed form
18931b55538m4683c6975k27033h2022D7084e1988G8739b93033a04790L54k1359
18920a25795B49963f6076A61568L2141j4180b61099J03688a509B0055a23353J1043
18909a12310a7261b481j71822A74418d7400j78425R5255A58095P508J04413B9490
18897c43436B9493b87342B58213@A35084K74719j38205H3482O2770o177k7827
18886A12248J67158i3158A32440a19480B1843b15716M1735d1735j02264F7836
18875f3969B2289a07398j83452a14710m80582d2389g564p8581k18398f2498B06543
18863i8879E2814a72731D3003b12909O0514L391j9489L0427A79919M7371a51817
18851A25911C2975a65570f0615A8066b2663G8097J1390i9373R050A1083a04874
$$ plain form
18839 295097 155583 180458 -177978 -241558 72573 -259012 -45621 -88577 144340 125932 -27879
18827 -361924 -83296 -107335 103503 177490 -21534 -83649 -191401 -118948 68631 -62120 41398
18815 360737 -147662 46495 -158742 -81228 -79483 -54513 210975 -97458 -150803 194143 11412
18803 332461 -95730 105022 26568 136407 -47006 93634 -138892 78734 -109472 -187323 85528
18791 366940 373151 52487 31047 -26831 -53911 -45209 -108935 8073 104842 175702 245302 -229034
18778 -58066 -80626 73618 -315680 -55281 -54560 37102 -87347 -212146 289674 120025 -85801
18766 -34042 77767 175608 -26907 44690 221880 426 -35682 -82909 -53611 304455 -76802 -67089
18754 -67089 -29836 -22995 -19742 -169869 288441 -175532 -12261 111296 37253 -274048 -324628
$$ packed form
18839B95097j39514K4875a77978o3580G2573b59012d5621m2956A44340j8408b7879
18827c61924h3296k4039A03503P3987b1534o2115j07752P2453F8631f2120D1398
18815C60737a47662D6495a58742P7514J745K4970B10975i7458n3345A94143A1412
18803C32461i5730A05022B6568J09839d7006I3634a38892G8734a09472p7851H5528
18791C66940O211E2487k1440b6831k7080Q702o3726H073R6769P0860O9600b29034
18778e8066k2560G3618c15680e5281P21C7102h7347j24799B89674A20025h5801
18766c4042G7767R7841b6907D4690J77190D26c5682m7227K9298C04455g6802R713
18754f7089b9836O841L253j50127B88441a75532a2261A11296C7253b74048n0580
$$ plain form
18743 -324628 21246 -68369 33152 -85971 -144935 7059 -389075 -46365 -14555 -7489 -255518
18732 -255518 -166336 -267933 298121 10665 -65478 241505 -361551 -245200 -7963 -186921
18722 -186921 224881 -36280 -305086 -83292 -40207 65927 -71315 -135812 -110731 -374789 -142186
18710 -183388 -52478 381 -254060 -191853 303620 -158122 3531 95749 -9568 344407 161251
18698 -200170 -145740 -48345 -53262 -75693 -514783 -57952 -199832 -30637 9861 -208746 -46701
18686 16419 -200335 44013 28276 129259 -57514 -291644 56987 -529 86978 36038 -103016
18674 124091 -247465 37018 18425 -154790 34638 -61609 147045 -220001 13592 -427541
18663 -353067 -239311 123405 -208326 30444 151139 -219995 9490 -18072 38410 21206 8778
$$ packed form
18743c24628B1246f8369C3152h5971n8964G059c89075d6365a4555P066k48029
18732b55518Q9182j01597B98121A0665f5478B41505c61551J16351g963j78958
18722a86921B24881c6280k68806h3292d0207F5927g1315o4497K5081k64058a42186
18710a83388e2478C81b54060O2207C03620a58122C531R2218i568C44407A61251
18698b00170N4430d8345m917k2431m39090e7952j41880c0637I861b08746d6701
18686A6419b00335D4013j5737J00983e7514k34130E6987e29H6978C6038a03016
18674A24091b47465C7018A8425a54790C4638f1609A47045b20001A3592d27541
18663c53067J13756A23405b08326C0444J20695b19995I490a8072C8410j7204H778
$$ plain form
18651 -233848 -100063 17958 81172 -150274 -415472 -42002 140281 -89602 336356 -86544
18640 121290 -174581 -322335 159074 -270689 -279315 -103491 63810 -264482 -203069 -109441
18630 -109441 -291832 213351 -238363 -354114 34469 323216 118195 370653 -96963 -29748
18619 -131247 -179790 -157523 -116331 -15733 -295158 -486043 25023 -68596 -197152 -323018 -12124
18607 -52758 -25317 -82335 -215769 -497925 -240644 -153600 301519 55819 -15871 -17578 -36608
18596 -36608 17433 11465 -41731 -78809 -69887 112274 -10086 310531 -112313 -97288 -222817
18585 -222817 194177 4977 70804 -274386 -284898 171093 -16344 -293787 -114955 -268806
18575 -268806 -194222 18093 209010 149551 -504468 67927 -156643 22548 62298 -153481 103651
$$ packed form
18651b33848a00063A7958O3214a50274k65198d2002A40281h9602C36356h6544
18640A21290a74581j47754A59074b70689q626a03491F3810b64482O1413R3628
18630a09441j82391B13351b38363j15751C4469K88747A18195K52458i6963b9748
18619a31247m8543K2267M1192a5733k79425j90885B5023f8596j28556j25866a2124
18607e2758b5317n7018j33434k82156b40644Q7044C01519E5819a5871j707j9030
18596c6608A7433n968d1731l7078Q922A12274a0086C10531a12313J5025j25529
18585b22817A94177D977O5827b74386j0512A71093a6344k77443a14955j53851
18575b68806P4584A8093J90917n9459e04468F7927a56643B2548L9750a53481A03651
$$ plain form
18563 -206268 -23618 -142086 -18154 11375 -66425 40320 -196467 81423 -230757 -74258 184797
18551 -188937 216163 161826 40942 -18035 -60735 130591 -22800 147633 39709 -314932 -382315
18540 -382315 -141253 -17433 -225660 -98378 -82130 -131465 69760 47682 -304166 -56444 377834
18528 -54327 56361 -120405 -330459 -487777 -89288 137295 148629 94902 -39318 -51815 184002
18516 -30274 57266 -30289 19132 93133 73409 -100531 6640 -115021 -62461 -79378 -201670
18505 -201670 82936 126507 -6942 12520 -85217 -275897 171722 -107569 9922 -134904 -90775
18494 -90775 96993 -65121 -276726 -69986 -111534 -288227 -17855 -449575 -142962 -180619 -78779
18482 -15075 209351 -13773 182697 128233 -356491 -31865 306423 -201439 154716 -72191
$$ packed form
18563b06268b3618j18468a8154A1375f6425D0320a96467H1423b30757g4258A84797
18551a88937B16163n4337D0942a8035m2700A30591b2800A47633C9709c14932o7383
18540c82315a41253a7433k08227i8378J6248m9335F9760k2078c04166e6444C77834
18528e4327E6361a20405k10054j57318h9288A37295J1334n3727c9318j2497A84002
18516c0274E7266c0289A9132P4001j9724a00531F640a15021N2560j6917j22292
18505b01670H2936M3571f942A2520h5217j90680A71722a07569I922a34904M4129
18494i0775I6993f5121k11605f9986m1548j76693a7855m31720a42962l7657g8779
18482a5075B09351a3773A82697n4464c56491c1865C06423b01439A54716g2191
$$ plain form
18471 -170738 -146834 -60391 -49663 -394752 -229818 -9537 11750 -60591 137909 30806 -53235
18459 -237524 -8854 9364 -263273 241087 -132138 -149455 197732 -303287 125751 -45096 190653
18447 -10498 89426 40668 228668 -205226 -40825 127660 56373 110350 -17440 10782 -9116
18435 132786 -78217 -25993 966 -215574 -125818 -11879 9416 -388579 257126 -273116 121989
18423 110388 23326 -99480 -265648 101887 -69157 -62164 -164529 112896 46227 21578 -300762
18411 71362 -31448 -112240 -185856 -163566 -44241 -209975 -195990 -11762 -231449 -110834 94344
18399 159209 252149 -61617 -106967 1772 178473 309576 -236059 3378 46401 -14166 -186962
18388 -186962 243263 33709 -152631 -92129 -326145 75605 161841 200372 -176263 -31509 -156210
$$ packed form
18471a70738K3904f0391J0728l45089J64934i537A1750f0591A37909C0806e3235
18459b37524h854I364b63273B41087a32138j7317A97732c03287A25751d5096A90653
18447a0498H9426D0668J88000b05226d0825A27660E6373N3977a7440A0782i116
18435A32786g8217b5993I66b15574Q9756a1879I416c88579B57126b73116A21989
18423A10388B3326i9480j66168A01887f9157O993j02365A12896D6227B1578c00762
18411G1362c1448q0792p3616K2290d4241j65734J3985a1762k19687a10834I4344
18399A59209R2940f1617m5350A772J76701J31103b36059C378M3023a4166j72796
18388a86962B43263C3709a52631O0502k34016G5605Q6236L8531a76263c1509j24701
$$ plain form
18377 -156210 142069 490689 149928 -98834 -18598 -190741 -112832 36321 -211342 -126681
18367 -126681 -51922 -230970 -60837 -119642 -69585 37280 -64819 -72676 -134883 -341234 -90675
18355 -92051 -9707 106135 -32452 189308 174417 479320 97255 -319259 -266014 -99886 -304068
18344 -304068 126657 221017 -227003 504458 136966 -106973 30336 10755 -100086 -100196 -225572
18333 -225572 -186614 -143597 -50706 209259 59690 -46594 -72429 -331530 340350 -32350 -247367
18322 -247367 116961 -320213 -228010 -5104 36030 -258469 60927 -75937 -168873 -165805 -225647
18311 -225647 104203 94991 -105237 115456 240701 7497 69177 26372 -193779 203823 40037
18299 -163511 -56517 107388 -95322 51223 -256096 257529 95106 66578 105495 -40225 31233
$$ packed form
18377a56210A42069L48620A49928i8834a8598j72143P7909C6321b11342Q4661
18367a26681e1922j79048f0837n8805N0057C7280f4819p857o2207k06351i0675
18355i2051i707A06135c2452A89308j4891L04903I7255c19259N3245i9886k04182
18344c04068A26657R4360b27003E04458A36966a06973C0336A0755a00086j10j25376
18333b25572L8958M3017e0706B09259E9690d6594k5835k59101C40350c2350k15017
18322b47367A16961c20213R2203e104C6030b58469F0927g5937r2936L068n9842
18311b25647A04203r212a05237A15456J25245G497O1680B6372a93779B03823D0037
18299a63511e6517A07388i5322E1223b56096B57529I5106k8528L8917d0225C1233
$$ plain form
18287 113558 -35975 -111007 -75879 144277 71143 -78027 -390560 -113721 163943 -17293 118395
18275 -171660 -122140 -131813 221965 92962 -8070 -434221 314756 149778 52609 -233321 -99863
18263 143312 41697 -454575 -93535 68995 -72255 -143991 -253206 -143621 34837 -2023 43434
18251 58985 72908 135207 -351811 -84900 155447 -161314 -172252 -271359 -148919 -18167 -112833
18240 -112833 -63279 33116 -104868 -187360 232943 86785 -56462 -114324 -222340 -101728 -183869
18229 -183869 -84740 110078 -197888 94231 31810 -43523 99439 44362 -30427 -23720 -168442
18218 -168442 -66167 261761 133682 -6858 157883 -75360 189594 121908 -304579 173521
18207 170023 -190063 104825 35864 64863 282724 -143992 -30735 -134021 2497 -119221
$$ packed form
18287A13558c5975p5032L5128A44277G1143g8027l12533a13721A63943a7293A18395
18275a71660M9520r673B21965I2962h070m26151C14756A49778E2609b33321i9863
18263A43312D1697d54575i3535F8995g2255p1736j09215J09585C4837b023D3434
18251E8985J3923O2299c51811h4900A55447a61314j0938r9107J22440a8167r4666
18240a12833M9554C3116a04868q2492B32943H6785e6462n7862j08016a01728q2141
18229a83869h4740A10078a97888I4231C1810d3523I9439D4362c0427O707j44722
18218a68442f6167B61761j28079f858A57883g5360A89594o7686c04579A73521
18207A70023a90063A04825C5864K8999K17861a43992c0735j03286B497a19221
$$ plain form
18196 -311638 170658 -234282 263399 95903 215597 30886 259884 24338 260656 93740
18185 231490 -177757 -378246 -51628 46198 -333538 -69523 -304218 113760 111081 169424 18647
18173 18890 -187233 52564 70551 -14993 -253694 -69412 -41888 15417 146235 30433 -67079
18161 -49434 190449 -86116 127425 305556 -202984 3824 -21315 -178898 90874 -135430 -20466
18149 -191815 -33730 55021 68893 -60326 -113735 311011 -157464 -201834 53652 -278454 -167070
18138 -167070 159755 -78119 -54927 -203112 -220165 -94358 -70790 -61270 33479 -78055 444324
18126 -38107 -42577 202596 -4896 -173565 -57564 221006 -53049 -320486 -8006 -143127 136562
18114 -185380 -239014 -231293 -69176 -181418 40366 285366 67167 235207 172424 -433276 193822
$$ packed form
18196c11638A70658b34282B63399I5903J19694C0886K28998B4338K36318I3740
18185B31490a77757k00489e1628D6198c33538f9523k34695A13760k679N8343A8647
18173A8890a87233E2564J7987a4993k38701f9412K7524A5417J30818C0433f7079
18161d9434A90449h6116A27425J78131b02984C824b1315j57583I0874a35430b0466
18149a91815c3730E5021J3872f0326n3409C11011a57464m4370E3652b78454J11384
18138a67070A59755g8119K3192j48185j7053i4358K3568R520C3479g8055D44324
18126c8107m470B02596d896j68669e7564B21006e3049k67437h006j35121A36562
18114a85380n3634P721f9176j12242D0366K45000F7167J68040o2783d33276A93822
$$ plain form
18102 -225448 -54575 -294984 -25859 264079 -68103 -91363 181387 143624 -140107 -135988 3318
18090 131269 207164 49422 -314297 142764 191834 51457 -91551 3398 44558 203616 -100835
18078 -151418 -156155 -214818 -4963 163464 -20933 -265806 -157502 134770 15100 228042 405691
18067 405691 -234525 -163708 -59554 6459 135755 74246 -198674 -97650 -312549 -11534 23357
18055 346616 184372 -182018 -109394 340368 244797 40718 -141246 311408 -34447 307921
18044 153811 318630 -633449 -25798 91126 82656 -145754 33180 309282 9196 -29800 -128760
18033 -128760 46176 -200855 127073 354359 -180282 -170071 132983 26532 455554 -39537
18022 215685 -188294 -368138 203137 120884 -146792 5556 -96871 -4155 234913 83335 -75296
$$ packed form
18102b25448e4575k40409b5859B64079f8103k3260A81387l7763a40107M119C318
18090A31269P5895D9422c14297A42764M9070E1457i1551C398M1160J59058a00835
18078a51418m737n8663d963A63464b0933k44873J08304A34770A5100K12942J77649
18067D05691b34525P0817e9554F459J29296o1509a98674i7650k14899a1534B3357
18055C46616j62244a82018P2624C40368r5571D0718a41246C11408c4447C07921
18044A53811J64819f33449b5798I1126q470a45754C3180K76102I196b9800r8960
18033a28760D6176b00855A27073K27286a80282J0211A32983B6532M29022c9537
18022B15685a88294j79844B03137q2253a46792E556i6871d155B34913H3335g5296
$$ plain form
18010 295884 -61394 68549 46513 68403 60106 -111430 -208360 53652 -181088 -94244 -170335
17999 -170335 248086 -113461 241982 118778 -40360 -19434 -385733 -293921 329002 102364
17988 271419 -8658 -114846 180551 -58180 -119023 91161 51953 -139005 -69620 -202182 54661
17976 327289 -3591 -267685 65766 36770 -210000 80198 -155557 -298562 90135 -81728 7379
17964 105614 73536 187570 -314154 68339 34747 240445 165767 -188283 296379 -31509
17953 -200937 208570 -43582 -98070 27892 -78246 163158 17687 52216 -163917 273389 -200417
17941 352865 80279 -206028 214117 -25558 73895 -274497 62155 79871 34970 24181 22881
17930 22881 -228985 -37046 -32323 145573 104737 210366 -208157 -36568 280482 1707 -75792
$$ packed form
18010B95884f1394F8549k2036K1890q297a11430r6930E3652a81088Q6844p6091
17999a70335B48086a13461B41982A18778d0360a9434l66299R1812C29002A02364
17988B71419h658j06188A80551e8180o0843I1161l9208a39005O9385j32562E4661
17976C27289c591k64094F5766k8996b10000H0198a55557j43005I0135h1728G379
17964A05614l2078J14034c14154F8339l3592K05698p4678a88283B96379c1509
17953b00937B08570d3582n4488B7892g8246A63158A7687L4529a63917B73389b00417
17941C52865H0279b06028B14117b5558G3895b74497F2155J7716C4970j0789j300
17930B2881b28985c7046M723A45573m0836J05629b08157c6568B80482A707g5792
$$ plain form
17918 -37945 223531 15985 65761 231647 208863 41787 -214932 367226 -93452 82654 174190
17907 174190 132477 63215 -398448 -26953 33036 102390 152019 69483 -223223 130519 157998
17896 157998 460499 97064 192589 -57102 73277 -425577 188374 -16429 147851 -77292 79986
17884 -242791 -145070 281346 111045 -350454 261812 -315316 -92861 -64822 131062 601 -52133
17872 -19495 -17688 237622 185839 -204212 -163889 81719 -9078 141826 -277284 -147935 -83011
17861 -83011 31037 -268727 265120 -82113 -32590 -206603 163724 67228 313107 -23912 -91010
17850 -91010 174495 -116892 75953 248282 258355 351031 97659 -174832 -284254 -39380 -24739
17839 -24739 -203290 58285 12651 277082 61179 229000 -207967 267261 -115651 -142721
$$ packed form
17918c7945B23531A5985M9776J65886k2784D1787b14932C67226i3452H2654R1536
17907A74190m1713F3215c98448b6953C3036O9354M9629F9483b23223A30519K7479
17896A57998L02501I7064R5525e7102G3277d25577A88374a6429A47851g7292G9986
17884b42791R7721B81346A11045c50454B61812c15316i2861K8039A31062F01e2133
17872a9495J807B37622n1783b04212M0323H1719i078A41826b77284J29349O4924
17861h3011C1037b68727B65120h2113c2590j74013A63724F7228K45879b3912o7098
17850i1010A74495a16892G5953J72329J0073R2676I7659a74832j09422c9380J4641
17839b4739j78551E8285A2651K64431F1179J67821b07967B67261a15651k7070
$$ plain form
17829 -142721 71510 155165 111280 -19726 -25232 115437 254249 -138775 412616 1080 35413
17818 35413 385664 -35006 -337319 25306 -189547 -290371 -300527 462514 211674 -122330
17807 -56466 204491 119090 241882 -137898 -2316 -249825 -14649 73596 -7272 286515 279802
17796 279802 -767 147317 -372976 355532 -192844 -61904 -65737 29371 200468 531153 -29239
17784 258626 80259 116141 44913 -16299 26499 -41781 -275087 286256 358885 -48521 223933
17772 -105703 -62194 119150 -53399 -51226 143935 254311 -7429 326921 2753 1855 51470 -6866
17759 -84278 57716 171418 -111963 -30767 226370 -9990 147426 207195 230672 54352 170741
17748 170741 12685 -139059 211494 62850 149526 37045 -43199 -146925 52145 130532 -17319
$$ packed form
17829a42721G1510Q3655m3885a9726n506A15437J38812a38775D12616A080L4333
17818C5413L50251c5006l02313B5306a89547j00824j0156D62514B11674a22330
17807e6466B04491q5401J22792a37898b316k47509a4649G3596g272B86515o713
17796B79802g67A47317c72976C55532a92844f1904l833B9371J71097L30685b9239
17784B58626H0259L5882D4913a6299B6499d1781k33306B86256P2629d8521B23933
17772a05703M3509A19150e3399K173A43935J10376g429C26921B753q98M9615f866
17759h4278E7716J13702a11963c0767B26370i990A47426N9769K3477E4352J16389
17748A70741A2685a39059B11494F2850Q6676C7045d3199j03726E2145P8387a7319
$$ plain form
17736 -105942 -120923 185677 -88260 -20116 97313 -220838 763 117526 150615 -276517 100040
17724 108137 261071 -92113 -297440 95552 85908 157428 60347 139725 56644 -71312 159156
17712 4096 162280 3163 385807 -46489 77006 305752 306051 -77345 -383707 -35139 -13191 -147973
17700 -147973 124385 377680 236787 -53124 -77604 300878 133991 -33344 254962 -106144
17689 2910 24451 -200718 -6214 97100 441971 72478 -20968 166645 155547 -135964 -35838
17677 340530 -51132 -10121 10800 520915 -113237 -58014 -111093 -28173 517883 225305 37186
17665 19782 277696 -8545 88616 40573 53647 4778 129763 20396 -92998 245194 -39021
17653 -36023 -221445 122332 153102 300637 327214 1672 109414 370693 39694 504649 -39027
$$ packed form
17736a05942j4981A85677h8260b0116I7313b20838G63J16763L3089b76517A00040
17724A08137J52934i2113k05327I5552r644P1520F0347P9378E6644g1312A59156
17712D096J58184C163L82644d6489G7006K28746K99g7345l06362c5139a3191j34782
17700a47973A24385K53295j40893e3124k4480C00878A33991c3344B54962a06144
17689B910K1541b00718f214I7100L44871G2478b0968A66645j1098a35964c5838
17677C40530e1132a0121A0800N10115a13237N5223n3079b8173E17883B25305C7186
17665A9782K57914h545H8616D0573J3074D778J24985B0396i2998B45194c9021
17653c6023j85422A22332L0770J47535K6577A672J07742K61279C9694M64955c9027
$$ plain form
17641 -14299 203728 216119 -175939 -225729 131856 334890 -135961 -503700 328283 200753
17631 200753 -228283 159304 140727 119333 -29717 127243 6430 -55691 70094 147932 -179238
17619 347458 610 100244 310878 -5815 349750 -56536 -96150 37304 98310 145854 20965 192933
17607 192933 259920 182449 -68755 -6391 215160 -29117 367932 70514 -67719 -46800 38217
17595 158558 121476 471470 99276 -270975 -26634 -135843 -62287 98507 -102020 -177128 111180
17583 -56490 -31250 142315 345943 84365 282731 -16032 -127968 109477 -53640 -104442 -95088
17572 -95088 -32289 97590 -8006 78674 -1967 153425 -273664 236673 184798 185942 -131393
17560 -125672 207705 272226 -105335 167615 159735 -14670 253562 196739 196838 440538 153238
$$ packed form
17641a4299B03728J2391a75939m9790A31856K03034a35961l67739C28283j27530
17631B00753b28283A59304j8577k1394b9717A27243F430e5691G0094P7838a79238
17619C47458F10R9634K10634e815C49750e6536l9614C7304O1006M7544B0965J71968
17607A92933O6987p7471f8755f391B15160b9117C67932G0514f7719K0919C8217
17595A58558l7082L49994I9276b70975b6634j09209f2287I8507a02020p5108A11180
17583e6490K5240A42315K03628H4365J98366a6032j11936A09477e3640n0802R354
17572i5088c2289I7590h006G8674a967A53425b73664B36673n1875J144a31393
17560a25672B07705O4521a05335A67615p880a4670B53562n6823R9K43700A53238
$$ plain form
17548 138232 104512 53673 155056 112307 151493 -238330 318119 -191613 319863 44044
17537 -102290 200046 -15969 -41897 98148 420580 312179 55032 183244 44593 301850
17527 301850 219087 294529 485380 360642 93113 133855 180560 488264 88712 164741 538720
17516 538720 199128 169137 318147 345148 361249 332483 894821 1016981 1152008 833346
17506 833346 298155 721396 463673 256164 287534 404666 397685 521408 461422 255319
17496 255319 515048 829300 692922 1003871 716618 643286 636346 546264 655864 762468
17486 762468 245515 242167 332813 320277 585797 211487 240984 159187 126512 609521 89099
17474 188384 232838 507915 294741 528127 242154 355051 140073 87895 461326 365824
$$ packed form
17548A38232l3720n0839J01383m2749L9186b38330C18119a91613C19863D4044
17537a02290B00046a5969k5928I8148L22432j08401E5032J28212D4593K57257
17527C01850q2763P5442J90851j24738I3113M0742M6705L07704H8712P6029L73979
17516E38720A99128k9991J49010K7001J6101k8766N62338J22160J35027l18662
17506H33346B98155M23241k57723k07509L1370J17132o981J23723n9986k06103
17496B55319K59729L14252j36378L10949k87253p3332o940r0082J09600J06604
17486G62468B45515l348R0646j2536K65520B11487K9497q1797l2675M83009H9099
17474A88384M4454K75077k13174K33386B42154J12897A40073n2178L73431r5502
$$ plain form
17464 365824 407691 23441 418351 156121 515129 305854 603911 213726 143240 157880
17454 157880 409534 43944 371329 323629 168641 315215 216432 257111 478575 216624
17443 324208 150294 454633 3804 292933 384057 379322 115213 414597 233504 625710
17433 625710 414207 445938 436302 224409 282684 225572 492773 316523 147694 205054 326842
17422 326842 408026 349192 46516 135418 525576 633658 596662 231575 297393 24793 305513
17411 305513 344088 263454 266650 272873 191136 266777 329239 160340 263825 154484 145125
17400 145125 56960 96035 321128 471393 8192 331897 552193 584909 -219147 46913 196909
17389 196909 388212 396705 447363 -126426 110672 271080 53721 475823 305053 -93163
$$ packed form
17464C65824M1867B3441L94910A56121L59008k09275K98057B13726p0486J4640
17454A57880K51654D3944L27385m7700j54988J46574r8783M0679K21464B16624
17443C24208A50294L04339C804K89129R1124m735A15213K99384j81093L92206
17433F25710k11503L1731r636k11893N8275n7112K67201j76250A47694N7360J21788
17422C26842Q1184n8834D6516Q8902L90158J08082l6996B31575O5818B4793K80720
17411C05513L8575q0634L196O223q1737P5641O2462A60340J03485j09341r359
17400A45125E6960L9075K25093J50265H192L23705K20296L2716b19147D6913J49996
17389A96909J91303Q493N0658a26426A10672J60408E3721M22102j70770i3163
$$ plain form
17378 368056 258284 147371 216098 267686 -28919 -78026 568075 208779 12450 178910
17368 178910 77336 231688 316985 217073 60347 374070 43354 472033 299243 218194 221132
17357 221132 326236 376018 -65644 212638 92474 -22293 88416 116067 443615 306021 105370
17345 210640 242486 141348 337234 -237394 293031 -90500 202191 -39292 399945 -89197
17334 -153131 315467 462743 413264 234359 128381 18773 8659 497145 210023 273959
17324 273959 174588 156644 67077 213226 101347 114677 422489 111571 358143 161056
17313 79816 71377 533167 526390 651392 528060 378221 202233 153541 192336 284010 -161984
17301 118475 199212 -81052 445265 281758 620739 452828 230835 347582 490372 348459
$$ packed form
17378C68056j09772j10913O8727N1588b8919m9107E68075B08779A2450J66460
17368A78910G7336J54352Q5297r9912F0347L13723D3354M28679j72790q1049K938
17357B21132J05104M9782f5644B12638I2474b2293H8416K7651L27548j37594A05370
17345B10640L1846j01138J95886b37394B93031i0500B02191c9292C99945h9197
17334a53131C15467J47276m9479j78905j05978A8773H659M88486B10023O3936
17324B73959r9371j7944F7077J46149A01347J3330L07812A11571K46572A61056
17313G9816q439M61790o777J25002j23332j49839j75988m8692L8795R1674a61984
17301A18475Q0737h1052D45265j63507L38981j67911k21993J16747J42790j41913
$$ plain form
17291 348459 75911 295439 497750 145571 178739 553223 208441 68436 139242 167126
17281 167126 470220 326135 86204 72510 229404 289144 129808 376199 387493 116500
17270 33162 245359 511826 140835 312397 -13539 201015 453158 101092 35025 19742
17260 19742 -47923 444079 63930 450589 119666 300692 150234 435702 368650 286841
17250 286841 -33745 295558 282697 424479 42124 390206 221273 232604 281357 173157
17240 173157 501307 349602 514877 244064 331721 356677 392106 85237 691726 83189
17229 117321 81400 256792 215226 631653 677960 374486 183216 545996 384715 335787
17219 335787 323620 144286 251434 134385 158754 313980 167992 297643 427495 225371
$$ packed form
17291C48459G5911K19528K02311A45571L3168L74484B08441F8436P0806K7884
17281A67126L03094j44085H6204j3694J56894N9740A29808K46391J1294A16500
17270C3162K12197K66467A40835J71562a3539B01015K52143A01092C5025j5283
17260A9742d7923D44079F3930L86659A19666J81026A50234K85468o7052q1809
17250B86841c3745B95558j2861J41782D2124L48082j68933J1331M8753j08200
17240A73157L28150j51705J65275B44064Q7657K4956L5429H5237O06489H3189
17229A17321l5921J75392m1566M16427M6307l03474A83216L62780j61281m8928
17219C35787j2167A44286J07148j17049K4369J55226j45988J29651J29852k02124
$$ plain form
17209 225371 191891 66604 318121 66310 552186 425371 120025 -162206 298088 149213
17199 149213 203329 210946 405839 408884 107977 242846 380075 401158 132431 379951 689028
17188 689028 498752 403279 79820 537959 179428 281782 204137 744948 586717 554456
17178 554456 301171 513453 331697 483206 308379 370651 257532 456817 506437 420073
17168 420073 696277 495488 522468 336525 363780 -64848 495614 194986 522529 443479
17158 443479 594276 289061 539444 483808 558337 121299 665368 348847 -32456 104264
17147 550396 260954 339511 368688 352874 615855 632707 683883 576435 522147 293574 232663
17136 232663 322018 685778 431911 602024 70554 438653 333795 490465 604833 414631
$$ packed form
17209B25371l3480F6604K51517F6310M85876j26815A20025a62206B98088j48875
17199A49213N4116P617J94893L045A07977J34869J37229K1083A32431K47520L09077
17188F89028j90276r5473G9820M58139A79428J02354p7645N40811j58231l2261
17178E54456k53285K12282j81756J51509j74827O2272j13119J99285M9620q6364
17168D20073K76204k00789K6980j85943K7255f4848D95614A94986L27543p9050
17158D43479J50797B89061K50383n5636P4529A21299N44069l16521c2456A04264
17147E50396B60954P8557K9177j5814K62981J6852N1176j07448n4288k28573o0911
17136B32663Q9355L63760k53867J70113G0554L68099j04858J56670J14368j90202
$$ plain form
17126 414631 551941 747614 424521 681374 380365 597384 478400 612307 518699 234866
17115 621181 837519 190178 525199 484481 742523 586068 426827 300402 542875 561282
17105 561282 699436 471062 99938 382306 740218 514514 600364 595522 510659 641212
17095 641212 624897 410855 441430 565252 590427 614530 375941 601186 311451 607005
17085 607005 1026827 430890 475077 687194 654666 263772 533168 620951 583547 720527
17075 720527 461829 505192 854907 557687 586485 536001 660844 620487 847112 507477
17065 507477 798259 658458 721773 825327 395227 555590 873050 224827 551708 515452
17055 515452 639968 379696 466677 657480 706280 702395 924548 594887 762496 794775
$$ packed form
17126D14631J37310J95673l23093K56853l01009K17019j18984J33907r3608B34866
17115F21181K16338A90178L35021m0718K58042j56455j59241j26425K42473J8407
17105E61282J38154k28374I9938K82368L57912k25704Q5850m842q4863J30553
17095F41212j6315k14042L0575J23822K5175K4103k38589K25245k89735K95554
17085F07005M19822D30890M4187K12117l2528B63772K69396Q7783l7404J36980
17075G20527k58698M3363L49715k97220K8798n0484J24843m0357K26625l39635
17065E07477K90782j39801O3315J03554C95227J60363L17460B24827L26881l6256
17055E15452J24516k60272Q6981J90803M8800l885K22153l29661J67609L2279
$$ plain form
17045 794775 960581 586215 756649 699286 498584 717500 909440 499017 885919 982474
17035 982474 1073327 1040883 976541 686520 544365 624360 810712 565643 779050 744392
17025 744392 1248699 832488 781469 896743 777834 643333 820178 747364 686209 760285
17015 760285 1424926 1190256 1163155 787564 883739 867625 1163952 847547 719102 946317
17005 946317 761837 831615 802934 1041864 893651 1208518 975311 1216907 942128 863851
16995 863851 1052516 1184392 982996 1095681 1057018 867620 1227577 802065 1072475 1384173
16985 1384173 1028676 1156611 1070526 1035852 1310207 897136 1367009 1386794 1103066 1204037
16975 1204037 1181344 1143636 1251892 1189698 938725 1132153 1098232 991044 1241133 1251596
$$ packed form
17045G94775J65806l74366J70434n7363k00702K18916J91940m10423L86902R6555
17035I82474R0853l2444o4342k90021j42155P9995J86352k45069K13407l4658
17025G44392N04307m16211n1019J15274j18909j34501J76845p2814o1155P4076
17015G60285O64641k34670k7101l75591R6175j6114K96327l16405j28445K27215
17005I46317j84480O9778k8681K38930j48213L14867k33207K41596k74779p8277
16995H63851J88665J31876k01396J12685l8663j89398L59957m25512K70410L11698
16985A384173l55497J27935q6085l4674K74355m13071M69873J9785k83728J00971
16975A204037k2693l7708J08256o2194k50973J93428l3921j07188K50089J0463
$$ plain form
16965 1251596 1274797 1466281 1156226 1197749 1058597 1302383 1492554 1147121 1195793 1397039
16955 1397039 1527614 1393501 1305919 1472329 1414534 1461261 1268676 1365001 1585156 1639006
16945 1639006 1445497 1227916 1403283 1615350 1232977 1658246 1484879 1499648 1747710 1506831
16935 1506831 1367061 1379141 1551674 1595805 1546854 1604157 1599124 1627055 1716430 1814453 1531555
16924 1531555 1706962 1739167 2136060 1991037 1411458 1835304 2044445 1814908 1634444 1659839
16914 1659839 1842829 2196266 1785949 1987120 1930449 2020137 1749237 1735080 2174420 2275229
16904 2275229 2081483 2501289 2398325 2027331 2122273 2079572 2402167 2237244 1871498 2388249
16894 2388249 2375965 2262203 2494443 2609586 2551546 2251394 2273767 2603658 2281072 2391662
$$ packed form
16965A251596K3201J91484l10055M1523j39152K43786J90171l45433M8672K01246
16955A397039J30575j34113q7582J66410n7795M6727j92585R6325K20155N3850
16945A639006j93509k17581J75367K12067l82373M25269j73367J4769K48062k40879
16935A506831j39770J2080J72533M4131m8951N7303n033K7931Q9375R8023k82898
16924A531555J75407L2205L96893j45023n79579M23846K09141k29537j80464K5395
16914A659839J82990L53437m10317K01171n6671Q9688k70900j4157M39340J00809
16904B275229j93746M19806j02964l70994R4942m2701L22595j64923l65746N16751
16894B388249j2284j13762K32240J15143n8040l00152K2373L29891l22586J10590
$$ plain form
16884 2391662 2405079 2478342 2750515 2265455 2374610 2628138 2484611 2872837 2211959 2869735
16874 2869735 2729506 3232430 3044156 2690227 2762983 2781863 3086930 3041517 2988939 3090662
16864 3090662 3194548 3306563 3196832 3288298 3326134 3360741 3614740 3472502 3736311 3387051
16854 3387051 3640307 3511345 3404094 3791902 3855985 3567979 4196468 3958927 3900221 4125153
16844 4125153 4335650 4246738 4177230 4260955 4571491 4194898 4321823 4439708 4671397 4744750
16834 4744750 4926714 4323741 4682941 4940072 5090827 5487196 5423491 5330201 5574278 5462663
16824 5462663 5479207 5906404 5845524 5692593 5910004 6272740 5983401 6342120 6335517 6161297
16814 6161297 6448187 6994031 6892569 7075633 6777152 7214737 7252691 7270746 7462734 7732009
$$ packed form
16884B391662J3417P3263K72173m85060J09155K53528j43527L88226o60878O57776
16874B869735j40229N02924j88274l53929P2756J8880L05067m5413n2578J01723
16864C090662J03886J12015j09731R1466L7836L4607K53999j42238K63809l49260
16854C387051K53256j28962j07251L87808O4083k88006O28489k37541n8706K24932
16844D125153K10497q8912o9508Q3725L10536l76593J26925J17885K31689P3353
16834D744750J81964o02973L59200K57131J50755L96369o3705r3290K44077j11615
16824E462663J6544M27197o0880j52931K17411L62736k89339L58719o603j74220
16814F161297K86890N45844j01462J83064k98481M37585L7954J8055J91988K69275
$$ plain form
16804 7732009 8139725 8205146 7885937 8212473 8704209 8351422 8833508 8836499 9537852 9149135
16794 9149135 9362028 9753616 9925031 10138295 10709877 10541847 11156932 10804139 11270707
16785 11270707 11574419 11978823 11867398 12572856 12632335 13306738 13688035 13880611 14278227
16776 14278227 14317142 15043054 15260820 15790569 16065617 16437036 17036610 17584283 17795674
16767 17795674 18395700 18790086 19551765 20254097 20379864 21652565 22140566 22854193 23231715
16758 23231715 23935821 24616673 25682918 26529814 27467222 28712357 29684005 30530199 31273420
16749 31273420 32075059 33640042 34547510 36366928 37489080 38719253 40383020 41830990
16741 41830990 43585272 45423454 46992455 48799701 50686158 52921996 55177975 57112095
$$ packed form
16804G732009M07716O5421l19209L26536M91736l52787M82086K991P01353l88717
16794I149135K12893L91588J71415K13264N71582j68030O15085l52793M66568
16785A1270707L03712M04404j11425P05458N9479O74403L81297J92576L97616
16776A4278227L8915P25912K17766N29749K75048L71419N99574N47673K11391
16767A7795674O00026L94386P61679P02332J25767J272701M88001P13627L77522
16758B3231715P04106O80852J066245Q46896R37408J245135R71648Q46194P43221
16749C1273420Q01639J564983R07468J819418J122152J230173J663767J447970
16741D1830990J754282J838182J569001J807246J886457K235838K255979J934120
$$ plain form
16733 57112095 59980411 62338477 65061171 67424693 70223426 73366757 76067138 79415495
16725 79415495 82533925 85716353 89479372 92563188 96331369 99573453 103192294 106501987
16717 106501987 110286636 113340276 116711627 119628861 122231209 124750036 127282910 129224016
16709 129224016 131164340 132084643 133335903 133610891 133462932 133419221 132656777 131215687 129689170
16700 129689170 127580764 125279172 122523970 119621213 116779114 113601023 110266663 107031209
16692 107031209 103540962 99622620 96380068 92834556 89425316 86044982 82563655 79640616
16684 79640616 76210404 72779306 70505565 67261119 64563936 61687451 59661614 57132622
16676 57132622 54499545 52369860 50026316 48106907 46427829 44435380 42863005 41130548
$$ packed form
16733E7112095K868316K358066K722694K363522K798733L143331K700381L348357
16725G9415495L118430L182428L763019L083816L768181L242084L618841L309693
16717A06501987L784649L053640L371351K917234K602348K518827K532874J941106
16709A29224016J940324R20303J251260K74988j47959m3711p62444j441090j526517
16700A29689170k108406k301592k755202k902757k842099l178091l334360l235454
16692A07031209l490247l918342l242552l545512l409240l380334l481327k923039
16684G9640616l430212l431098k273741l244446k697183k876485k025837k528992
16676E7132622k633077k129685k343544j919409j679078j992449j572375j732457
$$ plain form
16668 41130548 39510242 38171602 36620327 35040829 33873086 32567556 31458854 30353434
16660 30353434 29306756 28578284 27352498 26520813 25541079 24830268 23948654 23262847 22452531
16651 22452531 21586434 20899030 20708625 19638312 19189747 18530195 17921998 17593315 17119019
16642 17119019 16663065 16145996 15535339 15261514 14885847 14471810 14221265 13862894 13280338
16633 13280338 13036351 12344336 12609700 12133409 11814847 11695723 11094441 10783316 10622699
16624 10622699 10578966 10345166 10032044 9810877 9803839 9156828 9284714 9409824 8751929 8444138
16614 8444138 8270587 7846502 8327750 7759651 7700516 7388464 7455432 7572130 7038901 6768903
16604 6768903 6639540 6411684 6314253 6257442 6348244 6063188 6208741 6051369 5724935 5628247
$$ packed form
16668D1130548j620306j338640j551275j579498j167743j305530j108702j105420
16660C0353434j046678p28472j225786q31685r79734p10811q81614o85807q10316
16651B2452531q66097o87404j90405j070313m48565o59552o08197l28683m74296
16642A7119019m55954n17069o10657k73825l75667m14037k50545l58371n82556
16633A3280338k43987o92015K65364m76291l18562j19124o01282l11125j60617
16624A0622699m3733k33800l13122k21167p038o47011J27886J25110o57895l07791
16614H444138j73551m24085M81248n68099n9135l12052O6968J16698n33229k69998
16604F768903j29363k27856r7431n6811R0802k85056J45553j57372l26434r6688
$$ plain form
16594 5628247 5755398 5707854 5403771 5399507 5242582 5268643 4943228 4824040 4784546 4920361
16584 4920361 4799617 4725922 4703785 4853772 4433553 4580931 4512761 3929944 4334334 4197533
16574 4197533 3902916 3985205 4203260 4120697 3496684 3991835 3524658 3538237 3572030 3703007
16564 3703007 3828067 3282436 3322928 3221175 3158447 3398745 3273341 3056666 3041016 3129436
16554 3129436 3074698 3118991 2907893 2837748 2842058 3091892 3157254 2902751 3123436 2805656
16544 2805656 2662351 2184794 2468028 2593195 2814335 2467321 2341541 2811066 2658125
16535 2658125 2230104 2330112 2142154 1954536 2409991 2305780 2061510 2475015 2174313
16526 2174313 2011795 2406851 2376393 2001767 2262737 2185032 2229270 1905980 2034554 2175171
$$ packed form
16594E628247J27151m7544l04083m264j56925K6061l25415j19188l9494J35815
16584D920361j20744p3695k2137J49987m20219J47378o8170n82817M04390j36801
16574D197533k94617Q2289K18055q2563o24013M95151m67177J3579L3793J30977
16564C703007J25060n45631M0492j01753o2728K40298j25404k16675j5650Q8420
16554C129436n4738M4293k11098p0145M310K49834O5362k54503K20685l17780
16544B805656j43305m77557K83234J25167K21140l47014j25780M69525j52941
16535B658125m28021J00008j87958j87618M55455j04211k44270M13505l00702
16526B174313j62518L95056l0458l74626K60970p7705M4238l23290J28574J40617
$$ plain form
16516 2175171 2009310 1780206 2106600 1829947 1740717 1871457 1707684 1795518 1711289 1727960
16506 1727960 1859515 2131258 1773339 1892462 1697225 1689844 1721463 1809753 1682181 1731921
16496 1731921 1314292 1831507 1571320 1367851 1266957 1311048 1761094 1741205 1480799 1557765
16486 1557765 1552108 1424261 1180561 1189678 1164615 1600615 1331220 1291104 980624 2040854
16476 2040854 1364679 1022562 1250703 1614587 1417118 1183156 1495922 1193791 1409809
16467 1409809 1451026 1242815 930221 983038 1189942 1389273 1169090 1209820 947393 1290741
16457 1290741 1388634 1242738 1156234 1048808 1022297 1048335 1242278 1030108 1154018 1132195
16447 1132195 991037 1027104 1135582 805886 1137900 798028 893044 1172009 1020068 1107736
$$ packed form
16516B175171j65861k29104L26394k76653q9230J30740j63773Q7834q4229J6671
16506A727960J31555K71743l57919J19123j95237p381L1619Q8290j27572M9740
16496A731921m17629N17215k60187k03469j00894M4091M50046j9889k60406P6966
16486A557765n657j27847k43700R117k5063M36000k69395m0116l10480J060230
16476B040854o76175l42117K28141L63884j97469k33962L12766l02131K16018
16467A409809M1217k08211l12594N2817K06904J99331k20183M0730k62427L43348
16457A290741R7893j45896q6504j07426k6511K6038J93943k12170J23910k1823
16447A132195j41158L6067J08478l29696L32014l39872R5016K78965j51941Q7668
$$ plain form
16437 1107736 1079820 703289 1194848 1249848 916089 981722 937764 1055800 1000585 1076208
16427 1076208 969086 773764 987039 792957 895093 1043187 806056 1130693 884043
16418 884043 701466 583197 546113 989837 848931 735099 749609 848750 793957 703276
16408 703276 503717 617701 864193 518261 424017 801766 862153 980660 781833 543645
16398 543645 615461 622591 876474 856311 496992 764382 648357 738625 673742 746302 704545
16387 704545 787115 795612 567195 822244 900393 635331 848126 473792 323379 563310
16377 563310 602261 872033 665273 825920 517130 563557 736394 436798 725755 501427
16367 501427 920205 417028 684891 601295 355347 210530 300459 821979 622850 674113
$$ packed form
16437A107736k7916l76531M91559N5000l33759O5633m3958J18036n5215P5623
16427A076208j07122j95322K13275j94082J02136J48094k37131L24637k46650
16418H84043j82577j18269l7084M43724j40906j13832J4510R9141n4793r0681
16408G03276j99559J13984K46492l45932r4244L77749O0387J18507j98827k38188
16398E43645P1816P130K53883k0163l59319K67390j16025R0268o4883P2560m1757
16387G04545Q2570Q497k28417K55049P8149k65062K12795l74334j50413K39931
16377E63310L8951K69772k06760J60647l08790M6427J72837k99596K88957k24328
16367E01427M18778D17028K67863q3596k45948j44817Q9929N21520j99129N1263
$$ plain form
16357 674113 395124 409881 377648 410586 430732 344076 607263 407738 499601 627043 395774
16346 395774 677708 71865 936663 288401 726419 472925 557957 502455 717982 447977
16336 447977 322597 580318 604214 409956 534696 43800 469000 521723 609078 413339
16326 413339 302818 302298 98777 504822 312999 726959 333185 685875 374071 151133
16315 501423 427749 249449 899357 677982 796850 -104206 439933 681104 278944 173245
16305 173245 550100 394297 242681 229865 560559 391095 401522 406956 347554 424332 68015
16293 513297 380153 669695 495305 484909 206708 385529 44762 472972 387547 368324
16283 368324 325237 543892 573871 -33820 457577 381917 440385 181001 237043 150991 266634
$$ packed form
16357F74113k78989J4757l2233L2938K0146q6656K63187j99525R1863J27442k31269
16346C95774K81934G1865Q64798B88401M38018k53494Q5032n5502K15527k70005
16336D47977j25380K57721K3896j94258J24740D3800M25200N2723Q7355j95739
16326D13339j10521n20I8777M06045j91823M13960C33185L52690l11804A51133
16315E01423p3674j78300O49908k21375J18868a04206D39933K41171B78944j05699
16305A73245L76855j55803j51616j2816L30694j69464J0427N434n9402P6778F8015
16293E13297j33144K89542j74390j0396B06708J78821D4762M28210q5425j9223
16283C68324m3087K18655K9979c3820D57577p5660N8468A81001N6042q6052J15643
$$ plain form
16272 266634 17447 352861 29515 289989 210880 536434 93165 121016 -16381 217801 431219
16261 431219 109281 124291 310881 363240 147664 383633 283446 154239 105919 147416
16251 147416 138523 404745 148615 299162 268248 258740 301124 197995 308732 233431 150310
16240 150310 76779 276849 121017 -102189 339166 263069 360930 524255 151135 38931
16229 321317 353950 -111482 268547 97548 184574 174531 -134579 281953 110398 11778
16218 286976 302209 -28939 318518 211053 367815 347920 375570 62547 320339 -49125 372709
16206 123563 467574 355345 31346 251803 472826 197078 394718 340427 -87476 114135
16195 249004 219496 199957 312979 404039 214883 20352 -116284 286143 -28582 206045
$$ packed form
16272B66634A7447L35414B9515K60474p9109L25554I3165K7851a6381B17801K13418
16261D31219A09281J5010J86590N2359A47664K35969j00187j29207m8320M1497
16251A47416q893K66222A48615J50547l0914r508M2384j03129J10737p5301q3121
16240A50310p3531K00070A21017a02189C39166p6097R7861J63325A51135C8931
16229C21317L2633a11482B68547I7548Q7026j0043a34579B81953A10398A1778
16218B86976J5233b8939C18518j07465J56762j9895K7650F2547K57792d9125C72709
16206A23563L44011j12229C1346K20457K21023A97078J97640n4291h7476A14135
16195B49004k9508j9539J13022R1060j89156B0352a16284B86143b8582B06045
$$ plain form
16184 230951 202937 239482 406063 357558 77719 268199 354337 457083 81819 166494 260111
16173 260111 53265 220851 255930 275030 177902 -16294 349445 185144 211863 -72896 236803
16161 -4984 -11067 206177 -14566 54393 204727 359959 -15208 350086 14630 39001 131538
16150 131538 319770 365676 241213 275664 4824 -117840 152505 504648 429502 343260 57433
16138 417532 81461 -25141 226585 422324 475272 357537 358442 122703 49900 322801 174827
16127 174827 280858 255336 189984 -86174 82175 92292 -136775 112833 68174 131321 -13092
16115 134308 166416 18382 105928 555883 263480 -44364 63182 279280 -143207 -59056 72096
16103 34781 297100 248479 131897 232439 80657 -194156 152981 395640 190796 246651
$$ packed form
16184B30951k8014L6545J66581m8505G7719J90480Q6138J02746H1819Q4675R3617
16173B60111E3265J67586L5079J9100r7128a6294C49445j64301K6719g2896B36803
16161d984o083B06177a4566E4393J50334J55232a5208C50086A4630K4371R2537
16150A31538J88232M5906j24463L4451D824a17840A52505L52143p5146q6242E7433
16138D17532H1461b5141B26585J95739N2948j17735R05A22703D9900K72901j47974
16127A74827J06031k5522o5352h6174H2175J0117a36775A12833m4659O3147a3092
16115A34308L2108A8382Q7546M49955B63480d4364F3182K16098a43207e9056G2096
16103C4781K62319m8621j16582J00542H0657a94156A52981K42659A90796N5855
$$ plain form
16093 246651 340789 -187809 82220 83245 135106 -110268 417740 13352 150008 140908 -77392
16081 19762 -158987 138523 134509 -299149 -185674 111397 186198 39944 121630 -27881 71254
16069 -104991 -125569 247628 -2593 -5536 -74647 -36401 -173650 375581 213342 147548 40399
16057 240651 -142569 -73755 140208 284893 -3883 40027 -40360 -83600 -91714 303586 162690
16046 162690 -77884 34045 -64334 29179 -40814 203448 -49802 -103513 39774 -34547 218855
16034 -194851 20257 -66259 -145769 12129 -2619 -227915 -169192 804 -15580 15403 -100417 -60877
16022 -60877 -373134 253474 58209 145040 155330 166180 -265388 77401 273795 168638 195798
16011 195798 -79496 48014 -66592 48045 24267 255116 55064 -152088 91617 153737 153082
$$ packed form
16093B46651R4138a87809H2220J025N1861a10268D17740A3352J36656r100g7392
16081A9762a58987A38523m014b99149J13475A11397P4801C9944Q1686b7881G1254
16069a04991k0578B47628b593k943o9111c6401j37249C75581j62239o5794D0399
16057B40651a42569O8814A40208J44685c883D0027d0360m3240q114C03586j40896
16046A62690g7884C4045f4334B9179d0814B03448d9802n3711C9774c4547B18855
16034a94851B0257f6259p9510A2129b619k25296N8723H04a5580A5403a00417L9540
16022f0877l12257B53474E8209Q6831J0290J0850b65388G7401J96394j05157K7160
16011A95798g9496D8014f6592D8045k3778K30849E5064a52088I1617O2120o55
$$ plain form
16000 153082 228570 -106716 63399 -351528 181688 -264652 54090 89385 -191247 47627
15989 -70613 167444 115964 216306 -90840 -86095 103963 185530 -91918 -14313 -145703 -18084
15977 -164742 230766 -222099 -19397 240065 430619 201022 186824 634432 799484 711518
15967 711518 459149 551195 580091 520463 118606 127008 115139 -208979 222246 83748 -190494
15955 -439624 -15929 69995 -16108 -167159 -125616 203317 83393 219607 253235 235711 103576
15943 109106 142618 125519 359021 276155 -45902 -180703 296869 14751 -84674 183589 -111373
15931 -34791 46984 -14654 306735 -186899 -45091 116219 33630 16113 28069 -130465 -272663
15920 -272663 94455 83700 142250 148913 -199207 111308 -127352 299539 -139157 113718
$$ packed form
16000A53082P5488a06716F3399c51528A81688b64652E4090L5295a91247D7627
15989g0613A67444n1480J00342i0840M745A03963Q1567i1918a4313j31390a8084
15977a64742B30766b22099a9397B40065J90554B01022j4198M47608J65052q7966
15967G11518k52369R2046K8896n9628A18606Q402j1869b08979B22246H3748a90494
15955d39624a5929F9995a6108j51051M1543B03317H3393J36214L3628j7524A03576
15943A09106L3512j7099K33502q2866d5902j34801B96869A4751h4674A83589a11373
15931c4791D6984a4654C06735a86899d5091A16219C3630A6113J1956a30465j42198
15920b72663I4455j0755N8550O663a99207A11308a27352B99539a39157A13718
$$ plain form
15909 219211 -179919 -48734 -12805 -231318 3645 241261 249767 -113183 198056 -17 -14933
15898 -14933 449327 335190 99352 36274 -96195 -83664 317673 203599 -165639 -225627 -48637
15886 132049 -89928 -133188 14483 251238 -61541 -4746 22860 72061 -18644 -36949 239209
15874 61613 -242383 -382206 -260364 -113564 -232383 -166214 190709 -330273 13887 -279258
15863 -323332 -195709 -221651 229691 188461 -281004 -157669 214883 -74882 31610 -94926
15852 95815 -315396 141548 -128414 58682 -234027 129492 -91706 -82507 21850 122706 -256385
15840 -27237 234776 166291 -126085 -55601 -3464 -324740 -256593 -160910 -184884 174414 -212233
15828 -292885 57002 -80160 62643 -135311 65726 17877 -32292 94036 83208 -18028 -393818
$$ packed form
15909B19211a79919d8734a2805k18513C645K37616Q506a13183A98056a7j4916
15898a4933D49327j14137I9352C6274i6195J2531C17673j14074a65639n9988d8637
15886A32049h9928m3260A4483K36755f1541d746B2860M9201a8644j8305B39209
15874F1613b42383j39823J21842a13564j18819O6169A90709c30273A3887b79258
15863c23332J27623k5942B29691m1230b81004J23335B14883g4882C1610i4926
15852I5815c15396A41548a28414E8682b34027A29492i1706R199B1850J00856b56385
15840b7237B34776o8485a26085e5601c464l21276O8147R5683k3974A74414b12233
15828b92885E7002h0160F2643a35311F5726A7877c2292I4036j0828a8028l75790
$$ plain form
15817 -393818 371227 123469 54642 -242099 -307723 -48398 89070 301041 136941 -234791
15806 -20749 -229411 -227244 230379 9925 -291601 62623 -100825 112961 -248196 142315 -391597
15794 -192633 4868 -116531 213178 -22465 130663 225906 -20917 293616 -139563 -186295 301116
15782 -34462 -121481 -27931 -564013 -358284 -127491 -330029 -215799 8248 -36683 35757 -64370
15770 3349 35080 -194158 -48787 -83904 -147003 183443 -25376 55567 -254857 34999 -379112
15758 -432666 -316951 100581 -126787 -44816 53643 -289322 -343341 -305596 79981 7575 -227205
15746 -19249 229905 76837 165845 80968 413251 -10395 17923 19230 -21533 137968 -173321
15734 -221759 -42690 -74886 -31774 149129 23324 59627 -72328 42720 -58855 210750 136893
$$ packed form
15817c93818C71227A23469E4642b42099o5624d8398H9070K11971A36941b34791
15806b0749k08662K167B30379I925b91601F2623a00825A12961b48196A42315c91597
15794a92633D868a16531B13178b2465A30663R5243b0917B93616a39563m6732C01116
15782c4462q7019b7931n36082K05729a27491k02538J14230H248c6683C5757f4370
15770C349L1731a94158d8787l5117o3099A83443b5376E5567b54857C4999c79112
15758d32666J15715A00581a26787d4816E3643b89322n4019L7745G9981G575b27205
15746a9249B29905G6837Q9008H0968L32283a0395A7923J307b1533A37968a73321
15734b21759d2690l2196c1774A49129B3324L6303g2328D2720e8855B10750p3857
$$ plain form
15723 136893 90066 60390 -59727 -14351 -95410 182218 141195 -52190 57926 -174437 -74591
15711 -22699 -68822 52604 -265277 179039 -319571 -165821 -277419 -17248 164531 -142272
15700 48260 -41885 -200689 17977 -118548 -199843 -95496 86806 58976 -18727 212417 169445
15689 169445 -44046 368550 -127180 400712 -225024 -28227 -283200 65083 15264 -129977
15678 -88543 26709 -126120 80289 141794 29831 -66292 272971 -149221 -134561 -168016 -400452
15667 -400452 -121647 -306783 -217567 213930 -166143 9001 -360230 -26604 103809 88339
15657 88339 93588 -13372 102483 151169 96990 27472 -54501 159158 -284569 -168017 261914
15645 30701 -310898 291991 -12983 140370 154962 -397394 193241 -101086 110134 -117356
$$ packed form
15723A36893m6827k9676e9727a4351q1059A82218m1023e2190E7926a74437g4591
15711b2699m6123E2604b65277A79039c19571J53750j11598a7248A64531a42272
15700D8260d1885j58804A7977a18548q1295i5496H6806k7830a8727B12417m2972
15689A69445d4046C68550a27180D00712b25024b8227k54973F5083A5264a29977
15678h8543B6709a26120H0289O1505B9831f6292B72971a49221J4660l3455k32436
15667d00452a21647j85136Q9216B13930a66143I001c60230b6604A03809j5470
15657H8339N249a3372A02483M8686n4179B7472e4501A59158b84569J16552B61914
15645C0701c10898B91991a2983A40370J4592c97394A93241a01086A10134a17356
$$ plain form
15634 -358525 3152 1606 78217 -172874 126073 133519 -2660 88619 -16701 -122921 240904
15622 -36613 -119100 -116276 400095 196128 25085 96813 14219 -188006 -161772 305414 -244683
15610 -79095 -391401 319897 331330 210331 -414391 -48523 86330 -2465 208267 150030 -119391
15598 220280 20514 89595 64210 -168750 -113871 -176537 129299 334540 -108380 115705
15587 -19820 -69659 -166716 -64628 125934 -154794 -199451 31920 -44774 -30076 210486 -244629
15575 -19950 -202610 -8191 -104198 -30341 114593 -179559 -126607 507259 -216222 187790 -158117
15563 180836 -318359 -250866 -130917 -84677 -52116 -331852 278917 -285535 -71502 38291
15552 -229587 -88590 49009 171369 71444 -173073 -165789 -205466 -210988 388356 -84672 -124489
$$ packed form
15634c58525C152j546P6611a72874A26073P446b660H8619a6701j06220B40904
15622c6613q2487K824D00095A96128B5085P1728A4219a88006K6234C05414b44683
15610g9095l12306C19897J1433j20999d14391d8523H6330b465B08267n8237a19391
15598B20280B0514O9081k5385a68750N4879o2666A29299K05241a08380A15705
15587a9820m9839r7057f4628A25934a54794m4657C1920d4774J4698B10486b44629
15575a9950j82660h191r6007c0341A14593a79559N2952E07259b16222A87790a58117
15563A80836c18359O7493J19949M6240L2561k79736B78917b85535g1502C8291
15552b29587h8590D9009J22360G1444a73073P284l9677n522C88356h4672l9817
$$ plain form
15541 -124489 -38186 -86072 -229670 55149 -41239 75876 -118013 1522 -101036 -261185 -176382
15530 -176382 283021 259099 61614 153224 114383 -182118 173565 -367976 293234 41787
15519 -240480 -98037 -35702 410949 30323 -212079 44596 -123008 -362539 185627 27817
15508 5961 502430 -249780 -64507 -51047 126520 176511 -214253 142831 154299 481920 23838
15496 -4559 297480 231858 273600 124749 168866 516 53942 109524 201 193012 265135 393507
15484 393507 -127120 232155 -249491 77150 51684 97172 183545 204953 216614 69479 -3736
15472 177867 95030 -98539 314139 13647 194313 -113702 286584 -75973 155192 123214
15462 123214 164764 174332 137267 310318 544566 702684 326527 290446 -62281 424148 113840
$$ packed form
15541a24489c8186m7886j43598E5149d1239G5876a18013A522a01036j60149Q4803
15530a76382B83021k3922F1614R1610l8841a82118A73565c67976B93234D1787
15519b40480i8037c5702D10949C0323b12079D4596a23008k39531A85627B7817
15508E961M96469b49780f4507J3460A26520M9991b14253A42831J1468L27621B3838
15496d559B97480o5622M1742A24749M4117E16N3426N5582B01J92811P2123J28372
15484C93507a27120B32155b49491G7150k5466M5488Q6373K1408J1661F9479c736
15472A77867q2837i8539C14139A3647J80666a13702B86584g5973A55192l1978
15462A23214M1550R568l7065J73051K34248J58118C26527l6081f2281D24148A13840
$$ plain form
15450 -197848 -114682 80744 46840 15045 248988 171673 93528 195868 363 51701 62884
15439 62884 295937 -74489 131938 212538 -68703 210588 218856 584738 -193025 131234 260312
15428 260312 287506 332554 443794 652689 698468 295131 581491 553288 91646 187297 275763
15417 275763 414323 227068 257228 -259264 135693 383580 -350052 -172990 -96204 -186225
15407 -186225 -779 -246547 136145 -103160 -221501 65848 11053 -31299 293808 18961 -58725
15395 223096 -114298 -221992 -166708 23475 -11146 12948 -168149 -160186 231633 92964 47228
15384 47228 -24486 -69715 -222792 297363 -56712 -26885 42073 207302 339354 -143224 -29966
15372 -81887 62538 -238879 -47633 235308 69455 68481 197065 -9043 37869 -46605 395798
$$ packed form
15450a97848Q3166H0744l3904A5045K33943p7315p8145J02340C63N1338J1183
15439F2884K33053g4489A31938Q0600f8703B10588Q268L65882a93025A31234J29078
15428B60312K7194M5048J11240K08895M5779B95131K86360k8203I1646R5651Q8466
15417B75763J38560j87255L0160b59264A35693K47887c50052a72990P6786r0021
15407a86225g79k45768A36145a03160j18341F5848A1053c1299B93808A8961e8725
15395B23096a14298j07694N5284B3475a1146A2948a68149P963B31633I2964m5736
15384D7228b4486m5229j53077B97363e6712b6885D2073J65229J32052a43224b9966
15372h1887F2538b38879d7633B35308F9455r74J28584i043C7869d6605C95798
$$ plain form
15360 131881 157851 214615 323433 141508 201384 486698 -233112 80070 178058 111943 -82929
15348 -62777 303056 113337 125825 350043 -4588 216858 122985 114889 115775 97444 362868
15337 362868 29299 190409 108719 56726 48330 63189 -128735 469862 19222 526287 238553
15325 123639 297326 241542 343226 326780 209968 -32685 -113647 526942 257812 -70815
15314 -35193 389390 438686 100970 -99861 223426 76407 171605 339562 94006 166591 -305007
15302 33172 -88031 -262542 290831 436597 30193 -672 410147 -1527 164439 230071 -226154
15290 20636 -33175 100538 373781 -168756 -303640 1671 275491 204482 11095 -85353 -143818
15279 -143818 -176981 131556 202627 -286567 224702 157057 -60297 -250288 322974 220363
$$ packed form
15360A31881K5970N6764J08818A41508N9876K85314b33112H0070R7988o6115h2929
15348f2777C03056A13337J2488K24218d588B16858r3873q096Q86j8331K65424
15337C62868B9299J61110q1690n1993q396J4859a28735D69862A9222N07065B38553
15325A23639J73687n5784J01684j6446j16812c2685q0962E26942B57812g0815
15314c5193C89390M9296A00970i9861B23426G6407R5198J67957I4006P2585c05007
15302C3172h8031j74511B90831J45766C0193f72D10147a527A64439O5632b26154
15290B0636c3175A00538K73243a68756j34884A671K73820p1009A1095h5353n8465
15279a43818l3163A31556P1071b86567B24702o7645f0297j89991C22974j02611
$$ plain form
15269 220363 191182 -306394 -171602 100783 56240 35105 224177 212729 406056 -79811
15258 197505 -270536 150526 -15275 -86729 304986 -25961 80661 38412 212172 -20660 121058
15246 11675 200311 461781 -127995 -3674 45591 -212526 22127 124259 -75128 148026 17563
15234 239950 -19658 242163 500927 107893 398203 705311 840064 1557170 927693 1619879
15224 1619879 1240815 810273 153654 24868 218827 -96082 -39248 356917 53928 131853
15214 131853 -23162 57784 -128026 -491628 165490 -76388 120303 74644 323261 172870
15204 172870 -267119 195934 -137087 248508 -152330 -485460 -31601 349445 145084 72068
15193 90417 -135098 86960 276640 41874 -1417 -203710 92993 109574 363683 121011 127866
$$ packed form
15269B20363k9181c06394J34792A00783m4543k1135J89072j1448J93327g9811
15258A97505b70536A50526a5275p1454C04986b5961H0661C8412J73760b0660A21058
15246A1675J88636K61470a27995c674D5591b12526B2127J02132g5128A48026A7563
15234B39950a9658B42163K58764A07893K90310L07108J34753P17106o29477O92186
15224A619879l79064m30542A53654B4868J93959i6082c9248C56917E3928P7925
15214A31853b3162E7784a28026l63602A65490g6388A20303m5659K48617j50391
15204A72870b67119A95934a37087B48508a52330l33130c1601C49445A45084G2068
15193I0417a35098H6960J89680D1874a417k02293I2993J6581K54109A21011O855
$$ plain form
15182 127866 113281 38932 23230 -70011 37289 237784 -74206 28251 -110919 29629 281977
15171 281977 286434 -102137 83442 28358 272211 347124 233410 141714 -128555 -196427 271615
15159 -231795 288608 22204 -178039 63128 107140 227302 -70608 313903 330946 155380
15148 13302 185474 -99611 357586 592707 -186729 -63038 -189333 -37674 -238946 -74109
15137 433834 -82570 233138 -129511 -241546 124165 289235 467423 275293 153468 -186135
15126 122965 214202 -22410 -236288 209300 -168194 11877 278591 145513 110745 -191940
15115 481343 -76989 213412 -134249 234925 197253 -47518 295425 396348 69549 514435
15105 514435 302487 517393 357205 15545 626869 265888 -59017 153497 120098 111395
$$ packed form
15182A27866j4585C8932j5702g0011C7289K00495g4206B8251a10919B9629K52348
15171B81977M457a02137H3442B8358K43853P4913j13714r1696a28555o7872B71615
15159b31795B88608B2204a78039F3128M4012J20162g0608C13903J7043A55380
15148A3302J72172i9611C57586K35121a86729f3038j26295c7674k01272g4109
15137D33834h2570B33138a29511j12035A24165J65070J78188j92130j21825a86135
15126A22965R1237b2410k13878B09300a68194A1877K66714j33078l4768a91940
15115D81343g6989B13412a34249B34925l7672d7518B95425J00923F9549M44886
15105E14435k11948K14906j60188A5545O11324B65888e9017A53497l3399q703
$$ plain form
15095 111395 119740 324219 -16149 -79903 51118 4375 540052 290389 115483 5756 333450
15084 333450 -153886 -96380 334664 -212480 -134451 33446 328105 -71838 -100644 310639
15073 335374 -198516 488447 176634 184444 -103965 -28868 -4221 203346 74958 -182516 -130336
15062 -130336 161058 151053 323487 284796 105610 221318 76778 -132969 -205416 486533
15051 409876 71624 -182582 20745 110403 248432 209403 68489 339438 369510 455139 329846
15040 329846 360581 282218 125415 208189 221498 -71364 -100339 550465 361089 549475 178790
15028 249811 317616 250845 264158 494031 575070 274607 433450 191429 344370 361140
15018 361140 274702 580871 657330 358528 624533 418500 730035 664847 487265 472592
$$ packed form
15095A11395Q345K04479a6149o3754E1118D375N35677k49663A15483E756L27694
15084C33450a53886N7506C34664b12480P8029C3446K94659g1838k8806C10639
15073C35374a98516D88447A76634P810a03965b8868d221B03346G4958a82516N2180
15062a30336A61058j0005J72434l8691A05610J15708G6778a32969p2447D86533
15051D09876G1624a82582B0745Q9658J38029l9029F8489K70949L0072Q5629j25293
15040C29846L0735p8363A25415Q2774J3309g1364k8975E50465j89376J88386A78790
15028B49811O7805o6771J3313K29873Q1039B74607J58843A91429J52941J6770
15018C61140q6438L06169P6459k98802K66005k06033L11535o5188j77582j4673
$$ plain form
15008 472592 603636 363848 587253 416718 820132 329280 277258 154515 379948 341697
14998 341697 439981 -88709 124854 92654 592436 100197 237552 721175 743840 155721
14987 403144 -11066 -104361 402163 60213 581336 268278 304086 385898 576367 485565 411243
14976 411243 359111 647703 326995 212403 418936 559123 514262 372088 608926 515573
14966 515573 606582 808746 787352 456649 514751 755542 841483 329254 484687 515293
14956 515293 395336 694884 476577 609911 767805 454047 422395 249430 417645 491101
14946 491101 140458 250424 597296 341420 343817 250964 334184 265939 256346 142094 282530
14935 282530 280515 301933 247652 473651 449957 205340 498317 458775 547997 399880 704461
$$ packed form
15008D72592J31044k39788K23405j70535M03414C29280n2022j22743K25433l8251
14998C41697R8284h8709A24854l2200M99782A00197J37355M83623K2665A55721
14987D03144a1066r3295D02163F0213N21123B68278L5808Q1812J90469r0802p4322
14976D11243n2132K88592l20708j14592K06533J40187m4861j42174K36838r3353
14966E15573R1009K02164k1394l30703N8102K40791Q5941C29254J55433L0606
14956E15293j19957K99548k18307J33334J57894l13758l1652j72965J68215P3456
14946D91101A40458J09966L46872k55876K397r2853Q3220o8245r593j14252J40436
14935B82530k015K1418n4281K25999k3694B05340K92977l9542Q9222j48117L04581
$$ plain form
14924 704461 663113 693009 289828 533151 540050 66654 554868 628727 848554 822918 1083082
14913 1083082 962313 1201602 1219163 1143651 1370503 1342251 1430763 1505092 1141529 1465332
14903 1465332 723563 1458432 1287195 1611432 1872055 1887695 1568669 1101718 1160669 931534
14893 931534 493319 659428 501691 863375 353467 426803 279924 643867 362696 303762
14883 303762 208867 311719 310013 430090 455677 328488 475892 583131 199792 470524
14873 470524 485535 869862 560232 634100 764656 849937 507290 556231 584432 938248
14863 938248 535201 364563 819996 633421 504744 521600 244289 459520 272276 390937
14853 390937 592194 615663 559500 412766 715704 574659 801204 609593 666001 460653
$$ packed form
14924G04461m1348K9896B89828K43323O899F6654M88214P3859K19827k5636K60164
14913A083082j20769K39289J7561p5512K26852k8252Q8512P4329l63563L23803
14903A465332G23563P34869j71237L24237K60623J5640l19026m66951N8951k29135
14893I31534m38215J66109j57737L61684C53467P3336j46879L63943k81171n8934
14883C03762r4895J02852j706J20077K5587j27189J47404J07239A99792K70732
14873D70524J5011L84327l09630P3868J30556Q5281l42647M8941K8201L53816
14863I38248m03047j70638M55433j86575j28677J6856B44289K15231j87244J18661
14853C90937K01257K3469n6163j46734L02938j41045K26545j91611N6408k05348
$$ plain form
14843 460653 560368 297906 745312 286517 457164 547303 267920 730015 558128 576359
14833 576359 319799 393504 496402 482745 560227 515768 941559 780981 828544 1216637
14823 1216637 743742 866657 1278523 1069950 668458 635466 480139 651850 496197 515158
14813 515158 563702 834348 539239 586460 423883 538032 634271 750683 730415 809032
14803 809032 693572 619004 525423 611143 710365 754325 689916 889770 779863 621126 980460
14792 980460 666819 782358 583639 547135 792825 1048550 1009204 778364 988528 849832
14782 849832 596556 767148 1031067 1004238 474740 541152 485799 546751 586950 489987 561593
14771 561593 427489 701647 543247 820536 529481 633799 521212 752764 796804 576188
$$ packed form
14843D60653R9715k62462M47406B86517J70647R0139B67920M62095j71887J8231
14833E76359k56560P3705J02898j3657P7482m4459M25791j60578M7563L88093
14823A216637m72895J22915M11866k08573m01492l2992j55327J71711j55653J8961
14813E15158M8544K70646k95109M7221j62577J14149R6239J16412k0268P8617
14803H09032j15460p4568r3581Q5720R9222M3960o4409J99854j09907j58737L59334
14792I80460l13641J15539j98719l6504K45690K55725l9346k30840K10164j38696
14782H49832k53276J70592K63919k6829D74740O6412n5353O0952M0199r6963P1606
14771E61593j34104K74158j58400K77289k91055J04318j12587K31552M4040k20616
$$ plain form
14761 576188 948608 975796 821133 776562 1043097 980760 874469 654381 558128 590703
14751 590703 944581 694722 579124 470123 450892 519660 871183 462146 549670 818519
14741 818519 564189 748667 533108 590905 728313 619749 554207 695074 757320 883236
14731 883236 807420 743018 585092 720635 861756 390672 596264 730150 792599 788537
14721 788537 685911 716435 1093082 495308 981612 917569 1316152 908610 1264567 1063627
14711 1063627 1221036 1313152 1784411 1429287 1527723 1035355 910930 948604 1175235 956496
14701 956496 815542 1060811 869439 1016710 613324 1079741 671463 747262 1102233 1001170
14691 1001170 1096474 930599 930262 1272408 1147295 1183681 1476987 1582622 1716815 1683496
$$ packed form
14761E76188L72420K7188j54663m4571K66535o2337j06291k20088r6253L2575
14751E90703L53878k49859j15598j09001j9231O8768L51523m09037Q7524K68849
14741H18519k54330J84478k15559N7797J37408j08564o5542J40867O2246J25916
14731H83236p5816o4402j57926J35543J41121C90672K05592J33886O2449m062
14721G88537j02626L0524L76647D95308M86304o4043L98583m07542L55957k00940
14711A063627J57409R2116M71259l55124R8436m92368j24425L7674K26631k18739
14701I56496j40954K45269j91372J47271m03386M66417m08278P5799L54971j01063
14691A001170R5304j65875l37L42146j25113L6386K93306J05635J34193l3319
$$ plain form
14681 1683496 1291005 1206675 1104619 1024303 986942 1001738 770267 975160 885238 1297275
14671 1297275 1040149 1126406 1388780 1034329 674512 841814 1053907 1103555 850367 903106
14661 903106 873955 1019569 815491 717930 855911 763163 1102116 992613 1209018 1188233
14651 1188233 807545 1148792 950604 995441 1260707 1151046 746080 1190855 1317768 815901
14641 815901 1200122 1423890 1162515 1222213 1523877 1104407 1135159 1393856 1072822 1619297
14631 1619297 907483 1085180 954055 860585 1411686 1090517 1537486 1219108 1108576 1283470
14621 1283470 1325632 1162918 1209968 1215907 1039326 1424637 1314155 1177082 1298583 1381169
14611 1381169 1064670 1283412 1180974 1619246 1539823 1438574 1396610 1216514 1252042 1468081
$$ packed form
14681A683496l92491q4330j02056q0316l7361J4796k31471K04893q9922M12037
14671A297275k57126Q6257K62374l54451l59817J67302K12093M9648k53188N2739
14661I03106k9151J45614k04078r7561J37981r2748L38953j09503K16405k0785
14651A188233l80688L41247j98188M4837K65266j09661m04966M44775J26913n01867
14641H15901L84221K23768k61375N9698L01664m19470L0752K58697l21034N46475
14631A619297p11814J77697j31125r3470N51101l21169M46969l18378j10532J74894
14621A283470M2162j62714M7050N939j76581L85311j10482j37073J21501Q2586
14611A381169l16499K18742j02438M38272p9423j01249m1964j80096L5528K16039
$$ plain form
14601 1468081 1627832 1303979 1408373 1387814 1415538 1245792 1135139 1118692 1635985 1264571
14591 1264571 1694026 1805635 1573246 1628386 1506551 1399996 1822108 1485638 1567191 1329223
14581 1329223 1913900 1441140 1740435 1776436 1561219 1707366 1711195 1800051 1992309 2038091
14571 2038091 1713994 2032040 1608510 2327717 1814824 1756337 1682134 1864100 2095140 1842654
14561 1842654 2353475 2165195 2019113 2007174 1732583 1772750 1962218 2167842 2341417 2226833
14551 2226833 2154635 2223133 2283724 2686991 2609217 2685138 2586060 2809653 2865265 3214311 3664120
14540 3664120 3517349 4180860 4495361 5179683 5589556 7142603 9352326 13051093 19215850
14531 19215850 29397540 30711072 18368801 10771336 6696155 4901124 4031880 4067555
$$ packed form
14601A468081J59751l23853J04394k0559K7724j69746j10653j6447N17293l71414
14591A264571M29455J11609k32389N5140j21835j06555M22112l36470Q1553k37968
14581A329223N84677m72760K99295L6001k15217J46147L829Q8856J92258M5782
14571B038091l24097L18046m23530P19207n12893n8487p4203J81966K31040k52486
14561A842654N10821j88280j46082j1939k74591M0167J89468K05624J73575j14584
14551B226833p2198O8498O0591M03267p7774P5921r9078K23593N5612L49046M49809
14540C664120j46771O63511L14501O84322M09873J553047K209723L698767O164757
14531A9215850J0181690J313532j2342271p597465m075181j795031q69244L5675
$$ plain form
14523 4067555 4917824 4406293 3312716 2856941 2754520 2638557 2430216 2523134 2125332
14514 2125332 2419173 2542520 2252953 2447968 2684822 2442569 2396364 2560125 2446077 2482237
14504 2482237 2314156 2497105 2379657 2716474 2662798 2574947 2720696 2844224 3046149 2750655
14494 2750655 2475332 2876640 3020445 2984159 2694903 2885594 3063866 2980792 3170315 3156987
14484 3156987 3072961 3021624 3030436 2954387 3035690 2836349 3233297 3373444 3094361 3457645
14474 3457645 3094864 3542127 3601058 3328191 3722757 3668069 3759274 3647369 3797423 3786823
14464 3786823 3941122 4048546 3754867 3953025 4042940 3970287 4174583 4578918 4597674 3983482
14454 3983482 4144862 4473683 4154465 4667909 5151716 4577493 4853042 4566922 4458781
$$ packed form
14523D067555Q50269n11531j093577m55775j02421j15963k08341R2918l97802
14514B125332K93841J23347k89567J95015K36854k42253m6205J63761j14048L6160
14504B482237j68081J82949j17448L36817n3676q7851J45749J23528K01925k95494
14494B750655k75323M01308J43805l6286k89256J90691J78272q3074J89523j3328
14484C156987q4026n1337Q812p6049Q1303j99341L96948J40147k79083L63284
14474C457645l62781M47263N8931k72867L94566n4688R1205j11905J50054j0600
14464C786823J54299J07424k93679J98158Q9915p2653K04296M04335J8756o14192
14454C983482J61380L28821l19218N13444M83807n74223K75549k86120j08141
$$ plain form
14445 4458781 5067674 4865898 5281311 5086289 5219922 4999274 4981530 5441954 4809573 5734116
14435 5734116 5580986 5440405 5710242 5718672 5576670 5720898 5710621 5798751 6023032 6053426
14425 6053426 6084668 6043305 6063552 6230383 6627441 6557165 6604652 7059074 6495262 6556136
14415 6556136 7169862 6858417 7118866 7202002 7271193 7514038 7309688 7488481 7795838 8000345
14405 8000345 7994776 8293711 8457270 8355508 8595634 8862853 8696785 8619338 9176486 9109496
14395 9109496 9344829 9381789 9266335 9487986 9844997 9945790 10512052 10462735 10497248 10789889
14385 10789889 10804981 11083686 10727639 11063049 11394154 11620417 11613970 11830176 12181558 12112325
14375 12112325 12360050 12795575 12495218 12974364 13355620 13682638 14057311 13649879 14365768
$$ packed form
14445D458781O08893k01776M15413j95022J33633k20648j7744M60424o32381R24543
14435E734116j53130j40581K69837Q430j42002J44228j0277Q8130K24281L0394
14425F053426L1242m1363K0247J66831L97058p0276M7487M54422n63812O0874
14415F556136O13726l11445K60449Q3136O9191K42845k04350J78793L07357K04507
14405H000345n569K98935J63559j01762K40126K67219j66068p7447N57148o6990
14395I109496K35333L6960j15454K21651L57011J00793N66262m9317L4513K92641
14385A0789889J5092K78705l56047L35410L31105K26263o447K16206L51382o9233
14375A2112325K47725M35525l00357M79146L81256L27018L74673m07432P15889
$$ plain form
14366 14365768 14661349 14979605 15034136 15268993 15626726 16204882 16277734 16615250 16791759 17343343
14356 17343343 17123318 17621917 18032240 18359538 18967602 19220703 19499654 20630208 20800369
14347 20800369 21326291 21676045 21874377 22363720 23004551 23445384 23896035 24515698 24831344
14338 24831344 25489404 26115579 26852406 27259463 28041812 28694715 29521188 30376963 31163977
14329 31163977 31970706 32810193 33846333 34457741 35807126 36418213 37459776 38402534 39675394
14320 39675394 41015050 42182962 43446848 45262244 46167140 47800277 48921825 50788698
14312 50788698 52480215 54342897 56167558 57905194 60098637 62615469 64233153 66574200
14304 66574200 69016110 71631938 74420784 77007193 79946739 82796714 86268915 89427160
$$ packed form
14366A4365768K95581L18256N4531K34857L57733N78156P2852L37516J76509N51584
14356A7343343k20025M98599M10323L27298O08064K53101K78951J130554J70161
14347B0800369N25922L49754J98332M89343O40831M40833M50651O19663L15646
14338B4831344O58060O26175P36827M07057P82349O52903Q26473Q55775P87014
14329C1163977Q06729Q39487J036140O11408J349385O11087J041563R42758J272860
14320C9675394J339656J167912J263886J815396R04896J633137J121548J866873
14312E0788698J691517J862682J824661J737636K193443K516832J617684K341047
14304F6574200K441910K615828K788846K586409K939546K849975L472201L158245
$$ plain form
14296 89427160 93379819 97048305 101055517 105558560 110217368 115016540 120216174 125776348
14288 125776348 131609691 137685442 144304707 150997614 158431795 166304332 174426147 182836888
14280 182836888 192297308 202037408 211967334 222691679 234301753 245947734 258158470
14273 258158470 271148949 284524443 297786273 311058589 324056371 337760906 351218317
14266 351218317 363908275 375695496 386750638 397125689 406165726 414485927 422632570
14259 422632570 429640294 434146986 437196249 438381573 440657058 439124717 433263401 429329497
14251 429329497 423544664 414064071 404514996 392656623 380549358 368186283 356119333
14244 356119333 343364323 330547762 317021638 304025594 291064286 278629914 266588704
$$ packed form
14296H9427160L952659L668486M007212M503043M658808M799172N199634N560174
14288A25776348N833343O075751O619265O692907P434181P872537Q121815Q410741
14280A82836888R460420R740100R929926J0724345J1610074J1645981J2210736
14273B58158470J2990479J3375494J3261830J3272316J2997782J3704535J3457411
14266C51218317J2689958J1787221J1055142J0375051R040037Q320201Q146643
14259D22632570P007724M506692L049263J185324K275485j532341n861316l933904
14251D29329497n784833r480593r549075j1858373j2107265j2363075j2066950
14244C56119333j2755010j2816561j3526124j2996044j2961308j2434372j2041210
$$ plain form
14237 266588704 254730495 242914492 231894678 221824335 212018955 201372950 191246500
14230 191246500 181824815 172708996 164507748 156386278 149030556 141972387 135406162 129174800
14222 129174800 123669106 118070180 113043533 107990961 103675072 99381859 95395910 91524561
14214 91524561 87725655 84147141 80823468 78296318 74992101 72239676 69663746 67007897
14206 67007897 64759706 62658828 60457029 58378034 56353503 54691584 53072072 51633242
14198 51633242 50022796 48409245 47106785 45290379 44077186 42884049 42141152 40703277
14190 40703277 39370727 38312073 37247326 36583892 35632056 34564877 33730062 32720622
14182 32720622 32101889 31206225 30408575 29488553 28797503 28173813 27532814 27064627 25970839
$$ packed form
14237B66588704j1858209j1816003j1019814j0070343r805380j0646005j0126450
14230A91246500r421685r115819q201248q121470p355722p058169o566225o231362
14222A29174800n505694n598926n026647n052572m315889m293213l985949l871349
14214I1524561l798906l578514l323673k527150l304217k752425k575930k655849
14206F7007897k248191k100878k201799k078995k024531j661919j619512j438830
14198E1633242j610446j613551j302460j816406j213193j193137p42897j437875
14190D0703277j332550j058654j064747o63434r51836j067179q34815j009440
14182C2720622o18733q95664p97650r20022o91050o23690o40999m68187j093788
$$ plain form
14173 25970839 25388629 25375212 24382359 24054689 23302040 22823903 22255494 21937126 21571603
14164 21571603 21062205 20423343 19774685 19850778 19323278 19029093 18703710 18034011 17823658
14155 17823658 17469953 17353303 16619184 16772006 16156195 16057119 15719280 15377913 14600245
14146 14600245 14608721 14389559 14302946 13722692 13964609 13503374 13222598 13214122 12887472 12589146
14136 12589146 12237343 12183384 11841427 11726142 11440191 11382877 11201200 11168166 10727133 10715105
14126 10715105 10549872 10369467 10117025 10118756 10357145 9826791 9560404 9688858 9546648 9240405
14116 9240405 9072395 8830517 8739852 8823213 8670143 8510278 8474194 8035002 8314453 8093028
14106 8093028 7897912 7651673 7685058 7626362 7455802 7478140 7147558 7130230 6930881 7178605
$$ packed form
14173B5970839n82210j3417r92853l27670p52649m78137n68409l18368l65523
14164B1571603n09398o38862o48658P6093n27500k94185l25383o69699k10353
14155A7823658l53705j16650p34119J52822o15811r9076l37839l41367p77668
14146A4600245Q476k19162q6613n80254K41917m61235k80776q476l26650k98326
14136A2589146l51803n3959l41957j15285k85951n7314j81677l3034m41033j2028
14126A0715105j65233j80405k52442J731K38389n30354k66387J28454j42210l06243
14116I240405j68010k41878r0665Q3361j53070j59865l6084m39192K79451k21425
14106H093028j95116k46239L3385n8696j70560K2338l30582j7328j99349K47724
$$ plain form
14096 7178605 7161707 6700570 6681267 6570890 6680857 6433299 6280532 6211298 6240750 5909035
14086 5909035 5984523 5926608 5834447 5808226 5526455 6152972 5626245 5894493 5435487 5510312
14076 5510312 5306049 5881171 5560701 5113054 5327134 5273201 5070031 5003782 5640103 5239151
14066 5239151 4968814 5157365 4885457 5073980 4787110 4715868 4461986 4277601 4538785 4679053
14056 4679053 4520649 4112107 4540971 4493613 4067594 3997353 4421651 3747986 4498838 3979165
14046 3979165 3983857 3811931 4142288 4276204 3688386 3924057 4103297 3689225 3980472 3838612
14036 3838612 3800829 3549086 3688865 3243644 3367682 3532943 3390546 3684265 3557366 3548584
14026 3548584 3597031 3258787 2999151 3185729 3239843 3518411 2928545 3116706 3382901 3011223
$$ packed form
14096G178605j6898m61137j9303j10377J09967k47558j52767o9234K9452l31715
14086E909035P5488n7915r2161k6221k81771O26517n26727K68248m59006P4825
14076E510312k04263N75122l20470m47647K14080n3933k03170o6249O36321m00952
14066E239151k70337J88551k71908J88523k86870p1242k53882j84385K61184J40268
14056D679053j58404m08542M28864m7358m26019p0241M24298o73665P50852n19673
14046C979165M692j71926L30357J33916n87818K35671J79240m14072K91247j41860
14036C838612l7783k51743J39779m45221J24038J65261j42397K93719j26899q782
14026C548584M8447l38244k59636J86578N4114K78568n89866J88161K66195l71678
$$ plain form
14016 3011223 2887822 3112919 2944461 3038444 2963815 2948994 2628433 2690652 2758580 2935514
14006 2935514 2967890 2721347 2670665 2295358 2661070 2549836 2391535 2722943 2389116 2596603
13996 2596603 2504882 2452365 2419472 2418110 2537728 2331499 2335968 2515161 2749891 2591837 2259525
13985 2259525 1980177 2470321 2358415 2130033 2513399 2701158 2733158 2757324 3183397 3370100
13975 3370100 4452423 6153334 9016271 14261625 25243154 32332055 22717885 14654241
13967 14654241 9919357 7363874 5514022 4590216 4437314 4141787 3329980 3416780 3211147
13958 3211147 3047355 2884502 2840527 2916865 2704276 2614473 2565441 2671557 2012382 2553946
13948 2553946 2452181 2437649 2069796 2222657 2316195 2259047 2234210 2321071 1925607 2075058
$$ packed form
14016C011223j23401K25097j68458R3983p4629j4821l20561O2219O7928J76934
14006B935514L2376k46543n0682l75307L65712j11234j58301L31408l33827K07487
13996B596603r1721n2517l2893j362J19618k06229M469J79193K34730j58054l32312
13985B259525k79348M90144j11906k28382L83366J87759L2000K4166M26073J86703
13975C370100J082323J700911K862937N245354J0981529P088901r614170q063644
13967A4654241m734884k555483j849852r23806j52902k95527q11807Q6800k05633
13958C211147j63792j62853m3975P6338k12589q9803m9032J06116o59175N41564
13948B553946j01765j4532l67853J52861R3538n7148k4837Q6861l95464J49451
$$ plain form
13938 2075058 2204776 1558302 1447324 2115407 1672568 2307728 1834747 1908412 1808938 1670237
13928 1670237 1980020 1625416 1654044 1901178 1628082 1703462 1992349 1862633 1669560 1428739
13918 1428739 1680466 1608342 1650866 1662868 1525203 1886050 1560869 1621733 1728304 1585654
13908 1585654 1150009 1596499 1246898 1754136 1589802 1697544 1480917 1625081 1517844
13899 1517844 1666229 1379971 1334525 1570567 1700972 1409924 1560193 1496384 1526810 1210730
13889 1210730 1575795 1140670 1421734 1234429 1088349 1077522 1372152 1720272 1523934 1226637
13879 1226637 1393550 1442364 1238281 1271402 1368851 1198123 1227988 1115864 1232188 1444606
13869 1444606 1557635 1041335 1146189 1315593 1324865 1287520 1002558 1179670 1096464 1031140
$$ packed form
13938B075058J29718o46474j10978O68083m42839O35160m72981P3665r9474j38701
13928A670237L09783l54604K8628K47134k73096P5380K88887j29716j93073k40821
13918A428739K51727p2124M2524J2002j37665L60847l25181O0864J06571j42650
13908A585654m35645M46490l49601N07238j64334J07742k16627J44164j07237
13899A517844J48385k86258m5446K36042J30405k91048J50269o3809L0426l16080
13889A210730L65065m35125K81064j87305j46080j0827K94630L48120j96338k97297
13879A226637J66913M8814k04083L3121R7449j70728K9865j12124J16324K12418
13869A444606J13029n16300J04854J69404R272l7345k84962J77112q3206o5324
$$ plain form
13859 1031140 966699 1081304 1199829 951517 1442050 1498260 1135260 1441595 1340171 973272
13849 973272 937641 997625 1101739 1083782 1207112 1179227 1131456 1035666 1090296 1306203 984577
13838 984577 1017322 1240587 1062649 1089349 1026777 1139615 1349826 1247004 822588 969466
13828 969466 1051252 691813 615334 1110347 1092000 1001004 1216950 945831 1139605 979860
13818 979860 993007 1032015 802542 1233237 1217011 763841 720025 869565 978029 1050793
13808 1050793 948932 844683 771982 732012 852487 822041 722175 851597 811766 698593
13798 698593 832239 1057850 861341 1037869 807338 776849 769061 1045396 786250 786507 823667
13787 823667 418201 493568 652378 1017158 1042484 544201 972720 954215 627186 634271
$$ packed form
13859A031140o4441J14605J18525k48312M90533N6210l63000L06335j01424l66899
13849I73272l5631N9984J04114j7957J23330k7885m7771r5790N4630K15907l21626
13838I84577L2745K23265j77938K6700o2572J12838K10211j02822m24416J46878
13828I69466Q1786l59439p6479M95013j8347r0996K15946k71119J93774j59745
13818I79860J3147L9008k29473M30695j6226m53170m3816J49540J08464P2764
13808A050793j01861j04249p2701l9970J20475l0446r9866J29422l9831j13173
13798F98593J33646K25611j96509J76528k30531l0489p788K76335k59146K57L7160
13787H23667m05466P5367J58810L64780K5326m98283M28519j8505l27029P085
$$ plain form
13777 634271 584765 965209 703126 765865 977986 502843 686183 835083 715960 516869
13767 516869 823700 622101 437798 749033 696078 913583 514581 927627 755280 511216
13757 511216 291403 500030 1034539 569585 1179204 405851 688638 469595 381873 594561
13747 594561 778069 421573 569624 621302 663017 555141 746134 825806 463935 593721
13737 593721 935454 556596 495806 774612 668909 696950 491509 817249 795188 419587
13727 419587 560032 588853 670807 785490 684990 618427 764148 691862 634794 428918
13717 428918 726806 707977 794328 687862 608150 365807 837151 431683 649393 595055
13707 595055 691429 172843 556474 591030 479426 696994 386359 479747 450627 482117
$$ packed form
13777F34271m9506L80444k62083O2739K12121m75143J83340J48900j19123j99091
13767E16869L06831k01599j84303L11235n2955K17505l99002M13046j72347k44064
13757E11216k19813K08627N34509m64954O09619D05851K82787k19043q7722K12688
13747E94561J83508l56496J48051N1678M1715j07876J90993P9672l61871J29786
13737E93721L41733l78858o0790K78806j05703K8041k05441L25740k2061l75601
13727D19587J40445K8821Q1954J14683j00500o6563J45721p2286n7068k05876
13717D28918K97888j8829Q6351j06466p9712k42343M71344m05468K17710n4338
13707E95055R6374A72843L83631L4556j11604K17568l10635R3388k9120L1490
$$ plain form
13697 482117 341316 561453 211310 581308 169850 541643 774815 329518 807191 622540
13687 622540 496392 780365 761625 387028 443620 299798 532352 600021 357929 484319
13677 484319 556967 597438 637115 307480 472945 387853 471214 488325 892654 410226 730384
13666 730384 458226 803225 541493 701409 399192 438880 196895 738949 213025 295603
13656 295603 353207 717260 378397 431967 550237 485634 677017 754186 328579 562314
13646 562314 541918 623853 606763 467720 653996 585046 488743 404506 727632 741519 483507
13635 483507 421136 375583 210111 459822 381991 356247 192436 352651 317079 454671
13625 454671 402100 240151 158740 437078 412196 648906 493654 715408 420313 289044
$$ packed form
13697D82117j40801K20137B11310L69998A69850L71793K33172C29518M77673j84651
13687F22540j26148K83973j8740l74597N6592j43822K32554O7669k42092J26390
13677D84319P2648M0471L9677C07480J65465q5092Q3361J7111M04329D10226L20158
13666G30384k72158L44999k61732J59916l02217L9688A96895N42054B13025Q2578
13656B95603N7604L64053l38863N3570J18270o4603J91383P7169C28579K33735
13646E62314k0396Q1935j7090j39043J86276o8950r6303q4237L23126J3887k58012
13635D83507o2371m5553j65472K49711p7831k5744j63811J60215l5572J37592
13625D54671n2571j61949q1411K78338k4882K36710j55252K21754k95095j31269
$$ plain form
13615 289044 319746 622955 553317 317505 279600 92785 437011 132800 611033 451641
13605 451641 161010 324293 295792 461880 548936 192892 440836 201766 53936 254950
13595 254950 629067 -37768 384053 142337 630829 342793 375580 383082 166377 543960
13585 543960 491338 260566 193777 341346 475483 25252 129806 181943 570845 414370
13575 414370 530399 219527 558023 313616 475649 499308 636751 258529 175881 329022
13565 329022 414655 494977 330722 515593 384539 789168 414350 429039 297756 240815
13555 240815 272504 266058 398807 212874 -11693 279130 -15002 124258 243833 555619
13545 555619 183535 436791 436703 544130 207216 510985 200908 438570 660801 62664
$$ packed form
13615B89044L0702L03209o9638k35812l7905I2785L44226A32800M78233j59392
13605D51641A61010J63283k8501J66088Q7056A92892K47944B01766E3936K01014
13595B54950L74117c7768C84053A42337M88492k88036L2787P502A66377L77583
13585E43960n2622k30772o6789J47569J34137B5252J04554N2137L88902j56475
13575D14370J16029B19527L38496k44407J62033K3659J37443B58529q2648J53141
13565C29022Q5633Q0322j64255J84871j31054M04629l74818J4689j31283n6941
13555B40815L1689o446J32749j85933a1693B79130a5002A24258J19575L11786
13545E55619A83535K53256q8J07427B07216L03769B00908K37662K22231F2664
$$ plain form
13534 422099 437232 292407 116685 392715 348303 562016 474097 786875 314227 194622
13524 194622 458778 105820 530683 39452 118058 378352 550443 -20272 135686 324779
13514 324779 325442 403228 395538 202852 541937 93984 -20264 -102605 228811 -103430 344447
13502 343674 332301 210167 103567 213257 509114 -27722 426930 671133 19070 377515
13492 377515 202838 263636 -61741 46911 152299 561798 14941 367296 4525 270196 438323
13481 438323 415515 188102 224781 -5674 513040 208946 320197 332653 72123 -150995 174609
13469 -142442 547397 378876 187596 205650 419462 227283 170743 288997 162584 457785
13459 457785 88424 520266 191190 369399 340668 -5462 272626 161633 467787 -37859
$$ packed form
13534D22099J5133j44825A16685K76030m4412K13713q7919L12778C14227j19605
13524A94622K64156A05820M24863C9452P8606K60294J72091b0272A35686J89093
13514C24779O63P7786p690j92686L39085I3984b0264q2341B28811a03430C44447
13502C43674j1373j22134A03567J09690K95857b7722D26930K44203A9070L58445
13492C77515j74677O0798f1741D6911J05388M09499A4941L52355D525K65671J68127
13481D38323k2808A88102L6679e674E13040B08946J11251J2456G2123a50995A74609
13469a42442E47397j68521A87596J8054K13812j92179n6540J18254j26413K95201
13459D57785H8424M31842A91190J78209k8731e462B72626j10993L06154c7859
$$ plain form
13448 176558 180591 159527 281851 259182 190690 402661 181188 104288 -105517 311046 259417
13437 259417 -33515 310769 -243520 165376 202034 223912 196803 386956 330612 235444 -14670
13425 135002 107624 114808 194363 9431 -29137 -85564 353522 467310 68829 430772 321007
13414 321007 223231 665259 233922 51473 -72116 245007 254265 200795 -74421 400397 159009
13402 308682 361054 92712 -158965 -79459 222791 446945 374293 407527 103486 335990
13392 335990 113273 244987 64695 280442 239622 199567 77905 241935 103801 508629
13382 508629 305263 257782 322784 420526 98675 263190 338029 76746 15180 215440 247415
13371 247415 306355 211604 248108 369323 254700 76641 66916 55612 91328 218995 560605
$$ packed form
13448A76558M033k1064J22324k2669o8492K11971A81188p6900a05517C11046n1629
13437B59417c3515C10769b43520A65376L6658K1878k7109J90153n6344r5168a4670
13425A35002k7378P184P9555I431b9137n6427C53522J13788F8829L61943j09765
13414C21007r7776M42028B33922E1473g2116B45007R258n3470g4421D00397A59009
13402C08682N2372I2712a58965g9459B22791K24154p2652L3234A03486K32504
13392C35990A13273J31714F4695K15747m0820m0055G7905J64030A03801M04828
13382E08629k03366m7481O5002R7742I8675J64515P4839G6746A5180K00260L1975
13371B47415N8940r4751L6504J21215j14623G6641r725j1304L5716J27667L41610
$$ plain form
13360 560605 637343 174632 101700 279894 209513 -90184 208276 20519 -51095 56534 338086
13349 338086 142738 19507 25188 160731 170828 595050 263264 320094 208682 39060 -157000
13337 -55578 131556 -99002 -57993 -11156 217471 47887 164788 257850 222025 355258 509050
13326 509050 196696 511791 284878 67892 180482 43174 464557 286801 302229 216339
13316 216339 48469 -160929 202441 152572 290264 138420 147392 348068 399176 3194 142720
13305 142720 163450 432932 175351 406941 547111 359993 14994 264575 -26599 113408
13294 521389 234959 -44239 -83965 225699 321820 261964 314655 603398 -64472 10714 -43102
13282 383826 248458 409211 354187 -26820 -93559 -161025 171225 100962 253373 66769 48090
$$ packed form
13360E60605P6738A74632p2932J78194p0381i0184B08276B0519e1095E6534K81552
13349C38086A42738A9507N681J35543J0097M24222B63264N6830j11412C9060a57000
13337e5578A31556i9002M1009a1156B17471D7887J16901R3062l5825J33233J53792
13326E09050A96696L15095k26913F7892J12590D3174M21383j77756J5428q5890
13316B16339D8469a60929B02441m9869J37692A38420Q972K00676N1108C194J39526
13305A42720K0730K69482A75351K31590J40170j87118A4994K49581b6599A13408
13294E21389B34959d4239l9726B25699R6121n9856N2691K88743f4472A0714d3102
13282C83826j35368J60753n5024b6820o6739o7466A71225p0263J52411F6769j8679
$$ plain form
13271 48090 331608 118875 -37287 118455 288010 303894 197891 -34926 -17753 218309
13260 213845 281751 452304 121259 100823 85327 -215306 -39644 112358 37032 401973
13250 401973 93055 -47864 30690 81629 -67035 211195 289709 12040 -73629 44270 115073
13239 115073 238809 452339 -7968 98136 41747 111717 -29710 117114 -242322 428188 -232695
13227 53677 82948 244336 -148701 114167 209951 -192366 -10362 -4735 134918 -134842 34601
13215 424687 326733 94836 177990 213570 -121630 217771 23563 202387 -193382 64988 24843
13203 188344 238941 183701 56029 81287 117126 -18366 301886 11644 238269 540815 186027
13191 -339 81636 163524 28681 278783 263470 -86629 -13950 37441 203472 116411 -126882
$$ packed form
13271D8090K83518A18875c7287A18455J69555J5884j06003c4926J7173B18309
13260B13845O7906J70553A21259k0436j5496b15306c9644A12358C7032L64941
13250D01973I3055d7864C0690N0939f7035B11195P8514A2040g3629D4270P0803
13239A15073J23736K13530g968I8136D1747O9970b9710A17114b42322D28188b32695
13227E3677K9271J61388a48701A14167R5784a92366a0362d735A34918a34842C4601
13215D24687r7954I4836Q3154L5580a21630B17771B3563J78824a93382F4988B4843
13203A88344N0597n5240E6029K5258L5839a8366C01886A1644K26625L02546A86027
13191c39H1636Q1888B8681K50102j5313h6629a3950C7441J66031q7061a26882
$$ plain form
13179 187153 -200019 53964 -83909 67643 -121314 -15837 293840 -177521 331778 176587
13169 176587 298161 -174277 -200323 139217 342988 152619 -256563 -64578 -5122 -22261
13159 -22261 188439 27695 128925 184419 69606 39700 43076 104706 113942 43840 -250100
13147 126367 127695 146331 -128699 -205987 55199 158163 -41886 -32780 7526 -1668 363350 -362279
13134 82943 145107 32376 186783 -54208 306019 -135570 103495 -32106 386337 -33612 -33624
13123 -33624 110972 61465 93070 -34241 235003 -13894 160771 324755 48406 193414 171921
13112 171921 -20956 81860 165715 176232 104990 114372 66747 -164464 -52919 36910 48130
13101 48130 232869 114692 369332 -234644 -202468 -121336 -321508 168775 272704 271456
$$ packed form
13179A87153b00019E3964h3909F7643a21314a5837B93840a77521C31778j55191
13169A76587J21574a74277k6046A39217K03771A52619b56563f4578e122j7139
13159b2261A88439B7695J01230N5494F9606k9906L376O1630R236D3840b50100
13147A26367J328J8636a28699p7288E5199J02964d1886R106G526a668C63350c62279
13134H2943O2164C2376J54407e4208C06019a35570A03495c2106C86337c3612j2
13123c3624A10972m9507L1605c4241B35003a3894A60771J63984D8406J45008k1493
13112A71921b0956H1860Q3855J0517p1242R382m7625a64464e2919C6910J1220
13101D8130J84739A14692K54640b34644L2176Q1132k00172A68775J03929j248
$$ plain form
13091 271456 -181791 17951 182027 -58736 14035 -178888 -139137 110591 -118923 -112789 326973
13079 67681 72171 324673 300864 41858 167013 413 360907 79430 433544 242355 -244457
13067 463661 240568 161920 241852 57820 139936 157993 100610 146963 -108231 -98270 -207518
13056 -207518 219470 249342 29607 66804 206363 163745 222817 263681 169752 23430 -171760
13044 68723 356441 -98902 272119 -174778 73869 135165 -31134 71223 128687 62863 109766
13033 109766 -69182 -422471 -79928 -96826 19819 124186 25578 295230 135256 132043 175504
13022 175504 94246 -210315 271989 -173751 -14217 -12385 177478 -388 201206 89500 260419
13011 260419 96886 80173 179273 -51911 -64830 197062 229366 -217516 45498 24107 421749
$$ packed form
13091B71456a81791A7951J64076e8736A4035a78888L9751A10591a18923O134C26973
13079F7681M490K52502k3809D1858J25155D13L60494G9430L54114j91189b44457
13067D63661k23093p8648P9932E7820Q2116J8057n7383M6353a08231R961j09248
13056b07518B19470K9872B9607L7197J39559m2618N9072M0864r3929B3430a71760
13044F8723K87718i8902B72119a74778G3869O1296c1134G1223N7464F2863M6903
13033A09766f9182l53289g9928j6898A9819J04367B5578K69652A35256l213M3461
13022A75504q1258b10315B71989a73751a4217J832A77478c88B01206H9500J70919
13011B60419I6886j6713R9100e1911j2919A97062L2304b17516D5498k1391L97642
$$ plain form
13000 421749 61703 101659 -79931 -63192 14827 -82345 185495 115450 -12298 175669 328643
12989 328643 118373 -55603 -72 -64386 188341 -128790 242238 235732 259992 201436 -69750
12977 -46564 145082 -560646 -262913 -84849 -95495 -491792 85828 -15827 96798 -307661 242058
12965 -37640 74914 4575 156493 -21546 65266 116996 -33629 15719 61264 -110562 -104675 108356
12952 324739 57941 -126130 -78500 127198 199738 201419 186216 -301595 11353 -12709 -53403
12941 -53403 -11967 96254 225357 18237 -136807 -461930 221870 6152 -40289 43663 65713
12930 65713 -31403 204489 -55910 -45883 -211736 -217006 -189365 27517 -279240 4080 136916
12919 136916 -313478 196534 163821 -249826 95259 12917 170876 -99184 131198 359659
$$ packed form
13000D21749F1703L9956g9931J6739A4827h2345A85495p0045a2298A75669J52974
12989C28643A18373e5603g2o4314A88341a28790B42238o506K4260n8556f9750
12977d6564A45082e60646b62913h4849j0646l96297H5828a5827I6798c07661B42058
12965c7640G4914D575J51918b1546F5266N1730c3629A5719M5545a10562N887A08356
12952C24739E7941a26130M7630A27198P2540J681j5203c01595A1353a2709m0694
12941e3403a1967I6254J29103A8237a36807l25123B21870F152d0289D3663K2050
12930F5713c1403B04489e5910J0027j65853n270K7641B7517b79240D080J32836
12919A36916c13478A96534l2713b49826I5259A2917J57959i9184A31198K28461
$$ plain form
12909 359659 -230278 174528 -109244 6747 45351 -11164 -76600 -84000 97463 429071 -222475
12897 128716 122314 95964 -70583 217655 -29685 -3354 -26848 400424 83235 -30166 -24211 -33886
12885 -33886 156678 102887 305620 98965 196988 -29592 -25541 -235871 -25257 -92198 68759
12873 -72074 -10405 -138389 716749 213365 -74035 405313 125406 82683 -127235 -149274
12863 -149274 83143 -152664 -109420 -181793 150228 -45169 140164 129703 16975 37032 -209978
12851 467400 -127901 68891 -178671 227319 23801 -107652 -17950 303293 84139 308175
12841 308175 149506 -163876 151730 278422 234605 268431 -255042 112759 163811 -143153
12830 131961 -112114 -340342 -2452 -30968 -132800 -206691 -108033 -99781 -185695 -149780 -127099
$$ packed form
12909C59659b30278A74528a09244F747L8604a1164o5436p400I7463L31608b22475
12897A28716o402k6350g0583B17655b9685c354k3494D00424H3235c0166N955r675
12885c3886A56678n3791K02733I8965R8023b9592M051k10330b5257o6941F8759
12873g2074a0405j27984G16749B13365g4035D05313A25406m2723a27235k2039
12863a49274H3143a52664M3244p2373A50228d5169A40164j0461A6975K0057b09978
12851D67400a27901F8891a78671B27319B3801a07652a7950C03293H4139K24036
12841C08175A49506a63876A51730J26692m3817L3826b55042A12759N1052a43153
12830A31961a12114k28228b452k8516j01832p3891R8658Q252q5914L5915K2681
$$ plain form
12819 -127099 -156846 156715 45809 -136964 61421 313839 81437 80481 -97631 -73262 -179719
12808 -179719 -353992 157986 153953 -3167 -8839 -65827 -50960 -79844 -40150 -17362 -240654
12797 -240654 -20611 -110013 -250197 14202 103613 -87113 -98991 -38522 45870 -126337 229172
12785 163231 -154266 28107 83762 164670 -141835 36888 -252748 -160345 122736 42089 134312
12774 134312 -23738 -188832 -193013 41878 -160223 -173241 75838 5396 -73154 481125 -79354
12762 10806 196122 52906 108242 -201444 -406027 74679 105787 236041 -394644 -52976 -165793
12751 -165793 -60116 -197605 -105945 10618 -116686 -369219 -221669 -13848 -281547 -130888
12740 240856 -380558 -161966 -8311 82297 -89920 36003 209014 43350 -128432 286184 -304659
$$ packed form
12819a27099k9747A56715D5809a36964F1421K52418H1437r56i7631K4369j06457
12808a79719j74273A57986m033c167n672n6988J4867k8884L9694a7362k23292
12797b40654b0611q9402j40184A4202Q9411h7113j1878c8522D5870a26337B29172
12785A63231a54266B8107N5655Q0908a41835C6888b52748R2403A22736D2089R2223
12774A34312b3738j65094m181D1878a60223j3018G5838E396g3154D81125g9354
12762A0806J85316E2906N5336b01444k04583G4679L1108J30254c94644e2976j12817
12751a65793f0116j37489R1660A0618a16686k52533J47550a3848k67699a30888
12740B40856c80558a61966h311H2297h9920C6003J73011D3350a28432B86184c04659
$$ plain form
12728 8074 142791 -76660 244057 113653 7829 89439 17394 63854 74266 44560 -260773
12716 1523 189851 1206 -112673 -80886 -64860 -29185 78070 -267252 -214476 290346 46349
12704 -8995 78708 265811 -95441 7370 63587 14023 48282 -61054 -188325 142684 127016
12693 127016 -190682 195475 -6391 273300 170235 171409 -54901 220507 -51778 -208336 -120323
12682 -120323 120527 248954 120246 -203794 219873 -45731 -318314 184566 105219 -94318
12671 98935 59922 219 -233889 -54116 -233148 355037 137163 252085 264932 38641 68967
12660 68967 374474 326052 -19701 50930 -172431 107818 -54944 -158172 -17474 36667 -8787
12648 79920 169660 424462 84540 177447 379535 -370795 186484 134984 141455 169951 150266
$$ packed form
12728H074J34717g6660B44057A13653G829Q1610A7394M6460J0412k9706b60773
12716A523J88328A206a12673L1787J6026b9185G8070b67252N2776B90346D6349
12704h995G8708J87103i5441G370N6217A4023L4259f1054j27271A42684j5668
12693A27016a90682A95475f391B73300j03065J174e4901B20507e1778j56558Q8013
12682a20323A20527J28427A20246b03794B19873d5731k72583A84566p9347i4318
12671I8935l9013B19b33889e4116j79032C55037A37163J14922J2847C8641L0326
12660F8967L05507m8422a9701E0930a72431A07818e4944j03228a7474C6667h787
12648G9920Q9740K54802H4540R2907K02088c70795A86484n1500O471K8496j9685
$$ plain form
12637 150266 914 151508 -178392 51825 -566733 -310850 -379355 -5593 -186770 -217721 152537
12625 63493 226349 -111464 21534 89065 244856 -245531 -97845 74566 144561 176284 -29859
12613 257574 116149 194456 149692 -186902 -56606 144380 140711 -49411 -26657 -17657 -319399
12602 -319399 139038 106003 90196 79987 24488 60729 66430 -77029 198482 -89215 39419
12590 103466 40112 72431 -469651 -119657 84607 128224 223540 73778 -61597 -42086 -18817
12578 64917 -242492 201706 -53359 -96213 21238 -211026 -13635 31457 191393 -114999 -132616
12567 -132616 126926 164057 76458 145895 -209181 -372647 -171642 -142115 -70583 -182915
12557 -182915 -103543 28668 -14733 88401 235069 213501 63435 68416 -79339 -19521 -172991
$$ packed form
12637A50266I14J50594a78392E1825e66733K55883o8505e593j81177l0951A52537
12625F3493J62856a11464B1534O7531J55791b45531i7845G4566O9995L1723b9859
12613B57574A16149P8307m4764a86902e6606A44380l669d9411K2754R000l01742
12602c19399A39038l3035j5807j0209B4488L6241N701g7029A98482h9215C9419
12590A03466D0112L2319d69651a19657H4607M3617R5316G3778f1597J9511a8817
12578F4917b42492B01706e3359m2854B1238b11026a3635C1457J59936a14999j7617
12567a32616A26926L7131G6458O9437b09181j63466a71642K9527g0583j12332
12557a82915P9372B8668a4733H8401J46668k1568F3435M981g9339a9521j53470
$$ plain form
12546 -172991 64627 -52005 -157815 -192437 -280953 53767 21826 -287100 71044 80109 -240795
12534 333689 -262299 95923 222337 -140367 82754 249115 155797 96846 226745 68240
12523 91170 202465 -44718 -281214 131545 99152 6289 -68947 67990 -174484 -130715 -239495
12512 -239495 107117 -80863 -73010 -146708 -59414 160538 -78225 -85244 -286469 -148346 95655
12500 115235 172153 -187522 -145728 -104702 -46916 156574 -163696 -10349 552476 180284
12489 49876 150936 -18962 -85105 187957 -202187 -138917 -45584 204040 117867 4553 259716
12478 259716 -17800 -120441 -101180 -375173 -72489 159309 -454202 -221093 183369 1393
12467 -166357 -132460 3731 -36137 -86804 -398387 229839 42417 -191586 -42852 110464 -128653
$$ packed form
12546a72991F4627e2005j05810l4622q8516E3767B1826b87100G1044R065b40795
12534C33689b62299I5923J26414a40367H2754J66361r3318n8951J29899F8240
12523I1170J11295d4718k36496A31545l2393F289f8947F7990a74484M3769j08780
12512b39495A07117h0863P853p3698e9414A60538g8225p019k01225J38123I5655
12500A15235N6918a87522M1794M1026d6916A56574a63696a0349E52476A80284
12489D9876J01060a8962o6143A87957b02187O3270d5584B04040q6173D553K55163
12478B59716a7800j02641J9261k73993g2489A59309d54202b21093A83369A393
12467a66357L3897C731c6137n0667l11583B29839D2417a91586d2852A10464a28653
$$ plain form
12455 97565 99991 -425409 91081 -387589 54804 40695 362945 -63560 -15049 48643 160246
12444 160246 328586 149327 -202365 -430009 -151246 7202 -291790 25097 285002 -259789
12433 -81942 72257 -106036 -82438 308811 63807 -77017 -62616 41458 120524 203554 -195520
12421 -71622 224965 -204383 35824 146340 -161573 177260 76462 -187771 299469 -24421
12410 187355 -91079 -109401 14999 85976 -368672 32185 319057 62966 -243881 -4303 -113305
12399 -113305 -351098 209970 -226175 -138790 165789 92339 -98007 74748 330229 118169
12388 -44417 -140414 26794 -17006 113382 264958 -273779 333489 86560 28821 -48614 -73752
12377 -73752 136912 -69133 -88145 50056 124251 -26350 -441889 155086 -166588 318521 151623
$$ packed form
12455I7565K426d25409I1081c87589E4804j4109L22250f3560a5049D8643J11603
12444A60246J68340A49327b02365k27644a51246G202b91790B5097K59905b59789
12433h1942G2257a06036K3598C08811F3807g7017J4401D1458P9066Q3030a95520
12421g1622B24965b04383C5824J10516a61573A77260G6462a87771B99469b4421
12410A87355i1079j8322A4999P0977c68672C2185K86872F2966b43881d303j09002
12399a13305k37793B09970b26175Q7385A65789p3450i8007G4748K55481A18169
12388d4417r5997B6794a7006A13382J51576b73779C33489H6560B8821d8614k5138
12377g3752A36912f9133j9012E0056P4195b6350m15539A55086a66588C18521A51623
$$ plain form
12365 401383 110999 279182 345141 256151 -114966 -168091 -36880 149151 -210466 100183
12354 238230 254443 54044 -15366 -93789 -191 -49254 238203 -110270 -68436 51487 -38724
12342 4993 71043 -22359 -287051 183059 -49083 150413 -81817 -50524 28303 45570 -43822
12330 77248 261124 64226 -36202 545167 -63553 62165 130653 73853 -96016 228437 258609
12319 258609 153466 341839 130053 164252 -165959 -4149 -101524 237207 92471 -84968 207237
12307 316235 -6749 259281 140828 159237 41468 272508 -54269 271678 279931 222448 148202
12296 148202 -269788 97318 181445 -158089 138957 109816 15529 49438 -42789 66511 218636
12285 218636 -52741 310694 55522 -127583 49342 70496 92759 -140451 154745 -164775
$$ packed form
12365D01383A10999J68183O5959q8990a14966n3125c6880A49151b10466A00183
12354B38230J6213E4044a5366p8423a91m9063B38203a10270M1834E1487c8724
12342D993O6050b2359k64692A83059d9083A50413h1817L1293B8303J7267d3822
12330G7248J83876F4226c6202E45167f3553F2165O8488n6800i6016B28437L0172
12319B58609j05143J88373A30053L4199a65959d149r7375B37207I2471h4968B07237
12307C16235f749B59281j18453J8409D1468K31040e4269B71678Q253n7483p4246
12296A48202b69788I7318Q4127a58089A38957k9141A5529L3909d2789F6511J52125
12285B18636e2741C10694E5522a27583D9342K1154K2263a40451A54745a64775
$$ plain form
12274 328700 -39827 27511 141593 -100458 3288 203686 168830 351351 221755 252779 181695
12263 181695 390486 32455 -53484 310173 144063 113934 97323 121326 113081 102173 -50213
12251 -77069 300082 69857 -29154 366134 179845 191935 226470 262 27438 179082 265034
12240 265034 208956 318242 -95224 303971 -299063 171959 131184 88661 311363 322805
12230 322805 59951 332308 54587 12148 158165 203673 -248659 64318 224691 -201014
12219 32803 245878 77729 230184 102617 -4852 -30408 -15296 362254 165376 230777 197730
12208 197730 166087 287085 152680 124119 211372 151030 164 275950 352946 2319 99846
12197 99846 -128257 215014 -203021 195102 50486 236012 231244 147967 49934 279893 73909
$$ packed form
12274C28700c9827B7511J14082a00458C288K00398l4856J82521j29596L1024p1084
12263A81695K08791C2455e3484C10173A44063l0129j6611K4003q245j0908e0213
12251g7069C00082F9857b9154C66134A79845J2090L4535B62K7176J51644Q5952
12240B65034n6078J09286i5224C03971b99063A71959m0775m2523K22702J1442
12230C22805E9951K72357E4587A2148J46017M5508b48659F4318J60373b01014
12219C2803K13075G7729J52455A02617d852k5556J5112C62254A65376O5401l3047
12208A97730l1643J20998j34405k8561Q7253o0342A64K75786P6996B319R7527
12197I9846a28257B15014b03021A95102E0486J85526m768q3277D9934K29959G3909
$$ plain form
12185 208453 28303 147186 2655 59540 168134 131586 104564 -7860 5470 -43345 191226
12173 56189 31637 120535 90324 94189 166618 -14275 -79934 -35516 25033 378316 188462
12161 -24949 48980 -64854 -103924 172612 287029 170384 41366 235142 312521 414227 185110
12149 369797 145962 444908 134178 293657 306593 175825 307604 -23502 178711 -153848
12138 163064 -15179 165303 174455 224158 201524 62328 178178 368593 143524 -60676 190114
12126 130204 -46669 5116 326925 229031 224066 -85938 -72993 305665 31900 252 163638 -396133
12113 192493 -79503 -172515 270505 234560 174724 284792 37469 51896 181584 254390 195961
12102 195961 240426 268193 -3920 47591 22637 185226 307967 -78311 203070 -28631 48957
$$ packed form
12185B08453B8303J18883B655N6885J08594l6548k7022g860E470d3345A91226
12173E6189k4552Q8898l0211L865P2429a4275o5659c5516B5033L53283A88462
12161b4949D8980f4854l9070A72612J14417j16645D1366J93776P7379J01706A85110
12149C69797A45962K98946A34178J59479J2936j30768J31779b3502A78711a53848
12138A63064a5179A65303R152M9703k2634F2328J15850J90415A43524f0676A90114
12126A30204d6669E116L21809r7894m965h5938J2945C05665C1900B52J63386c96133
12113A92493g9503r3012B70505l5945n9836J10068C7469J4427J29688P2806n8429
12102A95961M4465K7767c920D7591B2637J62589J22741g8311B03070b8631D8957
$$ plain form
12090 -93983 100848 277792 -261347 -164500 -244850 189814 13678 -113193 460411 27586
12079 207980 227100 312718 -174210 -23810 126310 122048 -210996 101008 -255935 -40263 166780
12067 236926 243622 93164 20351 151336 -95418 201968 11465 392785 -53993 -163349 200483
12055 -132190 329323 -31301 246738 201903 260185 9683 -100005 260584 12780 244276 56621
12043 196400 16517 126271 -123252 12630 -55715 78061 171513 27027 68682 310206 49754
12031 28872 -20318 17559 -230614 190400 -416797 -282798 -65733 66815 -58000 -195997 -257715
12020 -257715 109506 104756 -32007 197747 145037 -28305 -74557 14695 180031 255185 -15655
12008 -155464 224226 649545 232493 -84070 -163086 253081 -85011 -193624 -234266 -22625
$$ packed form
12090i3983A00848J76944b61347R6847q0350A89814A3678a13193D60411B7586
12079B07980J9120Q5618a74210b3810A26310m262b10996A01008b55935d0263A66780
12067B36926O696I3164B0351J30985i5418B01968A1465L81320e3993j09356B00483
12055a32190C29323c1301B46738m4835N8282I683a00005B60584A2780K31496E6621
12043A96400A6517J09754a23252A2630e5715G8061R3452B7027M1655K41524D9754
12031B8872b0318A7559b30614A90400d16797J33999f5733F6815e8000j37997o1718
12020b57715A09506m750c2007A97747n2710b8305m6252A4695J65336P5154a5655
12008a55464B24226M25319B32493h4070p9016B53081h5011j08613m0642b2625
$$ plain form
11997 225005 231880 -54450 58508 -182618 98959 620482 42446 49063 -87868 -62243 12070
11985 -195749 57983 -89399 -263729 -29940 -255901 214252 192589 -12107 318837 -55357 41796
11973 -59882 -96790 -332419 -95920 170563 -136238 -256007 -41703 68649 204824 254386 47750
11961 -99281 58193 -179707 8469 39740 -11445 4099 -134721 -105257 24509 -92455 58014 89408
11949 89408 157537 -34504 305246 136736 19910 -10463 -110701 119420 89541 9001 72679
11938 72679 147362 204847 179001 -248970 -95686 28454 -229898 29917 260411 68005 172346
11927 172346 -143383 -127951 -96864 -159494 122890 -78252 475324 -245013 -3669 -84479 66055
11915 -36944 87661 46624 -92836 -75391 -20630 -45328 38015 -10240 -235446 -408477 149531
$$ packed form
11997B25005O875e4450E8508a82618I8959N21523D2446O617h7868K5625A2070
11985a95749E7983h9399j74330b9940k25961B14252k1663a2107C18837e5357D1796
11973e9882l6908k35629i5920A70563a36238j19769d1703F8649J36175M9562D7750
11961i9281E8193a79707H469L1271a1445D099a34721K9464B4509i2455E8014L1394
11949H9408O8129c4504C05246A36736A9910a0463j00238A19420k9879I001O3678
11938G2679P4683N7485k5846b48970i5686B8454b29898B9917K30494F8005J04341
11927A72346a43383J5432L1087o2630A22890g8252D75324b45013c669q0810F6055
11915c6944H7661m1037i2836J7445b0630k4698C8015a0240k25206j73031A49531
$$ plain form
11903 63052 116296 428812 196682 219101 40507 -194589 204588 164282 19374 -54869 -155048
11892 -155048 92639 -194736 -92630 -9651 74346 -260505 -362338 -78055 -160409 -169824 -235912
11881 -235912 189313 -165758 -214457 -118906 -115443 39469 -48889 -21208 -64577 96866 -134179
11869 73105 -116365 -96426 -490723 -144813 -22472 112147 351418 -460798 -73519 -69129 84040
11857 -289714 46917 -163298 -169772 1803 -3489 -54608 147015 238821 -33999 91417 -401702
11845 -110721 -4201 187533 -199771 -57169 56066 51412 -425483 -185996 76611 66563 -26571
11833 -22358 251165 194237 -40820 1154 34766 178035 -293892 345083 -107214 39390 -77126
11821 -204733 -251915 -231400 -348528 -186799 -441414 32428 145025 81227 -191162 -86436
$$ packed form
11903F3052N3244L12516A96682K2419D0507a94589B04588m0306A9374e4869j00179
11892a55048I2639a94736i2630i651G4346b60505j01833g8055q2354r415o6088
11881b35912A89313a65758m8699R5551L463C9469d8889b1208m3369I6866a34179
11869G3105a16365J9939l94297a44813b2472A12147K39271d60798g3519M390H4040
11857b89714D6917a63298o474A803c489n1119A47015R1806c3999I1417d01702
11845a10721d201A87533a99771e7169E6066m654d25483a85996G6611j0048b6571
11833b2358B51165n6928d0820A154L3612J43269b93892C45083a07214C9390g7126
11821b04733m7182K0515j17128J61729k54615C2428J12597o3798a91162h6436
$$ plain form
11810 -291746 -218847 -309622 -128834 -60719 -64430 -67570 -61850 12193 -41878 -205635 220310
11798 -199217 -4310 2397 -32295 -149905 126027 -27844 -313471 -101272 -15980 226212 -157253
11786 132855 -185473 19327 -40020 -413845 -109742 95859 104435 -134130 -279710 -268461 -139062
11775 -139062 -202577 -109037 105044 75378 -191257 -57234 -191417 32621 -94386 165266 5527
11763 -128126 -44777 -6686 148149 165852 -28505 -208727 -131371 89268 87921 -34006 -82380
11752 -82380 -121903 -88368 355378 107145 -229175 -47011 -64933 -294968 -208684 -135280 -144153
11741 -144153 -60643 42574 -196771 34259 162880 -85133 70664 343539 -43162 234303 87698
11729 -389860 -56215 81707 -169242 69066 17894 -62433 62693 108768 -67177 -19221 228026
$$ packed form
11810b91746P2899r0775a28834f0719l711l140N720A2193d1878j63757B20310
11798a99217d310B397c2295j17610A26027b7844k85627a01272a5980B26212a57253
11786A32855a85473A9327d0020l73825a09742I5859Q576a34130j45580J1249J29399
11775a39062o3515R3540A05044k9666a91257e7234j34183C2621i4386A65266E527
11763a28126d4777f686A48149J7703b8505j80222P7356H9268j347c4006m8374
11752h2380l9523L3535C55378A07145b29175d7011j7922k30035Q6284P3404q873
11741a44153f0643D2574a96771C4259J28621h5133G0664K72875d3162B34303H7698
11729c89860e6215H1707a69242F9066A7894f2433F2693M6075f7177a9221B28026
$$ plain form
11717 25050 173092 -99598 -48170 -71581 -256991 68880 -19317 48867 180534 -167344 -150701
11706 -150701 -489117 21839 65986 -143760 -77091 5414 46730 211505 -67197 -15980 -130852
11695 -130852 -132291 180187 157714 -312046 35305 170417 -59118 72716 14610 210788 -23303
11683 264893 624910 70237 61173 19112 645092 89563 -69069 -220279 143321 52009 57926
11672 57926 28656 89893 -232103 -319990 52041 144549 217465 -107435 788989 -55086 239214
11660 -40859 -48777 56944 18487 239269 -170252 -87650 -104479 -23979 -125787 -294160 -166469
11649 -166469 92418 219933 -44078 196229 354966 107604 -203610 -43144 -178030 27147
11638 202606 -255907 -53482 139666 269198 -36139 -79931 -177480 -294762 29013 -163827
$$ packed form
11717B5050J48042i9598d8170k3411j85410F8880a9317D8867J31667a67344J6643
11706a50701l38416B1839M4147a43760O6669E414M1316J64775f7197a5980j14872
11695a30852j439A80187k2473c12046C5305J35112e9118G2716A4610J96178b3303
11683B64893L60017G0237r064A9112O25980H9563f9069j51210A43321E2009N917
11672E7926B8656O1237b32103q7887E2041R2508P2916a07435G88989e5086B39214
11660d0859p918E6944A8487K20782a70252Q2602j6829b3979j01808j68373J27691
11649a66469I2418J27515d4078A96229J58737A07604b03610d3144j34886B7147
11638B02606b55907e3482A39666J29532c6139m3792r7549j17282B9013a63827
$$ plain form
11627 -23069 245098 -238389 -50890 -354959 1470 -83580 184642 -194862 -63991 -39013 222674
11615 21835 -359919 36846 46251 -258782 73356 -349145 -116803 260419 1539 -289467 330220
11603 225724 -72902 121551 101355 -588519 40815 -114196 -160476 71614 195114 73915 -56285
11591 130399 153817 212605 -159702 151462 55135 -18031 -47807 118276 129924 323730 107358
11579 205269 161816 -138472 218379 -149603 42022 329487 -3121 43828 -131306 -18930 -20144
11568 -20144 -103376 61171 48140 47135 -8003 -1490 66958 -164928 -114833 -31899 89091 -210358
11555 123032 19318 89251 88034 6633 -124521 -120140 149080 220906 -68586 -336764 483553
11543 -212050 -117546 211709 27848 203040 -123340 332801 148556 -294602 170570 103721
$$ packed form
11627b3069B45098b38389e0890l04069A470h3580A84642a94862f3991K4978B22674
11615B1835c59919C6846R405b58782G3356c49145a16803B60419A539b89467C30220
11603B25724g2902A21551k0196e88519D0815a14196m6280G1614J23500G3915e6285
11591A30399K3418N8788a59702A51462E5135a8031k9776A18276J1648J93806A07358
11579B05269m3453a38472B18379a49603D2022K87465c121D3828a31306a8930j214
11568b0144q3232F1171j3031j005h003a490F6958a64928N0095c1899H9091b10358
11555A23032A9318O9933j217F633a24521M381A49080P1826f8586k68178D83553
11543b12050R4504B11709B7848J75192a23340C32801A48556b94602A70570o6849
$$ plain form
11533 103721 74950 327924 -12412 161854 91129 90151 -153482 -52072 81704 -58955 13249
11521 54869 274644 204810 369443 174325 230065 -52040 140009 48443 87121 179918 93816
11510 93816 360998 128357 -102943 -99391 -104579 -227523 196758 73568 202571 -266249 84920
11498 54091 131147 253024 145489 -14893 85162 -81037 11779 -256391 -462 -46674 158585
11486 25332 34460 95179 137524 -92819 227664 328063 -93955 229201 322193 72195 73746
11475 73746 165370 -209057 82244 257077 140882 377576 -2967 204365 253977 -57150 -4515
11463 271484 497308 79994 -257508 480162 -55536 236476 292672 631704 -56561 60017
11452 246721 133998 -47416 -328031 470503 513277 36446 14050 168202 87309 47940 172082
$$ packed form
11533A03721k8771K52974a2412A61854p0725r78a53482e2072H1704e8955A3249
11521E4869K19775o9834J64633A74325N5740e2040A40009D8443L8678R2797q6102
11510I3816K67182A28357a02943L552n188j22944A96758G3568J29003b66249H4920
11498E4091P7056J21877j07535a4893H5162h1037A1779b56391d62m6212A58585
11486B5332R128O0719M2345i2819B27664J00399i3955B29201R2992G2195J551
11475G3746R1624b09057H2244J74833j16195K36694b967B04365M9612e7150d515
11463B71484K25824G9994b57508D80162e5536B36476N6196L39032e6561F0017
11452B46721j12723d7416k80615D70503M2774C6446A4050J54152q0893l9369J24142
$$ plain form
11441 172082 290473 309792 16290 -12064 -273175 32017 36914 279907 138017 83154 57911
11430 57911 332774 105120 -34741 8649 -145077 -48220 -8869 -56966 -48992 124661 138790
11419 138790 -120248 83722 272244 92268 40024 -173441 -92671 297547 9215 148210 -41083
11407 42340 168801 -2463 10699 -2129 -21544 -126829 -74481 63740 -124255 -16176 -186079
11396 -186079 69352 460 -315834 -32072 40808 276083 314965 474585 -438136 24326 -235184
11384 -85443 -46181 -86913 -57934 -85296 118376 -219934 138483 -80285 79055 280549 -399326
11372 -31351 -77546 134592 -88930 204759 -316095 -208984 -250485 -202991 -158719 54079 -37852
11360 -62641 -8011 -213941 -377819 -266006 221936 -43438 -269476 -297569 -372315 -12819 -11449
$$ packed form
11441A72082J18391J9319A6290a2064k61111C2017M897K42993A38017n4863k5243
11430E7911K74863A05120c4741H649a45077d8220h869m8097P974A24661J4129
11419A38790a20248H3722J88522I2268D0024a73441Q0770B97547I215J38995d1083
11407D2340J26461b463A0699b129j9415j05285N2348F3740a24255a6176j69903
11396a86079F9352D60c15834c2072D0808K35275L8882J59620d38136B4326b35184
11384h5443L9262m0732K8979k7362A18376b19934A38483h0285G9055K01494c99326
11372c1351m6195A34592h8930B04759c16095J07111m1501M7494M4272E4079c7852
11360f2641h011k05930j63878J11813B21936d3438k26038k8093p4746a2819J370
$$ plain form
11349 -11449 -76544 7079 -59706 -9265 21441 59327 -77104 140044 39551 23851 -157105 113095
11336 66043 -229627 -124639 146687 -180729 -139999 175159 71233 50035 151751 -205388
11325 220048 48713 -15382 -33988 114836 63378 -147855 211030 -78618 99584 -4089 -95693
11314 -95693 -111088 -476620 -70616 -208373 -170292 18857 -205314 269407 -36775 814 -136665
11302 152679 113882 -130298 39588 -11126 32556 -164348 -51252 123822 -62222 -175257 -197591
11291 -197591 21568 -190135 -35204 -1562 -67084 -43095 -86583 -131257 54772 -12908 -124514
11280 -124514 -30363 -162511 -102287 45136 317689 -63548 313182 -134320 108022 -38698
11269 -93396 -149697 -259310 214974 -385957 23240 159824 -181218 292213 235056 -53835
$$ packed form
11349a1449o5095G079e9706i265B1441L7886g7104A40044C9551j5700a57105A13095
11336F6043b29627J04988A46687a80729M0730A75159G1233k1198J01716b05388
11325B20048D8713a5382j8606A14836n1458a47855B11030g8618I9584d089r1604
11314i5693j5395l65532g0616j37757L8081A8857b05314B69407c6775H14a36665
11302A52679l8797a30298C9588a1126C2556a64348e1252A23822f2222j13035k2334
11291a97591B1568a90135c5204a562o5522K3989m3488m4674E4772a2908j11606
11280a24514c0363j32148O0224D5136K72553f3548C13182a34320A08022c8698
11269i3396n6301j09613B14974c85957B3240J36584a81218B92213n7157e3835
$$ plain form
11258 -183542 -78106 159429 -111916 381705 -124636 -137348 14479 -36480 40773 166170
11248 166170 23172 -279376 227309 -12818 30709 -74354 -156752 60415 -236925 306180 21127
11236 -44268 -194513 -30098 42933 -79685 -28766 -152825 34154 -324293 40886 -339241 -12348
11224 -107833 90584 -105814 58642 -118462 257387 -143439 -24965 -179685 246416 -94955
11213 60638 -324679 35861 -48310 -413701 81744 255519 -110392 52758 43909 109139 -3668
11201 -210089 66008 -79481 -90768 20688 -458446 -84240 -182078 -481712 -344037 -448657 220153
11189 -187332 -373880 -42733 -97791 -156943 25947 -266239 128188 -109605 -351517 -226735
11179 -226735 95820 -193370 8380 69816 171335 -184197 -101752 149754 126385 -315044 -89291
$$ packed form
11258a83542g8106A59429a11916C81705a24636j2712A4479c6480D0773J25397
11248A66170B3172b79376B27309a2818C0709g4354q2398F0415b36925C06180B1127
11236d4268j50245c0098D2933g9685b8766j24059C4154c24293D0886c39241a2348
11224a07833I0584a05814E8642a18462B57387a43439b4965j54720B46416i4955
11213F0638c24679C5861d8310l65391H1744J73775a10392E2758q849O5230c668
11201b10089F6008g9481j1287B0688d58446h4240r7838k99634J37675j04620B20153
11189a87332j86548d2733n5058n9152B5947b66239A28188a09605k41912J24782
11179b26735I5820a93370H380O1436J01519a84197Q2445A49754k3369c15044h9291
$$ plain form
11167 85013 -16943 35976 1284 7883 60068 63969 -376349 -59639 -119159 142103 40930 30473
11155 30473 -149861 -132549 -404598 3274 -212419 444054 152574 208566 -364756 131900
11144 -89084 -131298 33349 154925 -291786 157306 -56212 -66479 -8299 201913 80057 45977
11133 45977 28010 -36540 -15623 315066 -97054 -151570 -87785 -145191 60120 288818 75211
11121 6997 -37935 229009 -206111 -182515 -14078 15625 210379 227488 98545 -150859 116841
11109 20192 174230 -81867 -145647 94343 74478 -165365 60141 222646 -137342 -37360 -159664
11098 -159664 71325 -150396 -53644 467603 -124907 78540 283985 240996 105963 109657 41668
11086 403725 -185786 125978 311907 299366 -26473 278732 453941 -35155 61272 86777
$$ packed form
11167H5013a6943C5976A284O599N2185L901c76349e9639n9520A42103D0930j0457
11155C0473a49861J7312k72049C274b12419D44054A52574N5992c64756A31900
11144h9084m2214C3349J21576b91786A57306e6212j0267h299B01913H0057l4080
11133D5977j7967c6540a5623C15066i7054n4516O3785n7406F0120K28698G5211
11121F997c7935B29009b06111K3596a4078A5625J94754J7109I8545a50859A16841
11109B0192J54038h1867o3780I4343j9865a65365F0141J62505a37342c7360j22304
11098a59664G1325a50396e3644D67603a24907G8540K05445m2989A05963L694D1668
11086D03725a85786A25978J85929j2541b6473B78732J75209c5155F1272K5505
$$ plain form
11076 86777 23308 -87031 -133269 139234 137675 140478 87607 62421 57190 263763 79806 160662
11064 160662 96946 266263 91903 40024 389100 -135035 -76962 193554 449677 241880
11054 241880 325606 411143 495606 470477 -50250 224474 208070 21593 260752 364787 452647
11043 452647 291294 727561 415021 457160 264934 167503 874877 415025 441155 528051
11033 528051 868506 633448 423337 781586 1074820 637536 468530 783520 612234 572596
11023 572596 867827 542702 1153294 725492 749025 846110 891732 884029 618999 741941
11013 741941 552673 742403 666679 794566 881295 897468 313477 728198 741918 370647
11002 343663 394600 350249 676332 860070 369170 641486 464309 742325 748278 583106
$$ packed form
11076H6777B3308h7031m6238A39234j559K803n2871k5186n231K06573G9806Q0856
11064A60662o3716J69317I1903D0024L49076a35035N8073A93554K56123k07797
11054B41880Q3726Q5537Q4463k5129e0250B24474j6404B1593K39159J04035Q7860
11043D52647j61353M36267l12540M2139j92226r7431P07374D15025K6130Q6896
11033E28051L40455k35058k10111L58249K93234m37284j69006L14990j71286l9638
11023E72596K95231l25125O10592m27802K3533R7085M5622p703k65030J22942
11013G41941j89268J89730p5724J27887Q6729J6173C13477M14721J3720C70647
11002C43663N0937m4351L26083J83738C69170K72316j77177K78016N953j65172
$$ plain form
10992 583106 574771 443702 687422 710620 607141 763894 289827 445983 721763 271305
10981 757686 826789 314093 713123 890634 554302 695860 956922 685320 520624 852921
10971 852921 841535 628389 984607 875467 1016927 737511 739351 878711 1078396 893306
10961 893306 1095200 1394892 1415656 1256285 1656515 1975959 2124222 2158483 2447759 2576997
10951 2576997 2141953 2305543 2408700 2266903 1961534 2083874 1866050 1528535 1733405
10942 1733405 1465067 1493307 1476314 1689761 1775393 1664351 1690647 1262418 1346533 891525
10932 891525 1016625 963711 865468 783055 646429 352992 252330 323907 191956 279938
10922 279938 246998 332083 147573 107457 197365 454570 215723 283794 129974 160160 183374
$$ packed form
10992E83106q335j31069K43720K3198j03479J56753B89827J56156K75780B71305
10981G57686O9103C14093L99030J77511l36332J41558K61062k71602j64696L32297
10971H52921j1386k13146L56218j09140J41460k79416J840J39360J99685j85090
10961H93306K01894K99692K0764j59371M00230L19444J48263L4261K89276J29238
10951B576997m35044J63590J03157j41797l05369J22340k17824l37515K04870
10942A733405k68338K8240j6993K13447Q5632j11042K6296m28229Q4115m55008
10932H91525J25100n2914r8243q2413j36626k93437j00662P1577j31951Q7982
10922B79938l2940Q5085A47573m0116Q9908K57205B15723O8071A29974L0186K3214
$$ plain form
10911 183374 48756 242538 32405 -111612 347371 99657 -356109 31240 295559 -350780
10900 1393 -441498 -161459 -87798 178350 -55350 -400869 -29132 27298 185011 121084 -176643
10888 28857 47936 10051 -245694 -64203 -133313 -36952 46334 -205258 67470 116009 -52905
10876 -117468 -104626 -125709 -291607 -41040 132423 -230557 341630 -282673 -129063 9033
10865 -295938 215335 -103427 60937 -106748 -203024 -158622 48332 -100427 198020 173977
10855 173977 -22342 -24664 -80981 -178866 -194550 -274260 28526 -187610 255145 -102957 -190027
10844 -190027 -195822 -169771 436705 5708 -259428 -205124 -61603 113501 -113404 58132 -158262
10832 16989 243390 313518 -51854 127693 -30577 -270458 172859 -15392 71941 -388938 285316
$$ packed form
10911A83374D8756J93782C2405a11612C47371I9657c56109C1240K64319c50780
10900A393d41498a61459P3661A78350e5350l45519b9132B7298J57713o3927a76643
10888B8857J9079A0051b45694f4203o9110c6952D6334b05258F7470M8539e2905
10876a17468J2842k1083j65898d1040A32423b30557C41630b82673a29063I033
10865b95938B15335a03427F0937a06748r6276M4402D8332a00427A98020k4043
10855A73977b2342k322n6317r7885j5684p9710B8526a87610B55145a02957q7070
10844a90027n795K6051D36705E708b59428N4304f1603A13501a13404E8132a58262
10832A6989K26401P0128e1854A27693c0577k39881A72859a5392G1941c88938B85316
$$ plain form
10820 221418 59371 12558 -193369 78352 -172145 -15353 -73551 -155836 16024 311307 -243571
10808 -71882 141256 -522547 310014 -43212 357342 -143982 -66894 -161621 386519 -379635
10797 -250283 -206097 22189 -182006 43516 135645 14375 41527 -22049 -101949 88126 -10321
10785 75557 80049 -24364 105024 -113643 41584 157931 -313 5411 -199479 -59334 -21335 -215811
10773 -215811 95452 -228453 -34070 38901 169182 -95789 -179675 -114396 179586 -235558 259382
10761 22607 144650 -76787 -390241 51809 170701 100711 12946 111073 -55841 -109143 180957
10749 183237 359940 111917 59661 -389521 -209438 -527625 -147927 213079 -400135 62101
10738 -229119 -172593 221706 -254394 213417 9338 269164 -261918 -401655 -110396 15083
$$ packed form
10820B21418E9371A2558a93369G8352a72145a5353n8198q2285A6024K95283b43571
10808g1882A41256e22547C10014d3212C57342a43982f6894r4727C86519c79635
10797b50283M4186B2189a82006D3516R2129A4375K7152b2049p9900H8126a0321
10785G5557M492b4364A05024a13643D1584J16347c13E411a99479e9334b1335j94476
10773b15811I5452b28453c4070C8901J30281i5789q3886O5279A79586b35558B59382
10761B2607J22043g6787l13454E1809J18892o9990A2946R8127e5841n3302A80957
10749A83237J76703A11917n2256c89521J80083l18187a47927B13079d00135F2101
10738b29119N6526B21706b54394B13417I338K59826b61918j39737a10396A5083
$$ plain form
10727 -353668 208768 87838 -17654 -312330 147058 260350 -346365 -363080 77472 -155551
10716 133107 -13613 20962 -116032 -174308 19373 69326 93283 297821 -173936 98545 102282
10705 102282 218799 -65621 -293392 -169796 14078 121386 54054 -54123 -154138 -112799
10695 -112799 -77835 384 -72346 -423329 -134478 -3277 -85393 -198000 419384 -139586 -248868
10684 -248868 -498294 122045 -89168 13033 -174322 83363 -67094 -87596 -234377 -241283 -139853
10673 -139853 105444 -108106 -218394 -116358 -241097 -18638 -169589 -151884 95235 -59534
10662 82663 -215553 -286681 -197464 -538842 14311 -181945 109633 -344573 -158738 82383
10651 -94436 142340 -82760 -79390 140520 130216 73345 -23350 -96441 -43307 19558 180052
$$ packed form
10727c53668B08768H7838a7654k94676A47058J13292c46365j6715G7472a55551
10716A33107a3613B0962a16032n8276A9373M9953K3957K04538a73936I8545L737
10705A02282J16517f5621k27771J23596A4078J07308E4054e4123j00015M1339
10695a12799L4964C84g2346l50983a34478c277q2116j12607D19384a39586j09282
10684b48868k49426A22045h9168A3033a74322H3363f7094k0502j46781o906J01430
10673a39853A05444a08106j10288J02036j24739a8638j50951J7705I5235e9534
10662H2663b15553p1128Q9217l41378A4311a81945A09633c44573a58738H2383
10651i4436A42340h2760L370A40520j0304n6871b3350p3091d3307A9558J60494
$$ plain form
10640 180052 157539 77612 157329 22723 -235257 72392 -212995 -149519 -52464 223301 15210
10628 46898 101684 -355608 -77273 -456208 1941 -211774 21319 -241479 -105749 21235 -201771
10616 -105534 -174835 347041 -67157 -318131 -338044 -298997 -12732 -270942 87107 174949 41088
10604 -40218 79831 -104334 77696 74865 18125 -14087 -32045 27878 -180361 -74980 290444
10592 -37543 109245 -53410 -137686 -316604 125884 -97841 200600 53723 303960 -623629
10581 -227305 161627 31789 35752 -352848 -231862 -82017 92742 -167931 18157 6226 186804
10570 186804 -54030 274345 150076 33232 41316 -33011 -73160 -39270 -188307 -14701 -221788
10559 -221788 -64970 -313822 172614 -11756 -132739 162256 136547 -188261 -232977 -68896
$$ packed form
10640A80052k2513G7612P9717B2723b35257G2392b12995O3476e2464B23301A5210
10628D6898N4786c55608g7273l78935A941b11774B1319b41479a05749B1235b01771
10616a05534o9301C47041f7157k50974j9913L9047a2732k58210H7107Q7842D1088
10604d0218G9831a04334G7696k831A8125a4087j7958B7878a80361g4980B90444
10592c7543A09245e3410q4276j78918A25884i7841B00600E3723K50237f23629
10581b27305A61627C1789L963c52848J20986h2017I2742a67931A8157F226J80578
10570A86804e4030B74345j24269C3232Q084c3011m0149L3890j49037a4701k07087
10559b21788f4970k48852A72614a1756j20983A62256k5709a88261m4716f8896
$$ plain form
10548 -25095 95700 -265605 301760 171730 118713 -204710 -2708 335459 23214 138349 -374727
10536 -53136 -138701 -200473 -75687 -205336 -187612 -87117 -284223 151353 -35184 107968 14714
10524 11771 -71361 -156514 -15804 -277162 -170448 94327 62425 -174988 -363973 60100 -159902
10512 43414 -131430 -94505 -357798 261716 77249 10594 -334142 19527 -6789 150729 70905
10500 94020 81829 -279676 48259 -60030 -303530 -14366 -44882 -183500 -6648 -143965 -65134
10488 169181 -11539 171880 293611 -97666 -166201 63241 -182352 -117822 -138856 24701 73912
10477 73912 36780 -160425 -198747 113603 214146 180812 74282 -114943 2595 -38940 -434546
10466 -434546 -108952 125400 -38312 448381 317816 -140719 100307 280239 -4487 222644
$$ packed form
10548b5095I5700b65605C01760j30030n3017b04710b708C35459B3214J15135c74727
10536e3136q5565o1772g5687j29649J7724h7117j97106A51353c5184A07968A4714
10524A1771g1361q5153a5804k61358J06714I4327l1902a74988j88985F0100a59902
10512D3414a31430L6925k63293B61716G7249A0594c34142A9527f789A50729G0905
10500I4020j2191b79676D8259f0030k43500a4366l0516j38618f648j37317f5134
10488A69181a1539A71880J21731i7666o8535F3241a82352O4530k1034B4701M9211
10477G3912C6780a60425l8322A13603J00543l3334G4282a14943B595c8940l95606
10466d34546a08952A25400c8312D48381j30565a40719A00307J79932d487B22644
$$ plain form
10455 150550 -87808 98988 -56625 -32598 150062 -149225 94939 107781 -144239 -10522 103911
10443 -72050 -127014 -32741 -245294 -19584 390704 32898 44774 191382 -87461 -482536 -152165
10431 33184 -173897 79637 -14101 -26890 -232934 -82417 -229516 -341623 -66220 -185047 34309
10419 29506 13225 289712 -69482 115884 53768 -261651 46402 93009 -54426 72379 -404644
10407 -93292 -242543 68237 -1620 -58616 38867 253035 170619 -73964 -217859 -209632 -128253
10396 -128253 -108000 -46795 62683 -141683 87107 60027 193240 -92781 14293 39663 -85614
10384 218850 -136868 -210333 -276759 -343907 114936 48583 64416 -84598 184517 -285907 216779
10372 72703 341036 -369215 -45923 190635 -95398 212529 436626 -219942 -85771 173224
$$ packed form
10455A50550h7808I8988e6625K4027A50062a49225I4939J2842a44239a0522A03911
10443g2050n4964c2741k12553a9584C90704C2898J1876J46608h7461l95075a52165
10431C3184a73897G9637a4101j2789k06044h2417j47099j12107f6220j18827C4309
10419B9506A3225K76487f9482A15884E3768b61651D6402M6607e4426G2379d04644
10407i3292j49251F8237a620n6996C8867K14168q2416g3964j43895Q227Q1379
10396a28253K0253d6795F2683a41683H7107k7080J33213i2781A4293K5370h5614
10384B18850a36868p3465o6426o7148A14936D8583J5833h4598A84517b85907B16779
10372G2703K68333c69215d5923A90635i5398B12529K24097b19942h5771A73224
$$ plain form
10361 -147568 -178765 161647 -202738 205776 400651 363734 326683 371340 361323 312746 67846
10349 355966 622841 137559 391407 236165 208878 495064 510795 368728 143907 -249378
10338 436394 76580 -211004 401117 10484 372456 344857 537603 446412 307128 104294
10327 2750 241839 112345 321698 288299 99966 -19424 337220 402664 245913 -161885 107731
10315 -239207 -74573 -162844 198455 88152 -90189 107245 -333940 -308005 269666 237552 264740
10304 264740 329133 6103 -138664 76448 196708 81598 461834 265255 285744 -96453 -38293
10292 29398 207605 -157593 -61493 -1466 138609 11640 -90806 -60253 173796 231211 -237347
10280 -280465 -203843 -177512 -236591 -92285 201447 82753 -71323 153842 224920 -372748 -40903
$$ packed form
10361a47568l1197A61647b02738B05776J94875l6917l7051M4657j0017m8577F7846
10349C55966K66875A37559K53848j55242k7287K86186J5731j42067A43907b49378
10338D36394G6580b11004D01117A0484L61972k7599J92746r1191j39284A04294
10327B750K39089A12345K09353l3399I9966a9424C37220O5444j56751a61885A07731
10315b39207g4573q8271A98455H8152i0189A07245c33940K5935B69666l2114K7188
10304B64740O4393F103a38664G6448J20260H1598L80236j96579K0489i6453c8293
10292B9398J78207a57593f1493a466A38609A1640i0806L0553A73796N7415b37347
10280b80465P6622K6331n9079i2285B01447H2753g1323A53842P1078c72748d0903
$$ plain form
10268 139342 103627 3319 -46709 -149172 -293817 -87990 -160206 -209048 30451 -229621 -209622
10257 -209622 31239 -30713 -146054 -94148 60490 115053 -125950 194962 46875 3192 -7245
10245 -430483 233520 -208587 -193440 -249000 -45809 231114 345788 44117 389838 197272
10235 197272 264428 199102 314142 282764 -29795 -49284 -242913 -163541 -109503 53223 -112641
10223 391466 -224964 164820 285233 330531 9559 -338360 -91917 -140460 -124837 25508 -7072
10211 -108261 -41858 214498 -97211 -63219 -77647 -21398 -323912 -115952 -194588 -64287 138538
10199 -203180 -81791 -68688 287297 -124542 1253 -20966 -200824 -3360 -146264 -130416 -109754
10188 -109754 111231 -164888 -205885 62536 172581 32586 4368 121451 -227196 -333119
$$ packed form
10268A39342l5715C319d6709j02463j44645h7990p2216m8842C0451b29621J9999
10257b09622C1239c0713j15341N1906F0490N4563a25950A94962D6875C192g245
10245d30483B33520b08587J5147n5560d5809B31114J14674D4117L45721j92566
10235A97272O7156o5326J15040l1378b9795j9489j93629P9372N4038E3223a12641
10223C91466b24964A64820J20413M5298I559c38360i1917m8543J5623B5508g072
10211a08261d1858B14498i7211L3992j4428b1398l02514a15952p8636f4287A38538
10199b03180h1791J3103B87297a24542A253b0966j79858c360j42904J5848K0662
10188a09754A11231a64888m0997F2536J10045C2586D368J17083b27196j05923
$$ plain form
10178 -333119 -103321 65050 -123760 -155946 -174 -23725 -166109 119408 -79985 31452 25558
10167 25558 -138998 -115386 344106 294316 53914 -19214 -284065 1458 17056 94129 -402713
10155 368648 127033 -156397 81062 -199468 68200 -69904 51005 -150046 -82999 -166168 -112920
10144 -112920 -267961 33888 -171887 73182 314487 -71622 -161308 183492 -84093 -38456 -253415
10133 -253415 -294404 229370 -276386 -240112 -54081 -99767 11196 120544 -334888 135511
10122 283235 -77474 -213556 312125 151919 159127 -164667 -327200 234663 -284768 -410614
10112 -410614 47578 -96779 -185078 -306180 -103852 -148206 -34303 50689 290412 195181 -68592
10100 -427215 -175049 -138861 368224 -206311 -114754 -206583 -392484 -242342 -109070 -99177
$$ packed form
10178c33119a03321F5050a23760l2186a74k3551j42384A19408g9985C1452n894
10167B5558a38998K3612C44106m9790E3914a9214k64851A458J5598P7073d02713
10155C68648A27033a56397H1062a99468F8200f9904E1005a50046O7047q3169N3248
10144a12920j55041C3888a71887G3182K41305g1622q9686A83492h4093c8456k14959
10133b53415m0989B29370b76386L6274e4081m5686A1196J09348c34888A35511
10122B83235g7474j36082C12125A51919P208a64667j62533B34663b84768j25846
10112d10614D7578i6779q8299j21102a03852m4354c4303E0689K39723r5231f8592
10100d27215a75049L6188C68224b06311R1557r1829j85901J50142a09070R893
$$ plain form
10090 -99177 -234929 -35117 -161449 88016 -85773 -371308 1020 -286673 -209954 -247311 221333
10078 137498 353098 -149538 -230091 103861 -11970 -76593 -136843 -254317 99958 9440 -288535
10066 19065 -12922 -115226 -108275 21719 -133067 -87067 110527 256632 -5084 -440048 176796
10054 -111601 -366451 -87727 -128335 -230279 271003 -254383 -136181 -266270 -117011 -89937
10044 -89937 88090 -317871 -97838 -15340 -279473 194549 42988 -421665 -75746 317774 80733
10032 -152092 -73659 -13088 78641 -407069 27241 179808 -281303 59698 -37501 11496 -224340
10020 -201512 -300548 275360 -7318 -141135 60399 333366 -291309 -296818 -54140 38216 -362229
10008 174700 162746 132853 180899 -146726 -121565 -222745 -565387 -42305 188275 -577502
$$ packed form
10090i9177j35752c5117j26332H8016h5773k85535A020b86673P6719l7357B21333
10078A37498K15600a49538q0553A03861a1970o4623o0250j17474I9958I440b88535
10066A9065a2922j02304O951B1719a33067M6000A10527J46105e084m34964A76796
10054a11601k54850h7727m0608j01944B71003b54383J18202j30089a17011K7074
10044h9937H8090c17871i7838a5340k64133A94549D2988d21665g5746C17774H0733
10032a52092g3659a3088G8641d07069B7241J52567b81303E9698c7501A1496b24340
10020b01512r9036B75360g318j33817F0399K72967b91309n509e4140C8216c62229
10008A74700j1954k9893M8046a46726K5161j01180l42642d2305A88275e77502
$$ plain form
9997 184109 9981 224565 -299722 -43753 -431664 -108329 191306 -341746 -137123 -642918
9987 -642918 69460 -108821 112094 29944 -69168 29106 -51578 -143987 213935 -122575 -201739
9976 -201739 -58854 -113869 120854 178375 -12813 294603 -103799 190490 115731 38214 -159742
9964 18912 356600 -319971 -132018 -317619 2031 199257 -73831 -103402 47756 -78967 -473931
9953 -473931 -72814 -228076 -123584 262565 -148332 129220 -145420 83790 -74996 -107335
9943 -107335 60934 -186495 -149412 -310744 -343329 -173446 -263491 -340507 72580 -144067 -131257
9932 -131257 77674 47631 280509 -397824 -219061 29987 10014 -23009 -19056 75277 -33233
9920 -130750 -126310 216385 -186026 149230 8364 43233 65317 -21720 -115529 -154583 186201
$$ packed form
9997A84109I981K14584b99722d3753l87911a08329A91306c41746a37123n05795
9987f42918F9460a08821A12094B9944f9168B9106e1578r2409B13935a22575p9164
9976b01739e8854n5015A20854N7521a2813B94603a03799A90490p4759C8214a59742
9964A8912L37688c19971a32018j85601B031J97226g3831k9571D7756g8967l94964
9953d73931g2814j55262J04492B62565a48332A29220a45420H3790g4996l2339
9943a07335F0934a86495L7083j61332l2585J69883r0045p7016G2580a44067J2810
9932a31257G7674l0043K32878c97824J78763B9987A0014b3009L953G5277c3233
9920a30750M440B16385a86026A49230H364L4869K2084b1720r3809l9054A86201
$$ plain form
9908 -165548 101092 -296178 -100537 -98923 -16910 -420616 -189572 -29639 -260160 16390 11973
9897 11973 57998 28042 -500563 5155 -317643 286436 -130580 62711 -177899 -170122 298227
9885 145585 66094 56383 -27938 57696 372792 -3422 -270436 -89864 -138896 -40244 112851
9873 137267 -318763 188696 80339 -218629 -58411 -212837 283289 58844 -142599 -65815
9862 222703 -154460 -277862 -213686 141 158619 -278777 70403 91799 232014 -224374 -105050
9850 -201572 194596 -164974 -378764 89474 -28179 -14126 -507766 -168765 -226453 -155271 -55943
9838 -224769 -131352 103583 -72462 -4132 -276418 -163942 172977 -324791 -128383 -227407 -147562
9827 -147562 35832 112410 -285437 9704 -49087 -190054 -190179 -296742 -85606 -9819 -199606 -165311
$$ packed form
9908a65548A01092b96178a00537J614a6910m03706a89572b9639k30521A6390m417
9897A1973M6025B8042e00563E155c17643B86436a30580F2711a77899P777B98227
9885A45585F6094r711b7938E7696L15096c422k67014h9864m9032d0244A12851
9873A37267c18763A88696H0339b18629e8411j54426B83289E8844a42599f5815
9862B22703a54460j23402O4176A41J58478b78777G0403K1396J40215b24374a05050
9850b01572A94596a64974k13790H9474b8179J4053m93640a68765n7688P1182e5943
9838b24769R3417A03583g2462d132k72286J12476A72977c24791a28383r9024P9845
9827a47562C5832P6578b85437I704d9087j40967j25j06563h5606i819j89787L4295
$$ plain form
9815 -165311 -40605 58046 -17460 145299 -501045 2890 227575 -106217 -214778 -124931 -229580
9804 -229580 -65117 383388 108019 161969 56423 -180063 -137979 -69291 -113345 -187040 -334293
9793 -334293 6718 105945 -53914 42906 10182 -139520 22060 -105670 -42752 -146960 -196143
9782 -196143 14883 241702 149966 -81013 -114124 77054 -194073 208762 51347 -488774 359366
9770 -311156 -271626 -199781 -97171 -255880 -54241 199192 69762 -224807 195170 242596 -350860
9758 -103451 -107606 -202111 -351789 -46560 -251247 182823 14885 -251630 -221562 -54173 -314579
9747 -314579 -171588 -157203 -220590 -75826 -430249 -100686 -221069 -18154 168753 -255161
9736 118509 69164 22305 -344325 86035 96859 -208323 -51173 -311756 -60023 123801 -189631
$$ packed form
9815a65311d0605E8046a7460A45299e01045B890K24685a06217j08561Q9847j04649
9804b29580f5117C83388A08019N3950E6423a80063M2084O8688m4054p3695j47253
9793c34293F718R9227e3914D2906A0182a39520B2060a05670d2752j04208m9183
9782a96143A4883K26819r1736h1013l3111G7054a94073B08762E1347d88774C59366
9770c11156L9530P1845i7171j58709e4241A99192F9762b24807A95170M7426c50860
9758a03451m155r4505j49678d6560k04687A82823A4885b51630L0068e4173k60406
9747c14579J42991J4385o3387g5826l54423a00686j20383a8154A68753b55161
9736A18509m9345B2305c44325H6035J0824b08323e1173k60583f0023A23801a89631
$$ plain form
9724 -14407 -352364 7239 275120 -78775 -263312 -162936 13797 -64200 -213896 -246124 221956
9712 -69179 -52537 -202461 -156660 392082 -35020 -89625 6463 -269227 28717 169682 -140347
9700 -164298 -42498 89611 -388314 -289451 3862 -87495 19989 -72009 -145554 63958 298064
9689 298064 174480 -332310 -333413 -196316 -124410 -245802 191515 -337035 -5466 195181 -197366
9677 -6849 -63164 -92806 -397228 -9603 -229849 -254239 54771 -139698 -91352 -193327 -201789 17801
9664 -199504 -136445 -273690 78240 -47507 90850 233020 -67982 -10356 -310131 -115868 219836
9652 162493 -92971 -81499 20841 -104134 222465 -244131 -157271 -64135 -108980 108121 -254338
9640 163659 -46350 -295126 -537984 -123248 181889 -119854 138016 4845 26762 6661 -50619
$$ packed form
9724a4407l37957G239K67881g8775j84537J00376A3797f4200j49696l2228B21956
9712f9179J6642j49924M5801C92082c5020n4605F463b69227B8717J40965a40347
9700a64298d2498H9611c88314R8863C862h7495A9989g2009p3545F3958K34106
9689B98064j23584c32310j103J37097P1906j21392A91515c37035e466A95181a97366
9677f849n6315k9642l04422i603k20246k4390E4771a39698M8346j01975q462A7801
9664a99504O3059j37245G8240d7507I0850J42170f7982a0356k99775a15868B19836
9652A62493i2971J1472B0841a04134B22465b44131Q6860f4135m4845A08121b54338
9640A63659d6350k48776k42858a23248A81889a19854A38016D845K1917F661e0619
$$ plain form
9628 3242 -427111 -69901 -141083 9243 -257172 -250589 -297384 92944 4460 166282 -400766 64615
9615 56621 -214253 -268404 -119206 -116377 -57129 -146462 -196254 -250032 78676 -80021 98769 -460866
9602 -7576 -273081 -42426 330218 -64652 -96573 -114254 -28977 208802 -360766 -106832 -38616
9590 132198 -302269 -266869 -311472 191875 24936 -158835 -6754 164046 129111 -52706 77601
9578 -303032 151339 -141751 -331309 -19392 110293 -107389 -204281 -215251 -92551 60694 114286
9567 114286 -134553 -431338 -250694 9500 -51474 -185833 -90333 -59563 -151159 73232 -163306
9555 294187 -294254 206 113055 -135984 141166 -202050 -114406 157536 -158452 80554 -238387
9543 181848 -426705 -303421 -304063 -7826 -125974 -68675 -112384 -153453 -146182 24757 31539 -58016
$$ packed form
9628C242d27111f9901p1182I243b57172O583m6795I2944D460J61822d00766F4615
9615E6621b14253n4151a19206K829e7129q9333m9792n3778G8676h0021I8769d60866
9602g576k65505d2426C30218f4652l1921j7681b8977B08802c60766a06832c8616
9590A32198c02269L5400m4603A91875B4936a58835f754A64046l4935e2706G7601
9578c03032A51339a41751j89558a9392A10293a07389r6892j0970i2551F0694N3592
9567A14286a34553k96785J80644I500e1474j34359i0333L0770r1596G3232a63306
9555B94187b94254B06J12849a35984A41166b02050Q7644A57536a58452H0554b38387
9543A81848d26705J23284o42g826j18148N7299m3709m1069P271B4757O782e8016
$$ plain form
9530 -184015 -2224 159953 146703 -85657 -308259 104470 -166285 86329 -263936 117541 -6391
9518 -697427 333461 -73856 26734 -132219 160549 -294891 -34022 -300333 -416634 -247707
9508 -247707 183819 143810 -25384 310820 -32488 -411021 -37062 -43369 305507 58333 -20937
9496 35707 4427 -50444 -185467 -17917 137008 181131 -207775 -130151 -251541 -52442 -40223
9485 -40223 -106457 -133015 -69882 -233017 -59676 -155348 -129687 22095 221116 -75608 11250
9473 -240456 -64065 -165136 -217460 -145569 -8678 188742 -210820 285358 -15532 45124 -98594
9461 -284622 -18358 -274119 -172620 -245202 -78427 68062 251384 -47362 -157117 -6959 -25017
9450 -25017 44672 -369771 -37499 69859 127236 -292541 385354 -38474 -200024 -35172 -180287
$$ packed form
9530a84015b224A59953j3250h5657k22602A04470a66285H6329b63936A17541f391
9518f97427C33461g3856B6734a32219A60549b94891c4022k66311j16301J68927
9508b47707A83819m0009b5384C10820c2488l78533c7062o307C05507E8333b0937
9496C5707D427e0444j35023a7917A37008M4123b07775P7624j21390e2442J2219
9485d0223o6234k6558O3133j63135e9676r5672K5661B2095J99021g5608A1250
9473b40456f4065j01071n2324P1891h678A88742b10820B85358a5532D5124i8594
9461b84622a8358k55761J01499p2582g8427F8062J83322d7362j09755f959j8058
9450b5017D4672c69771c7499F9859N7377b92541C85354c8474j61550c5172j45115
$$ plain form
9439 -180287 -223780 -283155 -425364 -122756 78253 -42316 -115258 -101335 3861 -108717 -165453
9428 -165453 -264654 -219377 3890 -148690 -44945 -40087 -251156 75366 139620 -367530 -54044
9416 118677 84157 54879 -52829 -13043 -124261 -84584 -112332 -126012 49 -110695 6146 -40603
9403 -137971 -213610 226720 119248 159136 -193307 116824 29411 92677 -293868 134190
9392 -87297 -85365 295777 -327893 -233431 -57427 6053 91597 -26111 -279757 -22482 -27190 -542523
9380 -542523 129325 -25361 -31545 -318153 -96643 -13298 77887 -363953 227149 -299999 41246
9368 -34031 -308016 -291512 -114892 -110955 -133564 -304517 -187888 -47132 -247311 268279 -103011
9356 16595 -53034 14027 -200503 151051 -65052 -166849 189665 -17285 -92590 70291 -156637
$$ packed form
9439a80287m3493n9375j42209a22756G8253d2316p2942J3923C861a08717n6736
9428a65453r9201M5277C890a48690d4945M858k11069G5366O4254c67530e4044
9416A18677l4520k9278e2829a3043j11218L9677k7748j3680D9a10695F146d0603
9403a37971p5639B26720j07472L9888a93307A16824B9411O3266b93868A34190
9392h7297J932B95777c27893R4462e7427F053Q5544b6111k53646b2482m708n15333
9380e42523A29325b5361o184k86608i6643a3298G7887c63953B27149b99999D1246
9368c4031k73985J6504a14892L937k2609j70953J16629d7132k00179B68279a03011
9356A6595e3034A4027b00503A51051f5052j01797A89665a7285p5305G0291a56637
$$ plain form
9344 72233 2645 -160275 -99136 86748 7497 43036 -219106 -151708 -19935 -119312 -272495 308984
9331 -40341 58513 103145 -106228 -190288 322450 21873 -31477 -146344 69900 121871 -191418
9319 -304029 210918 201850 -194130 -111156 -161903 -128486 68362 -236979 84093 -327969 27665
9307 -546824 295267 -66626 -117946 -74391 -146504 -215856 -206532 64937 -8211 -280721 -118212
9295 108690 -13808 -227561 -371940 88000 182905 -212667 -77353 25188 -53699 -3158 -70695
9284 -70695 -114380 -35944 272014 9081 82430 -208675 -10314 80087 -1831 -32072 108504 142014
9272 142014 -177214 109793 -83063 -528191 -186296 -251783 -427282 -99837 -13290 1114 -324278
9260 179353 -242983 -51048 -165326 25011 -315 -231556 -108586 -318199 88830 60988 26085
$$ packed form
9344G2233B645a60275O1139H6748G497L5539b19106O7398a9935r9377j53183C08984
9331d0341E8513M4632a06228q4060C22450B1873c1477j14867F9900N1971a91418
9319c04029B10918r068a94130Q2974n0747L3417F8362b36979H4093c27969B7665
9307e46824B95267f6626n1320M3555p2113o9352R324F4937h211k72510a18212
9295A08690a3808k13753j44379H8000R4905b12667g7353B5188e3699c158o7537
9284g0695m3685c5944B72014I081P3349b08675a0314H0087a831l0241A08504L3510
9272A42014a77214A09793h3063m45128a86296o5487j75499i9837a3290A114c24278
9260A79353b42983e1048j14278B5011c15k31241a08586k09613H8830k7842B6085
$$ plain form
9248 9941 28649 -119148 -46160 176587 -72335 7080 151452 -260699 -187089 -172280 -158034
9237 -158034 -288126 -135433 168634 -263948 -17477 -68629 229268 152663 98287 59503 -57536
9225 264432 31264 -100414 35067 72342 37496 -445659 95428 -50316 -143785 -46691 -195979
9214 -195979 -435849 -170201 -163049 -21194 -70018 -375879 -195400 -440903 258510 -41624 71789
9202 -448804 -85241 91059 342220 -343549 -126950 -18066 218720 -195471 -163509 -245930 64738
9190 -44592 12194 -419246 169568 -4353 54491 -121212 4612 160703 5049 217413 167333
9179 167333 -116198 49710 -146558 124210 -284890 -153879 225600 -267779 111533 -47450
9168 51216 -138461 -128445 -127284 -223536 -93186 245614 -179094 25710 80867 195058 26908
$$ packed form
9248I941J8708a19148d6160A76587g2335G080J44372b60699P3610J4809J4246
9237a58034j30092a35433A68634b63948a7477n1152B29268p6605n4376l8784e7536
9225B64432C1264a00414C5067L7275l4846d45659I5428e0316r3469d6691j49288
9214a95979k39870a70201P152b1194m8824l05861J80479k45503B58510d1624G1789
9202d48804h5241I1059K51161c43549a26950a8066B18720a95471L1962q2421F4738
9190d4592A2194d19246A69568d353E4491a21212D612J56091E049K12364n0080
9179A67333a16198D9710a46558A24210b84890J31011B25600b67779A11533d7450
9168E1216a38461J0016J161r6252i3186B45614a79094B5710N5157J14191B6908
$$ plain form
9156 102992 -405447 -105111 50199 75579 389307 -210532 -275349 -290851 -116642 -86998 -99386
9145 -99386 -18848 -236055 -437898 -29467 -83102 8656 77687 11320 -188909 -87269 66328
9133 -128709 -111765 -183213 -105636 -27260 172821 104205 -263997 -61767 -75153 -51007 -138472
9122 -138472 -216819 -140149 -147511 -74398 111644 -130998 -121223 -34582 -143204 40401 7876 -44419
9109 -76525 -22751 57408 223733 -151178 -6797 -107406 292620 149802 176710 -119892 34226
9097 -320971 166396 118936 -90447 -89310 -35632 -24300 38008 296898 -30143 -218895 9633
9085 -19627 -265263 176999 101411 -44254 -33890 49978 8740 -189323 60737 -220642 -52888
9073 -403734 110683 -114089 -158856 -163631 -128191 -463140 -8407 76397 114066 252604 -185620
$$ packed form
9156A02992d05447a05111E0199K5380L13728b10532o4817j5502a16642K9644j2388
9145i9386a8848k17207k01843b9467n3635H656O9031A1320a88909h7269F6328
9133a28709J6944p1448P7577b7260A72821o8616b63997f1767j3386K4146q7465
9122a38472p8347P6670p362P3113A11644a30998R775c4582j08622D0401G876d4419
9109g6525b2751E7408J66325a51178f797j00609B92620j42818K6908a19892C4226
9097c20971A66396m7460i0447J137c5632J1332C8008K58890c0143j88752I633
9085a9627k45636A76999p5588d4254J0364D9978H740a89323F0737b20642e2888
9073d03734A10683a14089m4767m775L5440l34949h407G6397L7669J38538a85620
$$ plain form
9061 78699 82596 -33745 -10561 102500 -135566 -173183 -104145 -149218 -161354 -11066 -282916
9050 -282916 26913 -105238 -66664 -205298 17257 -153159 -333157 -258730 278309 -112673
9039 314475 -62758 -32604 -92368 -235420 -107429 62433 -4654 70457 -194263 219968 -7706
9027 -205915 -153341 273997 77825 -140601 15780 -189468 270335 -47003 -159590 -257285 -187201
9016 -187201 -202223 -270099 89890 -270483 -138908 -137797 -43636 6006 -121963 -161564 -149790
9005 -149790 -131022 -309347 320992 -297233 -453 -35990 155055 -332459 -156396 -216518 -164701
8994 -164701 -154501 -366270 -99477 -253936 -4650 154066 15838 -380505 -193176 -383573 -73034
8982 204565 -152076 20753 20482 8690 175472 263870 -112338 -169690 156621 -187549 -3655
$$ packed form
9061G8699L897c3745a0561A02500a35566l7617O9038m5073j2136a1066k71850
9050b82916B6913a05238L8574j38634A7257a53159j79998P4427B78309a12673
9039C14475f2758L0154n9764j43052a07429F2433d654G0457a94263B19968g706
9027b05915N2574B73997G7825a40601A5780a89468B70335d7003j12587r7695P0084
9016a87201j5022o7876H9890b70483J31575J111d3636F006a21963l9601J1774
9005a49790J8768j78325C20992b97233d53l5537A55055c32459a56396o0122N1817
8994a64701J0200k11769i9477j54459d650A54066A5838c80505J87329j90397g3034
8982B04565a52076B0753k71H690J66782Q8398a12338n7352A56621a87549c655
$$ plain form
8970 -290550 65566 -104412 152666 -48076 -103659 -35691 -19108 -287644 378 -257803 -104930
8958 44403 -200901 -296463 -118388 64389 -161926 -11197 -240468 191520 10006 -150783 -211223
8947 -211223 -145420 -67244 -146069 310688 25413 115499 -55786 -179491 -308490 238046 -191105
8935 160212 288995 -81878 -31681 -519592 94406 -26970 -22915 -102292 -323415 -95246 57773
8923 -27887 250015 250908 202793 48790 -219633 252907 257863 377638 241118 71826 95612
8912 95612 -113704 174039 352616 417378 370014 733218 1251395 1961753 3984815 8511787
8902 8511787 5541355 2813833 1101548 795865 582372 323682 8665 23058 231768 -1114
8891 -233109 285919 -39928 112948 252516 -295040 -84688 272011 -253460 -41702 -220259
$$ packed form
8970b90550F5566a04412A52666d8076n5583c5691J6583k68536C78b57803a04930
8958D4403b00901r5562a18388F4389a61926a1197k29271A91520A0006a50783o0440
8947b11223O5803f7244p8825C10688B5413R0086e5786j23705j28999B38046a91105
8935A60212J28783h1878c1681m87911I4406b6970M055p9377k21123i5246E7773
8923b7887B50015Q93m8115D8790b19633B52907M956J19775j36520G1826K3786
8912I5612a13704A74039J78577O4762m7364L63204N18177P10358K023062M526972
8902H511787k970432k727522A101548l05683k13493k58690H665J4393K08710a114
8891b33109B85919c9928A12948J39568b95040h4688B72011b53460d1702j78557
$$ plain form
8881 -220259 40654 19225 -381140 -124568 7582 -136103 -98048 39851 -19630 170150 -110235
8869 -225919 -102923 -211249 106432 -177232 145966 -327424 -148644 -140415 152476 76685
8859 76685 134112 -302737 -93114 -106934 -5592 -121143 -34787 -444115 -63861 18187 208605
8848 208605 147128 121395 -55826 -412488 -255822 -134597 -19570 127129 -60349 -169090 -155834
8837 -155834 54390 23302 -152853 -71070 -133554 15791 41656 -46525 55869 -267049 199398
$$ packed form
8881b20259D0654A9225c81140a24568G582a36103L8055C9851a9630A70150a10235
8869b25919a02923j08326A06432a77232A45966c27424a48644Q229A52476p5791
8859G6685N7427c02737i3114j3820e592j15551c4787m09328f3861A8187J90418
8848B08605o1477k5733e5826l56662J56666J21225a9570A27129f0349j08741J3256
8837a55834E4390B3302a52853g1070o2484A5791K5865d6525E5869b67049A99398
$$ [...]
##END NTUPLES=NMR SPECTRUM
##END=
