
##TITLE=AC1084_CANE01_5818974_GdcpBjHsnk
##JCAMPDX= 6.0         $$ Bruker NMR JCAMP-DX V2.0
##DATA TYPE= NMR SPECTRUM
##DATA CLASS= NTUPLES
##ORIGIN= BRUKER
##OWNER= Administrator
$$ 1.72 TOPSPIN		Version 2.1
$$ 2012-03-24 23:46:35.234 -0500  Administrator@TOPSPIN
$$ Compression mode = diff/dup
##.OBSERVE FREQUENCY= 400.13188235
##.OBSERVE NUCLEUS= ^1H
##.ACQUISITION MODE= SIMULTANEOUS (DQD)
##.ACQUISITION SCHEME= undefined
##.AVERAGES= 64
##.DIGITISER RES= 22
##SPECTROMETER/DATA SYSTEM= spect
##.PULSE SEQUENCE= noesygpps1d.comp
##.SOLVENT NAME= COFFEE_meoh
##.SHIFT REFERENCE= INTERNAL, COFFEE_meoh, 1, 14.96849
##AUDIT TRAIL= $$ (NUMBER, WHEN, WHO, WHERE, PROCESS, VERSION, WHAT)
$$ ##TITLE= Audit trail, TOPSPIN		Version 2.1
$$ ##JCAMPDX= 5.01
$$ ##ORIGIN= Bruker BioSpin GmbH
$$ ##OWNER= Administrator
$$ $$ C:\Bruker\TOPSPIN/data/COFFEE/nmr/AC1084_CANE01_5818974_GdcpBjHsnk/12/pdata/1/auditp.txt
$$ ##AUDIT TRAIL=  $$ (NUMBER, WHEN, WHO, WHERE, PROCESS, VERSION, WHAT)
(   1,<2012-03-24 23:46:30.234 -0500>,<Administrator>,<TOPSPIN>,<go>,<TOPSPIN 2.1>,
      <created by zg
	started at 2012-03-24 23:34:58.703 -0500,
	POWCHK enabled, PULCHK disabled,
       configuration hash MD5:
       1A 1E CE 29 27 FD 77 03 67 4E F0 E3 C4 B2 CB 90
       data hash MD5: 64K
       8F 00 BC 02 6D 77 F7 9D 3C E2 08 A5 DC 98 11 24>)
(   2,<2012-03-24 23:46:33.156 -0500>,<Administrator>,<TOPSPIN>,<proc1d>,<TOPSPIN 2.1>,
      <Start of raw data processing
       efp LB = 0.3 FT_mod = 6 PKNL = 1 PHC0 = 0 PHC1 = 0 SI = 128K 
       data hash MD5: 128K
       D2 9C 81 48 2D 1D D9 11 45 D2 16 47 1C 67 82 7B>)
(   3,<2012-03-24 23:46:34.375 -0500>,<Administrator>,<TOPSPIN>,<proc1d>,<TOPSPIN 2.1>,
      <pk PHC0 = 37.13928 PHC1 = 0 
       data hash MD5: 128K
       F5 8F 39 E4 45 02 28 3E B7 16 78 A6 4A 64 EF 29>)
(   4,<2012-03-24 23:46:34.921 -0500>,<Administrator>,<TOPSPIN>,<proc1d>,<TOPSPIN 2.1>,
      <abs ABSG = 1 
       data hash MD5: 128K
       C1 83 72 7D EE DE 5E EF D0 CE 82 0F 73 E8 CE FE>)
(   5,<2012-03-24 23:46:35.000 -0500>,<Administrator>,<TOPSPIN>,<proc1d>,<TOPSPIN 2.1>,
      <abs ABSG = 2 
       data hash MD5: 128K
       0E 01 B1 03 90 E6 F0 5B 48 8D 20 EB A8 86 7B 35>)
(   6,<2012-03-24 23:46:35.046 -0500>,<Administrator>,<TOPSPIN>,<proc1d>,<TOPSPIN 2.1>,
      <abs ABSG = 3 
       data hash MD5: 128K
       8B F2 0E 70 16 59 3F 48 59 4A 7F B2 1C 46 57 62>)
(   7,<2012-03-24 23:46:35.093 -0500>,<Administrator>,<TOPSPIN>,<proc1d>,<TOPSPIN 2.1>,
      <abs ABSG = 4 
       data hash MD5: 128K
       E1 FD A6 CE 57 93 C0 78 15 76 8D 8C CE BB 11 00>)
(   8,<2012-03-24 23:46:35.156 -0500>,<Administrator>,<TOPSPIN>,<proc1d>,<TOPSPIN 2.1>,
      <abs ABSG = 5 
       data hash MD5: 128K
       A3 4A E4 B8 50 37 10 DA 54 A0 39 6E 23 1A 08 7F>)
$$ ##END=
$$ 
$$ $$ hash MD5
$$ $$ BC 80 84 43 A7 1F 76 E2 B7 C8 52 29 63 FD 68 2A
##$RELAX= 
##$RELAX= 
##$RELAX= 
##$RELAX= 
##$RELAX= 
##$RELAX= 
##$RELAX= 
##$RELAX= 
$$ Bruker specific parameters
$$ [...]
##$TP07= 0
##$TPNAME0= <>
##$TPNAME1= <>
##$TPNAME2= <>
##$TPNAME3= <>
##$TPNAME4= <>
##$TPNAME5= <>
##$TPNAME6= <>
##$TPNAME7= <>
##$TPOAL= (0..7)
0.5 0.5 0.5 0.5 0.5 0.5 0.5 0.5
##$TPOFFS= (0..7)
0 0 0 0 0 0 0 0
##$TUNHIN= 0
##$TUNHOUT= 0
##$TUNXOUT= 0
##$USERA1= <user>
##$USERA2= <user>
##$USERA3= <user>
##$USERA4= <user>
##$USERA5= <user>
##$V9= 5
##$VALIST= <valist>
##$VCLIST= <CCCCCCCCCCCCCCC>
##$VD= 0
##$VDLIST= <DDDDDDDDDDDDDDD>
##$VPLIST= <PPPPPPPPPPPPPPP>
##$VTLIST= <TTTTTTTTTTTTTTT>
##$WBST= 2048
##$WBSW= 25
##$XGAIN= (0..3)
0 0 0 0
##$XL= 0
##$YL= 0
##$YMAX_a= 15351855
##$YMIN_a= -6600561
##$ZGOPTNS= <>
##$ZL1= 120
##$ZL2= 120
##$ZL3= 120
##$ZL4= 120
##$ABSF1= 14.96849
##$ABSF2= -5.584041
##$ABSG= 5
##$ABSL= 3
##$ALPHA= 0
##$AQORDER= 0
##$ASSFAC= 0
##$ASSFACI= 0
##$ASSFACX= 0
##$ASSWID= 0
##$AUNMP= <proc_prof1d_extract.lims>
##$AXLEFT= 0
##$AXNAME= <>
##$AXNUC= <1H>
##$AXRIGHT= 0
##$AXTYPE= 0
##$AXUNIT= <>
##$AZFE= 0.1
##$AZFW= 0.1
##$BCFW= 0
##$BC_mod= 0
##$BYTORDP= 0
##$COROFFS= 0
##$CY= 15
##$DATMOD= 1
##$DC= 0
##$DFILT= <>
##$DTYPP= 0
##$F1P= 0
##$F2P= 0
##$FCOR= 0.5
##$FTSIZE= 131072
##$FT_mod= 6
##$GAMMA= 0
##$GB= 0
##$INTBC= 1
##$INTSCL= 1
##$ISEN= 128
##$LB= 0.3
##$LEV0= 0
##$LPBIN= 0
##$MAXI= 10000
##$MC2= 0
##$MEAN= 0
##$ME_mod= 0
##$MI= 0
##$NCOEF= 0
##$NC_proc= -3
##$NLEV= 6
##$NOISF1= 0
##$NOISF2= 0
##$NSP= 0
##$NTH_PI= 0
##$NZP= 0
##$OFFSET= 14.96849
##$PC= 1
##$PHC0= 37.13928
##$PHC1= 0
##$PH_mod= 1
##$PKNL= yes
##$PPARMOD= 0
##$PPDIAG= 0
##$PPIPTYP= 0
##$PPMPNUM= 2147483647
##$PPRESOL= 1
##$PSCAL= 4
##$PSIGN= 0
##$PYNMP= <proc.py>
##$REVERSE= no
##$SF= 400.130004851821
##$SI= 131072
##$SIGF1= 0
##$SIGF2= 0
##$SINO= 400
##$SIOLD= 131072
##$SPECTYP= <>
##$SREGLST= <1H.CDCl3>
##$SSB= 0
##$STSI= 131072
##$STSR= 0
##$SW_p= 8223.68421052632
##$SYMM= 0
##$S_DEV= 0
##$TDeff= 65536
##$TDoff= 0
##$TI= <>
##$TILT= no
##$TM1= 0
##$TM2= 0
##$TOPLEV= 0
##$USERP1= <user>
##$USERP2= <user>
##$USERP3= <user>
##$USERP4= <user>
##$USERP5= <user>
##$WDW= 1
##$XDIM= 131072
##$YMAX_p= 527513792
##$YMIN_p= -141507312
##$CURPLOT= <Network HP LaserJet P1505>
##$CURPRIN= <$Network HP LaserJet P1505>
##$DFORMAT= <normdp>
##$LAYOUT= <+/1D_H.xwp>
##$LFORMAT= <normlp>
##$PFORMAT= <normpl>
##$SURQMSG= 1
$$ End of Bruker specific parameters
$$ ---------------------------------
##NTUPLES= NMR SPECTRUM
##VAR_NAME=  FREQUENCY,     SPECTRUM/REAL,   SPECTRUM/IMAG
##SYMBOL=    X,             R,               I
##VAR_TYPE=  INDEPENDENT,   DEPENDENT,       DEPENDENT
##VAR_FORM=  AFFN,          ASDF,            ASDF
##VAR_DIM=   131072,        131072,          131072
##UNITS=     HZ,            ARBITRARY UNITS, ARBITRARY UNITS
##FACTOR=    0.0627417313425165, 1,          1
##FIRST=     8223.62146879498, 3864,         -112757
##LAST=      0,             4950,            -113126
##MIN=       0,             -141507312,      0
##MAX=       8223.62146879498, 527513792,    0
$$ Real data points
##PAGE= N=1
##DATA TABLE= (X++(R..R)), XYDATA
$$ [...]
66791 3797270 3759187 3721276 3683913 3647135 3610669 3574390 3538384 3502503 3466434 3430382 3395016
66780 3395016 3360494 3326133 3291238 3255501 3218425 3179488 3139471 3100494 3063763 3028082 2991633
66769 2991633 2954464 2918032 2882941 2848583 2814705 2781616 2748649 2714039 2677028 2639043 2601995
66758 2601995 2566264 2531163 2496641 2463405 2431567 2400144 2368193 2335940 2304576 2275121 2247564
66747 2247564 2220856 2193618 2165077 2135566 2106206 2078041 2051374 2025799 2000675 1975434 1949655
66736 1949655 1923277 1896967 1871930 1848787 1826743 1804322 1780999 1757632 1735195 1713653 1692360
66725 1692360 1671051 1649968 1629338 1609174 1589446 1570078 1550806 1531246 1511043 1490091 1468959
66714 1468959 1448966 1431071 1414516 1397381 1378946 1360751 1344656 1330445 1316087 1299971 1282225
66703 1282225 1264285 1247888 1234011 1221988 1209894 1196478 1182329 1168555 1155039 1141090 1127159
66692 1127159 1114441 1102967 1091550 1079693 1068174 1057453 1046825 1035579 1023812 1011625 998758
66681 998758 985703 974041 964675 956482 947615 937556 927074 916731 906397 895933 885404 874673
66669 874673 863499 852144 841428 832020 823857 816251 808570 800977 794398 789409 785230 780351 774142
66656 774142 767212 760142 752732 744830 737086 730301 724530 719254 714014 708452 702230 695290 687856 679965
66642 679965 671537 663018 655251 648483 642345 636981 633055 630101 626179 620123 613118 606894 601388 595535
66628 595535 589454 584064 578911 572347 564166 556466 551297 548509 546415 543532 539108 532923 525482 518061
66614 518061 511877 507219 503489 499787 495383 490060 484245 478559 473236 468341 464334 461719 460073 458214
66600 458214 455622 453030 451126 449279 446156 441329 435638 430074 424959 420349 416641 414250 412918 411878
66586 411878 410789 409909 409071 407196 403607 399419 396566 395415 394403 392186 389036 385695 382094 378098 374493
66571 374493 372162 370924 370090 369422 368549 366394 362604 358839 356892 355894 353204 348128 343011 340272 339931
66556 339931 340551 341148 341263 340328 337950 334369 330153 325969 322711 320875 319662 317746 315161 313194 312116
66541 312116 310538 307661 304606 302493 300550 297454 293434 289689 286614 284086 282761 283418 285369 287017
66527 287017 287874 288723 289904 290744 290706 289813 287877 284566 280552 277394 275804 274979 274093 273545 274068 275297 275925
66510 275925 274973 272431 268988 265576 262988 261460 260564 259591 258062 256060 254298 253695 254428 255385 254947 252403
66494 252403 248406 244146 240436 237472 234955 232375 229566 227053 225577 225289 225787 226797 228268 229732 230140
66479 230140 228664 225462 221590 218359 216574 215962 215345 213833 211854 210594 210523 211047 211625 212416 213546 214403
66463 214403 214176 212756 210770 208989 207868 207284 206500 204851 202725 201304 200972 200610 199071 196860 195499
66448 195499 195475 195719 195173 194043 193232 193207 193794 194527 194702 193533 190908 187881 185839 185157 185091 185004 185134 185915
66430 185915 186991 187319 186108 183384 179867 176670 174973 175429 177636 180241 181674 180913 178050 174486 172197
66415 172197 172116 173221 173694 172897 171659 170809 170357 170263 170967 172542 174065 174514 173835 172640 171419 170588 170588 171040
66397 171040 170442 167774 164122 161726 161643 163235 165561 167935 169265 168418 165862 163774 163758 165146 166093 165625
66381 165625 164113 162440 161354 161104 161041 159948 157243 153593 150125 147565 146372 146789 148145 148890 148294 147659
66365 147659 148964 152580 157049 160738 162847 163092 161548 159062 156966 155988 155736 155336 154156 152063 149521
66350 149521 147508 146810 147312 148329 149503 150898 152367 153515 154198 154331 153273 150357 146296 143098 142045
66335 142045 142332 142196 140788 138472 136006 134196 133763 134602 135428 135066 133947 133430 133755 133762 132902 132379 133491
66318 133491 135558 136446 134909 131608 128003 125125 123534 123533 124792 126205 126829 126875 127306 128463 129550 129650
66302 129650 128940 128522 129114 130154 130405 129360 127751 126552 125743 124527 122636 120791 119625 118798 117747 116791
66286 116791 116700 117337 117667 117175 116492 116339 116707 117506 119226 122198 125657 128325 129733 130336 130553 130368 129761
66269 129761 128843 127588 126048 124801 124461 124600 123894 121626 118511 115770 114037 113556 114683 117248 119670
66254 119670 119737 116769 112653 110355 111395 114788 118250 120248 120948 121409 122107 122301 120738 116939 111966 107995
66238 107995 106822 108324 110382 110734 109095 107285 107278 109351 112133 114036 114403 113589 112327 111053 109775 108546
66222 108546 107838 108127 109218 110321 110808 110453 109067 106661 104131 102975 103763 105462 106809 107697 108427 108299
66206 108299 106244 102788 100033 99283 99628 99477 98676 98321 98938 99828 100286 100717 102108 104514 106446 106064 103074
66189 103074 99202 96533 95562 95221 94550 93589 92670 91718 90755 90388 91076 92322 93256 93821 94670 96037 97421
66172 97421 98391 99076 99651 99871 99419 98355 96991 95576 94262 93100 91971 90872 90339 91136 93191 95256
66156 95256 95998 95227 93741 92328 91429 91520 93026 95690 98499 100410 100859 99661 97136 94571 93721 95142
66140 95142 97448 98990 99900 101505 103903 105412 104935 103781 104148 106355 108574 109101 108018 106657 106227 107065
66124 107065 108600 109819 110262 110520 111202 111577 110178 106896 103450 101338 100244 99140 98064 97887 98943
66109 98943 100896 103510 106513 108984 109905 109255 107688 105350 102206 99327 98317 98960 98878 96424 92903 90842
66093 90842 90824 91281 90952 90184 89756 89668 89651 90013 91190 92817 93913 94003 93630 93632 94276 95235 96134 96703 96565 95418
66073 95418 93596 91887 90519 88898 86894 85705 86428 88115 88549 87080 85433 85210 85851 85859 85070 84527 84754
66056 84754 85274 85588 85629 85488 85561 86696 89195 91812 92879 92445 92174 92934 93710 93397 92541 92312 92500 91720
66038 91720 89511 87266 86715 87958 89378 89463 88362 87327 86783 85690 83307 80872 80425 82167 84251 85421
66022 85421 86458 88257 89731 89002 86041 82728 80521 79446 79404 80848 83489 85600 85826 85064 85365 87234
66006 87234 89234 90272 91049 92681 94935 96841 98416 100555 103273 105246 105358 103824 101383 98390 95351
65991 95351 93427 93353 94291 94736 94246 93358 92247 90777 89757 90601 93372 96428 98557 100219 101992 103081
65975 103081 102585 101277 100681 100883 100686 99732 99052 99335 99907 99879 99352 98860 98306 97099 95105 93009 91893
65958 91893 92664 95645 100387 105825 110632 113510 113682 111589 108877 107133 106595 106471 106285 106354 107043 108268
65942 108268 109775 111251 112116 111920 111166 111051 112093 113542 114362 114264 113562 112662 112031 112062 112664 113477 114616 116396
65924 116396 118173 118567 117419 116414 116904 118137 118793 119225 120659 122836 124239 124369 123993 123190 121132 118299
65908 118299 116974 118506 121487 123691 124560 124667 124012 122380 120465 118995 117360 114725 112063 111236 112131
65893 112131 112602 111549 110283 110160 110586 110515 110583 112232 115381 118365 119933 120136 119405 117798 115412 112773
65877 112773 110587 109371 109186 109339 108709 106992 105372 105172 106044 106382 105513 104503 104595 105756 107097 107894 107677
65860 107677 106128 103729 102051 102581 105293 108872 112194 115125 118072 121244 124318 126460 126829 125422 123232
65845 123232 121152 118967 115991 112461 109511 107738 106608 105565 104958 105314 106248 106791 106560 106015 105648 105525
65829 105525 105637 106132 107012 107994 108892 109909 111372 113398 115905 118603 120742 121311 120101 118362 117733 118310
65813 118310 118360 116301 112494 108699 106232 105380 106208 108739 112090 114534 115226 115210 115834 116742 116615 115614 115525
65796 115525 117051 118398 117544 114918 112511 110999 109412 107545 106899 108429 110726 111627 110898 110105 110244 110748
65780 110748 110865 110913 111799 114055 117620 121833 125276 126361 124781 122010 119859 118814 118161 117258 115998 114357
65764 114357 112353 110463 109296 108725 108065 107372 107803 110115 113325 115611 116354 116663 117911 120408 123544 126502
65748 126502 128377 128199 125645 121688 117932 115138 112780 110118 107216 104787 103537 103977 106240 109464 111843
65733 111843 112194 111397 111442 112983 114685 115124 114495 113977 114188 114812 115156 114548 112852 111198 111459 114107 117128
65716 117128 118109 116919 115219 113833 112252 110714 110799 113085 115662 116221 114695 112698 111116 109722 108720
65701 108720 109030 110714 112432 113022 112737 112369 111973 111340 111082 112107 114027 115198 114776 113908 114179 115403 115820
65684 115820 114298 111319 107796 104023 100374 97923 97207 96923 95148 91861 89136 88590 89592 90356 89978
65669 89978 88841 87713 87161 87494 88646 90229 91956 93823 95659 96936 97363 97258 96888 95792 93317 89711
65653 89711 86268 84391 84643 86456 88513 89709 90152 91083 93435 96564 98690 98609 96775 94660 93232 92171
65637 92171 90676 88867 87818 87928 88024 86970 85653 86051 88350 90481 90932 90608 91073 92198 92780 92590 92435
65620 92435 92612 92521 91674 90159 88322 86827 86730 88541 91317 93485 94441 94602 94173 92743 90105 86821 84014
65603 84014 82950 84247 86838 88377 87636 85900 85017 84864 84183 83164 83288 84726 85896 85943 85903 86776 87966
65586 87966 88359 87730 86483 85142 84652 85887 88197 89661 89499 89028 89541 90583 91268 91910 93103 94215
65570 94215 94224 93348 92598 92350 92383 92637 92766 91661 88767 85418 83614 83875 85427 87866 91107 94054 95082
65553 95082 94052 92548 91865 91952 92392 93034 93238 91838 88688 85429 83907 84285 85216 85485 85016 84620 85145
65536 85145 86715 88679 90442 92174 94203 95959 96289 94955 93065 91770 91207 91067 91470 92670 94228
65521 94228 95167 94942 93933 92976 92617 92846 93377 93991 94496 94449 93352 91315 89171 87561 86235 84663 83071
65504 83071 82276 82591 83384 83712 82951 80947 78165 75759 74937 75935 77801 79212 79452 78780 78202 78677 80227
65487 80227 81891 82833 83155 83305 83255 82924 82995 84355 86813 89160 90591 91402 92299 93611 95132 96173 95917
65470 95917 94385 92816 92340 92610 92718 93020 94648 97317 99323 100093 101047 103178 105334 106023 105599 105210 104587
65453 104587 102589 99545 97452 97703 99732 102011 103450 103777 103455 103523 104877 107357 109822 111141 110884 109395
65437 109395 107747 107376 108977 111698 114015 115420 116695 118572 120798 122653 123756 124048 123415 121765 119368
65422 119368 116949 115479 115692 117481 119844 121783 123318 125333 128513 132742 137467 142171 146439 150022
65408 150022 153075 155975 158681 160559 161157 161041 161531 163537 166753 170038 172422 173594 173515 172038 169300
65393 169300 166149 163514 161244 158174 153583 148086 142888 138713 135807 134148 132988 130887 127222 123292
65379 123292 120842 119629 117593 113596 108921 105697 104738 105401 106700 107824 108146 107539 106545 105767 105322 105154
65363 105154 105360 105724 105426 103923 101891 100596 100431 100641 100296 98914 96376 93182 90832 90860 92950 94862
65347 94862 94946 94163 94793 97598 101233 104213 106267 107490 107360 105476 102666 100471 99652 99919 100936 102821
65331 102821 105531 108442 110896 112726 114015 114786 115289 116258 118438 121861 125791 129273 131745 133478 135565
65316 135565 139057 143776 148291 151491 153953 157253 162104 167694 172899 177625 182735 189043 196705 205457
65302 205457 215169 225964 237706 249526 260182 269114 276848 284080 290542 295133 296959 295857 292046
65289 292046 285842 277902 269405 261633 255288 250041 244707 238133 230329 222612 216416 212160 209463 207925
65275 207925 207055 205905 203769 201214 199432 198487 197160 194738 191791 188688 184540 178638 172046 166496 162225
65260 162225 158203 154181 151009 148780 146082 141767 136440 131499 127450 123968 120949 118564 116605 114684
65246 114684 112941 111761 110910 109836 108895 109246 111083 112798 112640 110589 107818 104817 101229 97459 95041
65231 95041 94758 95295 94681 92595 90403 89226 89005 89436 90787 93335 96684 100124 103182 105402 106075 104819
65215 104819 102205 99317 96800 94679 92801 90997 88970 86635 84505 83247 82902 83053 83679 85179 87351
65200 87351 89011 89122 88000 87031 87359 89090 91535 93871 95669 97020 98205 99197 99675 99584 99425 99824 101032
65183 101032 102968 105439 108039 110183 111669 113013 114788 116690 117743 117476 116469 115638 115374 115568 116083
65168 116083 116799 117367 117280 116292 114565 112354 109683 106405 102511 98318 94342 91123 89170 88919 90431 92984
65152 92984 95152 95548 93656 90069 86078 82985 81452 81241 81761 82962 85340 88712 91506 92000 90231
65137 90231 87908 86365 85361 84181 83084 82950 84001 85560 86842 87365 86890 85702 84779 84886 85465 85201
65121 85201 83808 82480 82326 83118 84016 84684 84983 84173 81537 77713 74577 73569 74582 76502 78283 79442
65105 79442 80106 80840 82076 83547 84643 85313 86052 86867 86983 85984 84623 83917 83960 84320 85094 86559 88083
65088 88083 88613 88388 88942 90882 92778 93170 92798 93628 96098 98609 99735 99696 99295 98532 97074 95398 94527
65071 94527 94745 95276 95210 94330 93033 91864 91278 91565 92819 95002 97999 101504 104927 107552 108850 108717
65055 108717 107605 106441 106140 106893 107995 108586 108571 108766 110065 112399 114415 114437 112100 108942 106953 106574
65039 106574 106754 106973 108180 111172 114915 117561 118756 119906 122303 126019 130687 136273 142610 149060 155240
65024 155240 161555 168418 175403 181712 187163 192133 196699 200375 202725 203831 204128 203949 203248 201694 199127
65009 199127 195890 192488 188873 184466 178986 172771 166060 158564 150296 142445 136627 133227 130988 128318
64995 128318 124685 120714 117308 114820 112839 110663 108045 105398 103148 101119 98840 96360 94365 93425
64981 93425 93355 93337 92557 90834 88869 87720 87733 88077 87648 86333 84996 84384 84554 85319 86480 87365 86853 84499
64963 84499 81309 78760 77259 76088 74765 73774 73783 74839 76656 79128 81976 84286 85148 84682 83716 82433
64947 82433 80219 77218 75125 75570 78107 80664 81818 81857 81815 82400 83884 85968 87422 86892 84681 82967
64931 82967 83477 85598 87482 88408 89071 89945 90518 90201 89129 87846 86808 86258 86023 85441 84083 82572 82046
64914 82046 82714 83576 83756 83464 83461 84104 85190 86175 86312 85059 82793 80798 80319 81756 84615 87687 89366
64897 89366 88734 86742 85635 86727 89216 91438 92517 92311 90709 88028 85562 84531 84514 83828 81603 78765
64881 78765 76869 76621 77725 79529 81383 82715 83188 82881 82359 82529 84040 86499 88577 89348 89272 89340 89606
64864 89606 89406 88924 89401 91313 93207 93133 90931 88510 87954 89700 92335 93801 92961 90496 88351 88081
64848 88081 89578 91370 91958 90790 88246 85092 82007 79453 77817 77488 78584 80652 82832 84348 84699
64833 84699 83676 81756 80313 80599 82123 82791 81263 78729 77682 79248 82336 85141 86792 87649 88642
64818 88642 90330 92074 92333 90350 87362 85401 85105 85594 86313 87617 89245 89734 88291 86267 85643 86696
64802 86696 88155 89064 89328 88839 87369 85339 83593 82365 81391 81011 81989 84007 85450 85245 84041 83051
64786 83051 82542 82081 81598 81448 81831 82770 84352 86497 88832 91119 93395 95336 96095 95314 93744 92313
64770 92313 91097 89867 88993 88894 89013 88419 87244 86618 87200 88668 90532 92484 93863 93901 92905 92352 93323
64753 93323 95387 97267 97968 96939 94004 89801 85828 83398 82725 83285 84613 86307 87701 88153 87594 86479
64737 86479 85454 85168 85945 87248 88013 88018 88427 90247 92633 93667 92714 91067 90100 89759 89354 89000 89293 89914
64719 89914 89640 88041 86390 86245 87526 88769 89252 90000 92158 94981 96305 94957 92051 89681 88906 89292
64703 89292 89916 90278 90450 90859 92016 94035 96245 97438 96791 94632 92204 90514 89411 87947 85649 83149
64687 83149 81472 80992 81369 82152 82979 83367 82923 81887 81162 81731 84152 88341 93427 98065 101467 103970
64671 103970 106133 107714 108271 108334 108799 109285 108516 106492 104755 103965 102835 100496 98463 98718 100849 102780
64655 102780 103747 104670 105791 105799 103744 100425 97334 95258 94373 94597 95176 94759 92787 90440 89618 91199 94576
64638 94576 98463 101764 103957 105125 105624 105663 105331 104858 104467 103996 103117 101805 100172 98099 95811 94564
64622 94564 95621 98312 100241 100003 98776 98637 100171 102522 104979 107331 109057 109322 107867 105174 101810
64607 101810 98211 95048 93117 92767 93822 95938 98551 100755 101898 102205 102150 101440 99571 97339 96629 98240
64591 98240 100835 102678 103580 104363 105103 105066 104125 103075 102435 101874 101159 100806 101277 102121 102577 102614 102744 103089 103359
64572 103359 103636 104418 105739 106870 107148 106610 105576 104199 102846 102354 103248 104937 106386 107435 108813 110859
64556 110859 112871 113935 113887 113206 112330 111391 110383 109389 108763 109069 110457 112037 112366 110874 108474 106463
64540 106463 105146 103926 102480 101322 101231 102520 104827 107250 108624 108131 105941 103116 100655 98689 96774
64525 96774 94862 93639 93774 95127 97018 99145 101797 105067 108329 110821 112363 113197 113441 113161 112703 112382
64509 112382 112028 111422 110941 111023 111257 110982 110785 112109 114979 117249 116856 113967 110183 106685 104185 103588 105093
64492 105093 107166 108120 108582 110691 114612 117632 117430 114813 112255 111007 110897 111945 114432 117610 119805
64477 119805 120154 119320 118319 117358 116108 114464 112703 111201 110161 109339 108143 106474 105400 106312 109180
64462 109180 112119 113013 111334 108272 105492 103891 103138 102117 100073 97403 95080 93352 91617 89665 88280
64447 88280 88171 88995 90017 91203 92897 94836 96357 97437 98762 100836 103686 107207 110890 113283 112945
64432 112945 110374 108037 107810 109054 109780 109024 107381 105806 104861 104818 105506 106020 105382 103645 101794 100514
64416 100514 99589 98568 97440 96526 96179 96722 98147 99746 100555 100406 100128 100491 101447 102683 104282 106215
64400 106215 107566 107153 105079 103059 102774 104125 105576 106210 106922 109128 112558 115107 115214 113778 113048 114023
64384 114023 115734 116968 117642 118223 118709 118826 118724 118823 119239 119770 120148 119900 118410 115766 113283 112434 113306
64367 113306 114674 115580 116192 116992 117801 118012 117376 116167 114901 114271 115064 117547 120806 123175 123710 123076 122688
64350 122688 123082 123524 123323 122958 123450 125008 126979 128999 131331 133832 135372 134909 132658 129632 126493 123505
64334 123505 121220 120237 120198 119876 118529 116620 114940 113655 112660 112433 113824 116933 120549 122959 123424 122863
64318 122863 122956 124370 125993 126173 124670 123017 122932 124697 127153 128857 129149 128434 127716 127632 127863 127734 127339
64301 127339 127519 128561 129594 129742 129359 129414 129997 130245 129729 129141 129322 130120 130529 129750 127991 126437 126417 128186
64283 128186 130481 131643 131318 130617 130607 131255 132181 133657 136075 138879 141011 142365 143865 145895 147496 147715
64267 147715 147152 147472 149642 153211 157168 160825 163870 166198 168067 170062 172566 175352 177812 179405 179831
64252 179831 179190 178303 178586 181033 185208 189553 192772 194633 195377 194852 192693 189255 185872 184045 184558 187257
64236 187257 191267 195182 197538 197740 196622 195758 196080 197237 198200 198218 197289 196172 196055 197833 201497 206418
64220 206418 212201 218769 225474 230908 234228 236267 238547 241446 244061 245789 247077 248443 249568 249807
64206 249807 249013 247368 244989 242224 239856 238240 236462 233146 228194 223077 219215 216547 214044 211276
64192 211276 209061 208590 210194 212958 215364 216242 215334 213255 211105 209947 210327 212069 214498 216901 218795
64177 218795 219999 220824 222279 225636 231318 238208 244405 248803 251853 254830 258556 262891 267135 270611
64163 270611 272964 274405 275831 278306 281879 285041 285883 283877 280041 275430 270355 265491 262616 263007 265430
64148 265430 266995 266140 263812 261603 259867 258201 256697 255852 255818 256589 258550 261965 266121 269728 272285
64133 272285 274608 278052 283438 290528 298053 304286 308083 309542 309685 309615 309928 310461 310388 309004 306712 304765
64117 304765 303743 302891 301399 299603 298182 296825 294755 292290 290693 290457 290763 290876 291151 292178 293606
64102 293606 294494 294623 295057 297244 301583 306893 311536 315176 319063 324482 331497 339577 348543 358094 367229
64087 367229 375390 383770 394103 406310 418745 430772 443580 458084 473508 488677 503392 517681
64075 517681 530859 542323 552323 560827 566350 567170 563376 556737 548831 540153 530734 520647 509895
64062 509895 498444 486421 473944 461105 448500 437222 427741 419431 411891 406023 402693 400831 398286
64049 398286 394449 390719 388323 387020 386366 386916 389367 393377 398150 403568 409925 416922 423794 430322 437077
64034 437077 444571 452669 460939 469288 478145 488148 499547 511725 523337 533185 541113 548016 554961
64021 554961 562218 568990 573918 575900 574649 570688 565024 558733 552510 546361 539737 532168 523729 514832
64007 514832 505786 496810 488315 480803 474516 469571 466374 465477 466770 469145 471357 473129 475245 478659
63993 478659 483735 490237 497621 505205 512309 518702 524933 532013 540640 550846 562381 575153 589191
63980 589191 604445 620871 638442 656766 674937 692164 708421 724032 738826 752261 764260
63969 764260 775281 785537 794840 803322 811530 819550 826731 832636 837663 842504 847736 854277 863216 874529
63955 874529 886939 899909 914917 933577 955230 977724 1000076 1022749 1045490 1066673 1085239
63944 1085239 1101843 1117410 1131779 1144647 1156899 1170015 1184670 1200675 1217879 1236351 1256062
63933 1256062 1277134 1300266 1326269 1355271 1386854 1420867 1457611 1497334 1540141 1586597 1638011
63922 1638011 1695727 1760096 1830314 1905385 1985264 2070893 2163130 2261970 2367029 2478410 2596586
63911 2596586 2721841 2854609 2996360 3149307 3314917 3493342 3684687 3890454 4113432
63902 4113432 4356677 4622966 4914972 5235661 5588772 5979082 6411932 6892472 7425671
63893 7425671 8016845 8671190 9392348 10181793 11039494 11963959 12950837 13992135 15077559
63884 15077559 16196160 17336058 18482927 19619279 20724544 21775177 22745675 23611498
63876 23611498 24352247 24952637 25401663 25691899 25818993 25780199 25573175 25197498 24658102
63867 24658102 23966994 23141882 22204053 21177109 20085446 18951742 17795403 16633316
63859 16633316 15481204 14353636 13263394 12221690 11238469 10321326 9474005 8696715 7988127
63850 7988127 7346540 6769093 6250822 5785443 5367246 4991998 4656119 4355336 4084449
63841 4084449 3838469 3613962 3409284 3223475 3054949 2901191 2759471 2627628 2504161
63832 2504161 2387955 2278267 2174860 2077628 1985761 1897590 1811624 1727734 1646996 1570491 1498577
63821 1498577 1431148 1367896 1308067 1250496 1194454 1140342 1089381 1042767 1001112 964201 930970
63810 930970 900117 871011 843684 817837 792612 767795 744459 723576 704590 686330 668785
63799 668785 652752 638021 623397 608687 595226 583895 573894 564304 555729 549280 544678 540600
63787 540600 536549 533222 531101 529690 528278 526611 524588 521944 518445 513800 507177 497540 485056 471723
63773 471723 459861 449939 440376 429606 417874 406667 396690 387076 376707 365730 355219 345705
63761 345705 336717 327814 319348 311920 305580 299982 294968 290495 286131 281074 274803 267630 260602 254822
63747 254822 250569 247070 243369 239452 236168 234009 232511 230975 229119 226728 223442 219622 216834 216515
63733 216515 218240 220003 220149 218536 216031 213644 212088 211427 211010 210255 209483 209331 209432 208533 206126 203152
63717 203152 200683 198549 195773 191986 187991 185215 184748 186446 188739 189767 189056 187710 186819 186408 186276
63702 186276 187007 189239 192354 194856 196009 196366 196690 197032 197044 196627 196039 195714 196132 197597 199986 202901 206071
63685 206071 209423 212774 215800 218409 220998 224164 228132 232405 236049 238607 240753 243711 247911 252824
63671 252824 258361 265643 275545 287019 298030 308104 318752 331116 344392 357210 369579 382273
63659 382273 394761 404951 411194 413736 413920 412548 409457 404295 397248 389141 381221 374715 370035 366198
63645 366198 361500 355291 348964 344595 342564 341197 338919 335966 333321 330753 327104 322263 317460 313301
63631 313301 308791 303088 297300 293500 292395 292948 293979 295189 296641 298279 300261 303121 307116 311813
63617 311813 316653 321741 327847 335747 345608 356940 369031 381456 393982 405984 416374 424400 430136
63604 430136 433781 434970 433439 429912 425332 419471 411583 402520 394721 389362 384704 378329 370147 362012
63590 362012 355018 348673 342531 337045 332447 328082 323618 320098 318917 320155 322576 325062 327574 330932
63576 330932 336084 343436 352469 361978 370946 379149 386919 394695 403131 413245 425827 440699 457059
63563 457059 474662 494247 516460 540575 564711 587588 610085 634860 664191 698089 734628
63552 734628 772055 810219 849809 890602 931012 969269 1004484 1036251 1063539 1084596 1098303
63541 1098303 1105524 1108686 1109704 1108528 1104100 1096578 1087847 1079522 1071149 1061031 1048447 1034135 1018593
63528 1018593 1000871 979561 954571 927522 900662 875737 853592 834221 816978 800915 785137
63517 785137 769036 752554 736430 721983 710253 701194 693813 687194 681339 677006 674855 674905 676807
63504 676807 680456 686168 694347 705216 718806 734920 753075 772865 794606 819310 847759 879710
63492 879710 914194 950283 987387 1025249 1063996 1103700 1143321 1180520 1213210 1240919 1263843
63481 1263843 1281218 1292162 1298145 1302885 1308895 1315177 1319163 1320018 1319023 1317392 1314817 1309811 1300565 1285713
63467 1285713 1265119 1239754 1210267 1176133 1136971 1094127 1049811 1005023 959595 914143 870499
63456 870499 829786 791344 754263 719036 686897 658118 631810 607233 584696 565208 549491
63445 549491 537217 527066 517641 508444 499918 492849 487981 485734 485545 485758 485152 484515 485707 489186 493668
63430 493668 498495 504894 514086 525394 537305 549484 562438 575934 589155 602149 615619 629245
63418 629245 641609 652130 661932 672120 681912 689128 692057 690397 684812 676233 665490 653230 640059
63405 640059 626743 614023 602162 591016 580716 571856 564601 557973 550709 542965 536543 533058 532202
63392 532202 532285 532220 532343 533341 535222 537781 541337 546303 552436 559320 567201 576528 586946 597881 610061
63377 610061 625131 643420 663277 683219 703625 725649 749644 775866 805730 840738 880306
63366 880306 921981 963946 1006460 1050815 1097819 1147393 1198897 1251520 1304709 1358069 1410422
63355 1410422 1459272 1501935 1536953 1563816 1581807 1590378 1590637 1585247 1576544 1565494 1552510 1538078
63343 1538078 1522203 1504211 1483619 1460432 1434236 1404072 1369873 1333115 1295158 1255702 1213948
63332 1213948 1170868 1129114 1090559 1054797 1020415 987260 956959 931301 910395 892694 876819
63321 876819 862969 852221 844903 840488 838883 840745 846190 854278 864402 877389 894375 915107 938158
63308 938158 962529 988226 1015621 1045153 1077601 1113720 1153312 1195232 1238575 1283386 1329976
63297 1329976 1377874 1425795 1472349 1516282 1555908 1588695 1612125 1625368 1629899 1627983 1620668 1607805
63285 1607805 1589988 1569606 1549481 1530893 1513105 1494119 1471486 1443258 1409249 1371288 1331627
63274 1331627 1291204 1249835 1207529 1164779 1121936 1079389 1038259 999811 963907 929087 894667
63263 894667 861974 832882 807783 785736 766075 748930 734159 720644 707078 693208 680053
63252 680053 668986 660540 653944 647774 641248 634972 630268 627712 626416 624829 622191 619147 617026 616574
63238 616574 617243 617506 615856 611802 606131 600174 594698 589598 584747 580823 578812 578658 578969 578433 577179
63223 577179 576235 575776 574651 572053 569146 568241 570228 573528 576024 577489 579307 582082 584702 586077 586705
63208 586705 587716 589256 590933 593314 597484 603154 608660 613268 618236 624823 632304 638952 644335 649560
63194 649560 655571 662308 669594 677924 687985 699690 711910 723097 732542 741396 752240 766977 785134
63181 785134 804575 823874 843535 864878 888247 912706 937393 962851 990738 1022028 1055765
63170 1055765 1090070 1124313 1159612 1196956 1235692 1274416 1312692 1350988 1389354 1427219 1464427
63159 1464427 1501468 1538446 1574578 1609030 1641636 1672509 1701527 1728454 1753035 1774454 1791167
63148 1791167 1801830 1806290 1805245 1799084 1787447 1769878 1746428 1717555 1683888 1646489 1607208 1568275
63136 1568275 1531365 1497196 1466035 1438171 1413706 1392351 1374004 1359287 1348897 1342697 1340303 1342603
63124 1342603 1351572 1368066 1390462 1415909 1442237 1468282 1493599 1519101 1547262 1579985 1616036
63113 1616036 1651653 1684101 1713981 1743867 1775349 1807627 1838389 1865701 1889316 1910306 1929198
63102 1929198 1944548 1953816 1955596 1950459 1939557 1922922 1899420 1868169 1829937 1787265 1742999 1698359
63090 1698359 1652672 1605373 1557788 1512316 1470191 1430945 1393889 1359073 1326707 1296749 1269548
63079 1269548 1246045 1226637 1210251 1195101 1180188 1165854 1153134 1142750 1134528 1127805 1122543 1119724
63067 1119724 1120037 1122457 1124968 1126685 1128405 1131051 1134602 1138758 1143556 1148756 1153605 1157990 1163052 1169740
63053 1169740 1177187 1183390 1187329 1189813 1192406 1196043 1200618 1205516 1210506 1216083 1222639 1229397 1234826 1238331
63039 1238331 1240864 1243578 1246621 1249654 1252684 1255699 1258171 1259789 1261272 1263646 1267020 1270784 1274700 1279027
63025 1279027 1283815 1288809 1293923 1299230 1304730 1310757 1318371 1328595 1341390 1355977 1371963 1389401 1407971
63012 1407971 1427015 1446452 1466908 1488873 1512395 1537581 1564565 1592831 1621532 1650898 1682614
63001 1682614 1718180 1757297 1798379 1840421 1884004 1930668 1981537 2036343 2093531 2151593 2210619
62990 2210619 2272362 2338415 2408360 2479888 2550694 2620004 2688461 2757083 2826645 2897652 2970051
62979 2970051 3042721 3113854 3182500 3249505 3316374 3383495 3450269 3516775 3583927 3651435 3716658
62968 3716658 3776434 3829371 3875304 3912967 3939372 3951614 3948530 3930669 3899351 3855919 3801399
62957 3801399 3736903 3664623 3587907 3509622 3430827 3351962 3274933 3202808 3137563 3079465 3028757
62946 3028757 2986398 2952548 2925860 2905502 2892940 2890436 2898234 2914366 2936935 2965359 2999198 3036812
62934 3036812 3075863 3114988 3154677 3196386 3240774 3286806 3332714 3377441 3420631 3461495 3498788
62923 3498788 3532071 3561717 3586928 3604834 3612578 3609538 3596337 3572342 3535673 3485456 3422626 3348449
62911 3348449 3263663 3169418 3067957 2961859 2853406 2744784 2637783 2533037 2430717 2332327
62901 2332327 2240476 2156200 2077804 2003223 1932410 1866399 1805307 1748758 1697247 1651333 1609993
62890 1609993 1571564 1535967 1504289 1476214 1449755 1423717 1398715 1375313 1352896 1331077 1310642
62879 1310642 1292155 1274953 1258407 1242860 1228322 1213600 1197983 1182479 1167862 1152685 1135180
62868 1135180 1116405 1099338 1085058 1071850 1058244 1045054 1033831 1024820 1017133 1009737 1001676 992464
62856 992464 983004 975216 969990 966141 961857 956525 950681 944947 939708 935282 931851 929364 927585 925821
62842 925821 922752 917567 911321 906091 902441 898887 894336 889771 886648 884751 882777 880281 877887 876095
62828 876095 874930 874283 873701 872289 869899 867926 867790 868854 868995 867169 864316 861760 859851 858442 857558
62813 857558 857024 856163 854563 852894 852461 853938 856611 858821 859227 857794 855482 852889 849579 845001 839702
62798 839702 835115 832284 831069 830412 829158 826911 824464 823077 823133 823827 824270 824187 823387 821639 819758 819632
62782 819632 821946 824635 825017 823105 821437 821885 824077 826899 829939 833012 835552 837282 838692 840290 841928
62767 841928 843227 844135 844884 845872 847598 850035 852159 853050 853501 855466 859650 864695 869056 872496 875183
62752 875183 876694 877103 878170 881909 888132 894599 899667 903787 908133 912779 917106 921683 928736 940168
62738 940168 955505 972466 989604 1007617 1027754 1049751 1072306 1095238 1120130 1148769 1181745
62727 1181745 1218637 1258751 1301500 1346766 1395255 1447964 1505060 1565789 1629579 1696835 1768695
62716 1768695 1846592 1931933 2025274 2125611 2231219 2341229 2455518 2572785 2689881 2803687
62706 2803687 2912944 3017524 3116317 3206349 3283656 3344758 3387762 3412376 3418653 3405926 3373719
62695 3373719 3323473 3258113 3179696 3088828 2986997 2877992 2765829 2652257 2537525 2422773
62685 2422773 2310098 2200685 2094541 1992294 1895971 1807339 1726158 1650608 1579205 1512079
62675 1512079 1450635 1396133 1348499 1306383 1268192 1232868 1199878 1169079 1140741 1115231 1092458
62664 1092458 1072076 1054254 1039568 1028023 1019017 1012510 1009212 1009033 1010333 1011654 1013516 1017656 1025022
62651 1025022 1035398 1048479 1064272 1082627 1103332 1126642 1153165 1183289 1217175 1255010 1296872
62640 1296872 1342834 1393568 1450141 1512523 1579143 1648912 1723059 1803727 1891215 1983794 2079953
62629 2079953 2179461 2282157 2386817 2491351 2593133 2688990 2775792 2851330 2914104 2962418
62619 2962418 2994500 3009435 3007123 2987528 2950926 2898774 2833234 2755810 2667594 2570824 2468885
62608 2468885 2364364 2258223 2151321 2045587 1943119 1845079 1752069 1664661 1582826 1505683
62598 1505683 1432577 1363784 1299592 1239529 1183360 1132124 1087155 1048374 1014325 983566 955195
62587 955195 928359 902218 876456 851190 826428 802258 779518 759489 742657 728279 715351
62576 715351 703495 692644 682409 672359 662754 654411 647721 642198 637242 632928 629524 626463 622572
62563 622572 617540 612524 608958 607391 607997 611356 617561 624885 630774 634576 638312 644321 652938 662943
62549 662943 673305 683604 693452 702787 712723 725051 740446 757720 775278 792913 811813 833169
62537 833169 857425 884867 916201 952024 992052 1035485 1082002 1131749 1184336 1238656 1294005
62526 1294005 1350723 1409281 1469374 1530340 1591569 1651481 1706796 1754083 1791980 1820858 1840603
62515 1840603 1849990 1848274 1836047 1814180 1783152 1744014 1698881 1649648 1596962 1541185 1483655 1426160
62503 1426160 1369742 1314818 1262076 1212424 1166236 1123310 1083419 1046462 1012286 980800 952028
62492 952028 925680 901084 878034 857274 839467 823907 808946 793555 777858 762327 747248
62481 747248 733107 720777 710853 703028 696346 690051 684179 679555 677201 677634 680629 685597 691959 699063
62467 699063 706144 712776 719358 726902 736341 748094 762089 777933 795105 813288 832707 854204
62455 854204 878879 907395 939412 973994 1010867 1051045 1095726 1144744 1196621 1249954 1303987
62444 1303987 1358013 1411264 1463642 1515531 1566250 1613512 1654926 1689238 1715532 1732185 1737781
62433 1737781 1732608 1718292 1696368 1668068 1634975 1598434 1558260 1513228 1463362 1410969 1359059
62422 1359059 1309283 1261700 1216008 1172574 1132490 1096886 1066044 1039144 1015008 993012 973076
62411 973076 955024 938374 922739 908070 894576 882638 872585 864274 857123 850824 845631 841582
62399 841582 838097 835005 833350 834178 836994 840478 844398 849396 855020 859632 862744 865969 870843 876922
62385 876922 882963 888949 895694 903140 910297 916569 921987 926162 927924 926226 920902 912651 902651 891834
62371 891834 879918 865537 848042 828918 810569 793986 778578 764133 751584 741458 732731 724021
62359 724021 715246 707447 701455 697379 694994 694074 694574 696876 701443 707862 714818 721654 729441 739568
62345 739568 751644 763811 774966 785538 795930 805512 813809 821772 830951 841871 853925 866348
62333 866348 878515 889734 899707 909050 918424 927198 933923 938285 941548 944661 946907 947214 946087 945270
62319 945270 945709 946808 947786 949073 952068 957945 966893 978326 991727 1007520 1027111 1051772 1081457
62306 1081457 1114995 1151508 1191265 1235193 1284090 1338546 1399013 1465344 1536591 1611902 1691410
62295 1691410 1775481 1862975 1950935 2036188 2116608 2190630 2256418 2312287 2357352 2390885 2411488
62284 2411488 2418036 2411401 2394138 2368151 2333496 2289748 2237579 2178540 2114180 2046072 1976000 1905394
62272 1905394 1835168 1766683 1702031 1642402 1586909 1534090 1483966 1437397 1394028 1352542 1312826
62261 1312826 1276343 1244147 1215892 1190919 1168727 1148124 1127675 1107789 1090820 1078152 1068652
62250 1068652 1060934 1055543 1053328 1053063 1052641 1051849 1051993 1053164 1053838 1053118 1051561 1049648 1047145 1044322 1042222
62235 1042222 1041059 1039750 1037704 1035871 1035202 1035228 1035206 1035834 1038697 1044368 1051937 1060085 1067905 1075031 1081803
62220 1081803 1089298 1098447 1109059 1120055 1130742 1141548 1153478 1167040 1181790 1197031 1213092 1231637
62208 1231637 1254139 1280166 1307998 1337100 1369027 1405372 1445893 1489732 1537814 1592520 1654926
62197 1654926 1723518 1795936 1870919 1948045 2026678 2106169 2186374 2266562 2343609 2412335 2468278
62186 2468278 2509910 2537965 2553336 2556159 2546471 2524894 2492573 2450899 2401258 2344666 2281797 2213977
62174 2213977 2143960 2074810 2007826 1942472 1878634 1818026 1762727 1713177 1668515 1628203 1592362
62163 1592362 1561092 1534576 1513368 1497271 1484205 1471698 1459629 1450134 1444545 1441786 1440132 1439064
62151 1439064 1438668 1438692 1439283 1441396 1445169 1448935 1451491 1454586 1461323 1472265 1484863 1496805 1508214 1520126
62137 1520126 1532599 1545443 1559621 1576528 1596384 1618407 1642234 1668141 1696087 1725704 1757378
62126 1757378 1792333 1831026 1871998 1912924 1952539 1991129 2029198 2066120 2100203 2129946 2155314
62115 2155314 2178059 2200696 2224795 2250059 2275294 2300421 2327369 2358794 2396005 2438221 2483648
62104 2483648 2531060 2580494 2632678 2687682 2743869 2798238 2848011 2891753 2928794 2958100 2978469
62093 2978469 2989813 2993448 2990811 2982415 2968324 2949003 2925137 2897103 2865361 2831345 2797423 2765808
62081 2765808 2737667 2713072 2691405 2671836 2653938 2638178 2625767 2617861 2614829 2616077 2620394 2626445
62069 2626445 2633152 2639930 2646903 2655128 2666310 2681728 2701222 2723509 2747538 2773214 2800708 2829687
62057 2829687 2859647 2890687 2923512 2958856 2997219 3038802 3083178 3129209 3175851 3223037 3271374
62046 3271374 3321106 3371907 3423705 3477116 3532772 3590543 3649683 3709711 3771139 3835385 3903726
62035 3903726 3976027 4050667 4125996 4201654 4277917 4353967 4427663 4497465 4564130 4630175 4697979
62024 4697979 4768654 4842274 4918468 4996637 5075875 5154970 5232679 5308244 5381823 5454365 5527014
62013 5527014 5600631 5675661 5752097 5829480 5907355 5985978 6066319 6149035 6233557 6318531 6403075
62002 6403075 6487260 6571229 6654210 6734677 6811268 6883011 6948557 7005882 7053502 7091912 7123157
61991 7123157 7148745 7168469 7181391 7187149 7185706 7176562 7159407 7135435 7107022 7075907 7042565 7007450
61979 7007450 6971808 6936657 6901815 6866804 6832229 6799389 6768741 6739543 6710923 6682630 6654825
61968 6654825 6627926 6602837 6580563 6561130 6543254 6525554 6507818 6490718 6474501 6458570 6442463
61957 6442463 6426792 6412836 6401292 6391867 6384194 6378687 6376056 6376067 6377383 6378784 6380156 6381989 6384358 6387020
61943 6387020 6390395 6395740 6403998 6414656 6425950 6435996 6443574 6448026 6448791 6445193 6436494 6421912 6400650
61930 6400650 6372178 6336623 6294639 6246654 6192541 6132490 6068111 6002031 5936222 5871178 5806813
61919 5806813 5743341 5680756 5618206 5554963 5491900 5431125 5373968 5319867 5267280 5215158 5163508
61908 5163508 5113134 5064968 5019145 4974620 4930288 4886513 4844913 4806449 4770526 4736250 4703609
61897 4703609 4672840 4643546 4615427 4589339 4566568 4547300 4530731 4516487 4505025 4496732 4491646 4490010
61885 4490010 4491966 4496533 4502191 4509112 4519695 4535921 4557052 4581081 4607832 4639050 4675450 4715267
61873 4715267 4756446 4799210 4845390 4895788 4949339 5004900 5062786 5124060 5189015 5257186 5328735
61862 5328735 5405080 5487892 5577894 5675182 5780680 5896986 6027713 6176122 6344233 6532875
61852 6532875 6742353 6973361 7227849 7509267 7821784 8168887 8552541 8973818 9434330
61843 9434330 9936861 10484520 11079484 11722607 12413613 13150652 13929135 14740740 15572565
61834 15572565 16405565 17212830 17960130 18609772 19125678 19477165 19641686 19608006 19378938
61825 19378938 18971096 18411073 17730289 16960756 16132314 15271252 14400209 13538429 12701352
61816 12701352 11900013 11141617 10430925 9770708 9161184 8600380 8085909 7615964 7188405
61807 7188405 6799857 6446719 6126693 5838514 5580373 5349295 5141909 4955179 4786597
61798 4786597 4634559 4498748 4379489 4276337 4187557 4111096 4045640 3990545 3945191 3908835
61788 3908835 3880828 3860388 3845980 3835343 3826518 3818714 3811739 3804625 3795504 3783133 3767882 3750546
61776 3750546 3730946 3708924 3686470 3667209 3653247 3643708 3637075 3633727 3635122 3641493 3651692 3664721
61764 3664721 3679949 3696115 3711518 3725309 3737473 3747519 3754363 3757658 3758094 3756120 3751630 3745584 3740924
61751 3740924 3741008 3747525 3760415 3779187 3803723 3834416 3872372 3919330 3976764 4045052 4123741 4212399
61739 4212399 4311000 4419920 4540013 4672538 4818574 4978515 5152234 5339598 5540705 5755971
61729 5755971 5986249 6232895 6497813 6783655 7093716 7430959 7797151 8193544 8622663
61720 8622663 9088906 9597308 10152457 10758862 11421671 12146530 12939265 13805962 14752587
61711 14752587 15783795 16902352 18109670 19405604 20786257 22241525 23753957 25297579
61703 25297579 26835366 28317675 29684716 30872045 31816049 32459747 32761189 32702424 32292906
61694 32292906 31564797 30564690 29347055 27969684 26488785 24954214 23407276 21881252
61686 21881252 20402258 18989277 17654554 16405128 15244408 14172684 13187297 12283596
61678 12283596 11456415 10700828 10011903 9384465 8813456 8294354 7822902 7394630 7004974
61669 7004974 6649814 6325648 6029285 5757804 5508883 5280705 5071295 4878288 4699578
61660 4699578 4533823 4379821 4235598 4098631 3967126 3840813 3720395 3606380 3498445
61651 3498445 3395751 3297782 3204835 3117565 3035964 2958971 2885326 2814784 2748297 2686946 2630760
61640 2630760 2578512 2528600 2480143 2433262 2388284 2344947 2302712 2261737 2222898 2186558 2151819
61629 2151819 2117454 2083349 2050524 2019817 1990971 1963003 1935168 1907520 1880747 1855455 1831513
61618 1831513 1808250 1785433 1763847 1744591 1727970 1713356 1699995 1687590 1676191 1665851 1656380
61607 1656380 1647063 1636715 1624422 1610368 1595600 1580939 1566386 1551628 1536751 1522257 1508679
61596 1508679 1496477 1486154 1478159 1472603 1469137 1467151 1466116 1465821 1466395 1468119 1471176 1475433 1480329 1485048
61582 1485048 1489047 1492532 1496226 1500521 1505012 1509005 1512408 1515912 1520372 1526160 1532994 1540222 1547280 1554083
61568 1554083 1561036 1568593 1576686 1584626 1591591 1597296 1602097 1606214 1608892 1608721 1605050 1598698 1590834 1581481
61554 1581481 1569872 1556126 1541642 1527474 1513036 1497038 1479293 1461099 1443998 1428569 1414301
61543 1414301 1400379 1386615 1373686 1362312 1352395 1343407 1335548 1329821 1326749 1325673 1325541 1325729 1325851 1325677
61529 1325677 1325836 1327843 1332683 1339904 1348751 1359491 1372653 1387554 1402732 1417734 1433564 1451446
61517 1451446 1472024 1495747 1523164 1554477 1589146 1626030 1663819 1701817 1740718 1782075 1826492
61506 1826492 1872989 1920834 1971053 2024790 2080702 2135517 2187057 2235344 2280871 2323501 2363432
61495 2363432 2401615 2438423 2473109 2505329 2536104 2566342 2595296 2621459 2644372 2664537 2682008
61484 2682008 2696101 2706432 2713392 2717342 2717756 2713558 2704513 2692274 2679618 2668206 2657405 2645902
61472 2645902 2634074 2623771 2616027 2610360 2606589 2606013 2610082 2618949 2632244 2650610 2675555 2708069 2747905
61459 2747905 2793943 2845074 2901309 2964358 3036636 3119614 3213714 3319648 3438634 3571128 3716769
61448 3716769 3876172 4051318 4243360 4451550 4675524 4917237 5178936 5460137 5758212
61439 5758212 6071033 6396845 6731515 7067456 7395223 7704827 7985793 8227960 8423066
61430 8423066 8564951 8648855 8672486 8638296 8553269 8425689 8262920 8072191 7861588 7639022
61420 7639022 7410965 7182860 6959823 6746013 6543914 6354957 6180380 6021199 5878225
61411 5878225 5752775 5646623 5560467 5492992 5442099 5406518 5385647 5378736 5385372 5406339 5442671
61400 5442671 5493529 5555658 5625166 5699550 5778175 5861364 5949098 6040223 6132817 6225278 6316781
61389 6316781 6406617 6493790 6577769 6659084 6738421 6815520 6889765 6961598 7032245 7101892 7168975
61378 7168975 7231583 7288818 7340399 7385669 7423741 7454374 7478173 7496088 7509065 7517942 7522987 7523467
61366 7523467 7518157 7506622 7489739 7468742 7443985 7414991 7381621 7344807 7306132 7267084 7228907
61355 7228907 7192632 7158691 7126643 7095929 7067016 7041343 7019930 7002313 6986945 6972195 6956756
61344 6956756 6939521 6919659 6896878 6871531 6844596 6817500 6791511 6767132 6744610 6725393 6712570
61333 6712570 6709374 6717766 6739142 6775869 6830919 6905960 7000829 7115267 7250465 7408587 7591440
61322 7591440 7799959 8034300 8293751 8576779 8881456 9205402 9544912 9894518 10247678
61313 10247678 10597299 10934947 11250049 11530799 11766296 11948157 12071191 12133596 12136431 12082256
61303 12082256 11974336 11817280 11617453 11381408 11114013 10819092 10501781 10168958 9827265
61294 9827265 9482032 9138472 8802283 8477696 8165707 7865577 7577849 7304932 7049054
61285 7049054 6810885 6590388 6387982 6204255 6039000 5891202 5759898 5644740 5545646 5462145
61275 5462145 5393321 5338581 5298254 5273044 5262765 5265871 5280364 5304906 5338864 5381565 5431727
61264 5431727 5487546 5547306 5610029 5675356 5742386 5808768 5871608 5929354 5982084 6029901 6072089
61253 6072089 6108344 6139785 6167725 6191984 6211363 6225430 6234894 6240289 6241039 6235698 6222504 6199967
61241 6199967 6167757 6127275 6080870 6030377 5976524 5919328 5858592 5794331 5727270 5658608 5588907
61230 5588907 5517807 5445526 5374038 5305815 5241779 5181404 5124392 5071238 5022568 4979119 4942065
61219 4942065 4911970 4887326 4865325 4844126 4823342 4802558 4781017 4759003 4737860 4717940 4697822
61208 4697822 4676272 4653965 4632659 4613790 4598653 4588894 4585778 4589440 4599480 4615773 4638319 4667086
61196 4667086 4702535 4745597 4796759 4855918 4923532 5000953 5089153 5188001 5297146 5416465 5545003
61185 5545003 5680448 5820028 5960474 6096267 6219388 6321963 6398125 6442603 6449735 6416163
61175 6416163 6343601 6236869 6099928 5935885 5750129 5550640 5344526 5136087 4928673 4726375
61165 4726375 4532763 4349271 4176036 4013574 3862751 3723769 3596146 3479512 3373823
61156 3373823 3278868 3193982 3118274 3050993 2991614 2939532 2893825 2853726 2819453 2791961 2771550
61145 2771550 2757249 2748010 2743886 2745390 2752219 2763351 2777997 2795810 2816558 2840191 2866555 2894300
61133 2894300 2920658 2943225 2961323 2974884 2983046 2985426 2984004 2981737 2979252 2974429 2965300 2951801 2934566
61120 2934566 2913771 2889774 2863455 2835105 2804009 2769781 2733188 2695060 2655272 2613348 2569267
61109 2569267 2523163 2475046 2425382 2375215 2325139 2274812 2224001 2173489 2124440 2077384 2032252
61098 2032252 1988855 1946941 1906367 1867657 1831835 1799384 1769925 1743147 1719244 1697782 1676776
61087 1676776 1653604 1626688 1596048 1562834 1528879 1496241 1466383 1439626 1415475 1393225 1372255
61076 1372255 1352311 1333895 1318066 1305465 1295703 1287845 1281351 1276465 1273975 1274574 1278185 1283894 1290824
61063 1290824 1298981 1308990 1321231 1335663 1352139 1370219 1388896 1407248 1425333 1443815 1462912
61052 1462912 1482369 1502190 1522395 1542156 1560202 1576149 1590571 1603710 1615075 1624269 1631137 1634923
61040 1634923 1634388 1629137 1620041 1608278 1594900 1581303 1568776 1557139 1544993 1531821 1518822 1507285
61028 1507285 1497235 1488168 1479952 1472239 1463978 1454351 1443604 1432395 1421043 1409828 1399265 1389605
61016 1389605 1380714 1372592 1365140 1357352 1348080 1337952 1329198 1323052 1318696 1315239 1313005 1311903 1310211 1306520
61002 1306520 1301782 1298069 1296244 1296092 1297740 1301498 1306994 1313774 1321972 1331202 1339703 1346133 1351614 1358512
60988 1358512 1367579 1377614 1387475 1397137 1407165 1418489 1432318 1449061 1467675 1487169 1508108 1531257
60976 1531257 1555426 1578517 1600550 1623829 1649969 1678379 1708065 1739462 1773836 1811942 1853871
60965 1853871 1899534 1948790 2001544 2057807 2117275 2179013 2242161 2306863 2373974 2444252 2518372
60954 2518372 2597166 2680942 2769029 2860996 2958007 3062115 3174633 3296128 3427448 3569626
60944 3569626 3723104 3887964 4064354 4251699 4448328 4653407 4868855 5098349 5345506
60935 5345506 5614582 5911609 6242192 6608427 7010240 7449617 7931609 8462207 9048649
60926 9048649 9702189 10437627 11269644 12212447 13283355 14503567 15895372 17483061 19297597
60917 19297597 21375466 23751838 26460001 29530402 32955450 36612157 40209446 43350185
60909 43350185 45704378 47167690 47879765 48111799 48143047 48205523 48458094 48924581 49426283
60900 49426283 49610770 49109343 47721272 45489110 42632956 39426174 36105442 32839758
60892 32839758 29732947 26837330 24172761 21745067 19555086 17598461 15864661 14339200
60884 14339200 13005668 11845383 10837156 9958858 9189462 8510471 7907019 7368066 6884960
60875 6884960 6449875 6055961 5698216 5372979 5076678 4805836 4557846 4330565 4121095
60866 4121095 3925792 3741542 3566516 3399942 3241747 3092123 2950742 2816608 2689211
60857 2689211 2569328 2457858 2354316 2257400 2166662 2082497 2004678 1932163 1864518 1802323 1745677
60846 1745677 1693216 1643308 1595762 1551813 1512647 1478245 1447422 1418643 1390893 1363971 1338084
60835 1338084 1313317 1289623 1267226 1246840 1229496 1215997 1206127 1198322 1190676 1182584 1175073 1169260
60823 1169260 1165014 1161460 1158146 1155052 1151909 1148281 1144085 1139339 1133564 1126048 1116626 1105691 1093689
60810 1093689 1081142 1068869 1057436 1046507 1035444 1024449 1014447 1005897 998489 991984 986560 982217
60798 982217 978603 975688 974025 974147 976245 980532 987151 995486 1004356 1013443 1023850 1036705 1051741 1068052
60784 1068052 1085849 1106473 1130570 1156935 1183426 1208494 1231565 1252456 1271048 1287470 1302026
60773 1302026 1314829 1325860 1335553 1344828 1354018 1361988 1366950 1368275 1367026 1364611 1361509 1357640 1353377
60760 1353377 1349449 1345939 1341956 1336381 1328712 1319265 1308900 1298546 1288672 1279125 1269504 1259489 1248706
60747 1248706 1236718 1223594 1210133 1196867 1183106 1167854 1151736 1137044 1125365 1115923 1106995 1098329
60735 1098329 1091163 1086110 1082303 1078962 1076730 1076617 1078338 1080773 1083802 1088539 1095634 1104420 1114100 1124801
60721 1124801 1136779 1149513 1162542 1176509 1192107 1208388 1223588 1237693 1252754 1270074 1288280
60710 1288280 1304993 1319623 1333655 1348687 1365016 1381780 1397764 1412240 1425566 1438821 1452457
60699 1452457 1465504 1476466 1484593 1489971 1492929 1494050 1494427 1495104 1496292 1497597 1498754 1499666 1500025 1499570 1498591
60684 1498591 1497505 1496066 1493621 1489976 1485303 1479275 1471181 1461064 1450006 1438872 1427255 1414026 1398772
60671 1398772 1382540 1367285 1354404 1343449 1332490 1320281 1307963 1297980 1291320 1286561 1281784 1276696
60659 1276696 1272508 1270330 1270221 1271404 1272947 1274401 1276053 1278372 1281113 1283343 1284434 1284522 1283745 1281725 1278301
60644 1278301 1274239 1270493 1267129 1263726 1260526 1258184 1256364 1253600 1249021 1243541 1238720 1234915 1231124 1226307
60630 1226307 1220140 1212584 1203542 1193179 1182077 1170678 1158834 1146098 1132268 1117431 1101829 1085960
60618 1085960 1070518 1055866 1041764 1027963 1014899 1003322 993364 984424 976030 968482 962624 959272
60606 959272 958682 960156 962290 964238 966746 971314 978285 986496 994967 1004003 1014055 1024304 1033324 1040832
60592 1040832 1047960 1055862 1064718 1074121 1083835 1094048 1105150 1117205 1129344 1139840 1147325 1152064 1155817
60579 1155817 1160428 1166604 1173684 1180295 1185610 1190551 1197562 1208473 1222582 1237422 1251367 1264884 1279109
60566 1279109 1294100 1308987 1323290 1337409 1351902 1366864 1382124 1397677 1413527 1429012 1442448
60555 1442448 1451869 1456457 1457238 1456127 1454287 1451557 1447323 1441564 1434991 1428496 1422647 1417532 1412843 1408065
60541 1408065 1402623 1395927 1387595 1377829 1367352 1356600 1345101 1332115 1317926 1304029 1291846 1281579
60529 1281579 1272602 1264679 1258383 1254436 1252998 1253688 1256025 1259606 1264022 1268892 1274122 1279908 1286263 1292591
60515 1292591 1298078 1302622 1307078 1312408 1318739 1325480 1332139 1338636 1344894 1350610 1355648 1360380 1365315 1370531
60501 1370531 1375747 1380947 1386585 1392997 1399836 1406358 1412142 1417166 1421304 1424297 1426401 1428541 1431484 1435356
60487 1435356 1440463 1448001 1459041 1473000 1488202 1504302 1523442 1548611 1581312 1621027 1666273 1715759
60475 1715759 1769068 1826712 1889094 1954813 2020120 2080363 2131825 2172114 2199465 2212461 2210492
60464 2210492 2194358 2166637 2131609 2094148 2058059 2025432 1997596 1975923 1961185 1952683 1948893 1948840
60452 1948840 1952299 1958977 1968436 1980965 1997786 2019976 2047408 2079040 2114183 2153355 2197934 2249050
60440 2249050 2306989 2371720 2443731 2524006 2613531 2713493 2825868 2952877 3095540 3253395
60430 3253395 3425776 3612529 3813283 4027175 4254192 4496194 4755952 5035930 5338720
60421 5338720 5667660 6025291 6410318 6815488 7226946 7624518 7983532 8278538 8487021
60412 8487021 8591530 8581520 8456188 8225844 7909115 7527855 7103856 6657742 6207483 5766409
60402 5766409 5343110 4943226 4570544 4226750 3911759 3624990 3365810 3132833 2923898
60393 2923898 2737029 2570724 2423226 2292273 2175643 2071277 1977120 1891774 1815133 1747294
60383 1747294 1686788 1631055 1578810 1530817 1488152 1450646 1417188 1386497 1357322 1328904 1301602
60372 1301602 1276311 1253156 1231641 1211973 1194950 1180382 1166853 1153462 1140710 1129331 1119349
60361 1119349 1110539 1102665 1095021 1087050 1079727 1074827 1072322 1070008 1066451 1062763 1060576 1059807 1059625 1060237 1062203
60346 1062203 1064968 1067513 1069801 1072376 1075191 1077970 1081023 1084555 1087964 1091008 1094853 1100536 1107056 1112606
60332 1112606 1117357 1123347 1131536 1140440 1148019 1153856 1159115 1165034 1171729 1177942 1182023 1183656 1184414 1186029
60318 1186029 1188372 1189813 1189291 1187297 1184999 1183121 1181538 1179336 1175450 1169848 1163902 1159061 1155576 1153148
60304 1153148 1152284 1153955 1157967 1162603 1166158 1168467 1171030 1175911 1184101 1194439 1204453 1212672 1219708 1226878
60290 1226878 1234631 1242969 1252373 1263178 1274650 1285843 1296882 1308322 1319694 1329952 1339060 1347950
60278 1347950 1356999 1365583 1372977 1378765 1382683 1385155 1387663 1391412 1395830 1399583 1402826 1407154 1413444 1421109
60264 1421109 1429376 1437836 1445555 1451119 1453948 1454362 1452146 1446381 1437220 1426660 1416884 1408617 1401388 1394505
60250 1394505 1387486 1380446 1374325 1369870 1366280 1361928 1356585 1351844 1349094 1348166 1348067 1347766 1346064 1342237 1337353
60235 1337353 1333588 1331661 1330210 1328196 1326312 1325392 1325163 1325641 1327978 1332346 1336416 1337865 1337625 1338962 1343919
60220 1343919 1352138 1362541 1374439 1387340 1401245 1417149 1435876 1456451 1476744 1495627 1513388
60209 1513388 1530310 1546335 1562203 1579394 1598435 1618296 1638032 1658192 1680195 1704982 1732694
60198 1732694 1763112 1795976 1831272 1869494 1911408 1957480 2007685 2061703 2119026 2179257 2242873
60187 2242873 2311518 2386932 2469786 2560009 2657778 2763384 2876620 2997426 3126969 3266846
60177 3266846 3417049 3575701 3740948 3912010 4088114 4267562 4448381 4628869 4806760
60168 4806760 4978658 5141151 5291925 5429112 5550180 5652587 5735363 5799284 5845431 5874243
60158 5874243 5886085 5882224 5864907 5836702 5800013 5757350 5711906 5667394 5626896 5592073 5564090
60147 5564090 5545256 5539030 5548172 5573399 5614136 5670087 5741809 5830316 5936402 6059752 6198304
60136 6198304 6349055 6509822 6679425 6855404 7032324 7203388 7363457 7509656 7639589
60127 7639589 7750348 7839304 7904568 7944290 7956761 7942012 7902597 7841937 7762297 7665151 7553291
60116 7553291 7431779 7306649 7182921 7063894 6952004 6850228 6762533 6692823 6643463 6615068
60106 6615068 6607567 6620938 6654832 6708230 6779890 6868539 6971934 7086032 7205678 7326056 7443273
60095 7443273 7554013 7655426 7745197 7821259 7881687 7925594 7954074 7969726 7975410 7974032 7969104
60084 7969104 7964427 7963284 7968992 7986288 8020737 8076040 8152936 8251601 8374190 8524108 8703548
60073 8703548 8913077 9153381 9426256 9733779 10077248 10456916 10872025 11321066 11802558
60064 11802558 12315285 12856782 13421451 14000943 14586564 15170559 15744907 16299875 16824497
60055 16824497 17308159 17741412 18115850 18423944 18659016 18815186 18887603 18873207 18771573 18585341
60045 18585341 18320250 17984715 17588967 17144368 16663581 16160778 15650579 15146081 14657855
60036 14657855 14194392 13762601 13367771 13013998 12705194 12445090 12235725 12076368 11964271
60027 11964271 11895878 11867003 11872686 11907722 11966854 12043723 12130196 12217751 12299380 12369533 12422939
60016 12422939 12455043 12463752 12449420 12412481 12352061 12267535 12160520 12034170 11890645 11730140
60006 11730140 11552435 11358704 11151517 10933661 10707637 10476305 10243335 10012451 9786339
59997 9786339 9566843 9356333 9158326 8976415 8812985 8669421 8547183 8448086 8373737 8325260
59987 8325260 8303336 8307887 8337834 8391885 8469476 8570217 8692405 8832882 8988234 9155049
59977 9155049 9328760 9503444 9673340 9833631 9979108 10103367 10200713 10268380 10305773 10312076
59967 10312076 10285879 10226829 10136282 10016332 9869601 9700233 9513890 9316342 9112969 8909720
59957 8909720 8712929 8527220 8354682 8196989 8057410 7939624 7845405 7774788 7728020 7706044
59947 7706044 7709348 7737790 7791631 7871543 7977395 8108127 8263031 8441979 8643882 8865867
59937 8865867 9104400 9355988 9615753 9876162 10128594 10366074 10583710 10776779 10939802
59928 10939802 11067954 11158622 11210907 11223949 11196417 11127839 11020316 10878869 10710270 10521549
59918 10521549 10319496 10110970 9903039 9702521 9515492 9347140 9201508 9081007 8986419
59909 8986419 8917842 8875836 8861776 8877158 8922389 8995775 9093717 9212418 9349649 9504427 9674834
59898 9674834 9856870 10045770 10237694 10429472 10617537 10798397 10970008 11131551 11281734
59889 11281734 11418555 11541242 11651540 11752431 11846403 11935947 12025179 12119646 12224368 12343091
59879 12343091 12479963 12641034 12833138 13061528 13329312 13638804 13992087 14389658 14829349
59870 14829349 15307362 15819632 16360824 16921658 17487742 18041005 18561770 19030133 19427281
59861 19427281 19737064 19946642 20046260 20030050 19898278 19658359 19322877 18906772 18426382 17899465
59851 17899465 17343959 16776030 16209621 15657246 15129798 14635370 14179209 13765134 13396380
59842 13396380 13075174 12802654 12579800 12407703 12286346 12213653 12186414 12201852 12257862 12351849
59832 12351849 12479749 12636082 12814432 13007495 13206660 13401847 13582167 13736730 13854524
59823 13854524 13923953 13934148 13878259 13755477 13569305 13324335 13025499 12679711 12296318 11885207
59813 11885207 11455227 11014632 10571939 10135442 9712050 9306587 8921608 8557936 8216386
59804 8216386 7899313 7609695 7348484 7113871 6903570 6716733 6553034 6411100 6288996
59795 6288996 6185501 6099491 6028275 5967592 5913351 5862818 5814442 5767380 5721171 5675356 5629492
59784 5629492 5584048 5540925 5502213 5468366 5438040 5409441 5381088 5351351 5318221 5280051 5236215
59773 5236215 5186861 5132369 5073305 5010813 4947049 4885171 4828362 4778294 4734504 4695648 4661204
59762 4661204 4631735 4607854 4589603 4576730 4568972 4566010 4567816 4575343 4590533 4615289 4650380 4695123
59750 4695123 4747842 4806726 4870701 4939651 5013694 5092347 5174663 5260028 5348308 5438927 5529932
59739 5529932 5618066 5699870 5773094 5837437 5893965 5943729 5987165 6025079 6059924 6095535 6135446
59728 6135446 6181547 6234340 6294403 6363803 6446219 6545512 6664055 6802824 6963148 7147667
59718 7147667 7359069 7598657 7867141 8166550 8500241 8870842 9278865 9723329 10202565
59709 10202565 10713239 11247911 11792534 12324992 12815939 13232998 13547261 13739169 13801622
59700 13801622 13740375 13572156 13320519 13010557 12665044 12303400 11942047 11594332 11270187
59691 11270187 10976588 10718489 10499215 10320291 10181570 10081855 10019592 9993380 10002181 10045096
59681 10045096 10121028 10229038 10369082 10541709 10746665 10982518 11248472 11546014 11877759
59672 11877759 12245116 12648411 13089270 13571223 14097228 14667968 15283746 15946998 16661359
59663 16661359 17428871 18249841 19125220 20056959 21044983 22084979 23169734 24291041 25438909
59654 25438909 26600135 27759798 28904372 30022666 31104864 32143533 33136887 34090095
59646 34090095 35012406 35913311 36801182 37683422 38565530 39449256 40331653 41205191 42057945
59637 42057945 42874014 43634918 44321437 44915116 45399917 45764684 46005219 46124347 46130407 46036070
59627 46036070 45858069 45616785 45334967 45036051 44742674 44475621 44253370 44092290 44006960
59618 44006960 44010250 44113296 44325540 44654500 45105299 45680461 46379943 47200640 48135396 49172498
59608 49172498 50295497 51481831 52700382 53910632 55065000 56112259 56999567 57674252
59600 57674252 58087946 58202727 57996475 57465939 56627467 55514652 54172503 52650775 51000060
59591 51000060 49270337 47508783 45756175 44044831 42399402 40837868 39370410 37997603
59583 37997603 36710053 35489269 34309106 33139245 31951688 30727672 29461056 28157423
59575 28157423 26831157 25502064 24191337 22917511 21694342 20531322 19435101 18409955
59567 18409955 17457581 16577419 15767389 15024169 14343185 13719424 13148928 12629234 12157981
59558 12157981 11731532 11345517 10996370 10681491 10397946 10141970 9910048 9699660 9508438
59549 9508438 9333251 9170649 9017522 8870580 8725824 8579651 8430379 8277977 8122568
59540 8122568 7964070 7803065 7640829 7478300 7316065 7155714 7000260 6852493 6713426
59531 6713426 6582859 6461088 6349520 6249815 6162811 6088135 6024641 5971431 5928684 5897412 5878355
59520 5878355 5871150 5874305 5885596 5902866 5925335 5954268 5991539 6037250 6089404 6146044 6206687 6271196
59508 6271196 6338580 6408245 6481736 6561592 6648412 6740596 6837605 6942389 7059617 7192087 7339694
59497 7339694 7501412 7677093 7867328 8072886 8295058 8535909 8797330 9080124 9384667
59488 9384667 9711963 10062762 10435441 10825958 11230459 11646973 12073664 12506344 12938855
59479 12938855 13365352 13780742 14179304 14554902 14903322 15222967 15512076 15766237 15980088
59470 15980088 16151345 16282191 16376878 16439055 16471751 16479054 16467022 16442903 16413745 16385759 16364898
59459 16364898 16357932 16372739 16417103 16496865 16614689 16769947 16959140 17176116 17411869 17654326
59449 17654326 17888803 18099369 18270346 18386993 18435686 18404830 18286742 18078910 17783425 17405550
59439 17405550 16953278 16438077 15875171 15282095 14676107 14071947 13480930 12911344 12369571
59430 12369571 11861094 11390696 10961788 10575539 10230943 9926033 9659218 9429558 9236103
59421 9236103 9077595 8952998 8861878 8803762 8777353 8780825 8812901 8873329 8962395 9080386 9227475
59410 9227475 9403531 9607554 9837386 10090163 10363148 10653962 10959730 11275547 11593628
59401 11593628 11904277 12197878 12465597 12698077 12884593 13014902 13082226 13083862 13019219 12888485
59391 12888485 12693613 12439688 12134625 11787906 11409726 11010222 10598221 10180539 9762775
59382 9762775 9350377 8948531 8561459 8192440 7843994 7517224 7211334 6925005 6658444
59373 6658444 6413163 6189557 5985771 5799667 5631008 5480613 5347799 5229983 5125017
59364 5125017 5032853 4954278 4888774 4834543 4790391 4756626 4733810 4721241 4717100 4719909 4729493 4746636
59352 4746636 4772042 4805770 4847555 4897276 4954341 5016117 5077481 5133176 5181397 5225006 5269233
59341 5269233 5318586 5375743 5442194 5518899 5606632 5706383 5819087 5944115 6078240 6217274
59331 6217274 6359412 6506893 6664430 6836598 7026732 7237416 7471097 7730164 8016874
59322 8016874 8333422 8682141 9065717 9487179 9949473 10454841 11004693 11600244 12243296
59313 12243296 12936126 13680117 14474019 15313258 16190557 17096506 18018963 18942565 19850420
59304 19850420 20727395 21561986 22345566 23071239 23734276 24332940 24867938 25341181 25755254
59295 25755254 26112878 26415266 26660866 26846314 26968253 27023176 27005756 26908744 26725265 26451033
59285 26451033 26084920 25628916 25088253 24470828 23785776 23042843 22253147 21429528 20585042
59276 20585042 19730983 18876528 18029925 17199421 16392972 15617447 14878296 14179777 13525051
59267 13525051 12915762 12351816 11832151 11355848 10922134 10529434 10175318 9857659 9575030
59258 9575030 9325565 9106451 8915458 8751983 8615411 8503023 8410946 8337020 8281503 8244966
59248 8244966 8226565 8224404 8236546 8261383 8297722 8344504 8399879 8460918 8525085 8591517 8659707
59237 8659707 8727264 8790326 8846024 8893239 8931214 8959234 8977910 8989114 8994201 8993851 8990174 8987351
59225 8987351 8989284 8997822 9013972 9039555 9076882 9127993 9195112 9280620 9385489 9508470 9647550
59214 9647550 9801410 9968936 10148289 10336797 10530046 10720152 10896715 11051298 11180146
59205 11180146 11281586 11352509 11389575 11392891 11366130 11313294 11237361 11141968 11032062 10912066 10784920
59194 10784920 10653656 10522578 10395867 10275731 10162804 10057831 9962014 9875691 9797265 9723763
59184 9723763 9652439 9581728 9510932 9439602 9367849 9296896 9228385 9162993 9100521 9041617 8988649
59173 8988649 8944591 8911928 8893149 8891358 8909663 8950612 9016867 9111662 9237848 9397088 9590847
59162 9590847 9821520 10091733 10402946 10755516 11149527 11584316 12056996 12561684 13089646
59153 13089646 13629439 14167124 14686834 15171010 15600397 15955455 16219434 16380398 16430638
59144 16430638 16365805 16185979 15896813 15508425 15033574 14487614 13888824 13256427 12607649
59135 12607649 11957122 11318021 10701627 10115393 9562862 9046082 8567217 8127430 7725455
59126 7725455 7358354 7023557 6719630 6445224 6197902 5974566 5773014 5592509 5432316
59117 5432316 5290170 5163138 5049736 4950089 4864023 4790362 4728351 4678224 4639598 4610604 4589429
59106 4589429 4575568 4568865 4568741 4575400 4590445 4615001 4648245 4688725 4735807 4788751 4846218 4908422
59094 4908422 4978277 5058259 5147202 5242091 5341800 5446751 5556044 5667703 5781263 5897290
59084 5897290 6014334 6128720 6237474 6339326 6433059 6517326 6592164 6658037 6712970 6753256
59074 6753256 6777879 6789994 6793170 6788375 6775757 6757217 6735580 6712738 6690161 6670292 6656162 6650220
59062 6650220 6654133 6668969 6695219 6733583 6785860 6853846 6937386 7035259 7148095 7278287 7426469
59051 7426469 7590406 7768553 7962477 8174078 8402295 8644633 8900625 9171557 9457324
59042 9457324 9755414 10062586 10375814 10691501 11004951 11310630 11601988 11871059 12108834
59033 12108834 12305918 12452767 12540479 12562818 12517756 12406962 12234556 12006772 11731637 11417612
59023 11417612 11072483 10703740 10318848 9924002 9523216 9119818 8718592 8325433 7945047
59014 7945047 7579795 7230576 6897935 6582247 6283662 6002219 5737712 5489373 5256007
59005 5256007 5036553 4830521 4637966 4458995 4293099 4138951 3995071 3860568 3734994
58996 3734994 3617826 3508675 3407753 3315389 3231082 3153618 3081888 3014879 2951280 2890157 2831925
58985 2831925 2777512 2726620 2677951 2631131 2587098 2546421 2508576 2473170 2440591 2411086 2384404
58974 2384404 2360798 2341181 2325939 2314739 2307654 2304887 2305066 2305749 2306491 2309619 2316823 2326668 2336884
58961 2336884 2347500 2359775 2373160 2385433 2395414 2403679 2410742 2416142 2419533 2421488 2422938 2424566 2426790
58948 2426790 2429703 2433111 2437173 2442742 2450444 2459660 2469007 2477626 2485426 2492279 2497554 2500436 2500381 2497412
58934 2497412 2492177 2485504 2477826 2469293 2460428 2452177 2445254 2439928 2436299 2434325 2433920 2435772 2441544 2452127
58920 2452127 2466185 2481859 2499369 2519991 2542764 2564880 2585892 2608946 2636577 2667585 2699663
58909 2699663 2733073 2769641 2809490 2850887 2892563 2934474 2976994 3020844 3067173 3116457 3167926
58898 3167926 3221087 3276776 3335622 3396748 3459421 3524720 3593863 3666065 3740000 3816550 3898042
58887 3898042 3985438 4078336 4177287 4283802 4398146 4519236 4647007 4783080 4928618 5083110
58877 5083110 5245975 5418191 5601649 5797498 6005567 6225116 6456316 6701318 6963433
58868 6963433 7244730 7545012 7863706 8201972 8562208 8946623 9357449 9797564 10269367
58859 10269367 10773662 11311075 11884107 12496470 13150820 13848308 14589635 15375218 16204945
58850 16204945 17078934 17997429 18958023 19953523 20973976 22009601 23049259 24076540 25069706
58841 25069706 26005305 26859705 27607890 28224521 28688045 28982996 29099155 29032007 28785478
58832 28785478 28372049 27808777 27114475 26310931 25423397 24476767 23491590 22484889 21473258
58823 21473258 20472965 19497354 18555625 17653919 16796395 15985421 15221861 14505564 13835410
58814 13835410 13209387 12625351 12081539 11575901 11105282 10665854 10254379 9868895 9508434
58805 9508434 9172296 8859390 8568086 8296846 8044838 7811565 7595968 7396478 7212083
58796 7212083 7042842 6889114 6750510 6625675 6512998 6411631 6321937 6244669 6179639 6125847
58786 6125847 6083153 6052954 6036434 6032893 6040748 6059638 6090505 6134022 6189960 6257855 6337363 6428373
58774 6428373 6531700 6649159 6781826 6928713 7088527 7262288 7452617 7660629 7885266
58765 7885266 8125987 8384541 8663507 8964435 9288056 9635325 10007502 10405886 10832094
58756 10832094 11288334 11777250 12301806 12864963 13468730 14113815 14801046 15532803 16311822
58747 16311822 17138496 18010112 18922211 19868993 20841962 21829246 22816543 23787739 24724168
58738 24724168 25604025 26402873 27094664 27653517 28056993 28289402 28342679 28215336 27912018
58729 27912018 27443858 26827739 26084526 25237878 24313035 23334006 22320996 21291039 20260236
58720 20260236 19243312 18251046 17290352 16367417 15488860 14659008 13877818 13142747 12451615
58711 12451615 11802994 11195346 10627136 10096931 9602408 9139975 8706352 8299952 7919975
58702 7919975 7564866 7232532 6921566 6631244 6360373 6106820 5868400 5644070 5434186
58693 5434186 5239392 5059153 4891738 4735839 4591539 4459060 4337269 4224304 4119094
58684 4119094 4021260 3930135 3845181 3766861 3695612 3630213 3568544 3509753 3454228 3401633 3350547
58673 3350547 3299974 3249728 3199421 3148771 3098947 3051905 3008062 2966027 2924600 2883443 2841861
58662 2841861 2798806 2754287 2708939 2662068 2612142 2559466 2506157 2453017 2398762 2343044 2287818
58651 2287818 2234532 2182243 2129991 2079079 2031387 1987064 1945519 1907133 1872226 1839581 1807700
58640 1807700 1776580 1746727 1717423 1687501 1657085 1627133 1597933 1569291 1541464 1514621 1488147
58629 1488147 1461803 1436960 1415374 1397069 1380617 1365067 1350561 1337412 1325725 1315846 1308328 1303324
58617 1303324 1300485 1299477 1300480 1304319 1311748 1321995 1332449 1341066 1348840 1358307 1369477 1378993 1383838
58604 1383838 1384231 1382253 1379408 1376504 1374108 1371746 1367942 1362399 1357033 1353706 1352027 1350485 1348530 1346383
58590 1346383 1344037 1341975 1341921 1345454 1352610 1362978 1377163 1395788 1417952 1442171 1468260 1496931 1528170
58577 1528170 1561372 1596619 1634544 1675257 1718570 1764973 1815401 1870269 1929514 1993193 2061290
58566 2061290 2133488 2209926 2291760 2380318 2476170 2579592 2691249 2811884 2942099 3083109
58556 3083109 3236834 3404529 3585992 3780703 3988916 4211135 4447528 4698407 4964057
58547 4964057 5243179 5532284 5826983 6122405 6411579 6684971 6932938 7147553 7321136
58538 7321136 7444788 7510597 7515219 7460668 7352619 7198825 7007785 6787098 6543211 6283168
58528 6283168 6015290 5746947 5482583 5224729 4975669 4737113 4509851 4295338 4096401
58519 4096401 3914859 3749619 3598736 3462233 3341104 3234467 3139581 3053938 2975618 2902425
58509 2902425 2832745 2767091 2707043 2652663 2602188 2553999 2507659 2463355 2421500 2382610 2346496
58498 2346496 2311852 2277358 2242582 2207049 2169455 2128832 2085605 2040551 1993881 1946570 1901234
58487 1901234 1859894 1821603 1783844 1745582 1707669 1671196 1637194 1607157 1582103 1561326 1543285
58476 1543285 1527069 1511921 1496467 1480014 1463708 1448691 1433964 1417837 1400731 1384602 1370095
58465 1370095 1356023 1341212 1325113 1307110 1287085 1266398 1246643 1227731 1208703 1189894 1172454
58454 1172454 1156211 1139995 1124028 1110057 1098906 1089484 1080413 1071261 1062072 1053131 1045454 1040356 1038197
58441 1038197 1038240 1039666 1041833 1043924 1045391 1046719 1048926 1052393 1056813 1061912 1067597 1073827 1080888 1089152
58427 1089152 1098056 1106086 1112357 1117353 1121574 1124623 1126254 1127087 1127518 1127223 1126360 1125723 1124871 1121949 1116507
58412 1116507 1110782 1106950 1104866 1103658 1103381 1103450 1101658 1096756 1090120 1082935 1073880 1061961 1049498 1039445
58398 1039445 1031348 1022864 1013801 1005770 999031 992777 987587 984689 983478 982438 981850 982914 984851 985611
58384 985611 985025 984913 986558 990183 996097 1004076 1012466 1020103 1028190 1038070 1048466 1057474 1065943 1075931
58370 1075931 1086929 1096597 1104380 1111426 1117713 1122224 1125226 1127490 1128038 1125570 1121389 1118023 1115793 1113694
58356 1113694 1112616 1114472 1118983 1124606 1131799 1142020 1154305 1166338 1178174 1191381 1205324 1218064
58344 1218064 1230274 1244201 1259077 1271563 1280660 1288355 1295535 1301132 1305259 1309205 1312171 1311931 1308971
58331 1308971 1306222 1304491 1302046 1298869 1297251 1297629 1297775 1296778 1296184 1296658 1297174 1297906 1300214 1303309 1304727 1304590
58315 1304590 1305601 1308399 1310791 1312032 1313844 1316652 1318981 1321293 1326256 1334328 1343163 1352145 1363251 1376567
58301 1376567 1389450 1401417 1415424 1432722 1450674 1467396 1484539 1503607 1523296 1542401 1561881
58290 1561881 1582261 1602204 1621220 1640562 1660118 1677589 1691955 1704527 1715602 1723469 1727751 1730417
58278 1730417 1732738 1734647 1737430 1743037 1750251 1755804 1760060 1767209 1779059 1793192 1808168 1825694 1846442
58265 1846442 1868495 1891402 1917168 1945811 1974567 2002836 2033203 2066294 2099548 2132433 2167657
58254 2167657 2205609 2242821 2277705 2312630 2348604 2383345 2416441 2450765 2486536 2519651 2548349
58243 2548349 2576069 2605255 2633872 2660600 2687852 2716942 2745877 2774784 2807961 2847632 2891078
58232 2891078 2936560 2986225 3040257 3094285 3146003 3198694 3255027 3313125 3371920 3434258 3501250
58221 3501250 3569495 3637379 3708185 3783710 3861176 3939760 4023534 4114289 4208224 4303500 4404053
58210 4404053 4512004 4623551 4736624 4855143 4981118 5110097 5239240 5372319 5511822
58201 5511822 5654196 5798298 5950421 6115035 6288657 6468954 6661504 6870912 7093579
58192 7093579 7326316 7573792 7839892 8119835 8408597 8709229 9025127 9352271 9687405
58183 9687405 10035974 10403867 10789625 11193278 11624376 12092190 12596078 13134186 13712810
58174 13712810 14337999 15007244 15719371 16483398 17307353 18187620 19119497 20108230 21158801
58165 21158801 22265674 23424698 24644953 25937246 27302805 28746680 30290664 31958877
58157 31958877 33761714 35706404 37807825 40071922 42483356 45029741 47727312 50607349
58149 50607349 53694871 57022278 60647664 64635838 69036766 73907338 79338235 85433882
58141 85433882 92285256 99992604 108696907 118560454 129744227 142445741 156934749 173503945
58133 173503945 192399947 213834198 238024273 265207250 295729728 330179509 369065321
58126 369065321 411651646 454629121 492135806 517795727 527513792 520969116 501005767
58119 501005767 471879387 437729493 401809575 366279804 332325974 300492454 271039745
58112 271039745 244123285 219802673 198040193 178746245 161803132 147048121 134280295
58105 134280295 123307069 113968447 106116581 99606174 94322575 90190971 87127973 85004418
58097 85004418 83704113 83217178 83588701 84671931 85913636 86462381 85584009 83028324 79044420
58088 79044420 74118143 68725614 63246113 57952295 52996197 48423216 44235258 40438053
58080 40438053 37029898 33981829 31255306 28824254 26664976 24742722 23025577 21497529
58072 21497529 20142786 18930342 17828384 16821844 15902097 15051189 14250689 13496296 12789929
58063 12789929 12125441 11494229 10896681 10336016 9807979 9307615 8839000 8407447 8008483
58054 8008483 7634357 7284536 6959725 6652158 6352170 6059136 5777049 5505141 5241673
58045 5241673 4990838 4756630 4535090 4320991 4116415 3924459 3740694 3560053 3386486
58036 3386486 3226403 3077653 2934327 2797621 2672388 2557039 2446172 2339671 2240370 2146144
58026 2146144 2053125 1963718 1882962 1809758 1739650 1673190 1613290 1557230 1499885 1442821 1392031
58015 1392031 1348265 1307137 1267099 1229891 1194630 1158719 1123532 1092620 1065445 1038830 1012790
58004 1012790 988865 964877 937957 910881 888721 870758 852183 832270 814251 798388 781868
57993 781868 764802 750044 737650 725250 713227 703865 696171 686942 676247 666572 657586 646991
57981 646991 635466 625567 616911 607721 599683 595619 593611 589272 582842 578105 575106 570060 562067 554030
57967 554030 547014 539449 531984 527460 525736 523849 521656 522200 526049 530227 533158 535875 537984 537389 534613
57952 534613 532706 532086 529913 525191 520091 515434 509167 500289 490379 480316 469122 456802 444975
57939 444975 434134 423497 413813 406916 402341 397712 392537 388315 385043 381172 376844 373451 370153 364719
57925 364719 357809 352471 349260 345878 341946 339970 340838 342260 342742 343696 346557 350805 355663 361013 366093
57910 366093 369913 373160 377125 380937 382731 383188 384750 387614 389817 390928 392061 392419 389689 384119 378604
57895 378604 374483 370648 366829 364006 361298 356299 349139 342719 338399 334855 331624 330142 330677 331685
57881 331685 332823 335183 338077 339243 338881 339878 343154 346300 347654 348232 348665 347708 344874 341209 336338
57866 336338 328007 315679 301565 287152 271833 255836 241040 227829 214552 201354 191143 185281
57854 185281 181518 177777 174836 173654 173175 172714 173799 177632 183002 188348 193715 199304 204412 209217 215334
57839 215334 223198 231008 237448 243309 249418 255216 260452 265948 271675 276328 279736 283363 287514 290465
57825 290465 291169 290206 287260 280599 270320 259404 250153 241962 233693 225593 217675 208969 199732 191869
57811 191869 185909 180253 174686 171661 172534 175334 178043 181374 186496 192666 199163 207039 216793 226521
57797 226521 234520 241676 249321 256702 262531 267111 270960 273179 273043 271454 269137 265252 259533 253810
57783 253810 249519 245531 240330 234503 229167 223739 217379 211024 205838 201039 195312 189229 184340 180835
57769 180835 177736 174437 170694 166152 161079 156429 152158 146749 139362 130876 121872 111495 99452 87233
57755 87233 75927 64672 52712 41149 31136 22075 13266 5669 301 -3597 -7244 -10443 -12485
57742 -12485 -13478 -13518 -12014 -9037 -5686 -2002 3670 11959 20939 28602 34908 40129 43435 44757 45874
57727 45874 47879 49543 50026 51071 54465 59239 63539 67526 72271 77423 82041 86240 90055 92236 92031
57712 92031 90500 88221 83627 75635 65946 56489 46594 35217 23941 14909 7435 -306 -7648 -12710
57698 -12710 -16240 -20915 -27197 -32664 -35363 -35515 -34219 -32461 -30895 -28540 -22284 -9693 8087 27861
57684 27861 47796 67523 86004 101753 114632 125407 134126 140826 146986 154155 161755 168104 172907
57671 172907 176986 180608 184053 188731 195421 202358 207425 211469 217152 225305 234893 245814 259095 274704
57657 274704 291689 310254 331275 353922 376088 397205 418618 441202 464533 488376 513156
57646 513156 539021 565999 594670 625206 656469 687858 721253 759137 801564 847120 896048
57635 896048 949858 1008331 1069552 1132861 1199538 1270744 1347066 1429896 1520776 1619364 1724393
57624 1724393 1836870 1960143 2096577 2246389 2410047 2589617 2786927 3002075 3234328
57615 3234328 3483115 3747633 4026386 4317012 4615379 4915069 5208853 5489983 5750606
57606 5750606 5979667 6164252 6292714 6355524 6345234 6259377 6104114 5892977 5641512 5363869
57596 5363869 5072734 4778897 4489943 4211070 3947176 3702362 3477736 3272028 3084583
57587 3084583 2915989 2766044 2633261 2516300 2414015 2324442 2245917 2178899 2124443 2081148
57577 2081148 2045985 2017893 1998010 1986520 1982046 1984294 1994524 2013038 2038805 2071912 2113724 2164144
57565 2164144 2221503 2285972 2360461 2447068 2544960 2652848 2771525 2902883 3048115 3207566
57555 3207566 3380521 3564311 3755175 3950270 4147064 4340707 4524113 4690716 4834677
57546 4834677 4948350 5022890 5052765 5037711 4979803 4881419 4746969 4583585 4398254 4196163
57536 4196163 3982755 3764718 3547301 3332818 3123208 2921817 2731159 2551261 2382098
57527 2382098 2225439 2082271 1950290 1826219 1709232 1600232 1499268 1405710 1319744 1241671
57517 1241671 1170645 1105778 1047505 996158 950091 906923 865982 828054 793448 761667 732402
57506 732402 705617 681254 659841 642636 630012 620380 611618 603050 595341 589361 585883 585444 587622
57493 587622 591305 596308 603781 614436 627549 642313 658821 677019 696193 716490 739533 766380
57481 766380 796154 827796 861928 899742 941286 986125 1034624 1087275 1143591 1202912 1265573
57470 1265573 1332355 1403630 1479934 1562389 1651627 1747177 1848548 1955761 2068137 2184187
57460 2184187 2303643 2427790 2556135 2684125 2805946 2918413 3020314 3108935 3179403 3227189
57450 3227189 3249559 3244771 3211667 3150573 3063877 2955633 2831042 2695723 2554567 2411131
57440 2411131 2268226 2128425 1993709 1865420 1744824 1632896 1529382 1433386 1345272 1266544
57430 1266544 1197367 1135813 1080357 1031444 989577 953698 923007 898751 882313 872561 866970 864624
57418 864624 866445 873046 884158 899917 921178 948396 981225 1019315 1062940 1112917 1170196 1235140
57406 1235140 1307180 1385860 1472199 1567815 1672674 1785174 1904614 2031608 2165502 2303486
57396 2303486 2443147 2583447 2721381 2849615 2959517 3045234 3103163 3129335 3120235 3075690
57386 3075690 2998926 2894143 2765618 2618366 2457629 2287883 2113557 1939984 1771812 1610810
57376 1610810 1456562 1308880 1168294 1035104 909763 793819 688802 594333 508518 429829
57366 429829 357393 290069 226779 167519 112723 61809 13441 -33026 -77243 -118513 -156080
57355 -156080 -189532 -219841 -249088 -278047 -305050 -328553 -349816 -371566 -394770 -418294 -441051
57344 -441051 -462817 -483369 -502383 -520037 -536564 -551519 -564427 -575563 -585205 -592955 -598980 -604989
57332 -604989 -612684 -621874 -631235 -639956 -647453 -652711 -655550 -657660 -660620 -663694 -665232 -665576 -666828 -670247
57318 -670247 -675414 -681439 -687488 -692672 -696853 -701174 -706692 -713135 -719950 -727352 -735086 -741611 -746216 -750691
57304 -750691 -757026 -764600 -771493 -777245 -782277 -786028 -788240 -790963 -796378 -803240 -808225 -810405 -811724 -813374
57290 -813374 -814459 -814429 -814307 -815113 -816946 -819669 -822744 -824676 -824497 -823425 -823131 -823092 -821881 -820285 -820303 -821448 -820960
57273 -820960 -817732 -813253 -808533 -802891 -796071 -788859 -781038 -771291 -759635 -747574 -735424 -721946 -707095
57260 -707095 -692473 -678333 -662720 -644564 -625399 -607123 -590230 -575012 -562297 -551922 -542433 -533111
57248 -533111 -524417 -516009 -506625 -496551 -487608 -479715 -470137 -457522 -444189 -432582 -421684 -408921 -393910
57235 -393910 -378179 -362504 -346485 -330031 -313518 -296881 -279569 -260939 -240212 -217045 -192671
57224 -192671 -169209 -147180 -125042 -101915 -79352 -59329 -41751 -25036 -8199 8698 25294 41078
57212 41078 55328 67490 77179 83648 86005 83936 77183 64466 44484 18217 -11289 -41853 -73387
57199 -73387 -105891 -137965 -168176 -196591 -223952 -250180 -274386 -295660 -313481 -327995 -340024 -350228
57187 -350228 -358465 -364695 -369741 -373986 -376185 -375264 -372644 -370809 -370077 -368729 -365831 -361662 -355800 -347277 -336443
57172 -336443 -324193 -309428 -289905 -265740 -239511 -212738 -184719 -154847 -123307 -89366 -51900
57161 -51900 -11920 28269 68602 110791 154130 195341 233378 270948 310262 350684 391729 434772
57149 434772 480181 526014 571228 617203 664609 711963 758872 807319 857812 907638 955072
57138 955072 1002101 1050591 1098898 1144895 1189407 1233767 1276599 1316077 1353210 1390114 1426861
57127 1426861 1462513 1497323 1531508 1563810 1593677 1622972 1653308 1683552 1712142 1739880 1768254
57116 1768254 1797007 1825501 1854525 1884664 1914942 1945101 1977031 2011876 2047947 2083398 2118489
57105 2118489 2153062 2184445 2210285 2231081 2247707 2259075 2264592 2266229 2265721 2262546 2257168 2253264 2253815
57092 2253815 2257696 2262772 2269294 2277387 2284422 2288100 2288930 2286374 2275975 2254147 2222592 2183923 2135890
57079 2135890 2074116 1997642 1907622 1803536 1685438 1557569 1425090 1289035 1148238 1003715
57069 1003715 857022 706826 551093 389932 222106 41469 -159214 -383975 -636726 -924660
57059 -924660 -1253784 -1624879 -2038318 -2498660 -3009710 -3570315 -4181181 -4851350 -5592121 -6409797
57049 -6409797 -7310910 -8308638 -9416223 -10639230 -11981861 -13454764 -15068251 -16824827
57041 -16824827 -18728465 -20794853 -23042964 -25485543 -28141124 -31048055 -34253257 -37793740
57033 -37793740 -41698130 -45989094 -50665458 -55697913 -61057866 -66713591 -72563439 -78449709
57025 -78449709 -84392945 -90855243 -98603019 -108062386 -118673161 -128879296 -136820343 -141164319
57017 -141164319 -141507312 -138238515 -132152237 -124111141 -114893947 -105197705 -95669774 -86856051
57009 -86856051 -79077427 -72357490 -66481561 -61133708 -56012910 -50898019 -45682046 -40375988
57001 -40375988 -35071045 -29882994 -24917645 -20261094 -15973648 -12084712 -8599940 -5514023
56993 -5514023 -2812837 -468840 1555135 3296244 4789421 6070722 7174685 8128308
56985 8128308 8952131 9665515 10285782 10824023 11287419 11684953 12026441 12317402 12560067
56976 12560067 12759180 12922644 13056992 13166028 13253285 13322010 13372964 13405635 13421521 13423700
56966 13423700 13414163 13394647 13369242 13342675 13316016 13286575 13251688 13210102 13160300 13100414 13030058
56955 13030058 12950249 12861684 12764907 12661647 12553834 12441573 12324066 12202634 12081415 11964952
56945 11964952 11855651 11752810 11653836 11558547 11473473 11408520 11364621 11323850 11253929 11123878
56935 11123878 10916855 10632629 10283199 9886913 9463043 9028123 8595168 8174118 7771408
56926 7771408 7389937 7031104 6696620 6387466 6102120 5837350 5590326 5359064 5142067
56917 5142067 4938993 4750613 4576522 4413954 4260574 4117357 3986701 3868673 3761321
56908 3761321 3663874 3577070 3500612 3432895 3373412 3323074 3281639 3246882 3217015 3192088 3172166
56897 3172166 3155625 3140283 3125110 3109877 3093696 3074715 3050977 3021500 2987056 2950052 2913035
56886 2913035 2877054 2841682 2806321 2771016 2736326 2703155 2672491 2644662 2619126 2595599 2574934
56875 2574934 2558071 2544680 2533967 2526539 2524218 2527622 2534437 2539987 2539102 2528143 2506344 2475530 2438275
56862 2438275 2396730 2353313 2311053 2271839 2235050 2199289 2164922 2133480 2105140 2078609 2053325
56851 2053325 2029892 2008165 1986767 1965125 1944510 1926370 1910872 1897757 1887247 1879024 1871300 1862139
56839 1862139 1851367 1840400 1830500 1821792 1813578 1805021 1795779 1786465 1778355 1772469 1769279 1769399 1773839 1782989
56825 1782989 1795650 1809424 1821740 1830328 1833465 1830559 1822426 1810489 1795893 1779708 1763582 1749404
56813 1749404 1738155 1729515 1722676 1717293 1713692 1712605 1714866 1720998 1730788 1743521 1758996 1778246 1802777
56800 1802777 1832825 1866390 1900041 1930361 1954500 1969975 1975010 1969561 1955739 1936886 1916207 1895989
56788 1895989 1877382 1860538 1845406 1832842 1824651 1822097 1824649 1830749 1839791 1853002 1872507 1899893
56776 1899893 1935399 1977708 2024203 2071731 2117272 2157820 2189895 2209887 2215258 2205361 2181350 2145975
56764 2145975 2103562 2059178 2016625 1977078 1940031 1905574 1875270 1850836 1832586 1819585 1810980
56753 1810980 1806871 1808067 1815290 1828443 1846340 1867364 1890645 1916139 1942829 1966971 1983101 1987195
56741 1987195 1978535 1958694 1929799 1894247 1854968 1814681 1775011 1736971 1701916 1671147 1644830
56730 1644830 1622214 1602920 1587298 1575539 1567303 1562414 1561261 1564246 1571243 1581593 1594069 1606770
56718 1606770 1617541 1624527 1626012 1620227 1606313 1585576 1560786 1534061 1506111 1477451 1449166 1422145
56706 1422145 1396632 1373035 1352089 1333564 1315900 1298156 1281473 1267505 1255965 1245027 1233841
56695 1233841 1223350 1214594 1207458 1201448 1196580 1192716 1188742 1183340 1176479 1169487 1163627 1159095 1155530 1152843
56681 1152843 1151054 1149599 1147571 1144761 1141838 1139200 1136269 1132512 1128722 1126376 1125726 1125224 1123100 1119038
56667 1119038 1114182 1109915 1106793 1104304 1101439 1097696 1093556 1089818 1086578 1083205 1079266 1075127 1071743 1070093
56653 1070093 1070461 1071813 1072158 1070171 1066368 1062175 1058221 1054244 1050254 1046682 1043492 1040234 1037074 1034655
56639 1034655 1032771 1030251 1026483 1022029 1017378 1012218 1006513 1001240 997211 993863 989985 985157 979969 975390
56625 975390 972351 971206 971091 970522 969260 968807 970407 973253 975523 976534 976967 977444 977908 978260 978845 980264
56609 980264 983095 987457 992411 996318 998504 1000257 1003446 1008311 1013216 1016466 1017843 1018631 1020719 1025604
56595 1025604 1033580 1043612 1054243 1064825 1075968 1088976 1104786 1123109 1142655 1162511 1183130
56584 1183130 1205297 1228185 1249208 1265824 1276716 1281254 1279123 1270940 1258159 1241716 1221719 1199013
56572 1199013 1175921 1154471 1134697 1115499 1096302 1076994 1057228 1037070 1017795 1000851 986403
56561 986403 973768 962691 953162 944586 936396 929110 923672 920037 917432 915533 914203 912556 909758 906571
56547 906571 904631 904193 903889 902788 901384 900350 899744 899749 900857 902723 903996 903971 903426 903177 902826 901738 900386
56530 900386 899688 899571 899231 898526 898115 898277 898421 897911 896733 895140 893296 891677 891369 893234 896657 899586
56514 899586 900178 898388 895847 894332 894446 895453 896019 895239 893358 891576 890966 891703 893432 895939 899002 902170
56498 902170 905529 910172 916683 923309 927163 927524 926617 926726 928015 929876 932700 936867 941149 943849 944954
56483 944954 945690 946359 946085 944544 942503 940557 938423 935692 932300 928120 923023 917602 913088 910172 908389
56468 908389 906765 904708 902195 899524 897012 894750 892627 890548 888379 885777 882759 880448 880210 881615
56454 881615 882320 880660 877405 874141 871008 867249 863056 859325 856016 852195 847535 842645 838093 834198
56440 834198 831440 829929 828693 826605 823786 821149 819023 817377 816792 817625 818564 817712 815078 812420 810631
56425 810631 808998 807209 806238 806665 807746 808846 810391 812687 815091 817186 819554 822503 825142 826790 828378
56410 828378 831357 835714 840003 843016 844832 846591 849769 855189 862292 869808 877411 886031 896067 906104
56396 906104 914154 919679 923681 927236 930685 934021 937267 940333 942864 944317 944103 941871 937849 932828
56382 932828 927625 922636 917901 913505 909879 907753 907480 908194 908001 905502 900849 895020 888584 881882 875788
56367 875788 871115 867361 863186 858245 853570 849975 847190 844924 843669 843694 843989 843110 840803 838210 836615
56352 836615 836356 836767 836770 835562 832997 829421 825249 820771 816206 811728 807504 803778 800697 797995 795334
56337 795334 793103 792192 792595 792991 792349 791301 791155 792190 793774 795492 797135 798224 798903 800919 806253 814758
56321 814758 824365 833645 842956 852991 863405 873126 881038 886190 888391 888880 889486 890861 892276 893150
56307 893150 893861 894912 896244 897572 898540 898455 896784 894163 892165 891890 893340 895939 898830 900845 901291 900853
56291 900853 900952 902279 904718 908196 912410 916105 918160 919265 920949 923019 923701 922605 921725 922850 925579
56276 925579 928713 932227 936768 942144 947263 951061 953164 954385 956854 962563 971229 980346 987728 993249
56262 993249 998033 1003105 1009190 1016656 1025044 1033499 1041907 1050707 1059498 1067257 1074361 1082968 1094649 1108692
56248 1108692 1123330 1137438 1150316 1161127 1169811 1177832 1186880 1197033 1206848 1215052 1221812 1228626 1236942
56235 1236942 1246397 1254568 1259227 1260780 1261668 1263691 1267061 1271828 1278538 1287154 1296738 1306809 1317879 1330306
56221 1330306 1343730 1358093 1374130 1392530 1413563 1437713 1465441 1496084 1528196 1561303 1596237
56210 1596237 1633730 1673985 1717748 1766191 1819356 1876147 1936267 2000902 2071213 2147524 2230190
56199 2230190 2319841 2416573 2520392 2632396 2753834 2884004 3021139 3165482 3319117 3482271
56189 3482271 3652108 3825807 4002315 4179985 4354907 4522945 4681524 4828207 4959486
56180 4959486 5072325 5165157 5236438 5284351 5309268 5314311 5301938 5271979 5224579 5163009 5091592
56169 5091592 5012598 4926962 4836324 4742384 4645743 4547197 4448616 4350641 4250872 4146284 4036344
56158 4036344 3922277 3804943 3685328 3565499 3446915 3328995 3211348 3096009 2985276
56149 2985276 2878559 2773777 2671023 2572593 2480109 2393704 2313352 2238873 2169185 2103527 2042993
56138 2042993 1989025 1940895 1896464 1854910 1816895 1782434 1750458 1720406 1692764 1667953 1645778
56127 1645778 1625809 1607535 1590638 1575755 1564143 1555831 1549204 1543235 1538790 1536727 1536249 1536500 1538261
56114 1538261 1542435 1548114 1553975 1560519 1569213 1580214 1592553 1605859 1620571 1637052 1655495 1675886
56102 1675886 1697427 1719217 1742005 1767525 1795493 1823512 1850868 1879711 1911016 1942278 1971418
56091 1971418 2000243 2031338 2063904 2095688 2127036 2159895 2194548 2230686 2270444 2317094 2371448
56080 2371448 2432394 2500129 2576165 2661086 2755091 2860062 2978442 3110664 3255933 3414434
56070 3414434 3585918 3766614 3949927 4129792 4301713 4462143 4609712 4746275 4874254
56061 4874254 4993525 5102478 5200077 5283833 5347249 5383022 5388923 5368608 5327794 5271895 5205539
56050 5205539 5130619 5044805 4944276 4827498 4694905 4547045 4386002 4217091 4046148 3876443
56040 3876443 3710886 3555040 3414072 3288111 3174363 3072590 2984679 2909968 2845209 2788726
56030 2788726 2740883 2700906 2666838 2638223 2615405 2596626 2579122 2562574 2548385 2536408 2525578
56019 2525578 2516581 2510326 2505045 2498874 2494245 2495396 2502242 2510801 2519029 2527970 2537735 2546955 2556299 2568432
56005 2568432 2584257 2602636 2623433 2647299 2673147 2699594 2728044 2760387 2794736 2827847 2860843
55994 2860843 2897817 2939415 2982694 3026763 3073500 3122701 3171589 3219557 3269056 3321506 3376207
55983 3376207 3432909 3491458 3549676 3606025 3663460 3726086 3793076 3860800 3929595 4002862 4080611
55972 4080611 4159893 4240950 4326918 4417932 4511525 4608472 4712202 4822930 4938272 5058866
55962 5058866 5187039 5321061 5457853 5600603 5756145 5925124 6102494 6287525 6485110
55953 6485110 6696838 6919131 7151081 7395927 7653556 7919653 8193691 8480074 8780013
55944 8780013 9089797 9408292 9738783 10082898 10440747 10817675 11222615 11659095 12125770
55935 12125770 12625431 13164442 13743875 14361401 15021905 15735388 16504014 17321988 18188138
55926 18188138 19106832 20076713 21091921 22155706 23279863 24470238 25727340 27062702
55918 27062702 28499486 30054549 31734059 33546670 35502855 37599218 39823129 42178447
55910 42178447 44691079 47389075 50298867 53463834 56943065 60787291 65040664 69772275
55902 69772275 75081466 81068375 87828356 95480389 104168728 114033555 125224238 137959013
55894 137959013 152540592 169315777 188674795 211088669 237056790 266968891 301030351
55887 301030351 339150262 380408071 422155926 459694507 487441667 501169701 499688658
55880 499688658 484812560 460007349 428960120 394792263 359815890 325548128 292891396
55873 292891396 262394555 234419356 209156232 186615647 166682439 149176243 133868373
55866 133868373 120499335 108822701 98626675 89714042 81892487 74997876 68904406
55859 68904406 63501792 58683189 54363390 50486212 47001797 43852499 40988001 38375605
55851 38375605 35985834 33783351 31740754 29847043 28093941 26466021 24950645 23544291
55843 23544291 22241433 21028484 19895171 18840915 17863749 16953479 16101687 15308268 14572016
55834 14572016 13884194 13237148 12630535 12063762 11530721 11026800 10552726 10106673 9680658
55825 9680658 9269510 8875723 8501084 8141177 7792643 7458501 7141678 6840036 6551902
55816 6551902 6279757 6024385 5781892 5550479 5333800 5133722 4945812 4765634 4593584
55807 4593584 4430177 4272651 4119700 3973703 3834916 3699323 3565476 3437585 3318622
55798 3318622 3206337 3099255 3000196 2909879 2822859 2733972 2643707 2553617 2462051 2368568 2277518
55787 2277518 2192837 2113575 2038174 1968612 1906555 1849790 1796195 1747248 1704235 1665220 1629044
55776 1629044 1598025 1573317 1551954 1532000 1516219 1506768 1500287 1492299 1482848 1473942 1464917 1454250
55764 1454250 1442828 1431433 1417547 1398153 1373448 1345081 1313399 1279090 1244666 1211621 1178862
55753 1178862 1146283 1116770 1092186 1070636 1050210 1032084 1017378 1004395 991753 980833 972330
55742 972330 963954 954612 947380 945018 945756 946724 948196 950896 952455 950602 947254 945565 945085 943407 940394
55727 940394 937227 933265 927241 919864 912237 903582 893350 883536 876020 869704 863135 857682 855020 853383
55713 853383 849384 841740 830674 815893 798061 780033 763639 747294 729543 712388 697949 684521
55701 684521 669745 655280 644113 635013 624002 610101 595610 581712 567848 554733 544037 535169
55689 535169 525763 515323 505452 496832 488767 481328 475155 469415 462580 454950 448081 442217 436617 431726
55675 431726 428592 426796 425432 425378 427989 432167 435351 436884 437829 438002 436011 431998 427695 423791 419617
55660 419617 415310 411893 409184 405804 401297 396218 390366 383203 375998 371214 369379 368484 366927 365376
55646 365376 365300 367066 369876 372600 374484 375794 377441 379358 380042 378645 376412 374879 373786 372285 370962
55631 370962 370779 371059 370602 370064 371187 374273 378510 384254 392712 403487 414437 424167 433039 441646 449780
55616 449780 456940 462593 466010 466918 466119 464501 461899 457858 452887 447837 442785 437655 433153 429960 427806
55601 427806 426440 426399 427580 428285 427225 425327 424015 422987 421503 420523 421447 423747 426030 428535 432298
55586 432298 436524 439099 439286 437864 435142 430886 425734 420580 415025 408439 401963 397235 393588 388821
55572 388821 382321 375138 367351 358029 347853 339185 333018 327981 322740 317364 311972 306112 300044 294761
55558 294761 290166 284932 278694 272732 267870 263309 258318 253725 250854 249826 249567 248973 247906 247514 249242
55543 249242 252853 256013 256762 255662 254251 252299 248439 242901 237597 233629 230588 228276 227304 227832 229325
55528 229325 231641 234846 237923 239330 238925 237921 237003 236107 235928 237667 240996 244117 246240 248380 251273
55513 251273 254196 256528 259078 262997 268368 274440 280588 286793 293857 302911 313801 324289 332038 337047
55499 337047 340746 343194 342962 339681 334811 329554 323536 315934 306606 296000 285250 276332 270543 266789
55485 266789 262856 258363 254769 252556 250470 247879 245748 244469 242653 239178 235040 232104 231126 231771 233405
55470 233405 235107 235949 236034 236381 237183 237123 235115 231906 229387 228840 230136 231899 232341 230748 228404 227271
55454 227271 227710 228315 227791 225948 223021 219432 216299 214932 215561 217545 220652 224759 228439 229671 228279
55439 228279 226113 224316 221974 218035 213030 208074 203385 198722 194316 190534 187222 183993 180722 177553
55425 177553 174921 173393 172818 171958 169944 167571 165931 164390 161664 158371 156321 155302 153002 148660 144571
55410 144571 143155 144385 146929 149873 152307 153090 152346 151735 152076 152131 150778 148849 147464 146031 143496 140461
55394 140461 138418 137633 137269 137044 137449 138613 140039 141232 141940 142227 142829 144704 147642 150084 150933 150751
55378 150751 150551 150383 149864 149237 148994 149199 149940 151595 153905 155702 156422 156949 157951 158317 156536 153028 149848
55361 149848 148470 148920 150696 153331 156139 158450 160191 161613 162537 162546 161902 161612 162496 164443 166547 167841
55345 167841 168113 168205 169217 171241 173291 174585 175438 176592 178078 179014 178281 175350 170847 166347 163230 161755
55329 161755 161567 162691 165145 167872 169238 168814 167785 167401 167780 168383 168729 168466 167473 166128 164822 163240
55313 163240 160891 158123 155672 153394 150591 147504 145274 144457 144752 145956 147735 148685 147512 145271 144482
55298 144482 145618 146425 145303 143397 142485 142718 143583 145251 147543 149044 148715 147297 145981 144944 144358 145362
55282 145362 148374 151445 151936 149264 144815 140000 135761 133183 132984 134568 136604 138317 139576 140364 140862
55267 140862 141404 141787 141484 141035 141966 144439 146401 146186 144684 143653 143223 142685 142464 143271 144113 143314 141296
55250 141296 140375 141687 143858 144935 144324 142582 140445 138477 136973 135877 135095 134735 134852 135432 136890 139707
55234 139707 143133 145313 145519 145268 146223 148019 149274 149704 149851 149603 148613 147564 147397 147640 147055 145688 144838
55217 144838 145017 145287 144594 142733 140160 137921 137537 139696 143081 145503 146062 145363 144085 142538 141304 140979
55201 140979 141300 141617 142073 143132 144226 144258 143515 143658 145451 147640 148497 147574 145602 143464 141770 140905 141111
55184 141111 142501 144798 146905 147414 146156 144650 144234 144392 143892 142996 143256 145345 148289 150817 152400 152934
55168 152934 152345 150714 148260 145343 142965 142703 145294 149560 153534 156191 157430 157196 155828 154615 154555
55153 154555 154902 154266 152736 151515 150824 149861 148733 148691 150144 151939 152982 153365 153579 153807 154239 154957 155315
55136 155315 154649 153719 154071 155661 156582 155752 154509 154698 156278 157786 158360 158331 158262 158173 157615 156174 154152 152774
55118 152774 153172 155078 157033 157927 157768 157085 156320 155775 155198 153483 149757 144967 141365 140225 141010 142874
55102 142874 145732 149333 152552 154446 155298 155836 156039 155456 154270 153313 153157 153523 153500 152344 150376 148982
55086 148982 149226 150622 151989 153205 154998 157023 157687 156503 155280 155913 157804 158626 157221 154670 152668
55071 152668 151809 151617 151525 151316 150924 150241 149377 148958 149798 152062 155058 158139 161370 164767 167468 168660 169215
55054 169215 171235 175558 180625 184292 186075 187058 188142 189203 189746 189689 189245 188334 186456 183361 179804 177238
55038 177238 176487 177020 177855 178677 179546 179955 179217 177746 176922 177447 178610 179587 180666 182465 184340 184434 181570
55021 181570 176726 172329 170100 169820 170326 171229 173042 175855 178926 181847 185109 188840 191855 192953 192584
55006 192584 192162 192069 191461 189986 188671 188890 191030 194199 196789 197468 196168 194052 192198 190629 189004 187595
54990 187595 186911 186935 187456 188618 190268 191416 191312 190515 189935 189480 188769 188386 188900 189283 188138 186153 185428
54973 185428 186405 187417 187580 188154 190292 193116 195013 195654 195866 196411 197534 198890 199441 198244 195724 193325
54957 193325 191714 190422 189436 189749 191726 194126 195503 195717 195484 195316 195513 196387 197894 199744 202199 205869
54941 205869 210395 214236 216196 216373 215450 214090 213177 213239 213236 211300 207359 203666 201957 201426 200444 198958 197981
54924 197981 197779 197864 198029 198197 197951 197271 197105 198095 199348 199597 199081 199102 200060 201037 201153 200422 199388 198750 199213
54905 199213 200912 202952 204198 204580 205182 207084 210461 214805 219629 224836 230350 235516 239460 242505 246579
54890 246579 253176 261263 268442 274031 279452 285482 291091 295809 301531 310525 322627 335690 348135
54877 348135 360021 372084 384603 396720 406262 410951 410429 406421 400418 392225 381394 368772 355564
54864 355564 341996 328159 315200 304227 294709 285425 276489 269086 263535 258876 254171 249137 243824
54851 243824 238866 235778 235855 238754 242956 247299 251282 254421 256557 258696 262513 268887 277434 287027 296179
54836 296179 303779 310629 319556 332583 348272 363035 374619 382865 387562 387697 383177 375477 365801
54823 365801 353984 340038 325497 312016 299377 286135 272111 259239 249669 243478 238561 232675
54811 232675 225405 218162 212625 209528 208618 208925 209029 208033 206816 207473 210822 215077 217664 217745 216289 214435
54795 214435 212822 211878 211604 211322 210588 209987 210072 209967 208247 204953 201605 199344 198126 197437 196570 194378 190239
54778 190239 185447 182261 181243 180708 179147 176902 175015 173722 172842 172607 173109 173766 174247 175260 177413 179782
54762 179782 180791 180375 180191 181435 183404 184752 185460 186698 188880 190765 190954 189683 188498 188502 189695 191895
54746 191895 195254 199491 203492 206396 208644 211414 215322 219977 224430 227782 229946 232202 236337 242724
54732 242724 249910 256690 263780 272652 283446 294974 306244 317002 327328 337838 349895 364313
54720 364313 379902 394321 406237 415653 422371 425536 424961 421683 416675 409810 400670 389871 379141
54707 379141 370249 363887 359281 354983 350305 345909 342830 341467 341817 343943 347401 350916 353609 356143
54693 356143 359733 364606 370473 377940 387979 400267 413501 427332 442652 459936 478574 497888
54681 497888 517395 535885 551725 564494 575038 583469 588418 588778 584800 576681 563428 544330 520857
54668 520857 496088 472608 451542 432954 416298 400767 385918 371852 358603 345800 333244
54657 333244 321351 310671 301355 293307 286342 279989 273695 267648 262877 260207 259417 259576 259751 259320 258261
54642 258261 257377 257593 258710 259391 258736 257390 256747 257476 259074 260526 261137 260954 260491 259935 258993 257848 257706
54625 257706 259522 262534 265123 266876 268654 270684 271996 272053 271741 272257 274049 277188 281645 286633 290666
54610 290666 292892 293705 293854 294030 295547 299890 306728 313617 318725 322918 328231 335240 342976 350467 357168
54595 357168 362517 366377 369542 372809 375949 378519 381105 384719 389404 394625 400747 408885 419343 431247
54581 431247 443844 457296 472121 488572 506595 525827 545629 565714 586546 608420 630175
54570 630175 649483 664307 673604 676851 673847 665072 651617 634605 615076 594225 572976 551227
54558 551227 528196 503809 479450 457234 438749 424300 412909 403009 393513 384268 375505 367395
54546 367395 360560 356238 354890 354822 353266 348943 342762 336059 329215 322329 316022 310663 305471 299411 292750
54531 292750 286861 282456 278706 274370 269278 264309 260167 256616 253021 249359 246412 244789 243860 241952
54517 241952 237851 232078 226456 222329 219460 216795 213971 211607 210285 209848 209833 210020 210240 210159 209764 209647
54501 209647 210244 211059 211207 210484 209346 208224 207605 208504 211691 216317 220280 222320 223075 223822 225087 226827
54485 226827 229091 231736 234169 236141 238506 242458 248138 254391 259772 263602 266442 269882 275481 283482
54471 283482 292788 302278 311622 320661 328926 336500 344695 354887 366876 379011 389711 398094 403516
54458 403516 405523 404418 401028 395603 387586 376835 364531 352288 340588 328616 315771 302954
54446 302954 291984 283800 277636 272102 266641 261505 256712 251852 246927 242603 239341 236800 234290 231263
54432 231263 227314 222502 218050 215858 216664 219190 221613 223319 224653 225751 226545 227480 229209 231705 234346
54417 234346 236599 237879 237185 234038 229787 226901 226655 228199 229998 231304 232006 232048 231694 231724 232666 234164
54401 234164 235587 236868 238155 239012 238777 237734 237167 237962 239663 241208 242104 242326 241499 239087 235537 232432
54385 232432 230980 230783 230609 229995 229558 229939 231117 232545 233384 232753 230542 227942 226385 225938 225512 224660 224106
54368 224106 224218 224156 223152 221609 220140 218456 216313 214772 215196 217263 219111 219400 218274 216546 215082
54353 215082 214965 216909 220069 222457 223134 223232 224287 226384 228695 231213 234846 239924 245519 250491 254670
54338 254670 258789 263660 269632 276469 283430 289681 294994 299868 304707 308963 311572 312172 311503 310494 309389
54323 309389 307893 305706 302703 299148 296011 294435 294260 293632 290905 286533 282189 278356 273946 268321 262520
54308 262520 258151 256004 255991 257390 258684 258276 256211 254560 255303 258195 261212 262506 261447 258522 255200
54293 255200 253462 254370 257032 259513 260713 260927 260991 261671 263771 267918 273798 279941 284666 287282 288429
54278 288429 289333 290733 292517 294318 296101 297848 298998 298817 297287 295010 292292 288940 284900 280405 275519
54263 275519 270341 265568 261908 258971 255825 252653 250454 248928 246339 242084 237635 233996 229969 224433
54249 224433 218823 215551 214968 215673 216884 218521 219599 218749 216256 213732 211764 209561 206965 204956 203868
54234 203868 202740 200868 198567 195981 192630 188683 185261 182806 180419 177510 174891 173383 172485 171393
54220 171393 170395 170112 170202 170092 170511 172950 177492 182170 184816 185032 184145 183615 183795 184131 184274 184574 185324 185907
54202 185907 185447 184294 184153 186235 189597 191749 190931 187662 184183 182442 182539 183131 183270 183489 184805 187012
54186 187012 188596 188386 186828 185463 185336 185933 185660 183489 180194 177700 177148 178052 179391 180794 182266 183568
54170 183568 184519 185343 186094 186403 186479 187546 190299 193643 196039 197431 198605 199368 199000 198041 197792 198068 197328
54153 197328 195299 193705 193833 194965 195843 196189 196035 195017 193405 192630 193608 195388 196449 196577 196574 196946 197878
54136 197878 199758 202461 204588 204540 202203 198733 194955 190953 187162 184857 185057 187213 189182 188609 184734
54121 184734 179072 174156 171429 170611 170934 172185 174315 176846 179274 181548 183646 185099 185436 184751 183513
54106 183513 182241 181636 182324 183991 185422 185953 186295 187305 188515 188715 187561 185758 183986 182566 182057 183208
54090 183208 186008 189260 191368 191423 189717 187465 185861 185066 184286 182961 181503 180506 179816 179049 178661 179550
54074 179550 181512 182886 182142 179484 176603 175019 174832 174946 174336 173099 172167 172041 172087 171322 169785 168722
54058 168722 169242 170909 171928 170908 168419 166485 166417 167442 167722 166381 164112 162141 161417 162660 166169
54043 166169 171061 175262 176950 176031 174163 173511 175303 178991 182571 184158 183582 182312 181925 182980 185214
54028 185214 188006 190467 191796 192014 191943 192236 192863 193698 194876 196156 196523 195124 192366 189614 187958 187575
54012 187575 188106 189303 191270 194075 197073 198962 199030 198284 198668 201049 204542 207789 210129 211412 211618 211198
53996 211198 211010 211356 211610 211363 211374 212810 215893 219778 223420 226144 227757 228696 229875 232079 235563 240207
53980 240207 245570 250712 254784 258262 263015 270509 280221 290254 299167 306765 313395 319143 323907 328108
53966 328108 333067 340172 349325 358681 366547 373115 379440 385262 389355 391943 394979 399449 403925 406692
53952 406692 408004 409198 410722 412170 413322 413886 412957 410012 405984 402159 398380 393417 386862 379663 372984
53937 372984 367322 362539 358051 353265 348421 344649 342653 341782 340789 338751 334845 328580 321274 315981 314261
53922 314261 313829 311205 306150 301600 299540 299027 298433 297498 296383 294435 291139 287333 284467 283178 283151 283690
53906 283690 283856 282759 280437 278085 276911 277035 277833 278892 280132 281284 281844 281720 281698 282959 285862 289322
53890 289322 291928 293751 296329 300440 304746 307467 308758 310412 313605 317970 322640 327056 330915 334546
53876 334546 339380 346809 356272 365433 372572 377915 382484 386738 390797 394881 398782 401666 403163 404164
53862 404164 405957 408978 412901 417497 422893 429282 436765 445156 453677 461306 467786 473910 480456 487294
53848 487294 494093 501444 510521 521518 532960 542830 550308 556329 562385 568749 573970 576264 575366 572807
53834 572807 570438 568897 567433 564819 560458 554900 549343 544315 538776 530880 519882 507176 495286
53821 495286 485796 478215 470832 462610 453996 445697 437106 426833 414900 403413 394384 387520 380905
53808 380905 373421 365612 358468 352266 346673 341264 335790 330362 325372 320885 316267 310793 304434 297681
53794 297681 290951 284695 279690 276479 274679 273467 272499 271806 271151 270209 269102 267947 266274 263789 261382
53779 261382 260292 260377 260336 259556 258612 257858 256836 255388 254229 253863 253854 253675 253525 253809 254513 255545 256981 258483
53761 258483 259215 259046 259271 261340 265033 268478 269905 269064 267088 265400 264861 265714 267952 271409 275504 279407
53745 279407 282751 285836 288946 292081 295688 300886 308130 316207 323428 329430 335050 341055 347929 356209
53731 356209 365671 374677 381724 387299 392760 397922 401656 404623 409089 415534 421620 425404 427707 430222
53717 430222 433051 435437 437436 439256 439939 438311 434651 430221 425724 421241 416991 413033 408715 403486
53703 403486 397831 392544 387626 382782 378378 374838 371603 367669 362845 357619 352297 347143 342819 339674
53689 339674 337048 334198 331398 329152 327027 324500 322250 321062 319858 316694 311756 307512 305415 304150
53675 304150 301943 299080 296894 295395 293502 291075 289114 287956 286699 284972 284107 285558 288692 291251
53661 291251 291943 291596 291581 292226 293460 296072 301005 307699 314379 320025 325016 329783 334094 338035 342416
53646 342416 347430 351868 354577 356045 357746 360486 364143 368421 372994 377294 380959 384236 387334 389884
53632 389884 391723 393743 397082 401779 406854 411375 414740 416489 416858 417308 419541 423970 429688 435525 440461
53617 440461 443535 444564 444748 445480 446624 447018 446569 446589 447848 449435 450046 449550 448952 449503 452024 456212 460285
53600 460285 462174 461520 459830 458347 456716 454139 450866 447710 444880 442305 440566 440384 441248 441454 439751
53585 439751 436606 433895 433585 436305 440628 444007 445001 444341 443353 442070 440044 438497 439778 444146 448707
53570 448707 450671 450505 450643 452128 454294 457106 461589 467618 473271 477250 480443 484200 488417 492536 497145
53555 497145 502986 509292 514827 520049 526440 533904 540635 545801 550778 557246 565352 574224 583131 591677
53541 591677 599872 608395 617760 627059 634850 641625 649750 660270 671327 680788 688911 697000 704794 710999
53527 710999 715590 719753 724004 728072 732375 737822 744074 749598 753779 757549 761512 764799 766574 767532
53513 767532 768924 770793 772251 773195 774707 777575 781133 783988 785489 785963 785666 784262 781684 778991 777749
53498 777749 778756 781759 785988 790176 792527 792018 789906 788830 790064 792540 794683 795960 796368 795978 795712
53483 795712 797123 800346 803586 805710 808016 812025 816962 821207 825130 830280 836444 841890 846388 851767
53469 851767 859278 868445 878940 891529 906273 921524 935823 949686 964630 981459 1000272 1021027
53457 1021027 1043165 1065503 1087515 1110175 1134833 1161776 1190451 1220433 1251417 1282856 1314415
53446 1314415 1346562 1380154 1415734 1453609 1494105 1537135 1581906 1627690 1674646 1723389 1773996
53435 1773996 1825932 1878724 1932065 1985258 2037124 2086776 2134348 2180864 2227467 2274861 2323313
53424 2323313 2372803 2422783 2471894 2518690 2563175 2607150 2652433 2698955 2745250 2790574 2835653
53413 2835653 2881221 2926513 2969580 3008799 3043966 3076232 3106951 3136299 3163127 3186500 3207046
53402 3207046 3226222 3244589 3261496 3276133 3287845 3295495 3297824 3294838 3287906 3278013 3264815 3247927
53390 3247927 3228241 3207000 3184146 3158546 3129691 3098344 3065398 3030724 2993442 2953026 2909994
53379 2909994 2865662 2821436 2778173 2735876 2693809 2651168 2608083 2565843 2525650 2487133 2448880
53368 2448880 2410713 2374634 2342868 2315566 2291154 2268447 2247538 2229053 2213542 2201378 2192248
53357 2192248 2184839 2178053 2172696 2171182 2175332 2185002 2198732 2215086 2233451 2254299 2278612 2306491
53345 2306491 2336667 2368161 2401901 2439523 2480937 2524587 2570071 2618867 2672093 2729002 2788309
53334 2788309 2849757 2913747 2980638 3051180 3126530 3206871 3290743 3376584 3464368 3555098 3649396
53323 3649396 3747253 3848477 3952538 4058296 4164469 4270173 4374956 4478925 4582901 4687472
53313 4687472 4791527 4892692 4989623 5082865 5172963 5258969 5339585 5414511 5483511 5545174 5598087
53302 5598087 5642735 5680912 5713621 5740636 5761735 5776919 5785298 5784958 5774369 5753447 5723256 5685294
53290 5685294 5641034 5591352 5535983 5473755 5403488 5324747 5238148 5145333 5048419 4949179 4848844
53279 4848844 4748583 4649420 4551342 4453217 4354233 4255035 4157042 4061115 3967347 3875541 3785347
53268 3785347 3696476 3609348 3524976 3443678 3364581 3287188 3212747 3143156 3078961 3019306 2963389
53257 2963389 2910967 2861767 2815498 2772327 2732375 2694758 2658046 2621869 2587486 2556725 2530772
53246 2530772 2509749 2492826 2478826 2467271 2458587 2452861 2448910 2445472 2442897 2442606 2445042 2449242 2454499
53233 2454499 2461484 2471462 2485163 2502541 2522829 2544671 2567053 2590463 2616603 2646730 2680832 2718419
53221 2718419 2759224 2802693 2847507 2892296 2936514 2980152 3022846 3063888 3103204 3141954 3181761
53210 3181761 3222930 3263461 3300246 3331572 3358151 3381433 3401503 3417322 3428651 3436633 3442332 3445553
53198 3445553 3445488 3441915 3435234 3425583 3412377 3394795 3372628 3346558 3317436 3285292 3249480 3209949
53186 3209949 3167747 3123726 3077259 3027140 2973564 2918318 2862984 2807806 2752613 2698067 2645386
53175 2645386 2595110 2546475 2497930 2448301 2397762 2347778 2299858 2254361 2210651 2168011 2125948
53164 2125948 2083943 2041861 2000638 1961715 1925397 1890469 1855859 1822193 1791137 1763490 1738307
53153 1738307 1713733 1688318 1661714 1634592 1608013 1582630 1558198 1533733 1508213 1481375 1454069
53142 1454069 1427717 1403211 1380178 1357364 1333642 1308676 1282793 1256454 1229848 1203137 1177163
53131 1177163 1153418 1132554 1112957 1091811 1067957 1042827 1018202 994190 970280 947176 925958
53120 925958 906109 886099 865718 846065 827200 807804 787752 769046 752951 737755 721055
53109 721055 703307 687290 674425 663349 652166 640570 629170 618045 606849 595704 585240
53098 585240 576038 568478 562638 557776 552296 545021 536457 528187 521014 514334 507468 500755 494748 488974
53084 488974 482411 475070 468219 462862 458764 455228 452103 449506 447150 444738 442676 441578 441066 439835
53070 439835 437153 433823 431371 430541 430790 431017 430536 429415 428027 426296 423550 419303 414154 409501 406196
53055 406196 403707 400899 397604 394963 393973 393918 392797 389421 384762 381053 379880 381284 384008 386077 385836
53040 385836 383465 381273 381434 383451 384858 384305 382651 380976 379195 377311 376444 377439 379682 382555 386923
53025 386923 393597 401194 407358 411675 415580 419601 422475 423186 422185 420241 417625 414977 413497 413432 413435 412212
53009 412212 409899 407179 403967 399732 394387 388127 381044 373608 366847 361335 356575 351937 347519 343401
52995 343401 338904 333683 328872 325865 324311 322566 320025 317551 315451 312572 308242 303947 301833 302110
52981 302110 303062 303289 302647 301013 297702 292931 288670 286699 286325 285335 283009 280755 279625 278798 277244 275495
52965 275495 274564 274139 273278 272296 272354 273343 273781 272994 272035 271963 272401 272386 271656 270370 268396 265782 263447 262451
52947 262451 262637 262641 261354 259042 257005 256330 257044 258410 259954 261865 264260 266475 267643 267782 267694 267917 268361
52930 268361 268873 269478 270057 270439 270676 270508 268792 264649 259368 255985 256428 259869 264310 268690 272815 276267
52914 276267 278567 279896 280733 281116 281004 280966 281596 282514 282871 282758 283303 285226 287958 290389 292135 293857 296599
52897 296599 300765 305600 309673 312014 312710 312571 312682 314201 317703 322201 325606 326937 327628 329904 334336
52882 334336 339831 345560 351632 357881 363355 367554 371284 375650 380822 386416 392451 399130 405864 411366
52868 411366 414758 416121 415942 414622 412696 410943 409818 409001 407950 406743 405935 405638 405206 403979 401903
52853 401903 399231 396019 392283 388383 384803 381635 378630 375766 373422 371991 371545 371920 372902 374257 375605
52838 375605 376288 375520 373084 369913 367482 366321 365615 364621 363826 364037 364908 365354 365185 365287 366174 367314 368154
52821 368154 368886 369806 370704 371345 371956 372717 373226 372999 372199 371370 370668 369836 368928 368704 370028 372748 375311 375969
52803 375969 374692 373444 374024 375945 377187 376790 375783 375534 376161 376959 377691 378903 381283 384928 389003 392167
52787 392167 393732 394305 394847 395409 395590 395943 397711 401076 404736 407563 409612 411123 411691 411103 410110 409581
52771 409581 409488 409332 408931 408210 406946 405372 404428 404634 405208 404994 403936 403082 403397 405037 407508 410128 412536
52754 412536 414861 417113 418698 419251 419725 421492 424337 426620 427557 427745 427113 424405 419726 415545 413409
52739 413409 411255 406148 398609 391855 387303 383281 378195 372657 367832 363502 358673 352819 345845 337893
52725 337893 329963 323842 320594 319497 318794 317065 313775 309244 304479 300582 297983 296480 295853 295863 295775 294730
52709 294730 292757 290778 289414 288308 286782 284593 281935 279111 276351 273523 270109 265911 261681 258525
52695 258525 256767 255891 255398 254973 253906 251262 246939 242012 237746 234634 232382 230358 227940 224932 221831
52680 221831 219441 218256 218334 219440 220903 221634 220870 218818 216192 213425 210730 208550 207381 207434 208806 211409
52664 211409 214245 215618 214910 213446 212599 211925 210426 208781 208467 209065 208393 205496 201743 198713 196633 195312
52648 195312 194975 195485 196067 196435 197014 197650 197524 196881 197266 199163 200879 200835 199705 199138 199582 200611 202286
52631 202286 204625 206493 206611 205249 203644 202094 199972 197350 195334 194746 195561 197679 201317 206448 212423
52616 212423 218183 222562 224889 225939 227724 231495 236373 240772 244559 248654 252955 256119 257399 257338 256526
52601 256526 255029 253397 252931 254211 256252 257717 258201 257754 256037 252862 249078 246091 244629 244497 245195
52586 245195 246076 246115 244271 240308 235020 229632 225086 221700 219258 217468 216315 215661 214682 212440 209404
52571 209404 207546 208195 210371 212150 213142 214442 216518 218673 220660 223102 225683 226588 224972 222738 222254
52556 222254 223105 222855 220477 217132 213688 209597 204824 201008 199590 200074 201221 202890 205521 208687 211424
52541 211424 213454 215075 216348 217412 218978 221351 223436 223931 223221 222897 223587 224446 224603 223946 222507 220387
52525 220387 218454 218030 219608 222679 226685 231128 234821 236559 236885 237911 240838 244727 248145 250856 253211
52510 253211 255057 256253 257445 259360 261823 264294 266905 270169 273852 276815 277968 277227 275863 275882 278371
52495 278371 282162 284802 285119 284234 283870 284552 285829 287240 288403 288974 289179 289721 290606 290955 290621 291029 293394
52478 293394 296879 299498 300160 298905 295993 292242 289712 290398 294134 298870 303033 306545 309563 311593 312263
52463 312263 312003 311443 310753 309855 308692 307111 305068 303167 302388 302981 304005 304180 302922 300642 298512 297853
52447 297853 299122 301310 302773 302680 301274 298991 296156 293574 292377 292860 294162 295523 297138 299164 300529
52432 300529 299772 297024 294386 294011 296177 299362 301936 303467 304519 305520 306132 305763 304511 303295 302931
52417 302931 303199 303026 301715 299891 299023 299963 302165 304475 306366 308018 309461 310349 310766 311563 313395 315691
52401 315691 317074 316725 315124 313645 313636 315587 318765 321626 322920 322504 321129 319649 318492 317720 317339 317462
52385 317462 318092 318676 318265 316581 314725 314106 314724 315272 315059 314885 315641 317017 318236 319287 320548 321753
52369 321753 322325 322426 322752 323486 324258 325019 326126 327596 329056 330449 332123 334122 336011 337535 338944 340516
52353 340516 342150 343421 343619 341860 337879 332900 329085 327702 328017 328161 326940 324858 323651 324778 328057
52338 328057 331786 334397 335919 337487 339696 341965 343470 344033 343911 343276 342417 342177 343567 346582 349621
52323 349621 350638 349204 347182 346905 348874 351841 354865 358201 361996 365360 367586 369506 372712 377806
52309 377806 384070 390317 395450 398909 401412 404664 409448 414744 419648 425188 432588 440464 445814 447825
52295 447825 448811 451066 454580 458390 462315 466290 469543 471850 474654 479537 485976 491645 494684 495100 494508
52280 494508 495150 498544 504185 509884 513946 516630 519089 521751 524561 527977 532554 537902 543215 548619
52266 548619 554995 562523 570368 577828 584903 591542 597228 601669 605379 609328 614463 621571 631024 642410
52252 642410 654790 667481 680341 693472 707299 722863 741172 761920 783515 804839 826433
52241 826433 849435 873843 898592 923129 948065 974071 1000786 1027255 1053280 1079957 1108857
52230 1108857 1140701 1174594 1208363 1239744 1267691 1292857 1316905 1341379 1367106 1394231 1422201
52219 1422201 1449553 1474393 1495813 1514838 1533409 1552209 1569836 1584308 1595051 1603158 1610017 1616127
52207 1616127 1621139 1624569 1626376 1627147 1627841 1629111 1630773 1632038 1632281 1631335 1629014 1624998 1619622 1614459 1611299
52192 1611299 1610568 1611429 1613561 1617853 1624693 1632463 1639101 1644920 1652586 1663945 1678077 1693104 1708809
52179 1708809 1726337 1745907 1766109 1785415 1803379 1820247 1836311 1852072 1868331 1885524 1903154
52168 1903154 1920160 1935710 1949554 1961834 1972689 1981952 1989232 1994326 1997302 1998033 1996058 1991336 1984685
52155 1984685 1976810 1967261 1955318 1941738 1928425 1916175 1903960 1890924 1877861 1865713 1853679 1840295
52143 1840295 1825958 1812794 1801811 1791603 1780456 1768589 1757356 1747060 1736982 1727415 1720251 1716858
52131 1716858 1716188 1715828 1714411 1712128 1709193 1705229 1700568 1696990 1696023 1696975 1697643 1696802 1694994 1692931 1690375
52116 1690375 1687199 1684601 1684155 1685798 1687507 1687101 1684004 1679291 1674542 1670760 1667975 1665390 1661968 1657235
52102 1657235 1651794 1647014 1643980 1642536 1641296 1638634 1633733 1626900 1619131 1611439 1604320 1597661 1591169 1584908
52088 1584908 1579199 1574037 1568935 1563532 1557976 1552478 1546864 1540957 1535000 1529115 1522607 1514578 1505327 1496604
52074 1496604 1490163 1486271 1483670 1480769 1476819 1472198 1467740 1463816 1460173 1456509 1452695 1448400 1443185 1437438
52060 1437438 1432489 1429159 1426838 1424799 1423760 1424906 1427813 1430795 1433326 1436690 1442039 1449234 1458099 1469279
52046 1469279 1482870 1497393 1511442 1525770 1542563 1562963 1586204 1611014 1636954 1664430 1694026
52035 1694026 1725878 1759344 1793361 1827336 1861428 1895774 1930002 1963907 1997909 2032190 2065836
52024 2065836 2097611 2127211 2154991 2180704 2203305 2222000 2236912 2248923 2259427 2269728 2279764
52013 2279764 2287600 2291169 2290529 2287487 2283089 2276729 2267995 2258005 2247986 2237550 2225527 2211995 2198325
52000 2198325 2185454 2173207 2161405 2150576 2141227 2133260 2126637 2121918 2119498 2118802 2119000 2120137 2122829
51987 2122829 2127046 2132095 2137759 2144503 2152312 2160319 2168093 2176415 2186004 2196122 2205339 2213214 2220383 2227306
51973 2227306 2233890 2240076 2245772 2250205 2252334 2252011 2249919 2246354 2241016 2233990 2225733 2215915 2203516 2188659
51959 2188659 2173048 2157802 2141928 2123963 2104137 2083633 2062395 2039190 2013682 1987045 1960327
51948 1960327 1933221 1904851 1874932 1843683 1811164 1777281 1742320 1707210 1673083 1640429 1608622
51937 1608622 1576552 1543902 1511433 1479711 1448033 1415109 1380521 1344952 1309192 1273634 1238721
51926 1238721 1205186 1173470 1143109 1112931 1082000 1050544 1019941 991444 964878 938985 913098
51915 913098 887809 863771 840656 817856 795563 774481 755011 737331 721574 707058 692088
51904 692088 675685 659077 644240 631316 618838 606314 594973 585665 577581 569680 562072 555197
51892 555197 548735 542250 536088 530649 525435 519815 514269 509842 506586 503438 499519 494745 489267 483147
51878 483147 476778 470950 466156 462117 458174 453933 449532 445497 442233 439406 435992 431303 425845 420749
51864 420749 416587 413257 410803 409458 408730 407389 404890 402127 400093 398476 396475 394611 394472 396499 399103
51849 399103 400457 400301 399419 398180 396537 395002 394385 394498 393985 391796 388334 384966 382802 381999 381775 381030
51833 381030 379458 378057 377983 378814 378735 376693 373631 371199 369927 369229 368555 367708 366419 364506 362473 361274
51817 361274 361351 362160 362667 362184 360952 360084 360537 361854 362362 361001 358479 356137 354337 352835 352239 353813
51801 353813 357684 362288 365996 368543 370445 371726 371986 371500 371557 373414 377129 381589 385606 388784 391138
51786 391138 392256 391461 388857 385560 382565 380070 378266 378025 379941 383189 386255 388505 390193 391423 392325
51771 392325 394089 398177 404055 409057 411351 411993 413158 415282 417269 418857 421083 424162 426417 426212 424205
51756 424205 422747 423342 425551 428254 430987 433559 435164 434789 432462 429367 426628 424499 422902 422160 422774
51741 422774 424845 428042 431869 435670 438725 440778 442286 443854 445601 447283 448738 449879 450574 450939 451530
51726 451530 452869 454987 457632 460590 463453 465533 466592 467403 469107 472200 476324 480635 484007 485558
51712 485558 485709 486215 488361 491526 494291 496447 498885 501973 505332 509088 513932 519738 525415 530591 536280
51697 536280 543360 551406 559709 568431 577632 585819 590749 591815 590661 589072 586834 582406 575594 568776
51683 568776 564830 564072 564001 562217 558822 555587 553693 552987 552743 552158 550545 547997 545525 543729 541835 539094
51667 539094 536494 535631 536279 536754 536557 536816 537801 537901 535843 532417 529081 526182 523594 521818 521182 520774
51651 520774 519347 516736 513421 509417 504764 500654 498816 499674 501744 502877 501835 499076 496386 495425 496240
51636 496240 497552 498489 499150 499322 497969 494834 491511 489908 490431 492598 496475 502132 508375 513548 517471
51621 517471 521360 525941 530726 535110 538954 541965 543495 543213 541307 537940 533233 527781 522296 516547
51607 516547 509450 500557 490928 482213 475191 469400 463820 457854 451844 446631 442460 438595 434318 429981
51593 429981 426500 424061 421959 419619 417167 415017 413449 412641 412605 412970 413133 412689 411509 409545 406910 404077
51577 404077 401697 400266 400028 400912 402369 403606 404223 404291 403773 402589 401444 401530 402746 403149 401225 397956
51561 397956 395513 394472 393702 392635 392102 392808 394350 396077 397751 398875 398470 396279 393554 391972 392065 393047
51545 393047 393855 394132 394428 395570 397647 399828 401605 403819 407710 413042 418129 421830 424714 428039 432367
51530 432367 437547 443352 449594 455886 461587 465827 467780 467492 466367 466061 466654 466488 464025 459279 453465
51515 453465 448038 444295 442979 443644 444872 445623 446003 446502 447176 448082 449904 453353 458154 463238 467907 472305
51499 472305 476730 480992 484725 488075 491624 495472 498783 500762 501945 503717 506387 508604 509198 508709 508262
51484 508262 507758 506489 505005 504879 506624 509170 511467 513318 514562 514862 514742 515424 517041 518243 518251 518092
51468 518092 518933 520305 520999 520743 519925 518486 516339 514299 513359 513259 512744 510985 508054 504406 500834 498540
51452 498540 498266 499441 500796 501451 500833 498366 494407 490914 489683 490102 490057 488926 488043 487976 487245 484758 482074
51435 482074 481812 484464 488104 490950 493001 495127 497596 499911 501505 502245 502569 503391 505558 509120 513325
51420 513325 517508 521831 526853 532599 538402 543683 548501 553246 558144 563246 568508 573513 577479 580017
51406 580017 581708 583366 584899 585492 584928 584047 583753 584119 584686 585082 585239 585510 586641 588832 590629 589824 586072
51389 586072 581775 579513 579251 578929 577162 574232 570806 567018 562879 558478 553322 546404 537483 527875 519577
51374 519577 513721 509920 506800 503122 498663 494108 489987 486050 481974 478179 475294 473188 471323 469839
51360 469839 469363 469816 470490 471452 473720 477512 481234 482959 482379 480675 478960 477521 476197 474660 472320
51345 472320 468570 463415 457753 452915 449724 447638 444823 439609 432176 424446 418111 413160 408483 403323
51331 403323 397636 391557 385244 379182 374022 370077 367191 365001 363042 360738 357706 354052 350150 346229
51317 346229 342389 338840 335720 332770 329517 325817 322013 318602 315850 313594 311328 308650 305834 303621
51303 303621 302228 300842 298573 295639 293156 291869 291549 291515 291261 290613 289745 289182 289354 290111 290917 291580 292373
51286 292373 293432 294435 294979 294979 294667 294588 295642 298580 303181 308264 312781 316653 320445 324588 329109 333735
51270 333735 337904 340902 342378 342690 342606 342731 343282 344048 344339 343244 340377 336365 332395 329217 326665 324056
51254 324056 320958 317566 314306 311153 307673 303945 300906 299062 297238 293707 288650 284308 282208 281377
51240 281377 280114 278439 277543 277578 277492 276745 275575 273569 269651 264134 259496 258088 259771 262506 264653 265925
51224 265925 266632 266967 267042 266996 266955 267032 267180 266977 265938 264234 262746 262265 263009 264861 267261 268682 267378 263535
51206 263535 259821 258763 260036 261234 260776 258917 256326 253250 250243 248362 248071 248813 250093 252044 254385
51191 254385 255756 254973 252519 250028 248571 247996 247714 247498 247572 248283 249557 250492 249898 247751 245776 245924 248286
51174 248286 251055 252558 252779 252777 253204 253783 254010 253970 254407 256084 259046 262434 265088 266341 266276 265380 264218
51157 264218 263401 263469 264518 266036 267345 268229 269046 270267 272067 274434 277485 281503 286502 291711 295598
51142 295598 296764 295244 292884 291908 292806 293971 293863 293179 294112 297490 301534 303935 304416 304446 304886 305009 303946
51125 303946 302150 300857 300628 301066 301731 302711 304100 305367 305631 304591 302967 301800 301358 300994 300155 299199
51109 299199 298884 299194 299149 297854 295401 292580 289964 287518 285009 282559 280704 279824 279510 278753 277060 275274
51093 275274 274832 276104 277822 278364 277335 275708 274686 274777 275750 276979 277702 277372 276213 275403 276303 279135
51077 279135 282423 284027 282953 280109 277304 275649 275015 274679 274169 273630 273663 274646 275874 275662 272957 268830
51061 268830 265538 263853 262157 258872 255083 253577 255296 257880 258279 256054 253418 252554 253807 256372 259678
51046 259678 263578 267771 271640 274506 275769 275208 273517 272216 272453 274140 276726 280395 285566 291450 296229
51031 296229 298925 300090 300398 299749 298425 297967 299720 303165 306783 309974 312862 314803 314830 313729 313988 316890
51015 316890 320788 323108 323288 322861 323281 324639 326253 327633 328781 330156 332460 335957 339844 342674 343733
51000 343733 343879 344784 347290 350698 353704 355727 356934 357279 356400 354670 353484 353744 354622 354573 353162 351057
50984 351057 348682 346015 343563 342196 341819 341424 340851 341309 343474 346142 347719 348385 349734 352723 356840
50969 356840 361045 364683 367506 369527 370921 371759 371941 371722 371975 373310 375110 376150 376239 376682 378809 382427
50953 382427 386126 389060 392022 396534 403001 410186 416588 421837 426389 430529 434535 439430 446254 454398
50939 454398 461820 467445 472460 478589 486034 493943 502108 511030 520718 530641 540926 552545 566024
50926 566024 580764 596054 612287 630551 651150 672921 694220 714490 734692 756245 779957
50915 779957 806150 835148 866935 900731 936068 974265 1017624 1066890 1120636 1177618 1238519
50904 1238519 1304439 1374814 1448182 1524454 1605069 1691132 1782503 1878413 1977675 2078113 2177000
50893 2177000 2272678 2365155 2454656 2540094 2619422 2691217 2755449 2812584 2862200 2902939 2934071
50882 2934071 2956693 2972781 2983326 2988342 2988562 2985677 2980467 2972213 2960992 2949309 2939925 2932725 2925008
50869 2925008 2914208 2898862 2877577 2849084 2813562 2772387 2726139 2674012 2615352 2550528 2479998
50858 2479998 2403868 2322977 2239294 2154495 2068972 1982947 1897895 1816020 1738646 1665670 1596462
50847 1596462 1530945 1469931 1414430 1364550 1319282 1277794 1240570 1208647 1181973 1159261 1139214
50836 1139214 1121072 1104215 1088425 1074482 1063370 1054826 1047834 1042542 1040222 1040989 1043089 1045123 1047550
50823 1047550 1051087 1055041 1058552 1062519 1068702 1077314 1086835 1096105 1105647 1116942 1131197 1148693 1168624
50810 1168624 1189621 1210951 1233134 1257089 1283129 1311285 1342022 1375753 1412049 1450346 1491312
50799 1491312 1536522 1586645 1640925 1698859 1761583 1830974 1907813 1991659 2082551 2182113 2292442
50788 2292442 2414108 2545921 2686792 2837157 2998069 3169571 3350864 3541677 3742085
50779 3742085 3950645 4163895 4378366 4592234 4804118 5010758 5206781 5386668 5546644
50770 5546644 5685177 5802379 5898730 5973773 6026116 6055107 6062544 6052734 6031285 6003801 5974765
50759 5974765 5946720 5920644 5897421 5878408 5864060 5852596 5840759 5825429 5803755 5772275 5727244
50748 5727244 5666052 5587683 5491831 5378298 5247287 5099575 4936393 4759825 4573369 4381293
50738 4381293 4187150 3993517 3803321 3620470 3448450 3288685 3140896 3004883 2881428
50729 2881428 2771598 2675761 2593499 2524043 2466393 2419266 2381515 2352775 2333191 2322085 2317149
50718 2317149 2315545 2315668 2317302 2320213 2323436 2325990 2327246 2326231 2321607 2313174 2302512 2291099 2278393
50705 2278393 2262943 2244879 2225847 2206487 2185596 2162363 2138192 2115341 2094482 2074520 2054343
50694 2054343 2033750 2012871 1991683 1970479 1950274 1932285 1917153 1904840 1895178 1888403 1885246 1886581
50682 1886581 1892864 1903851 1919077 1938826 1964508 1997660 2038451 2085544 2137702 2195312 2260047
50671 2260047 2333236 2415015 2504853 2602259 2706866 2818371 2936551 3060845 3189509 3319513
50661 3319513 3447661 3571807 3690917 3804138 3909825 4005200 4087142 4153799 4205441 4243073
50651 4243073 4266195 4272793 4262005 4236066 4199165 4155158 4107079 4058078 4011467 3969719 3934052
50640 3934052 3904853 3881690 3862964 3846461 3830687 3815273 3799762 3782163 3758950 3726492 3682608
50629 3682608 3626927 3559981 3482438 3395671 3302591 3206650 3109704 3011908 2914237 2820005 2732922
50618 2732922 2654590 2585060 2524903 2475090 2435369 2404695 2383469 2373677 2376328 2390283 2414288 2448753
50606 2448753 2494508 2550771 2615465 2686825 2763611 2844251 2926916 3010358 3093654 3175013 3251631
50595 3251631 3321248 3383678 3440593 3493748 3543224 3587270 3623999 3653252 3676591 3695578 3710630
50584 3710630 3721681 3729271 3734390 3737707 3739632 3741072 3743681 3749366 3759796 3776061 3798260 3825356 3855903
50571 3855903 3889118 3925075 3963781 4004183 4044047 4080769 4112432 4138366 4158757 4173693 4182701
50560 4182701 4185262 4181541 4172390 4158823 4141809 4122465 4102050 4081731 4062736 4046906 4036602 4033364
50548 4033364 4036493 4043329 4051310 4059674 4069008 4079323 4088980 4095372 4096157 4089709 4074963 4051316 4018375
50535 4018375 3975417 3921334 3855547 3778721 3692135 3596652 3493043 3383157 3269881 3155706
50525 3155706 3042102 2930551 2823184 2721500 2625078 2532640 2444312 2361794 2286138 2216559
50515 2216559 2152225 2094398 2045424 2005591 1972270 1942835 1917501 1898233 1885442 1877170 1871650 1869270
50503 1869270 1871304 1877870 1888376 1903403 1924754 1953429 1988545 2028470 2072254 2119680 2170770 2225924
50491 2225924 2286165 2352603 2425713 2505427 2591750 2684735 2783717 2886843 2991735 3096748 3201488
50480 3201488 3305882 3408760 3507713 3600554 3686655 3766819 3842423 3915301 3987965 4062926 4141497
50469 4141497 4223710 4309457 4399221 4493693 4593315 4698415 4809225 4925597 5047305 5174900
50459 5174900 5309560 5451470 5598692 5748062 5896898 6043398 6185808 6321910 6449148
50450 6449148 6564612 6664883 6746482 6806699 6843783 6856551 6844470 6808257 6749739 6670679 6572139
50439 6572139 6455463 6323666 6181327 6033403 5884669 5740104 5604681 5482179 5374733
50430 5374733 5284036 5212233 5160710 5128346 5112057 5109072 5117552 5134636 5154949 5171712 5178711 5170807
50418 5170807 5143701 5094596 5023009 4930107 4817313 4686020 4538337 4377325 4206669 4030696
50408 4030696 3854244 3681430 3514290 3353111 3198010 3049738 2909408 2778307 2657784
50399 2657784 2548335 2448819 2357498 2273960 2199274 2134230 2078324 2030340 1989039 1953290 1922723
50388 1922723 1898363 1881372 1870857 1864220 1860134 1859790 1864446 1873123 1883885 1896330 1911491 1929987
50376 1929987 1951728 1977023 2006499 2039871 2075911 2113831 2153906 2196527 2241391 2287835 2335556
50365 2335556 2384788 2435974 2489131 2543329 2597170 2650125 2703035 2756825 2811222 2865428 2919746
50354 2919746 2975682 3034452 3095984 3159355 3223727 3289033 3356284 3427100 3502375 3581375 3662515
50343 3662515 3744675 3827322 3909758 3991015 4070168 4145888 4215827 4277409 4329365 4371768 4404539
50332 4404539 4426660 4436716 4433297 4414824 4380105 4329463 4264336 4185448 4092473 3986237 3870263
50321 3870263 3749145 3626060 3502882 3382178 3267611 3162224 3067386 2983703 2912019 2852898
50311 2852898 2805809 2769647 2743944 2728928 2724170 2727319 2734271 2740610 2743197 2740694 2732616 2717877 2694472
50298 2694472 2660738 2616610 2563261 2501864 2433524 2360412 2285867 2212572 2141033 2070477 2000799
50287 2000799 1932938 1867790 1805890 1748080 1695336 1647612 1603763 1563027 1525678 1491882 1460952
50276 1460952 1432447 1407031 1385298 1366480 1349450 1334468 1322756 1314738 1309922 1308315 1310578 1316574
50264 1316574 1324913 1334332 1344705 1356462 1369846 1385024 1402112 1420834 1440878 1462705 1487050 1513397
50252 1513397 1540055 1566121 1592298 1619197 1646130 1672532 1699358 1727745 1757134 1786186 1814997
50241 1814997 1844700 1875091 1904298 1931007 1955468 1977943 1997683 2014118 2027671 2038284 2044245
50230 2044245 2043885 2037974 2029263 2019896 2010205 1999653 1987592 1972957 1954515 1932106 1907058 1880906
50218 1880906 1854110 1826221 1796700 1765209 1731787 1697472 1664494 1635082 1609837 1587372 1565510
50207 1565510 1542806 1519362 1496666 1476500 1459590 1445155 1431891 1419257 1407735 1398083 1390636 1385242
50195 1385242 1381602 1379672 1379683 1381499 1384026 1385805 1386456 1386970 1388197 1389605 1390102 1389453 1388057 1385808 1382183
50180 1382183 1377272 1371723 1365783 1359414 1353197 1347856 1342741 1336071 1327133 1316997 1306536 1295191 1282720
50167 1282720 1270897 1261904 1255665 1250229 1244523 1239294 1235402 1232572 1230289 1228904 1229271 1231741 1235876 1240824
50153 1240824 1245859 1250833 1256023 1261273 1265701 1268879 1271876 1276011 1280648 1283386 1282793 1279867 1276229 1271929
50139 1271929 1265941 1258081 1249181 1239623 1228959 1217307 1206120 1196850 1189235 1181578 1172621 1162585 1152351
50126 1152351 1142242 1132020 1121771 1112227 1104125 1097562 1091919 1086168 1079384 1071449 1063301 1056012 1049524
50113 1049524 1042856 1035708 1029203 1024661 1022208 1021031 1020398 1019760 1018337 1015497 1011443 1006910 1002294 997579
50099 997579 992866 988192 982926 976065 967305 957378 947261 937461 928053 919068 910844 904009 898661 893395
50085 893395 886082 876369 866566 859001 853272 847548 841911 838375 837659 838083 838232 838689 840121 841485 841706
50070 841706 841723 843041 845106 846060 845876 846957 851345 858605 866855 874865 882641 890650 899092 907789 916614
50055 916614 925913 936183 947211 958133 968718 979910 992291 1004637 1014947 1022567 1028308 1032937
50043 1032937 1036935 1041576 1048505 1057698 1067176 1075578 1083878 1093561 1104133 1113904 1122801 1132884 1145796
50030 1145796 1160879 1176389 1191726 1207662 1224704 1242155 1259038 1275422 1292468 1311315 1332276
50019 1332276 1355000 1378908 1403254 1427191 1450337 1473301 1497307 1523290 1551611 1582545 1616507
50008 1616507 1653505 1692733 1733211 1774852 1818665 1865809 1916621 1970706 2027881 2088691 2153764
49997 2153764 2222852 2295010 2369824 2448032 2530603 2617511 2707679 2799502 2890626 2977406 3055766
49986 3055766 3123145 3179257 3224898 3260718 3287519 3306760 3319802 3326969 3328180 3324298 3316896 3306574
49974 3306574 3292134 3271414 3242218 3202404 3150365 3086372 3012972 2933283 2849162 2761639 2672548
49963 2672548 2584549 2499445 2417556 2339126 2265401 2197632 2135704 2078684 2026447 1979818 1939128
49952 1939128 1903503 1871927 1844199 1820216 1798749 1777888 1756832 1736608 1718498 1702112 1685666
49941 1685666 1668186 1650712 1634795 1620190 1604790 1586830 1566464 1544991 1523276 1501499 1479903
49930 1479903 1458933 1438679 1418757 1398794 1378682 1358569 1339181 1321992 1308261 1297564 1287912
49919 1287912 1277705 1267234 1257961 1250798 1245487 1241385 1238332 1236786 1237303 1239784 1243247 1246695 1250405 1255878
49905 1255878 1264141 1274472 1285188 1295295 1304847 1314188 1323737 1334409 1347245 1362271 1378472 1395362
49893 1395362 1414047 1436120 1461761 1489601 1518418 1548463 1581057 1617405 1658222 1704216 1756283
49882 1756283 1814982 1880193 1951767 2030464 2117746 2214385 2319545 2431414 2548267 2668417
49872 2668417 2789369 2907751 3020369 3125019 3220417 3306097 3382877 3452984 3518956 3582190
49862 3582190 3642611 3699394 3751520 3797624 3835716 3863185 3876948 3873800 3851368 3809249 3749227
49851 3749227 3674152 3586527 3488081 3380310 3265082 3144654 3021263 2896740 2772572 2650354
49841 2650354 2531951 2418872 2311442 2209043 2111458 2019625 1934617 1856051 1782098 1711163
49831 1711163 1643284 1579838 1522235 1470977 1425542 1384751 1347247 1311869 1277919 1245417 1215322
49820 1215322 1189081 1167262 1148460 1129931 1109561 1087214 1064406 1043076 1024446 1008284 993088
49809 993088 977604 962384 949224 938835 929810 920353 910286 900865 893367 888539 886490 886055 884904
49796 884904 881693 877824 875769 875803 875881 874813 874015 875493 879478 884826 890586 896155 900843 904576 908546
49781 908546 914016 920681 927125 932736 938350 945063 953138 962127 971488 981058 991365 1003469 1018201
49768 1018201 1035734 1056089 1079432 1105349 1132554 1160464 1190815 1226509 1268729 1316212 1367589
49757 1367589 1423355 1484976 1552972 1626660 1705132 1787519 1872361 1957440 2040373 2119063 2191646
49746 2191646 2256428 2312188 2358623 2396501 2427203 2451892 2471282 2486493 2499690 2512850 2525430
49735 2525430 2533808 2533421 2521191 2495848 2456932 2404437 2339167 2262683 2176986 2084811 1989819 1895574
49723 1895574 1804125 1716152 1632444 1554350 1482540 1416159 1353929 1295810 1243077 1196931 1157331
49712 1157331 1122943 1091913 1062889 1035717 1011108 989433 970040 951948 934929 919484 905931
49701 905931 894037 883565 874735 867934 863129 859631 856332 852209 846943 841140 835841 831736 828825 826714
49687 826714 825079 823978 823912 825340 827860 830045 830575 829470 827896 826900 826783 827548 829139 831086 832612 833496
49671 833496 834399 835972 838087 840313 842670 845375 848203 850709 852883 855067 857305 859277 860890 862487
49657 862487 864351 866240 867486 867501 866379 865126 865015 866391 868274 869452 869784 870095 871004 872305 873465 874307
49641 874307 875006 875614 875763 875027 873708 873076 874269 876976 879772 881936 884193 887331 890906 893967 896344
49626 896344 898339 899716 900105 900230 901731 905661 911739 918772 925059 928796 929303 928006 927292 928195 929856
49611 929856 931111 931716 932016 932424 933402 935116 937037 938728 940851 944200 947742 949140 947692 945479 944960
49596 944960 946614 949517 952865 955971 957891 958337 958244 958445 958472 957632 956500 956158 956513 956628 956381 956688 958229
49579 958229 960874 964140 967271 969114 968970 967615 966708 967200 968899 971249 973695 975411 975644 974512 972922
49564 972922 971786 971807 973724 977947 983885 990221 995815 1000104 1003158 1005938 1009958 1015808 1022418 1028651 1035065
49549 1035065 1043032 1052512 1062045 1070800 1079382 1088591 1098672 1109832 1122210 1135190 1148065 1161633
49537 1161633 1177714 1196572 1216201 1234826 1252880 1271759 1292027 1313869 1338028 1364767 1392650
49526 1392650 1419864 1446487 1474245 1504303 1536425 1569970 1604448 1639175 1673822 1709616 1748783
49515 1748783 1792208 1838563 1886313 1935716 1987996 2043161 2099645 2156112 2212909 2271694 2334172
49504 2334172 2401184 2472214 2545375 2618313 2689852 2760943 2833716 2909434 2987405 3065744 3142876
49493 3142876 3218261 3292067 3364616 3436127 3506588 3575544 3641961 3704482 3761918 3813537 3858957
49482 3858957 3898026 3930970 3958412 3980699 3997104 4006224 4007476 4001866 3990938 3975523 3956193 3934378
49470 3934378 3911905 3889444 3866453 3842969 3820499 3800662 3783843 3769781 3758841 3751984 3749827 3752180
49458 3752180 3758089 3766118 3775348 3786637 3802178 3823200 3848801 3877603 3909529 3944927 3982814 4021506
49446 4021506 4060603 4100911 4142270 4182646 4219691 4252410 4281079 4306088 4326946 4342030 4349491
49435 4349491 4348772 4340797 4326306 4304819 4275888 4240155 4197868 4147505 4087813 4020493 3948696 3873169
49423 3873169 3792331 3706257 3617888 3529426 3440058 3348706 3256990 3167599 3081227 2997047 2915122
49412 2915122 2836285 2760234 2685702 2612561 2542302 2476374 2415112 2358224 2305158 2254858 2206172
49401 2206172 2158933 2114151 2072962 2035634 2001444 1969219 1938175 1908561 1881300 1856870 1834907
49390 1834907 1814898 1796465 1778803 1760910 1743021 1726850 1713580 1702445 1692144 1682704 1674830 1668287
49378 1668287 1662392 1657499 1654424 1652693 1650908 1648926 1648178 1649588 1652468 1655905 1660013 1665264 1671525 1678437
49364 1678437 1686112 1694923 1705125 1717052 1731165 1747625 1766257 1787147 1810553 1835909 1861505 1885636
49352 1885636 1907630 1927490 1945102 1960501 1974609 1989065 2005143 2023004 2041914 2061055 2080243
49341 2080243 2100140 2121891 2146518 2174411 2205032 2236943 2268614 2299583 2330639 2362538 2394841
49330 2394841 2426457 2456881 2486203 2514286 2540997 2567220 2594551 2623537 2653063 2681925 2710163
49319 2710163 2738243 2765621 2791156 2814726 2837556 2860837 2884575 2907984 2930600 2952813 2975645
49308 2975645 3000209 3027171 3056439 3087267 3118661 3149807 3180314 3210373 3240749 3272373 3305625
49297 3305625 3340079 3375192 3411376 3449972 3491940 3536818 3583479 3631754 3682652 3736883 3793807
49286 3793807 3852207 3911647 3972682 4036142 4102636 4172371 4244913 4319415 4395646 4474692 4558162
49275 4558162 4646868 4740569 4838520 4939607 5042424 5146336 5252530 5362930 5477794 5595208
49265 5595208 5713339 5832298 5953165 6075854 6198820 6320541 6440519 6558870 6675484
49256 6675484 6789569 6899592 7003663 7100385 7189389 7270828 7344410 7409123 7463752 7507367 7539539
49245 7539539 7560632 7571978 7575256 7571469 7560689 7542830 7518397 7488447 7454291 7417420 7379337 7341026
49233 7341026 7302799 7264865 7227873 7192591 7159470 7129072 7102654 7081687 7066726 7057369 7053349 7055059
49221 7055059 7062802 7076160 7094338 7116547 7141839 7169373 7199378 7232970 7270235 7309218 7347803
49210 7347803 7385935 7424592 7462781 7497031 7524138 7543222 7554767 7558927 7555471 7544386 7525562 7498313
49198 7498313 7461831 7415755 7360002 7294722 7220858 7140057 7053445 6961105 6863307 6761484 6657293
49187 6657293 6551419 6444306 6337502 6233161 6132256 6034092 5937496 5841824 5747116 5654125
49177 5654125 5564176 5478195 5395808 5315948 5238226 5163056 5090632 5020697 4953430 4889647 4829645
49166 4829645 4772381 4716246 4660534 4605968 4553902 4505018 4458771 4414293 4371917 4333279 4299467
49155 4299467 4269541 4241604 4215037 4190887 4170110 4152314 4136389 4121748 4108693 4097944 4089867
49144 4089867 4083873 4078698 4073809 4070323 4069839 4072314 4075931 4079280 4082964 4088624 4097010 4107658 4120148 4134903
49130 4134903 4152505 4172626 4194110 4216253 4239604 4265097 4292605 4321117 4350508 4382171 4417227
49119 4417227 4454678 4492264 4528842 4565151 4602452 4641283 4681505 4722713 4764396 4806231 4848304
49108 4848304 4890622 4932610 4973743 5014462 5055634 5097117 5137735 5176811 5214924 5252917 5291082
49097 5291082 5329776 5370078 5412971 5458086 5503780 5548600 5592571 5637137 5683817 5732724 5782470
49086 5782470 5831698 5880526 5930131 5981155 6033022 6084673 6135337 6184542 6231919 6277236 6320443
49075 6320443 6361660 6401219 6439549 6476842 6513271 6549707 6587503 6626914 6666362 6704021 6739638
49064 6739638 6774021 6807460 6839785 6871374 6902632 6932750 6960348 6985260 7008272 7029335 7047681
49053 7047681 7063789 7079404 7095077 7109219 7120182 7127914 7133116 7136465 7139396 7143884 7150262 7156687 7162068
49040 7162068 7168175 7177335 7189151 7201205 7212278 7223199 7234884 7247110 7259168 7270550 7281085 7291387
49028 7291387 7302836 7316023 7329512 7341354 7351677 7362601 7375649 7390399 7405719 7421027 7435962
49017 7435962 7449911 7462548 7474220 7485289 7495505 7504403 7512050 7519127 7526344 7533774 7540554 7545328 7547239
49004 7547239 7546447 7543550 7538823 7532143 7523190 7511291 7495603 7476071 7453895 7430492 7406268 7380907
48992 7380907 7354265 7326174 7295783 7262162 7225505 7187000 7147597 7107653 7067557 7027708 6987855
48981 6987855 6947423 6906610 6866373 6827218 6788964 6751874 6716949 6684644 6654268 6625244 6598127
48970 6598127 6573642 6551512 6531144 6512838 6497139 6483289 6469632 6455728 6442834 6431812 6421708
48959 6421708 6411379 6401773 6395280 6392920 6393347 6394790 6396867 6400037 6404406 6409899 6416675 6424221 6430594 6433921
48945 6433921 6434446 6433877 6432927 6430923 6427860 6425035 6422886 6419648 6413240 6403526 6391767 6378747 6364611 6349777
48931 6349777 6334610 6318516 6300449 6280306 6258989 6237375 6215981 6195221 6174975 6154083 6131176
48920 6131176 6105913 6078706 6049735 6019282 5988640 5959171 5930338 5900019 5867167 5833027 5799257
48909 5799257 5766008 5732638 5699454 5667695 5638090 5610110 5582510 5554217 5525091 5496407 5470426
$$ [...]
##END NTUPLES=NMR SPECTRUM
##END=
