
##TITLE=AC1085_CSTA01_5819259_p0tdv5XrwB
##JCAMPDX= 6.0         $$ Bruker NMR JCAMP-DX V2.0
##DATA TYPE= NMR SPECTRUM
##DATA CLASS= NTUPLES
##ORIGIN= BRUKER
##OWNER= Administrator
$$ 1.72 TOPSPIN		Version 2.1
$$ 2012-03-24 19:36:45.156 -0500  Administrator@TOPSPIN
$$ Compression mode = diff/dup
##.OBSERVE FREQUENCY= 400.13188235
##.OBSERVE NUCLEUS= ^1H
##.ACQUISITION MODE= SIMULTANEOUS (DQD)
##.ACQUISITION SCHEME= undefined
##.AVERAGES= 8
##.DIGITISER RES= 22
##SPECTROMETER/DATA SYSTEM= spect
##.PULSE SEQUENCE= zg30
##.SOLVENT NAME= COFFEE_meoh
##.SHIFT REFERENCE= INTERNAL, COFFEE_meoh, 1, 14.98061
##AUDIT TRAIL= $$ (NUMBER, WHEN, WHO, WHERE, PROCESS, VERSION, WHAT)
$$ ##TITLE= Audit trail, TOPSPIN		Version 2.1
$$ ##JCAMPDX= 5.01
$$ ##ORIGIN= Bruker BioSpin GmbH
$$ ##OWNER= Administrator
$$ $$ C:\Bruker\TOPSPIN/data/COFFEE/nmr/AC1085_CSTA01_5819259_p0tdv5XrwB/10/pdata/1/auditp.txt
$$ ##AUDIT TRAIL=  $$ (NUMBER, WHEN, WHO, WHERE, PROCESS, VERSION, WHAT)
(   1,<2012-03-24 19:36:37.234 -0500>,<Administrator>,<TOPSPIN>,<go>,<TOPSPIN 2.1>,
      <created by zg
	started at 2012-03-24 19:35:30.656 -0500,
	POWCHK enabled, PULCHK disabled,
       configuration hash MD5:
       1A 1E CE 29 27 FD 77 03 67 4E F0 E3 C4 B2 CB 90
       data hash MD5: 64K
       89 D9 28 79 7C 85 9B CB 65 F5 38 E8 23 47 B8 30>)
(   2,<2012-03-24 19:36:40.843 -0500>,<Administrator>,<TOPSPIN>,<proc1d>,<TOPSPIN 2.1>,
      <Start of raw data processing
       efp LB = 0 FT_mod = 6 PKNL = 1 PHC0 = 0 PHC1 = 0 SI = 32K 
       data hash MD5: 32K
       C4 C8 EE CE ED FC 4F 66 3D 38 26 91 71 D8 D9 AE>)
(   3,<2012-03-24 19:36:41.171 -0500>,<Administrator>,<TOPSPIN>,<proc1d>,<TOPSPIN 2.1>,
      <pk PHC0 = 215.2936 PHC1 = 0 
       data hash MD5: 32K
       1A 16 97 C7 25 00 3B 45 E8 77 9B 6A 1C 15 36 D6>)
(   4,<2012-03-24 19:36:41.250 -0500>,<Administrator>,<TOPSPIN>,<proc1d>,<TOPSPIN 2.1>,
      <abs ABSG = 1 
       data hash MD5: 32K
       2A D3 13 8D 9B 9A BA 73 9D B4 0C 74 C5 37 D1 2A>)
(   5,<2012-03-24 19:36:41.281 -0500>,<Administrator>,<TOPSPIN>,<proc1d>,<TOPSPIN 2.1>,
      <abs ABSG = 2 
       data hash MD5: 32K
       49 2F D4 EF 1B 9B E5 B3 AF 23 05 C2 9C F2 1C 4D>)
(   6,<2012-03-24 19:36:41.312 -0500>,<Administrator>,<TOPSPIN>,<proc1d>,<TOPSPIN 2.1>,
      <abs ABSG = 3 
       data hash MD5: 32K
       1F C5 D2 26 50 A4 2C CD BD F9 BA 2D CE FD 03 BD>)
(   7,<2012-03-24 19:36:41.343 -0500>,<Administrator>,<TOPSPIN>,<proc1d>,<TOPSPIN 2.1>,
      <abs ABSG = 4 
       data hash MD5: 32K
       E6 3B 5B 42 F7 50 91 BC DD 7F ED 30 81 8D F3 DD>)
(   8,<2012-03-24 19:36:41.359 -0500>,<Administrator>,<TOPSPIN>,<proc1d>,<TOPSPIN 2.1>,
      <abs ABSG = 5 
       data hash MD5: 32K
       15 96 B6 67 8C EC 6F 71 F1 26 D2 05 A3 CD C5 91>)
$$ ##END=
$$ 
$$ $$ hash MD5
$$ $$ D4 1A 49 0A F0 83 F9 60 D4 D3 08 56 66 99 9A 3B
##$RELAX= 
##$RELAX= 
##$RELAX= 
##$RELAX= 
##$RELAX= 
##$RELAX= 
##$RELAX= 
$$ Bruker specific parameters
$$ --------------------------
$$ [...]
150 150 150 150 150 150 150 150
##$TP07= 0
##$TPNAME0= <>
##$TPNAME1= <>
##$TPNAME2= <>
##$TPNAME3= <>
##$TPNAME4= <>
##$TPNAME5= <>
##$TPNAME6= <>
##$TPNAME7= <>
##$TPOAL= (0..7)
0.5 0.5 0.5 0.5 0.5 0.5 0.5 0.5
##$TPOFFS= (0..7)
0 0 0 0 0 0 0 0
##$TUNHIN= 0
##$TUNHOUT= 0
##$TUNXOUT= 0
##$USERA1= <user>
##$USERA2= <user>
##$USERA3= <user>
##$USERA4= <user>
##$USERA5= <user>
##$V9= 5
##$VALIST= <valist>
##$VCLIST= <CCCCCCCCCCCCCCC>
##$VD= 0
##$VDLIST= <DDDDDDDDDDDDDDD>
##$VPLIST= <PPPPPPPPPPPPPPP>
##$VTLIST= <TTTTTTTTTTTTTTT>
##$WBST= 2048
##$WBSW= 25
##$XGAIN= (0..3)
0 0 0 0
##$XL= 0
##$YL= 0
##$YMAX_a= 535542
##$YMIN_a= -640516
##$ZGOPTNS= <>
##$ZL1= 120
##$ZL2= 120
##$ZL3= 120
##$ZL4= 120
##$ABSF1= 14.98061
##$ABSF2= -5.57192
##$ABSG= 5
##$ABSL= 3
##$ALPHA= 0
##$AQORDER= 0
##$ASSFAC= 0
##$ASSFACI= 0
##$ASSFACX= 0
##$ASSWID= 0
##$AUNMP= <proc_prof1d_extract_pilot.lims>
##$AXLEFT= 0
##$AXNAME= <>
##$AXNUC= <1H>
##$AXRIGHT= 0
##$AXTYPE= 0
##$AXUNIT= <>
##$AZFE= 0.1
##$AZFW= 0.1
##$BCFW= 0
##$BC_mod= 0
##$BYTORDP= 0
##$COROFFS= 0
##$CY= 15
##$DATMOD= 1
##$DC= 0
##$DFILT= <>
##$DTYPP= 0
##$F1P= 0
##$F2P= 0
##$FCOR= 0.5
##$FTSIZE= 32768
##$FT_mod= 6
##$GAMMA= 0
##$GB= 0
##$INTBC= 1
##$INTSCL= 1
##$ISEN= 128
##$LB= 0
##$LEV0= 0
##$LPBIN= 0
##$MAXI= 10000
##$MC2= 0
##$MEAN= 0
##$ME_mod= 0
##$MI= 0
##$NCOEF= 0
##$NC_proc= -8
##$NLEV= 6
##$NOISF1= 0
##$NOISF2= 0
##$NSP= 0
##$NTH_PI= 0
##$NZP= 0
##$OFFSET= 14.98061
##$PC= 1
##$PHC0= 215.2936
##$PHC1= 0
##$PH_mod= 1
##$PKNL= yes
##$PPARMOD= 0
##$PPDIAG= 0
##$PPIPTYP= 0
##$PPMPNUM= 2147483647
##$PPRESOL= 1
##$PSCAL= 4
##$PSIGN= 0
##$PYNMP= <proc.py>
##$REVERSE= no
##$SF= 400.13
##$SI= 32768
##$SIGF1= 0
##$SIGF2= 0
##$SINO= 400
##$SIOLD= 32768
##$SPECTYP= <>
##$SREGLST= <1H.CDCl3>
##$SSB= 0
##$STSI= 32768
##$STSR= 0
##$SW_p= 8223.68421052632
##$SYMM= 0
##$S_DEV= 0
##$TDeff= 65536
##$TDoff= 0
##$TI= <>
##$TILT= no
##$TM1= 0
##$TM2= 0
##$TOPLEV= 0
##$USERP1= <user>
##$USERP2= <user>
##$USERP3= <user>
##$USERP4= <user>
##$USERP5= <user>
##$WDW= 1
##$XDIM= 32768
##$YMAX_p= 463544529
##$YMIN_p= -706728
##$CURPLOT= <Network HP LaserJet P1505>
##$CURPRIN= <$Network HP LaserJet P1505>
##$DFORMAT= <normdp>
##$LAYOUT= <+/1D_H.xwp>
##$LFORMAT= <normlp>
##$PFORMAT= <normpl>
##$SURQMSG= 1
$$ End of Bruker specific parameters
$$ ---------------------------------
##NTUPLES= NMR SPECTRUM
##VAR_NAME=  FREQUENCY,     SPECTRUM/REAL,   SPECTRUM/IMAG
##SYMBOL=    X,             R,               I
##VAR_TYPE=  INDEPENDENT,   DEPENDENT,       DEPENDENT
##VAR_FORM=  AFFN,          ASDF,            ASDF
##VAR_DIM=   32768,         32768,           32768
##UNITS=     HZ,            ARBITRARY UNITS, ARBITRARY UNITS
##FACTOR=    0.250966925370066, 1,           1
##FIRST=     8223.43324360095, -6148,        -181203
##LAST=      0,             195855,          -131632
##MIN=       0,             -706728,         0
##MAX=       8223.43324360095, 463544529,    0
$$ Real data points
##PAGE= N=1
##DATA TABLE= (X++(R..R)), XYDATA
$$ [...]
19471b92690m0719d0114A29841k6993K4005a88945A2872c64560J56527C6581K25934
19460B62515a42249j8059A09392j5534k6647a58532a6551k44262Q7849E0679b03635
19448C7107g7923k24044A30595a02831I9285h4992L5270j8253j43360B53128j13047
19437A40081b12710J00471e1711j8729k82664e8276j45451E6561b05230A89323
19426A74116B038b57200e7713l28518E6849a8863j29331I6708J20890c72546l3236
19415d05782C6199b68530A51132a76560k22223J16626i9037A90845J59389a52832
19404b53363a21821A4791b93296a14745r8146n2413J8830f5950j0997G7997K20517
19393B98514d1821B3829J23172J81720j37274a94428A22132d52410e989j50936
$$ y = [-292690, -333409, -40114, 129841, 102848, 126853, -188945, 12872, -364560, -208033, 36581, 262515, -142249, -160308, 109392, 93858, 67211, -158532, -16551, -260813, -172964, 50679, -203635, 37107, -77923, -301967, 130595, -102831, 99285, -84992, -49722, -67975, -211335, 253128, 140081, -212710, -112239, -51711, -70440, -353104, -58276, -203727, 56561, -205230, 189323, 174116, 2038, -257200, -57713, -386231, 56849, -18863, -148194, 96708, 217598, -372546, -405782, 36199, -268530, 151132, -176560, -398783, -282157, -99037, 190845, 350234, -152832, -253363, -121821, 14791, -293296, -114745, -212891, -265304, -246474, -65950, -76947, 77997, 298514, -41821, 23829, 147001, 328721, 191447, -194428, 122132, -452410, -5989, -156925]
19383a56925A61993o2459b53961d2753p4196J9771F7432a87895l9726c3624j95728
19372b29352c2648j40804I1190D0157a61538c5067j30368a8688B9554P4688C7209
19360c69489J3813B9821a42248P0835j2411j49821d7324C3178d7612K3177L62
19349b4073D8807a92212A66840e5600B0035a52741M0128b3228o7226D4221c96430
19337A38313h6280p6549C42749c57541a5617B15754a568j06340l05178A75946
19326A74335b45083A22146a77189j2232N5653c4382B28488D5942a19311D437a0792
19314c15672G8722e9102a5621k28027r2751A69986m8599B9780J78925a48283J5039
19303a33244e6674m6012d0932n2870k4239d4621j36055F2202a9263q8569h30j44734
$$ y = [-156925, 161993, 99534, -253961, -42753, -116949, -97178, 67432, -187895, -227621, -33624, -229352, -32648, -173452, 91190, 40157, -161538, -35067, -165435, -18688, 29554, 104242, 37209, -369489, -355676, 29821, -142248, -71413, -83824, -233645, -47324, 33178, -47612, -24435, -24073, 48807, -192212, 166840, -55600, 20035, -152741, -112613, -23228, -90454, 44221, -396430, 138313, -86280, -162829, 342749, -357541, -15617, 215754, -1568, -107908, -413086, 175946, 174335, -245083, 122146, -177189, -189421, -133768, -34382, 228488, 45942, -119311, 4437, -10792, -315672, 78722, -59102, -15621, -243648, -336399, 169986, 121387, 29780, 208705, -148283, -133244, -56674, -102686, -40932, -93802, -118041, -44621, -180676, 62202, -19263, -107832, -830, -145564]
19291a45564B37189a32370L7736j24840B00458b3996D8470h0802o1699q4425d2939
19279c7854k36284P7178G9219a45206q0566P3142O6962E8334a9048l09345D4122
19267e58700a5358q4510E5300a23807n9150C09364d38848D6352a85927e0901j64314
19256b15215D6800a17137r2905D6166c5539k14950j20500J84661M0397f8978B46709
19244c433m10380A44894f4141k98963c2248l2954r360q9544p3753O8849n40b8571
19231B67446f0559B74068a82729l1135Q4739q6551A31752a5755J048j81398A82522
19219B68000f7536A17419a93794e6089A50919B3826f7137F0574a51415H8126a24385
19207c0624A56488a21762i47k293A16621g3657D2770b10260A20788E9114K01113
$$ y = [-145564, 237189, -132370, -94634, -219474, 200458, -23996, 48470, -80802, -142501, -226926, -42939, -37854, -274138, -196960, 79219, -145206, -225772, -152630, -85668, 58334, -19048, -328393, 44122, -558700, -15358, -99868, 55300, -123807, -182957, 309364, -438848, 46352, -185927, -50901, -215215, 46800, -117137, -210042, 46166, -35539, -250489, -370989, -186328, -145931, -68978, 246709, -3433, -413813, 144894, -64141, -363104, -32248, -65202, -74562, -164106, -237859, -169010, -169550, -28571, 267446, -60559, 274068, -182729, -213864, -129125, -215676, 131752, -15755, -14707, -196105, 182522, 268000, -67536, 117419, -193794, -56089, 150919, 23826, -67137, 60574, -151415, 88126, -124385, -30624, 156488, -121762, -947, -3240, 116621, -73657, 42770, -210260, 120788, 59114, 260227]
19196B60227A9610b0415B38819a96233A07028a09669j57479D7034f2220B1707
19185c24555J04948j03537Q0127i0903k09514a32212j45431P9162C6916l401Q2433
19174A15948b35038O3991Q95J2956J3841B1478J83333a61895j5940k79561A92905
19162c852G5720b63125M1127A04597a55615j7088A85667i1750j05165O0021k3542
19151a60436M7491b3021B19803i4845E7139a67807B58687G394M9500O2325J57204
19140B76423a57286d4956k68213a22309e6741D598K79379c119j49212N2126k76990
19129c77195A9900b52454R6073b3778D687K72161a32762l92754J38558A05886
19118b52090B48629J61206j83877c73764B1880a88819G0214b08433c1293n5767
$$ y = [260227, 19610, -20415, 238819, -196233, 107028, -109669, -267148, 47034, -62220, 21707, -324555, -219607, -323144, -243017, -90903, -300417, -132212, -277643, -198481, 36916, 33515, 115948, -235038, -171047, -170152, -157196, -143355, 21478, 204811, -161895, -177835, -457396, 192905, -3852, 75720, -263125, -221998, 104597, -155615, -172703, 185667, -91750, -196915, -136894, -160436, -112945, -23021, 219803, -94845, 57139, -167807, 258687, 7394, 56894, 119219, 276423, -157286, -44956, -313169, -122309, -56741, 4598, 283977, -3119, -152331, -100205, -377195, 19900, -252454, -156381, -23778, 4687, 276848, -132762, -525516, -386958, 105886, -252090, 248629, 409835, 225958, -373764, 21880, -188819, 70214, -208433, -31293, -87060]
19108h7060l8695E4867J63569M7266a5569k34492B22782j6088A4983J5403P8668
19097A09054b74486B18615l1729m8844m7464a25374n4153Q876O8473k80961N7193
19086c25946A43536k0759C0256c31817A10980b27341f4436H1502a77250O0658
19076a16592k0047A33114b4117l5699K9170A5147a13085M4424j38199A40370o3478
19065G6892c8130G0373a85462n1156R6868l1645C45972d05245a49816r9363a01072
19053E0547J1862b88653c1029q267m7262A19956b97144J37032L9432p994j69731
19042b98405f607j03687F6568K0635J27861h8112j60658l095g6441G3159K5426
19031I8585k9053j0675d18788j5625L9742E0509a79446K5744g1040A75694j6600
$$ y = [-87060, -125755, 54867, 218436, 265702, -15569, -250061, 222782, 206694, 14983, 30386, 109054, -274486, 218615, 186886, 138042, 90578, -125374, -179527, -170651, -102178, -383139, -325946, 143536, 122777, 30256, -331817, 110980, -227341, -64436, 81502, -177250, -116592, -136639, 133114, -24117, -59816, -30646, 15147, -113085, -68661, -206860, 140370, 76892, -38130, 70373, -185462, -236618, -139750, -171395, 345972, -405245, -149816, -249179, -101072, 50547, 62409, -288653, -31029, -39296, -86558, 119956, -297144, -160112, -120680, -128674, -298405, -6607, -110294, 66568, 87203, 215064, -88112, -248770, -251865, -76441, 73159, 98585, 69532, 58857, -418788, -434413, -394671, 50509, -179446, -153702, -71040, 175694, 159094]
19020A59094G1787b77716L5627A16676j2447b8059j10257A29356e6877A24875
19009a05930k33645f1553F8232c5191r9732C43779b6530C72861b15316a3479o7855
18998h1334C5719K67700m7102C5116b56515n7016J50075A95463E555a06905A86350
18986A21938D1251A7819a5713B67566a75889L9287p4981B8002b19654j79503A04807
18974B07635E0433G46h8350K9395J5345j18607c1208j83080N1018B94741a31145
18962C72822A68902L62381F2487a58192A40280L85156A28571K63986j14417H6056
18951a78178B9743b75948a13661j60891C2173Q592M06740a27932B316a92343o6925
18940b59268B7380g8571l8348q9705E801a80289k8871A47347c14068a26986A80124
$$ y = [159094, 71787, -277716, -242089, 116676, 104229, -28059, -138316, 129356, -56877, 124875, -105930, -339575, -61553, 68232, -35191, -134923, 343779, -26530, 372861, -215316, -13479, -81334, 35719, 303419, 256317, 35116, -256515, -313531, -163456, 195463, 5555, -106905, 186350, 121938, 41251, 17819, -15713, 267566, -175889, -136602, -211583, 28002, -219654, -399157, 104807, 207635, 50433, 746, -88350, -58955, -43610, -162217, -31208, -214288, -163270, 294741, -131145, 372822, 168902, 531283, 62487, -158192, 140280, 525436, 128571, 392557, 278140, 86056, -178178, 29743, -275948, -113661, -274552, 32173, 40765, 447505, -127932, 2316, -192343, -259268, 27380, -78571, -116919, -206624, 5801, -180289, -209160, 147347, -314068, -126986, 180124]
18928a56776B7982a52601J3860b3940A73858Q5124J21952a2612A9738a18617j66420
18917b85037C91448b6613A06904C2503a5949l4761B05311a39865A86515H2100
18906H6119a13420B0513Q2894J51114I9105a56782c1167r6855L8197m12509A53646
18894e7429B51366K13577j00422j60558R585d6355C1673R1106N4927J42682b1320
18882a13444a9332k7656F9492a43155r5837j01849A5719L4540d260j63437o3101
18871b30798B5300h0669j67527B33541b63289j4535k28885g4830h579m2583j93102
18860b44264K487A10613K3782a08820p0842D6306c14156J29991A41441d4853E5605
18848A04974c04075a42314G7879C6594b71497J26996L6906i735I4050D0458K9583
$$ y = [-156776, 27982, -152601, -138741, -23940, 173858, 258982, 380934, -12612, 19738, -118617, -285037, 391448, -26613, 106904, 32503, -15949, -50710, 205311, -139865, 186515, 82100, 86119, -113420, 20513, 103407, 254521, 99105, -156782, -31167, -128022, -89825, -502334, 153646, -57429, 251366, 464943, 364521, 203963, 213548, -46355, 31673, 122779, 177706, 320388, -21320, -113444, -19332, -46988, 69492, -143155, -238992, -340841, 15719, 50259, -4260, -167697, -230798, 25300, -80669, -248196, 233541, -263289, -277824, -506709, -74830, -8579, -51162, -244264, -241777, 110613, 134395, -108820, -179662, 46306, -314156, -184165, 141441, -44853, 55605, 104974, -304075, -142314, 77879, 36594, -271497, -144501, -107595, -9735, 94050, 40458, 70041]
18837G0041b35308a9266o2013p6401g735G9982N4894g6347o5450j99198a56425
18825a42393A80960i6554m3853p3387g3171c1608k923j79492f904E5782J05736
18814A61518A9578a42394a4456n16072d2604A82875a32828M7616b9921B44900
18803b29565d8747l5079a0859l25841A51680J04887a07324m6428A05370N0895
18793A56265a38933d9772B64976d2721A44936l1133P0870e5429a586j11200k41827
18782c54613c9720j5086p4842j76805B98774H6522a23622D2089e6940j10212O0597
18771a06555B04942b29496A87555b58580a22521p2896R3817E2115b21508A67915
18760I492h4474m7767F4598a56362C5843a75243o579A16209g7733G8141c5749
$$ y = [70041, -235308, -19266, -81279, -157680, -7735, 79982, 134876, -76347, -141797, -340995, -156425, -142393, 180960, -96554, -140407, -213794, -73171, -31608, -34531, -214023, -6904, 55782, 161518, 19578, -142394, -14456, -530528, -42604, 182875, -132828, -85212, -29921, 244900, -229565, -48747, -83826, -10859, -336700, 151680, 256567, -107324, -153752, 105370, 156265, -138933, -49772, 264976, -42721, 144936, 113803, 184673, -55429, -1586, -112786, -354613, -39720, -54806, -129648, -306453, 298774, 86522, -123622, 42089, -56940, -167152, -106555, 204942, -229496, 187555, -258580, -122521, -195417, -101600, 52115, -221508, 167915, 9492, -84474, -132241, 64598, -156362, 35843, -175243, -181822, 116209, -77733, 78141, -35749]
18748a68340g5355C07138a51371A00497d31663G1459J55400b80321P6187B22117
18737E282c4835k8201r4982D31262a7385D9295c45520B7821N1557a11244n5839
18726a67083k37422a1475m00968J58706f0432a9532k54841A11201c27246a59141
18715a35455k47652g7339C41814j00869e4335A39999a27356A868P0050A3673a68480
18703D6253J41142a27539k3312f928C14651b68869a09577m0092j57508g3961n0303
18692a24264k63113a01674j2473A90759b20276A77389j6228m0811a84318j89783
18682c74101a00103j21873l26996g0860G6485P0800a74910E8178R7563I306d8490
18670I4212e0444A3346J63271A8531J6964a22818l4712j01470A90566c92025K6362
$$ y = [-168340, -75355, 307138, -151371, 100497, -431663, 71459, 226859, -280321, -204134, 222117, 5282, -34835, -63036, -158018, 431262, -17385, 49295, -345520, 27821, 79378, -111244, -167083, -404505, -11475, -412443, -253737, -60432, -19532, -274373, 111201, -327246, -159141, -135455, -383107, -77339, 341814, 240945, -54335, 139999, -127356, 1868, 71918, 13673, -168480, 46253, 187395, -127539, -150851, -6928, 314651, -268869, -109577, -149669, -307177, -73961, -124264, -387377, -101674, -114147, 190759, -220276, 177389, 161161, 120350, -184318, -374101, -100103, -221976, -548972, -70860, 76485, 147285, -174910, 58178, 155741, 9306, -48490, 94212, -50444, 13346, 176617, 18531, 35495, -122818, -157530, -259000, 190566, -392025, -365663]
18659c65663a5571B03412H9430a12295q827j78468a14947A4903j767a37621f6636
18647b14882A32614b37321B569b81416C9936M144c30962h5482n1875J7886N7632
18636f1839o4612C8972a23915A31594b30745f1799K6343B33492d9520D5631M50231
18625D95862b38413A88387a55287p5161c8353j3550k8453H7922a0332j36800J71
18614a46961M0880G9963b91887K0749f5164j38865A3448N5554c92457a69530a5787
18602a6486k52995C9605G907c9240q4969A10468A8684a84073G0472b60260A50264
18590b79273r7993a53728D1077c8489O770j12423D2984K12580b7787A69558a11810
18578a00979L134M5324j7553L1513q7905I6411b5185A955b61749M2366c3557j63905
$$ y = [-365663, -15571, 203412, 89430, -112295, -121122, -299590, -114947, 14903, 13136, -137621, -66636, -214882, 132614, -237321, 2569, -281416, 39936, 44080, -330962, -85482, -137357, -119471, -61839, -126451, 38972, -123915, 131594, -230745, -61799, -35456, 233492, -49520, 45631, 495862, -238413, 188387, -155287, -230448, -38353, -51903, -80356, 87922, -10332, -147132, -146961, -106081, 79963, -291887, -271138, -65164, -204029, 13448, 69002, -392457, -169530, -15787, -16486, -269481, 39605, 7907, -39240, -124209, 110468, 18684, -184073, 70472, -260260, 150264, -279273, -377266, -153728, 41077, -38489, -31719, -144142, 42984, 255564, -27787, 169558, -111810, -100979, -97845, -52521, -70074, -38561, -126466, 96411, -25185, 1955, -261749, -219383, -33557, -197462]
18566a97462b1037C77219a26472k74101J56266a10784k34751g4119A00190e153
18555h7586D9475a57426K1652B50322c02408b476A41914i3032M4774K0448C1146
18543I2994g2963B08846e2741A38979a4377A91853F3782g2565A08990R5145b85699
18531B5409l638g7419A39060c5078C2793J79626R0248a54227B6984b47142J14802
18520a32340a3057O229r2039m2898G1034a4059F321c67004J22300A084L0179J13078
18508A44341B655J36251A5278a24728A86869j2275q0367a23558q5531A3238d50032
18496G0274a22534E7450c33652a42002r8088P8408j134o2058A1902g4174r9929
18485a74103l79621a16899n3226n3935K3389D2985P9693a11091l6209l8835e6465
$$ y = [-197462, -21037, 377219, -126472, -400573, -244307, -110784, -345535, -74119, 100190, -5153, -87586, 49475, -157426, -135774, 250322, -302408, -2476, 141914, -93032, -48258, -27810, 31146, 92994, -72963, 208846, -52741, 138979, -14377, 191853, 63782, -72565, 108990, 204135, -285699, 25409, 21771, -77419, 139060, -35078, 32793, 212419, 302667, -154227, 26984, -247142, -132340, -13057, -6828, -98867, -141765, 71034, -14059, 6321, -367004, -244704, 1084, 31263, 144341, 2655, 138906, 15278, -124728, 186869, 174594, 94227, -123558, -209089, 13238, -450032, 70274, -122534, 57450, -333652, -142002, -240090, -161682, -162816, -224874, 11902, -74174, -174103, -553724, -116899, -170125, -224060, -200671, 42985, 122678, -111091, -147300, -186135, -56465]
18473a00471A89497b53075B1097b8496j04225r816j82312b3370j47187b7835m85048
18462e12883b02172c3336C3542j4475J6674h7095F0989O085d00469P2643Q2608
18451b45218P1838m0075A34501b55j26149G7214C6170i882m8835j1581A51441
18439b77805J09730P4877j53576a11089B35485o6224b49124C27260a27271K4598
18429a02673A45361L2225c02423L4556C3439a59718B23880a38714G3455L5684
18419A09139a94135j46471B27899f2774B58332C4197J67757d42669J23058J45381
18409a74230j16360A35343e3779A1346g4427B01823h4290k80901R1971C3396e0536
18397B45792r9380L2097I937K6599a44991n1711c0510k99145A21840q728L7312
$$ y = [-100471, 189497, -253075, 21097, -28496, -132721, -142537, -324849, -23370, -170557, -27835, -512883, -202172, -33336, 33542, 19067, 35741, -87095, 60989, 67074, -400469, -327826, -245218, -173380, -213455, 134501, -255, -126404, 77214, 36170, -9882, -58717, -70298, 151441, -277805, -168075, -93198, -246774, -111089, 235485, 169261, -249124, 327260, -127271, -102673, 145361, 177586, -302423, -267867, 33439, -159718, 223880, -138714, 73455, 109139, -194135, -340606, 227899, -62774, 258332, 34197, 201954, -442669, -319611, -174230, -290590, 135343, -53779, 11346, -74427, 201823, -84290, -365191, -273220, 33396, -50536, 245792, 146412, 178509, 9937, 36536, -144991, -196702, -30510, -329655, 121840, 113112, 150424]
18386A50424J41763K59548c4115B06758a26131j9401A19645n5113i9677d4018
18375a15778A045h8465F1431b50387B8506e1214H5604c9562I3643c42413B8227
18363D8580a00728j38612J16133b2689G4674b74746g3256E4200e43653E496i0570
18351A62747p1658a06442A24803b87468A51954i0299k7917C66170a6895o675E0703
18339B08065R5540d01593A892e6402B34104m1136g7864q8877C4518J62184b32535
18327d9741K490j89384A91956C1779J2322K83265a00406M9986C22926c32121a4980
18315A86024b69651j36202a901E9178i015H4103a73789Q3091C3480a48667G4693
18303A972h2164m5711I80N0308e34842C64360a83145A13687B6178c36588J63114
$$ y = [150424, 292187, 551735, -34115, 206758, -126131, -145532, 119645, 64532, -99677, -44018, -115778, 1045, -88465, 61431, -250387, 28506, -51214, 85604, -39562, 93643, -342413, 28227, 48580, -100728, -239340, -123207, -22689, 74674, -274746, -73256, 54200, -543653, 5496, -90570, 162747, 91089, -106442, 124803, -287468, 151954, -90299, -118216, 366170, -16895, -23570, 50703, 208065, 303605, -401593, 1892, -56402, 234104, 192968, -77864, -166741, 34518, 196702, -232535, -49741, -47251, -236635, 191956, 31779, 44101, 327366, -100406, -50420, 322926, -332121, -14980, 186024, -269651, -405853, -1901, 59178, -9015, 84103, -173789, -90698, 33480, -148667, 74693, 1972, -82164, -127875, 980, 51288, -534842, 364360, -183145, 113687, 26178, -336588, -173474]
18292a73474b3160k82762l769f1501q2638B61783L753b12266G9722B1522M5887
18281F7409p817b9422j06984H6978a34864A84793p9681L6085L4857E0838g9904
18269B52372B1945b83501h9300j31899A25942e3354j24717E1592a83822N5718
18259a28104C11129A16338c94761J31117B52960I7467h2200l11891J50279N9834
18249a83978A48267c07260M0392A77229a60208d7457j25992k2510C5775P6618
18239A12393h5457j77185e5480k32457C15076b33647K6416j5190e3610j98274
18229b51884P0204h5139R996A3350b52808F5747O387a46465k35625j59464G7626
18217a80280O2317j1294K1342H3872l2973k3625g4370a487j0810j00949B45246
$$ y = [-173474, -23160, -305922, -309691, -61501, -144139, 261783, 265536, -212266, 79722, 21522, 67409, 59592, -29422, -136406, 86978, -134864, 184793, 105112, 141197, 176054, 50838, -79904, 252372, 21945, -283501, -89300, -221199, 125942, -53354, -178071, 51592, -183822, -128104, 311129, 116338, -394761, -263644, 252960, 97467, -82200, -394091, -243812, -183978, 148267, -307260, -266868, 177229, -160208, -47457, -173449, -195959, 35775, 112393, -85457, -262642, -55480, -287937, 315076, -233647, -207231, -222421, -53610, -251884, -181680, -85139, -75143, 13350, -252808, 65747, 72134, -146465, -382090, -541554, 77626, -180280, -117963, -129257, -107915, 83872, 50899, 27274, -74370, -1487, -12297, -113246, 245246]
18205d1780k08467B51815l2204O203a14788k70361A5621b71707J00817C6831a93930
18193A71952K21116a13849o0644R29A198J04781j4288f1405A90886D0538b25408
18181C5207i6238r7612L593c8377j04758j83774A63645O0514r8380c09767h1161
18169f695H6954M9602E3886d89912A50562a1345l87833G8101b11799f674j6648
18158b3322j02727j14525j61106G2753h520A14494m6255C3566h3946d880A43738
18146b0621G5847N0067l2066b20732D1401K10667a92401A0778O0765B1588d0714
18134A9205J63376h5381L1575B77248c1820I6468l2806J65852a32606j84093e549
18122a60612m9283R4471j6026A79700c5061D2765g461l9538a9353B0827b84702
$$ y = [-41780, -250247, 251815, 219611, 225814, -114788, -385149, 15621, -271707, -170890, 36831, -193930, 171952, 393068, -113849, -174493, -173564, 1198, 105979, 91691, -61405, 190886, 40538, -225408, 35207, -96238, -193850, -190257, -38377, -143135, -326909, 163645, 224159, 125779, -309767, -81161, -6695, 86954, 136556, 53886, -489912, 150562, -11345, -399178, 78101, -211799, -6674, -23322, -126049, -240574, -401680, 72753, -8520, 114494, 68239, 33566, -83946, -4880, 143738, -20621, 75847, 125914, 93848, -220732, 41401, 252068, -192401, 10778, 71543, 21588, -40714, 19205, 182581, -85381, -53806, 277248, -31820, 96468, 63662, 229514, -132606, -316699, -5549, -160612, -209895, -115424, -131450, 179700, -35061, 42765, -7461, -46999, -19353, 20827, -284702]
18110d9874A42262c32521i2848b9360m347l15930p5043c3146B11724l5876q1329
18099I4519J32181c59637Q7040L5533Q3541j43623g600j29078j07599m4773J09671
18088a79379A03533c10295E0676P4010a23097B11165a85589b830B83963a43139
18077A14340N0980b11251o8072l4973d2251j82868A13703B1911a12462J9848I0093
18065a17721n6874A3217a54129P4189E1320c0919d812H467a16008B0305a74225
18053B92125d3867A77637c08808A59461F3131d5094B84042L2360j35223F5513
18042H6744A6428L47808A6789O9402e7167B65925D9477a19377j66505I430J53240
18031A62670a17363p0615r1565A59109c9854C27419F9515J2289g9468A03767b16024
$$ y = [-49874, 142262, -332521, -92848, -29360, -33707, -349637, -424680, -33146, 211724, 175848, 94519, 226700, -359637, -272597, -237064, -153523, -297146, -7600, -136678, -244277, -289050, -179379, 103533, -310295, 50676, 124686, -123097, 211165, -185589, -2830, 283963, -143139, 114340, 165320, -211251, -279323, -314296, -42251, -225119, 113703, 21911, -112462, -92614, 90093, -117721, -174595, 13217, -154129, -79940, 51320, -30919, -4812, 8467, -116008, 20305, -174225, 292125, -43867, 177637, -308808, 159461, 63131, -45094, 284042, 316402, 181179, 65513, 86744, 16428, 364236, 16789, 86191, -57167, 265925, 49477, -119377, -285882, 9430, 162670, -117363, -187978, -279543, 159109, -39854, 327419, 69515, 81804, -79468, 103767, -216024]
18019D478a97132d9899G3662b64940B95049B5355a93231B36701E3357d33096i5163
18007b69975F9206r02c4710j02656A96493c87673A67873B7561e5377l8305p7664
17996a71346A23420f31672A21852a64657q5894J21474B46019b83064f0298j817
17986f2115C354a4923l6062l20325A40606a36235B67757G9641R2969A578a44969
17974a18362A6895d0921A6222c1565B45040I5016c40505e892l25339B51931n0645
17963B01286h7715c1290r8271q096k10488G9745J76251K6524f028B56011A9208
17951f6079J5397j24588G7160a37616N0103K8201n3573j30927j84736a94394D70140
17939e3214C5498J54148d7324j29750D6019N1704K443A7849a68738A9954b0885
$$ y = [4478, -197132, -49899, 73662, -264940, 295049, 25355, -193231, 236701, 53357, -433096, -95163, -269975, 69206, 68304, -34710, -137366, 196493, -387673, 167873, 27561, -55377, -93682, -171346, 123420, -631672, 121852, -164657, -250551, -129077, 246019, -283064, -60298, -62115, 3354, -14923, -50985, -371310, 140606, -136235, 267757, 79641, 172610, 1578, -144969, -118362, 16895, -40921, 16222, -31565, 245040, 95016, -340505, -5892, -331231, 251931, 201286, -87715, -31290, -129561, -137657, -348145, 79745, 255996, 282520, -6028, 256011, 19208, -66079, -50682, -175270, 77160, -137616, -87513, -59312, -112885, -243812, -428548, -194394, 470140, -53214, 35498, 189646, -47324, -177074, 46019, 97723, 100166, 17849, -168738, 19954, -20885]
17927a57651l6591h8089A2881a72611A10727b04934B2712a58283O0442A1831J12141
17916A23972J52213E5288h7305F3940a65909A49050F4174J38476A6697b4252k3351
17905d7603p4345C59589A4102a70484D2295a09420A30912J09958G5963J74601
17895B50564p3165Q9504a57997P3277a3827j8597A96121a64177H7460i8933c2928
17883a5194A48245l32m6277f0104j02613F9698K67998b2682A02248M7827b91225
17871C07960d9357C85406a99491k6313e5911B34751b49514J13763D9898O099K29801
17860B85798L3978A47239D8278R8261A7197a29134a0698k57253A68014J97886
17850C65900e7701A61649C799a34420a9864j12664j49788j7098A79378c82338
$$ y = [-157651, -194242, -88089, 12881, -172611, 110727, -204934, 22712, -158283, -97841, 11831, 123972, 276185, 55288, -87305, 63940, -165909, 149050, 64174, 202650, 16697, -24252, -47603, -121948, 359589, 14102, -170484, 42295, -109420, 130912, 240870, 75963, 250564, 177399, 266903, -157997, -84720, -13827, -32424, 196121, -164177, 87460, -98933, -32928, -15194, 148245, 147913, 101636, -60104, -162717, 69698, 337696, -22682, 102248, 150075, -291225, 307960, -49357, 385406, -199491, -225804, -55911, 234751, -249514, -135751, 49898, 55997, 285798, 319776, 147239, 48278, 146539, 17197, -129134, -10698, -267951, 168014, 365900, -57701, 161649, 3799, -134420, -19864, -132528, -282316, -299414, 179378, -382338]
17839c8075E8444d4469B5225K82498a88533j42694A31696K51847B119L19921a76148
17827a08567G1673K26935c2032A14340d71060F6750B6316J06774E1458k879M4127
17816I2706C2783c4052C42739a93B34388i9015c7058b493D03253a08922A48071
17804b2530q3164B81036a86754A08768m9724b66163B02145l3468E6064L6613O608
17793I9285a70497H8273e9813a6039l35501D9561i1059A83507Q5350F9069k2308
17782D6761c24943P6748D8082A8163Q1126a04172j98891D1041d948m7645E0061
17770a19837F3281f1741l0552c9807B88392m0816j23075a74984b2920A44879b22581
17758i191j08855B15159d1409A56721L860b7254B64290l2894a40359A08638C9873
$$ y = [-38075, 58444, -44469, 25225, 307723, -188533, -331227, 131696, 383543, 2119, 322040, -176148, -108567, 71673, 298608, -32032, 114340, -471060, 66750, 26316, 133090, 51458, 48579, 92706, 32783, -34052, 342739, -193, 234388, -99015, -37058, -2493, 403253, -108922, 148071, -22530, -105694, 281036, -186754, 108768, 59044, -266163, 202145, 168677, 56064, 92677, 99285, -170497, 88273, -59813, -16039, -351540, 49561, -91059, 183507, 268857, 69069, 46761, -324943, -248195, 48082, 18163, 99289, -104172, -303063, 41041, -4948, -52593, 50061, -119837, 63281, -61741, -92293, -39807, 288392, 247576, 124501, -174984, -22920, 144879, -222581, -9191, -118046, 215159, -41409, 156721, 160581, -27254, 264290, 231396, -140359, 108638, 39873]
17746A73181M7100r0961a59904B05473i2503A97288O4811C9144J07977G1102Q0760
17735A51862M1221E0145J44375L8131h8796j9536B10978a83320d2172n80972f3044
17723a04739D6923c3070H5350Q6948F5608M2810j6905J9595b71820A90403h7822
17711C11647K9757J10394k21313C9818a19791a1769j23103A40335J34455Q6431
17701C61221d36A02259J44233g3119l48896B26557J39580A28577C6017K03765
17691B39782a80173C05319a18332D7967b32262l1845I0160a49939A24478a83959
17680a3649E9399b34331E9777k3682O281K68689a3677r7061B21775E7519J27175
17669A84694a64226I8617K9062J51727l2537n5276i0748D648N5704A4005e1281
$$ y = [173181, 220281, 129320, -159904, 205473, -92503, 197288, 262099, 39144, 147121, 71102, 151862, 193083, 50145, 194520, 232651, -88796, -108332, 210978, -183320, -42172, -623144, -63044, -104739, 46923, -33070, 85350, 172298, 65608, 108418, 91513, 111108, -271820, 190403, -87822, 311647, 341404, 451798, 230485, 39818, -119791, -11769, -134872, 140335, 274790, 361221, -436, 102259, 246492, -73119, -422015, 226557, 366137, 128577, 36017, 239782, -180173, 305319, -118332, 47967, -232262, -264107, 90160, -149939, 124478, -183959, -13649, 59399, -234331, 59777, 36095, 42376, 311065, -13677, -110738, 221775, 57519, 184694, -164226, 98617, 127679, 279406, 246869, 191593, -90748, 4648, 60352, 14005, -51281]
17657B0595J61438c298B42632q7016M4407E593K83059a3942r6q2078B92854J35312
17645D28166h7101a3002A06724C4127P20L9666J45731A0432N2266B6527b79322
17633b61041A86217k2712G6120P7216Q3765a24489B82777C7944K10119m142I9030
17621I8852L6130m814n5488j894M9246k5296q527J49097r4804C0367O8822j7261
17609H1928J60007k7413r3350f118B60913a18909D06060b5636C50374g3548C6468
17597G7752C0975h3687B96601A16338f9502g46A12221j0329B2634M50116e2101
17585B64858f6750I6276K4932j9511A4684J14361K9018c5572A72144K33930A66506
17573D47171j41851b80514A91728r5015j5857J92711e0615k6114p7277A80190
$$ y = [20595, 182033, -3298, 242632, 155616, 200023, 5593, 288652, -13942, -14038, -96116, 292854, 428166, -87101, -13002, 106724, 34127, 34847, 74513, 220244, 10432, 62698, 26527, -279322, -261041, 186217, 163505, 76120, 153336, 237101, -124489, 282777, 37944, 248063, 243921, 99030, 98852, 134982, 130168, 74680, 72786, 122032, 96736, 88209, 237306, 142502, 30367, 99189, 81928, 241935, 214522, 121172, -6118, 260913, -118909, 406060, -25636, 350374, -73548, 36468, 77752, 30975, -83687, 296601, 116338, -69502, -746, 112221, 101892, 22634, 472750, -52101, 264858, -66750, 96276, 121208, 101697, 14684, 129045, 158063, -35572, 172144, 406074, 166506, 447171, 305320, -280514, 191728, 96713, 80856, 273567, -50615, -76729, -154006, 180190]
17562g0669b5222j55801G8446J85145A4512K10744l6176o6123c7805l5897A39104
17550B72295J10172l9580F4082K78730A01542J16191g6139B43237P6584A52457
17539i214j02871D809P7731R3513b2429a663D6692N0958J09387m773K83708r0436
17527C95536k068j39700M3111j09833M2981P5791o2397G7228j7808K97847j29357
17516B27910J49059K040I667K58638J23664j11771K61152k8294J83680N9324R6246
17505H52306k04721j05202A56867M15612j7953B49799J44276l7228j9059K02766
17495E40554j67020L40822o4476j63367M26460C69830P65J99276A68280K85725
17485D54005Q1285j44876J2691j58455m8376M644H759L26869A07050M02397j22441
$$ y = [-70669, -25222, -181023, 78446, 263591, 14512, 225256, 189080, 122957, -37805, -73702, 139104, 272295, 382467, 342887, 64082, 342812, 101542, 217733, -76139, 243237, 319821, 152457, -9214, -112085, 4809, 82540, 176053, -22429, -1663, 46692, 97650, 207037, 202264, 485972, 395536, 393468, 253768, 296879, 187046, 230027, 305818, 243421, 77228, 59420, 357267, 227910, 376969, 379009, 9667, 268305, 391969, 280198, 541350, 513056, 696736, 756060, 852306, 647585, 542383, 156867, 572479, 554526, 249799, 394075, 356847, 337788, 540554, 373534, 714356, 649880, 486513, 912973, 369830, 370595, 569871, 168280, 454005, 535290, 390414, 403105, 244650, 196274, 200918, 8759, 335628, 107050, 509447, 387006]
17474C87006A91297K82612A82830L36982k24263L6254j31267P9338l6691f9482
17463B59093Q7358j07135M1043J79999D3211Q444h2736I4547R816l8221N7322
17452A23464c8021C75926A87020L5955R547A244M84209A48811K58974k3111j31262
17441B53412H3949Q2278k3393f581B80496L3619K93328A50832L06438K0026A34856
17429D36409B00811K6924A08069A7134M85750A30871L20885A58790N4139k8032
17419A84897D8110O4037M1650N8180J22509A09772L7314o8905K38197A38281J74915
17408C13196Q5134B64M40391J28795A68064K86253R1143G8274N84424k27197j83899
17397B51602N5092c5186G7724J91242j31601K78292A32143K6086L0642J25476
$$ y = [387006, 191297, 473909, 182830, 519812, 295549, 331803, 200536, 279874, 243183, -69482, 259093, 346451, 239316, 280359, 460358, 43211, 51655, -82736, 94547, 104363, 66142, 123464, -38021, 375926, 187020, 222975, 232522, 1244, 485453, 148811, 407785, 384674, 253412, 83949, 166227, 142834, -6581, 280496, 314115, 607443, 150832, 457270, 477296, 134856, 436409, 200811, 227735, 108069, 17134, 502884, 130871, 451756, 158790, 212929, 184897, 48110, 112147, 153797, 211977, 334486, 109772, 147086, 78181, 316378, 138281, 313196, 398330, 264, 440655, 569450, 168064, 454317, 545460, 78274, 662698, 435501, 251602, 306694, -35186, 77724, 268966, 137365, 415657, 132143, 158229, 188871, 314347]
17387C14347J23583A46803L7211G1955L81945E4672N43836g8156L4348A66338
17376A08486L50619R651p7621A1237b45416d7586A79321J93078a39235B650N62683
17365E65333B55483O839m0216a1332A87511H9112J97105c2510B81115l9666J35204
17354C76653J44877B26619M99Q9005J20521A70235m966h4524C09124a00327B63669
17342C06901A40823J21982B2501J26066a91761D05665A63371K2754K02411l3973
17332C54563C3976K8202L64754j94405c0857k3928B22302J96251A79710J80480
17322C60190K12419A15436l0108O1655o0904L6872K00945p9774j4249H8654J00928
17311A89582J42313r448j49201p8585K4793J10311F1701J11047K70722q547j07281
$$ y = [314347, 437930, 146803, 184014, 71955, 453900, 54672, 598508, -78156, -43808, 166338, 108486, 459105, 468756, 391135, 11237, -245416, -47586, 179321, 372399, -139235, 2650, 565333, 255483, 262322, 222106, -11332, 187511, 89112, 286217, -32510, 281115, 241449, 376653, 521530, 226619, 227118, 316123, 436644, 170235, 165269, -84524, 309124, -100327, 263669, 306901, 140823, 262805, 22501, 148567, -191761, 405665, 163371, 186125, 388536, 354563, 33976, 62178, 426932, 232527, -30857, -54785, 222302, 418553, 179710, 360190, 572609, 115436, 85328, 146983, 86079, 122951, 323896, 244122, 229873, 88654, 189582, 331895, 322447, 173246, 94661, 119454, 229765, 61701, 172748, 443470, 434923, 327642]
17300C27642j06176A10648a00005C93359A37659Q5789j11392P8074l5705N98213
17290G52638A47304Q3508r3696L08568O8933C3178K30415a6782a698C13176J78171
17279D91347A58826J44283K4041j5011A22387J53745B2789L30988A54738o37L10542
17268D64643o7536b8214A27047J52387p6595q3184J40366R755J37819l3225k2128
17257C52242A69186K00468A41722J47916j22836o2793K28781j54546L6721j2997
17247B01968l7962l8281E8748Q0391l7811J64728J73873j65421L9693g8502F45734
17235C70693b2257B85756q1m2750K89872j30498r8529J31171M0953Q5497m8220
17224E13171F757M39713q9779O9612A93282M32049G4536J84377M8253L91632A90871
$$ y = [327642, 221466, 110648, -100005, 393359, 137659, 223448, 112056, 190130, 154425, 752638, 147304, 230812, 137116, 445684, 514617, 33178, 263593, -16782, -1698, 313176, 491347, 158826, 303109, 327150, 312139, 122387, 276132, 22789, 353777, 154738, 154101, 464643, 397107, -28214, 127047, 279434, 202839, 119655, 260021, 269776, 407595, 374370, 352242, 169186, 369654, 141722, 289638, 166802, 104009, 332790, 178244, 214965, 201968, 164006, 125725, 58748, 139139, 101328, 266056, 439929, 274508, 314201, -78502, 645734, 370693, -22257, 285756, 285675, 242925, 532797, 402299, 303770, 434941, 475894, 561391, 513171, 6757, 446470, 356691, 426303, 193282, 625331, 74536, 258913, 307166, 698798, 190871]
17212G6122K39621L03162B81485P1918r0064J866N6961N32777l37151A7674M08930
17201D26604j28129J69255o6064A34145M4751n550L43929j48016A48144L18583
17191D66727I1282J55161M7806J2131K80703A90603k6034K92461j93082p1112
17181A92836M9968P6505O1613j1383j25007L17933k05444K55489j34727k15914
17171B61869L23419A35835K53727j10219A04790L39137R309A18788K00522R6934
17161D16244K54024k52940K29137B64708J48458N6559m6036J64458k15909n3499
17151C18739j47344M15337k26295J41524L4323j70628L90328k42938J40855J9143
17141F73044k82844o3578K93671j61348j4991M9123j86603n2653L86311C18388
$$ y = [76122, 315743, 618905, 281485, 353403, 263339, 265205, 322166, 854943, 517792, 17674, 426604, 298475, 467730, 401666, 134145, 178896, 173346, 517275, 369259, 148144, 466727, 91282, 246443, 294249, 306380, 587083, 190603, 164569, 457030, 263948, 192836, 242804, 319309, 380922, 369539, 244532, 562465, 357021, 612510, 477783, 261869, 585288, 135835, 389562, 279343, 104790, 443927, 453236, 118788, 319310, 416244, 670268, 417328, 646465, 264708, 413166, 469725, 423689, 588147, 372238, 318739, 171395, 586732, 360437, 501961, 536284, 365656, 755984, 513046, 653901, 673044, 390200, 326622, 620293, 458945, 443954, 493077, 306474, 253821, 640132, 318388]
17130B28146M41096j56002J44507A99212K54207J3138j0301J4460j20794M40920
17120G90842l28263j08993J24431n3134O9496Q5645j64791j96062K92387n4999
17110D56559B14805M77769k11067k8279p3536j74740L947J80432m7036m3117J85682
17099D84860A83768L71053p8995J45289k36162m5661R3503q7982J48779q7245
17089D06347K54769k70757J12437L43859l51891J35150j58048j72358m616M0434
17079C35326Q5058N03458k80555j80654o5048R8642J64912J10091k87371P1355
17069E55214j92172M02486k25785P1620q9819K5078L38801k84854L01827l40096
17059E62300K91199l88210K56143J3180k61990J26191J79882p7121k00301K97416
$$ y = [228146, 669242, 513240, 657747, 199212, 453419, 466557, 456256, 470716, 349922, 790842, 462579, 353586, 478017, 424883, 494379, 580024, 415233, 219171, 511558, 456559, 214805, 692574, 481507, 453228, 379692, 204952, 208899, 389331, 342295, 299178, 484860, 183768, 554821, 475826, 621115, 384953, 339292, 432795, 344813, 493592, 406347, 661116, 390359, 502796, 846655, 494764, 629914, 471866, 299508, 294892, 335326, 420384, 923842, 643287, 462633, 397585, 496227, 661139, 771230, 483859, 555214, 363042, 765528, 539743, 611363, 521544, 546622, 885423, 600569, 902396, 562300, 853499, 465289, 721432, 734612, 472622, 598813, 778695, 701574, 501273, 798689]
17049G98689j98756q1781n1816P717K59475k8527R6212O9078l7099o0307j42846
17038F30039J68947L78262m30713J51159K6015J0163j81529j73596K06129l3299
17028G51577j28593j61187K14713O4220R1428j97501K55741J5712J34440K93124
17018A333674l60642l54164J19899n3965m231Q2478L1411k13149M20438o0363
17008I41386j48092J64327J41842k15946k5429M8075J67802j5418l92312M33647
16998A099882k58233J24334K89376k53521K84541j45213n1626l1544l85724L476
16988F75748J20596j848K36261j38735L06513l67740L29523o1115q7686m05150
16978F06367K64022J53232M28049n11113J9772M6039J30875J03396k7451K9620
$$ y = [798689, 599933, 518152, 466336, 474053, 733528, 705001, 801213, 870291, 833192, 772885, 630039, 798986, 1177248, 746535, 897694, 923709, 933872, 752343, 578747, 784876, 751577, 622984, 461797, 676510, 740730, 832158, 634657, 890398, 906110, 1040550, 1333674, 973032, 618868, 738767, 684802, 680571, 763049, 794460, 581311, 1001749, 941386, 793294, 957621, 1099463, 883517, 858088, 906163, 1073965, 1058547, 666235, 1099882, 841649, 965983, 1255359, 1001838, 1286379, 1141166, 1089540, 1057996, 672272, 675748, 796344, 794496, 1030757, 892022, 1198535, 830795, 1160318, 1099203, 1011517, 606367, 870389, 1023621, 1451670, 940557, 960329, 1006368, 1137243, 1240639, 1213188, 1242808]
16968A242808j5854j60981J55680k87354M07840j20530o4125j09664Q4816M33905
16958A566541k14998q0583p2624N1444k24046K22778N429J08939m4165n10879
16948H07836L49007J1951J6976J25320K63009j85140M3768K1359k51626K24838
16938A427298J06255K01263l17851L53259k98200L2198k81947K55591K25686J09349
16928A812901m47053L52126l6738j67061J01464J05956j1371K80892l99126J91980
16918A783970J33732j85158N9544J88233j85833j58841J19850L4366K1203O2515
16908A873581k08363J82159p2774K12352J9718o4355r4422M45900n87070M33891
16898B140617j83685o8332J10807J09280r4323L8528J55893k52064K75566J8818
$$ y = [1242808, 1226954, 1065973, 1221653, 934299, 1342139, 1221609, 1157484, 1047820, 1132636, 1566541, 1351543, 1270960, 1198336, 1249780, 1025734, 1248512, 1253941, 1362880, 1318715, 807836, 1156843, 1168794, 1185770, 1311090, 1574099, 1388959, 1432727, 1454086, 1202460, 1427298, 1533553, 1734816, 1416965, 1770224, 1472024, 1504222, 1222275, 1477866, 1703552, 1812901, 1365848, 1717974, 1681236, 1514175, 1615639, 1721595, 1710224, 1991116, 1591990, 1783970, 1917702, 1732544, 1792088, 1980321, 1794488, 1635647, 1755497, 1789863, 1811066, 1873581, 1665218, 1847377, 1774603, 1986955, 2006673, 1942318, 1847896, 2293796, 1706726, 2140617, 1956932, 1888600, 1999407, 2108687, 2014364, 2052892, 2208785, 1956721, 2232287, 2251105]
16888B251105j20475L47591j94925q3449L35715k1600j42991K09202r4868J29180
16878B614485r4737j15770J11709J31446k8803J84229l08653j77781Q48065j49756
16868C014434k03875N2857K13036j83595J39004r3597J21745K46439j33108P3863
16858C247203M2210J01964J43730J43821k8795k91290n937O0001J23790P4732
16848C611429K33825n03660M78666J1016k8853J81783K7542J23564j54369K74161
16838D255104q4431K42000P2654Q7661J32662J77611K26426o48589M60545L9474
16828D961117L3790K98970l01292L08203j99879K74671J1519j63605J74358L39604
16818E737456K03216k69658K90539j6900K47279J64782k05907N29798j62440J43070
$$ y = [2251105, 2130630, 2478221, 2283296, 2199847, 2535562, 2513962, 2370971, 2580173, 2485305, 2614485, 2519748, 2403978, 2515687, 2647133, 2618330, 2802559, 2493906, 2316125, 3164190, 3014434, 2810559, 2863416, 3076452, 2892857, 3031861, 2938264, 3060009, 3306448, 3173340, 3247203, 3289413, 3391377, 3535107, 3678928, 3650133, 3358843, 3352906, 3412907, 3536697, 3611429, 3845254, 3341594, 3820260, 3831276, 3802423, 3984206, 4011748, 4135312, 3980943, 4255104, 4170673, 4412673, 4485327, 4572988, 4705650, 4883261, 5109687, 4461098, 4921643, 4961117, 4994907, 5293877, 4992585, 5300788, 5100909, 5375580, 5387099, 5223494, 5397852, 5737456, 5940672, 5671014, 5961553, 5944653, 6191932, 6356714, 6150807, 6680605, 6518165, 6661235]
16808F661235j949K77552Q7842L52936L92407k53719K80852m0174K76098M1893
16798H074973K84913N76182k51308K84791K7425O2514N25064J71066j8932O09582
16788A0346270P6871M86743k22499N68694J07535J13942N57723K24968J79236
16779A2439483K55220P56836K8332L00964O59175N8340L00788P72286J81253K88627
16769A6041304O85148J36368J133449J8931O77041N57245M93765P15643Q97395
16760B1356289L37044J127264k5225J018040P51051O46289J166133Q95702J007701
16751B8280288P71341Q63552J492880J158788J083558Q73262J687278J260724
16743C7471671J634465J207689J909105J480677J582058K244744K017216J968455
$$ y = [6661235, 6659286, 6936838, 7024680, 7377616, 7770023, 7516304, 7797156, 7756982, 8033080, 8074973, 8359886, 8936068, 8684760, 8969551, 8996976, 9059490, 9584554, 9755620, 9736688, 10346270, 10423141, 10909884, 10687385, 11256079, 11363614, 11477556, 12035279, 12260247, 12439483, 12694703, 13451539, 13479871, 13780835, 14440010, 14498350, 14799138, 15571424, 15752677, 16041304, 16726452, 16862820, 17996269, 18015200, 18692241, 19249486, 19743251, 20458894, 21356289, 21693333, 22820597, 22795372, 23813412, 24564463, 25210752, 26376885, 27272587, 28280288, 29051629, 29915181, 31408061, 32566849, 33650407, 34523669, 36210947, 37471671, 39106136, 40313825, 42222930, 43703607, 45285665, 47530409, 49547625, 51516080]
16735E1516080K319222K332543K401930K732836K479180K700814L373059K947798
16727G2803462L235227L536629M072313L168838L826275M382289M391381L901047
16719A03317461M513406M600716M365110M357067M268613L883361M456274L642687
16711A37404695L657428L150337K752238K458112J802528J104003Q02077k18040
16703A52913378j70548q18634j846109k045323k472139l565913l261226l830627
16695A34902859l844991m145885m701706m272660m620713m268557m548791m548325
16687I9951231m036563m302038l949185l972874l812072l135289l902193l470167
16679F9370850l022858k948709l015510k530457k677252k271277k309433k567414
$$ y = [51516080, 53835302, 56167845, 58569775, 61302611, 63781791, 66482605, 69855664, 72803462, 76038689, 79575318, 83647631, 86816469, 90642744, 95025033, 99416414, 103317461, 107830867, 112431583, 116796693, 121153760, 125422373, 129305734, 133762008, 137404695, 141062123, 144212460, 146964698, 149422810, 151225338, 152329341, 153131418, 152913378, 152742830, 151924196, 150078087, 148032764, 145560625, 141994712, 138733486, 134902859, 131057868, 126911983, 122210277, 117937617, 113316904, 109048347, 104499556, 99951231, 95914668, 91612630, 87663445, 83690571, 79878499, 76743210, 72841017, 69370850, 66347992, 63399283, 60383773, 57853316, 55176064, 52904787, 50595354, 48027940]
16671D8027940j692430k409842j215197j938138j589095j484252j883401j121163
16663C4694422j443768j093325j360148j177245j027908j208496o69701j403533
16655B5310298q67973n38461j012923n33281r58796n08461r41945l83641p83794
16646A8781023p66082k40801n84090j41871q54398n27588m28022k40583l77158
16637A4620430o23649l87230k97975k76806o06187j62578r1025p24208k45401
16628A1205371l50537j49146l23802p3386o4615o48522Q2885k45230l41062j88229
16618H903727O0562q9607n12669l26772m9033r5923M1581m17051j89859j14110
16608G210846l35975J74982k48892k93461J11155k50569K042J14248j63416k62032
$$ y = [48027940, 46335510, 43925668, 42710471, 40772333, 39183238, 37698986, 35815585, 34694422, 33250654, 32157329, 30797181, 29619936, 28592028, 27383532, 26713831, 25310298, 24442325, 23903864, 22890941, 22357660, 21398864, 20890403, 19948458, 19564817, 18781023, 18014941, 17774140, 17190050, 17048179, 16193781, 15666193, 15238171, 14997588, 14620430, 13996781, 13609551, 13311576, 13034770, 12428583, 12266005, 12174980, 11450772, 11205371, 10854834, 10705688, 10381886, 10308500, 10243885, 9595363, 9678248, 9433018, 9091956, 8903727, 8964289, 8874682, 8362013, 8035241, 7986208, 7890285, 7931866, 7514815, 7324956, 7210846, 6874871, 7049853, 6800961, 6507500, 6618655, 6368086, 6370128, 6484376, 6320960, 6058928]
16598F058928j60614k16832J38193m59696K33216p59204N77744p6335j88533j55624
16588D991243n3742J47247m61465o9403k27206J54262r6598l0684j26271L5096
16578D262479k44850L24267m27280J53232l63113L55276m25266L0754J27360J33084
16568C925943l28107L1050j26818j5208Q4053m19592K37348l58731K20829j85707
16558C065060L7644O6237Q8249l28659J2773p5457J1171L3547O47j9217k38325
16547B653670J50285k36402j7201J55913l99040J63219l1546J1447j4020l04138
16537B132187J12558n4620k84440M62026k15424q8922P3487l8231p3740M9397
16527B074278J55339l32433J58179n4641L3525k73052j31626K36273P4857k3669
$$ y = [6058928, 5898314, 5681482, 5819675, 5359979, 5593195, 4833991, 5411735, 5335400, 5146867, 4991243, 4937501, 5084748, 4623283, 4553880, 4326674, 4480936, 4384338, 4353654, 4227383, 4262479, 4017629, 4341896, 3914616, 4067848, 3704735, 4060011, 3634745, 3665499, 3792859, 3925943, 3597836, 3628886, 3502068, 3486860, 3570913, 3151321, 3388669, 3029938, 3250767, 3065060, 3102704, 3168941, 3257190, 2928531, 2941304, 2865847, 2877018, 2910565, 2911212, 2891995, 2653670, 2803955, 2567553, 2550352, 2706265, 2307225, 2470444, 2438898, 2450345, 2436325, 2132187, 2244745, 2190125, 1905685, 2367711, 2152287, 2063365, 2136852, 2098621, 2024881, 2074278, 2229617, 1897184, 2055363, 2000722, 2034247, 1761195, 1629569, 1865842, 1940699, 1917030]
16517A917030l83987J68440j35897Q5907K87719j46037Q2315k18165j66247L79371
16507A870449n51822J67924M29679k02772O599k91787M61827n45339K06538j25873
16497A425423K6281K56556p4997m97978Q1689K92002q1566o6284J57141n5716
16487A462551j09915l2696k0523K42287l33585l0654p5907O3720K00191k30070
16477A135399J76780j37035j29865N8767k94208K81911K78552j07564n1220p8417
16467A133100j30443j10826K07275K4921j70134J53122j30302j33882K14685j4044
16457A043472K84282o43291M26559k08290k51243L80917k4915o745j03874P8811
16447I75683O0673k76911K93342k05975N7165n7884O6411J25494k19697L61890
$$ y = [1917030, 1533043, 1701483, 1565586, 1651493, 1939212, 1793175, 1875490, 1657325, 1491078, 1870449, 1318627, 1486551, 1916230, 1713458, 1720057, 1428270, 1890097, 1344758, 1551296, 1425423, 1451704, 1708260, 1633263, 1135285, 1216974, 1508976, 1427410, 1361126, 1518267, 1462551, 1352636, 1319940, 1299417, 1541704, 1208119, 1177465, 1101558, 1165278, 1365469, 1135399, 1312179, 1175144, 1045279, 1104046, 809838, 1091749, 1370301, 1262737, 1211517, 1133100, 1002657, 891831, 1099106, 1124027, 953893, 1107015, 976713, 842831, 1057516, 1043472, 1327754, 684463, 1111022, 902732, 651489, 1032406, 1007491, 1000746, 896872, 975683, 1036356, 759445, 1052787, 846812, 903977, 846093, 912504, 1037998, 818301, 1180191]
16437A180191j94971l13j74533M80891F28652j4993L05293n0118j80217K026K08433
16426H99076J33371k29465j81733j70624K09604K90482l1822L54450C81341P6001
16416D57342J65290J21757q4340j70062N06749j74543k46494K57430J38116B92558
16405I17177K3293k92100K88688m16493J67233p8402K90638K584l29392J12837
16395F86063r7500J82521K6810k52294L68218l36927M5103m0636k20560M19958
16385G80756J2101k09377l3718n575l9406j663J85767j67326p1324M76143l92781
16374E33597K23217j63153M07867B26874J99307o7673J90143k6845J77690j34585
16364E64911B20593J46312J32819P5001k02008J04423L06519j0865B92463K40665
$$ y = [1180191, 985220, 984907, 810374, 1291265, 628652, 613659, 918952, 868834, 688617, 690643, 899076, 1032447, 802982, 621249, 450625, 660229, 950711, 918889, 1273339, 381341, 457342, 622632, 744389, 660049, 489987, 996736, 822193, 575699, 833129, 971245, 292558, 917177, 940470, 648370, 937058, 520565, 687798, 609396, 900034, 902618, 573226, 686063, 588563, 771084, 797894, 545600, 913818, 576891, 621994, 581358, 360798, 780756, 792857, 583480, 549762, 544187, 504781, 503118, 688885, 521559, 450235, 926378, 533597, 756814, 593661, 1001528, 226874, 426181, 358508, 548651, 521806, 699496, 564911, 220593, 366905, 499724, 574725, 372717, 477140, 783659, 772794, 292463, 533128]
16354E33128j84610J93862J77627j4996j00283K55098k22960J0202k44084R2043
16344D95027A69764K02531J70991j47866J23962M855k19981M28900l14374J0815
16334D29597j21055M17610k95540J36995L3609o0188k22665m3132K2615R0788
16324C88634H3416L80790J85085B43917n1822M28103a13614D16789A82460m6104
16314A36356K38971N2691J30095O92J3560j54600j76741M21378j07204B70872
16303B64987J32720j9589r8228Q3029j39910K89272j10940M6422B16194K87905
16293E04099L750j71007K44163B84427J24170Q0043q9255l72n8379K50338K03547
16282G94519B41149O3027N1497R6760n7949R9251a9237E05768B02443J78636A03132
$$ y = [533128, 348518, 542380, 720007, 705011, 604728, 859826, 636866, 647068, 402984, 495027, 169764, 372295, 543286, 395420, 519382, 524237, 304256, 733156, 418782, 429597, 308542, 726152, 430612, 567607, 601216, 541028, 318363, 275231, 297846, 388634, 83416, 464206, 649291, 243917, 192095, 620198, -113614, 416789, 182460, 136356, 375327, 428018, 558113, 558805, 572365, 417765, 241024, 662402, 555198, 270872, 264987, 397707, 378118, 279890, 362919, 223009, 512281, 401341, 447763, 216194, 504099, 507849, 336842, 581005, 284427, 408597, 488640, 399385, 399013, 340634, 590972, 794519, 241149, 304176, 355673, 452433, 394484, 493735, -19237, 505768, 202443, 381079, 103132]
16270A94474K68291k15918n0450K71860q6739j69757J63776O1562K86870k59735
16260D64234A11252L38857j94432J34783I3357C7432K17966L19905B43441K05461
16250D48902j08688j16703p6879f3827C67327l95q2632b60252g5121C51456j11009
16239B40447A2670K93426J88335k5610l3687e452B33272J72593J4281m0001R2496
16228D72641j21147e7493C86715b4541G9509a23702B65946A23765L02865A82659
16217B07487K2344K98631a73755E12318H7391Q6895J814K5144D7769L951K81991
16206C33711j30481L11029j53313F8475R9864a26218C28427n1306K7321p0906
16196B33536M5756A019f4017A99912O6845l6478Q1669A08785N1263J5777M27660
$$ y = [194474, 462765, 246847, 196397, 468257, 381518, 211761, 375537, 437099, 723969, 464234, 111252, 450109, 255677, 390460, 93357, 37432, 255398, 575303, 243441, 448902, 340214, 223511, 146632, -63827, 367327, 366932, 284300, -260252, -75121, 351456, 240447, 12670, 306096, 494431, 468821, 435134, -5452, 233272, 405865, 420146, 380145, 472641, 351494, -57493, 386715, -24541, 79509, -123702, 265946, 123765, 426630, 182659, 207487, 229831, 528462, -173755, 512318, 87391, 174286, 176100, 201244, 47769, 51720, 333711, 203230, 514259, 360946, 68475, 168339, -126218, 328427, 277121, 304442, 233536, 279292, 1019, -64017, 199912, 266757, 230279, 311948, 108785, 160048, 175825, 603485]
16185F03485C6090J05526K37988j67179E147J01652D6142a7823D91905k15729
16175B76176O4374l9040j32983F1335K46677h6780A40776D5615b92321A95116
16164C92931a25467A45605C0446J86567B9763j2064M8297g8586C07573D2060K80618
16153C22678c1551j54545B86658j7776r0350J73782p8093d87541A35178J49010
16143B84188D727L02764g153m4858C32218D2868m060K61152g475l7059B99598
16131A88762P1556N0703j07457a54495C36923A13734F988M9586R0631j4799d2297
16119A29315d9846B52352i2368r7739g8649l86763B44864F6053J92480K6529j11516
16108A73546P6622b68137A15266b30882B34771Q106l0610c09801J14247A51327
$$ y = [603485, 36090, 141616, 379604, 212425, 5147, 106799, 46142, -17823, 491905, 276176, 340550, 301510, 168527, 61335, 308012, -86780, 140776, 45615, -292321, 195116, 392931, -125467, 145605, 30446, 217013, 29763, 17699, 65996, -78586, 307573, 42060, 322678, -31551, -186096, 286658, 268882, 178532, 352314, 274221, -487541, 135178, 284188, 4727, 307491, -7153, -52011, 332218, 42868, 38808, 299960, -7475, -44534, 299598, 188762, 260318, 311021, 203564, -154495, 336923, 113734, 6988, 56574, 147205, 132406, -42297, 129315, -49846, 252352, -92368, -190107, -78649, -465412, 244864, 66053, 258533, 285062, 173546, 250168, -268137, 115266, -230882, 234771, 242877, 212267, -309801, -195554, 151327]
16097A73356p0294L7013K36308D4334K84292A21654a89598H5535b62722a01498
16086c6399l96005A1933R5461O2862J65630a33035A6094a64395A29658K4922J64458
16075C19038d1458A37536m8058R3697A0940g458g43A6456a97184I4810b0924C9274
16062A57868L0669H9813J84571b0276F0949O5314a46794A61243L08968a44075
16051C88790a56288A15025E1382b97924e166k05763A66124b26811e8292A54948
16040I9178K41029A08553k0879N7051a93684D9391O2882C4331L3541J88365a86319
16028a10917A20689a30166j98386H9477N5991a05678m4533D3397K08523a24235
16017A7049M07054D4835b05278E0337K34536b63277c2141q0632e2043A15990b0628
$$ y = [173356, 103062, 140075, 376383, 44334, 328626, 121654, -189598, 85535, -262722, -101498, -36399, -432404, 11933, 107394, 170256, 335886, -133035, 16094, -164395, 129658, 154580, 319038, -41458, 137536, 89478, 183175, 10940, -7458, -743, 16456, -197184, 94810, -20924, 39274, 157868, 188537, 89813, 274384, -20276, 60949, 126263, -146794, 161243, 470211, -144075, 388790, -156288, 115025, 51382, -297924, -5166, -210929, 166124, -226811, -58292, 154948, 99178, 340207, 108553, 87674, 144725, -193684, 49391, 112273, 34331, 67872, 256237, -186319, -110917, 120689, -130166, -328552, 89477, 145468, -105678, -150211, 43397, 251920, -124235, 17049, 424103, 44835, -205278, 50337, 284873, -263277, -32141, -112773, -52043, 115990, -20628]
16005i474H1097e8950m2377k1999d9827j5659j4888B53558I9895a31022A30599
15993B77359j10077a13934A86241b05536p5731I1643c3550A87711K3755E5848
15982d6502d819C6774m031d2542A64601m7588a30502D2120c9190C72749q2960
15971B89789K99004P9904l21429M10080J26243l82197J16072k35060j83420c2326
15960B49524b03952d4900M884B57199d2481A86321a0833r5980A43675a31610k34339
15949c65949g7054j16016D16960a67152f4172j77049F6747a51912A85307a4888
15938c66391H7263J54945b97073a2832j86162N6752O440A02475c36648A897M1290
15927D3187A2306J81767b3488n3515o5661A03673f6246k07957f5219J2139j34048
$$ y = [-9474, 81097, -58950, -101327, -123326, -49827, -65486, -80374, 253558, 99895, -131022, 130599, 277359, 167282, -113934, 186241, -205536, -281267, 91643, -33550, 187711, 211466, 55848, -46502, -4819, 36774, 32743, -42542, 164601, 117013, -130502, 42120, -39190, 372749, 289789, 588793, 668697, 347268, 757348, 883591, 501394, 617466, 382406, 198986, -32326, 249524, -203952, -44900, -40016, 257199, -42481, 186321, -10833, -106813, 143675, -131610, -365949, -77054, -193070, 416960, -167152, -64172, -241221, 66747, -151912, 185307, -14888, -366391, 87263, 242208, -297073, -12832, -198994, -142242, -135802, 102475, -336648, 1897, 43187, 12306, 194073, -23488, -77003, -142664, 103673, -66246, -274203, -65219, -53080, -187128]
15916a87128B4620G836G90L2180h6837q4409d2734H8106a53278A8692K77956B630
15903b32587A56308m8947M6051r407P4165l006b64923e0354k38457A72567a11615
15891A50808a76724j85245D2703b25089e9011A05273e318p6461j76901e3829D2471
15879b04784M5651E4254B6893e5844h484H3110a87739a3101D0501K02086G4015
15867a30657A10816d0702o7274G6256M9355J79832A05776b41372A52706a8594
15856a03079j61263b7021j53031B34909a41590L3320C6329b9651A39038h7617
15845a74017D4935J7641a40584F5957a63191A52138a17241G4757a79007B83830
15834c6302o9292A14457b0728A33657D3968f0467k01212C8458a81715E783O0595
$$ y = [-187128, 24620, 7836, 790, 32970, -86837, -171246, -42734, 88106, -153278, 18692, 296648, 2630, -232587, 156308, 107361, 153412, 144005, 218170, 215164, -264923, -50354, -288811, 172567, -111615, 150808, -176724, -361969, 42703, -225089, -59011, 105273, -5318, -81779, -258680, -53829, 42471, -204784, -159133, 54254, 26893, -55844, -8484, 83110, -187739, -13101, 40501, 242587, 74015, -130657, 110816, -40702, -107976, 76256, 125611, 305443, 105776, -241372, 152706, -18594, -103079, -264342, -27021, -180052, 234909, -141590, -108270, 36329, -29651, 139038, -87617, -174017, 44935, 62576, -140584, 65957, -163191, 152138, -117241, 74757, -179007, 283830, -36302, -105594, 114457, -20728, 133657, 43968, -60467, -261679, 38458, -181715, 5783, 66378]
15823F6378J5757i4268A51667a60357f7654B48400g8082D7356A1703M0527b39434
15811F9606Q2408C3062h2039A61305b27590h7369A48469b68532B41406j17662
15801A23744d8846j31468A96419a74707e3621k76025B06556k9084f3030k07644
15791b70674A6966M4833K51034A42354k9204a00651n7211E9171a97717j97788
15781c95505R4849D9212b13195P3158E7550a42824j1166c3924k6263B90190b83557
15769D3293b59263c0241o968l39958F8102L3217c79906b0048I0980J796J33384
15758B26160b3829B53455L6406J03107i1985c6863B8856a25192a0978A30259a14755
15746a46087c2334B2375c1716k6309D1500J08737f8888m7476B13729c9533I3606
$$ y = [66378, 82135, -94268, 151667, -160357, -67654, 248400, -78082, 47356, 11703, 52230, -239434, 69606, 152014, 33062, -82039, 161305, -227590, -87369, 148469, -268532, 241406, 123744, -48846, -180314, 196419, -174707, -53621, -329646, 206556, 177472, -63030, -270674, 16966, 61799, 312833, 142354, 113150, -100651, -157862, 59171, -197717, -395505, -300656, 49212, -213195, -140037, 57550, -142824, -153990, -33924, -60187, 290190, -283557, 43293, -259263, -30241, -37209, -377167, 68102, 101319, -379906, -20048, 90980, 92776, 226160, -23829, 253455, 289861, 392968, -91985, -36863, 28856, -125192, -10978, 130259, -114755, -146087, -32334, 22375, -31716, -58025, 41500, 150237, -68888, -116364, 213729, -39533, 93606]
15734A24778a29877k1740L0463A94815M007M825G1863c0934n8441C5695N8103
15723I3798J49438a63366B33472a44238j16271i5770j22928j45950b4490l8249
15713f2739l54962J13473B5707N1174a89955G198Q3880b4329j47858j16490B07894
15701A6793a61766K5826B58456b1456D4148a73942C052c8082j03724B05763a51190
15689c016l6245H2577b28950a11071j40A41427g8968n1096A16705D5937b46570
15677A09561m8580R7082h5108E78432h1733A8254M0451a45004D0172n255J46046
15666A80963b3789m820d173A3024D371g5771B07778K008c6781B34719A3761a84567
15653b08842D563b39190J11545L6355j60327i0482A40645c03647j96764G0475
$$ y = [124778, -129877, -151617, -121154, 194815, 198822, 203647, 71863, -30934, -89375, 35695, 93798, 243236, -163366, 233472, -144238, -260509, -95770, -218698, -364648, -24490, -62739, -417701, -304228, 25707, 76881, -189955, 7198, 91078, -24329, -172187, -288677, 207894, 16793, -161766, -135940, 258456, -21456, 44148, -173942, 3052, -38082, -141806, 205763, -151190, -3016, -39261, 82577, -228950, -111071, -111211, 141427, -78968, -130064, 116705, 45937, -246570, 109561, 60981, 158063, -85108, 578432, -81733, 18254, 58705, -145004, 40172, 34917, 180963, -23789, -28609, -4173, 13024, 4371, -75771, 207778, 209786, -36781, 234719, 13761, -184567, -208842, 4563, -239190, -127645, -91290, -251617, -90482, 140645, -303647, -500411, 70475]
15642A29467J24608a7475j91211A11102a17681M269k26333R8720a07029m11588
15632e18617C2754a56295j03342c0274j07328f1479A38639a4178k46857e0895
15621E4162a17643A14370L8943O2293a26567I1518c894k28640k58365a16444C09214
15609b3254G5763R3173k1082R8578B2521a61955B85724D6285a36061A00726a96993
15597a69740H2562k11i1325p7074j34284a44126k42966E229h6529K3469j044A2968
15584A20386i5992d2418A83635L2275c4673A48270n5469d87668i0093j00456a2941
15572A15441K098b79799A7879Q8098b01660H6898a47908r5024h3125A24884m3009
15561H1875e4547D32961e01601a15090k13099a2603k1775a101k12412I0340L4470
$$ y = [129467, 254075, -17475, -208686, 111102, -117681, -113412, -339745, -241025, -107029, -518617, 32754, -156295, -259637, -30274, -137602, -61479, 138639, -14178, -261035, -50895, 54162, -117643, 114370, 153313, 215606, -126567, 91518, -3894, -232534, -490899, -116444, 309214, -23254, 75763, 168936, 147854, 246432, 22521, -161955, 285724, 46285, -136061, 100726, -196993, -169740, 82562, 82351, -91325, -168399, -302683, -144126, -387092, 5229, -86529, -63060, -64104, 12968, 120386, -95992, -42418, 183635, 215910, -34673, 148270, 92801, -487668, -90093, -190549, -12941, 115441, 117539, -279799, 17879, 105977, -201660, 86898, -147908, -242932, -83125, 124884, 81875, -54547, 432961, -501601, -115090, -328189, -12603, -34378, -1101, -213513, 90340, 124810]
15550A24810i326A36878R7702a0248k2667j9337r3543q029I5957a94135m6383
15539b40518m6587c9337I0278b9688j12520E2453j0241i2338H0251k9760b16390
15527b59589I8392b31101A58262b15562b1593j41407a3385A8837c52233A9201
15516I2104J10326a40116A55467c00719a31341G4633J14550p0317l8252K9960
15506A10574h7619L4906A96201b03211B46042L4162a35244J9324o392A82789H5808
15494a42691A63195M31996k92533b54430H5330a25092G9338M14103A3253c36912
15483A57341D0742J60241d4636B51798A17509a46828C47824G116J87760a03241
15472B73263f7328j6061B1711c3213k12865G2786E098b15517B3265b52967C21598
$$ y = [124810, -9326, 136878, 234580, -10248, -32915, -52252, -145795, -153824, 95957, -194135, -240518, -287105, -39337, 90278, -29688, -142208, 52453, 42212, -92338, 80251, 50491, -216390, -259589, 98392, -231101, 158262, -215562, -21593, -163000, -13385, 18837, -352233, 19201, 92104, 202430, -140116, 155467, -300719, -131341, 74633, 189183, 118866, 80614, 110574, -87619, -52713, 196201, -203211, 246042, 280204, -135244, -115920, -122312, 182789, 85808, -142691, 163195, 595191, 302658, -254430, 85330, -125092, 79338, 493441, 13253, -336912, 157341, 40742, 200983, -44636, 251798, 117509, -146828, 347824, 7116, 194876, -103241, 273263, -67328, -83389, 21711, -33213, -246078, 72786, 5098, -215517, 23265, -252967, 321598]
15460C79838A40168B5176J24600J80030J45572K00181A87829K32888A07480J52870
15450B60350b8656j3285n5406C5952a4156B4325f7931j03653B18006b18198A09216
15438C26486R0644b4002I3104e6147m3544q497c2202N749A94688A689c4377C68373
15425C48839R6802J23194k77402p9778K71215r055k21789C678L25732d3179A83511
15413A87931o6282f8436C34322A56715e7728j2121f81l453G4744d6192l8245A71751
15400B6916A582a16990I1945i6096j3736j7101k86487b0652q0232A21841b25875
15388A7035J47153i5329D48884a31832A50496n1252a50135A8976a60467j55276
15378c15743A76014h475j96585K0422C73303A68687J7340a3415A6171J25405a71284
$$ y = [379838, 140168, 25176, 149776, 329806, 475378, 675559, 187829, 420717, 107480, 260350, -28656, -41941, -97347, 35952, -14156, 24325, -67931, -171584, 218006, -218198, 109216, 326486, 417130, -24002, 93104, -56147, -99691, -108188, -32202, -26453, 194688, 1689, -34377, 368373, 348839, 445641, 568835, 291433, 211655, 482870, 473815, 252026, 3678, 329410, -43179, 183511, 187931, 121649, -68436, 334322, 156715, -57728, -69849, -681, -4134, 74744, -46192, -84437, 171751, 26916, 1582, -116990, 91945, -96096, -109832, -126933, -413420, -20652, -100884, 121841, -225875, 17035, 164188, -95329, 448884, -131832, 150496, 99244, -150135, 18976, -160467, -315743, 176014, -8475, -205060, -184638, 373303, 168687, 186027, -13415, 16171, 141576, -171284]
15366b7833C11547a78603d1617j2712I8118C3306b45400L013D28666K4374k14545
15355B38495A18936g6994A24520c1255j39835A6271K79545A08422J31569H9774
15344A0490J17152o3298L86792B07827K53358A93091o8564E6677M31635I5923
15333I7646h146A10806b8169l9293B15386G9065L23025L7651M9675j03401r9599
15322B86416l1546n9425n3034j7874a03992A29525J71676k0693Q2239a37382B15891
15310E3102c5558A96051q5482N31480b99850N1955C70052c1054A01865c19327
15299A57019J38231a97226A38631h0499A36060b5033C48330a40394E2536L7714
15289I0250d171B46714i5901H5832k6487c86062A01716I679b3965q0330i705B74552
$$ y = [-27833, 311547, -178603, -41617, -54329, 98118, 33306, -245400, -242387, 428666, 453040, 238495, 118936, -76994, 124520, -31255, -171090, 16271, 295816, 108422, 239991, 89774, 10490, 127642, 64344, 451136, 207827, 461185, 193091, 124527, 56677, 488312, 95923, 97646, -8146, 110806, -28169, -67462, 215386, 79065, 402090, 439741, 489416, 386015, 286416, 254870, 195445, 142411, 124537, -103992, 129525, 301201, 280508, 362747, -137382, 215891, 53102, -35558, 196051, 110569, 642049, -299850, -247895, 370052, -31054, 101865, -319327, 157019, 295250, -197226, 138631, -80499, 136060, -25033, 348330, -140394, 52536, 90250, -4171, 246714, -95901, 85832, 59345, -386062, 101716, 9679, -23965, -104295, -9705, 274552]
15276B29102r1167B0982d4505C4793f0582B0667a1459j5815B0211e0422A89035
15264h944p985D2444J30919F5122Q6595g3020j08403N0220j5001j0660K6243e4154
15251A26139i7614D643R8083J27312p8508a13591A2322a36836b1536j07679A55129
15239C91864a47618A32883M28575D2783M5453J07191q7558J25367K02371J75425
15229F11032K2872M10216J36074K40820K53971o13712j02474l04736B64006N6773
15219C20779A29675J53561A745J51187f7280A45537d50844I2646h3716A85423
15208i4310d4034k82528e6208A5617J10677k1890J56849r9814p0823B3213N2801
15197G6014a15315M6070C95014j88764M868E560J65175h4621H4374l0955E945
$$ y = [229102, 137935, 20982, -44505, 34793, -60582, 20667, -11459, -27274, 20211, -50422, 189035, -8944, -16929, 42444, 173363, 65122, 151717, -73020, -181423, -131203, -146204, -156864, -130621, -54154, 126139, -97614, 4643, 102726, 230038, 151530, -113591, 12322, -136836, -21536, -129215, 155129, 391864, -147618, 132883, 561458, 42783, 88236, 195427, 107869, 233236, 435607, 611032, 633904, 1044120, 1180194, 1421014, 1674985, 1061273, 958799, 654063, 264006, 320779, 129675, 283236, 1745, 152932, -67280, 145537, -450844, 92646, -83716, 185423, -94310, -44034, -326562, -56208, 15617, 126294, 104404, 261253, 161439, 90616, 23213, 76014, -115315, -69245, 395014, 206250, 211118, 5560, 170735, -84621, 84374, 53419, 5945]
15185B107J09494M18247B47244g6709j4272c2089j42327a08A852h5706A5222N2968
15173F8190a42269B27466m3256J54958i1282M5598C75693F7603c3838A44510j3241
15162A31269P4652D7730N4839K01649i1269C41302A55758d8158K4019p8497F6891
15150A93927c7010C80808e1484l6397A2191O96J43841d10195a92358C53852n5288
15139B98564j48084b9350A24319g5059A50338F6686f20r196C53751B8202K5107
15128E3309p61e4845j3657p9790A08800J60201H2930P690a68698B38404n1880
15117A86524m7116a93207E0657j6622J47243Q5547q0816p9117h8838q0159A73239
15105B2616L51228A30359K03416A25969L27304f397G6724K56931j59752K82232
$$ y = [2107, 111601, 529848, 247244, -76709, -90981, -32089, -174416, -108, 1852, -85706, 15222, 68190, -142269, 227466, 184210, 339168, -91282, -45684, 375693, 67603, -33838, 144510, 131269, 205921, 47730, 102569, 304218, -91269, 341302, 155758, -48158, -24139, -102636, 66891, 193927, -37010, 380808, -51484, -87881, 12191, 12887, 156728, -410195, -192358, 353852, 298564, 150480, -29350, 124319, -75059, 150338, 66686, -620, -9816, 353751, 28202, 53309, 52548, -54845, -68502, -148292, 108800, 269001, 82930, 90620, -168698, 238404, 186524, 139408, -193207, 50657, 34035, 181278, 266825, 186009, 106892, -88838, -168997, 173239, 22616, 373844, 130359, 333775, 125969, 453273, -6397, 76724, 333655, 173903, 456135]
15095D56135r341F4931J98354B6711R8021N3849b4213A97509N3121j12886O9831
15084B07575J94810p1812j45802R1362g3639j11969a8300n4611B85923A03754
15073a84270r234B02193N3388C1168L122J75951I5397k4034K82502b7877D5902
15061B71105a07206E76580B11105b04580B17179e0111n568j93030N2104I0466
15050B57857A15224L48010a7060B38526E0148K65176j34256K98461k25266K65456
15040E19719M996k38170J9745A36738L3956P7848J93255A36369J78843j21570
15030A93642Q3534P5955A26282J38921A13529M12349j63935L64814k63129A91401
15019c07127G87013l21137p7204j11850L8154k7467M46409k03743J13282k52285
$$ y = [456135, 446794, 64931, 263285, 26711, 124732, 178581, -24213, 197509, 250630, 137744, 207575, 402385, 330573, 184771, 276133, -73639, -185608, -18300, -72911, 285923, 103754, -184270, -193504, 202193, 255581, 31168, 34290, 210241, 95397, 71363, 353865, -27877, 45902, 271105, -107206, 576580, 211105, -204580, 217179, -50111, -55679, -248709, -196605, 90466, 257857, 115224, 463234, -17060, 238526, 50148, 315324, 181068, 479529, 254263, 519719, 524715, 286545, 306290, 136738, 170694, 248542, 441797, 136369, 315212, 193642, 277176, 353131, 126282, 265203, 113529, 525878, 361943, 726757, 463628, 191401, -307127, 787013, 465876, 388672, 276822, 314976, 287509, 733918, 530175, 643457, 391172]
15009C91172I7905O17927C02015L1862P7833J93085J27895k34176p9748J27218
14999E45984k70003N9324L10009G7041M21845r6315K65152B28330M17913A60958
14988B88052K8158A21460J11139J15444d0891B96958K90169j09873O3717A77285
14977C17881l8823K32940J78032j74765j17529K29197B11727R3816J59449p5789
14967C89203K43197M5369J88187k54141J2117j67458K8840B41721N32539k37978
14957E36282r1507k2375L76780C26485m0276A34471K10106M7374Q8107j65709
14947C14349A25740j3742K99956d5632E85480A92189K02716I7382N12543o7900
14937E42025j52472J52335B29023L4027P8485p4978J57226B02089P7446l5654
$$ y = [391172, 97905, 715832, 302015, 333877, 411710, 604795, 732690, 498514, 418766, 545984, 275981, 335305, 645314, 77041, 498886, 402571, 667723, 228330, 646243, 160958, 288052, 316210, 121460, 232599, 348043, -40891, 296958, 587127, 477254, 540971, 177285, 317881, 279058, 511998, 690030, 515265, 397736, 626933, 211727, 305543, 464992, 389203, 632400, 677769, 865956, 611815, 623932, 456474, 485314, 241721, 774260, 536282, 444775, 422400, 799180, 326485, 286209, 134471, 344577, 391951, 480058, 314349, 125740, 111998, 411954, -45632, 585480, 192189, 394905, 97382, 609925, 542025, 389553, 541888, 229023, 263050, 341535, 266557, 423783, 202089, 279535, 243881]
14927B43881l9356M50933j01642J84354j14850j71074J0095r5680A49441L20079
14917D69520J05170O0233O8573j87596L25172J36561M24301j61757l7150N7823
14907A260850O0762o2024K46359m3606j96768J9153M7589O21811m53793p0233
14897A430100J26295k06607k54174j98297M5124P626k52086j40094k31599N187
14887C31475L60356k70969n78B01481L72294l7929A79917J69750m8211P2884K5215
14876C99555J51258j32745q5199J77963j45105P5936j37931P8399J74963j9685
14866E37409K08905o4063J1255L8673q6116m5067K04372j67480L81269D62038
14855B73819L53592j41498n1951M24199l04991j47348M26154l88121J49757J38895
$$ y = [243881, 204525, 655458, 553816, 738170, 623320, 452246, 462341, 366661, 149441, 469520, 574690, 634923, 703496, 515900, 841072, 977633, 1401934, 1240177, 1203027, 1260850, 1321612, 1259588, 1505947, 1462341, 1265573, 1284726, 1332315, 1954126, 1500333, 1430100, 1556395, 1349788, 1095614, 897317, 942441, 950067, 697981, 557887, 326288, 331475, 691831, 420862, 420284, 201481, 573775, 535846, 179917, 349667, 301456, 374340, 399555, 550813, 418068, 332869, 510832, 365727, 441663, 303732, 382131, 557094, 537409, 746314, 682251, 693506, 732179, 646063, 600996, 805368, 637888, 1019157, 462038, 273819, 627411, 485913, 433962, 858161, 553170, 405822, 831976, 443855, 593612, 732507]
14845G32507C57645J75320q7009j81304Q6894L4300A25620K70440m5617O7545
14835D17988K40504j24881k66049J96613j59483L21946q757k75055J95625K64084
14825H02535k39006L84595k6541J78O4795K95714k91478k98549L2829j27805j83142
14814D14125R7789j302J9846K0029K7820J80349l58280J61520K04584k32732P1363
14803F05111p8423J55181k09498K43400q4600n0845R8173A36469N91229J55538
14793H83236j20230m7929j42952J62183n2694P759p9335J75182J87675k67609
14783G05286K235j78288J62422B96837L39786O7775K15532l21131j908m9859j50514
14772C96518N58368l98009K35236p4924j16409K50249P7754k82489r4975L70380
$$ y = [732507, 357645, 532965, 445956, 264652, 351546, 385846, 125620, 396060, 350443, 417988, 658492, 533611, 267562, 464175, 304692, 626638, 617881, 342826, 538451, 802535, 563529, 948124, 921583, 921761, 986556, 1282270, 990792, 692243, 725072, 597267, 414125, 511914, 510612, 530458, 550487, 578307, 758656, 400376, 561896, 766480, 533748, 605111, 526688, 681869, 472371, 715771, 631171, 580326, 678499, 136469, 727698, 883236, 763006, 715077, 572125, 734308, 681614, 689373, 610038, 785220, 972895, 705286, 707521, 529233, 691655, 296837, 636623, 704398, 919930, 598799, 596891, 547032, 396518, 954886, 556877, 792113, 717189, 600780, 851029, 928783, 646294, 551319, 921699]
14762I21699m476l67057L77122j24523o3984M2804N0354K5898j89713J15840n0839
14751G33125J03210l34317L04968O4040J06366D17815M68654j54116o3465k96357
14741C72531K12539o4736M70222l19836M4851B28172M44226N2715k58969M6807
14731E12951J35283J71951O2487j7927l25792L88917j69923m7678N8344j79164
14721E89449L03776J07564m00572L25644M2106K77595E86327M18365q6857J49050
14711A066885r7648K76357R0444l6073M8760P8398j61597j75380j54777N5820
14701I91189j47946n4193L13849D57106M35936J7788P6684q8975m7954n3482m1814
14690G55289J55556O960M05434l57269J75014K46621M0975K39334R1225n09682
$$ y = [921699, 917223, 550166, 927288, 802765, 738781, 781585, 831939, 857837, 668124, 783964, 733125, 836335, 502018, 806986, 871026, 977392, 417815, 886469, 732353, 668888, 372531, 585070, 520334, 990556, 670720, 715571, 228172, 672398, 725113, 466144, 512951, 648234, 820185, 882672, 864745, 538953, 927870, 757947, 710269, 768613, 589449, 893225, 1000789, 600217, 925861, 967967, 1245562, 586327, 1004692, 917835, 1066885, 969237, 1245594, 1336038, 1299965, 1348725, 1427123, 1265526, 1090146, 935369, 991189, 843243, 789050, 1102899, 457106, 893042, 910830, 987514, 898539, 850585, 797103, 755289, 910845, 917805, 1323239, 965970, 1140984, 1387605, 1428580, 1667914, 1759139, 1249457]
14680A249457N9745M5112j69337l98375L89656k78577K63655k77407O9799J10871
14670A064599k45899J37361K13235k86654O4481l4608J98621J89497k67230P3812
14660A107215k26863K99808n43393P14602j03623k63594R3325j72764n7173K63497
14650A111037K05861m08248O8323K76523M0673k99876L38470l40071N3812p3877
14640I72627K62290r2566K71200j25377P1871r2086m0834L75052m71150J63663
14630A294690k21280J44453j24545k5908M03531m30458j03300Q0266M26685k70195
14620A173939J20726M2912k15973P5308L96628k82693j67342p345K04676p7214
14610A263622M82490j58328k49976L57003j91630J82824K8143l17167K70076j01849
$$ y = [1249457, 1309202, 1354314, 1184977, 786602, 1176258, 897681, 1161336, 883929, 953728, 1064599, 818700, 956061, 1169296, 882642, 947123, 912515, 1111136, 1300633, 1033403, 1107215, 880352, 1180160, 636767, 1351369, 1247746, 984152, 1077477, 904713, 847540, 1111037, 1316898, 908650, 976973, 1253496, 1294169, 994293, 1332763, 992692, 1046504, 972627, 1234917, 1142351, 1413551, 1288174, 1360045, 1267959, 1227125, 1602177, 1131027, 1294690, 1073410, 1217863, 1093318, 1067410, 1470941, 1040483, 937183, 1017449, 1444134, 1173939, 1294665, 1337577, 1121604, 1196912, 1593540, 1310847, 1143505, 1136160, 1340836, 1263622, 1746112, 1587784, 1337808, 1694811, 1503181, 1686005, 1714148, 1396981, 1667057, 1565208]
14600A565208j02562k21052K01241K61468l83974K34195J01221l19525K18058
14591A554278J19519j94024L88521m06968j12923L48299J384K50489k86239J69742
14581A832078L65318n22509j17445L11660K42783l29278j19273K86667j78620
14572A771381J50933j3896L0611m25487J67163K30649L64384k27290J67397l6255
14562B179590r4122N2366j7050J73977k00404J37748O1306K69050Q676k21869
14552B349268L10652j20401j50622J66027q3294o9310M93120m8552K96742J30011
14542C273641L96035J99667l13556M60662L59691R71441L22390J990034K237266
14533I897271L652382O433392J0791389J037315j2839066p981306l508050j864744
$$ y = [1565208, 1462646, 1241594, 1442835, 1704303, 1320329, 1554524, 1655745, 1336220, 1554278, 1673797, 1479773, 1868294, 1461326, 1348403, 1696702, 1698086, 1948575, 1662336, 1832078, 2197396, 1674887, 1557442, 1869102, 2111885, 1782607, 1663334, 1950001, 1771381, 1922314, 1908418, 1939029, 1513542, 1680705, 1911354, 2275738, 2048448, 2215845, 2179590, 2085468, 2137834, 2120784, 2294761, 2094357, 2232105, 2293411, 2562461, 2571137, 2349268, 2659920, 2539519, 2388897, 2554924, 2471630, 2402320, 2895440, 2846888, 3143630, 3273641, 3669676, 3869343, 3555787, 4016449, 4376140, 5347581, 5669971, 7660005, 9897271, 13549653, 19983045, 30774434, 31811749, 18972683, 10991377, 7483327, 5618583]
14525E618583l50300n38867O91782r58314j199249l19111m06661L33532j0009
14516B861386l56592j13404j153K04178j78756K5658J22137m4989k83511M42545
14506B677499O1549J9742j11407j27047L21960o6047l04749M340N80990m62420
14496B594410J88432K61599j47067K88820p2603p6849O028K67079J77392m73833
14486C013408J36860J2229L69130m75575K92430J53049m3081J1518M14764l56160
14476C528572o131K86582j54740J59826K47581m05984R8675L28747P7358l08901
14466C851585K1706l27755K54038L99602q4366K57744l94414M89969k92719O07929
14456D783319j37554l1642Q2262j2682j4584k55159L99498P0831k14780j05305
$$ y = [5618583, 5268283, 4729416, 5421198, 4462884, 3263635, 2944524, 2537863, 2871395, 2861386, 2504794, 2391390, 2390237, 2594415, 2415659, 2441317, 2563454, 2518465, 2234954, 2677499, 2739048, 2758790, 2647383, 2520336, 2842296, 2776249, 2471500, 2475840, 3056830, 2594410, 2782842, 3044441, 2897374, 3186194, 3113591, 3036742, 3042770, 3309849, 3487241, 3013408, 3150268, 3162497, 3531627, 3056052, 3348482, 3501531, 3458450, 3469968, 3884732, 3528572, 3522441, 3809023, 3654283, 3814109, 4061690, 3655706, 3754381, 4083128, 4160486, 3851585, 3873291, 3545536, 3799574, 4199176, 4114810, 4372554, 3978140, 4468109, 4175390, 4783319, 4645765, 4614123, 4696385, 4683703, 4669119, 4413960, 4813458, 4884289, 4669509, 4564204]
14446D564204O00259J27696m58056M57118k83613O55391k09853o4284k13737N10564
14436E685689j98531J72436J56146k3683k00873L15133j17599N23423J33399k64864
14426F180676L23313M0719k48352j74676N86376m2753j46529K92743N8690L39570
14416G209777k1227J65771n4340Q8466k24314J93070N39896K9631J45219M04493
14406H476442k46739K59459p6127M53047K99318r2744J35854P1788L19795r5448
14396I504645o73J65069L08128L17979m05530M36750l6647L00269K15208L33696
14386A1138894l11015Q16190k28280K33243J72396K52125K00939N73419k57318
14377A2590593L64653j30733O38441M0580K50748M13643l43969O91513K30809
$$ y = [4564204, 5164463, 5292159, 4834103, 5291221, 5007608, 5662999, 5453146, 5388862, 5175125, 5685689, 5487158, 5659594, 5815740, 5792057, 5591184, 5906317, 5788718, 6312141, 6445540, 6180676, 6503989, 6544708, 6296356, 6121680, 6708056, 6665303, 6518774, 6811517, 6870207, 7209777, 7188550, 7354321, 7299981, 7388447, 7164133, 7357203, 7897099, 7926730, 8071949, 8476442, 8229703, 8489162, 8413035, 8866082, 9165400, 9072656, 9208510, 9280298, 9600093, 9504645, 9503972, 9669041, 9977169, 10295148, 9889618, 10326368, 10289721, 10589990, 10805198, 11138894, 10827879, 11644069, 11415789, 11649032, 11821428, 12073553, 12274492, 12847911, 12590593, 12955246, 12824513, 13462954, 13503534, 13754282, 14167925, 13823956, 14515469, 14746278]
14368A4746278q4395O62521L9353K27129N69182J22081N70944J48145N91564j4787
14358A7578015J37884M18216M58515L26916M87081P5860O91119M52062N17215
14349B1142883M55785M11457N86081M37718N88464M29228M63263N80831K31114
14340B5326824M34496R56374P69686P04362O87193N47878R94248M69378Q39444
14331C1729883P37724Q78353R40888J138469P45927J058884J398915M23850J396426
14322D0449319J040181J274989J372237Q62275J675824J442321J066882J501526
14314E0685554J854476K168475J046702K163123J989322K214736J864343K223722
14306F6210453K286705K641524K037433K979871K732225K946783L100091L094287
$$ y = [14746278, 14661883, 15324404, 15363757, 15590886, 16160068, 16282149, 16853093, 17001238, 17592802, 17578015, 17715899, 18134115, 18592630, 18919546, 19406627, 19482487, 20173606, 20625668, 21142883, 21598668, 22010125, 22596206, 23033924, 23622388, 24051616, 24514879, 25095710, 25326824, 25761320, 26717694, 27487380, 28191742, 28878935, 29426813, 30421061, 30890439, 31729883, 32467607, 33345960, 34286848, 35425317, 36171244, 37230128, 38629043, 39052893, 40449319, 41489500, 42764489, 44136726, 44999001, 46674825, 48117146, 49184028, 50685554, 52540030, 54708505, 55755207, 57918330, 59907652, 62122388, 63986731, 66210453, 68497158, 71138682, 73176115, 76155986, 78888211, 81834994, 84935085, 88029372]
14298H8029372L299281L560044L735443L952853M229986M285432M634674M965593
14290A20692678N248651N125706O139034O094958O513375O604669P394950P573188
14282A71387209Q212178Q518161Q891627R711836R988307J0767200J1519073J1550088
14274B50545679J2317958J3099821J3127264J3970689J3615208J4341733J4672368
14267C45690720J4473421J4538630J4312026J3794112J2782645J1651211R797115
14260D37039880Q497754P288270M077797K308217J881950K450661p15400o170702
14252D56658427n487703q919108j1052237j0857722q854154j0946883j1709308
14245C88831312j2416451j1133155j2798223j2948043j3032752j2917141j3116790
$$ y = [88029372, 91328653, 94888697, 98624140, 102576993, 106806979, 111092411, 115727085, 120692678, 125941329, 131067035, 137206069, 143301027, 149814402, 156419071, 163814021, 171387209, 179599387, 188117548, 197009175, 206721011, 216709318, 227476518, 238995591, 250545679, 262863637, 275963458, 289090722, 303061411, 316676619, 331018352, 345690720, 360164141, 374702771, 389014797, 402808909, 415591554, 427242765, 437039880, 445537634, 452825904, 456903701, 459211918, 461093868, 463544529, 462829129, 456658427, 451170724, 442251616, 431199379, 420341657, 411487503, 400540620, 388831312, 376414861, 365281706, 352483483, 339535440, 326502688, 313585547, 300468757]
14238C00468757j3370911j3593556j3542775j2262831j2136203j1243682j1137231
14231B13181568j0505412r797599r165527r051045q388001p999533p849631o581292
14223A43843528o218464o063410o154656n340550n088739m748320m413363m357098
14215A01458928m197964l840672l879541l234216l169570l361178k818761k503272
14207G4453754k900586k804217j960106k142679j969895k613779j541906k018584
14199E6502002j656095j492921j702810j538553j636096j442512j482570q16806
14191D4733639r41024j780945j144800r08394j372817r57665l73363j323212j098702
14182C4832717p85878r36028q28281o60416p32971p60937j085844m60932p48195
$$ y = [300468757, 287097846, 273504290, 259961515, 247698684, 235562481, 224318799, 213181568, 202676156, 192878557, 183713030, 174661985, 166273984, 158274451, 150424820, 143843528, 137625064, 131561654, 125406998, 120066448, 114977709, 110229389, 105816026, 101458928, 97260964, 93420292, 89540751, 86306535, 83136965, 79775787, 76957026, 74453754, 71553168, 68748951, 66788845, 64646166, 62676271, 60062492, 58520586, 56502002, 54845907, 53352986, 51650176, 50111623, 48475527, 47033015, 45550445, 44733639, 43792615, 42011670, 40866870, 39958476, 38585659, 37627994, 37254631, 35931419, 34832717, 34046839, 33110811, 32282530, 31622114, 30889143, 30128206, 29042362, 28581430, 27833235]
14173B7833235n74028p05246l23702o61221p96617m77646m56366o05897m31783
14164B2800729p98264n15208J50567n97603k22686r85696Q6521n80608k22412
14155A9115340k14177m04179o19808O0275p63584j07585l19973k66512m88444
14146A5991353k62799n4194k08385o13604K87742q42133k22417l8013l6019m54622
14136A3546909l11237j48708l3320m19861Q3826n64354j01410J6918k43622m23112
14126A1402029J17373j91638k87937J80244r91757J0004K76328k11948l87148
14117I915550O8554l11231p941l01531j09728k13892K40351k62189l88046N9982
14107H689879j25470j27475K7967j66919K97156k43567n26027k70285L25420K49458
$$ y = [27833235, 27259207, 26553961, 26230259, 25569038, 24772421, 24294775, 23838409, 23232512, 22800729, 22002465, 21487257, 21637824, 21040221, 20817535, 19831839, 19918360, 19337752, 19115340, 18901163, 18496984, 17877176, 17937451, 17173867, 17066282, 16746309, 16479797, 15991353, 15728554, 15674360, 15465975, 14852371, 15140113, 14297980, 14075563, 14037550, 14001531, 13546909, 13235672, 13086964, 13053644, 12633783, 12717609, 12153255, 12051845, 12068763, 11825141, 11402029, 11519402, 11327764, 11039827, 11220071, 10228314, 10238318, 10514646, 10302698, 9915550, 9984104, 9672873, 9664932, 9363401, 9253673, 9039781, 9280132, 9017943, 8629897, 8689879, 8564409, 8436934, 8464901, 8297982, 8595138, 8351571, 7825544, 7555259, 7880679, 8130137]
14097H130137n79284k81633J70607L8634j00237o42847K48057k05580Q0817k94929
14087F563742m8128K48937m40294P6058q815j57242j66345J25391k06532P257
14077E994029k02964K20665k28632l5164J93351j00283k47448J31298j99622L36133
14067E861363j41292j47497m70051Q8205K60578k79492J37258k74256O4220j96751
14057D902285R6039l26232J97652Q1391m55163N45475q09618L82458k69804k56827
14047D087656L50620n5392K04614j74303j48502M77667l60166j12194m18226N14006
14037D365780n04999P2167k25550J63398k1011N151l42923j2756K06616l30445
14027C375428M89409j93182L064k01083j19302M3679P7629l0849J0531n6124j76387
$$ y = [8130137, 7550853, 7269220, 7439827, 7478461, 7378224, 6735377, 6983434, 6777854, 6858671, 6563742, 6515614, 6764551, 6324257, 6400315, 6391500, 6234258, 6067913, 6193304, 5986772, 5994029, 5791065, 6011730, 5783098, 5747934, 5941285, 5841002, 5593554, 5724852, 5525230, 5861363, 5720071, 5572574, 5102523, 5190728, 5451306, 5171814, 5309072, 5034816, 5099036, 4902285, 4998324, 4672092, 4869744, 4951135, 4495972, 5041447, 4231829, 4614287, 4344483, 4087656, 4438276, 4382884, 4587498, 4413195, 4264693, 4742360, 4382194, 4270000, 3851774, 4365780, 3860781, 3932948, 3707398, 3870796, 3849785, 3854936, 3512013, 3499257, 3705873, 3375428, 3864837, 3671655, 3674719, 3473636, 3354334, 3398013, 3475642, 3444793, 3455324, 3399200, 3222813]
14016C222813K08363n6024r5059J96722J25445m68410K52214p3197j27364j34153
14006C051350K16514m12375L2196l11400M40495R1363o99038L48772K49336l52440
13996B654773J74006j88262r0369M4204r3323P9241j60290K09561j03020J8705
13986B545226j02610R7912J43189L9110j42958K13128k22555j0686L88957N12201
13976C460914K74871P16156J969708K993633N376004J1280104Q111245j1268998
13968B2913637p797535m570028k541721j540333q02999q50767k70078o09385j76128
13959C754663o1642l44309l66545j64686L7240L7928n6811j62025l97709K57123
13949B533227J67356k97086o1186K23911m63176K46747L3545n38959O94195j05797
$$ y = [3222813, 3431176, 3375152, 3280093, 3476815, 3602260, 3133850, 3386064, 3312867, 3185503, 3051350, 3267864, 2855489, 2887685, 2576285, 3016780, 3108143, 2409105, 2757877, 3007213, 2654773, 2828779, 2640517, 2550148, 2594352, 2501029, 2580270, 2419980, 2629541, 2526521, 2545226, 2442616, 2540528, 2683717, 2722827, 2579869, 2792997, 2570442, 2559756, 2948713, 3460914, 3735785, 4451941, 6421649, 9415282, 14791286, 26071390, 34182635, 22913637, 15116102, 10546074, 8004353, 6464020, 5661021, 4810254, 4540176, 3930791, 3754663, 3693021, 3348712, 2982167, 2817481, 2854721, 2892649, 2835838, 2673813, 2276104, 2533227, 2700583, 2403497, 2342311, 2566222, 2103046, 2349793, 2383338, 1844379, 2538574, 2432777]
13939B432777j70835k37409M1196j33769L51759j63752n872j29903K22396m38858
13929A767730K99776l0073J63786m31938K82909l67122M96186m15995J82453j43837
13919A803875j49550L45822l70615L43675q3951j60336k2823J43426j18202L8919
13909A770240K18560J9234j92688j64354L792J54621j64220q3993k8535K02906
13899A735563J5379j45327J48163r1679j24853J02809l54069J94973n7572Q7947
13889A511334J30675j00739j28555K86635o07462M70623k77127P7696J95767j3664
13879A545183o7848k46833J93470o1606M00613l78565K36005k84096L56260n37952
13869A154631L32887j40713j54902j35789M48579j6742j18227k57522J11765K06304
$$ y = [2432777, 2261942, 2024533, 2065729, 1931960, 2283719, 2119967, 2114095, 1984192, 2206588, 1767730, 2067506, 2037433, 2201219, 1769281, 2052190, 1685068, 2181254, 1765259, 1947712, 1803875, 1654325, 2000147, 1629532, 1973207, 1889256, 1728920, 1706097, 1849523, 1731321, 1770240, 1988800, 2008034, 1815346, 1650992, 1654784, 1809405, 1645185, 1561192, 1532657, 1735563, 1750942, 1605615, 1753778, 1662099, 1537246, 1640055, 1285986, 1480959, 1423387, 1511334, 1642009, 1541270, 1412715, 1699350, 1091888, 1562511, 1285384, 1363080, 1558847, 1545183, 1477335, 1230502, 1423972, 1362366, 1762979, 1384414, 1620419, 1336323, 1692583, 1154631, 1487518, 1346805, 1191903, 1056114, 1504693, 1487951, 1369724, 1112202, 1223967, 1430271]
13859A430271k53536J69379k30902J25444K9070N6501l85899L79513J18l16335
13849A003624J07758K80531j09463k14476k93199N14731l03008L70988m70860
13840H86626L59158j21522L8428k27664p3631m01L98556j08964j58966K7129J0875
13829A029624m9583j03056J55873J98429n00879L68780L8105l03919L52647m13803
13819G72218L18363K97754j81239m52714M94635k50462k7212j45726M5007M71430
13809A342054m47848j28573J39665K18439k2405J24511l15582K94928j57595q264
13799A039330k21437N24607n16946J0348K49235k79669N35819l28376J59935l32311
13789H40535O8577l25640L27268K01516j31536j57485j80183L08135l41952Q9008
$$ y = [1430271, 1176735, 1346114, 1115212, 1240656, 1269726, 1326227, 940328, 1319841, 1319959, 1003624, 1111382, 1391913, 1282450, 1067974, 774775, 1289506, 986498, 1357486, 886626, 1245784, 1124262, 1162690, 935026, 861395, 860994, 1259550, 1150586, 991620, 1018749, 1029624, 980041, 876985, 1032858, 1231287, 730408, 1099188, 1137293, 833374, 1186021, 772218, 1090581, 1388335, 1207096, 754382, 1249017, 998555, 971343, 825617, 870624, 1342054, 894206, 765633, 905298, 1123737, 1101332, 1225843, 910261, 1205189, 1047594, 1039330, 817893, 1342500, 825554, 835902, 1085137, 805468, 1341287, 1012911, 1172846, 840535, 909112, 583472, 910740, 1112256, 980720, 823235, 643052, 951187, 609235, 698243]
13779F98243P1070K7632J52427l51835O5670Q5186M34287j17078L2563j93114
13769I05051l09634r0365L10645k52940N36162m14488K02365l32957R814J56028
13759G19681j52159P7496L63792k02417m2767j36509O7327Q5212K77284J08812
13749A165752j83978l88010O5248J43482C85883K01402R4904K54185l71756P1156
13739F35774K62288k92701J97121O0224j35044k24290J43265j8730J92397j63814
13729F56490J55761R2804k49591L3020k09395L28067R495k34252P3009J68314
13719H23722C51176N29095C18010K70955M76202m10412K33663l48978M3987K06862
13709G90289k04026L4207O14509D28612N62757m6680j17255o4238k09149K0198
$$ y = [698243, 769313, 796945, 949372, 597537, 663207, 748393, 1182680, 1065602, 1098165, 905051, 595417, 505052, 815697, 562757, 1098919, 684431, 886796, 553839, 563653, 719681, 567522, 645018, 1008810, 806393, 763626, 627117, 694444, 779656, 1056940, 1165752, 981774, 593764, 659012, 802494, 385883, 587285, 682189, 936374, 564618, 635774, 898062, 605361, 802482, 862706, 727662, 503372, 646637, 627907, 820304, 656490, 812251, 905055, 655464, 688484, 479089, 807156, 816651, 582399, 655408, 823722, 351176, 880271, 318010, 588965, 1065167, 654755, 888418, 539440, 583427, 790289, 586263, 620470, 1234979, 428612, 991369, 944689, 827434, 763196, 554047, 574245]
13699E74245k43684K65993p123m8761M385J97270k86335R5572J49161j13926j5255
13688E71542j94128J61633J35205J1044j7054j09795L4521Q0596k42809K29894
13678F60649l4554O6779j71437K3664p4391K20902l5435C12351L82980J27195
13668H22526k67261l8788G3123N79717j58363L1554K26899C50556M29621r1329
13658F88848k82120L36224l57068J46686k9143J19413B52444J09364J30446O7684
13648E59938q6342k10213O4666N4866L3122Q6135N6162k56905N23058k19661j3437
13637E91389k3258k40053R4619J61974k50303j3586K41176q7454m8820L60233
13627G85917B87929K79321k43847L45427l14456L15849N832k92757K9046j00002
$$ y = [574245, 330561, 596554, 589431, 540670, 545055, 742325, 455990, 551562, 700723, 586797, 571542, 377414, 539047, 674252, 685296, 668242, 558447, 592968, 673564, 430755, 660649, 626095, 692874, 521437, 545101, 470710, 691612, 656177, 312351, 695331, 822526, 555265, 516477, 73123, 652840, 494477, 526031, 752930, 350556, 780177, 688848, 406728, 742952, 385884, 532570, 503427, 622840, 252444, 361808, 492254, 559938, 473596, 263383, 328049, 382915, 416037, 502172, 558334, 301429, 824487, 604826, 591389, 568131, 328078, 422697, 584671, 334368, 320782, 561958, 474504, 425684, 785917, 287929, 567250, 323403, 668830, 354374, 670223, 676055, 383298, 412344, 312342]
13617C12342p0906L09181R4339j97585K7544k7406A46370L04885q9304K74361
13607F36312k47070J35241K4837k62794K41031N2368j97078A81571L19570j42559
13597C58582K55130B63165J61910O5447K5114J86660j60816B48245K34970P6203
13587E59418j33986k6100R1414B43477n5712N25354B24153M04663A98644K03014
13577D01658M0687B11140n7371M98409A49814K27565l6554K16476k44788K60130
13567E72643r1412O1741j30691L4007M80350A31001J14679K72772j14495R1678
13557D95635O073B25338k355L251K87997j39453Q39H2473M92989j30916l3782
13546D10764A20002K31717P4906A36190N47833A35890K48184L87374l34534k8989
$$ y = [312342, 241436, 550617, 644956, 447371, 474915, 447509, 146370, 451255, 361951, 636312, 389242, 524483, 549320, 286526, 527557, 579925, 382847, 181571, 501141, 358582, 613712, 263165, 425075, 490522, 515636, 702296, 541480, 248245, 483215, 559418, 425432, 399332, 490746, 243477, 187765, 713119, 224153, 628816, 198644, 401658, 442345, 211140, 153769, 652178, 149814, 377379, 340825, 557301, 312513, 572643, 481231, 542972, 412281, 446288, 926638, 131001, 245680, 518452, 403957, 495635, 501708, 225338, 222983, 226234, 514231, 374778, 375617, 82473, 575462, 444546, 410764, 120002, 351719, 426625, 136190, 684023, 135890, 384074, 771448, 436914, 407925]
13536D07925n0344K06013A65457L59893K14586j73043k82314j12808R5308H9947
13525E34357k21622J05519A85438a77924B02777M81959C12372M1591p205c3518
13514B35525K39443L8632A84397K7809L9595J30517R4472A02226J47661I2622
13503E02568k9428B11412K28807k12520o5079K45489L55399l49922n4335a01771
13492a10726C92774G5396M47282A20222J83241p1062j8748L9570K73700j82882
13482C44041m9517R6303h706B94301J04429j87564K55647j79162R5151M2632j18937
13471C06497L3036j51284J61753A48118R589J99712j31068J69948j63086J19795
13461C53008C4976K69368C2754L66045C5762a0620A11846J2205r639J77663R772
$$ y = [407925, 357581, 563594, 165457, 525350, 739936, 566893, 284579, 171771, 267079, 89947, 534357, 312735, 418254, 185438, -177924, 202777, 684736, 312372, 353963, 346758, -33518, 235525, 474968, 513600, 184397, 212206, 251801, 382318, 476790, 102226, 249887, 92622, 502568, 473140, 211412, 440219, 227699, 162620, 408109, 763508, 413586, 359251, -101771, -110726, 392774, 75396, 522678, 120222, 303463, 232401, 213653, 253223, 526923, 344041, 294524, 390827, -8706, 294301, 398730, 211166, 466813, 287651, 382802, 425434, 306497, 339533, 188249, 350002, 148118, 157707, 357419, 226351, 396299, 233213, 353008, 34976, 304344, 32754, 398799, 35762, -10620, 111846, 124051, 114412, 292075, 301847]
13450C01847E0912M11698A47052K66817I3222n138J11513J35307A54561P1883
13440B26444a14858A25420J93155L0235n1975N8960e9198B48692A7502M30149
13430D47651A35950J41793o2728o9094j8186O08M35192d1627A49667L02711j60661
13419B91717o3981A6501J01112K47664J21124D9578J45865J49402F8551M37085
13409E05636K1607B63150K6037A12640K62438j74132J08844A42515E8927K7258
13399H6185j7172O3563R0317B5701A2329K9412N9454L39151A58836R2086J34321
13388C85243o0292J05493q4019A61806J34711k6000n7819L4133K23849I4905J4053
13377A08958A0199N95077e7708F9683J57753J44455e8288m2569A38366E7272L13671
$$ y = [301847, 50912, 462610, 147052, 413869, 93222, 88084, 199597, 334904, 154561, 226444, -114858, 125420, 318575, 348810, 296835, 355795, -59198, 248692, 17502, 447651, 135950, 277743, 215015, 145921, 127735, 128343, 563535, -41627, 149667, 452378, 291717, 227736, 16501, 117613, 365277, 486401, 49578, 195443, 344845, 68551, 505636, 527243, 263150, 289187, 112640, 375078, 200946, 309790, 142515, 58927, 86185, 69013, 132576, 222893, 25701, 12329, 41741, 101195, 440346, 158836, 250922, 385243, 324951, 430444, 346425, 161806, 296517, 270517, 212698, 246831, 470680, 94905, 108958, 10199, 605276, -57708, 69683, 227436, 371891, -58288, -100857, 138366, 57272, 370943]
13366C70943Q556j42622l3800e2997D51270j26052A21080M59150a18601H6233
13355B78925m7052J65512a5276E39017k16809o9488L0421b870A73075Q6517j8454
13344B41138r171j2043K37423A68874Q1603N3053l6558k3346j00802j3773K33042
13333C62093p422h8684D47610j46443n0840J19220A45721O1108k7608r448M0606
13322B10379F7020L98274E0801J16958H338N94861B15043P0891m6319n2577J42963
13311C30001q5399J22593O5695J6997A87958q7510J78689j23989n9141R3151K96373
13300D85531j59478H0954Q92K92689g835B73871e0645A68163i8614I0061K00421
13289B90482h3363A94132L7820F1169K18400p1390I3446a2529B4561K84487d8401
$$ y = [370943, 379499, 236877, 203077, -52997, 451270, 325218, 121080, 580230, -118601, 86233, 278925, 231873, 397385, -15276, 539017, 322208, 252720, 283141, -2870, 173075, 259592, 241138, 231967, 219924, 457347, 168874, 250477, 303530, 266972, 243626, 142824, 129051, 362093, 354671, -88684, 447610, 301167, 250327, 369547, 145721, 206829, 179221, 169773, 210379, 67020, 465294, 50801, 167759, 8338, 603199, 215043, 285934, 239615, 187038, 330001, 244602, 367195, 432890, 449887, 187958, 100448, 279137, 155148, 96007, 189158, 485531, 326053, 80954, 81846, 374535, -7835, 273871, -50645, 168163, -98614, 90061, 290482, -83363, 194132, 231952, 61169, 279569, 208179, 93446, -12529, 24561, 309048, -48401]
13277C06852G2365K23562m930a24251a6687q9455B22912I5090C1881O1129a66924
13265B24097I3433b1106C05478a3059B22661q5219h108D05552d7502B9599q570
13254B1029K9266b5378r8752a1399l5855d397C13921F3721a14832A20374J74675
13243B95049J74032o3835j045a4673D05506j02502J5119H3796K76503A7375K54761
13232B72136D6356A5799L97285D7021A2848P6473O0654J86657F6729a23675D0047
13220D06073j18521J5103j07780q5527J47836H7062P3083a16997c0990A13979
13209a76817B84838j39725b77133C66687B8355g5851A43452K81336b8179B52988
13198C73439q307O8475E2841J45645K40441I0392J34616b3330j16533B53691D6559
$$ y = [306852, 72365, 295927, 290997, -124251, -16687, -106142, 222912, 95090, 31881, 93010, -166924, 224097, 93433, -21106, 305478, -13059, 222661, 137442, -8108, 405552, -47502, 29599, 21029, 50295, -25378, -124130, -11399, -47254, -4397, 313921, 63721, -114832, 120374, 295049, 469081, 405246, 404201, -14673, 405506, 303004, 318123, 83796, 360299, 17375, 272136, 46356, 15799, 413084, 47021, 12848, 89321, 149975, 336632, 66729, -123675, 40047, 406073, 287552, 302655, 194875, 109348, 257184, 87062, 160145, -116997, -30990, 113979, -176817, 284838, 145113, -277133, 366687, 28355, -75851, 143452, 424788, -28179, 252988, 373439, 365132, 433607, 52841, 198486, 438927, 90392, 225008, -23330, -139863, 253691, 46559]
13186b4434B88505c1524j21323B55582a63847C44627C3719O7511K22854m5482
13176B78602r7934A1739c26668g8278B07608a27913e332E47816a36167A29024
13165b04610B46614B0318L84373H9843l2317b94699C87936G782J90362b0987A60729
13153H9466a37161C51928A21215A4576J47830J58431P3317H9106c73732A69367
13142f9009A33179a26911C61317j25348a65542P6375I1362K16312d1076k02576
13132b43652C533O4266J96027A9935a65658B19081f5391C47307j05486q2692j1364
13121A47765l2405J94933r9795O0294e894k8583j46108C79982a8239C38334A50287
13109A36137c469B0103J64351n1568g5695A97858C1988K3589a05662B81573I8578
$$ y = [-24434, 288505, -31524, -152847, 255582, -163847, 344627, 33719, 101230, 324084, 278602, 180668, 11739, -326668, -78278, 207608, -127913, -5332, 547816, -136167, 129024, -204610, 246614, 20318, 404691, 89843, 57526, -294699, 387936, 7782, 198144, -20987, 160729, 89466, -137161, 351928, 121215, 14576, 162406, 320837, 394154, 89106, -373732, 169367, -69009, 133179, -126911, 361317, 235969, -165542, -89167, 91362, 307674, -41076, -243652, 3533, 67799, 263826, 19935, -165658, 219081, -65391, 347307, 241821, 159129, 147765, 115360, 310293, 210498, 270792, -5894, -34477, -180585, 379982, -18239, 338334, 150287, 136137, -3469, 20103, 184454, 132886, -75695, 197858, 31988, 55577, -105662, 281573, 98578]
13097f5676C9992K62069d4726C76465A37051K25538a06580j36298A50058M6255
13087A96313a60886A94839b42494C30837i0102b7470N701C43314B5774K18986
13077B44760I3735J84609L9082A08629c78053F3500a81670A4648f0941A13763
13066c4922A61824h996j83032A20953m2507e3834J2503B39886a57322k48459B61446
13054a60419A88556i2847B76295a89245B90640F424J17659n0785O9111a00325
13043B64666l1575f6909B21736m8916L39193a2002C63391a01135H3316L42928
13033D26244A94115n7512c3241E4822b1808E3509K75060i3376A54641L629o3544
13022I4726b0457P647C3738j809h6610o7224H3980l4421K63017o2947M9984K6524
$$ y = [-65676, 39992, 302061, -44726, 376465, 137051, 362589, -106580, -242878, 150058, 196313, -160886, 194839, -242494, 330837, -90102, -27470, -21769, 343314, 25774, 244760, 93735, 278344, 317426, 108629, -378053, 63500, -181670, 14648, -60941, 113763, -34922, 161824, -8996, -192028, 120953, 78446, -53834, -41331, 239886, -157322, -405781, 261446, -160419, 188556, -92847, 276295, -189245, 290640, 6424, 124083, 73298, 142409, -100325, 264666, 233091, -66909, 221736, 172820, 512013, -12002, 363391, -101135, 83316, 426244, 194115, 136603, -33241, 54822, -21808, 53509, 328569, -93376, 154641, 158270, 94726, -20457, -12810, 33738, 31929, -86610, -153834, 83980, 49559, 312576, 249629, 299613, 326137]
13010C26137j28108a7680C819d2124A78445N5105d5892C19758a34313A24467L63793
12999D88260C5876K95915J13467B03757q4378M9713Q7828b26166A54182D8086
12988A45010o8509a2269l6579D23145j61531E0809b38613d3157j53171D8074M9195
12977I7269L0868E6188a25266G4859J54895q9306K9448a7885D63284A38665a66041
12965A97474B5333O6145K4841l287M2891f8498I6189J43562a96693f0826q315
12954f9141A5873a1966A85303d4436B68552A21054c09453a28586D86488D3493
12943A26266a30919r0772o7515b5788D30980k12120k053d9521j43335B92637a43302
12931B33333k1821c12695B33024C251J78823c21219I6566J2054M0309i7518k68273
$$ y = [326137, 198029, -17680, 3819, -42124, 178445, 233550, -45892, 319758, -134313, 124467, 488260, 35876, 331791, 445258, 203757, 119379, 169092, 256920, -226166, 154182, 48086, 145010, 76501, -12269, -48848, 423145, 261614, 50809, -238613, -43157, -196328, 48074, 97269, 128137, 56188, -125266, 74859, 229754, 140448, 169896, -17885, 463284, 138665, -166041, 197474, 25333, 91478, 116319, 113032, 155923, -68498, 96189, 239751, -196693, -60826, -69141, 15873, -11966, 185303, -44436, 268552, 121054, -309453, -128586, 486488, 43493, 126266, -130919, -221691, -289206, -25788, 430980, 218860, 216807, -49521, -192856, 292637, -143302, 233333, 211512, -312695, 233024, 3251, 182074, -321219, 96566, 108620, 148929, -97518, -365791]
12920c65791C14136f3627C3983G571g7578A91224F2339c482A99696a4835k47623
12909b62458c1041A301J65302F9356J6975R4834l6042r050h9256j19352A9481
12897C79216P2913C2536d0456j8855G5083P5803m1404L36017A79486j0556o094
12886A62836F1734K35539A5673K68885C1965d1551j30773A13606J45417K3512
12876B82535i773B12280J12288a02923B87476o2794a65386f5221j11479P224I725
12864E83271b03684A54562p6089c0423j62826e1255F5727J58893K0976n4932C5424
12852i2326A03823K6622d8729C4524K1477h1165q3331B79685B2843K13793O9082
12841C05718H5282J72891D2254J96031k1470r5969N7835N0608m4043a30671C2870
$$ y = [-365791, 314136, -63627, 33983, 7571, -77578, 191224, 62339, -3482, 199696, -14835, -262458, -31041, 1301, 166603, 69356, 86331, 181165, 145123, 136073, -89256, -208608, 19481, 379216, 452129, 32536, -40456, -59311, 75083, 150886, 109482, 445499, 179486, 168930, 162836, 61734, 297273, 15673, 284558, 31965, -41551, -172324, 113606, 259023, 282535, -9773, 212280, 324568, -102923, 287476, 224682, -165386, -65221, -176700, -169476, 9725, 583271, -203684, 154562, 78473, -30423, -193249, -51255, 65727, 224620, 245596, 190664, 35424, -92326, 103823, 130445, -48729, 34524, 56001, -81165, -164496, 279685, 22843, 236636, 305718, 85282, 258173, 42254, 238285, 216815, 120846, 178681, 229289, 185246, -130671, 32870]
12829A71398J08676C9612c00427J45249G7045P0411a68476C06166I0737b01828
12818f4845A51557d9015j61543B23270o8839F4964A5823J8988b25405a06782A50807
12806c0569A96883D0777b67106C98453i4642A493b78812K1616O5267d3439B23726
12794a04151a358B7207a42263A51781i0744G3174g8441A25418D5952c4317j71659
12783b05976B3218J22765e2528p0416L6525B20786J13837a43561B27222a96643
12772B31243b51059g1350A85926f3217J4344m6020n0981L2513M0870j8528o3819
12761a54838B3839b17706i919j05369e2320q3014o7325E4844A4650b07443B83307
12749A79327j4385a06056p2569B96067a06422j26262g2293E0500b485A37325M1754
$$ y = [171398, 280074, 39612, -300427, -155178, 77045, 147456, -168476, 306166, 90737, -201828, -64845, 151557, -49015, -210558, 223270, 154431, 64964, 15823, 34811, -225405, -106782, 150807, -30569, 196883, 40777, -267106, 398453, -94642, 1493, -278812, -257196, -191929, -43439, 223726, -104151, -1358, 27207, -142263, 151781, -90744, 73174, -78441, 125418, 45952, -34317, -205976, 23218, 145983, -52528, -122944, -86419, 220786, 334623, -143561, 227222, -196643, 231243, -251059, -71350, 185926, -63217, -48873, -94893, -145874, -113361, -72491, -91019, -154838, 23839, -217706, -9919, -115288, -52320, -135334, -202659, 54844, 14650, -207443, 283307, 179327, 164942, -106056, -178625, 296067, -106422, -232684, -72293, 50500, -2485, 137325, 179079]
12738A79079i155G1936K08036A24656a7522r7529m2436j2195A60188K0457b64534
12726F5611P9538M9666M8998a34300N3475A04518a08433A41355a27624F0992a6773
12714b14101B44554c49096H5489G897b68164P7570A95479E960N3029d3457p913
12703e1370C819J12332J9108A388i5902F1994d9690I6010L5690b47432G2230K78159
12691C50389E5584J16282J33557b28908B20894e2448D44519a31015C47879A10703
12680e7563j12689c031A57344i344A99727k3479R340c934A76396E623N7249c37888
12667A63654O2743o1380J83050j28925A06491J64927A05836l8358N5504g4753
12656A76764a9757B5347K38027a88521A80258E3560L1760n693j3984b11644N8859
$$ y = [179079, -9155, 71936, 279972, 124656, -17522, -115051, -157487, -169682, 160188, 180645, -264534, 65611, 145149, 194815, 243813, -134300, -80825, 104518, -108433, 141355, -127624, 60992, -16773, -214101, 244554, -349096, 85489, 7897, -268164, -190594, 195479, 5960, 58989, -43457, -51370, 3819, 116151, 135259, 1388, -95902, 61994, -49690, 96010, 131700, -247432, 72230, 350389, 55584, 171866, 305423, -228908, 220894, -52448, 444519, -131015, 347879, 110703, -57563, -170252, -3031, 157344, -9344, 199727, 176248, 185588, -3934, 176396, 5623, 62872, -337888, 163654, 226397, 165017, 348067, 219142, 106491, 271418, 105836, 67478, 122982, -74753, 176764, -19757, 25347, 263374, -188521, 180258, 53560, 85320, 79627, 65643, -211644, -152785]
12645a52785e716A59549P2672J31463I3807A808L2904K68707d2272B7181m892
12634B2289a05718q0671A39987J54123a57979O1285B7050b18453A03711d6665
12623C5199b99957G3875f8209E7308g22j09999K1888b7600l1523F8726M2909i2094
12610C05275j1074o0598K3899R7175a23591D28862j03963I7032l6077R6107k4304
12599A32758a14546A20562Q5058I6907k4568B0829J28633n1473b3043m6459F3794
12587A5150a14763A00738M8342J19107r7151G4598J8828P5874M42803A81122O5559
12576B46681c2560B34981A0918Q102a30498H0689j8606J03981i7601A064J1201
12565A2265g080A4204a91440C58070h479C44617a78704H1581M0325K11828D7839
$$ y = [-152785, -5716, 159549, 232221, 363684, 93807, 1808, 34712, 303419, -42272, 27181, 22289, -105718, -186389, 139987, 294110, -157979, -96694, 27050, -218453, 103711, -46665, 35199, -299957, 73875, -68209, 57308, -722, -110721, -88833, -27600, -59123, 68726, 111635, -92094, 305275, 294201, 233603, 257502, 354677, -123591, 428862, 324899, 97032, 60955, 157062, 132758, -114546, 120562, 205620, 96907, 72339, 20829, 149462, 97989, -23043, -69502, 63794, 15150, -114763, 100738, 149080, 268187, 171036, 74598, 93426, 169300, 612103, 181122, 246681, -32560, 234981, 10918, 19020, -130498, 80689, 62083, 166064, -97601, 1064, 12265, -7080, 14204, -191440, 358070, -8479, 344617, -178704, 81581, 121906, 333734, 47839]
12553A88966a84502G7470a21231a0907A48585b32509H1678e8187q3770M4404k6682
12542a24235H8037a69076d5587F1012d6649l64055B74209j1481r0452k2623c83422
12530a43783A93787h0444j9912G9522j82b73150D0838J47841p8633L5511a85736
12518a43685n1471A02809m7187R1958f4583j01712B23986A09675J95519E9395
12507A39791c1700p4744q1637K0077A48268a04153B24827f4733C35076a5092A42002
12495G6660q896a36168p7060A79183a57831a018A06649P6738b5264C16014N156
12484C21170c3284B36778I1204k4255b02285M3673J8808A27539I169R79P3582
12473H3730a37584e5570B07225a67881j83169E5103J13050a69199A45587d5708
$$ y = [188966, -184502, 77470, -121231, -10907, 148585, -232509, 81678, -58187, -141957, -97553, -124235, 88037, -169076, -45587, 61012, -46649, -410704, 274209, 262728, 172276, 149653, -383422, -143783, 193787, -80444, -100356, 79522, 79340, -273150, 40838, 188679, 110046, 145557, -185736, -143685, -195156, 102809, 55622, 147580, -64583, -166295, 223986, 109675, 305194, 59395, 139791, -31700, -106444, -188081, -168004, 148268, -104153, 224827, -64733, 335076, -15092, 142002, 76660, 67764, -136168, -213228, 179183, -157831, -1018, 106649, 183387, -25264, 316014, 321170, -33284, 236778, 91204, 66949, -202285, -158612, -139804, 127539, 9169, 10148, 83730, -137584, -55570, 207225, -167881, -351050, 55103, 168153, -169199, 145587, -45708]
12462c5513j91883l6035J24119A50729b2807j99926O9388J7874m3489M1580B1625
12450h4107B5457i5702H3162b15425i4728j31909a3924q3156D165K29980F6833
12438i6068j40367B32946c08120a42092f3987j60409A71671d93591a13782K9356
12428h4426b6466j2428B37575a80234k15766B18436D1900d34919B33753a02648
12417b52345a16747m3955m913P2969J7927c5714m5879A41282i0333B6362a77808
12405B69536j20225O6680A5334O5222Q1221b46201a0143D5960J1205g6985b0199
12393a0497j52455A54435e37941H0814L90571b43518A0154c4934B62277P2064
12383C34341F1910h2740r8871M6640f3342j1640q0955H2416L75655h6394D06915
$$ y = [-35513, -227396, -263431, -139312, 150729, -22807, -222733, -153345, -135471, -178960, -137380, 21625, -84107, 25457, -95702, 83162, -215425, -94728, -226637, -13924, -97080, 4165, 234145, 66833, -96068, -236435, 232946, -308120, -142092, -63987, -224396, 171671, -493591, -113782, -84426, -26466, -38894, 237575, -180234, -396000, 218436, 41900, -434919, 233753, -102648, -252345, -116747, -160702, -165615, -92646, -74719, -35714, -81593, 141282, -90333, 26362, -177808, 269536, 149311, 215991, 15334, 80556, 161777, -246201, -10143, 45960, 57165, -76985, -20199, -10497, -162952, 154435, -537941, 80814, 471385, -243518, 10154, -34934, 262277, 334341, 61910, -82740, -181611, -134971, -63342, -74982, -155937, 82416, 458071, -86394, 406915]
12371a8505k29732B62754E8129K54166a8459H1815J19090g372D140P7919P8363
12360A60422a48568B1689M22265a33511d7151A23491a50916b7265j95754A10592
12349D3588K61282B8035N7416K68489A76692b9107j0326j45647P8939l7809B82821
12337A20386a84114C2199a57172k00813C54876c5940l759k49752e5530n321A37897
12325H3551h1861B00914L36795A41508N3863b8889A23722C4989J04420l5786M59678
12314E63301A61530b857G5496K86090A59281J61406B6996O2831m3322J25885a01717
12302A92711L5688m180C7354J38182P7599N3778A5563c5548A31258J28277A8156
12290i2602l8991M1694A07405J26370Q9033A36076n0242a19908C5694a72349B87445
$$ y = [-18505, -248237, 262754, 58129, 312295, -18459, 81815, 200905, -7372, 4140, 82059, 160422, -148568, 21689, 443954, -133511, -47151, 123491, -150916, -27265, -223019, 110592, 43588, 304870, 28035, 85451, 353940, 176692, -29107, -39433, -185080, -106141, -143950, 282821, 120386, -184114, 32199, -157172, -357985, 354876, -35940, -39699, -289451, -55530, -60851, 137897, 83551, -81861, 200914, 537709, 141508, 195371, -28889, 123722, 34989, 139409, 103623, 563301, 161530, -2857, 75496, 361586, 159281, 320687, 26996, 89827, 46505, 172390, -101717, 192711, 228399, 224219, 37354, 175536, 253135, 306913, 15563, -35548, 131258, 259535, 18156, -92602, -131593, -89899, 107405, 233775, 322808, 136076, 85834, -119908, 35694, -172349, 287445]
12278D35386f3803k39045A58520a65620E8700B2485b15403a2179I3341N9268E2956
12266H8313K82291I3496J66172j06696M8672p5997l8203L13575j18669h8935J0277
12255g8658B95453G6680N6653K27814A15740n4481J15311m251L4606H3805K2268
12244A06073R0176I6698K76032j25255b2710B56415a29610B83760H1170K599J03974
12233A87743J33129C9910J35304b1209B95600A03071E651L37071L1655A59865
12222B44027B1859K00372M3096H3799D1696Q3559a21624C6851I117K82462l8678
12211B52901J4024j24721D418a65715C67675A07690a05783A19691K45300a73655
12200C7947K35382K7974j26610J5361q8983J7073n6007R180b48423A24891a52149
$$ y = [435386, -63803, -302848, 158520, -165620, 58700, 22485, -215403, -12179, 93341, 152609, 52956, 88313, 370604, 93496, 259668, 152972, 201644, 125647, 87444, 401019, 282350, -88935, -78658, 295453, 76680, 133333, 361147, 115740, 61259, 176570, 172319, 206925, 83805, 106073, 196249, 96698, 372730, 247475, -22710, 256415, -129610, 283760, 81170, 83769, 187743, 320872, 39910, 175214, -21209, 295600, 103071, 5651, 342722, 374377, 159865, 244027, 21859, 222231, 265327, 83799, 41696, 125255, -121624, 36851, 9117, 291579, 252901, 266925, 142204, 4418, -165715, 367675, 107690, -105783, 119691, 364991, -173655, 37947, 273329, 301303, 174693, 190054, 101071, 118144, 62137, 71317, -248423, 124891, -152149]
12188b2215B75047H6574J12668G9122J87705h5727C42738j4885A39761L29326
12178D69087B02676I1591J01483P8970j20265K02462j30957h2499k496n441D6980
12166A98915F9929k7262c7954C62679A17289N3226a78908B54561c00969D91347
12155B78607A02631L77749e419B48311F6641K51306E7204K23630o9907K9079i9952
12143C49910j35069P1116A40828a93467e204j5088C10434b6384B08512H1299d8328
12131A3086J21553c2500o4941H0265b0261B59391D615K95676j32734J17181E1046
12119a33610k9414E9434J84903c78374B21047J70636G8809J2588i9846I6741b29867
12107b8264m0512a1454I3524L17448c7363E1307a06244A90797a37468j96197B61813
$$ y = [-22215, 275047, 86574, 199242, 79122, 266827, -85727, 342738, 327853, 139761, 469087, 202676, 91591, 193074, 272044, 151779, 354241, 223284, -82499, -84995, -90436, 46980, 198915, 69929, 42667, -37954, 362679, 117289, 170515, -178908, 254561, -300969, 491347, 278607, 102631, 480380, -5419, 248311, 66641, 317947, 57204, 280834, 210927, 240006, -99952, 349910, 214841, 285957, 140828, -193467, -5204, -20292, 310434, -26384, 208512, 81299, -48328, 13086, 134639, -32500, -97441, 80265, -20261, 259391, 4615, 300291, 167557, 284738, 51046, -133610, -163024, 59434, 244337, -378374, 221047, 391683, 78809, 91397, -99846, 96741, -229867, -28264, -68776, -11454, 93524, 410972, -37363, 51307, -106244, 190797, -137468, -333665, 261813]
12095E18104p0683b73633C6220a07716C3357P4521h0402A5097J69866Q8011e0777
12083C5178n40g7710A62012L9692q9704R7450E8292K54712A09149m6227g5355
12071F2393b98551d7993C55339j69027e7251D07261j33732D8214J86028a04157
12060D5205L23180q0077C1038J06329i14A16113J28581B6964K00813r7198A1607
12048B22356e242C17736J55949a91500n7198C39522H7165j4111J82174a88243
12037a99514e3481A44392F5598d07124f449k8609m1960C82422a51605B77980a29131
12025A26884c4715G7310a55024I7132b52307g1710E42J28522b01446b6520A09405
12013G3272a43435A71732B7190h4650q5184H2374K3364m4636j1414J05608f4036
$$ y = [518104, 447421, -273633, 36220, -107716, 33357, 107878, -80402, 15097, 184963, 272974, -50777, 35178, 34638, -77710, 162012, 201704, 112000, 209450, 58292, 313004, 109149, 62922, -75355, 62393, -298551, -47993, 355339, 186312, -57251, 407261, 273529, 48214, 234242, -104157, 45205, 368385, 288308, 31038, 137367, -914, 116113, 244694, 26964, 227777, 130579, 11607, 222356, -5242, 317736, 473685, -191500, -248698, 339522, 87165, 73054, 255228, -188243, -199514, -53481, 144392, 65598, -407124, -6449, -35058, -77018, 382422, -151605, 277980, -129131, 126884, -34715, 77310, -155024, 97132, -252307, -71710, 542, 129064, -201446, -26520, 109405, 73272, -143435, 171732, 27190, -84650, -169834, 82374, 105738, 61102, 49688, 155296, -64036]
12001B03542J41027a56755E2514J94473f1941n5356C36494H3549a4660B3699J7979
11990D1678O9784j5322j7937b8744o4674B33169A15574N9854f4945j26306i0892
11978h2895m346j5067B6911D805J02069a37219h520m58162A70328I572a444l68107
11966c69551a46129A80117G4665a36578e2848p3247E180a53863q9172H6314J91785
11955B78099a8783n8576A8950K82304A11614b33790Q3021j22848A46131b44459
11944a02420J6195c384D1107a59514c8390A21731B2205e0504D847a14115H6543
11932b68976P7520g5142d200I1111D669f9092A94447a13317j85207h6059E7397
11920A53474g8148A08752n1968A7209L10469b4998k6219B541L3128j3117e9267
$$ y = [203542, 344569, -156755, 52514, 246987, -61941, -117297, 336494, 83549, -14660, 23699, 41678, 111462, 96140, 78203, -28744, -93418, 233169, 115574, 175428, -64945, -191251, -90892, -82895, -87241, -102308, 26911, 4805, 106874, -137219, -8520, -466682, 170328, 9572, -1444, -369551, -146129, 180117, 74665, -136578, -52848, -126095, 5180, -153863, -243035, 86314, 278099, -18783, -77359, 18950, 301254, 111614, -233790, -150769, -273617, 146131, -244459, -102420, -86225, -3384, 41107, -159514, -38390, 121731, 22205, -50504, 4847, -114115, 86543, -268976, -191456, -75142, -4200, 91111, 4669, -69092, 194447, -113317, -298524, -86059, 57397, 153474, -78148, 108752, 56784, 17209, 327678, -24998, -51217, 2541, 35669, 22552, -59267]
11908a20641A99437A2645M7243P2226b20959B77366A15680e2329J4467j64703
11898b02565L5541f884j1901A02409A3664d6948A68982g6171A85391K85148A48035
11886A97916m2206j4228j3311J0625a70421D2109K22806c61011B6478K75387a49691
11874b10032i5118o3988b5254j171n8790J4508j3136j55117h0632B78634d6077
11862D7034b63231J783g0269B18264n6923P1500b3225I1210a69016H6022a22006
11850a51891A08728a29995C9155L77655i2321H5360B6300b24245J12120j74620
11840b86745O4916A04530a03610L2193j12065n2017d8252A08604d4920C9921g7676
11828a46956c6065A8054b71960e6172A02778k6330J32693C2287Q2976K417C083
$$ y = [-120641, 199437, 12645, 59888, 132114, -220959, 277366, 115680, -52329, -37862, -202565, -167024, -6884, -18785, 102409, 13664, -46948, 168982, -76171, 185391, 470539, 148035, 197916, 155710, 141482, 128171, 138796, -170421, 42109, 264915, -361011, 26478, 301865, -149691, -210032, -95118, -159106, -25254, -26425, -85215, -70707, -83843, -238960, -80632, 278634, -46077, 47034, -263231, -261448, -70269, 218264, 161341, 232841, -23225, 91210, -169016, 86022, -122006, -151891, 108728, -129995, 39155, 416810, -92321, 85360, 26300, -224245, -112125, -286745, -221829, 104530, -103610, -71417, -183482, -235499, -48252, 108604, -44920, 39921, -77676, -146956, -36065, 18054, -271960, -56172, 102778, 76448, 209141, 32287, 115263, 117680, 3083]
11816b57637a15043l5473B08683f8192G9307L1763e08489B82191E4770O1246b80760
11804f7215K681a5289B3656L03968a35755q5445E886c52046D1807a24374I4957
11792B70997a54991M9390D1307g3414k62569d3406m22215B24970L82600j80461
11782D27109A92814b00970D49d4107j58731k8026C00972i8722C05832A08433c0324
11770d0854I9932a70040b951l33350D6110b9725O574A06673e4714B4885b29E8702
11757B78182a94968k74380B25179r9734m4937J62551a26069r0074A27167a38493
11746c04842C3215b5044k43569E7045O7227b68111A30504i0287G7727C2134B190
11734c7779m8218A44422A53a49344e4187A8277e8453A66205b27073R5295D6292
$$ y = [-257637, -115043, -150516, 208683, -68192, 79307, 111070, -508489, 282191, 54770, 116016, -280760, -67215, -64534, -15289, 23656, 327624, -135755, -221200, 5886, -352046, 41807, -124374, 94957, 270997, -154991, -105601, 41307, -73414, -335983, -43406, -465621, 224970, 607570, 427109, 192814, -200970, 449, -44107, -202838, -230864, 300972, -98722, 305832, 108433, -30324, -40854, 99932, -170040, -2951, -336301, 46110, -29725, -23151, 106673, -54714, 24885, -229, 58702, 278182, -194968, -469348, 225179, 125445, 80508, 243059, -126069, -216143, 127167, -138493, -304842, 33215, -25044, -268613, 57045, 124272, -268111, 130504, -90287, 77727, 32134, 2190, -37779, -85997, 144422, 153, -149344, -54187, 18277, -58453, 166205, -227073, -131778, 46292]
11722A2832J40596g3027K5128o8656b9597A85565o7635c3008a235A36094o5692
11711G0402d1567F3391A1455Q3652k2174K3417a30905A96686a14044a4112D0152
11699b52967B22275a39836A20085J3291P8885I8658h8269B04704d6519A33687
11688i215o297A66923B5857g2762D0099b8031C3483K23105H7738f1205B24064
11676b0309A18650n4541g5780R895A2306D203M51755e2347B81087h0395J6472
11665f3923A29238b22397c3081A62092l6313N4753J50871A65588D6753p785a3846
11653A26547a03105B75860b5194A99110a26049b032A31980K96181a64283f9087
11642a01989E75J63638j0671J6804l9319Q3881A3223e4211J6480C22714A36547
$$ y = [12832, 153428, -73027, -47899, -116555, -29597, 185565, 117930, -33008, -1235, 136094, 70402, -41567, 63391, 11455, 95107, 72933, 96350, -130905, 196686, -114044, -14112, 40152, -252967, 222275, -139836, 120085, 133376, 212261, 98658, -88269, 204704, -46519, 133687, -9215, -15512, 166923, 25857, -72762, 40099, -28031, 33483, 256588, 87738, -61205, 224064, -20309, 118650, 64109, -75780, -65885, 12306, 4203, 455958, -52347, 281087, -80395, -63923, 129238, -222397, -33081, 162092, 125779, 180532, 331403, 165588, 46753, 38968, -13846, 126547, -103105, 275860, -25194, 199110, -126049, -2032, 131980, 428161, -164283, -69087, -101989, 575, 164213, 153542, 170346, 131027, 214908, 13223, -54211, -37731, 322714, 136547]
11630C4254Q5698J05496a34546C123J12163b3033A80671a31416a3106j8403k26493
11619b58002P1857O4757N9119k01988g1497H4474a72480C7702P8263b77863C04982
11607A4800b55189B59255j0631k0120j8311E984R3298c14951C3997a79302A25653
11595a48256r7667B32281p0952a05099k1469L7201B2848R6313B0833K51362c06120
11583A4533a07026j1298N3261m945A55547A1942b43497B8825M5340b63907M6888
11572b17019m9186a9133n3173D4406A5977f0297B37167J34232A62572L2857B8701
11560G1430J68448b10106e2643C6501J25674P6895A01946P613b9628C193J41797
11549A44990J71353J24864G5490a06245B43314a61700B05968J416q2188c5792
$$ y = [34254, 119952, 225448, -134546, 3123, 115286, -23033, 180671, -131416, -13106, -31509, -258002, -186145, -121388, -62269, -264257, -71497, 84474, -172480, 37702, 115965, -277863, 304982, 14800, -255189, 259255, 248624, 228504, 210193, 5984, 99282, -314951, 33997, -179302, 125653, -148256, -245923, 232281, 161329, -105099, -126568, -89367, 22848, 119161, 20833, 272195, -306120, 14533, -107026, -118324, -65063, -70008, 155547, 11942, -243497, 28825, 74165, -263907, -217019, -266205, -19133, -72306, 44406, 15977, -60297, 237167, 371399, 162572, 195429, 28701, 71430, 239878, -210106, -52643, 36501, 162175, 239070, 101946, 109559, -29628, 3193, 144990, 316343, 441207, 75490, -106245, 243314, -161700, 205968, 207384, 125196, -35792]
11538A67136o4802a15405D56820A46639e7609B34143J5050a77724A05838J51391
11528B57229n6234j427A8514p798J30068o3333L879d2156m3298B90448j5084G5973
11515A3500K79907G2786K03695f0380j1469C8203c0338A76701n9681l0683J56947
11504B43284f7258j49769A63912j7706j7307K33997b48914c1046l7981A21055
11493E0834a89619A82505a23567B03664a27541A13365K74833l9805K2363p9468
11483B91288j9281l5575i7736A87960a09292A47093J2099l7181L1535m9074l9381
11472F5091e2003B32380j2784r2192a5117C103a89785F6232K6186M3614E3306
11460B64500b16416B91584q5051b44168c4045a6066A00080m3026h3868B2111J93021
$$ y = [167136, 102334, -115405, 456820, 146639, -57609, 234143, 249193, -177724, 105838, 257229, 200995, 199568, 18514, 10716, 140784, 77451, 81330, -42156, -85454, 290448, 275364, 75973, 13500, 293407, 72786, 276481, -60380, -71849, 38203, -30338, 176701, 117020, 86337, 243284, -67258, -217027, 163912, 146206, 128899, 362896, -248914, -31046, -69027, 121055, 50834, -189619, 182505, -123567, 203664, -127541, 113365, 388198, 348393, 370756, 291288, 272007, 236432, -97736, 187960, -109292, 147093, 159192, 122011, 153546, 104472, 65091, -52003, 232380, 219596, 127404, -15117, 3103, -189785, 66232, 92418, 136032, 53306, 264500, -216416, 291584, 206533, -244168, -34045, -16066, 100080, 57054, -83868, 22111, 215132]
11449B15132L1829a12076f223B1765R1231J70150a44174C39527H3476J28689g916
11437g8768A6106K20055A9013O7441K07632r4770n5088f8943j01696C32440b43503
11425A32851P0977Q3208a12546A22692B3272K6875J41108a69532h3764K0804C0702
11413A07463D6960a34993B502a09076c8331o1690A64296f5260j31422B04417J27466
11402C31883f1217K8482E4521a20736A74533C3239e18404a94329A24708b93118
11391i8389j2009k9537B9871B455i7492j6654m018A04936A5086K7357J75159l950
11379B13652I6232K51158b13978i7021c9785A45588h3054j00739D9743F005J46256
11368A52261l1488J93380g0927j8260I7708c36718h7425j00227h6809H1074a7920
$$ y = [215132, 246961, -112076, -6223, 21765, 112996, 283146, -144174, 339527, 83476, 212165, -7916, -78768, 16106, 236161, 19013, 86454, 294086, 199316, 144228, -68943, -170639, 332440, -243503, 132851, 203828, 287036, -112546, 122692, 23272, 50147, 191255, -169532, -83764, -62960, 30702, 107463, 46960, -134993, 2502, -109076, -38331, -100021, 164296, -65260, -196682, 204417, 331883, -61217, -32735, 54521, -120736, 174533, 33239, -518404, -194329, 124708, -293118, -98389, -110398, -139935, 29871, 2455, -97492, -114146, -118164, 104936, 15086, 42443, 217602, 213652, 96232, 347390, -213978, -97021, -39785, 145588, -83054, -183793, 49743, 6005, 152261, 120773, 314153, -70927, -89187, 97708, -336718, -87425, -187652, -86809, 81074, -17920]
11356C08509h3966K6801k09828a635A2433b54178I5607k016K35812d0238k42272
11345b82510g6746C5899K58702f3212q831j70719G3026b43981A8277b7546p1128
11334i8674A95620e4853B88406B6047j1907K57555A5068c03356f6151A31098l4923
11323I6175b4149A07649k5746a42942j33269C0393b17670P8064A24337a4048j95869
11312b09917h1403B68765c9381A37241a19500n614B1470J67887q6424m5138M3500
11301A01295N4551b58208D7941b14258E23060a25218A8298b75315p7835a9353
11290a33847F6251b05705j08068Q456D1130L2467b15249k10690A32574m0823c81720
11278A39749i5108j28459m7297j2886g5254n7402o2098D4539N5052A0036b05952
$$ y = [308509, -83966, -57165, -266993, -1635, 12433, -254178, 95607, 93591, 329403, -40238, -282510, -76746, 35899, 294601, -63212, -72043, -242762, 73026, -243981, 18277, -27546, -98674, 195620, -54853, 288406, 26047, 14140, 271695, 15068, -303356, -66151, 131098, 96175, -24149, 107649, 81903, -142942, -276211, 30393, -217670, -139606, 124337, -14048, -209917, -81403, 268765, -39381, 137241, -119500, -125114, 21470, 189357, 102933, 57795, 101295, 155846, -258208, 47941, -214258, 523060, -125218, 18298, -275315, -353150, -19353, -133847, 66251, -205705, -313773, -305317, 41130, 73597, -215249, -425939, 132574, 91751, -381720, 139749, -95108, -223567, -270864, -283750, -75254, -132656, -194754, 44539, 99591, 10036, -205952]
11266A10453J14043a36119B301b84191b2901k87167B22129b9594k71449A0185
11255b01408A9776a11080j17748B92355B2907a94610G5044a47288C87201a41836
11244c67879l5195d1420j33095k2691A0561M11384i4871e060l6955m5511n5950
11233a43476L9882E8852c16914a22751H1695h1875n6217B29939C3174c3368l4227
11222f7595J2060e033k73262B7740d02423a43162f9663A84834R9482a01931c7939
11210a12832r509A85011G8957a6650j0516j46181H9529a69900K7260H0247f8060
11198b10050D1758b36374g8567A98258a09560B11858a84761H4851h5095A52576
11187a16517H7318c080I5278f0303k5763l6640C3113c95450J84318b2557j33423
$$ y = [110453, 224496, -136119, 2301, -284191, -22901, -310068, 222129, -29594, -301043, 10185, -201408, 19776, -111080, -228828, 292355, 22907, -194610, 75044, -147288, 387201, -141836, -367879, -403074, -41420, -174515, -197206, 10561, 421945, -94871, -5060, -42015, -87526, -143476, -103594, 58852, -316914, -122751, 81695, -81875, -138092, 229939, 33174, -33368, -67595, -55535, -5033, -278295, 27740, -402423, -143162, -69663, 184834, 284316, -101931, -37939, -112832, -122341, 185011, 78957, -16650, -27166, -173347, 89529, -169900, -142640, 80247, -68060, -210050, 41758, -236374, -78567, 198258, -109560, 211858, -184761, 84851, -85095, 152576, -116517, 87318, -3080, 95278, -60303, -86066, -122706, 33113, -395450, -211132, -22557, -155980]
11176a55980j66530A21663M6088b5625j379j10009L8405B51746A3490l981K49247
11165B58756a31590o9876K2508J3169k19909A57935f995q3687B1699Q1415a94572
11153A50071d6545D1309b86778B9731N6701a21158R247J4783b6540r3722A149
11141B32053c43897b6728l07302f8822i164l1931n07454c9486A58186i7080A6086
11129E3556K8110b15904A70342a66220H1733H426g6356k23875Q3583a4200D3909
11117A31426b15077a01636k84155B95804j27616M9774a88299k0193a7514l8874
11107e6388A9201F64K38543e7245j39205f31B6363J60495a01424N0338A21856
11095G6077J01624c91982A86444N2909d8370H6099b2620B61723E0469a57312H2121
$$ y = [-155980, -322510, 121663, 167751, -25625, -27004, -137013, -98608, 251746, 13490, 9509, 258756, -131590, -201466, -178958, -165789, -385698, 157935, -6995, -90682, 21699, 103114, -194572, 150071, -46545, 41309, -286778, 29731, 86432, -121158, -111911, -97128, -26540, -120262, 1149, 232053, -343897, -26728, -334030, -68822, -9164, -41095, -548549, -39486, 158186, -97080, 16086, 53556, 81666, -215904, 170342, -166220, 81733, 8426, -76356, -300231, -216648, -14200, 43909, 131426, -215077, -101636, -385791, 295804, 168188, 217962, -188299, -208492, -17514, -56388, 19201, 664, 239207, -57245, -196450, -631, 26363, 186858, -101424, -51086, 121856, 76077, 177701, -391982, 186444, 239353, -48370, 86099, -22620, 261723, 50469, -157312, 82121]
11083B59443j09745L62423A07925K34687j46149k9571M68016G7923K16128g1691
11072G5438K54511F6453K6136J03338i9377B16275n7735N6417L8722h3492B94828
11060d3784A86345m8616r308a5558E18480j34769H9335M32180B11628p3788J76346
11049C14186b43125A28425o0377L66746A51877P4256j01777M09624G7634L88533
11039D66167A21049J47605R8548J49921n5172r8017N08765C78865K30449j76971
11029D32343L98883C96046Q3851j4760L42909l57584N0533J374o9703l8360N64120
11018I58426B55362N35355k21425j37729L58312l59988K61586j04259l6191J47322
11008F98345k32182j3665J13123L45546l70449l7848j1499j79522M91962C49174
$$ y = [259443, 149698, 512121, 107925, 342612, 196463, 166892, 634908, 77923, 294051, -71691, 75438, 329949, 66453, 92589, 195927, -99377, 216275, 158540, 214957, 253679, -83492, 294828, -43784, 186345, 137729, 128421, -15558, 518480, 383711, 89335, 521515, 211628, 137840, 314186, -243125, 128425, 68048, 434794, 151877, 226133, 124356, 533980, 77634, 466167, 121049, 268654, 367202, 517123, 461951, 363934, 872699, 378865, 609314, 432343, 831226, 396046, 479897, 465137, 808046, 450462, 500995, 502369, 432666, 394306, 958426, 255362, 790717, 569292, 431563, 789875, 429887, 691473, 587214, 551023, 698345, 466163, 452498, 565621, 911167, 540718, 502870, 491371, 311849, 803811, 349174]
10997F58800k93733J92215J14702j34045j61812o5060N35518B77850K33126J18752
10987F29728B95960K53148R5756k33011M29869D03942n4975A68852J68408R1698
10977D28958j50549M86784j02091n8885p6660J77529N0234k28604N50085m31512
10967F45289K72414l55081M18703j73285j206K5264L79540j90607L83357O4977
10957A469365j30700L50591K16602K76202j64594L9158J61509k83544p7158k32972
10947A624459P1229l57789K87707K80574m23289J15936J72505j54174k55383L30499
10937A692274j39736j43339Q9096n99494J0560L36598k59517n5117j58553l19734
10927D53038K10696k82608m482K19190E1044K25967N4755j46857e5815B04290
$$ y = [658800, 365067, 557282, 671984, 537939, 376127, 311067, 846585, 277850, 510976, 629728, 295960, 549108, 644864, 411853, 841722, 403942, 348967, 168852, 337260, 428958, 278409, 765193, 663102, 604217, 527557, 705086, 755320, 526716, 1076801, 645289, 917703, 562622, 981325, 808040, 806834, 832098, 1211638, 1021031, 1404388, 1469365, 1338665, 1689256, 1905858, 2182060, 2017466, 2056624, 2218133, 1934589, 1857431, 1624459, 1695688, 1337899, 1625606, 1906180, 1482891, 1598827, 1771332, 1617158, 1361775, 1692274, 1552538, 1409199, 1498295, 898801, 909361, 1245959, 986442, 931325, 772772, 453038, 663734, 381126, 376644, 595834, 51044, 277011, 331766, 184909, -55815, 204290]
10916B80740A31472a8271B71650A24235i547r0262A65044E0837L3425b16515C74459
10904a47706B00740J6696O1576m7827b01876j44679p5964g5285n3642A19716K34841
10893C54557j52781G0998b64186f8662m58951E0822a40567R95G6359R6360D7821
10881A24797c6957k07827A01251J21553a73371B28640g9689l3937A20163k4808
10871I5355b09618A46867b08874H8865a10611K5807p2521A301b18569B2521b51501
10859c77870b9590A78190a31144J2732p0875d3023j94097J9099f068E900J55579
10848A61479a90222P1383E1351J97555H3914c28964A44487b73327R3353A12179
10837b6768A66987A6396K5800Q0637D1146f7143b494F8651b511G2539a1599H2122
$$ y = [280740, 131472, -18271, 271650, 124235, -9547, -99809, 165044, 50837, 84262, -216515, 374459, -147706, 200740, 217436, 279012, 231185, -201876, -346555, -422519, -75285, -128927, 119716, 354557, 201776, 70998, -264186, -68662, -527613, 50822, -140567, -139572, 76359, 172719, 47821, 124797, -36957, -244784, 101251, 222804, -173371, 228640, -79689, -113626, 120163, 95355, -209618, 146867, -208874, 88865, -110611, -84804, -157325, 1301, -218569, 22521, -251501, -377870, -29590, 178190, -131144, -118412, -189287, -43023, -237120, -218021, -6068, 5900, 161479, -190222, -118839, 51351, 248906, 83914, -328964, 144487, -273327, -179974, 112179, -26768, 166987, 16396, 42196, 122833, 41146, -67143, -2494, 68651, -2511, 72539, -11599, 82122]
10824d5088G2025K3180r589c3441j30354E0540K89876G8683c79432E41511a13569
10812h5137k30969Q1788J2608A77493a35786j24290J17799L3358A52660a32785
10801B78340M21823a75867e4329l2945r2364g3670k14205o7381A73480b72821
10790e0748c074k7585k37568a5224A4620L74822F3386A6047M0934a93099C0990
10778C11537h4039a040n326j8094n4327A35740a83719k19177a73587l7951j36787
10767c48325C35301b79702d5013k50384H425e2106k19502L7190B94937I8556a81024
10755F9015J18452c3392B18117E8923d7766G9121b64788E3859h7202j03006N553
10744a84655Q6216A7889O5329c42587a16349N5665r5283l0650a7757j08292A17176
$$ y = [-45088, 72025, 95205, 85616, -33441, -163795, 50540, 340416, 78683, -379432, 541511, -113569, -85137, -316106, -234318, -221710, 177493, -135786, -260076, -142277, -108919, 152660, -132785, 278340, 700163, -175867, -54329, -87274, -179638, -73670, -287875, -355256, 173480, -272821, -50748, -3074, -30659, -268227, -15224, 14620, 389442, 63386, 16047, 56981, -193099, 30990, 311537, -84039, -1040, -6366, -24460, -78787, 135740, -183719, -402896, -173587, -211538, -348325, 335301, -279702, -45013, -295397, 8425, -52106, -271608, -234418, 294937, 98556, -181024, 69015, 187467, -33392, 218117, 58923, -47766, 79121, -264788, 53859, -87202, -190208, -184655, -98439, 17889, 83218, -342587, -116349, -60684, -155967, -186617, -17757, -126049, 117176]
10732c16581G0821B5090a48477m182D9046a90603j15211a10210j68466b4826k31048
10721b55874e2700A12138a99041f6915B25795j03942b52005b6508B53722F9583
10710C5553e0951k8486J8913H6154a27190A3147a84525I9820e0278A05445a46742
10698h1900k31785b8280A03885K25987a53232B76158c20261H4975c15131A93389
10687a00533q4322a5130a580F0510K2310a3417j26256B05750b39765m66963A32210
10675A07823f6106K2010o2459B09493g7378j84687L6753P6473k2009b5128A81553
10663C21786G3418f2431B24135O700H8129K28191h2135G4595h1m3742B3872b73505
10650a24450B83983a33464e849A01204j3502k5401f7320A30883m5989j0889J48051
$$ y = [-316581, 70821, 25090, -148477, -152659, 49046, -190603, -305814, -110210, -278676, -24826, -255874, -52700, 112138, -199041, -66915, 225795, 121853, -252005, -26508, 253722, 69583, 35553, -50951, -79437, -60524, 86154, -127190, 13147, -184525, 99820, -50278, 105445, -146742, -81900, -313685, -28280, 103885, 329872, -153232, 276158, -320261, 84975, -315131, 193389, -100533, -184855, -15130, -1580, 60510, 82820, -13417, -139673, 205750, -239765, -706728, 132210, 107823, -66106, -44096, -106555, 209493, -77378, -262065, -225312, -148839, -170848, -25128, 181553, 321786, 73418, -62431, 224135, 230835, 88129, 316320, -82135, 74595, -81, -43823, 23872, -273505, -124450, 283983, -133464, -5849, 101204, 87702, 62301, -67320, 130883, 84894, 74005, 222056]
10639B22056A09979G510K7656J22611b90610e6153G6841b12464c6612k20605B19342
10627A64116a2816B94207d5899A25301B8158Q3932r380b12647A8678b48381D4604
10615b10467D4969d2644k2782l00971a45839K7519a6519D0591e4742j63933L8543
10604a80132A93635a04431B27197a56615A48742g7056l24594a14176M1303m2655
10594a15528J2155j98539g158J441D30701H0095a40711A62856E8288J00551c9141
10582a3758r8511m7214B205b71820e7545a8352j59726P1910C26118a51691B48871
10570e8815q3696n2112j6136b6745H7966h2862D9216a23171C3250d0459j58496
10559a98955j52938G286J85363B0542b27392L5181G6351m753a5862C7508J9918
$$ y = [222056, 109979, 7510, 35166, 157777, -290610, -56153, 76841, -212464, -36612, -257217, 219342, 164116, -12816, 294207, -45899, 125301, 28158, 112090, 102710, -212647, 18678, -248381, 44604, -210467, 44969, -42644, -65426, -366397, -145839, -118320, -16519, 40591, -54742, -218675, -180132, 193635, -104431, 227197, -156615, 148742, -77056, -401650, -114176, -72873, -115528, -103373, -301912, -7158, -5717, 430701, 80095, -140711, 162856, 58288, 158839, -39141, -13758, -112269, -159483, 2205, -271820, -57545, -18352, -178078, -106168, 326118, -151691, 248871, -58815, -142511, -194623, -210759, -26745, 87966, -82862, 49216, -123171, 33250, -40459, -198955, -351893, 7286, 192649, 20542, -227392, -192211, 76351, 71598, -15862, 37508, 57426]
10548E7426d20804h3791j37345M9320D5056M5870b2871A01029O5962K9148e3821
10536i4779H4788c99882E731J07362d0132j13574m0440h2671j7923L9771A4330
10524B17716L0065G7925J7608J8424g6923N607r8166q8977R0269L0193c8924l86481
10512d25405a87761A03499a03494o1105j02526N9745J3071O8299o0571A95165
10501a24290L7325j74974j08514E634c22641A2730a60907N3489M9890j25269A33648
10489f9736A9131M1967a71566A60705a1533n1316j00988B4708j691b9173I2870
10477A1462J2842L20628a3616A3072L018N8776i2296B81867b96809d1345B28086
10465C70127n6547o0613K683H4725j5050L10631P8632o8184j35350Q7236A01992
$$ y = [57426, -420804, -83791, -221136, -171816, 45056, 90926, -22871, 101029, 166991, 196139, -53821, -94779, 84788, -399882, 5731, 113093, -40132, -153706, -194146, -82671, -100594, -60823, 14330, 217716, 247781, 77925, 95533, 113957, -76923, -71316, -169482, -258459, -168190, -137997, -38924, -425405, -187761, 103499, -103494, -164599, -267125, -207380, -194309, -126010, -186581, 195165, -124290, -86965, -261939, -370453, 5634, -322641, 12730, -160907, -107418, -57528, -182797, 133648, -69736, 19131, 61098, -171566, 160705, -11533, -62849, -163837, 24708, 23017, -29173, 92870, 11462, 24304, 344932, -13616, 13072, 16090, 74866, -92296, 281867, -296809, -41345, 228086, 370127, 313580, 252967, 255650, 84725, 69675, 380306, 458938, 390754, 255404, 342640, 101992]
10453B15755l585f634j54726B13964l8696b90464D25995a17853C4634a50566C6214
10441A76956a19742J8072j78947g074j54474k1357D395d594m58277G8971b46630
10429e5975a8080P038m78494B7739K25342a11915d0913A9829J20803C6216J14109
10418A50325i1863d545m98720a03070B87667g3689A72837f5048j69240A17351
10407b65452A1552a37932G0908j9925Q0080c10903b3069j21526B62441j15822
10397A46619n4911c05717a4108j84172e9911j46643g2279j27496F8333i6947a0606
10385a17247K5533M4257j46022A23732B3226K798b42574O5522B36989D3054c64409
10373B9426M26745F7134L47693g5382B45448h9188B78937b09005A34038O2443
$$ y = [215755, 212170, -6634, -161360, 213964, 175268, -290464, 425995, -117853, 34634, -150566, 36214, 176956, -119742, -101670, -280617, -7074, -161548, -182905, 4395, -4594, -462871, 78971, -246630, -55975, -18080, -11042, -489536, 27739, 253081, -111915, -40913, 19829, 140632, 36216, 150325, -91863, -4545, -503265, -103070, 287667, -73689, 172837, -65048, -234288, 117351, -265452, 11552, -137932, 70908, 50983, 131063, -310903, -23069, -144595, 262441, 146619, 91708, -305717, -14108, -198280, -59911, -206554, -72279, -199775, 68333, -96947, -10606, -117247, -91714, -47457, -193479, 123732, 23226, 26024, -242574, -177052, 236989, 43054, -364409, 29426, 456171, 67134, 414827, -75382, 245448, -89188, 278937, -209005, 134038, 196481]
10363A96481a6653A5523P2921b7281m2805B18363d020A95825P7307D5480J55820
10352B01300J59373j5961A63738L66084j84769Q8593K42927B03048D9869J5285
10342F5154J04951K30408q5775j28819N552q3186a556D34404n3434J69618j72965
10331C77623K91075k95154L56086C16819k9090J72080A81712J55346L8828C6751
10320C00110A16020b57029C31583c14327a4551I847K49895J03103e8614q8242
10310a46856I1232L8529C925a35495C16178C2573N1208A9060p994K34567R8165
10299C43798A65685R8654F8094L80494a96227D73333D2294a93790B6950c3472
10288b36442E787J34848d0724l9264l2004q6251A71701a72506M206C3442A3749
$$ y = [196481, -16653, 15523, 88444, -27281, -70086, 218363, -4020, 195825, 273132, 45480, 201300, 360673, 344712, 163738, 529822, 345053, 433646, 676573, 203048, 49869, 65154, 170105, 400513, 314738, 185919, 191471, 108285, -1556, 434404, 380970, 550588, 377623, 668698, 373544, 729630, 316819, 287729, 459809, 181712, 337058, 375886, 36751, 300110, 116020, -257029, 331583, -314327, -14551, 9847, 259742, 362845, -58614, -146856, 91232, 129761, 3925, -135495, 316178, 32573, 83781, 19060, 11066, 245633, 343798, 165685, 264339, 68094, 448588, -196227, 473333, 42294, -193790, 26950, -33472, -236442, 5787, 140635, -40724, -79988, -111992, -198243, 171701, -172506, -168300, 33442, 13749]
10276c52109B52304a8273F0508a02662j27141k9337A12232c68573D10098c9500
10265b74997e8156j84492F9891L6814a64073A9119c17615A28471C5421b04697
10254A23801a55794I2546m3901p623K55109D6806a37867A95781b51480h1764L627
10243g8137m0845B44226J3670k7360A14946J50210n5447H4217M5787D090a57961
10231A91510r5285k0133b88272f4905K9825I951N9502d0719C1634P5618h3758
10219H1160g382j00816r2224N6710M2445G7367j6720c9023A19925C6680J7080
10208E3760h4998A03602b5156H6268c79660J42358B68729a61084f6929A45566
10197a0247j06908L1204j45112j44092a14859G0272N9791b90724A08365C8286
$$ y = [-352109, 252304, -18273, 60508, -102662, -229803, -259140, 112232, -368573, 410098, -39500, -274997, -58156, -242648, 69891, 106705, -164073, 19119, -317615, 128471, 35421, -204697, 123801, -155794, 92546, 48645, 41022, 296131, 46806, -137867, 195781, -251480, -81764, -78137, -118982, 244226, 257896, 230536, 114946, 265156, 209709, 84217, 130004, 4090, -157961, 191510, 96225, 76092, -288272, -64905, -35080, 9951, 69453, -40719, 31634, 107252, -83758, 81160, -7382, -108198, -200422, -143712, -101267, 77367, 60647, -39023, 119925, 36680, 53760, -84998, 103602, -25156, 86268, -379660, -237302, 268729, -161084, -66929, 145566, -10247, -117155, -85951, -231063, -375155, -114859, 70272, 130063, -290724, 108365, 38286]
10186C1855J59335l4857d16928D1883b2518l8996D0356L4618a81050M966k99015
10175d75099G7375b19453A72968A5979a59128m9753h6974k69572J62011A8192
10164C47996a30793j8675A92813m1063J65466a36415I3410c44196H6411J90111
10154B76522b7818n7472A40897b9646j20946c2737l00121J62795f5528m00258
10144d65786O3454J70030P0642M0385A8077J13018b59377k8595c3743B05855g6665
10132E7263g6299n6066B10545a41239j46949o1218J01963f6502j41188l9148h1389
10120B90325a52297D8748M193e7920j73597N0242r5931m0734i7563B27857a49714
10108a36711j51784P7429R0626D4805j7869J0897c28787m5704e5236J9249C09107
$$ y = [31855, 191190, 156333, -416928, 41883, -22518, -61514, 40356, 74974, -181050, -176084, -475099, 77375, -219453, 172968, 15979, -159128, -208881, -86974, -356546, -194535, 18192, 347996, -130793, -149468, 192813, 151750, 317216, -136415, 93410, -344196, 86411, 276522, -27818, -85290, 140897, -29646, -150592, -32737, -332858, -170063, -65528, -465786, -402332, -232302, -161660, -121275, 18077, 131095, -259377, -287972, -33743, 205855, -76665, 57263, -76299, -132365, 210545, -141239, -288188, -349406, -247443, -66502, -207690, -246838, -81389, 290325, -152297, 48748, 52941, -57920, -231517, -181275, -277206, -317940, -97563, 227857, -149714, -136711, -288495, -211066, -120440, 44805, 26936, 37833, -328787, -374491, -55236, -35987, 309107]
10096g8038j25815B10780G3328a07473j68052C45014j47767n6243d297j51023
10086a55320B28629j01120a05870j56248A70225a8090k23507E7846a571B26798
10075A2495a37861O3136j0026j78177A14795a89997d5910D8281c43671A73255
10064b83462g7221p1367B17708c6977j3556A41316a54413j08970J19053C98724
10053B27799g5796q6227d9776k09799p0388G788d6002B19007a43575k94621A1267
10041a40422C66146f1939k34638d1639I6867L4367n1950h3406G4306a11229p2719
10030a83948N0079j46237g4022A80211a35468H092e833A26076b06105A45528j521
10019A44007a9449m9699c1168k5662B01679a34017D0225a03744j76188C41538
$$ y = [-78038, -203853, 210780, 73328, -107473, -275525, 345014, 197247, 141004, -4297, -155320, 228629, 127509, -105870, -262118, 170225, -18090, -241597, 57846, -1571, 226798, 12495, -137861, -74725, -84751, -262928, 114795, -189997, -45910, 48281, -343671, 173255, -283462, -77221, -148588, 217708, -36977, -50533, 141316, -154413, -263383, -144330, 398724, 227799, -75796, -162023, -49776, -259575, -329963, 7788, -46002, 219007, -143575, -438196, 11267, -140422, 366146, -61939, -296577, -41639, 96867, 131234, 79284, -83406, 74306, -111229, -183948, -133869, -280106, -74022, 180211, -135468, 8092, -5833, 126076, -206105, 145528, 144007, -19449, -69148, -31168, -56830, 201679, -134017, 40225, -103744, -279932, 341538]
10008F8731d0931j12928A7810c17033A41300o6386b6987j51568B02798d08686
9997a13472l2336l0631b5431k73253i5633L2780j97986C9938J38682E5099b28992
9985c15822e7459B41046J52873e1762k93545A25984a59988L1670k32214a77460
9974b47261a07007m7220B71117b24019g5115j8300A38326c87338e6496j71051
9964b27547A48017e245j96346K3121Q4428o1643M8276A49163C2060b63606J08721
9953a54885B391K20807d80906K02957j7102A5747c24726G2510d0395k00872b2261
9941A86651D142a30260L1261A53632M2175b37631k4826j1512d1749C9435a27803
9929c0750D3213A7359h8759j54608f1133o6513J6277j02259L4924F8968f2307
$$ y = [68731, -40931, -153859, 17810, -317033, 141300, 74914, -26987, -178555, 202798, -408686, -113472, -145808, -176439, -25431, -298684, -95633, -62853, -260839, 39938, 178620, 55099, -228992, -315822, -57459, 241046, 393919, -51762, -345307, 125984, -159988, -128318, -360532, -177460, -247261, -107007, -154227, 271117, -224019, -75115, -93415, 138326, -387338, -56496, -227547, 148017, -5245, -201591, -178470, -94042, -155685, -107409, 149163, 32060, -263606, -154885, 2391, 223198, -480906, -277949, -295051, 15747, -324726, 72510, -40395, -241267, -22261, 186651, 4142, -130260, -98999, 153632, 195807, -237631, -262457, -273969, -41749, 39435, -127803, -30750, 43213, 17359, -88759, -243367, -61133, -127646, -111369, -213628, -178704, 68968, -62307]
9917b49644D3856c46043G2423B0187O3406K4556m6452J17437c08946a13331C1002
9905A11957J1322b81144J31791L6722J0492j34657a660k41119a09450A08688l6158
9894G2530b68922B02812m2500C2353a3898l5004j18625I3290g6638E5341a83716
9882A78951b90548a6472k88500k9938a65718N2118j03173a8278j38799B86835
9871E7049f917E061J46414h2480A97898g8779b8757j74971O2116D6104K6289a87147
9858C21016k2190b96760l2949G3995a79545Q6520j03525O2276C0867A0019b15245
9846H2616l9516a15498A70254e72323a20700A39094K4858c58738J12111e9792
9835b66898P3857R5268A09240J42774f9314A29313a91249k1015Q0568j59906J38640
$$ y = [-249644, 43856, -346043, 72423, 20187, 83593, 108149, 61697, 179134, -308946, -113331, 31002, 111957, 123279, -281144, -149353, -112631, -102139, -236796, -1660, -242779, -109450, 108688, 72530, -268922, 202812, 160312, 32353, -13898, -48902, -167527, 93290, -76638, 55341, -183716, 178951, -290548, -16472, -304972, -334910, -165718, -113600, -216773, -18278, -157077, 286835, 57049, -6917, 5061, 151475, -82480, 197898, -78779, -28757, -203728, -141612, 46104, 72393, -187147, 321016, 298826, -296760, -329709, 73995, -179545, -93025, -196550, -134274, 30867, 10019, -215245, 82616, 43100, -115498, 170254, -572323, -120700, 139094, 163952, -358738, -246627, -59792, -266898, -193041, -97773, 109240, 252014, -69314, 129313, -191249, -212264, -131696, -291602, -152962]
9824a52962l25077a24919l39270A859J92728a34158H0880C4140e1707A0089b76003
9812a28950j09085k11482A48279C3484b91842Q3667O9082A73899a56908r4027
9802b50935G7905c19655A49797c34072d6702n1867P660L3469k92156b052D0639
9790B16225a33657E295R5981b97585h4090k57478C67675A83420L6100c13989a9065
9778e3900H6551a70426g597j14477D59981a11147k0201n174O6957j31760j48981
9767c50306D1617l412R0405a82932F1090P4096a61304D3952K01488c81370P1184
9756c10186A17335d2216j44624D3716K18551C4025L73816a12236k48868j59937
9746e21041a05357q401I9344B6655Q8973e3262k36892a40137J5343A55170A731
$$ y = [-152962, -478039, -124919, -464189, 1859, 194587, -134158, 80880, 34140, -51707, 10089, -276003, -128950, -238035, -449517, 148279, 33484, -291842, -208175, -139093, 173899, -156908, -250935, 77905, -319655, 149797, -334072, -46702, -98569, -90909, -57440, -349596, -2052, 40639, 216225, -133657, 5295, 101276, -297585, -84090, -341568, 367675, 183420, 219520, -313989, -19065, -53900, 86551, -170426, -7597, -122074, 459981, -111147, -131348, -136522, -69565, -201325, -350306, 41617, 38205, 128610, -182932, 61090, 135186, -161304, 43952, 245440, -381370, -310186, 117335, -42216, -186840, 43716, 262267, 34025, 407841, -112236, -361104, -521041, -105357, -113758, 99344, 26655, 115628, -53262, -290154, -140137, -124794, 155170, 1731]
9734a28587j455a9674k46601c9366j62174d8697I0615c79396j05160F9707O4444
9723A34151C0690L3967a14323K4962l1338Q709B61014d3767j30558n8781J4183
9712b18923g8194j77543B27276o2115b26661F2720c3805j12087B49422r8458a00539
9700h3055j13396L2120A93047H9746k1703b05630l3033B1113b5831A9174c93375
9688F9360b05086Q8124A23981b20803M7001b3697j75606A37804h5223j19861B71717
9676B37700c266l21661E7957K06595b98076a08057J1434M250k37085J58055m7871
9665b19274n650r0477J43644b1077j85108h0507r6275d941C48627D2797a41268
9653d2484p9560c1245j72739p0689B70198F2550O1631c4387b81G1997i2752j35290
$$ y = [-128587, -130042, -19674, -266275, -39366, -201540, -48697, 90615, -379396, -484556, 69707, 134151, 30690, 64657, -114323, -89361, -120699, -111990, 261014, -43767, -174325, -233106, -218923, -78194, -255737, 227276, 165161, -226661, 62720, -33805, -145892, 249422, 150964, -100539, -83055, -196451, -164331, 193047, 89746, 68043, -205630, -238663, 21113, -25831, 19174, -393375, 69360, -205086, -116962, 123981, -220803, -173802, -23697, -199303, 137804, -85223, -205084, 271717, 237700, -3266, -324927, 57957, 264552, -298076, -108057, -96623, -92373, -329458, -171403, -219274, -224924, -315401, -171757, -21077, -206185, -80507, -176782, -4941, 348627, 42797, -141268, -42484, -122044, -31245, -203984, -274673, 270198, 62550, 124181, -34387, -281, 71997, -92752, -228042]
9641b28042D34821A35962a95717j70233A8541b62394c8887B08837e2731o6830
9631a19561k44975Q1185a04951H2254J4237b4729j98698E2702a25793j13892A62664
9619b07152A75615c45046a06622B15688H0809a62420A42930c45110Q6398P3039
9609a85673H4849c07234a25144k03750a04479j00758b7563k17828p7865k1090
9599c44346a04126A77730a49902e8937K0535j01319A82938e5117B7105J10703
9589A37808c47738a20160A34775a8716A07520D2754J71093a98046D4277b32389
9578d6055k07746P6289A90888b60700A2010l835a07472k42611F3378a1529r5658
9567a07187k21579H88b71857N8526k33271a26556l16394L5966c8538A99437c1148
$$ y = [-228042, 434821, 135962, -195717, -365950, 18541, -262394, -38887, 208837, -52731, -119561, -364536, -283351, -104951, 82254, 96491, -24729, -223427, 52702, -125793, -239685, 162664, -207152, 175615, -345046, -106622, 215688, 80809, -162420, 142930, -345110, -258712, -185673, 84849, -307234, -125144, -328894, -104479, -205237, -27563, -245391, -323256, -344346, -104126, 177730, -149902, -58937, -38402, -139721, 182938, -55117, 27105, 137808, -347738, -120160, 134775, -18716, 107520, 42754, 213847, -198046, 44277, -232389, -46055, -253801, -177512, 190888, -260700, 12010, 8175, -107472, -350083, 63378, -11529, -107187, -328766, 888, -271857, -213331, -446602, -126556, -442950, -406984, -38538, 199437, -31148]
9555D85845E8941j0391R5792C6217P2991O2113a34949N7494D5364c73111B33633
9543g3286j41590D3211a19492A17861B6349L1974f8354j88873i6159A9645B323
9531b22471b3979F984a43689n9109a1566A29246a09175c7000k44233J35513A5862
9519a38312j53847b881k82334B29506g271j65999C25733g1657C4455b78542c4162
9507A56001f4028j16240a6131j5791K111j93346f4115k39697e1711n3358a9437
9495c3105I2739e9411A29586c82737a69902M4275P755L130C8893c7042p6150A5290
9482a48050P1912f533H5336M915k7047a5138H1469a10460j11388F9821l1403M2691
9470H1109b47123A5577a50734A55480C1320a12615O112A5158C205f5701D98259
$$ y = [485845, 58941, 48550, 144342, 36217, 109208, 171321, -134949, -77455, 45364, -373111, 233633, -73286, -214876, 43211, -119492, 117861, 26349, 58323, -68354, -257227, -96159, 19645, 2323, -222471, -23979, 6984, -143689, -202798, -11566, 129246, -109175, -37000, -281233, -145720, 15862, -138312, -292159, -2881, -285215, 229506, -7271, -173270, 325733, -71657, 34455, -278542, -34162, 156001, -64028, -180268, -16131, -31922, -29811, -223157, -64115, -303812, -51711, -105069, -19437, -33105, 92739, -59411, 129586, -382737, -169902, -125627, -117872, -114742, 38893, -37042, -113192, 15290, -148050, -76138, -6533, 85336, 90251, 63204, -15138, 81469, -110460, -221848, 69821, 38418, 81109, -247123, 15577, -150734, 155480, 31320, -112615, -106503, 15158, 3205, -65701, 498259]
9458c2546r1866B98326c282j18871B56944A4386a35563K7336k110j56529B05715
9446E2755d6937q4954B16160a76953c1709p8549a7758j16348A03216h4109m3188
9435a27297j5445j11328q9226E7307j5239k44a65237c5757j66463F180R042a6674
9422H1118J35716C552P5534M43145a60135G6082a91716B4872K4273a54206K764
9411a51442G4529d9694A5239a33098F5444R9979e8982k72874e1248k99112a24918
9399B3128a68865M7460A06146b15068n7635A21655g9245B17490K8500A22300l3389
9388H8911c66650A49922b45793H9598i8762F2537M2032a07316j29856j22456a8127
9376a76070B08598d29795a18185A70071R9385b247k30471j77356A02136e030o0674
$$ y = [-32546, -124412, 298326, -3282, -122153, 256944, 14386, -135563, -108227, -110337, -266866, 205715, 52755, -46937, -131891, 216160, -176953, -31709, -110258, -17758, -134106, 103216, -84109, -127297, -142742, -254070, -343296, 57307, 42068, 41824, -165237, -35757, -202220, 6180, 15222, -16674, 81118, 216834, 3552, 79086, 522231, -160135, 76082, -191716, 24872, 49145, -154206, -151442, 74529, -49694, 15239, -133098, 65444, 165423, -58982, -331856, -51248, -350360, -124918, 23128, -168865, -121405, 106146, -215068, -272703, 121655, -79245, 217490, 245990, 122300, 88911, -366650, 149922, -245793, 89598, -98762, 62537, 104569, -107316, -237172, -359628, -18127, -176070, 208598, -429795, -118185, 170071, 269456, -2247, -232718, -410074, 102136, -5030, -65704]
9365f5704r0265C6859a70443e5460j78498d425l45125A18992a77673h0962A10312
9353g205j9958B17755B6990d31821a58770j07045A66751k7040c26389a4929j35608
9342a50537q7283k57858b27994E350a98683A42153b64013p0557A63800c66497
9331F5911b6013P249o3573F3511a89244I6111k1157a53358A81692k2158c82388
9319g378n9399A420a21193D5708e3034p4622D9139k1881b55176j6055J22452b480
9306F1949K05138b407j22139q1408k3529C11814d9050k74991a07557D5808K73453
9295C19261a10489j28259e5378k46742a36464B8436L4625b41531Q1837r1858f7695
9283i4812E5940a74527B43689E2274c08263c649F7537a44112O5211K4742a1184
$$ y = [-65704, -155969, 36859, -170443, -55460, -233958, -4425, -349550, 118992, -177673, -80962, 110312, -7205, -27163, 217755, 26990, -431821, -158770, -265815, 166751, 139711, -326389, -14929, -150537, -237820, -495678, -227994, 5350, -198683, 142153, -264013, -334570, 163800, -366497, 65911, -26013, -18764, -82337, 63511, -189244, 96111, 74954, -153358, 181692, 159534, -382388, -7378, -66777, 1420, -121193, 45708, -53034, -127656, 49139, 27258, -255176, -271231, -148779, -2480, 61949, 267087, -2407, -124546, -205954, -229483, 311814, -49050, -324041, -107557, 45808, 319261, -110489, -238748, -55378, -302120, -136464, 28436, 63061, -241531, -159694, -251552, -67695, -94812, 55940, -174527, 243689, 52274, -308263, -3649, 67537, -144112, -78901, -54159, -11184]
9271a24175A63277a90381M9677j5693j11959M5468h3976j71209J4694g1579B85170
9259A0493b07515C14818r1708i2999d638C24474A9420R0732g5704j56723j84691
9248d17118E4354j8639b56583A08491a47305I883h7828m8629c4080j94360A29028
9236G4093a62457o7388A61729C431N0207a55751O9824A22328a0257A07809b2801
9224c61265a26703j3441r3803e8954J785A95794b99368J36177C9544b0006m887
9213b4893C1960b30760N7317G6874a69309e155j02341e3332l0428k31251F191
9201I4101a89752O3920j39954a7924r3268q2809A48981L5133b07589o8436H9239
9189C56352j72644a19381j13171c9319r7542A23748h4074k42375I3129c59926
$$ y = [-124175, 163277, -190381, -140704, -156397, -268356, -222888, -83976, -255185, -240491, -71579, 285170, 10493, -207515, 314818, 223110, -92999, -4638, 324474, 19420, 110152, -75704, -232427, -417118, 54354, 35715, -256583, 108491, -147305, 9883, -87828, -136457, -34080, -228440, 129028, 74093, -162457, -229845, 161729, 3431, 53638, -155751, -85927, 122328, -10257, 107809, -22801, -361265, -126703, -140144, -233947, -58954, -57169, 195794, -299368, -163191, 39544, -20006, -24893, 31960, -230760, -173443, 76874, -169309, -5155, -107496, -53332, -83760, -315011, 6191, 94101, -189752, -125832, -265786, -17924, -111192, -194001, 148981, 184114, -207589, -276025, 89239, 356352, 183708, -119381, -232552, -39319, -136861, 123748, -84074, -326449, 93129, -359926]
9178B5904a61112k2712g4562C5302b3340A68097G7145a01340G3280B7640b68547
9166A33704g5179b4744k88306a26990A75670a21281L9042o9511g2171b6068f978
9154b02379n4966P008f5630k02080N1897j30003J14317f1693j16753h5250o7894
9143a53144j14773G3929a24983j23650C92014B0230c5099k31291C67b75669K5740
9132b49929j9708O0129a2604j41347h944B4266M3072f5408n5837a236A2930a27247
9119E8350b77299B46786b47514R8148B62624b53186D3774c8477k17781A89858
9108a92293g0216j28164p1231n9471A74015A0216c02105F2832L7813K06259a32534
9096c7167j87236J04945j97577B97840a16337A39319f4912j0758A53096b65436
$$ y = [25904, -161112, -183824, -74562, 35302, -23340, 168097, 77145, -101340, 73280, 27640, -268547, 133704, -75179, -24744, -313050, -126990, 175670, -121281, -82239, -151750, -72171, -26068, -6978, -202379, -257345, -250337, -65630, -267710, -215813, -345816, -231499, -61693, -178446, -85250, -153144, -267917, 73929, -124983, -248633, 392014, 20230, -35099, -266390, 367, -275669, -249929, -269637, -209508, -12604, -153951, -8944, 24266, 67338, -65408, -121245, -1236, 12930, -127247, 58350, -277299, 246786, -247514, -149366, 262624, -253186, 43774, -38477, -256258, 189858, -192293, -70216, -198380, -269611, -329082, 174015, 10216, -302105, 62832, 100645, 306904, -132534, -37167, -224403, -119458, -317035, 297840, -116337, 139319, -64912, -75670, 153096, -265436]
9085c15556Q3229a184q9062j18000j40717a34093A48514b11648F7127b07761B162
9073d4849m59299A74154b04964A33710b5918j54499a2247j22369D30100b2288
9062h9115n6113E542h9051B60714c32399E5676a94681L5828k8111K3832b5924
9050I8921e9475D4747e1023k89588O0718M1021A26468Q7949b4805I8323C1765
9038f2375C75314A2463K9481b86318E1208a34712E8338a18981l68j955A94283
9026a17075B5996L35836a25823a5152C16654H6630c41269A93950c9928a3134B14444
9014B25650a44068l4468j15479a10154p5196C8169b12604B06897h0639q246C6543
9002A5387a81592C35755b41790f3585j34081A49553c17387g4952C8720L9721a23813
$$ y = [-315556, -232327, -1184, -90246, -208246, -348963, -134093, 148514, -211648, 67127, -207761, 2162, -44849, -504148, 174154, -204964, 133710, -25918, -180417, -12247, -134616, 430100, -22288, -89115, -145228, 5542, -89051, 260714, -332399, 55676, -194681, -158853, -186964, -163132, -25924, 98921, -59475, 44747, -51023, -340611, -279893, -238872, 126468, 214417, -24805, 98323, 31765, -62375, 375314, 12463, 41944, -286318, 51208, -134712, 58338, -118981, -119349, -121304, 194283, -117075, 25996, 361832, -125823, -15152, 316654, 86630, -341269, 193950, -39928, -13134, 214444, 225650, -144068, -178536, -294015, -110154, -185350, 38169, -212604, 206897, -80639, -88885, 36543, 15387, -181592, 335755, -241790, -63585, -197666, 149553, -317387, -74952, 38720, 78441, -123813]
8990b54643b4146j80829c8618G321J07016C6150c1650A94903K0479a24466G9278
8978B04638c54830a29052A25556c61182C6309b31657a4007l9141b837k89527C2883
8966c7430I7065b49165g1985n9725A33668c86951C31716a02812j25519E4829c36645
8954a94438E2966a46471j76450c3285r8687B9919b24098h5808L2797m26J377j09389
8942a61449P8998k04218Q9938A36337d74797a450H0865b03941A37137c14835c9067
8930F8136b45607q9832M9067c666m499k89740L4613B26939a615r6179L3462C319
8917c1473D01100F70R8216b90629J11549l2160A50169A7900J00022M6211P26291
8906H90424N19681J138228K222422M713337D465636k044324j105384l21889l36956
$$ y = [-254643, -24146, -204975, -38618, 7321, 114337, 36150, -31650, 194903, 215382, -124466, 79278, 204638, -354830, -129052, 125556, -361182, 36309, -231657, -14007, -53148, -2837, -292364, 32883, -37430, 97065, -249165, -71985, -131710, 133668, -386951, 331716, -102812, -228331, 54829, -336645, -194438, 52966, -146471, -322921, -33285, -131972, 29919, -224098, -85808, -53011, -53437, -52060, -161449, -82451, -286669, -196731, 136337, -474797, -1450, 80865, -203941, 137137, -314835, -39067, 68136, -245607, -335439, -286372, -3666, -8165, -297905, -263292, 226939, -1615, -97794, -64332, 3319, -31473, 401100, 670, 98886, -290629, -179080, -211240, 150169, 17900, 117922, 164133, 890424, 1410105, 2548333, 4770755, 9484092, 4465636, 2421312, 1315928, 994039, 657083]
8897F57083J29608A31181O1238k6677K52844h03I9659f3096m9514J2340A5014
8885B65441c51585A48987D8189g6090j19916F0582b46619B53432c4577F6905K06166
8874B73071D1063A1335c8756j24332B993b57415B6781a98449A71515a78161F4642
8862g0008j2357P623o6660A3890N4030c13478a54041p1040f6634o2554B32370
8850b17964M6487d6057a5743l64711J68837A28864C9006r573a23006j69070B5740
$$ y = [657083, 786691, 131181, 192419, 165742, 418586, -803, 99659, -63096, -112610, -100270, 15014, 265441, -351585, 148987, 48189, -76090, -196006, 60582, -246619, 253432, -34577, 66905, 273071, 41063, 11335, -38756, -163088, 2993, -257415, 26781, -198449, 171515, -178161, 64642, -70008, -82365, -74742, -141402, 13890, 67920, -313478, -154041, -225081, -66634, -129188, 232370, -217964, -171477, -46057, -15743, -380454, -211617, 128864, 39006, 29433, -123006, -292076, 25740]
$$ [...]
##END NTUPLES=NMR SPECTRUM
##END=
