
##TITLE=AC1085_CSTA01_5819259_p0tdv5XrwB
##JCAMPDX= 6.0         $$ Bruker NMR JCAMP-DX V2.0
##DATA TYPE= NMR SPECTRUM
##DATA CLASS= NTUPLES
##ORIGIN= BRUKER
##OWNER= Administrator
$$ 1.72 TOPSPIN		Version 2.1
$$ 2012-03-24 19:50:18.734 -0500  Administrator@TOPSPIN
$$ Compression mode = diff/dup
##.OBSERVE FREQUENCY= 400.13188235
##.OBSERVE NUCLEUS= ^1H
##.ACQUISITION MODE= SIMULTANEOUS (DQD)
##.ACQUISITION SCHEME= undefined
##.AVERAGES= 64
##.DIGITISER RES= 22
##SPECTROMETER/DATA SYSTEM= spect
##.PULSE SEQUENCE= noesygpps1d.comp
##.SOLVENT NAME= COFFEE_meoh
##.SHIFT REFERENCE= INTERNAL, COFFEE_meoh, 1, 14.96826
##AUDIT TRAIL= $$ (NUMBER, WHEN, WHO, WHERE, PROCESS, VERSION, WHAT)
$$ ##TITLE= Audit trail, TOPSPIN		Version 2.1
$$ ##JCAMPDX= 5.01
$$ ##ORIGIN= Bruker BioSpin GmbH
$$ ##OWNER= Administrator
$$ $$ C:\Bruker\TOPSPIN/data/COFFEE/nmr/AC1085_CSTA01_5819259_p0tdv5XrwB/12/pdata/1/auditp.txt
$$ ##AUDIT TRAIL=  $$ (NUMBER, WHEN, WHO, WHERE, PROCESS, VERSION, WHAT)
(   1,<2012-03-24 19:50:13.875 -0500>,<Administrator>,<TOPSPIN>,<go>,<TOPSPIN 2.1>,
      <created by zg
	started at 2012-03-24 19:38:42.171 -0500,
	POWCHK enabled, PULCHK disabled,
       configuration hash MD5:
       1A 1E CE 29 27 FD 77 03 67 4E F0 E3 C4 B2 CB 90
       data hash MD5: 64K
       61 FE C9 13 01 44 ED AC DC 7F 84 33 8C 76 1A 23>)
(   2,<2012-03-24 19:50:16.562 -0500>,<Administrator>,<TOPSPIN>,<proc1d>,<TOPSPIN 2.1>,
      <Start of raw data processing
       efp LB = 0.3 FT_mod = 6 PKNL = 1 PHC0 = 0 PHC1 = 0 SI = 128K 
       data hash MD5: 128K
       C9 B2 CB D9 84 84 A7 07 53 B2 CE 6B 99 0C 9D E3>)
(   3,<2012-03-24 19:50:17.859 -0500>,<Administrator>,<TOPSPIN>,<proc1d>,<TOPSPIN 2.1>,
      <pk PHC0 = 38.15002 PHC1 = 0 
       data hash MD5: 128K
       F4 57 74 2B BF 0F 3E 60 6C C9 65 34 56 07 F2 CB>)
(   4,<2012-03-24 19:50:18.234 -0500>,<Administrator>,<TOPSPIN>,<proc1d>,<TOPSPIN 2.1>,
      <abs ABSG = 1 
       data hash MD5: 128K
       00 6D 1A E0 83 45 F8 7A F4 FC ED 30 79 AC 4D F5>)
(   5,<2012-03-24 19:50:18.312 -0500>,<Administrator>,<TOPSPIN>,<proc1d>,<TOPSPIN 2.1>,
      <abs ABSG = 2 
       data hash MD5: 128K
       34 F0 D7 7B B5 4B 68 9A F4 C1 EA 6C D6 2A 78 9A>)
(   6,<2012-03-24 19:50:18.375 -0500>,<Administrator>,<TOPSPIN>,<proc1d>,<TOPSPIN 2.1>,
      <abs ABSG = 3 
       data hash MD5: 128K
       3A D6 55 25 16 BF C6 8D E6 02 38 80 52 71 70 CF>)
(   7,<2012-03-24 19:50:18.437 -0500>,<Administrator>,<TOPSPIN>,<proc1d>,<TOPSPIN 2.1>,
      <abs ABSG = 4 
       data hash MD5: 128K
       C2 16 B2 6D 12 AB D6 F5 83 2F BD 35 80 0F A2 6A>)
(   8,<2012-03-24 19:50:18.484 -0500>,<Administrator>,<TOPSPIN>,<proc1d>,<TOPSPIN 2.1>,
      <abs ABSG = 5 
       data hash MD5: 128K
       EC 03 CD 6D D4 D5 C3 72 7D 18 9F E6 C1 4E 6B 73>)
$$ ##END=
$$ 
$$ $$ hash MD5
$$ $$ CF 4C 29 0C 25 36 6C D4 56 D5 D4 53 8B 2D B5 06
##$RELAX= 
##$RELAX= 
##$RELAX= 
##$RELAX= 
##$RELAX= 
##$RELAX= 
##$RELAX= 
##$RELAX= 
$$ Bruker specific parameters
$$ [...]
##$TP07= 0
##$TPNAME0= <>
##$TPNAME1= <>
##$TPNAME2= <>
##$TPNAME3= <>
##$TPNAME4= <>
##$TPNAME5= <>
##$TPNAME6= <>
##$TPNAME7= <>
##$TPOAL= (0..7)
0.5 0.5 0.5 0.5 0.5 0.5 0.5 0.5
##$TPOFFS= (0..7)
0 0 0 0 0 0 0 0
##$TUNHIN= 0
##$TUNHOUT= 0
##$TUNXOUT= 0
##$USERA1= <user>
##$USERA2= <user>
##$USERA3= <user>
##$USERA4= <user>
##$USERA5= <user>
##$V9= 5
##$VALIST= <valist>
##$VCLIST= <CCCCCCCCCCCCCCC>
##$VD= 0
##$VDLIST= <DDDDDDDDDDDDDDD>
##$VPLIST= <PPPPPPPPPPPPPPP>
##$VTLIST= <TTTTTTTTTTTTTTT>
##$WBST= 2048
##$WBSW= 25
##$XGAIN= (0..3)
0 0 0 0
##$XL= 0
##$YL= 0
##$YMAX_a= 14676328
##$YMIN_a= -6380195
##$ZGOPTNS= <>
##$ZL1= 120
##$ZL2= 120
##$ZL3= 120
##$ZL4= 120
##$ABSF1= 14.96826
##$ABSF2= -5.58427
##$ABSG= 5
##$ABSL= 3
##$ALPHA= 0
##$AQORDER= 0
##$ASSFAC= 0
##$ASSFACI= 0
##$ASSFACX= 0
##$ASSWID= 0
##$AUNMP= <proc_prof1d_extract.lims>
##$AXLEFT= 0
##$AXNAME= <>
##$AXNUC= <1H>
##$AXRIGHT= 0
##$AXTYPE= 0
##$AXUNIT= <>
##$AZFE= 0.1
##$AZFW= 0.1
##$BCFW= 0
##$BC_mod= 0
##$BYTORDP= 0
##$COROFFS= 0
##$CY= 15
##$DATMOD= 1
##$DC= 0
##$DFILT= <>
##$DTYPP= 0
##$F1P= 0
##$F2P= 0
##$FCOR= 0.5
##$FTSIZE= 131072
##$FT_mod= 6
##$GAMMA= 0
##$GB= 0
##$INTBC= 1
##$INTSCL= 1
##$ISEN= 128
##$LB= 0.3
##$LEV0= 0
##$LPBIN= 0
##$MAXI= 10000
##$MC2= 0
##$MEAN= 0
##$ME_mod= 0
##$MI= 0
##$NCOEF= 0
##$NC_proc= -3
##$NLEV= 6
##$NOISF1= 0
##$NOISF2= 0
##$NSP= 0
##$NTH_PI= 0
##$NZP= 0
##$OFFSET= 14.96826
##$PC= 1
##$PHC0= 38.15002
##$PHC1= 0
##$PH_mod= 1
##$PKNL= yes
##$PPARMOD= 0
##$PPDIAG= 0
##$PPIPTYP= 0
##$PPMPNUM= 2147483647
##$PPRESOL= 1
##$PSCAL= 4
##$PSIGN= 0
##$PYNMP= <proc.py>
##$REVERSE= no
##$SF= 400.130004940542
##$SI= 131072
##$SIGF1= 0
##$SIGF2= 0
##$SINO= 400
##$SIOLD= 131072
##$SPECTYP= <>
##$SREGLST= <1H.CDCl3>
##$SSB= 0
##$STSI= 131072
##$STSR= 0
##$SW_p= 8223.68421052632
##$SYMM= 0
##$S_DEV= 0
##$TDeff= 65536
##$TDoff= 0
##$TI= <>
##$TILT= no
##$TM1= 0
##$TM2= 0
##$TOPLEV= 0
##$USERP1= <user>
##$USERP2= <user>
##$USERP3= <user>
##$USERP4= <user>
##$USERP5= <user>
##$WDW= 1
##$XDIM= 131072
##$YMAX_p= 512038086
##$YMIN_p= -42535915
##$CURPLOT= <Network HP LaserJet P1505>
##$CURPRIN= <$Network HP LaserJet P1505>
##$DFORMAT= <normdp>
##$LAYOUT= <+/1D_H.xwp>
##$LFORMAT= <normlp>
##$PFORMAT= <normpl>
##$SURQMSG= 1
$$ End of Bruker specific parameters
$$ ---------------------------------
##NTUPLES= NMR SPECTRUM
##VAR_NAME=  FREQUENCY,     SPECTRUM/REAL,   SPECTRUM/IMAG
##SYMBOL=    X,             R,               I
##VAR_TYPE=  INDEPENDENT,   DEPENDENT,       DEPENDENT
##VAR_FORM=  AFFN,          ASDF,            ASDF
##VAR_DIM=   131072,        131072,          131072
##UNITS=     HZ,            ARBITRARY UNITS, ARBITRARY UNITS
##FACTOR=    0.0627417313425165, 1,          1
##FIRST=     8223.62146879498, 2978,         -109422
##LAST=      0,             2629,            -110157
##MIN=       0,             -42535915,       0
##MAX=       8223.62146879498, 512038086,    0
$$ Real data points
##PAGE= N=1
##DATA TABLE= (X++(R..R)), XYDATA
$$ [...]
63954 978678 990115 1002948 1017937 1034588 1051726 1068552 1084672 1099827 1114400 1129647 1146349
63943 1146349 1163440 1178917 1192066 1203909 1215591 1227361 1239341 1252164 1266309 1281571 1297881
63932 1297881 1316097 1337420 1362475 1391467 1424610 1461629 1501262 1542267 1584973 1631142 1682291
63921 1682291 1738875 1801164 1869975 1945868 2028247 2116060 2209237 2308759 2415372 2529023 2649836
63910 2649836 2778980 2918050 3068095 3229998 3405650 3597967 3809495 4041562 4295153
63901 4295153 4572349 4876702 5212567 5584385 5996454 6453237 6960085 7523752 8151740
63892 8151740 8850670 9625212 10478363 11411904 12425724 13516516 14677285 15897958 17166518
63883 17166518 18470105 19795288 21126501 22443401 23719915 24926572 26034154 27016064
63875 27016064 27849533 28517105 29007376 29313203 29428848 29349709 29074862 28608847 27961009
63866 27961009 27144993 26180211 25092767 23912747 22669327 21387712 20089269 18792805
63858 18792805 17515209 16271614 15075604 13939155 12872015 11880833 10968466 10133889
63850 10133889 9373116 8681075 8053360 7486534 6976915 6519211 6106555 5732123 5390845
63841 5390845 5079400 4794622 4532539 4289502 4063884 3855688 3664272 3487079 3320857
63832 3320857 3163517 3014389 2873238 2739553 2612463 2490825 2373697 2261152 2154361
63823 2154361 2054258 1960274 1870860 1785076 1702972 1624448 1548654 1475041 1404542 1338972 1279214
63812 1279214 1224434 1173161 1124734 1079349 1037007 997105 959333 924384 893116 865125 838947
63801 838947 813913 791109 771917 755941 741072 725578 709539 694137 680165 667674 656633
63790 656633 647254 639579 633210 627681 622848 618725 615116 611658 608139 604578 601075 597696 594311 590288
63776 590288 584680 577087 568156 558647 548231 535968 521872 506949 491525 474774 456708 439525
63764 439525 425690 415139 405556 395189 384356 374413 366356 360359 355475 349759 341946 333284 326473
63751 326473 322367 318907 313926 307763 302244 298161 294968 292148 289378 285679 279981 272833 266448 262488
63737 262488 260415 258471 255681 252407 249281 246310 243164 239889 236869 234200 231598 229092 227322 226677
63723 226677 226504 225810 224512 223243 222114 220631 218866 217587 216864 215694 213682 212038 212002 212993 213337 212276
63707 212276 210320 208170 206421 205841 206682 207797 207673 206362 205237 204723 203625 201220 198845 198449 200194
63692 200194 202315 203073 202201 200648 199473 199091 199352 200267 202365 205902 209872 212592 213482 213516 213554 213107 211540
63675 211540 209760 209574 211502 214314 216865 219432 222847 227121 231566 235880 240419 245552 251148 256695
63661 256695 261652 265781 269306 272578 275374 276898 276797 275843 275096 274719 274315 274123 274878 276440 277677 278142
63645 278142 278822 280475 282117 282236 281025 280321 281522 284463 288113 291329 292954 292296 289827 286652 283176
63630 283176 279101 274780 271329 269013 266705 263746 261289 260672 261134 260485 257866 254732 253009 253262 254983
63615 254983 257753 261428 265543 269373 272695 276108 280234 284817 288993 292445 295758 299333 302493 304238
63601 304238 304558 304304 303951 303300 302257 300944 299000 295888 292277 289944 289583 289603 288011 284862 281915 280340
63585 280340 279853 279868 280473 282014 284419 287325 290625 294708 300006 306162 311779 315712 318728 323139 330273
63570 330273 338974 347228 354677 362761 372836 385037 398807 413702 429591 446564 464655 483446
63558 483446 502361 521687 542871 567248 594830 624770 656387 689107 722147 755353 789912
63547 789912 827096 866390 905777 943539 978636 1009465 1033756 1050331 1060146 1065191 1066998 1066421
63535 1066421 1064041 1060151 1054766 1048023 1040254 1031466 1021138 1008712 993969 976853 957346 935682
63523 935682 912423 888237 863902 840449 818882 799553 781971 765272 748930 733309 719613
63512 719613 708771 700120 691770 682704 673813 666269 659797 653680 648873 647661 651146 658079 666287 674469
63498 674469 682757 692440 705129 721385 740206 760489 782548 807247 834327 863011 893799 927727
63486 927727 963847 999398 1032989 1065749 1098518 1129520 1155860 1175900 1189159 1195459 1195920 1193821
63474 1193821 1192601 1193039 1193435 1192151 1188792 1183126 1174245 1161253 1144156 1123655 1100144 1072901 1040418
63461 1040418 1002154 960101 917875 877874 839960 803212 767987 735496 706192 679508 654681
63450 654681 631038 608032 586000 566501 550885 538644 527822 516848 505374 493851 483269
63439 483269 475017 469805 466533 462973 457884 451988 446812 443032 440076 437046 434027 432555 434425 439681
63425 439681 446271 452211 457672 464225 472459 481305 489640 497489 505289 512727 518989 523907 528244 532639
63411 532639 536526 538469 537681 534771 530643 525218 518188 510645 504526 500049 495151 488373 481146 476024
63397 476024 473567 472390 471731 472245 474252 476696 478446 479681 481495 484609 488807 493302 497583 502100 507883
63382 507883 515200 523085 530773 538984 548892 560374 572476 585340 600289 617909 637350 657887
63370 657887 680102 705056 733207 764550 798917 835650 873747 912863 953632 996671 1041938
63359 1041938 1089295 1138801 1189974 1241632 1293020 1344195 1394513 1441448 1481819 1513763 1536802
63348 1536802 1550802 1556114 1554490 1548534 1539954 1529089 1516197 1502261 1488035 1472880 1455049 1432965
63336 1432965 1406076 1374845 1340278 1303303 1264343 1223474 1181093 1138349 1096821 1057770 1021680
63325 1021680 988506 958278 931286 907529 886184 866218 847799 832699 822834 818441 817944 819451
63313 819451 822052 825983 832143 841525 854544 870692 889150 909867 933657 961040 991447 1023911
63301 1023911 1058141 1094392 1132667 1172766 1215045 1260229 1308093 1356891 1404478 1449499 1490954
63290 1490954 1527038 1555240 1573705 1582203 1582068 1575837 1566631 1556750 1546344 1534099 1519546 1503952
63278 1503952 1488379 1471712 1451595 1426863 1397886 1364809 1327052 1285162 1241927 1200449 1161580
63267 1161580 1124166 1087394 1051670 1017198 983159 949118 916370 886850 861043 837919 816742
63256 816742 797911 781861 768163 756201 745861 736867 728239 719484 711918 707583 706749 707409 707515 706835
63242 706835 706284 706283 706513 706770 707200 707693 707571 706053 702849 698350 693317 688345 683453 678210 672217 665408
63226 665408 658169 651479 646735 644820 645292 646918 648999 651602 654552 656998 658312 658727 658782 658811 659396 661568
63210 661568 665849 671545 677461 682809 686975 689443 691000 694260 701372 711181 720009 725605 729265 733728
63196 733728 740151 747944 756630 766567 777950 790120 802201 813907 825488 837298 849706 863205
63184 863205 878326 895494 915123 937590 962669 989207 1016060 1043648 1074024 1108921 1148072
63173 1148072 1189927 1233509 1278889 1326254 1375555 1426953 1480581 1535664 1590774 1645162 1698938
63162 1698938 1751805 1802834 1852116 1901506 1952813 2005918 2059342 2111836 2162480 2209881 2252480
63151 2252480 2289477 2320750 2346057 2364872 2376449 2379426 2371849 2352445 2321570 2280517 2230781 2174668
63139 2174668 2115444 2055468 1994783 1932936 1871555 1813575 1760278 1710907 1665045 1623613 1587349
63128 1587349 1556132 1530400 1511647 1500666 1496381 1497048 1501561 1509031 1518321 1528939 1541564 1556910
63116 1556910 1574749 1594540 1616105 1638903 1661370 1681970 1700536 1718072 1735680 1754059 1773272
63105 1773272 1792213 1808736 1820942 1828171 1830587 1828508 1822466 1813021 1799797 1781316 1756507 1725888
63093 1725888 1690759 1652030 1610748 1569075 1529500 1493056 1458994 1426107 1393838 1362512 1333301
63082 1333301 1307837 1287053 1270247 1255676 1241975 1228700 1215916 1203931 1193225 1183925 1175448 1167258
63070 1167258 1159868 1154352 1150887 1148512 1146588 1145801 1147263 1150950 1155572 1159904 1163854 1167985 1172252 1175710
63056 1175710 1177697 1178871 1180501 1182896 1185269 1187206 1189471 1192918 1197281 1201639 1205659 1209674 1213809 1217732
63042 1217732 1221322 1225136 1230014 1236294 1243274 1249455 1253750 1256733 1260250 1265464 1271722 1277797 1283695 1290370
63028 1290370 1297937 1305212 1311377 1317439 1325494 1336690 1350159 1363864 1376356 1387799 1399596 1413228
63016 1413228 1429445 1448179 1468796 1490447 1512590 1535370 1559275 1584480 1610901 1638888 1669328
63005 1669328 1702899 1739697 1779711 1823041 1869362 1917846 1968054 2020334 2074924 2131474 2190278
62994 2190278 2253386 2323221 2400120 2482147 2567438 2655859 2748142 2844352 2943900 3046404 3151618
62983 3151618 3258560 3365610 3471914 3578232 3685703 3793859 3900585 4004351 4105912
62974 4105912 4207200 4308923 4409971 4508830 4604549 4696087 4781610 4858729 4924840 4976922 5011773
62963 5011773 5027071 5021886 4995983 4949317 4882643 4798052 4698402 4586622 4465775 4339020 4208968
62952 4208968 4077671 3947753 3822762 3705704 3597825 3499462 3411367 3334309 3268083 3211921
62942 3211921 3165485 3128451 3099621 3077661 3062573 3055331 3056106 3063725 3076695 3093653 3112896 3132712
62930 3132712 3152557 3173103 3194898 3217595 3240452 3262669 3283153 3300848 3315357 3326300 3331990
62919 3331990 3329884 3318738 3299229 3271915 3235612 3188546 3130414 3062599 2987012 2905460 2819568
62908 2819568 2730409 2638432 2544426 2450370 2358753 2271170 2188074 2109680 2036483 1968808 1906341
62897 1906341 1848283 1793824 1742482 1694233 1649396 1608297 1570931 1536782 1504874 1474290 1444947
62886 1444947 1417642 1392835 1369496 1345898 1321641 1298167 1276881 1257410 1238326 1219194 1201250
62875 1201250 1186056 1173837 1163045 1151333 1137157 1120912 1104541 1089787 1076739 1064040 1050410
62864 1050410 1035951 1022162 1010688 1001780 993949 985490 976458 968655 963385 959716 955469 949622 943116
62851 943116 937326 932387 927337 921509 915342 909885 905814 903084 901281 900041 899109 898298 897629 897397 897918
62836 897918 899177 900818 902387 903540 904175 904498 904766 904832 904186 902755 901397 901202 902270 903473 903369 901228
62820 901228 897482 893515 890757 889441 888365 886295 883384 880656 878246 874914 869478 862186 854564 848285
62806 848285 844076 841108 837450 831812 824981 819022 815023 812325 809907 807535 805175 802269 798292 793483
62792 793483 788489 783763 779688 776622 774285 771732 768495 765108 762014 758827 755491 753283 753335 754720 755414
62777 755414 754952 754674 755365 756249 756795 757911 760269 762595 763145 762432 763003 766319 770940 774416 776235 778117
62761 778117 781632 786371 790740 794045 797206 801558 807576 814910 823050 831469 839495 846718 853572 861065
62747 861065 869904 880216 892072 905680 920873 936823 952662 968235 984021 1000489 1017789 1036073
62735 1036073 1055968 1078649 1105256 1136093 1170510 1207879 1248615 1293906 1344482 1400077 1460174
62724 1460174 1524781 1594287 1669068 1749621 1836700 1930883 2032294 2141156 2258260 2384271
62714 2384271 2518851 2661129 2810920 2968605 3133660 3304042 3477222 3650991 3822712
62705 3822712 3988489 4143858 4284989 4408640 4511416 4590009 4642080 4666149 4660906 4625815
62695 4625815 4562685 4475563 4368322 4242919 4100628 3944452 3779535 3611343 3443851 3279043
62685 3279043 3117385 2958955 2804778 2657141 2518146 2388153 2266302 2152364 2047179
62676 2047179 1951074 1862806 1780658 1704000 1633182 1568318 1508905 1454410 1404480 1358496 1315545
62665 1315545 1275196 1238050 1205216 1177263 1153637 1132918 1113600 1094960 1077550 1062840 1052106
62654 1052106 1045469 1042061 1041062 1042327 1045905 1051375 1058205 1066654 1077695 1091841 1108564 1127248 1148303
62641 1148303 1172871 1201786 1235313 1273622 1316851 1364830 1417375 1474804 1537466 1604778 1675573
62630 1675573 1749640 1828055 1911376 1998022 2084914 2169286 2249383 2323920 2391590 2450870 2499652
62619 2499652 2535264 2555605 2560427 2551001 2528503 2493222 2445339 2385824 2316265 2238292 2153645 2064714
62607 2064714 1974555 1886110 1801191 1720053 1642050 1566789 1494581 1425787 1360296 1298148 1240276
62596 1240276 1187815 1140699 1097687 1057873 1021364 988192 957507 928423 901025 875735 852180
62585 852180 829524 807563 786656 766753 747448 728995 712377 698162 685916 674791 664000
62574 664000 652791 641061 630223 622418 618270 616264 614765 613516 612410 610167 605771 600532 597035
62561 597035 596211 596856 597886 599455 601657 603764 605510 607949 612216 618290 625650 634300 644379 655553
62547 655553 667697 681623 698284 717520 738313 760058 783154 808629 837539 870261 905968
62536 905968 943392 982592 1025376 1073457 1126857 1184772 1247237 1314993 1388232 1466417 1548983
62525 1548983 1635345 1724474 1815078 1905570 1993159 2073814 2144374 2204127 2253092 2289445 2310344
62514 2310344 2314907 2304590 2280672 2243352 2193663 2134262 2067473 1994177 1915674 1835266 1756688
62503 1756688 1681758 1610362 1541701 1474702 1408475 1343863 1283837 1230953 1184727 1142603 1102932
62492 1102932 1065778 1031261 998807 968224 940186 915074 892169 870521 850023 831211 814360
62481 814360 799023 784223 768997 753097 737281 722738 710294 700382 693448 689688 688297 687521 685865
62468 685865 683218 680773 680001 681607 685110 689361 693660 698511 705226 714779 727122 741455 757087 774209
62454 774209 793967 817552 844888 874357 904257 934628 967394 1004454 1045701 1089055 1132483
62443 1132483 1175825 1220337 1266409 1312090 1354133 1390192 1419654 1442696 1459291 1469170 1472092 1467950
62431 1467950 1456998 1439928 1417215 1388630 1354316 1316321 1277821 1240345 1202865 1164359 1126159
62420 1126159 1090646 1058435 1028291 999512 973006 949910 930221 913044 897225 881564 865378
62409 865378 849495 836012 826386 819989 814905 809760 804331 798789 793225 788126 784657 783784 785148 787312
62395 787312 789307 791507 794735 799001 803781 809156 815749 823434 831078 837917 844424 851426 859080 867309
62381 867309 876414 886411 896208 904344 910249 914058 915529 914029 909459 902277 892512 879574 863306 844796
62367 844796 825939 808384 792731 778300 763835 748889 734322 721114 709109 697660 687091
62356 687091 678564 672520 668173 664578 661379 658480 655977 654681 655761 659371 664324 669517 674961 680979
62342 680979 687279 693548 700331 708325 717173 725867 734258 743305 753712 765037 776385 787357 797931
62329 797931 807866 816804 824782 832119 838731 843995 847441 849282 850166 850779 851872 854076 857129 859735 861123
62314 861123 862632 866844 875019 886333 899838 915956 935312 957216 980523 1005472 1033622 1066322
62302 1066322 1104295 1148205 1198267 1253290 1311483 1372570 1438079 1509154 1584975 1663689 1743914
62291 1743914 1824724 1904717 1981671 2052814 2115312 2167129 2207737 2237539 2256520 2264156 2260699 2247460
62279 2247460 2225337 2193998 2153240 2104389 2049629 1990582 1928305 1864080 1799285 1734849 1671653
62268 1671653 1611103 1554394 1501508 1451782 1405192 1362167 1322342 1284585 1248183 1213000 1178567
62257 1178567 1144432 1111768 1083188 1059968 1040416 1022031 1004554 989676 978299 969589 962716 957984
62245 957984 955591 954407 952931 950852 948861 947347 946124 945133 944500 943949 943027 942030 941831 942478 942722 941440
62229 941440 939011 936822 935936 936812 939809 945090 952050 959444 966257 972266 977991 984461 992662 1002620 1013202
62214 1013202 1023400 1033713 1045576 1059553 1074961 1091418 1109762 1130805 1153833 1177280 1200870
62203 1200870 1226475 1256660 1292623 1333678 1378489 1426561 1478428 1534699 1595353 1660146 1729166
62192 1729166 1802339 1878365 1954667 2028462 2097529 2159899 2213432 2256205 2287197 2306355 2314061
62181 2314061 2310694 2296633 2272541 2239545 2198918 2151429 2097163 2036340 1970304 1901547 1832806
62170 1832806 1766327 1703661 1645551 1591937 1542492 1497277 1456600 1420336 1387949 1359150 1334006
62159 1334006 1312258 1293192 1276444 1262348 1250999 1241490 1232763 1224974 1219339 1216528 1215617 1214727 1212526
62146 1212526 1209176 1206250 1205877 1209540 1217116 1226834 1236380 1244367 1250896 1256780 1262564 1268613 1275796 1285203
62132 1285203 1296923 1309877 1323362 1338080 1354851 1372997 1391186 1409616 1429961 1452927 1477138
62121 1477138 1501016 1524601 1548704 1573209 1597444 1621719 1647174 1674134 1701824 1730078 1760364
62110 1760364 1794442 1832618 1874200 1919337 1969340 2024747 2083844 2143935 2203949 2265018 2328324
62099 2328324 2392987 2456339 2515608 2568794 2614438 2651510 2679673 2699277 2711066 2716106 2715609 2710183
62087 2710183 2699349 2682339 2659351 2631661 2600855 2568558 2536579 2506353 2478179 2451725 2427305
62076 2427305 2405900 2387956 2373080 2361019 2351977 2345748 2341464 2338564 2337189 2337357 2338665 2341162 2345536
62063 2345536 2351964 2359774 2368835 2380222 2394676 2411378 2429125 2447896 2468305 2490448 2514500 2541614
62051 2541614 2572749 2607003 2642523 2678773 2716477 2755479 2794395 2832767 2872144 2914337 2959607
62040 2959607 3007209 3056837 3108802 3163415 3220968 3281940 3346441 3413362 3480278 3544393 3603961
62029 3603961 3659475 3713456 3768443 3824938 3881735 3938123 3994877 4052829 4111316 4168726 4224070
62018 4224070 4277551 4330082 4382882 4437140 4493350 4551104 4609966 4670358 4732995 4797751 4863931
62007 4863931 4931702 5002463 5077422 5156385 5238529 5323972 5413771 5508043 5604414 5698776 5787667
61996 5787667 5869805 5945330 6014002 6074742 6127018 6172005 6211672 6246792 6276466 6299691 6316768
61985 6316768 6328788 6336277 6338973 6336687 6329719 6318663 6304691 6290119 6277604 6268024 6259650 6250101 6238792
61972 6238792 6226854 6215190 6203712 6192374 6181680 6171589 6160902 6148573 6135243 6122599 6111321
61961 6111321 6100345 6088269 6074896 6061154 6047961 6035690 6024533 6014803 6006524 5998963 5990916 5981567
61949 5981567 5971026 5960233 5950542 5943041 5937630 5932744 5926723 5919773 5913838 5910063 5907062 5902495 5895798
61936 5895798 5888360 5881279 5874144 5866142 5857281 5848010 5838246 5827254 5814111 5798130 5779209 5757777 5733949
61923 5733949 5706804 5675262 5639783 5602457 5565195 5528351 5491151 5452625 5411948 5368846 5324269
61912 5324269 5280010 5237204 5195640 5154600 5113575 5071983 5029357 4986377 4944656 4904736 4865241
61901 4865241 4824886 4784382 4745297 4707822 4670997 4634516 4598873 4563924 4528709 4492892 4457313
61890 4457313 4422955 4390326 4359954 4332452 4307641 4284334 4261566 4239600 4219411 4201512 4185539
61879 4185539 4170723 4156566 4143242 4131572 4122626 4117360 4116457 4119971 4126923 4135802 4146012 4158547 4174742
61866 4174742 4194691 4217438 4242602 4271224 4305055 4345344 4392308 4445576 4505288 4572811 4650035
61855 4650035 4737973 4836748 4947105 5070964 5209954 5364556 5535710 5726441 5940596 6180495
61845 6180495 6447102 6742040 7068004 7427289 7821477 8252820 8724558 9239237 9797557
61836 9797557 10399231 11043865 11729802 12451793 13199255 13955493 14697656 15397352 16021696
61827 16021696 16535147 16903659 17101417 17116723 16952856 16624445 16153736 15568696 14900723
61818 14900723 14180588 13434818 12684631 11946507 11232753 10552093 9910497 9311413 8755433
61809 8755433 8240896 7765809 7329112 6929877 6565790 6232971 5927162 5645098 5385034
61800 5385034 5146137 4927231 4726300 4541447 4371781 4216656 4074537 3943715 3823764
61791 3823764 3714923 3616094 3525002 3440623 3363790 3294792 3232013 3173952 3121027 3073842 3030818
61780 3030818 2989362 2948883 2911059 2877300 2847439 2820752 2796666 2774070 2751412 2728390 2706792
61769 2706792 2688808 2674852 2663650 2654215 2647041 2643201 2642746 2644427 2646986 2650198 2654325 2659010 2663506
61756 2663506 2668040 2674026 2682585 2693482 2706077 2720723 2738538 2760202 2785619 2814520 2846830 2882792
61744 2882792 2923406 2970410 3024945 3086220 3152304 3222383 3297656 3379890 3469788 3567080 3671764
61733 3671764 3784831 3907962 4042628 4189226 4346987 4515199 4694868 4888987 5100920
61724 5100920 5332654 5584726 5857566 6152655 6472650 6820881 7200825 7615833 8069253
61715 8069253 8564918 9107407 9701545 10351621 11061317 11834352 12674691 13585801 14569939
61706 14569939 15628374 16761617 17968263 19242763 20573528 21941392 23317293 24659905
61698 24659905 25916001 27024951 27925527 28562920 28895953 28904221 28592068 27986498 27130401
61689 27130401 26075344 24875979 23585187 22249743 20908018 19590090 18318542 17108808
61681 17108808 15969950 14906530 13920343 13010914 12175445 11409397 10707534 10064463 9474538
61672 9474538 8931906 8431268 7968876 7542654 7150945 6791121 6459777 6154113 5872246
61663 5872246 5611907 5369966 5144151 4934327 4740768 4561534 4392925 4232446 4080129
61654 4080129 3936922 3803062 3678226 3562017 3453682 3352155 3256763 3167201 3082735 3002395
61644 3002395 2926015 2853995 2785890 2720624 2658514 2601450 2550064 2501954 2453944 2405282 2357548
61633 2357548 2312229 2269624 2229430 2190918 2152705 2113597 2073869 2034988 1998150 1963691 1931696
61622 1931696 1902312 1875421 1850605 1827441 1805382 1783634 1761686 1739861 1718918 1699364 1681597
61611 1681597 1666237 1653517 1642562 1631991 1621148 1610068 1598324 1584753 1568653 1550825 1533060
61600 1533060 1516652 1501511 1486750 1472161 1458805 1447753 1438540 1429788 1421363 1414761 1410865 1408482
61588 1408482 1406046 1403861 1403339 1404502 1405650 1405515 1404565 1403877 1403615 1403180 1402408 1402116 1403410 1406381 1409556 1411042
61572 1411042 1410461 1409390 1409715 1412040 1415818 1420115 1423686 1425266 1424802 1423806 1423496 1423119 1421111 1417361 1413127
61557 1413127 1409075 1404809 1400221 1395820 1391504 1386333 1380063 1373848 1368878 1364998 1361080 1356024 1349070 1340032
61543 1340032 1329853 1320247 1312096 1304558 1296298 1287301 1278979 1272693 1268556 1265639 1263055 1260779 1259469 1259573
61529 1259573 1260927 1263436 1267731 1274469 1283147 1292282 1300920 1309453 1318865 1329750 1342271 1356613 1373050
61516 1373050 1391714 1412453 1434818 1458277 1482750 1508982 1538178 1571154 1607829 1647302 1688341
61505 1688341 1730232 1773420 1818907 1866694 1915249 1962824 2008614 2052123 2092379 2128994 2163498
61494 2163498 2198138 2233267 2266940 2297095 2323122 2345350 2364239 2380465 2394755 2407136 2416890
61483 2416890 2423408 2426374 2425242 2419641 2410446 2399384 2387388 2374473 2361383 2349746 2339928 2330238 2319395
61470 2319395 2308564 2299778 2293421 2288820 2286566 2288532 2295901 2308634 2326815 2351018 2381170 2416483
61458 2416483 2457095 2504664 2560609 2624510 2695078 2772337 2858175 2954806 3063196 3183062 3314183
61447 3314183 3457490 3614796 3787550 3976127 4180423 4400662 4637077 4889049 5155173
61438 5155173 5434028 5723883 6020964 6318228 6606181 6874828 7114812 7317459 7474990
61429 7474990 7581581 7634580 7634762 7585717 7493153 7364489 7208150 7032178 6843013 6645621
61419 6645621 6444675 6245182 6051842 5868245 5696892 5539484 5396730 5268354 5154157
61410 5154157 5055049 4972325 4905851 4853753 4814204 4786884 4772203 4769864 4779027 4799499 4831653 4875068
61398 4875068 4928099 4988968 5056478 5129314 5205626 5284165 5365222 5449374 5535394 5620380 5702024
61387 5702024 5780013 5855094 5927594 5997240 6063620 6126241 6184626 6238883 6289764 6337525 6381050
61376 6381050 6418835 6450686 6477822 6501410 6521794 6539302 6554890 6569181 6581194 6588892 6591253 6589303
61364 6589303 6584772 6578185 6568883 6556607 6542011 6525308 6505485 6481829 6455726 6429809 6405417 6381935
61352 6381935 6358618 6335874 6314338 6293740 6273382 6252993 6232315 6210384 6185915 6158208 6127325
61341 6127325 6093871 6059042 6024331 5990614 5958020 5927139 5899818 5878201 5863758 5858114 5864206 5885439
61329 5885439 5923799 5979635 6053147 6145204 6256760 6388389 6540647 6714333 6910118 7128034
61319 7128034 7367108 7625291 7900166 8190037 8493610 8807683 9125362 9437086 9732940
61310 9732940 10003407 10238894 10430426 10571489 10658877 10692094 10672869 10604997 10493325 10342222
61300 10342222 10155299 9936504 9690851 9424028 9141724 8849132 8550570 8249742 7950693
61291 7950693 7657845 7374396 7101453 6839754 6591559 6359492 6144010 5943607 5757411
61282 5757411 5586092 5430193 5289142 5162353 5050090 4952893 4871082 4804885 4753884 4716266
61272 4716266 4689844 4673964 4669224 4675327 4690739 4714612 4747239 4788114 4835152 4886619 4942390 5002455
61260 5002455 5065416 5129220 5192159 5252439 5308151 5358566 5404268 5445297 5480452 5509193 5532573
61249 5532573 5551254 5564334 5571584 5575188 5577206 5576337 5569248 5554453 5533016 5505954 5472974 5433767
61237 5433767 5388831 5338811 5284285 5226353 5166349 5104932 5042341 4979307 4916754 4854966 4794167
61226 4794167 4735626 4680833 4629649 4580455 4532246 4485728 4442510 4404016 4370759 4341467 4313175
61215 4313175 4283504 4252762 4222706 4193570 4163729 4132155 4099555 4067022 4035292 4005707 3980253
61204 3980253 3959913 3944421 3934352 3931937 3938661 3953195 3973055 3997650 4028552 4067359 4114505 4169988
61192 4169988 4234128 4307428 4390274 4482873 4585131 4696566 4816404 4943392 5075164 5208049
61182 5208049 5337645 5459206 5567254 5655510 5717865 5749361 5746320 5706573 5630623 5522339 5387708
61171 5387708 5232798 5063182 4884640 4703063 4523156 4347761 4178672 4017626 3866194
61162 3866194 3725181 3594593 3473998 3362675 3259778 3164964 3078873 3002447 2935500 2876215
61152 2876215 2822273 2772406 2726715 2685824 2650044 2619262 2593244 2571900 2555385 2543888 2537116
61141 2537116 2534259 2534901 2539848 2550343 2566150 2584949 2604053 2622408 2640500 2658604 2675721 2690208
61129 2690208 2700927 2707538 2709925 2707792 2701111 2690906 2679058 2666764 2653303 2636904 2616902 2594440
61117 2594440 2570951 2546673 2521153 2494616 2468237 2443225 2419963 2397636 2374380 2348410 2319603
61106 2319603 2289613 2259814 2229596 2197387 2162887 2127291 2091482 2055166 2018016 1980699 1944240
61095 1944240 1909014 1874942 1842264 1811562 1783153 1756807 1731967 1707936 1683901 1659071 1632977
61084 1632977 1605630 1577241 1547704 1516507 1483524 1449914 1417836 1389052 1364142 1343180 1326389
61073 1326389 1313514 1303136 1293609 1284568 1276726 1270385 1265193 1261426 1260244 1262053 1265644 1269876 1275387
61060 1275387 1283464 1293618 1303727 1312767 1322081 1333359 1346382 1359678 1372635 1385885 1399916 1414550
61048 1414550 1429744 1445637 1461444 1475458 1486903 1496995 1507427 1518439 1529149 1539044 1547963 1555052
61036 1555052 1558993 1559412 1557234 1553712 1550001 1547413 1546772 1547208 1546603 1543663 1538820 1532968 1526357 1519130 1511874
61021 1511874 1505037 1498588 1492813 1488624 1486415 1485299 1484016 1481980 1478951 1474691 1469734 1465728 1463893 1463451
61007 1463451 1462313 1459005 1453426 1446448 1439594 1434462 1431303 1428416 1423938 1418077 1412692 1408827 1405780 1402627
60993 1402627 1399650 1397723 1397051 1397197 1398044 1400146 1404066 1409750 1416764 1424809 1433593 1442397 1450649 1459298 1470676
60978 1470676 1486057 1503931 1521770 1538988 1556863 1575989 1595610 1615558 1636978 1660601 1685954
60967 1685954 1713000 1742896 1776188 1811757 1848695 1887879 1930480 1976207 2024329 2075338 2130165
60956 2130165 2188642 2250140 2314996 2384110 2457832 2536348 2620458 2710983 2808314 2913397 3027914
60945 3027914 3152355 3285193 3425243 3573552 3731689 3899982 4079487 4274296 4489631
60936 4489631 4728663 4993225 5286402 5611996 5972339 6369206 6806590 7291136 7831551
60927 7831551 8439951 9132021 9922583 10821890 11838535 12983732 14270306 15712796 17335913
60918 17335913 19180488 21294456 23723197 26517647 29730580 33345265 37157216 40739326
60910 40739326 43594799 45418025 46246620 46383229 46194595 45982434 45973311 46306342 46936942
60901 46936942 47555924 47679889 46902174 45108112 42486287 39368011 36059798 32776171
60893 32776171 29650444 26757746 24128834 21766182 19661236 17800916 16166179 14734497
60885 14734497 13485364 12399730 11455232 10626969 9893674 9240170 8654026 8123257 7637939
60876 7637939 7191584 6779970 6399820 6048422 5723012 5420667 5139802 4880717 4643091
60867 4643091 4423842 4219137 4027310 3847637 3677315 3512416 3351644 3196767 3049468
60858 3049468 2909944 2778404 2655306 2539643 2429180 2323184 2223154 2130213 2043371 1961095
60848 1961095 1883123 1809863 1741211 1676886 1617178 1562570 1512867 1467001 1423389 1380701 1338866
60837 1338866 1299248 1263324 1231431 1203075 1177681 1154320 1131750 1110019 1091215 1077132 1066807
60826 1066807 1057856 1049572 1042911 1037958 1033633 1029858 1027877 1028075 1029343 1030957 1033093 1035015 1034872 1032340
60812 1032340 1029633 1028586 1028187 1026295 1022406 1017231 1010750 1002752 994848 989910 988972 989916 989800 987670 984465
60797 984465 980885 976561 971578 967855 967822 971683 976987 981395 985059 989663 996067 1004059 1013854 1026333
60783 1026333 1041654 1058683 1076050 1093025 1109335 1124924 1139916 1154133 1166710 1176983 1185602
60772 1185602 1193889 1202212 1209984 1217107 1224156 1230952 1236177 1238901 1239699 1239951 1240722 1242512 1245228 1248155 1250627
60757 1250627 1252880 1255547 1258357 1260273 1260942 1261026 1261080 1261128 1261292 1261487 1260371 1256206 1249383 1242594 1237608 1233028
60741 1233028 1226127 1215777 1202639 1187626 1171624 1156031 1142085 1129682 1117739 1105660 1093802
60730 1093802 1082796 1073103 1064935 1057969 1051395 1044854 1039070 1034982 1032569 1031203 1030881 1032377 1036185 1041944
60716 1041944 1048897 1056442 1064104 1071421 1078245 1085277 1094131 1106388 1122119 1139558 1156843 1173872 1191777
60703 1191777 1210785 1229706 1247692 1265231 1282805 1299642 1314667 1327873 1339866 1350772 1360558
60692 1360558 1369813 1379068 1387713 1394754 1400395 1405661 1410415 1413026 1412546 1410383 1409086 1409754 1411098 1410792 1407436
60677 1407436 1401303 1393572 1385092 1375941 1365988 1355465 1344843 1334411 1324121 1313553 1301957 1288806
60665 1288806 1274571 1260450 1246952 1233325 1219037 1205432 1194957 1188767 1185750 1183997 1182603 1181858
60653 1181858 1182225 1183552 1185118 1186302 1187307 1189101 1192380 1196698 1200969 1204719 1208347 1212177 1215873 1218927
60639 1218927 1221183 1222519 1222580 1221261 1219139 1216863 1214268 1210644 1205882 1200844 1196426 1192618 1188695 1184020
60625 1184020 1178387 1171793 1164236 1155724 1146214 1135559 1123723 1111072 1098258 1085729 1073449 1061077
60613 1061077 1048290 1035003 1021484 1008194 995289 982380 969242 956784 946747 940102 936100 933314
60601 933314 931262 930482 931257 932989 935017 937555 941394 946796 952975 958752 963685 968418 973813 979836 985626
60586 985626 990773 996201 1003357 1012516 1022073 1029646 1033958 1035762 1036883 1038259 1039155 1038638 1037469 1037759 1040696
60571 1040696 1045409 1050392 1055187 1060194 1065713 1072093 1080253 1090934 1103565 1116654 1129213 1141173 1152730
60558 1152730 1164310 1177085 1192384 1210222 1229144 1247836 1266227 1284674 1302780 1319576 1334513
60547 1334513 1347756 1359640 1370188 1379068 1385825 1390196 1392261 1392164 1389672 1384165 1375150 1362786 1348119
60534 1348119 1332888 1318796 1306432 1294877 1282586 1268794 1254150 1240328 1229123 1221478 1217017 1214690
60522 1214690 1213981 1215007 1217295 1219327 1220014 1219980 1220594 1222171 1224012 1225819 1227937 1230280 1232058 1232885 1233436 1234806
60506 1234806 1237575 1241474 1245627 1249377 1253356 1259276 1268055 1278640 1289411 1300102 1311284 1322680 1333531
60493 1333531 1344265 1356029 1368534 1380217 1391011 1403183 1418674 1437087 1457275 1479418 1504180
60482 1504180 1530944 1558568 1587535 1619875 1656875 1697954 1742016 1789084 1839977 1894532 1950470
60471 1950470 2004164 2052267 2092114 2120655 2134345 2131482 2114233 2087047 2053118 2013799 1971370
60460 1971370 1930286 1894561 1865045 1840345 1819558 1803145 1791920 1786265 1785989 1790217 1797856 1808734
60448 1808734 1823767 1843476 1867036 1893482 1923172 1957298 1996640 2041694 2093463 2153022 2220698
60437 2220698 2296733 2382648 2480955 2593362 2719900 2859830 3012821 3179047 3358561 3550741
60427 3550741 3754293 3968024 4191925 4427626 4678012 4946739 5237829 5554348 5895893
60418 5895893 6256145 6621668 6972281 7283330 7529866 7690916 7751692 7704519 7550716 7302332
60408 7302332 6980088 6607623 6206896 5797142 5394362 5009357 4647293 4310750 4002460
60399 4002460 3724169 3474559 3250520 3049826 2870855 2710540 2564922 2431683 2310277
60390 2310277 2199654 2097840 2004073 1919333 1843989 1776431 1714838 1658891 1608664 1562879 1519486
60379 1519486 1477500 1437385 1399910 1365278 1333118 1302791 1273837 1246413 1221088 1198046 1176798
60368 1176798 1156840 1138134 1120686 1104122 1088170 1073260 1060065 1048433 1037266 1025728 1014313
60357 1014313 1004293 996112 988794 981376 974566 970338 969911 972753 977506 983075 988588 993255 996908 1000086
60343 1000086 1003103 1005651 1007744 1010225 1013580 1017089 1020131 1023648 1029107 1036336 1043550 1049480 1054499 1059670
60329 1059670 1065596 1072229 1079015 1085188 1090542 1095859 1101876 1107979 1112662 1115185 1116048 1115954 1115196 1114088 1113228
60314 1113228 1113159 1114269 1116848 1120584 1124129 1126031 1126149 1125563 1125275 1125684 1127087 1129614 1132660 1135336 1137614
60299 1137614 1140233 1143492 1147075 1151059 1155973 1161548 1166571 1170475 1174264 1179339 1186136 1194369 1203899 1214784
60285 1214784 1226951 1240216 1254185 1268027 1280963 1293185 1305513 1317882 1329073 1338357 1346379 1353652
60273 1353652 1359114 1361385 1361022 1360349 1361086 1363099 1365612 1368676 1372866 1378027 1382996 1386652 1388857 1390205 1391000
60258 1391000 1390762 1388754 1384652 1378511 1370435 1360772 1350535 1341095 1333269 1326938 1321579 1316900 1312816 1309168
60244 1309168 1305701 1302311 1299173 1296509 1294136 1291384 1287711 1283415 1279349 1275924 1272871 1270052 1267897 1266833
60230 1266833 1266950 1268412 1271269 1274354 1275545 1274124 1272033 1271570 1272598 1273416 1273709 1274914 1277825 1281595 1285388
60215 1285388 1289509 1294531 1300701 1308612 1319074 1331623 1344410 1356397 1368747 1383278 1400383 1419081
60203 1419081 1438274 1457260 1475836 1494684 1515012 1537250 1560772 1585459 1612642 1643736 1678701
60192 1678701 1716682 1757533 1801814 1849891 1901893 1958137 2018803 2083735 2153362 2229328 2313233
60181 2313233 2405146 2504163 2609992 2723072 2843533 2971150 3106034 3248219 3396584 3549216
60171 3549216 3704848 3862868 4021716 4178289 4329241 4472012 4604364 4723979 4829256
60162 4829256 4919862 4995787 5056151 5099605 5125745 5135791 5132105 5117401 5094183 5064487 5030153
60151 5030153 4993531 4957797 4926318 4901757 4885825 4879628 4883967 4899601 4927659 4969739 5027111 5099680
60139 5099680 5186107 5285212 5397063 5522385 5660850 5809988 5965616 6123211 6279094 6430582
60129 6430582 6575033 6708710 6826908 6925626 7003073 7059137 7093606 7105639 7095106 7063516 7012896
60118 7012896 6944370 6858839 6759007 6649867 6536935 6424464 6315522 6213081 6120290 6039759
60108 6039759 5972963 5920500 5882816 5860703 5855256 5867560 5898389 5947798 6014516 6095621 6187124
60097 6187124 6284921 6384998 6482994 6574511 6656391 6727269 6786529 6833377 6867417 6889523 6901392
60086 6901392 6904734 6901707 6895715 6890601 6889161 6893461 6906653 6933343 6977822 7042755 7129875 7241006
60074 7241006 7377829 7541398 7732659 7952992 8203588 8484620 8795701 9137037 9509446
60065 9509446 9913037 10346094 10805248 11286427 11785403 12297540 12817195 13337345 13849570
60056 13849570 14344347 14811938 15243651 15632313 15971148 16252574 16469147 16615874 16690610
60047 16690610 16691962 16618255 16469626 16250196 15967225 15629299 15246796 14832927 14401760 13964834
60037 13964834 13531041 13109439 12709955 12340701 12006323 11709605 11452994 11237638 11062528
60028 11062528 10926066 10827588 10766222 10738984 10741080 10767393 10812729 10871308 10937227 11005155 11069745
60017 11069745 11124878 11164619 11185139 11185280 11165457 11126384 11068354 10991032 10894093 10778373 10645959
60006 10645959 10498654 10336837 10160389 9970390 9769466 9560959 9348276 9134549 8922270
59997 8922270 8713541 8511203 8319232 8141418 7979952 7835837 7710247 7604909 7521429 7460766
59987 7460766 7422978 7407121 7412154 7438682 7489078 7564730 7663465 7780649 7912578 8057584 8213763
59976 8213763 8376816 8540664 8699449 8848394 8983218 9099526 9192940 9259707 9297138 9303629
59966 9303629 9278611 9222858 9138644 9028851 8895706 8741157 8568880 8385146 8196898 8009359
59956 8009359 7826069 7650528 7486662 7337778 7206080 7093250 7000681 6929131 6879104 6851856
59946 6851856 6849211 6871878 6918546 6987237 7077248 7189317 7324176 7481526 7660294 7859002
59936 7859002 8075118 8304078 8539526 8774794 9003888 9220872 9419082 9592176 9736207
59927 9736207 9849925 9932553 9981807 9994522 9968869 9905624 9807842 9680023 9527429 9355661
59917 9355661 9170707 8979282 8788462 8604382 8431465 8273236 8133416 8015601 7922037 7853387
59907 7853387 7809649 7790719 7796036 7824418 7874787 7946810 8040395 8154373 8285797 8430672 8585383
59896 8585383 8747328 8914211 9083109 9250538 9413209 9568406 9713998 9848759 9972698
59887 9972698 10086542 10190972 10286968 10376794 10463807 10551214 10641938 10740049 10851338 10981729
59877 10981729 11135544 11315802 11525536 11768027 12045919 12360570 12712028 13099098 13519349
59868 13519349 13968858 14441299 14926971 15413277 15886508 16332711 16736687 17081243 17348833
59859 17348833 17524709 17599256 17568977 17436659 17210654 16903030 16527627 16099211 15633450 15146454
59849 15146454 14653436 14167039 13696504 13248587 12829585 12446012 12102697 11800805 11539021
59840 11539021 11316709 11135036 10995171 10896800 10838620 10819009 10835816 10886739 10970180 11084302
59830 11084302 11224703 11384290 11555733 11732267 11905434 12064146 12197504 12297074 12355188 12363142
59820 12363142 12313624 12204335 12037545 11817138 11548070 11237787 10895490 10529624 10147544
59811 10147544 9757157 9366862 8983504 8611795 8255683 7918651 7602458 7306970 7031614
59802 7031614 6776167 6540436 6324429 6128713 5953333 5796596 5656350 5532325 5425837
59793 5425837 5337324 5265635 5209442 5167340 5136282 5111790 5090379 5070476 5050856 5030042 5007908
59782 5007908 4986025 4965293 4944479 4922065 4898255 4874093 4849570 4823672 4795552 4764670 4730332
59771 4730332 4691810 4648505 4599650 4544907 4486047 4427257 4372779 4324481 4282012 4244338 4210300
59760 4210300 4178535 4148213 4119955 4095484 4076519 4064327 4059813 4063259 4073971 4090576 4111581 4135613
59748 4135613 4161714 4190107 4222528 4261249 4307570 4361221 4421082 4486399 4557328 4634146 4715695
59737 4715695 4798770 4879377 4954399 5021961 5081022 5131700 5175720 5215345 5251664 5284744 5315536
59726 5315536 5346718 5381463 5422174 5470571 5528117 5596048 5675814 5769795 5880833 6010721 6159888
59715 6159888 6328855 6519228 6732987 6971688 7236803 7529971 7852291 8204054 8585698
59706 8585698 8998022 9439996 9905662 10382587 10852021 11289580 11666735 11954641 12130547
59697 12130547 12184359 12121566 11960100 11723115 11433161 11111153 10777410 10450152 10142029 9859474
59687 9859474 9606192 9386293 9203606 9059284 8951468 8877111 8833631 8819328 8833130 8874252
59677 8874252 8942104 9036653 9158643 9308931 9487610 9694280 9928981 10192274 10484811 10807950
59667 10807950 11164703 11558835 11992683 12466701 12981316 13538339 14140530 14790877 15492424
59658 15492424 16247413 17056065 17917080 18829282 19791160 20798105 21841218 22909132 23989523
59649 23989523 25068642 26131968 27167638 28168781 29131868 30054686 30937957 31787804 32613961
59640 32613961 33424867 34224995 35015542 35794921 36557609 37293567 37989359 38629360 39196563
59631 39196563 39674546 40050787 40318942 40478519 40533405 40491351 40364660 40170537 39929734 39663739
59621 39663739 39392520 39134326 38906485 38725061 38603506 38552698 38582531 38702371 38919386 39237576
59611 39237576 39659288 40186667 40820433 41557744 42392090 43314130 44310458 45360802 46437120
59602 46437120 47505583 48528669 49465122 50269096 50891658 51286346 51417019 51263746 50823787
59593 50823787 50109400 49146308 47972960 46636957 45187905 43671282 42126859 40589425
59585 40589425 39088281 37646163 36279542 34999121 33808739 32704460 31675957 30707856
59577 30707856 29778351 28858371 27916891 26931016 25892852 24808617 23693420 22566744 21449410
59568 21449410 20360652 19315578 18324267 17392416 16522632 15715636 14970835 14286151 13658083
59559 13658083 13082774 12557020 12077793 11641066 11242021 10876547 10541966 10236147 9956410
59550 9956410 9699496 9462350 9242883 9040110 8853295 8680588 8518709 8364111 8213892
59541 8213892 8065178 7914618 7759767 7600780 7439757 7278433 7117284 6956609 6797388
59532 6797388 6641015 6489231 6344405 6208807 6083246 5967210 5860572 5764254 5678855 5603597
59522 5603597 5537188 5479131 5429670 5389179 5358211 5337544 5327349 5326463 5332994 5345494 5363355 5386506
59510 5386506 5415274 5450140 5491014 5536876 5586613 5640098 5698035 5761008 5829309 5903593 5984930
59499 5984930 6073918 6170391 6274436 6387340 6511123 6647379 6796956 6960529 7138913 7332917
59489 7332917 7543435 7771762 8019182 8285997 8571320 8874024 9193401 9528568 9877655
59480 9877655 10238005 10606680 10980259 11354356 11723912 12083906 12429705 12757162 13062622
59471 13062622 13342069 13589853 13799474 13967263 14095190 14188940 14253404 14291172 14304951 14299433
59461 14299433 14280032 14251134 14216568 14181073 14150700 14132367 14133375 14160377 14217939 14308242 14432142
59450 14432142 14589485 14777818 14991326 15221081 15455456 15680344 15880756 16043444 16157538
59441 16157538 16212581 16197809 16104878 15930817 15677664 15350586 14957840 14511648 14027048 13519312
59431 13519312 13002637 12490037 11992387 11517031 11068230 10649089 10262412 9909955 9592059
59422 9592059 9308460 9058869 8842607 8658296 8504289 8379269 8282421 8213274 8171498 8156873
59412 8156873 8169493 8209684 8277336 8371558 8491558 8637419 8808938 9003887 9218821 9451650
59402 9451650 9701610 9965956 10238193 10510440 10775848 11027417 11256109 11452288 11608436
59393 11608436 11718834 11777350 11777769 11716623 11594617 11415570 11185424 10912159 10605031 10273000
59383 10273000 9924082 9565684 9204355 8845119 8491738 8147547 7815436 7497465 7195321
59374 7195321 6910819 6645124 6398004 6168827 5957770 5764922 5588650 5426287 5276415
59365 5276415 5139367 5015556 4904400 4804942 4716566 4638902 4571731 4514976 4468308 4430955 4402438
59354 4402438 4382983 4372590 4370271 4374995 4386909 4406877 4435311 4471632 4513298 4554364 4586990 4606935
59342 4606935 4617291 4625326 4636504 4653183 4677578 4712652 4759890 4818683 4888136 4966997 5051412
59331 5051412 5135598 5216459 5296517 5381725 5477819 5588941 5717456 5863735 6027350 6209508
59321 6209508 6413224 6640755 6892613 7170025 7476590 7816095 8189884 8597856 9041154
59312 9041154 9522518 10044643 10609468 11218618 11873053 12571717 13310577 14082690 14878955
59303 14878955 15689151 16502287 17305864 18085717 18828461 19524853 20170149 20761483 21296547
59294 21296547 21775271 22200944 22578098 22909501 23195350 23433961 23621971 23754443 23825691
59285 23825691 23829993 23761484 23614384 23384186 23068653 22668115 22186073 21629845 21009603 20336184
59275 20336184 19620393 18874029 18109737 17338928 16570833 15813993 15077196 14367998 13691396
59266 13691396 13050808 12449219 11888374 11367911 10886538 10443385 10037281 9665645 9325489
59257 9325489 9015223 8734440 8482283 8256920 8056430 7879357 7724522 7590795 7476836
59248 7476836 7380733 7300307 7234131 7181832 7143230 7117871 7105611 7106640 7120440 7145642 7181544
59237 7181544 7228761 7287552 7356294 7432519 7514701 7601991 7692790 7784803 7876420 7967246 8057242
59226 8057242 8145819 8231703 8313476 8390523 8463559 8533864 8602111 8668773 8735607 8805619 8881260
59215 8881260 8963809 9054805 9156463 9269547 9391746 9518859 9646521 9770047 9884299 9985490
59205 9985490 10072434 10144625 10199774 10234542 10247003 10236775 10203280 10145743 10065136 9964777 9848811
59194 9848811 9721124 9585654 9446524 9307565 9172540 9045751 8931099 8830097 8741687 8664572
59184 8664572 8599148 8546893 8508540 8483240 8468940 8462994 8462676 8465684 8470410 8475940 8481991 8488721 8496280
59171 8496280 8504388 8512580 8521093 8531715 8547870 8573602 8612055 8664842 8733111 8819085 8926120 9057483
59159 9057483 9215937 9404473 9626252 9882976 10173880 10496956 10850626 11233384 11641866
59150 11641866 12069721 12507981 12945578 13369126 13762684 14108703 14390374 14594129 14710530
59141 14710530 14733279 14658375 14485071 14217476 13864560 13438690 12954509 12428217 11875977 11312157
59131 11312157 10749310 10199051 9671161 9171378 8701339 8261301 7852101 7474348 7127151
59122 7127151 6808455 6515864 6246864 5999407 5772794 5566892 5380114 5209544 5053678
59113 5053678 4913450 4789418 4679227 4579262 4487924 4405973 4334343 4272890 4220757 4176701 4139234
59102 4139234 4107399 4081346 4061719 4048941 4043468 4045785 4055379 4070524 4089994 4114499 4145634 4183984
59090 4183984 4228938 4279719 4335839 4397106 4463872 4536767 4615721 4699883 4788736 4882274 4979722
59079 4979722 5079550 5181515 5287147 5396961 5508420 5617876 5723383 5824257 5919161 6006390
59069 6006390 6085266 6155642 6216786 6268305 6311466 6347943 6377916 6401146 6419335 6435536 6451460
59058 6451460 6467213 6483643 6503199 6528307 6560367 6600602 6650549 6711411 6783909 6868775 6966455
59047 6966455 7076577 7198884 7334491 7485008 7650570 7830013 8022851 8229600 8449940
59038 8449940 8681797 8922329 9168509 9416286 9660076 9893336 10108877 10298690 10454642
59029 10454642 10569920 10639659 10660845 10632945 10558678 10443166 10292076 10111015 9906093 9683503
59019 9683503 9448154 9203441 8952313 8697617 8441414 8184862 7928933 7674609 7422438
59010 7422438 7172661 6925806 6682747 6444445 6212002 5986270 5766871 5552559 5343528
59001 5343528 5142309 4951108 4769287 4595050 4428588 4271456 4123516 3982914 3849024
58992 3849024 3723050 3605423 3494760 3389935 3291103 3197959 3109015 3023648 2943171 2868674
58982 2868674 2799252 2733530 2671593 2613920 2559467 2506384 2454245 2404335 2358047 2316005 2278498
58971 2278498 2245559 2216362 2189316 2163287 2138615 2116766 2098949 2085057 2073962 2064625 2056582 2049454
58959 2049454 2042778 2036726 2032197 2029529 2027708 2025677 2023831 2023278 2024080 2025283 2026319 2027287 2028124 2028580 2028909
58944 2028909 2029636 2030855 2032629 2035596 2040055 2044900 2048816 2052218 2056549 2061933 2067133 2071807 2077060 2083408
58930 2083408 2089784 2095180 2100082 2105800 2113346 2123330 2135854 2150156 2165289 2181334 2199004 2218055
58918 2218055 2237392 2256937 2278032 2301533 2326694 2352357 2378124 2403949 2429778 2456184 2484350
58907 2484350 2514775 2546733 2579380 2612529 2646029 2679384 2712522 2746143 2780823 2816311 2851980
58896 2851980 2887384 2922400 2957662 2994848 3035632 3080286 3128095 3178983 3233692 3292595 3355577
58885 3355577 3423038 3495790 3573960 3657209 3745884 3840595 3940895 4046046 4156942 4275427
58875 4275427 4401786 4535086 4676254 4828370 4993154 5169493 5356610 5556452 5771495
58866 5771495 6002118 6248080 6511051 6793685 7097139 7421285 7766765 8135454 8529713
58857 8529713 8952555 9407798 9898381 10424776 10986234 11583252 12217849 12891943 13606567
58848 13606567 14362154 15158159 15992209 16860160 17756468 18673477 19600485 20524123 21429264
58839 21429264 22298746 23112510 23848132 24482889 24995937 25369891 25591868 25654026 25554065 25296491
58829 25296491 24893679 24364360 23729666 23010087 22225341 21395186 20538770 19673247 18813204
58820 18813204 17970547 17154134 16370010 15622515 14914758 14247782 13620283 13030097 12475711
58811 12475711 11956081 11469577 11013670 10585338 10181720 9801089 9443241 9108036 8793393
58802 8793393 8495959 8214165 7949406 7703493 7475987 7264715 7067803 6884265 6713550
58793 6713550 6555619 6410885 6279141 6158965 6048808 5948140 5857078 5775739 5704634 5644794
58783 5644794 5596546 5558700 5529771 5509578 5498968 5498580 5508620 5529344 5560992 5603468 5656741 5721316
58771 5721316 5798005 5887481 5990152 6106001 6234491 6375359 6529612 6699014 6884608 7086729
58761 7086729 7306392 7545300 7804249 8083081 8382861 8706653 9057356 9436122 9843845
58752 9843845 10282874 10756000 11264718 11809794 12392874 13016409 13682271 14390956 15141266
58743 15141266 15929878 16751780 17601596 18473499 19359005 20245404 21116549 21953740 22735202
58734 22735202 23436758 24035428 24512552 24853110 25043729 25073913 24939941 24647250 24209483
58725 24209483 23645812 22978000 22227951 21416625 20564118 19689125 18807296 17930685 17069248
58716 17069248 16232149 15426986 14658478 13928413 13236364 12580502 11959114 11371968 10819296
58707 10819296 10299375 9808808 9345653 8910428 8503203 8121713 7763605 7428475 7115839
58698 7115839 6822776 6545847 6284302 6039222 5810251 5595280 5392876 5203103 5026122
58689 5026122 4861559 4708974 4567389 4434619 4308593 4189153 4077307 3973084 3875563 3784602
58679 3784602 3700730 3623263 3550084 3479698 3412415 3349200 3290329 3235407 3183840 3134927 3087992
58668 3087992 3042628 2998578 2955518 2913281 2872101 2832338 2794040 2756768 2719450 2680679 2640018
58657 2640018 2598788 2558366 2517768 2474404 2427425 2378585 2329464 2279788 2229231 2178815 2129442
58646 2129442 2081034 2034338 1991467 1952934 1916179 1879033 1842878 1810141 1780342 1751193 1722346
58635 1722346 1695324 1670515 1646848 1623913 1601910 1579861 1556326 1531812 1508267 1486166 1464110
58624 1464110 1441364 1418960 1398234 1379958 1364814 1352965 1343135 1333617 1324215 1315852 1308793 1302954
58612 1302954 1299431 1299675 1303178 1307883 1312920 1319190 1327309 1336789 1347274 1358674 1369855 1378936 1385256
58599 1385256 1389511 1391648 1390205 1384216 1374618 1363488 1352877 1344239 1337704 1331923 1325812 1320338 1317373
58586 1317373 1317248 1318940 1322347 1328516 1337630 1348532 1360516 1374112 1389929 1408118 1429125 1453529
58574 1453529 1480994 1510629 1542420 1577092 1614685 1654696 1697434 1743795 1793800 1846921 1903589
58563 1903589 1964645 2029326 2095623 2162851 2232345 2305795 2384825 2472382 2572335 2686938 2816179
58552 2816179 2959981 3119203 3293947 3482818 3684924 3901088 4131979 4376124 4630587
58543 4630587 4892386 5158114 5422907 5680638 5924452 6146348 6336911 6486629 6587970
58534 6587970 6636566 6631245 6573596 6467656 6319961 6139309 5935044 5714717 5483879 5248371
58524 5248371 5015241 4790164 4575031 4369684 4175209 3994009 3827481 3675588 3538287
58515 3538287 3415448 3305475 3205820 3115056 3033080 2959304 2892040 2829613 2770792 2714275 2658998
58504 2658998 2604898 2552387 2501425 2452015 2404756 2359714 2315724 2272191 2230384 2191164 2152756
58493 2152756 2113079 2073230 2036012 2001744 1968276 1934640 1901677 1869151 1835359 1800081 1765247
58482 1765247 1732051 1699801 1668185 1638289 1610646 1584351 1558735 1533957 1509554 1484450 1458878
58471 1458878 1434262 1410941 1388233 1367076 1350005 1337625 1327409 1316949 1306228 1295704 1284435
58460 1284435 1271583 1258026 1244985 1232319 1219393 1206475 1194184 1182491 1171170 1160622 1151745
58449 1151745 1145434 1141986 1140093 1136949 1130755 1122791 1115539 1109272 1102336 1094332 1086744 1080473 1074923 1069759
58435 1069759 1065565 1062586 1060499 1059380 1059181 1058692 1057034 1055668 1056540 1058782 1059836 1059248 1058320 1056541 1052056
58420 1052056 1045857 1041680 1040877 1040874 1039659 1038296 1037636 1036024 1032230 1027760 1024222 1020696 1015675 1009640 1004002
58405 1004002 999271 995624 993586 992878 992167 990828 989370 987588 984440 980379 977551 976940 977407 978110 979437
58390 979437 981002 981473 981264 982702 986500 990675 993944 997501 1002341 1007559 1012448 1017522 1022149 1024007 1022460
58375 1022460 1020002 1018924 1018895 1019008 1019587 1020611 1021021 1020992 1022386 1025582 1028374 1029316 1029640 1030678 1032125 1034023
58359 1034023 1037510 1042174 1045559 1046768 1047748 1049672 1051167 1051569 1052738 1055917 1059950 1064181 1069822 1076698
58345 1076698 1082259 1086050 1091730 1102180 1115656 1129060 1141822 1154160 1164812 1173282 1181591 1191268
58333 1191268 1201321 1211179 1222372 1235002 1246150 1254517 1263066 1274042 1284808 1291897 1295896 1298903
58321 1298903 1300434 1299677 1298860 1300482 1303676 1306860 1311259 1318082 1325003 1329683 1334456 1343158 1355100 1366381
58307 1366381 1375724 1385021 1395203 1405357 1415302 1425915 1437463 1449805 1463155 1476916 1489626 1501848
58295 1501848 1516560 1534593 1552528 1567627 1581853 1598240 1616312 1634181 1652121 1670680 1688084
58284 1688084 1702984 1717202 1732617 1748163 1762947 1778941 1797078 1814195 1827842 1840782 1856481
58273 1856481 1873554 1889191 1904734 1922805 1941885 1959138 1976204 1996863 2020856 2045006 2068675
58262 2068675 2093337 2118557 2143106 2168296 2195676 2223267 2248549 2273295 2301011 2331642 2363205
58251 2363205 2396360 2432620 2470090 2505735 2539913 2574290 2607650 2638447 2669054 2702621 2738083
58240 2738083 2773016 2808759 2847659 2888021 2927105 2966412 3008496 3051415 3092266 3133606 3180247
58229 3180247 3231985 3285503 3341123 3401353 3464955 3528781 3593672 3662576 3734881 3808364 3884271
58218 3884271 3964347 4045510 4123940 4201970 4284507 4371318 4459478 4550417 4647434 4749027 4852008
58207 4852008 4958373 5071687 5189625 5307866 5428403 5555979 5689457 5825220 5966001
58198 5966001 6117330 6277914 6442635 6612336 6791387 6978409 7169124 7365661 7573036
58189 7573036 7789151 8008650 8234071 8472499 8723959 8984257 9256615 9548664 9860166
58180 9860166 10185692 10527090 10890853 11275450 11674418 12090254 12532288 13002889 13499279
58171 13499279 14026542 14594131 15201443 15841868 16519473 17246659 18028043 18863271 19763233
58162 19763233 20745277 21813906 22964662 24205506 25555134 27022500 28609719 30334405
58154 30334405 32226905 34306029 36580336 39071723 41812068 44817796 48096601 51680983
58146 51680983 55627639 59985737 64800090 70148052 76139471 82880546 90477390 99075817
58138 99075817 108851610 119957410 132526620 146727648 162751204 180742237 200827102
58131 200827102 223238941 248375465 276784120 309194841 346336733 387981359 431436852
58124 431436852 470985261 499577550 512038086 507338300 488315432 459583967 425566349
58117 425566349 389652328 354152107 320457774 289272824 260907464 235481923 212960792
58110 212960792 193167633 175880454 160899238 148006702 136934579 127426358 119299572
58103 119299572 112411798 106612924 101779286 97852365 94786180 92499429 90962946 90297922
58095 90297922 90624234 91693228 92711536 92653390 90836283 87242749 82359714 76789785
58087 76789785 71001637 65306727 59909424 54921968 50375931 46265152 42579369 39296911
58079 39296911 36373412 33760259 31424560 29339346 27467931 25773372 24233874 22834584
58071 22834584 21552117 20360980 19248707 18211151 17237827 16314394 15435221 14601386 13809846
58062 13809846 13055928 12342965 11677768 11058671 10478250 9935172 9432879 8968761 8534897
58053 8534897 8127665 7746719 7386348 7038307 6702438 6384953 6086846 5803196 5533116
58044 5533116 5280773 5046354 4824831 4614323 4417653 4235182 4063525 3901625 3750906
58035 3750906 3609492 3473385 3343109 3222125 3109195 2999696 2894064 2797235 2709641 2626398
58025 2626398 2545706 2470511 2401213 2334032 2267580 2204128 2143498 2082545 2021761 1965615 1915011
58014 1915011 1865689 1815274 1765859 1718711 1672731 1629308 1592332 1561800 1533214 1504645 1478647
58003 1478647 1455915 1433061 1408357 1384116 1361674 1339463 1317700 1299488 1285322 1271563 1256258
57992 1256258 1241638 1229117 1216616 1202697 1188780 1175600 1161877 1147918 1136034 1125999 1114701
57981 1114701 1101658 1090108 1081070 1071150 1058081 1043937 1031027 1019077 1008311 1000780 996369 991543
57969 991543 984197 976118 969102 962579 956511 952277 948939 943061 934352 927232 924582 923998 922418 920320
57955 920320 918858 917002 914306 912879 913632 913836 911161 907026 903318 898839 891890 883624 876066 869193 862432
57940 862432 856699 852564 848589 843685 839102 836161 834126 832130 830928 830959 830897 829949 829351 829822 829668 827283
57924 827283 823588 820418 818199 816401 814346 810614 803897 795482 788616 784555 781739 779466 779219 781233
57910 781233 782943 782409 780324 777241 772024 764855 758609 755089 752645 749448 746361 744472 742535 739176
57896 739176 735271 731947 728434 723857 718862 713668 706985 698818 691777 687499 684304 680625 678127 678843
57882 678843 681520 683687 685482 688760 693903 699935 706406 712996 718516 722191 724647 726122 725336 721601
57868 721601 716128 709725 701333 690581 679534 669894 660657 650595 640902 633032 625942 617970 609781
57855 609781 603159 598457 595218 593545 592837 591181 588270 586943 589417 593901 597466 600316 604391 609541
57841 609541 614215 618599 624004 630096 635534 640481 645895 651247 655552 659698 665088 670692 674084 674870
57827 674870 674570 673641 671079 666684 661439 655698 648942 641151 632940 624770 617305 611586 607453 602991 597277
57812 597277 592230 589859 589185 588267 587725 589361 592409 594330 594921 596652 601042 607404 615136 624547 635030
57797 635030 644826 653211 661089 669039 676391 682446 686961 689352 688981 686425 683069 679387 674868 669401
57783 669401 663332 656395 648060 638828 629885 621667 614073 607631 602994 599520 595806 591490 587254 583391
57769 583391 579625 575983 572544 568657 563637 557793 551693 545025 537445 529769 522969 516768 510536 504479
57755 504479 498270 489834 477938 465261 456204 451671 448386 443628 438402 435335 435203 436400 436753 435358
57741 435358 433386 433157 435841 440521 446234 453861 464560 477135 488665 497324 503105 506553 508591 510999
57727 510999 515000 519575 523021 525891 530491 537669 546091 554593 563228 571861 579642 586210 591840 596268
57713 596268 598878 599848 599451 596464 589518 580098 571874 566509 562220 557196 552335 549448 548529 548203 547715
57698 547715 547212 546809 546418 546044 545630 544849 543113 539234 531331 518170 500792 482031 464469 449765
57684 449765 439495 434905 435387 438537 442384 446754 452285 459141 467045 475643 484434 493014 501534 510253
57670 510253 518688 526056 532520 539113 546513 554688 563535 572962 582575 592288 602915 615047 627692
57657 627692 639327 649996 660960 672516 683784 694645 706244 719342 733671 749270 766881
57646 766881 786393 806089 824224 840624 856470 873304 892330 913771 936854 961229 988252
57635 988252 1019745 1055676 1094405 1135190 1179000 1226654 1277668 1331324 1387683 1447169 1510505
57624 1510505 1579496 1656542 1742605 1836712 1938193 2048629 2170838 2306557 2455766 2617976
57614 2617976 2793599 2984020 3190412 3412748 3650646 3905143 4178236 4469493 4773469
57605 4773469 5080471 5377775 5648644 5872703 6031632 6116231 6127519 6072298 5959823 5801521
57595 5801521 5609707 5394635 5164108 4926100 4689334 4460361 4241996 4035573 3842958
57586 3842958 3665527 3503069 3355013 3221394 3101604 2993643 2895835 2808186 2731023 2663422
57576 2663422 2603979 2552208 2508229 2471815 2442509 2419907 2403293 2391933 2386281 2387901 2397504 2413960
57564 2413960 2435786 2462778 2495728 2535576 2583457 2640557 2707104 2782066 2864411 2954312 3053133
57553 3053133 3162779 3284700 3418430 3561404 3711483 3869271 4036133 4209937 4384558
57544 4384558 4553508 4711659 4852900 4968764 5051215 5095689 5100731 5066572 4995456 4891984
57534 4891984 4761659 4609813 4442477 4266558 4087740 3909091 3732684 3561355 3397802
57525 3397802 3243029 3096864 2959285 2830512 2710725 2600324 2499434 2406702 2319947 2238576
57515 2238576 2163871 2096300 2034399 1977106 1925187 1878917 1836240 1795047 1755923 1720968 1691072
57504 1691072 1665811 1644639 1626430 1609055 1591341 1574594 1560552 1548807 1537899 1527866 1519811
57493 1519811 1513860 1509556 1507534 1508586 1511540 1514207 1516426 1520344 1527610 1537886 1550118 1563648 1577919
57480 1577919 1592558 1608236 1626506 1648558 1674674 1704516 1737199 1771619 1807730 1847045 1890858
57469 1890858 1938633 1989242 2042889 2100344 2161087 2224197 2290766 2363504 2443802 2530908 2624151
57458 2624151 2724159 2831336 2944583 3062376 3184188 3310204 3440222 3572954 3705576
57449 3705576 3833625 3951831 4055208 4139047 4198607 4230176 4232648 4207310 4156251 4081930 3988131
57438 3988131 3880046 3763015 3641878 3521233 3404872 3294358 3189144 3088797 2994577 2908480
57428 2908480 2831451 2763121 2702839 2650260 2604875 2565496 2530660 2499739 2473384 2452489 2436861
57417 2436861 2425539 2418466 2417065 2422823 2435944 2455541 2480271 2508428 2538574 2571006 2607902 2651181
57405 2651181 2700771 2755479 2814745 2878835 2948337 3024404 3108568 3201082 3300205 3404301 3513997
57394 3513997 3631049 3755640 3886031 4020085 4155441 4288333 4413717 4526654 4622626 4696903
57384 4696903 4745113 4764752 4755412 4717877 4654149 4568245 4465689 4351830 4231064 4107233 3983615
57373 3983615 3862447 3745182 3633104 3527157 3427731 3335379 3251218 3175654 3107369 3044644
57363 3044644 2987255 2935945 2890616 2850349 2814757 2783936 2757358 2734075 2713787 2696503 2681475
57352 2681475 2667727 2655354 2645145 2637319 2631863 2629467 2630483 2633363 2635865 2637602 2639793 2642903 2646381
57339 2646381 2650543 2656510 2664063 2671645 2679001 2687975 2700043 2714654 2730481 2746736 2762737 2777896
57327 2777896 2792810 2808877 2826182 2843226 2859471 2876515 2895898 2917134 2938863 2960595 2982331
57316 2982331 3003709 3024691 3046141 3068717 3092026 3115632 3139953 3165335 3191191 3216903 3242694
57305 3242694 3268743 3294371 3319042 3343447 3368635 3394706 3421122 3447652 3474172 3500178 3525400
57294 3525400 3550592 3577011 3605389 3635649 3667088 3698562 3729227 3759489 3790486 3822391 3854228
57283 3854228 3885671 3917693 3950741 3983575 4015051 4046007 4078032 4111072 4143609 4174807 4205263
57272 4205263 4235800 4266661 4297873 4329555 4361747 4394489 4428038 4462542 4497624 4532786 4568064
57261 4568064 4603869 4640357 4677341 4714596 4751828 4788547 4824326 4859072 4892882 4925923 4958725
57250 4958725 4992181 5026845 5062391 5098146 5134028 5170760 5209264 5249973 5292655 5336842 5382410
57239 5382410 5429487 5477604 5525434 5571894 5617263 5662652 5708667 5755119 5801569 5847399 5891877
57228 5891877 5935330 5979999 6028549 6081802 6139035 6200322 6267074 6340103 6418475 6500495 6584553
57217 6584553 6668859 6752006 6834329 6917208 7000316 7080995 7157145 7229171 7297953 7362254 7419615
57206 7419615 7468915 7510582 7544799 7570826 7587847 7595587 7594442 7586044 7573549 7560504 7549318 7541074
57194 7541074 7536311 7535334 7538029 7544072 7553379 7566271 7583384 7605350 7631995 7661949 7693835 7727847
57182 7727847 7765116 7805329 7846179 7885559 7923034 7958602 7991466 8021123 8048506 8074645 8098908
57171 8098908 8119838 8137230 8151964 8164003 8171932 8174836 8173845 8171387 8169137 8166754 8162323 8153985 8141321
57158 8141321 8125377 8107767 8090103 8073790 8059419 8046302 8033398 8020775 8009523 8000380 7993427 7989032
57146 7989032 7987696 7988606 7989526 7988805 7986684 7984221 7981837 7979303 7976094 7971117 7962922 7950807 7935205 7916835
57132 7916835 7896333 7874884 7854143 7835083 7817782 7802703 7791154 7784154 7781802 7784046 7791102 7802860
57120 7802860 7818962 7839578 7864812 7893062 7921272 7947154 7970036 7989571 8005376 8018127 8028997
57109 8028997 8037182 8039590 8033662 8018826 7994563 7959011 7910612 7849639 7777096 7693767 7601535 7504387
57097 7504387 7407078 7313704 7227737 7151573 7085209 7026944 6975736 6930868 6888767 6842657 6786584
57086 6786584 6718025 6636425 6542492 6440366 6337191 6238000 6142865 6050506 5961691 5876725 5792250
57075 5792250 5703695 5609390 5509966 5405506 5295744 5181354 5062505 4937501 4805033 4666274
57065 4666274 4522693 4373554 4217788 4056698 3892604 3726469 3558890 3391501 3225295
57056 3225295 3059489 2894272 2732786 2578548 2433266 2299240 2181350 2084696 2013254 1973196
57046 1973196 1974349 2025968 2134845 2310711 2570232 2932947 3416927 4040073 4818678 5757966
57036 5757966 6844970 8050387 9329937 10621488 11849778 12939089 13817389 14418451
57028 14418451 14708440 14708723 14427663 13701510 12122518 9228882 4857866 -666850 -6707623
57019 -6707623 -12677568 -18271345 -23426774 -28145642 -32360687 -35924641 -38691068 -40613599
57011 -40613599 -41784569 -42376594 -42535915 -42318795 -41706816 -40658180 -39145451 -37173954 -34790803
57002 -34790803 -32079482 -29138428 -26061536 -22933733 -19832212 -16822571 -13955347 -11268744
56994 -11268744 -8790555 -6534740 -4500530 -2678333 -1054135 392003 1685124 2848030
56986 2848030 3896564 4842890 5698790 6473309 7171494 7798533 8361697 8865720 9310141
56977 9310141 9694539 10023301 10302318 10534282 10720889 10867170 10979869 11062940 11117482 11144710
56967 11144710 11146337 11123332 11076837 11009558 10924658 10824352 10710636 10585375 10447970 10294933
56957 10294933 10123898 9936880 9738413 9532418 9322551 9113368 8908697 8710009 8517945
56948 8517945 8333821 8158033 7989012 7825948 7671479 7530916 7411534 7323507 7275303 7260524
56938 7260524 7249490 7200396 7083365 6894543 6649564 6368364 6067027 5758173 5452331 5157026
56928 5157026 4876101 4610970 4362189 4129899 3913527 3711853 3523514 3346936 3179298
56919 3179298 3016126 2853297 2689926 2528668 2372921 2224528 2084187 1952662 1830709
56910 1830709 1718681 1616900 1525636 1444270 1371526 1307164 1252318 1207376 1170779 1141035 1118827
56899 1118827 1105731 1101521 1103904 1110181 1117866 1124306 1127186 1125464 1119016 1107815 1092331 1074142 1054953
56886 1054953 1035308 1015353 996501 981038 969982 962346 956588 952102 949337 949310 953058 960901 972198
56873 972198 986296 1003611 1025041 1050131 1076064 1098472 1113200 1117920 1112703 1099160 1078943 1053376
56861 1053376 1024352 994454 965489 937612 910539 884933 861742 840877 821605 803826 787939
56850 787939 773746 760584 748451 737928 728937 720605 712653 706176 702605 702337 704613 708332 712816
56837 712816 718081 724538 732305 741017 750592 761887 775957 792677 810673 828828 847472 867830
56825 867830 890490 914443 937320 956364 969522 976132 977044 974079 968962 962336 953828 943369 932265
56812 932265 922452 914760 908576 903331 899600 898426 900332 905592 914919 929054 947908 970764 997233
56799 997233 1027152 1059183 1089859 1114372 1128534 1130430 1120826 1102375 1078353 1051752 1025009 1000014
56787 1000014 978182 960627 948218 941286 939396 941846 948463 959723 976134 997987 1025779 1060362
56775 1060362 1102267 1150877 1204166 1258658 1309396 1350470 1376427 1383891 1372510 1344983 1306213
56764 1306213 1261672 1215740 1171065 1129108 1090908 1057331 1028938 1005906 988124 975444 967851
56753 967851 965349 967859 975676 989920 1011727 1040616 1074237 1109913 1145277 1176628 1198090 1204488
56741 1204488 1195119 1173430 1143199 1106577 1065833 1024769 986920 953153 922179 893030 866368
56730 866368 843688 825929 812889 803683 797662 794784 795015 797967 803699 813244 827132 843397 858066
56717 858066 867666 870472 865682 852952 833241 808799 781674 752998 724050 696717 672141 649758
56705 649758 628469 608093 589144 571964 556778 543927 533387 524511 516725 509956 503997 498149
56693 498149 492007 486009 480724 476151 472150 468964 466916 466015 466140 466967 467585 467024 465426 463851 462708
56678 462708 461386 459734 458681 458784 459288 459360 459194 459117 458696 457725 457081 457443 457947 457282 455538 453832 452552
56661 452552 451098 449014 446458 443820 441654 440481 439721 437308 431570 423421 415690 410244 406537 403009
56647 403009 398964 394780 390859 386981 382731 378367 374836 372589 370641 367557 363343 359505 357089 355556
56633 355556 353922 352030 350202 348511 347049 346157 345740 345020 343530 341794 340549 340040 340443 342004 344126
56618 344126 345286 344750 343672 343779 345601 348529 351687 353974 354271 352628 350570 349367 348642 347387 345403
56603 345403 342857 339523 335620 332467 330875 329587 326774 322544 318533 315377 312106 307954 303488 299858
56589 299858 297987 298489 301395 305776 310508 315625 322480 332555 346329 362790 379569 394126 405551
56576 405551 414901 423377 430814 436485 440513 443580 445885 447321 448075 448137 446755 443330 438475 433521 429407
56561 429407 426580 425054 423810 421166 416769 412396 409824 408910 408794 409748 412302 415584 418292 420540 423026
56546 423026 425069 425333 424073 422742 421640 419811 417207 415156 414508 414870 415786 417194 418608 419196 418868 418224
56530 418224 417582 417213 418069 420686 423632 424771 424068 423411 423655 423725 422980 422575 423746 426264 429254 432194 434432
56513 434432 435058 434197 433552 434838 438230 442650 446899 450265 452826 455388 458569 462030 465360 469258 474520
56498 474520 480187 484427 487355 491219 497336 504555 511490 518665 527311 537254 547260 556640 565316 572916
56484 572916 578907 583371 586814 589342 590695 590913 590301 588681 585285 579752 573009 566620 560932 554426 545682
56469 545682 535790 527615 522445 518662 514272 509252 504388 499345 493632 488360 485001 482973 480387 476855
56455 476855 473562 470774 467404 463321 460157 459134 459563 460034 459861 458951 457451 455937 454895 453793 451805
56440 451805 449515 448585 449470 450770 451135 450606 449718 448532 446955 444920 441963 437820 433768 432149 433994
56425 433994 437959 441938 444789 446343 446808 446678 446536 446692 447412 449014 450927 451342 449261 446537 446175 448699
56409 448699 451805 453580 454308 455037 456178 458018 460970 464847 469192 474541 481826 490373 498253 505026 512297
56394 512297 520854 529011 534688 537737 539327 540328 541196 542453 544380 546786 549302 551198 551185 548680 545171
56379 545171 542785 541549 539644 536335 532680 529305 525609 521659 518582 516340 513215 508499 503743 500304
56365 500304 497538 494531 491785 489807 487684 484532 481095 478656 477453 477167 477768 478841 479375 479255 479794
56350 479794 481780 484166 485657 486391 487093 487817 488553 489975 492601 496029 499631 502903 504788 504281 502346
56335 502346 501560 502875 504360 504196 503310 503816 506262 509700 513168 515826 516809 516218 515237 514194 511400 504775
56319 504775 493676 478645 460889 442789 427287 415623 406952 400812 398118 398759 400276 400531 400072
56306 400072 400296 400920 401083 401609 404211 409258 415894 423564 431982 440311 447659 453822 458812 462550 465696
56291 465696 469460 473828 477357 479592 481988 485410 488487 489923 490893 493563 498439 504559 511050 517256
56277 517256 522560 527381 533060 539705 545659 550221 555166 562141 570185 577347 583231 588381 592743 596388
56263 596388 600366 605289 610392 615275 620878 627329 632746 635998 638911 643883 650916 658816 667570 677522
56249 677522 687904 698284 709837 723021 735589 745268 753092 761858 772537 784272 796505 808875
56237 808875 820270 830158 839711 849744 858997 866342 872987 880502 888621 897155 907774 921113 934260
56224 934260 944311 952597 962219 973346 984644 997554 1014898 1036300 1059176 1083594 1111900 1143866
56212 1143866 1176574 1209430 1245222 1285515 1328790 1374239 1424041 1480481 1543485 1612280 1687161
56201 1687161 1768515 1856069 1950168 2052190 2163075 2282777 2411393 2549407 2696996 2854622
56191 2854622 3023768 3204930 3395094 3589316 3784787 3981422 4178666 4373676 4562414
56182 4562414 4740404 4902551 5044265 5162911 5256767 5323363 5360877 5370516 5355419 5317949 5260187
56171 5260187 5186070 5100137 5004616 4900294 4789580 4675788 4559962 4441616 4322339 4205239
56161 4205239 4090482 3974659 3855402 3733992 3612682 3491964 3371254 3250108 3128085
56152 3128085 3005433 2884458 2768371 2658302 2552949 2451125 2352925 2258608 2168396 2083368
56142 2083368 2004707 1932156 1864830 1802936 1746783 1694833 1645083 1597843 1554858 1516269 1480762
56131 1480762 1448037 1418503 1391200 1364745 1339938 1318766 1301274 1285891 1272117 1260170 1248855
56120 1248855 1236895 1225684 1217502 1211629 1205575 1199597 1196371 1196447 1197678 1199063 1201596 1205311 1209084 1213520
56106 1213520 1220564 1230104 1240319 1251394 1265293 1281797 1298555 1315241 1333847 1354474 1374762 1394110
56094 1394110 1414660 1437416 1461179 1486034 1513987 1545089 1576595 1607257 1639145 1674203 1712306
56083 1712306 1753665 1799785 1850926 1905817 1965043 2031877 2109012 2197231 2297699 2412372 2541611
56072 2541611 2684303 2840065 3007503 3180127 3348239 3505713 3651565 3785233 3905224
56063 3905224 4013056 4113386 4208332 4295358 4371462 4434848 4481479 4505455 4505539 4487515 4458070
56052 4458070 4419757 4373066 4318529 4254305 4175702 4079944 3968730 3844915 3710491 3569493
56042 3569493 3428700 3293133 3164044 3042771 2932649 2835263 2748712 2671667 2605420 2550037
56032 2550037 2502270 2459630 2423140 2394023 2370992 2352653 2339249 2330210 2323242 2317403 2313884 2312632
56020 2312632 2311742 2311234 2313439 2318485 2323531 2327626 2332925 2339933 2346269 2351724 2359729 2371897 2385629 2398975
56006 2398975 2413466 2430335 2448391 2467267 2488295 2510749 2532002 2552745 2577013 2605684 2635293
55995 2635293 2664569 2696382 2731676 2767583 2803475 2842757 2886585 2931995 2978250 3028483 3082873
55984 3082873 3137083 3190096 3246621 3308879 3372976 3436425 3501997 3570946 3639928 3708267 3780684
55973 3780684 3858913 3938246 4016508 4098620 4187694 4279519 4370981 4466210 4569011 4676700 4787005
55962 4787005 4903557 5028810 5158901 5291423 5431127 5582008 5740812 5904044 6074070
55953 6074070 6252558 6435610 6621457 6815361 7020797 7233576 7450729 7676911 7915766
55944 7915766 8163696 8419063 8688728 8978115 9283256 9599884 9931651 10282331 10649335
55935 10649335 11032559 11440141 11877663 12341376 12829634 13350386 13909322 14501971 15126430
55926 15126430 15792441 16509032 17275642 18095186 18982880 19951553 21001200 22133408 23361851
55917 23361851 24697812 26141475 27700592 29402236 31273318 33326306 35576820 38055288
55909 38055288 40785985 43776315 47045708 50645290 54632734 59053933 63972068 69490260
55901 69490260 75723744 82778934 90784397 99907154 110305759 122102238 135436471 150514782
55893 150514782 167580833 186905078 208858028 233928827 262604035 295272911 332175895
55886 332175895 372946353 415520614 455313805 486059754 502376088 502221034 487335890
55879 487335890 461687316 429522491 394314666 358578261 323980457 291504580 261676642
55872 261676642 234760154 210815884 189714741 171219071 155074567 141019843 128765524
55865 128765524 118026913 108569715 100199485 92732870 86012340 79930225 74408887 69371284
55857 69371284 64751645 60514040 56633232 53069769 49783701 46756628 43978051 41422675
55849 41422675 39060603 36876848 34860891 32988139 31230535 29576254 28022611 26559303
55841 26559303 25174855 23870074 22648805 21502801 20419793 19398214 18439931 17536490
55833 17536490 16676654 15860421 15092276 14367468 13677942 13025054 12413209 11836532 11284302
55824 11284302 10754481 10250293 9768689 9303866 8857644 8435203 8034647 7651082 7286770
55815 7286770 6947033 6630132 6330998 6050898 5793534 5555393 5329762 5117128 4922128
55806 4922128 4743226 4574658 4416078 4271211 4138933 4014103 3895664 3786374 3686035
55797 3686035 3591767 3502945 3419232 3335896 3247631 3155181 3062541 2970272 2877419 2787071 2703655
55786 2703655 2626891 2553935 2484883 2420878 2359927 2300296 2244892 2196661 2152796 2109165 2067067
55775 2067067 2029776 1995819 1961864 1929048 1900274 1874294 1848633 1825223 1806795 1790758 1773157
55764 1773157 1755757 1742448 1731338 1717304 1700015 1682475 1663819 1640775 1614684 1590052 1567098
55753 1567098 1542226 1514799 1487145 1458992 1428309 1396951 1369247 1345446 1322230 1298996 1277823
55742 1277823 1257989 1236590 1214449 1195674 1181319 1168683 1156736 1146930 1138620 1128843 1117086 1105835
55730 1105835 1096297 1087715 1080526 1075931 1072733 1068750 1064668 1062418 1060813 1057382 1053354 1051802 1051821 1049883
55716 1049883 1046328 1044825 1045418 1043635 1037041 1027540 1016478 1002517 985470 967698 950504 933048 915700
55703 915700 900514 887522 874394 860658 848654 839355 830692 820817 809923 798217 785384 772678
55691 772678 762387 754461 746319 736453 725656 714694 703512 692688 682817 672611 660445 647461
55679 647461 636187 626622 616862 607096 599458 594194 589500 585000 581886 579615 575989 570469 564115 556538
55665 556538 546541 535556 526585 519655 512082 503303 495508 489352 483208 477109 473133 471039 467652 461758
55651 461758 455838 451741 448426 445341 444282 446134 449112 452066 456467 463168 469893 473868 474771 473549
55637 473549 470485 465922 460937 456050 450914 445994 442589 440676 438949 437587 438570 442526 447606 452245
55623 452245 456785 461734 466793 472264 479070 486772 493927 500791 508916 517564 523510 525411 525419 525376 524351
55608 524351 521412 517994 515642 513721 511134 508294 505714 502568 498334 494219 491390 489309 487171 485532
55594 485532 485229 486053 487659 490416 494156 497332 498523 497925 496677 495693 495446 495663 495007 492470 489162 487097
55578 487097 486193 484412 480916 476888 472912 467998 461861 455773 450159 443450 434496 424288 414330 405028
55564 405028 396593 389703 384250 378923 372893 366461 359645 351943 343930 337050 331186 324554 316866 310373
55550 310373 306726 304774 302584 299728 296480 292751 289102 286945 286343 285250 282308 278859 276943 276791 277544
55535 277544 278894 280534 281347 280690 279553 279159 279273 278895 277771 276332 274988 274189 274228 274380 273215 270312
55519 270312 266715 263447 260702 258693 257728 257140 255620 253074 250706 249062 247512 245841 244436 242742 239717
55504 239717 236339 235354 237670 241070 243350 244619 245644 246206 246375 247235 248976 250136 250065 250270 252017 254466
55488 254466 256454 258097 259126 257881 253996 250277 249711 251850 254103 255279 255957 256511 256893 257648 259389
55473 259389 261784 264414 267700 271760 275380 277695 279934 283930 289632 295492 300528 304676 307997 311038
55459 311038 315225 321377 328266 333840 337297 338823 338126 334550 328036 318578 305155 286475 262749 236131
55445 236131 209852 187190 170127 158058 148686 140934 135962 134587 135147 135189 134109 132724 131266 129356
55431 129356 127296 125808 124791 123490 121569 119211 116663 114422 113207 112987 112748 111814 110502 108963 106709
55416 106709 104149 103102 104501 106743 107719 107358 106824 106360 105622 105158 105672 106335 105589 103383 101231 100306 100657
55399 100657 101861 103198 103578 102496 100805 99519 98421 96921 95613 95548 96398 96766 96173 95491 95531 96277 97444
55382 97444 98728 99638 99946 100192 101019 102223 103183 103772 104125 104028 103469 103287 104175 105385 105465 104084 102232 100842
55364 100842 100147 100254 101365 103354 105751 108182 110440 112333 113913 115565 117434 119043 119801 119540 118311
55349 118311 116276 114184 113266 114055 115801 117478 118837 120146 121502 122799 123784 123907 122838 121193 119847
55334 119847 118488 116163 113399 112130 112909 113816 112982 110700 108131 105573 103255 102224 102772 103182 101796
55319 101796 99500 98520 99429 100857 101613 101687 101600 101951 103146 104562 104640 102844 100750 100105 100714 101443 102215 103480
55301 103480 104660 104940 104954 105803 106774 105959 103086 100046 98408 97840 97246 96251 95287 95081 96147 98109 99684
55284 99684 99995 99538 99155 98677 97575 96351 96016 96530 96998 97194 97745 98895 100117 100942 101394 101711 102278 103519
55266 103519 105237 106551 107137 107881 109510 111279 111949 111367 110077 108202 105929 104417 104825 106702 108515
55251 108515 109382 109317 108288 106195 103378 100188 96622 93354 92226 94258 97815 100194 100565 99950 99010 97636
55235 97636 96403 96515 98123 100158 102003 103974 106135 108004 109616 111595 113794 114926 113986 111417 108663
55220 108663 107101 107339 108958 110937 112620 114001 114963 115100 114619 114348 114189 112864 110098 107645 106847 106539
55204 106539 104904 102152 99638 97605 95776 94993 95875 96777 95695 93713 93934 97177 101284 104539 107061
55189 107061 108672 108305 106377 105136 105522 105748 104189 101828 100611 100960 102073 103280 103970 103495 102300 102078
55173 102078 103717 105976 107119 106941 106314 105631 104724 103677 102773 102010 101396 101385 102421 104191 105724 106172 105523
55156 105523 104726 104812 105635 105889 104894 103676 103475 103955 104055 103968 104765 106400 107677 108135 108489 109170 109808 110182
55138 110182 110352 109984 109013 108824 111025 114901 117833 118514 118067 117703 117179 116155 115237 114724 113828 112160 110700
55121 110700 110333 110513 110232 109309 107973 106201 104235 102801 102081 101302 99954 98529 97533 96705 95840 95512 96345
55104 96345 98260 100779 103242 104564 104004 102570 102409 104214 106434 107596 107994 108149 107040 103439 98321
55089 98321 94424 93463 94696 96275 97343 98677 101491 105688 109482 111028 110205 108269 106215 104344 103081
55074 103081 102953 103684 104455 105223 106753 109133 111302 112332 112319 111902 111653 111836 111885 110431 107033 103574 102537
55057 102537 104122 106580 108985 111758 114508 115810 115662 116077 118324 121306 123454 124607 125290 125804 126753
55042 126753 128811 131201 132148 131589 131499 132617 132965 130890 127582 125134 123967 123749 124928 127430 129486 129925
55026 129925 130234 132172 134525 134629 132361 130276 130152 131422 132783 133492 133188 132201 131996 133789 136747 138933
55010 138933 139940 141163 143499 146116 147674 147656 146356 144544 143212 142916 143251 143432 143105 142154 140375 138096
54994 138096 136456 136175 136538 136415 135704 134963 134309 133603 132961 132141 130305 127543 125674 126116 127745 128410 127890
54977 127890 127635 128139 128521 128512 128960 130150 131330 132245 133582 135400 136507 136061 134723 133633 133123 133043 133583
54960 133583 135096 137462 140110 142533 144622 146553 148229 148948 148244 147222 148018 151200 154597 155704 154467
54945 154467 152565 150764 148611 146278 145031 145708 148014 151354 155104 158077 159139 158663 158220 158581 158982
54930 158982 158551 157399 156108 155157 155010 155787 156734 157001 156926 157332 157610 156067 152528 148964 146769 144926 141898
54913 141898 138188 135750 135682 137592 140510 143250 144425 143439 141351 139816 139330 139325 139717 141257 144284 148106
54897 148106 151859 155198 157954 159932 161462 163415 166099 168636 170075 170807 172252 175367 180067 185885
54883 185885 192398 198895 204488 209017 213367 218552 224980 232918 242955 255218 268493 280974 291822
54870 291822 301428 310245 317930 323495 325809 324214 319199 312191 304056 294216 282126 269062 257156
54857 257156 246873 236860 226366 216371 207997 201288 196077 192593 190514 188744 187103 187005 189361 192804
54843 192804 195241 196448 197884 200505 203884 207191 210066 212701 215730 219777 224729 229979 235770 243390
54829 243390 253421 264707 275816 286511 296798 305537 311290 313839 313638 310427 303697 294099 283098
54816 283098 271629 260183 249598 240342 231432 221514 210853 200964 192578 185384 179472 175307 172226
54803 172226 168703 164532 161299 160111 160091 159784 158958 158289 158060 157938 157567 156836 155898 155134 154768 154397 153418 151895
54785 151895 150442 149247 147895 146223 144608 143230 141685 139589 137171 135145 134327 135219 137364 139186 139207
54770 139207 137546 135709 134814 134560 134032 132930 131841 131667 132940 135424 138300 140889 143039 144728 145699
54755 145699 145812 145359 144658 143785 143022 142947 143555 143972 143755 143843 145344 147877 150010 150993 151231 151469 152418 154772
54737 154772 158603 162843 166137 168019 168846 169268 170408 173614 178989 184873 189941 195008 201553 209426 217652
54722 217652 226683 237816 250797 264053 277098 290645 304360 316625 326734 335217 341683 344523
54710 344523 343488 340415 336510 330905 323116 314924 308173 302214 295303 287419 279963 273457 267360 261797
54696 261797 257788 255673 254545 253581 253166 254423 257925 262882 267476 270308 271779 273730 277662 283780 291657
54681 291657 300881 310749 320384 329894 340653 353647 368002 381746 393587 403445 411711 418523 423334
54668 423334 424763 421443 413552 403017 391692 379852 366999 353492 340412 328027 315335 301404
54656 301404 286772 273289 262613 254888 248914 243637 239198 236237 234535 232990 230866 228400 226153
54643 226153 224423 223396 223235 223794 224648 225320 225047 222694 217872 212044 207532 205313 204693 205055 206689 209612
54627 209612 212813 215221 216496 216526 215195 213231 212231 213032 214717 215813 215774 214855 213463 212371 212807 215404
54611 215404 219333 223014 225423 226597 227401 229024 231993 235484 238311 240534 243048 245612 246883 246811 247265
54596 247265 249352 251673 252549 252590 253523 255555 257533 258939 259936 260058 258740 256960 256612 258091 260095 262067
54580 262067 265280 270881 278173 285604 292483 298851 304449 309000 313388 319601 329037 341053 353454 364396
54566 364396 373709 382243 390137 396157 398880 398171 395152 390863 385225 377363 366862 354656 342556 331791
54552 331791 322296 313580 305733 299059 293272 288043 283966 281793 280854 279566 277611 276023 274805 272195
54538 272195 267311 261921 258232 256093 253878 251060 248197 245027 240610 235286 230710 227635 225004 221614
54524 221614 217467 213116 208875 205142 202458 200559 198300 195204 192303 190553 189087 186147 181577 177207
54510 177207 174535 172959 170872 167866 165035 163369 162725 162527 162654 163144 163516 163066 161628 159663 157726 156166
54494 156166 154994 153689 151591 149053 147709 148861 151940 155235 157694 159146 159390 158466 157564 158107 159874
54479 159874 161425 162505 164405 167577 170621 172400 173621 175315 177079 178049 178572 179729 181954 185077 188958
54464 188958 193120 196640 199408 202682 207303 212274 216346 220148 225218 231383 236591 239183 239160 237439 235029
54449 235029 232753 230678 227846 223532 218546 214241 210513 206045 200527 195366 191898 189910 188374 186836
54435 186836 185606 184946 184392 182828 179363 174439 169803 167093 166701 168086 170323 171883 171028 167709 164373
54420 164373 163474 164523 164954 163721 162517 163266 165839 168770 171084 172717 173886 174802 175646 176456 177307 178637
54404 178637 180766 182892 183261 180958 177277 174795 175016 177142 179279 180639 182158 184766 187672 189150 188831
54389 188831 188039 187582 186474 183665 180083 177813 177753 178992 180180 180587 180071 178987 177998 177402 176775 175695
54373 175695 174327 172767 170576 167817 165862 166046 167955 170104 171915 173853 175899 177202 177265 176386 174880
54358 174880 172789 170455 168578 167608 167625 168539 169756 170229 169844 170302 173382 178486 183066 185371 185691 185212
54342 185212 184937 185672 187653 190002 191700 193161 195725 199702 204255 209239 215414 222417 228147 231012 231646
54327 231646 231653 231733 231841 232228 233249 234546 235101 233917 230558 225543 220316 216153 212946 209747 206372 203543
54311 203543 201581 200212 199746 200914 203091 204181 203063 200977 199688 199424 199462 199523 199441 198481 196284 193864
54295 193864 192543 192465 193162 194801 197457 199571 198768 194522 189031 185188 184395 186311 189725 193287 196029
54280 196029 197765 198953 200148 201747 204076 207221 210726 213783 215836 216830 216966 216468 215524 214152 212146
54265 212146 209447 206564 204275 202698 200883 197694 193270 189293 187452 187586 187803 186590 184394 182719 182034
54250 182034 181189 178847 174946 170632 167012 164155 161201 157507 153646 150871 149558 148790 147803 147050 147152
54235 147152 147505 146994 145651 144528 144116 143967 143809 143916 144296 144494 144339 143980 143108 141154 138508 136519 135945
54218 135945 136254 136685 137059 137205 136647 135537 135071 136201 138309 139708 139212 137074 134800 134172 135859 138863
54202 138863 141747 144190 146578 148409 148569 147384 146934 148588 151371 153511 154576 155172 155479 155184 154342 153270
54186 153270 151965 150413 149122 148580 148467 148085 147346 146759 146654 146881 147037 146631 145300 143327 141610 140816 140940
54169 140940 141944 144223 147851 151851 154847 156297 156634 156549 156551 156960 157822 158947 160295 162102 164387 166655
54153 166655 168333 169235 169373 168649 167029 164926 163245 163041 164797 167706 169977 170449 169676 168901 168547 168582 169643
54136 169643 172172 174681 174773 172218 169269 167340 165235 161639 157670 155438 155264 155834 156179 156066 155158 153387
54120 153387 151728 151260 151751 152315 153032 154629 156787 158121 157862 156613 155388 154842 155349 156864 158640 159821
54104 159821 160365 160791 161225 161452 161712 162565 164031 165564 166825 167694 167669 166166 163524 160912 159026 157554
54088 157554 156117 155060 154850 155142 154999 154029 152959 152773 153342 153316 151739 149314 147387 145965 143837 140691
54072 140691 137765 136024 135019 134319 134748 136908 139428 140179 138803 136825 135599 135297 135549 135860 135516 134201
54056 134201 132716 132213 132866 134115 135761 137711 139025 138708 137484 137355 138988 140740 140758 139048 136946 135439
54040 135439 134719 134737 135408 136396 137104 136859 135203 132429 129880 129195 131017 134571 138334 140824 141150 139747
54024 139747 138638 140054 144313 149412 152983 154252 153944 152879 151245 149039 146665 144788 143739 143355 143524
54009 143524 144625 146957 149886 152134 153115 153431 153925 154839 156228 158450 161637 165059 167533 168267 167250
53994 167250 165408 164564 166249 170011 173660 175679 176577 177428 178321 179187 180840 183769 186790 188508 189584
53979 189584 192013 196490 201961 207453 212827 217902 222451 227222 233528 241492 249841 257571 264781 271800
53965 271800 278643 285493 292683 300054 307174 314040 320551 325724 328904 331508 335750 341527 346418 349193
53951 349193 351375 354495 357575 358602 357264 354925 352695 350621 348233 345076 341140 337106 333546 329696
53937 329696 324237 317649 312315 309512 307698 304909 301522 299141 297692 295355 290938 284878 278137 271449
53923 271449 265625 261398 258764 257150 256173 255619 255017 254116 253544 254065 255301 256089 256042 255889 256253 256979 257800
53906 257800 258798 259926 260819 261389 261971 262429 261689 258793 254237 249779 246883 245620 245157 245013 245436 246505
53890 246505 247335 246891 245617 245504 247989 252221 256078 258619 260758 263502 266477 268771 270628 273427 278089
53875 278089 284298 291442 299506 308441 317293 324990 331803 338976 346664 353303 357529 359826 361461 362660
53861 362660 362878 362324 361925 362025 362391 363474 366325 370958 375993 380498 385235 391490 399458 408442 417844
53846 417844 427146 435420 441816 446561 450891 455943 461895 468012 473291 477231 480080 482180 483122 481988
53832 481988 478559 473848 469261 465603 462939 460841 458540 455256 450546 444053 435083 423326 410129 398179
53818 398179 389305 383058 377728 372097 365837 359027 352046 345505 339568 333613 327074 320306 314086 308541
53804 308541 303068 297142 290749 284206 277901 272073 266634 261436 256817 253306 250511 247025 242110 236934
53790 236934 233302 231431 229890 227747 225815 225361 226202 226761 225853 223849 221828 220041 217737 214467 210840
53775 210840 207655 204871 202036 199327 197395 196401 196008 196116 196663 196835 195654 193554 192241 192555 193524 194105
53759 194105 194827 196824 200067 203478 206314 208576 210440 212069 213642 214947 215243 214197 212664 211943 212596
53744 212596 214589 218095 223244 229312 235110 240318 245756 252177 259312 266277 272552 278341 284151 290160
53730 290160 296072 301651 307231 313281 319538 325188 330060 334865 339854 343895 345534 344567 342029 339069
53716 339069 336420 334542 333586 333253 333135 332997 332531 331257 329124 326750 324586 322295 319482 316522 313980
53701 313980 311692 309271 307245 306663 307572 308557 308034 305613 302282 299746 299430 301492 304555 306699 306876 305333
53685 305333 302980 300557 298138 295137 291100 286674 283295 281472 279861 276682 271775 266707 263021 260910
53671 260910 259473 257763 255623 253753 252843 252635 252241 251469 251085 251502 252060 252140 252116 252434 252556 251868 251048 251419
53653 251419 253280 255895 258738 261709 264379 266223 267509 268942 270566 272127 274319 278253 283492 288009
53639 288009 290718 292916 296393 301008 305026 307398 308772 310324 312383 314461 316229 317991 320101 322356
53625 322356 324454 326880 330552 335372 339894 342899 344581 345550 345528 343959 341415 339274 338273 338237 338852 339707
53609 339707 339921 338857 337162 336121 336104 336620 337576 339263 341225 342440 342797 343087 343397 342683 340243 336594
53593 336594 332705 329481 328072 329292 332218 334666 335639 336240 337731 339923 342028 343807 345112 345543 345430
53578 345430 345932 347245 347913 347113 346452 348057 351771 355724 358959 361831 364325 365865 366862 368782 372288
53563 372288 376518 380537 384432 388567 392703 396323 399135 400934 401737 402380 404142 407351 411111 414976 420100
53548 420100 427811 437405 446360 452895 457680 462797 469380 476583 482612 486548 489133 491964 495972 500672
53534 500672 504956 508580 512690 518676 526547 534750 541608 546677 550510 553524 555529 556296 556180 556171 557507
53519 557507 560989 566251 571769 576041 578734 580331 580906 579976 577610 574929 573216 572996 574115 576110 578228
53504 578228 579734 580532 581026 581102 580042 577932 576373 576966 579506 582489 585059 587570 590365 592973 594891
53489 594891 596492 598773 602394 607214 612589 618026 623526 629217 634777 639651 643983 648826 654896 661544
53475 661544 667603 673022 678903 685907 693398 700408 706972 714214 723405 735110 748857 763474 778005
53462 778005 792454 807390 822805 837854 851985 865935 881267 899130 919737 942666 967135
53451 967135 992098 1016777 1041409 1067135 1094764 1123708 1152398 1179795 1206400 1233824 1263454
53440 1263454 1295542 1329435 1364581 1401103 1439237 1478288 1516665 1553361 1589070 1625233 1662031
53429 1662031 1698079 1732346 1765609 1799344 1833716 1867547 1900070 1931864 1964006 1997088 2031272
53418 2031272 2066410 2101477 2134568 2164368 2191678 2218829 2247388 2276694 2304746 2330281 2353819
53407 2353819 2376785 2399826 2421984 2441404 2456738 2467991 2476296 2483002 2488649 2492430 2492696 2488241 2479172
53394 2479172 2466512 2451340 2434634 2417497 2400584 2383161 2363556 2341076 2317068 2293551 2271112
53383 2271112 2248588 2224611 2198865 2171906 2144451 2117230 2091118 2066679 2043451 2020081 1995584
53372 1995584 1970456 1946278 1924416 1905392 1889441 1876903 1867743 1861129 1855998 1851832 1848568 1846175
53360 1846175 1844750 1844604 1845666 1847134 1848512 1850782 1855738 1864258 1875920 1890160 1906782 1925286 1944760
53347 1944760 1964925 1986485 2010013 2035177 2061501 2089283 2119366 2152481 2188977 2228477 2269585
53336 2269585 2310907 2352925 2398052 2448225 2503178 2561605 2622896 2686672 2751564 2816017 2880058
53325 2880058 2945064 3011932 3080606 3151197 3224085 3298659 3373215 3446633 3519145 3590888 3660663
53314 3660663 3727090 3790361 3851775 3911613 3968316 4019909 4065586 4105601 4140153 4169041 4192324
53303 4192324 4210593 4224220 4232752 4235529 4232536 4223993 4209294 4187349 4158155 4123036 4082859 4037072
53291 4037072 3985400 3929634 3872412 3814663 3755570 3694997 3634401 3574824 3515311 3454432 3392891
53280 3392891 3333571 3278896 3228656 3180432 3131767 3081803 3031128 2980551 2930409 2880934 2832708
53269 2832708 2786385 2742314 2700825 2662519 2627629 2595327 2564418 2534731 2507166 2482329 2459799
53258 2459799 2438854 2419192 2400529 2382091 2363027 2343007 2322146 2300709 2279169 2258192 2238123
53247 2238123 2218709 2199585 2180821 2162862 2146264 2131685 2119800 2110947 2105116 2102295 2102286 2104072 2106156
53234 2106156 2108045 2110780 2115448 2121852 2129453 2139002 2152078 2169177 2189349 2211672 2235896 2261405
53222 2261405 2286826 2311481 2336429 2363195 2391861 2421063 2449431 2476337 2501567 2525240 2547986
53211 2547986 2570280 2591248 2608770 2621260 2629049 2633659 2635906 2635138 2630338 2621631 2610391 2597892 2584171
53198 2584171 2568470 2550462 2530412 2508140 2482788 2454204 2423901 2393664 2363609 2332610 2300505
53187 2300505 2268694 2238252 2208540 2178202 2146632 2113859 2079891 2045224 2011456 1980324 1952141
53176 1952141 1925812 1900129 1874409 1848224 1821496 1794894 1769374 1745228 1722198 1700397 1680335
53165 1680335 1661913 1644161 1626277 1608362 1591006 1574724 1559920 1546721 1534494 1522073 1508790
53154 1508790 1494930 1481044 1467283 1453504 1439353 1423947 1406164 1385803 1364100 1342579 1321543
53143 1321543 1300045 1277228 1253487 1230384 1209360 1190411 1172232 1153981 1136361 1120252 1104814
53132 1104814 1088200 1070046 1051771 1034044 1015483 994668 972179 949627 927776 906824 887564
53121 887564 870675 855205 839115 821361 802602 784145 767060 751894 738179 724515 710131
53110 710131 696112 683972 673353 662459 650578 638772 627927 617584 607087 596647 586718 577348
53098 577348 568654 560947 553873 546412 538317 530589 523858 517270 509821 501950 494720 488124 481435 474848
53084 474848 469486 465659 462191 457790 452367 446691 441396 436726 432888 430069 428155 426639 424847 422185
53070 422185 418369 413747 409382 406414 404927 403659 401326 398251 396049 395531 395614 394750 392679 390020 386881
53055 386881 383046 379213 376652 375488 374484 372802 370841 368999 366752 363644 360222 357212 354578 352095
53041 352095 350066 348598 346893 344164 340807 337849 335751 334512 334230 334528 334077 332051 329689 328992 329942
53026 329942 330448 329225 327351 326543 327126 328321 329556 330732 331883 333290 335494 338647 342177 345341 347703
53011 347703 349072 349741 350876 353609 357346 360060 360894 361259 362374 362907 360615 355575 350076 345578 341564
52996 341564 337407 333535 330143 326356 321658 317001 313324 309875 305188 299270 293548 288846 284515 279733
52982 279733 274804 270911 269066 269415 271089 272606 272868 271940 270541 268877 266523 263518 260928 259799 259871
52967 259871 259743 258239 255368 252016 249030 246685 244841 243354 242175 241223 240461 240109 240473 241347 241922 241589
52951 241589 240600 239614 238921 238590 239077 240933 243836 246567 248160 248650 248509 247823 246356 244088 241459 239308
52935 239308 238586 239604 241321 241944 240733 238904 238237 239059 240146 240509 240576 241392 243085 244653 245276 245358 245935
52918 245935 247214 248218 248045 246925 245550 243773 240844 236924 233621 232638 234247 237202 239854 241390 242481
52903 242481 244661 248426 252013 252971 251151 249154 249330 251282 253002 253522 253397 253281 253354 253944 255526 257910
52887 257910 260326 262473 264779 267532 270528 273744 277585 282075 286442 289989 292954 295986 299036 301368
52873 301368 302778 304309 307397 312374 318186 323575 328055 331537 333694 334662 336016 339774 346044 352601
52859 352601 357212 359549 360470 360636 360775 362157 365306 368649 369833 368303 365526 362751 359839 356436 353273
52844 353273 351783 352864 356127 359859 361935 361425 359245 356741 354123 351164 348891 348985 351294 353248 352352
52829 352352 348562 343866 340339 338957 339523 341215 343468 346413 350016 353166 354496 354045 353020 351948 350263
52814 350263 347968 346321 346242 347128 347977 348829 350302 352386 354420 355792 356205 355784 355275 355430 355806 354935 352213
52797 352213 348990 347287 347958 350355 353052 354661 354798 354585 355361 356742 357155 356513 356771 359133 362264 364299
52781 364299 365184 365834 366408 366952 368480 371554 374688 376010 375886 376101 377009 377446 377062 376690 376430 375301 372980
52764 372980 370166 367068 363235 359097 355950 354085 352695 351888 352745 354697 355095 352706 349876 349475 351031
52749 351031 351680 350186 348192 347877 349795 352894 355486 356292 355518 354790 355283 356223 356052 354641 353286 352775
52733 352775 352586 351893 350229 347106 342159 336044 330265 325627 321508 317073 312492 308548 305647 303731 302569
52718 302569 301536 299557 296123 292188 289324 287898 286715 284602 281770 279266 277561 276250 274895 273524
52704 273524 272164 270453 268085 265346 262779 260395 257636 254212 250634 247740 245803 244247 242176 239152
52690 239152 235534 232128 229398 227052 224511 221758 219504 218372 218156 218094 217750 217279 216757 215602 213138 209733
52674 209733 206880 205731 205734 205260 203575 201581 200286 199175 196820 192898 188818 186139 184949 184207 183314 182792
52658 182792 183385 184836 185812 185030 182400 179032 176229 174630 174197 174537 174974 174712 173483 171980 171155 171023
52642 171023 170650 169462 168060 167420 167670 168109 168254 168324 168683 169327 170126 171188 172525 173510 173168 171206 168498
52625 168498 166343 165448 165832 167366 169770 172151 173244 172537 170815 169305 168590 168660 169536 171190 173058 174346
52609 174346 174973 175671 176977 178613 180136 181677 183582 185605 187097 187982 189026 190887 193324 195734 198088
52594 198088 200729 203302 204730 204702 204553 205890 208618 211101 212195 212246 211968 211304 209879 207883 205881 204203
52578 204203 203023 202477 202091 200647 197510 193842 191589 191255 191356 190187 187607 184967 183648 183751 184053 183406
52562 183406 182294 182423 184352 186271 186014 183760 181632 180976 181378 182205 183499 184886 185114 183723 182209 182437
52546 182437 184375 186271 186692 185641 183959 182420 181379 180767 180390 180405 181274 183041 185073 186817 188410 190218
52530 190218 192232 194275 196266 197795 198046 196891 195651 195891 197673 199773 201452 203127 205213 207274 208741
52515 208741 209843 211284 213335 215700 218074 220374 222373 223502 223414 222770 223062 225197 228318 230514 230735
52500 230735 229506 227742 225737 223722 222491 222544 223192 223609 224377 226715 230259 233057 234128 234748 236435 238736
52484 238736 240079 240082 239782 239968 240653 242159 245296 249789 253574 254709 253617 252607 253320 255372 257352 258339
52468 258339 258326 258002 258511 260705 264042 266866 268471 270269 273825 278111 280236 279179 277404 277910 280692
52453 280692 283249 283959 283662 283962 285151 286153 285817 283921 281300 279288 278728 279422 280666 282069 283432 284132
52437 284132 283403 281403 279353 278309 278186 278166 277711 277063 277079 278630 281740 285226 287696 288985 290073 291504
52421 291504 292665 292868 292378 291780 290972 289547 287887 287120 288046 290467 293456 295950 297422 298330 299600 301249
52405 301249 301983 300774 298462 297038 297555 299385 301265 302295 302107 301146 300865 302616 305997 309108 310749
52390 310749 311586 312803 314538 316283 317979 319821 321516 322641 323424 324374 325378 325946 326166 326528 326865 326393
52374 326393 325018 323756 323505 324031 324644 325292 326318 327399 327439 325776 323098 320843 319734 319211 318550 318289
52358 318289 319909 323714 327554 328490 325830 321907 319687 320127 322138 324439 326650 328751 330343 330933 330646
52343 330646 330248 330418 331164 332030 332676 333118 333601 334591 336806 340715 345662 349916 352121 352625 353003 354432 357013
52326 357013 360402 364234 367693 369502 369068 367359 366107 366179 367076 367892 368317 368668 369337 370402 371565 372275
52310 372275 372059 371001 370043 370545 373142 376903 379963 381385 382275 384671 389357 395141 400319 404358 407874
52295 407874 411401 414751 417653 420569 424377 429187 433834 437040 438968 441141 444677 449188 453616 457445
52281 457445 460569 462779 464366 466683 470822 475945 480176 483226 486781 492042 498257 504346 510679 518228
52267 518228 526916 535873 544717 553622 562595 571619 581102 591317 601780 611945 622113 632853 643995
52254 643995 655164 666914 680362 695901 713090 731552 751122 771516 792958 816817 844222
52243 844222 874021 903414 930947 957914 986573 1017980 1051782 1086996 1122450 1157340 1191895
52232 1191895 1226906 1262410 1297740 1333019 1369408 1407271 1445264 1482032 1517715 1552747 1586118
52221 1586118 1616263 1643237 1668619 1693365 1716939 1738614 1758392 1776290 1791734 1804212 1813796
52210 1813796 1820456 1823609 1823217 1820907 1818935 1817925 1816440 1813036 1808010 1802573 1797056 1791020 1784919 1780468
52196 1780468 1778915 1779713 1781415 1783353 1785988 1790223 1796947 1806649 1818694 1831491 1844149 1857632 1873449
52183 1873449 1891784 1911950 1934182 1959377 1986916 2014293 2039498 2062727 2085201 2107332 2128682
52172 2128682 2148831 2167419 2183870 2197720 2208789 2216716 2221028 2222067 2221018 2218460 2213595 2205478 2194076
52159 2194076 2179427 2160927 2138770 2115211 2092758 2071258 2048266 2022274 1994222 1965620 1936747
52148 1936747 1907439 1878455 1850907 1824895 1799685 1775064 1751670 1729919 1709296 1688963 1668772
52137 1668772 1649471 1632064 1617138 1604640 1594059 1584753 1576272 1568484 1561403 1554926 1548816 1542855 1536856
52124 1536856 1530570 1523984 1517772 1512942 1509683 1506926 1503480 1499239 1494770 1490215 1485441 1480939 1477413 1474345
52110 1474345 1470010 1463438 1455617 1448266 1441974 1435970 1429312 1421881 1414451 1407914 1402232 1396337 1389626 1383205
52096 1383205 1378695 1375957 1373245 1369630 1365760 1361862 1356792 1350069 1343302 1338144 1334011 1329368 1324355 1320379
52082 1320379 1317749 1315544 1313528 1312306 1311467 1309379 1305461 1301375 1299326 1300033 1302693 1305897 1308086 1308088 1305964
52067 1305964 1302900 1299898 1297079 1294532 1293138 1293985 1297261 1302045 1307051 1311603 1316301 1322667 1331593 1342118
52053 1342118 1352353 1361722 1371760 1384629 1401416 1421810 1444658 1468606 1492976 1518441 1546463
52042 1546463 1577831 1612094 1648405 1686206 1724975 1764138 1803725 1844530 1887179 1931390 1976445
52031 1976445 2021854 2067072 2111007 2152394 2190641 2226022 2259125 2290212 2318968 2344788 2367420
52020 2367420 2387130 2403907 2416809 2424780 2428052 2427962 2425176 2418822 2407820 2392580 2375095 2357689 2341714
52007 2341714 2326870 2311530 2294227 2275057 2255240 2235465 2215571 2195992 2178241 2163182 2149835
51996 2149835 2137009 2125595 2118040 2115628 2117173 2120436 2124132 2128603 2135255 2145437 2159259 2175302 2191829
51983 2191829 2208272 2225150 2242722 2260488 2278037 2295580 2313235 2330337 2345948 2359732 2371803
51972 2371803 2381907 2389308 2393508 2394719 2393475 2389968 2383928 2375085 2363608 2350042 2334760 2317518 2297622
51959 2297622 2274629 2248715 2220237 2189207 2155649 2120387 2084832 2049620 2013875 1976319 1936794
51948 1936794 1896152 1854981 1813232 1771006 1728762 1686526 1643842 1601004 1559460 1520239 1482584
51937 1482584 1445011 1407336 1370750 1336091 1302881 1269997 1236594 1202349 1167565 1133117 1099748
51926 1099748 1067344 1035407 1004172 974521 946708 919873 893053 866173 839807 814512 790675
51915 790675 768583 748277 729403 711255 692905 673686 654108 636067 621350 609822 599630
51904 599630 589194 578318 567409 556607 546154 536792 529005 522157 514934 506662 498020 490512 485205
51891 485205 481724 478559 474651 470418 466823 463818 460472 456292 451363 445342 437666 429044 421496 416275
51877 416275 412657 409253 405426 400842 394962 388140 382217 378564 375941 371676 364934 357778 352912 351099
51863 351099 350766 349493 345973 341171 337518 336457 336965 336930 335534 333527 331599 329616 327464 325607 324483
51848 324483 324107 324469 325603 326913 327091 325174 321367 316636 311942 308051 305535 304427 304025 303365 301838
51833 301838 299381 296470 294057 293028 293274 293508 292432 290066 287620 286122 285564 285384 285258 284996 284046 281880
51817 281880 279074 277392 278195 280947 283720 285093 285199 285067 285485 286510 287628 288218 288227 288305 288949 289664 289651 289259
51799 289259 289864 292112 295086 297577 299361 300730 301584 301776 301856 302676 304523 307176 310428 313951 317068 319294
51783 319294 320823 321981 322632 322767 323156 324599 326782 328664 329706 329994 329570 328574 327739 327646 327651 326736 325394
51766 325394 325468 327829 331340 334429 336558 337697 337608 336598 336044 337070 339046 340239 339570 337085 333274 329078
51750 329078 326287 326573 329600 332853 333844 332128 328901 325391 322341 320557 320746 322400 323604 322723 320191
51735 320191 318158 318414 321053 324956 328860 331811 333315 333613 333452 333251 332863 332487 333154 335535 338677 340888
51719 340888 341762 342436 343893 345908 347858 349538 350735 350891 349924 348801 348482 348686 348480 347889 348045 349638
51703 349638 351973 353891 355140 356466 358710 362211 366894 372434 378222 383561 388167 392376 396660 401011
51689 401011 405033 408665 412491 417164 422639 428263 433580 438847 444694 451348 458271 464534 469577 473671
51675 473671 477637 482082 486908 491462 495031 497162 497730 496879 494957 492484 490138 488587 488034 487887 487216
51660 487216 485721 484106 483265 483166 482684 480624 476944 472957 470148 468761 467908 467216 467678 470158 473534 475606
51644 475606 475939 476529 479069 482633 484939 485134 484324 483861 484224 485312 486747 487818 488037 487918 488537 490217
51628 490217 492215 493775 494944 496379 498928 503335 509661 516975 524274 531767 540331 549500 556860 560084
51614 560084 559129 555989 552714 550097 547863 545487 542796 540033 537371 534349 530137 524528 518357 512685
51600 512685 507784 503146 498231 493003 487932 483794 481225 480114 479412 477862 475081 471849 469237 467459
51586 467459 465611 462575 458120 453066 448478 444876 442135 439759 437148 434053 430980 428812 427778 427156
51572 427156 426220 424968 423590 421877 419775 417929 416783 415558 413130 409698 406488 403943 401506 399357
51558 399357 398805 400133 401245 399740 395905 392459 391410 392047 392222 390881 388916 387867 388325 389661 390982
51543 390982 391966 392763 393552 394570 396185 398448 400678 402116 402941 404134 406344 409424 412959 416525 419338
51528 419338 420552 420245 419510 419185 419104 418911 418879 419325 419800 419550 418449 416858 414838 412244 409414 407097 405668
51511 405668 404910 404526 404355 403996 402842 400840 398997 398754 400753 404242 407685 410001 411297 412519 414412
51496 414412 416731 418359 418336 417044 416311 417778 420877 423010 422290 419695 417761 417523 417760 417239 416543 417129
51480 417129 419329 421968 423584 423545 422249 420648 419513 418932 418536 418060 417407 416444 415396 415408 417931 423272
51464 423272 430245 437315 443487 448136 450989 452679 454454 456794 458939 460043 460074 459124 456858 453323 449551
51449 449551 446510 444058 441570 438893 435941 432099 427047 421630 416948 413136 410007 408258 408625 410168
51435 410168 410856 409924 408477 407665 407467 407518 407863 408358 408358 407709 407334 408132 409709 410824 410875 410693 412081 416583
51417 416583 424158 432861 440253 445338 448758 451327 453260 455024 457815 462420 468210 474082 479914 486291
51403 486291 493081 499255 504118 507963 511299 514127 516288 517976 519473 520766 521864 523207 525174 527306
51389 527306 528706 529347 530399 532875 536499 540342 544019 547427 549701 549691 547731 545866 545654 546386 546231 544556
51373 544556 542329 540550 539210 537784 535957 533625 530636 526842 522272 517239 512360 508217 504774 501361
51359 501361 497580 493944 491195 489265 487350 484949 482313 479940 477985 476172 474107 471818 470086 469859
51345 469859 471145 472941 474503 475990 477556 478782 479759 481587 484573 486882 486679 485030 484711 486239 487249
51330 487249 486037 483498 480621 476272 469103 460134 451589 444176 437301 431211 426843 423662 419594 413587
51316 413587 406962 401664 398109 395131 391285 385818 379006 371910 365476 359912 355300 352358 351501 351248 348895
51301 348895 343307 336148 329884 325432 322303 319998 318322 317022 316116 316125 316970 317065 314776 310659 307179 306036
51285 306036 306771 308094 309263 309611 308032 304219 299758 296712 295315 294151 292534 291515 292205 294072 295461
51270 295461 295186 293162 290212 287864 287810 290669 295348 300129 304227 307915 311514 314954 318072 320594 321909
51255 321909 321739 321106 321764 324288 327342 329164 329219 328052 326233 324040 321700 319172 315910 311423 305962
51240 305962 300227 294642 289458 285200 282276 280201 278076 275906 274660 274805 275573 276076 276329 276453 275600 272716
51224 272716 268078 263028 258169 252921 247187 242364 239898 239500 239731 239991 240872 242557 243939 243823 242302
51209 242302 240418 238948 238054 237695 237713 237641 237084 236329 236066 236403 236657 236232 235230 234042 232899 232143 232497 234448
51191 234448 237569 240852 243601 245592 246652 246755 246491 246676 247196 246940 245337 243425 242787 243796 245565 247284
51175 247284 248697 249367 248601 246619 244968 245026 246516 248032 248695 248658 248343 247979 247838 248191 248867 249378 249595 249956
51157 249956 250983 252976 256039 259832 263279 265214 265553 265325 265346 265413 265019 264231 263489 263097 263329 264525 266550
51140 266550 268594 270024 271132 272542 274231 275824 277580 280348 284520 289663 295139 300358 304242 305243
51126 305243 302671 297872 293416 290885 289714 288463 286902 286088 286288 285823 282963 278516 275272 274700 275466
51111 275466 275699 275570 276582 279106 281846 283399 283356 282062 280210 278587 277323 275470 272112 267870 264440
51096 264440 262644 261763 260836 259657 258314 256758 255355 254993 256015 257477 258006 257020 254846 252140 249647
51081 249647 248036 247425 247282 247234 247723 249391 251962 254144 254720 253559 251706 250602 251108 253034 255476 257504
51065 257504 258543 258559 258327 259185 261784 264963 266448 264937 261141 256828 253405 251454 250836 250830 250712 250561 251085
51048 251085 252381 253478 253550 252950 252491 252206 251595 250796 250721 252034 254622 258074 262051 266002 269119 271035
51032 271035 272425 274471 277514 280386 281409 280236 278444 277979 279196 280864 281970 282771 284001 285782 287824
51017 287824 290103 292771 295668 298421 300849 302869 304177 304498 304039 303366 302879 302625 302515 302590 303199 304895
51001 304895 307755 310729 312299 312130 311527 311857 313091 314429 315615 316689 316990 315746 313681 312772 313915
50986 313915 315718 316311 315755 315865 317909 321239 324371 326737 328878 331100 332678 332848 332190 332199 333450 335013
50970 335013 335983 336672 337558 338008 337368 336816 338491 342514 346385 348040 348304 349401 352061 355307 358374 361387
50954 361387 364367 367013 369725 373522 378517 383515 387856 392649 399232 407025 414138 419805 425034 430793
50940 430793 436687 441905 446613 451766 458023 465410 473637 482279 491007 500174 510804 523481 537620
50927 537620 552422 568127 585485 604296 623514 642817 663051 684828 707695 731253 756374
50916 756374 784623 816948 853468 894033 938224 985082 1033699 1084356 1138763 1199063 1266604
50905 1266604 1341403 1422470 1508734 1599883 1696280 1798146 1905253 2017452 2134917 2257437
50895 2257437 2383904 2512908 2643399 2774186 2903060 3026895 3142544 3247400 3339542 3417965
50885 3417965 3482497 3533011 3568834 3589311 3594622 3585658 3563638 3530653 3490099 3445341 3397711 3346692
50873 3346692 3292284 3236399 3181604 3129122 3078494 3028608 2978550 2927761 2875731 2821526 2763694
50862 2763694 2701159 2634324 2564720 2493380 2420052 2344152 2265734 2185151 2102521 2018292 1933937
50851 1933937 1851369 1771902 1696432 1626182 1562247 1504157 1449829 1397524 1347577 1301860 1261804
50840 1261804 1227276 1197136 1170383 1146628 1125768 1107504 1091178 1075963 1061306 1047413 1035393
50829 1035393 1026577 1021274 1018242 1015832 1013687 1012896 1014380 1017768 1022249 1027969 1035765 1045763 1057170 1069530
50815 1069530 1083322 1098808 1115091 1131143 1147423 1165662 1187109 1211800 1239518 1270424 1304213
50804 1304213 1339628 1375888 1414264 1457097 1505182 1557266 1612537 1672651 1740367 1816815 1901204
50793 1901204 1993075 2093726 2205072 2328012 2462470 2608527 2766887 2938590 3124844 3326896
50783 3326896 3545355 3779472 4027402 4287178 4557112 4835399 5119877 5408209 5697581
50774 5697581 5983659 6260141 6519841 6756335 6964577 7140409 7280189 7381237 7442539 7464928
50764 7464928 7450606 7402492 7324134 7220419 7098048 6964493 6825884 6686175 6548542 6416725
50754 6416725 6293895 6180494 6074338 5973052 5875224 5778779 5679563 5572834 5455740 5327446
50744 5327446 5187362 5034662 4869771 4695165 4514015 4328440 4139537 3948822 3759150
50735 3759150 3574058 3396206 3226382 3064098 2909245 2763041 2627352 2503435 2391526
50726 2391526 2291023 2200443 2117658 2041139 1971013 1908328 1853205 1804303 1760028 1719608 1682970
50715 1682970 1650289 1621746 1597046 1575006 1554262 1534515 1516423 1500197 1485068 1470326 1456024
50704 1456024 1442419 1429592 1417968 1408230 1400116 1392213 1383745 1375874 1370413 1367761 1366791 1366306 1365975 1366512
50690 1366512 1369661 1377342 1389897 1405691 1423289 1443446 1467912 1496962 1529554 1565535 1606093 1651889
50678 1651889 1702282 1756843 1816352 1881615 1952208 2027257 2106861 2192163 2284400 2384295 2492060
50667 2492060 2607682 2731513 2864565 3007479 3158969 3315957 3475641 3636811 3798625
50658 3798625 3958664 4112877 4257274 4389140 4506791 4608411 4691064 4750686 4783426 4787558
50648 4787558 4764281 4716871 4649449 4566436 4472360 4371450 4267406 4163680 4063594 3969863
50638 3969863 3884181 3807313 3739069 3677922 3621278 3566755 3512908 3458200 3399753 3334092 3259264
50627 3259264 3175578 3084182 2985746 2881087 2772356 2662569 2553799 2446560 2341334 2240144
50617 2240144 2145927 2060440 1983362 1913451 1850022 1793059 1742551 1698339 1660392 1628715 1603101
50606 1603101 1583283 1569117 1560186 1555452 1553845 1555097 1559418 1566419 1574995 1584434 1595063 1607641 1622591
50593 1622591 1640068 1660404 1684156 1711793 1743284 1777705 1813439 1849449 1886567 1927128 1973221
50582 1973221 2025646 2084349 2149009 2218906 2293071 2371084 2453159 2538915 2626571 2713948 2799944
50571 2799944 2884643 2968365 3050990 3131582 3208029 3277603 3338723 3391799 3437599 3475319 3503382
50560 3503382 3521777 3532216 3535879 3532492 3522088 3506243 3486655 3463709 3437825 3411423 3387959 3369151
50548 3369151 3354506 3343539 3336963 3335327 3337947 3344011 3353552 3366128 3379317 3389849 3395859 3396735 3390863
50535 3390863 3374954 3346169 3304033 3249808 3184687 3109219 3024164 2931574 2835137 2739204 2646626
50524 2646626 2557329 2469695 2383420 2300099 2220978 2145557 2073193 2004747 1941355 1882610 1827520
50513 1827520 1776688 1731765 1692933 1658593 1627854 1601691 1580982 1564713 1551111 1539786 1531907
50502 1531907 1528711 1530486 1536565 1545694 1556756 1569655 1585280 1604245 1625908 1648987 1672900 1698251
50490 1698251 1726275 1757976 1793461 1831790 1871851 1913647 1958389 2007009 2058906 2112421 2166262
50479 2166262 2220119 2274203 2328791 2384255 2441272 2500835 2564041 2631759 2704493 2782730 2867408
50468 2867408 2959780 3060767 3170633 3289255 3416485 3552267 3696615 3849399 4009875 4176454
50458 4176454 4347167 4520204 4693914 4866799 5037890 5206385 5369968 5524039 5663777
50449 5663777 5786728 5892139 5978109 6041253 6079540 6093650 6084640 6051931 5995074 5916459 5820723
50438 5820723 5712001 5593074 5466822 5337160 5208524 5085347 4971954 4871966 4787581 4719903
50428 4719903 4669697 4637166 4621287 4620172 4631918 4654203 4682993 4712262 4735164 4745196 4736773 4705779
50416 4705779 4650125 4569842 4466859 4344800 4208105 4060426 3904126 3741884 3578098 3417588
50406 3417588 3263169 3115455 2974723 2841794 2717308 2601547 2495134 2398628 2311148 2230641
50396 2230641 2156070 2088266 2028108 1975004 1927870 1886550 1851213 1821148 1795287 1773442 1755993
50385 1755993 1742782 1733432 1728488 1728977 1734689 1744016 1755840 1770615 1788971 1810112 1832468 1855578
50373 1855578 1880433 1908084 1938618 1971519 2006158 2041663 2077112 2112401 2148359 2185281 2221831
50362 2221831 2256346 2288934 2321154 2353616 2385167 2414859 2443342 2471474 2498896 2525442 2553200
50351 2553200 2585305 2622772 2664102 2708306 2756673 2810945 2871073 2935825 3004678 3077899 3155203
50340 3155203 3235308 3316564 3397147 3474850 3547601 3614356 3674878 3728500 3773495 3807672 3829174
50329 3829174 3836743 3829720 3807982 3771660 3720918 3656247 3578896 3490722 3393962 3291709 3188291
50318 3188291 3087977 2992840 2902653 2817484 2739838 2673510 2620627 2580546 2551425 2531936 2521367
50307 2521367 2518784 2522551 2530307 2539162 2546211 2548984 2545061 2531453 2505342 2466076 2415954 2358418 2295802
50294 2295802 2229230 2160032 2090086 2020733 1952230 1884627 1818737 1756015 1697781 1644443 1595061
50283 1595061 1547865 1501924 1458398 1419419 1385616 1355406 1326960 1300141 1276180 1256145 1240244
50272 1240244 1228038 1218686 1211336 1205729 1202171 1200725 1200975 1202919 1207368 1214786 1224415 1235397 1248309
50259 1248309 1264510 1284057 1305178 1325959 1345925 1365896 1386897 1409314 1432581 1455566 1477642
50248 1477642 1499308 1521354 1543615 1565249 1586049 1606529 1626481 1644428 1659121 1671019 1681666
50237 1681666 1691973 1701676 1710089 1716609 1720447 1720623 1716690 1709253 1699476 1688150 1675400 1661204 1645994
50224 1645994 1630655 1616016 1602277 1588809 1574610 1559233 1543331 1527978 1513386 1498661 1482992
50213 1482992 1466514 1449668 1432369 1414687 1397835 1383292 1370962 1359385 1347909 1337467 1328798
50202 1328798 1321144 1313505 1306098 1299629 1293944 1288507 1283607 1279920 1277258 1274805 1272350 1270300 1268658 1266905
50188 1266905 1264768 1262241 1258988 1254549 1249015 1242739 1235709 1228130 1221226 1216246 1212664 1208553 1202785 1195742
50174 1195742 1187827 1178665 1168210 1157401 1147123 1137468 1128623 1121452 1116394 1112586 1109059 1106276 1105636
50161 1105636 1107585 1110890 1113750 1115307 1116215 1117981 1121548 1126480 1131738 1136923 1142085 1146473 1148650 1148187
50147 1148187 1146257 1144011 1141269 1137440 1132830 1128049 1122729 1115813 1106881 1096489 1085493 1074692 1064759
50134 1064759 1055764 1047060 1038320 1030271 1023525 1017014 1008880 999072 989951 983759 980237 977311 973559 969319
50120 969319 965633 962794 960050 956352 951215 945040 938738 932976 927766 922748 917824 913345 909720 906959
50106 906959 904608 901945 898182 892876 886548 880590 875862 871384 865200 856777 847610 838856 829369 817336
50092 817336 803333 790214 779745 770658 760558 748723 736355 724888 715057 707326 702334 700631
50080 700631 702051 705239 707930 708296 706316 703496 701111 699187 697287 695514 694253 693527 693278 693974 696419
50065 696419 701009 707333 714257 720355 724893 728742 733731 740697 748652 756249 763301 770241 776875 782758
50051 782758 788437 795206 803604 813036 822858 832929 842914 851995 859843 867287 875452 884570 894051 903385
50037 903385 912496 921295 929436 936746 943623 950740 958321 965893 972903 979564 986870 995684 1005865 1016471
50023 1016471 1026753 1036785 1047014 1057378 1067226 1076252 1085205 1095261 1106751 1119055 1131819 1145683
50011 1145683 1161506 1179467 1199367 1221184 1244643 1268818 1293044 1317910 1344347 1371920 1398955
50000 1398955 1424292 1447916 1470111 1491227 1512205 1533838 1555162 1574014 1589665 1603434 1616059
49989 1616059 1626160 1632466 1635992 1638257 1638504 1634799 1627464 1619345 1612425 1605686 1596688 1584047 1568030
49976 1568030 1549926 1531426 1513892 1497736 1482852 1469526 1458205 1448478 1439333 1430639 1423416 1418386
49964 1418386 1415211 1413631 1414363 1418069 1424141 1431394 1439616 1449653 1462136 1476803 1493047 1510439 1528421
49951 1528421 1545925 1561762 1575446 1587413 1598285 1607948 1615508 1620158 1621808 1620887 1617940 1613750 1609377
49938 1609377 1605406 1601164 1595258 1586878 1576050 1562625 1545779 1524900 1500462 1473485 1444471 1413440
49926 1413440 1380823 1347662 1314666 1281604 1248072 1214700 1183105 1154508 1128701 1104590 1081522
49915 1081522 1059797 1040039 1022385 1006197 990356 974022 957591 942757 931072 922267 914382 905590
49903 905590 895456 884469 873113 861748 850833 840771 831728 823795 816887 810341 803197 795169 786782
49890 786782 778309 769276 759487 749784 741114 733415 726179 719609 714381 710518 707320 704247 701197 698190
49876 698190 695407 693248 691619 689511 686228 682846 681478 682966 686095 689201 691763 694295 697468 701720
49862 701720 707169 713524 720305 727285 734492 741884 749400 757200 765341 773444 781251 789372 798749 809413
49848 809413 820481 831491 843004 855750 869857 885111 901376 918516 936509 955884 977485
49837 977485 1001470 1027029 1053334 1080190 1107343 1133680 1157862 1179716 1200500 1221607 1243144
49826 1243144 1263996 1283238 1301230 1318994 1336761 1353836 1369959 1385799 1401331 1414426 1422206
49815 1422206 1423609 1419687 1411581 1399340 1382910 1363199 1341514 1318440 1293684 1266732 1237583 1207192
49803 1207192 1177058 1147955 1119303 1090515 1062646 1037540 1015313 993927 971727 949348 928489
49792 928489 909783 892745 877196 863668 852442 842834 833470 823171 811839 800711 791342 784072
49780 784072 777773 771158 763861 756116 748112 740136 732736 726223 720364 714905 709955 705509 701062 696210
49766 696210 691231 686754 683285 681363 681449 682944 683973 683016 680552 678317 677199 676671 676115 675713 675861 676650
49750 676650 678270 681215 685437 689806 693157 695734 698890 703298 708060 711915 714671 716893 718678 719784
49736 719784 720943 723839 729140 735310 740245 743592 746743 750996 756648 763453 770797 777526 782922 788164
49722 788164 795687 806625 819686 832984 846139 860011 875177 891420 908337 925836 944254 964182
49710 964182 985740 1007858 1028818 1047690 1064556 1079316 1091442 1101363 1110853 1121040 1130972 1139289
49698 1139289 1146555 1154545 1163600 1172011 1177953 1180773 1180331 1176327 1168756 1158067 1144313 1126929 1106050
49685 1106050 1083554 1061918 1042006 1022501 1001816 980334 960445 944337 932102 922226 913487 905695
49673 905695 898785 892326 886417 882181 880485 880653 881187 881452 881874 882760 883860 884942 885916 886274 885364 883445
49657 883445 881693 880769 880094 879019 878000 877881 878551 879330 880530 883511 888772 894799 899591 902748 905176
49642 905176 907024 907264 905670 904004 904263 906466 909169 911581 913968 916326 918322 920652 924870 931089 937031
49627 937031 940301 940793 940130 939668 940010 941510 943869 945687 945750 944764 944742 946723 949999 953481 956736 959584
49611 959584 961746 963313 964856 966804 969244 972269 975724 978470 979042 977569 976196 976872 979311 981831 983581
49596 983581 985008 986440 987369 987390 986953 986595 985906 984017 981025 978297 977087 977274 977838 978229 978641 979038 978714
49579 978714 977172 974875 972607 970575 968760 967749 968254 969757 970631 970125 969589 970919 973976 976400 976264
49564 976264 974462 973783 975656 978496 979761 979252 979544 983011 989182 995663 1001179 1006791 1014046 1022748 1031141
49549 1031141 1038065 1044353 1051908 1061632 1072612 1083389 1093740 1104884 1118056 1133286 1149636 1166177
49537 1166177 1182541 1198862 1215578 1233135 1251681 1271154 1291714 1313648 1336623 1359560 1381813
49526 1381813 1404212 1428322 1454763 1482804 1511624 1541324 1572469 1605132 1638822 1673108 1708028
49515 1708028 1744044 1781884 1822320 1865748 1911880 1960020 2009681 2060729 2112846 2165203 2217008
49504 2217008 2268371 2320284 2373755 2429237 2486814 2546271 2606666 2666385 2724328 2780902 2837372
49493 2837372 2894349 2951399 3007859 3063340 3117282 3168597 3215967 3258344 3295380 3327867 3357544
49482 3357544 3385762 3412223 3435512 3454717 3469856 3480937 3487695 3490481 3490432 3488336 3484077 3477675 3470168
49469 3470168 3462970 3456898 3452201 3448941 3446918 3445872 3446184 3448877 3454621 3463299 3474691 3488624 3504086
49456 3504086 3519375 3533988 3549560 3567957 3589030 3611097 3633004 3654782 3676743 3698945 3721314
49445 3721314 3743476 3764584 3783850 3800861 3815008 3825389 3831948 3835842 3837665 3835913 3828324 3814193
49433 3814193 3794354 3769534 3740146 3707163 3671526 3632694 3589246 3541104 3489858 3436704 3381456
49422 3381456 3323915 3264833 3204786 3143238 3079661 3014935 2950818 2888364 2827456 2767557 2708427
49411 2708427 2650231 2593349 2538064 2484340 2432027 2381197 2332093 2284878 2239681 2196675 2155704
49400 2155704 2116016 2076830 2038134 2000795 1966082 1935191 1908532 1884925 1862080 1838652 1815524
49389 1815524 1794520 1776258 1759952 1744700 1730051 1715704 1701660 1688525 1676926 1666892 1658396
49378 1658396 1651775 1646668 1641303 1634288 1626552 1620077 1615131 1610453 1605941 1603251 1603478 1605983 1609886 1615079
49364 1615079 1621190 1627118 1632462 1638205 1645322 1653839 1663877 1676375 1691925 1709889 1729453 1750627
49352 1750627 1773336 1796251 1817351 1835133 1848961 1859131 1867248 1875715 1886096 1898361 1912053 1927429
49340 1927429 1945054 1965051 1987206 2011126 2035997 2060927 2085761 2110764 2135506 2159228 2182376
49329 2182376 2206313 2231152 2255386 2278225 2300737 2323954 2347524 2371148 2395646 2421191 2445983
49318 2445983 2468234 2488403 2508025 2527529 2546860 2567110 2589541 2613662 2638127 2663096 2689874
49307 2689874 2718623 2748226 2778330 2809661 2842274 2875128 2907675 2940539 2974365 3009253 3045563
49296 3045563 3084029 3124780 3167258 3211270 3257068 3304282 3351913 3399731 3448671 3499502 3552023
49285 3552023 3605933 3661599 3719582 3780027 3842816 3907681 3974012 4041335 4110204 4181989 4257461
49274 4257461 4336129 4417095 4499886 4584280 4669955 4756577 4843813 4931143 5018086 5104641 5191091
49263 5191091 5277462 5363684 5449994 5536434 5622069 5705560 5786416 5864838 5940422 6012087 6079501
49252 6079501 6143410 6204014 6259829 6308904 6350753 6386569 6417791 6444688 6466171 6480906 6488881
49241 6488881 6491785 6491502 6488516 6482344 6473157 6462047 6449894 6437136 6424822 6414681 6407564 6402548 6398050
49228 6398050 6393200 6387914 6382647 6378703 6377981 6381476 6388248 6396406 6404937 6414363 6426126 6441620 6461222
49215 6461222 6483702 6506835 6528931 6549528 6568606 6585875 6601050 6613999 6624009 6629633 6629889 6625028
49203 6625028 6615395 6600210 6578332 6549886 6516140 6477958 6435182 6387402 6334467 6276222 6212634
49192 6212634 6144380 6072800 5999070 5923877 5847843 5771614 5695416 5619145 5543106 5468168 5395038
49181 5395038 5323940 5255134 5188993 5125221 5062786 5001330 4941961 4885831 4832374 4779977 4728170
49170 4728170 4677900 4629500 4581715 4533466 4485583 4439857 4396996 4356589 4318560 4283298 4250315
49159 4250315 4218076 4185604 4153366 4122242 4092604 4064935 4040217 4018625 3998580 3978322 3958108
49148 3958108 3939614 3923380 3908305 3893969 3882017 3874196 3869809 3866269 3862029 3858002 3856043 3856763 3859186
49135 3859186 3862047 3864958 3868486 3873561 3880920 3890896 3903405 3917944 3933673 3949786 3966137 3983403
49123 3983403 4002275 4022280 4041880 4060244 4078738 4100020 4125455 4153860 4182944 4211443 4239601
49112 4239601 4268301 4298311 4329921 4362589 4395291 4427975 4462288 4499949 4540600 4582271 4623890
49101 4623890 4666216 4710245 4755899 4802643 4850141 4897792 4944744 4991258 5039216 5090418 5144931
49090 5144931 5201514 5258746 5315169 5369553 5422261 5475557 5531358 5589341 5648218 5707790 5768029
49079 5768029 5826832 5880880 5929046 5973436 6016797 6060239 6103636 6146624 6188486 6228485 6267293
49068 6267293 6307121 6349387 6392818 6434544 6472561 6506607 6537455 6566360 6594761 6623405 6651678
49057 6651678 6678416 6703417 6727534 6751084 6772855 6791303 6806578 6820693 6835446 6850665 6864981
49046 6864981 6877835 6889685 6900446 6909130 6915615 6921568 6928582 6936274 6943367 6949845 6956675 6964022 6971307
49033 6971307 6978697 6986796 6994909 7001522 7006995 7014019 7024488 7037180 7049449 7060188 7070253 7081007
49021 7081007 7093520 7108397 7125208 7142398 7158641 7174137 7189954 7206501 7223190 7239274 7254444
49010 7254444 7268877 7283037 7297023 7309852 7320009 7327132 7332400 7336725 7339330 7338900 7335410 7329757 7322058
48997 7322058 7311531 7297937 7282046 7264418 7244570 7221696 7195750 7167482 7137651 7106324 7072894
48986 7072894 7036880 6998819 6960108 6921798 6883813 6845513 6806560 6766926 6726609 6685971 6646025
48975 6646025 6607779 6571426 6536555 6502912 6470518 6439393 6409732 6382101 6356863 6333567 6311495
48964 6311495 6290576 6271107 6252783 6234821 6217116 6200513 6185791 6173011 6162052 6153075 6146073 6140450
48952 6140450 6135556 6131266 6127665 6124500 6121514 6119013 6117480 6116566 6115078 6112141 6107848 6102485 6095682 6086977
48938 6086977 6076751 6065663 6053284 6038448 6021277 6003617 5986496 5968183 5946110 5920296 5893362
48927 5893362 5867211 5841155 5813602 5784117 5753027 5720112 5684717 5646532 5605491 5561473 5514926
48916 5514926 5467315 5420143 5373789 5327868 5282346 5237622 5193871 5150967 5108849 5067475 5026739
48905 5026739 4986950 4948883 4912806 4878060 4844413 4813311 4786642 4764585 4745780 4729475 4716285
48894 4716285 4706758 4700514 4697220 4697374 4701491 4709354 4720769 4736274 4756142 4779016 4802502 4825329 4848526
48881 4848526 4874325 4904066 4937048 4971154 5004738 5038199 5073650 5112873 5155733 5200796 5247133
48870 5247133 5294933 5344381 5394830 5445548 5496784 5549271 5602950 5657029 5711473 5767536 5826259
48859 5826259 5887176 5949204 6012263 6077034 6143458 6210600 6278089 6346710 6417322 6490103 6565124
48848 6565124 6642713 6722647 6803739 6884970 6966513 7049043 7132537 7216472 7300862 7386332 7473104
48837 7473104 7560239 7645770 7727629 7804883 7878275 7949011 8016891 8080414 8138900 8193354 8244649
48826 8244649 8292011 8334295 8371668 8404656 8432344 8453133 8466836 8474352 8475548 8469333 8456058 8438007
48814 8438007 8416752 8391416 8360428 8323828 8282745 8237494 8187356 8131994 8072141 8008983 7943440
48803 7943440 7875956 7806498 7734721 7660370 7583590 7504975 7425547 7346487 7268315 7190419 7112045
48792 7112045 7033827 6957642 6884820 6815249 6748378 6684164 6622580 6563111 6505684 6451511 6402096
48781 6402096 6357496 6316170 6276569 6238556 6203380 6172436 6145888 6122430 6100788 6081493 6066468
48770 6066468 6056692 6051040 6047879 6046895 6048658 6053144 6059765 6068394 6079336 6092554 6107858 6125620 6146315
48757 6146315 6169430 6193821 6219155 6246000 6274393 6303300 6331805 6360073 6388911 6419193 6451902
48746 6451902 6487662 6525734 6564340 6602562 6641139 6680884 6721315 6761662 6802232 6843525 6884748
48735 6884748 6924760 6964262 7005412 7048971 7093159 7135887 7177108 7218229 7260034 7301951 7342903
48724 7342903 7382145 7419639 7456166 7492870 7530130 7566947 7601743 7633553 7662347 7688753 7713945
48713 7713945 7739251 7764960 7789432 7809919 7824415 7832606 7835237 7832958 7825648 7812578 7793236 7768038
48701 7768038 7737864 7702839 7662212 7615851 7565063 7511245 7454358 7393598 7329037 7261550 7191544
48690 7191544 7119089 7045241 6971894 6900029 6829184 6758957 6690041 6623520 6560202 6501086 6447305
48679 6447305 6398925 6354666 6313518 6275950 6243050 6215467 6193849 6179165 6171399 6168682 6169043 6172714
48667 6172714 6181612 6196788 6217415 6242128 6270199 6301247 6334635 6369518 6405114 6440920 6476977
48656 6476977 6513728 6551287 6589207 6627418 6666676 6707165 6747128 6784108 6817555 6849132 6880310
48645 6880310 6910628 6938562 6963204 6984766 7004284 7023338 7043369 7064660 7086324 7107630 7128918
48634 7128918 7150954 7174038 7198319 7224527 7253632 7285875 7320835 7358548 7399871 7445258 7493624
48623 7493624 7543259 7594047 7648091 7707561 7772344 7840421 7910226 7981682 8055054 8130017 8206268
48612 8206268 8283973 8362828 8441481 8518587 8593698 8666354 8735108 8798441 8855954 8907479 8951720
48601 8951720 8987229 9014365 9034656 9048122 9052672 9046466 9029584 9002980 8967045 8921906 8868090 8806011
48589 8806011 8735455 8656469 8570547 8480300 8387882 8293796 8197114 8096936 7993894 7890002 7786743
48578 7786743 7683934 7581130 7479420 7380368 7283486 7186490 7088364 6990642 6895157 6801988 6710535
48567 6710535 6621182 6534605 6450282 6366998 6284430 6203289 6124330 6048057 5974939 5904905 5836901
48556 5836901 5769908 5704335 5641604 5582353 5525674 5470167 5415318 5361771 5310591 5262270 5216366
48545 5216366 5172276 5130226 5090812 5053433 5016016 4976911 4936528 4896558 4858121 4821266 4785587
48534 4785587 4750466 4715081 4679140 4643644 4610277 4580049 4552864 4528071 4504800 4481993 4458892
48523 4458892 4435708 4413504 4393476 4376380 4362161 4349730 4337578 4325253 4313926 4305007 4298593 4293814
48511 4293814 4290245 4288129 4287548 4288255 4290268 4293835 4298832 4304892 4312108 4320993 4331678 4343702 4356660 4370596
48497 4370596 4385767 4402279 4419651 4436399 4450616 4461768 4471538 4482075 4493685 4505264 4516626
48486 4516626 4529085 4543614 4559638 4575970 4591908 4607109 4621583 4636333 4652806 4670835 4688004
48475 4688004 4702004 4713007 4722947 4733214 4744079 4755724 4768365 4781475 4794217 4806964 4821278
48464 4821278 4837909 4855632 4872651 4888509 4904023 4919977 4936797 4955214 4976124 4999531 5024330
48453 5024330 5049592 5075541 5102893 5131755 5161837 5193357 5226855 5262217 5298821 5336853 5377589
48442 5377589 5421757 5468401 5516090 5564726 5615202 5667642 5721059 5774820 5829484 5885851 5943980
48431 5943980 6003467 6063929 6124556 6183740 6240030 6293518 6345858 6398753 6452455 6505563 6556012
48420 6556012 6602297 6643913 6680791 6712684 6739389 6761325 6779171 6792853 6801558 6805049 6804204 6799742
48408 6799742 6791142 6777708 6760357 6741163 6720964 6698293 6671111 6639077 6603659 6566493 6528153
48397 6528153 6488319 6446566 6402884 6357565 6310657 6261664 6209954 6155448 6098536 6039355 5977818
48386 5977818 5914742 5852250 5792127 5733850 5675161 5614843 5554336 5496253 5441808 5390243 5340361
48375 5340361 5291892 5245227 5200426 5157011 5114802 5074621 5037917 5005517 4976934 4951081 4927520
48364 4927520 4906599 4888372 4871985 4856519 4842119 4829756 4819956 4812242 4805872 4800748 4797390 4796245
48352 4796245 4797191 4799602 4802770 4806232 4809893 4814024 4819124 4825511 4832743 4839652 4845381 4850319 4855546 4861379
48338 4861379 4867123 4872394 4877938 4884675 4892700 4901805 4912239 4924016 4936022 4946984 4957235 4968492
48326 4968492 4981837 4996750 5012022 5026524 5039023 5048658 5056218 5063827 5072454 5080525 5085926 5088761 5091040
48313 5091040 5093941 5096598 5097746 5097535 5097039 5096609 5095565 5093712 5092459 5093739 5097744 5102382 5105387 5106612 5107765
48298 5107765 5110342 5114624 5120434 5127684 5135868 5143965 5151562 5159517 5168993 5180247 5192817 5206455 5221369
48285 5221369 5237780 5255596 5274325 5293066 5310877 5327352 5342645 5356985 5370640 5384142 5397704
48274 5397704 5410352 5420751 5429152 5437325 5445945 5453414 5458314 5461859 5466385 5472243 5477913 5482693 5487252
48261 5487252 5491334 5492976 5491033 5487145 5483935 5482042 5480106 5477222 5474035 5471285 5468477 5464846 5461047 5458787
48247 5458787 5458510 5458212 5455309 5449496 5443115 5438726 5436930 5436583 5436328 5435544 5434519 5434312 5436160 5440552 5447056
48232 5447056 5455088 5464418 5474861 5486275 5499097 5514000 5530586 5547331 5563418 5579638 5596741 5613932
48220 5613932 5630007 5644924 5658811 5670330 5677801 5681606 5683720 5684913 5684105 5680573 5674958 5667467 5656619
48207 5656619 5640770 5620061 5596134 5570529 5543799 5515495 5484645 5450912 5415437 5379670 5343164
48196 5343164 5303648 5259867 5213445 5167250 5122674 5079135 5035521 4991222 4946170 4900637 4854912
48185 4854912 4808870 4762137 4714879 4667969 4622202 4577774 4534607 4492499 4450804 4408900 4367305
48174 4367305 4327489 4290078 4254112 4218591 4183874 4150722 4118778 4086932 4054657 4022120 3989505
48163 3989505 3957149 3925905 3896268 3867223 3836880 3804302 3770071 3735213 3700290 3665458 3630630
48152 3630630 3595392 3559321 3522525 3485438 3448142 3410373 3372199 3334151 3296582 3259304 3222039
48141 3222039 3184768 3147496 3109997 3072084 3034035 2996498 2959830 2923628 2887127 2850238 2814060
48130 2814060 2780008 2748524 2718992 2690736 2663527 2637175 2611506 2587071 2565081 2546072 2529151
48119 2529151 2513085 2497553 2482894 2469248 2456810 2446387 2438813 2433946 2430963 2429365 2428931 2428958 2428531
48106 2428531 2427601 2426976 2427252 2428514 2431170 2436034 2443187 2451545 2460152 2469369 2480090 2492148 2504168 2515036
48092 2515036 2524960 2534864 2545128 2555289 2564836 2573812 2582406 2590427 2597797 2605350 2614306 2624730 2635267
48079 2635267 2644845 2653930 2663424 2673024 2681669 2689261 2696801 2704802 2712653 2719890 2727162 2735333 2744261 2753191
48065 2753191 2762160 2772386 2784994 2799432 2813331 2824332 2832390 2839998 2849653 2861416 2873640 2885770
48053 2885770 2899157 2914792 2931567 2947768 2963441 2979952 2997532 3014684 3030384 3045794 3062945
48042 3062945 3082223 3101993 3120616 3138211 3156185 3175456 3195514 3215222 3234252 3253586 3274612
48031 3274612 3297845 3322679 3348449 3375523 3405015 3437419 3471878 3507031 3542308 3578064 3614794
48020 3614794 3652828 3692654 3734695 3778479 3822818 3867299 3912951 3960737 4009893 4058718 4106777
48009 4106777 4155228 4204927 4255337 4305838 4357094 4410237 4465351 4521885 4580322 4642327 4709106
47998 4709106 4780658 4856931 4938077 5021670 5099827 5161031 5196368 5204139 5188488 5154848 5107890
47987 5107890 5052772 4995494 4940457 4888515 4838633 4790815 4746190 4704723 4664571 4624147 4583698
47976 4583698 4544114 4505146 4465696 4425319 4384277 4342172 4297526 4249231 4197879 4145241 4092574
47965 4092574 4039822 3986360 3932011 3876980 3821006 3763219 3703229 3642019 3581143 3521006 3460512
47954 3460512 3398603 3335558 3272364 3209402 3146571 3084431 3024245 2966619 2910912 2856421 2803542
47943 2803542 2753079 2704827 2657673 2611135 2566056 2523494 2483354 2444525 2406150 2368530 2332870
47932 2332870 2300279 2270914 2243968 2218628 2195050 2174110 2156074 2139826 2123748 2107156 2090604
47921 2090604 2074996 2060949 2048954 2039501 2032507 2026815 2020823 2013859 2006753 2000819 1996428 1992865 1989581
47908 1989581 1986925 1985214 1983628 1980891 1976925 1972829 1969097 1964962 1960068 1955633 1952811 1950622 1946890 1940953
47894 1940953 1934033 1926946 1918966 1909503 1899548 1890480 1882256 1873731 1864145 1853405 1841436 1828379 1815309
47881 1815309 1803745 1794142 1785506 1776602 1767081 1757336 1747855 1739037 1731285 1724969 1720435 1718110 1718286 1720647
47867 1720647 1724265 1728311 1732699 1737812 1743754 1750199 1757074 1765026 1774714 1785638 1796260 1805746 1815329
47854 1815329 1827244 1842077 1857552 1870158 1877813 1881045 1882157 1883506 1886049 1888910 1890350 1889353 1886201
47841 1886201 1881491 1875027 1866065 1854351 1840420 1824981 1808465 1791283 1774179 1758083 1743538 1730168
47829 1730168 1716687 1701737 1685135 1668303 1653292 1641241 1631718 1623407 1615277 1607249 1599938 1593916
47817 1593916 1589389 1586595 1586170 1588657 1593710 1600271 1607520 1615252 1623301 1631319 1639456 1648680 1659799 1672459
47803 1672459 1685531 1698342 1711125 1724500 1738875 1754084 1769134 1782433 1792836 1800606 1807061 1813185
47791 1813185 1818710 1822572 1823965 1822877 1819691 1814497 1806948 1796827 1784453 1770365 1754926 1738518 1721730
47778 1721730 1704774 1687110 1668521 1650282 1634122 1620065 1606572 1593063 1580784 1570526 1561093
47767 1561093 1551325 1542442 1536649 1533980 1532150 1529313 1525569 1521903 1519167 1518248 1519763 1522970 1525926 1527333
47753 1527333 1527699 1528445 1530474 1533716 1537359 1540325 1542106 1543269 1544572 1545728 1545889 1545238 1544914 1545081 1544344 1541733
47737 1541733 1538295 1535795 1534504 1533130 1530517 1526623 1522075 1517627 1514114 1512325 1512486 1513865 1515025 1514902
47723 1514902 1514008 1514427 1518067 1524935 1533654 1543466 1554825 1567938 1581888 1595911 1610675 1627436 1646365
47710 1646365 1666488 1687001 1707919 1729566 1752053 1775157 1798158 1819783 1838866 1855313 1870213
47699 1870213 1884911 1899982 1914874 1928359 1939458 1948079 1954639 1959052 1960488 1958367 1953281 1946568 1939145
47686 1939145 1930970 1921470 1910354 1898200 1886418 1876305 1867985 1860583 1853550 1847294 1842169 1837471 1832170
47673 1832170 1826456 1821872 1819881 1820778 1823900 1828289 1832958 1837167 1841093 1846162 1854263 1866349 1881832 1899385
47659 1899385 1918184 1938195 1959445 1981547 2004186 2027643 2052334 2078089 2104369 2131109 2158700
47648 2158700 2187108 2215431 2242350 2266562 2287051 2303871 2318732 2333668 2348494 2360449 2367101
47637 2367101 2368890 2367889 2364685 2357723 2345580 2328685 2308651 2286948 2264608 2242298 2219932 2196692
47625 2196692 2172041 2146520 2121125 2096252 2071811 2048227 2026625 2007948 1992320 1979399 1968856
47614 1968856 1960369 1953740 1949495 1948864 1952466 1959327 1968028 1978673 1992613 2010045 2029239 2048925 2070260
47601 2070260 2095024 2122541 2150029 2175848 2200801 2225882 2250224 2272034 2290485 2305952 2319201
47590 2319201 2331126 2342377 2352229 2358337 2358661 2353462 2344815 2334523 2323098 2310123 2294625 2275451
47578 2275451 2252430 2227210 2202064 2177938 2154402 2131331 2109444 2088990 2069160 2049491 2031046
47567 2031046 2015326 2002350 1990560 1978436 1965628 1952553 1939498 1926463 1913617 1901532 1890658
47556 1890658 1880470 1869339 1855699 1839522 1822430 1806095 1790609 1774585 1756813 1737431 1717293
47545 1717293 1696422 1673792 1648997 1623649 1600171 1579083 1558196 1534989 1509237 1482862 1457812
47534 1457812 1434922 1414306 1395608 1377610 1358733 1338606 1318653 1300507 1284142 1268051 1251128
47523 1251128 1233868 1217784 1203983 1192319 1181700 1171082 1160243 1149599 1139339 1128992 1117918
47512 1117918 1106023 1093826 1082049 1071298 1061916 1053791 1046422 1039374 1032541 1025813 1018846 1011710 1005535
47499 1005535 1001775 1000615 1000662 1000461 999836 999448 999627 1000334 1001901 1004990 1009713 1015245 1020253 1023426 1023965 1022293
47483 1022293 1020073 1018634 1017435 1014991 1011338 1008261 1006630 1004895 1001165 995687 990002 984423 977890 969916
47469 969916 961227 952498 943759 935167 927101 919222 910473 900473 890086 880464 872267 865751 860457 854752
47455 854752 847048 837921 829763 823845 819036 813939 808745 804003 799129 793600 788327 784094 779613 773182
47441 773182 765830 760774 759651 761037 762799 764178 765094 765152 764343 763548 763460 763869 764718 766788 770363 774078
47425 774078 776399 777767 780075 784145 788916 793266 797441 802056 806501 809361 810267 810526 811637 813718 815757
47410 815757 817056 817779 818214 818276 818037 818132 819094 820601 821924 822984 824401 826533 828902 830628 831199 830897 830796
47393 830796 832137 835243 839039 842111 844174 846106 848581 851267 853536 855417 857442 859916 862736 865853
47379 865853 869515 874012 879339 885210 891338 897603 903893 909910 915320 920095 924537 929024 934007 940178
47365 940178 948083 957385 967060 976643 986883 998793 1012481 1027283 1042555 1057929 1073358 1089542
47353 1089542 1107674 1127894 1148470 1167511 1185229 1203368 1222641 1242013 1260533 1278416 1295841
47342 1295841 1311981 1326004 1337993 1347984 1354996 1358085 1357816 1355670 1352313 1347452 1341091 1333933 1326526
47329 1326526 1318866 1310898 1302569 1293227 1281828 1268202 1253696 1240134 1228471 1218606 1210063 1202558 1196382
47316 1196382 1192582 1192245 1194932 1198101 1199034 1197541 1196132 1197294 1201119 1205883 1210230 1214042 1217708 1221554
47302 1221554 1226032 1231636 1238351 1245833 1254198 1263883 1274406 1284119 1291762 1297549 1302001 1304439 1303750 1300283
47288 1300283 1295817 1291541 1287050 1281483 1274646 1266471 1256231 1243098 1227287 1210058 1192677 1175666
47276 1175666 1158916 1142104 1124912 1107038 1088265 1068792 1049611 1032165 1017172 1003856 990786
47265 990786 977490 964821 953704 944030 934946 925750 916309 907076 899032 893178 889583 887083 884312
47252 884312 880918 877571 875018 873526 873093 873554 874351 874657 874198 873759 874352 875900 877232 877655 878103 880154
47236 880154 884083 888543 892147 894780 897097 899412 901458 902849 903389 903294 903440 904931 908037 911962 916013
47221 916013 920341 925016 929244 932522 936050 941681 949628 958418 967127 976397 986958 998415 1010187
47208 1010187 1022663 1036497 1051288 1065851 1079635 1093299 1107866 1123597 1139614 1154612 1168211
47197 1168211 1181658 1196831 1214391 1233202 1251479 1267935 1281828 1292833 1301503 1309323 1317572 1326015
47185 1326015 1333003 1336800 1336918 1334508 1331573 1329462 1327931 1325824 1322453 1317875 1312091 1304866 1296523 1288082
47171 1288082 1280190 1272535 1264717 1257097 1250237 1243914 1237277 1229797 1221766 1214096 1207805 1203336 1200122 1197152
47157 1197152 1194058 1191218 1188779 1186380 1184204 1183545 1185600 1190132 1195893 1202075 1208895 1217085 1227247 1239407
47143 1239407 1252705 1265796 1277976 1289768 1302087 1314997 1327525 1338408 1346804 1352649 1356642 1359675
47131 1359675 1362138 1363973 1365189 1365741 1365045 1362529 1358781 1355132 1351789 1347529 1341792 1335946 1331581 1328537
47117 1328537 1325665 1322787 1320772 1320285 1321660 1325496 1332199 1341168 1351455 1363019 1376467 1392035 1409805
47104 1409805 1430374 1454033 1479573 1505280 1530841 1556934 1583256 1608802 1634185 1661677 1692198
47093 1692198 1723848 1754264 1782951 1810283 1835718 1858531 1879348 1899226 1917618 1932822 1944320
47082 1944320 1953244 1960461 1965517 1967922 1968365 1967885 1966570 1963799 1959384 1953791 1947527 1940944 1934600 1929074
47068 1929074 1924256 1919336 1913874 1908538 1904445 1901977 1900628 1899857 1899595 1899904 1900707 1902056 1904323 1907907 1913035
47053 1913035 1919911 1928556 1938305 1948022 1957207 1966484 1976475 1986529 1995140 2001415 2005579 2008170 2009229 2008223
47039 2008223 2004222 1996202 1983714 1967432 1948827 1929172 1908922 1887813 1865283 1841050 1815628 1790039
47027 1790039 1764780 1739450 1713843 1688857 1665455 1643055 1620025 1595885 1572138 1550547 1531369
47016 1531369 1513768 1497354 1482695 1470521 1460928 1453455 1447640 1443393 1440795 1439620 1439332 1439684 1441081
47003 1441081 1444125 1449025 1455609 1463479 1471830 1479766 1487458 1496627 1509000 1524492 1541582 1559118 1576689
46990 1576689 1593395 1607567 1618227 1626052 1632530 1638838 1645677 1653282 1661079 1668020 1673773 1679144 1685016
46977 1685016 1691464 1698180 1705069 1712053 1719059 1726645 1735954 1747436 1760251 1773505 1787432 1802601 1818602
46964 1818602 1834464 1850022 1865861 1882067 1897932 1912996 1927619 1942398 1957615 1973438 1990062
46953 1990062 2007461 2025444 2044236 2064495 2086311 2108439 2129036 2147317 2164198 2181174 2198814
46942 2198814 2216690 2234483 2252330 2269747 2285059 2296828 2305468 2312472 2318219 2321674 2322350 2321204 2319068
46929 2319068 2315459 2309810 2302806 2295393 2287251 2277689 2267583 2258996 2252884 2248428 2244718 2241933 2240602 2240839
46915 2240839 2242800 2246932 2253154 2260521 2268355 2277076 2287331 2298898 2311298 2325041 2341223 2359780
46903 2359780 2379009 2397299 2414928 2433612 2454390 2476458 2498388 2520182 2543511 2569645 2597593
46892 2597593 2624802 2649514 2671902 2692984 2713189 2732286 2750080 2766644 2782096 2796551 2810086
46881 2810086 2822393 2832763 2840846 2847316 2853328 2859337 2864877 2869360 2872646 2874785 2875761 2875801 2875570 2875749 2876629
46866 2876629 2878333 2881195 2885640 2891812 2899605 2908926 2919631 2931278 2943360 2955918 2969760 2985923
46854 2985923 3004816 3025692 3046870 3066786 3085222 3103524 3123390 3145457 3169148 3193447 3217203
46843 3217203 3238915 3257153 3271603 3283046 3291941 3297504 3298602 3294924 3286698 3273835 3256332 3235349
46831 3235349 3212915 3190373 3167833 3145250 3123249 3102511 3083080 3064893 3048668 3035747 3027232
46820 3027232 3023631 3025007 3030987 3040793 3053901 3070751 3092346 3118923 3149265 3181529 3214504 3247877
46808 3247877 3281565 3315213 3348413 3380994 3412712 3442846 3470406 3494847 3516368 3535594 3553205
46797 3553205 3569812 3585670 3600465 3613849 3626404 3639451 3653542 3667837 3681667 3696179 3713366
46786 3713366 3733648 3755456 3777362 3799625 3823266 3848372 3873953 3898982 3923020 3946130 3968604
46775 3968604 3990546 4011429 4030172 4045846 4058104 4066978 4072738 4076015 4077496 4077261 4074913 4070567 4065023
46762 4065023 4058669 4050942 4041381 4030544 4019255 4007629 3995739 3984829 3976829 3972788 3972511 3975502 3981377
46749 3981377 3989544 3999634 4012541 4030040 4052863 4079645 4108103 4136738 4165161 4193503 4222148
46738 4222148 4251618 4282069 4312909 4342999 4370992 4395221 4413762 4425219 4429608 4428365 4423441 4416099
46726 4416099 4406037 4391656 4371843 4347726 4321983 4296110 4269203 4240118 4209881 4180698 4153004
46715 4153004 4125068 4095731 4066109 4037888 4011110 3984572 3957629 3930545 3903545 3876603 3850027
46704 3850027 3824330 3799783 3776926 3757128 3741201 3727353 3712061 3693711 3674249 3656478 3640951
46693 3640951 3626646 3613504 3602447 3593287 3584615 3576182 3569840 3567310 3568096 3570479 3573724 3578325 3584645
46680 3584645 3592471 3601861 3613474 3627649 3643566 3659687 3674971 3689617 3704655 3720814 3737871 3755104
46668 3755104 3772147 3788929 3804964 3819427 3832267 3844666 3857791 3871287 3883600 3893733 3902348
46657 3902348 3910936 3920085 3928783 3935639 3940904 3946893 3955954 3968200 3981909 3996019 4011217 4028285 4046463
46644 4046463 4064285 4081221 4097501 4112740 4125974 4136982 4146493 4154710 4160308 4161335 4156749 4146957
46632 4146957 4133171 4116318 4096240 4071904 4042675 4009297 3973273 3935507 3896105 3855238 3813388
46621 3813388 3770690 3726921 3682416 3638093 3594120 3549324 3502807 3455744 3410716 3369384 3331481
46610 3331481 3295988 3262423 3230649 3200157 3170300 3141175 3113708 3088707 3066085 3045261 3026015
46599 3026015 3008658 2993460 2980364 2969315 2960369 2953249 2947325 2942601 2940447 2942681 2949920 2961332 2976093
46586 2976093 2994406 3016825 3043075 3072058 3102889 3135604 3170746 3208302 3246985 3284685 3319885
46575 3319885 3352427 3382556 3409543 3432134 3450401 3466085 3480540 3493135 3502473 3508583 3512968 3516920
46563 3516920 3520842 3525063 3530225 3536810 3545328 3557136 3573954 3596068 3621999 3650630 3682678 3719084
46551 3719084 3758762 3799297 3839569 3880229 3921421 3961271 3997221 4027936 4053283 4073180 4087287
46540 4087287 4095363 4097127 4091892 4079041 4058947 4032942 4002260 3967251 3927615 3883186 3834636 3783627
46528 3783627 3732095 3680970 3629642 3577063 3523413 3470497 3420495 3374493 3332027 3291710 3252241
46517 3252241 3213118 3174557 3136875 3100165 3064583 3030380 2997287 2964300 2930638 2896609 2863121
46506 2863121 2830642 2799222 2769122 2740607 2713443 2687584 2664039 2643750 2625555 2606818 2586709
46495 2586709 2567532 2551819 2539207 2527476 2515833 2505635 2498110 2492891 2489055 2486320 2484594 2483127
46483 2483127 2480962 2478047 2475514 2474872 2477018 2481885 2488935 2497951 2509106 2522143 2535935 2549389 2562587
$$ [...]
##END NTUPLES=NMR SPECTRUM
##END=
