
##TITLE=AC1086_CCIN01_5835837_6RdfhfLT20
##JCAMPDX= 6.0         $$ Bruker NMR JCAMP-DX V2.0
##DATA TYPE= NMR SPECTRUM
##DATA CLASS= NTUPLES
##ORIGIN= BRUKER
##OWNER= Administrator
$$ 1.72 TOPSPIN		Version 2.1
$$ 2012-04-10 10:33:16.750 -0500  Administrator@TOPSPIN
$$ Compression mode = diff/dup
##.OBSERVE FREQUENCY= 400.13188235
##.OBSERVE NUCLEUS= ^1H
##.ACQUISITION MODE= SIMULTANEOUS (DQD)
##.ACQUISITION SCHEME= undefined
##.AVERAGES= 8
##.DIGITISER RES= 22
##SPECTROMETER/DATA SYSTEM= spect
##.PULSE SEQUENCE= zg30
##.SOLVENT NAME= COFFEE_meoh
##.SHIFT REFERENCE= INTERNAL, COFFEE_meoh, 1, 14.98061
##AUDIT TRAIL= $$ (NUMBER, WHEN, WHO, WHERE, PROCESS, VERSION, WHAT)
$$ ##TITLE= Audit trail, TOPSPIN		Version 2.1
$$ ##JCAMPDX= 5.01
$$ ##ORIGIN= Bruker BioSpin GmbH
$$ ##OWNER= Administrator
$$ $$ C:\Bruker\TOPSPIN/data/COFFEE/nmr/AC1086_CCIN01_5835837_6RdfhfLT20/10/pdata/1/auditp.txt
$$ ##AUDIT TRAIL=  $$ (NUMBER, WHEN, WHO, WHERE, PROCESS, VERSION, WHAT)
(   1,<2012-03-28 00:04:46.218 -0500>,<Administrator>,<TOPSPIN>,<go>,<TOPSPIN 2.1>,
      <created by zg
	started at 2012-03-28 00:03:39.640 -0500,
	POWCHK enabled, PULCHK disabled,
       configuration hash MD5:
       1A 1E CE 29 27 FD 77 03 67 4E F0 E3 C4 B2 CB 90
       data hash MD5: 64K
       24 88 62 32 59 69 1C EB 97 6A D9 49 E7 DB 93 F4>)
(   2,<2012-03-28 00:04:51.750 -0500>,<Administrator>,<TOPSPIN>,<proc1d>,<TOPSPIN 2.1>,
      <Start of raw data processing
       efp LB = 0 FT_mod = 6 PKNL = 1 PHC0 = 0 PHC1 = 0 SI = 32K 
       data hash MD5: 32K
       CB 64 BC F6 EC 00 AD 74 E5 D9 A2 F4 28 5C F5 A1>)
(   3,<2012-03-28 00:04:52.156 -0500>,<Administrator>,<TOPSPIN>,<proc1d>,<TOPSPIN 2.1>,
      <pk PHC0 = 214.0247 PHC1 = 0 
       data hash MD5: 32K
       DC 60 45 7E 3B 26 78 A0 F5 9A 2D 77 DB E4 A6 F4>)
(   4,<2012-03-28 00:04:52.281 -0500>,<Administrator>,<TOPSPIN>,<proc1d>,<TOPSPIN 2.1>,
      <abs ABSG = 1 
       data hash MD5: 32K
       CF 8D 6A BF 04 26 E1 5C 93 3A B4 D4 C1 CD A5 60>)
(   5,<2012-03-28 00:04:52.312 -0500>,<Administrator>,<TOPSPIN>,<proc1d>,<TOPSPIN 2.1>,
      <abs ABSG = 2 
       data hash MD5: 32K
       EB 95 F2 A3 2D 12 6C 0E E7 F5 28 32 DE DE 98 C8>)
(   6,<2012-03-28 00:04:52.343 -0500>,<Administrator>,<TOPSPIN>,<proc1d>,<TOPSPIN 2.1>,
      <abs ABSG = 3 
       data hash MD5: 32K
       05 F0 4A 30 D6 1D 6F 35 CD 1D B3 73 06 0F 83 E3>)
(   7,<2012-03-28 00:04:52.375 -0500>,<Administrator>,<TOPSPIN>,<proc1d>,<TOPSPIN 2.1>,
      <abs ABSG = 4 
       data hash MD5: 32K
       31 EC 1B DC 53 B3 B5 F3 5C 37 22 86 0C 57 8D B1>)
(   8,<2012-03-28 00:04:52.421 -0500>,<Administrator>,<TOPSPIN>,<proc1d>,<TOPSPIN 2.1>,
      <abs ABSG = 5 
       data hash MD5: 32K
       B6 DE 1E 3A 1A E9 6B B6 1C 86 BC D1 FB F2 00 CA>)
(   9,<2012-03-28 00:05:00.031 -0500>,<Administrator>,<TOPSPIN>,<audit>,<TOPSPIN 2.1>,
      <user comment:
       ICON-NMR User ID: COFFEE
       data hash MD5: 32K
       B6 DE 1E 3A 1A E9 6B B6 1C 86 BC D1 FB F2 00 CA>)
$$ [...]
150 150 150 150 150 150 150 150
##$TP07= 0
##$TPNAME0= <>
##$TPNAME1= <>
##$TPNAME2= <>
##$TPNAME3= <>
##$TPNAME4= <>
##$TPNAME5= <>
##$TPNAME6= <>
##$TPNAME7= <>
##$TPOAL= (0..7)
0.5 0.5 0.5 0.5 0.5 0.5 0.5 0.5
##$TPOFFS= (0..7)
0 0 0 0 0 0 0 0
##$TUNHIN= 0
##$TUNHOUT= 0
##$TUNXOUT= 0
##$USERA1= <user>
##$USERA2= <user>
##$USERA3= <user>
##$USERA4= <user>
##$USERA5= <user>
##$V9= 5
##$VALIST= <valist>
##$VCLIST= <CCCCCCCCCCCCCCC>
##$VD= 0
##$VDLIST= <DDDDDDDDDDDDDDD>
##$VPLIST= <PPPPPPPPPPPPPPP>
##$VTLIST= <TTTTTTTTTTTTTTT>
##$WBST= 2048
##$WBSW= 25
##$XGAIN= (0..3)
0 0 0 0
##$XL= 0
##$YL= 0
##$YMAX_a= 533386
##$YMIN_a= -642051
##$ZGOPTNS= <>
##$ZL1= 120
##$ZL2= 120
##$ZL3= 120
##$ZL4= 120
##$ABSF1= 14.98061
##$ABSF2= -5.57192
##$ABSG= 5
##$ABSL= 3
##$ALPHA= 0
##$AQORDER= 0
##$ASSFAC= 0
##$ASSFACI= 0
##$ASSFACX= 0
##$ASSWID= 0
##$AUNMP= <proc_prof1d_extract_pilot.lims>
##$AXLEFT= 0
##$AXNAME= <>
##$AXNUC= <1H>
##$AXRIGHT= 0
##$AXTYPE= 0
##$AXUNIT= <>
##$AZFE= 0.1
##$AZFW= 0.1
##$BCFW= 0
##$BC_mod= 0
##$BYTORDP= 0
##$COROFFS= 0
##$CY= 15
##$DATMOD= 1
##$DC= 0
##$DFILT= <>
##$DTYPP= 0
##$F1P= 0
##$F2P= 0
##$FCOR= 0.5
##$FTSIZE= 32768
##$FT_mod= 6
##$GAMMA= 0
##$GB= 0
##$INTBC= 1
##$INTSCL= 1
##$ISEN= 128
##$LB= 0
##$LEV0= 0
##$LPBIN= 0
##$MAXI= 10000
##$MC2= 0
##$MEAN= 0
##$ME_mod= 0
##$MI= 0
##$NCOEF= 0
##$NC_proc= -8
##$NLEV= 6
##$NOISF1= 0
##$NOISF2= 0
##$NSP= 0
##$NTH_PI= 0
##$NZP= 0
##$OFFSET= 14.98061
##$PC= 1
##$PHC0= 214.0247
##$PHC1= 0
##$PH_mod= 1
##$PKNL= yes
##$PPARMOD= 0
##$PPDIAG= 0
##$PPIPTYP= 0
##$PPMPNUM= 2147483647
##$PPRESOL= 1
##$PSCAL= 4
##$PSIGN= 0
##$PYNMP= <proc.py>
##$REVERSE= no
##$SF= 400.13
##$SI= 32768
##$SIGF1= 0
##$SIGF2= 0
##$SINO= 400
##$SIOLD= 32768
##$SPECTYP= <>
##$SREGLST= <1H.CDCl3>
##$SSB= 0
##$STSI= 32768
##$STSR= 0
##$SW_p= 8223.68421052632
##$SYMM= 0
##$S_DEV= 0
##$TDeff= 65536
##$TDoff= 0
##$TI= <>
##$TILT= no
##$TM1= 0
##$TM2= 0
##$TOPLEV= 0
##$USERP1= <user>
##$USERP2= <user>
##$USERP3= <user>
##$USERP4= <user>
##$USERP5= <user>
##$WDW= 1
##$XDIM= 32768
##$YMAX_p= 463750685
##$YMIN_p= -744597
##$CURPLOT= <Network HP LaserJet P1505>
##$CURPRIN= <$Network HP LaserJet P1505>
##$DFORMAT= <normdp>
##$LAYOUT= <+/1D_H.xwp>
##$LFORMAT= <normlp>
##$PFORMAT= <normpl>
##$SURQMSG= 1
$$ End of Bruker specific parameters
$$ ---------------------------------
##NTUPLES= NMR SPECTRUM
##VAR_NAME=  FREQUENCY,     SPECTRUM/REAL,   SPECTRUM/IMAG
##SYMBOL=    X,             R,               I
##VAR_TYPE=  INDEPENDENT,   DEPENDENT,       DEPENDENT
##VAR_FORM=  AFFN,          ASDF,            ASDF
##VAR_DIM=   32768,         32768,           32768
##UNITS=     HZ,            ARBITRARY UNITS, ARBITRARY UNITS
##FACTOR=    0.250966925370066, 1,           1
##FIRST=     8223.43324360095, 5614,         -24786
##LAST=      0,             -21250,          -172642
##MIN=       0,             -744597,         0
##MAX=       8223.43324360095, 463750685,    0
$$ Real data points
##PAGE= N=1
##DATA TABLE= (X++(R..R)), XYDATA
$$ [...]
19484F0686j3981J46508i2555c0412m9864A03763h5651a4549m1040k55916q0981
$$ 60686 46705 193213 -92555 -30412 -80276 103763 -85651 -14549 -55589 -311505 -392486
19473c92486D49316F9215a9246j10629r9492o6246J18522q1160C55651a68574
$$ -392486 449316 69215 -19246 -129875 -229367 -295613 -177091 -258251 355651 -168574
19462b12398O4286N5230B92563C7406b81049A56030g5010b7559k77225D1001b03744
$$ -212398 -148112 -92882 292563 37406 -281049 156030 -75010 -27559 -304784 41001 -203744
19450B92217c03576J01810A27682a38517k04783a65268o9014j09724a37312C49314
$$ 292217 -303576 -201766 127682 -138517 -343300 -165268 -234282 -344006 -137312 349314
19439C8968b25180d262o4852a6386g972k18326f781j64732A22758d9354j47115
$$ 38968 -225180 -4262 -69114 -16386 -7972 -226298 -6781 -171513 122758 -49354 -196469
19428a96469A68424m1626j6903c01684d9550j47352A74585c54007h7047H6089
$$ -196469 168424 126798 109895 -301684 -49550 -196902 174585 -354007 -87047 86089
19417b35914j0734r3059n1463a27775n3792M6443c9019C44509f045m6753k07025
$$ -235914 -246648 -339707 -391170 -127775 -181567 -135124 -39019 344509 -6045 -52798 -259823
19406b59823D5141J97201a28363K3726B38967b17107A45681K43085a01401K3059
$$ -259823 45141 242342 -128363 -104637 238967 -217107 145681 388766 -101401 -78342
19396g8342D2001a4304o708A86824C1034d5547J7928C00984c183B0462i4326C2270
$$ -78342 42001 -14304 -21012 186824 31034 -45547 -27619 300984 -3183 20462 -94326 32270
19383d05126a51230d5369k6758H8187a20205m5893G7588c7117j58305d0911j6270
$$ -405126 -151230 -45369 -72127 88187 -120205 -166098 77588 -37117 -195422 -40911 -57181
19372e7181C2621a83482P2076r999A85276n2131b36237a03233j021C7780a10691
$$ -57181 32621 -183482 -111406 -121405 185276 133145 -236237 -103233 -104254 37780 -110691
19360a00286o4875j21694I2824L0271r739d46721A68990R3206n5671f5231J4911
$$ -100286 -165161 -286855 92824 123095 113356 -446721 168990 262196 206525 -65231 -50320
19349e0320E7097e6179m1250j95293A54018n5753h5296n3186j69899g7139o1499
$$ -50320 57097 -56179 -97429 -292722 154018 98265 -85296 -138482 -308381 -77139 -138638
19338a38638B31003H7830b46184D38e0267n4573k3952j1891b0725j42754E6611
$$ -138638 231003 87830 -246184 438 -50267 -104840 -128792 -140683 -20725 -163479 56611
19326G4797a59669j15837D48000B23178b35409H9882f2483k68703A30432b70120
$$ 74797 -159669 -275506 448000 223178 -235409 89882 -62483 -331186 130432 -270120
19315b45306Q7841A7650a93752j70501a29482j00532p433l0698d0976j2793B81795
$$ -245306 -157465 17650 -193752 -364253 -129482 -230014 -237447 -268145 -40976 -53769 281795
19303A64369a12568M3578j75992a21035G062b2354j70739j97476d2038l5945B02901
$$ 164369 -112568 -68990 -244982 -121035 7062 -22354 -193093 -390569 -42038 -77983 202901
19291b29823A0237a78557J1222J1762I2396a30585f1203A20619A1609c22660o1982
$$ -229823 10237 -178557 -167335 -155573 92396 -130585 -61203 120619 11609 -322660 -384642
19280c84642D8996a24036A6168b7818E8707c3284N676B08176I5022a72668D9372
$$ -384642 48996 -124036 16168 -27818 58707 -33284 -27608 208176 95022 -172668 49372
19268b51134j8610J06340j62485a40798B2311J99143b54340a11107k17109h0637
$$ -251134 -269744 -163404 -325889 -140798 22311 221454 -254340 -111107 -328216 -80637
19257A03376a37357I58M8691h9294G9378a83947A50460C4703Q4934D8315d6130
$$ 103376 -137357 958 49649 -89294 79378 -183947 150460 34703 119637 48315 -46130
19245H3228b66121J18719O2890A8236d1093A36582L9440a49089e5973A34179e3611
$$ 83228 -266121 -147402 -84512 18236 -41093 136582 176022 -149089 -55973 134179 -53611
19233a38717k60808I8057M9269c74284a03592m7895I4105c02208B56444B3825
$$ -138717 -399525 98057 147326 -374284 -103592 -151487 94105 -302208 256444 23825
19222C90329a65517C5594A1642O0279c5099C7814J886c02226D7212i4572B48874
$$ 390329 -165517 35594 11642 71921 -35099 37814 39700 -302226 47212 -94572 248874
19210b69464b2262l7682m0794J269A73264f0521A08208C5491k694d1220k83659
$$ -269464 -22262 -59944 -100738 -99469 173264 -60521 108208 35491 32797 -41220 -324879
19199c24879O0922a07270k7901q8650N3130E3250K0650e4326k0548j28428N549
$$ -324879 -263957 -107270 -135171 -223821 -170691 53250 73900 -54326 -74874 -203302 -197753
19188a97753B46873f0390j06654E0139a6258B1624b73427a15637E5312a93573
$$ -197753 246873 -60390 -167044 50139 -16258 21624 -273427 -115637 55312 -193573
19177c36621J52948B8528L4356L2958C5694h8711F064a15045j2739H0973a52407
$$ -336621 -183673 28528 62884 95842 35694 -88711 6064 -115045 -127784 80973 -152407
19165a47374j89474J4066H7727K5023m8773b6938h141l63620J59781d1739m14494
$$ -147374 -336848 -322782 87727 112750 63977 -26938 -8141 -371761 -211980 -41739 -456233
19154d56233e1189A46068a25302l1934k21125A54615g3022C8385b15901J00239
$$ -456233 -51189 146068 -125302 -157236 -378361 154615 -73022 38385 -215901 -115662
19144a15662l81304I746J49044K06844a70876A5189J44435N1307e9550J0605C8022
$$ -115662 -496966 9746 158790 365634 -170876 15189 159624 210931 -59550 -48945 38022
19132g7383m4927l8356l6162A29835A6023a42143j16704J20067D5470M9907a12475
$$ -77383 -122310 -160666 -196828 129835 16023 -142143 -258847 -138780 45470 95377 -112475
19120b68758a3882B27654a94217j56328a62823P3666n1981B5508e8262a3864m959
$$ -268758 -13882 227654 -194217 -350545 -162823 -89157 -141138 25508 -58262 -13864 -18823
19109a8823j63771g3858r6103c510j33190A01919f9555J4177F5583a70474O8936
$$ -18823 -182594 -73858 -169961 -3510 -136700 101919 -69555 -55378 65583 -170474 -101538
19098a01538A04369J97283f283A8337J95217C945J4260b13407i2441B89577c45474
$$ -101538 104369 301652 -6283 18337 213554 3945 18205 -213407 -92441 289577 -345474
19086a24411d8379D047d62122D07591c23697i3125K0439H3221d30136G3784i1136
$$ -124411 -48379 4047 -462122 407591 -323697 -93125 -72686 83221 -430136 73784 -91136
19074G6060c12313J47319L7648B62047J05721b9154j81491A21460a18940k45141
$$ 76060 -312313 -164994 -127346 262047 367768 -29154 -210645 121460 -118940 -364081
19064c64081g6733B10011a95417L5872j69218E7243e5096E2741L10873A32872
$$ -364081 -76733 210011 -195417 -159545 -328763 57243 -55096 52741 363614 132872
19053a35420G5960a58755j0574j0435g4446C42234a49647A20386B941d7168F5781
$$ -135420 75960 -158755 -169329 -179764 -74446 342234 -149647 120386 2941 -47168 65781
19041a22941A9334L6141a24908j85643B38412o997a6311k67457B02381f5247j5581
$$ -122941 19334 55475 -124908 -310551 238412 231415 -16311 -283768 202381 -65247 -80828
19030h0828l1954j38883a0448j44410A12957J2456h4614q5303P5214m7464q1737
$$ -80828 -112782 -251665 -10448 -154858 112957 125413 -84614 -169917 -94703 -142167 -223904
19019b23904l6272h8787q5083B28006E4142J08275D6297e05254a1860C22408b77193
$$ -223904 -260176 -88787 -173870 228006 54142 162417 46297 -505254 -11860 322408 -277193
19007g1858J6741k03205A46377D1820f5148A56947c24593D2683b50766L7425Q817
$$ -71858 -55117 -258322 146377 41820 -65148 156947 -324593 42683 -250766 -213341 -204524
18996b04524A67580c77444F9056b64298D0176P7365J5995F41a6478H1171J0721
$$ -204524 167580 -377444 69056 -264298 40176 117541 133536 641 -16478 81171 91892
18985I1892b71582Q3934A94327a74427p9995J4096A00967D0701F880k7c62814
$$ 91892 -271582 -187648 194327 -174427 -254422 -240326 100967 40701 6880 6853 -362814
18973a82050P1267B5258c28372h3563j63554B1568J71392J5999b90776B53267
$$ -182050 -110783 25258 -328372 -83563 -247117 21568 192960 208959 -290776 253267
18962A57431J18824a57552C3622i6553I5040Q0039O7563C8138J02538N4809a89280
$$ 157431 276255 -157552 33622 -96553 95040 175079 242642 38138 140676 195485 -189280
18950b89059E3054P1490e57567C75739a81841E9577a13088b0428k37757F1594
$$ -289059 53054 124544 -557567 375739 -181841 59577 -113088 -20428 -258185 61594
18939D0413c74109a62445d2611B6044b54195k98840F1362j1389b49663j54960
$$ 40413 -374109 -162445 -42611 26044 -254195 -553035 61362 49973 -249663 -404623
18929d04623c0924B85376H8037J7690a25213D4281e6848n8638d146E8873b61343
$$ -404623 -30924 285376 88037 105727 -125213 44281 -56848 -115486 -4146 58873 -261343
18917H4698l8715i9631A2858J34316d9418n9792k75107B17171b76589d8705B03821
$$ 84698 45983 -99631 12858 147174 -49418 -109210 -384317 217171 -276589 -48705 203821
18905a83934B49819M2c90091J81140i5591A7111b16902B80454a10132K0924G315
$$ -183934 249819 249861 -390091 -208951 -95591 17111 -216902 280454 -110132 -89208 7315
18893E00751k543j39259d333k6111A53240h2445A92405h5322k13544B5310b07859
$$ 500751 498208 358949 -4333 -30444 153240 -82445 192405 -85322 -298866 25310 -207859
18881a97920E5862i5544G4962b2197m04557b9840l11362D8271a15171q3279A28081
$$ -197920 55862 -95544 74962 -22197 -426754 -29840 -341202 48271 -115171 -198450 128081
18869g4241A83194H0778a26273n9828d8951m9360C2913J8995j2510L240e4069
$$ -74241 183194 80778 -126273 -186101 -48951 -98311 32913 51908 39398 42638 -54069
18857A7842c03444J39213K0636A07625C012a58011k77102B36198i3118B61820
$$ 17842 -303444 -164231 -143595 107625 3012 -158011 -435113 236198 -93118 261820
18846A54151a98716m0222b9863m0433j46367P1397G1374J65269E3110d2041f877
$$ 154151 -198716 -238938 -29863 -70296 -216663 -145266 71374 236643 53110 -42041 -6877
18834A12210a31000f0952E1570b53138J01292N7588j81558a03710c2207C3535
$$ 112210 -131000 -60952 51570 -253138 -151846 -94258 -275816 -103710 -32207 33535
18823A56620b22927H6161d3328A17661k6022a86371k8312D1581J81432a41864
$$ 156620 -222927 86161 -43328 117661 91639 -186371 -214683 41581 223013 -141864
18812A80434a10018j49921D3746a11816j37682Q1157P6659l9288B2975g2923A27388
$$ 180434 -110018 -259939 43746 -111816 -249498 -168341 -91682 -130970 22975 -72923 127388
18800f2990k22683n4425C3204K28402A19122e5855D7607b26423c7407j56431J6884
$$ -62990 -285673 -340098 33204 261606 119122 -55855 47607 -226423 -37407 -193838 -176954
18789a76954A04128O423a55856j03779j12698f8389K0529A4225b06843I5503b39737
$$ -176954 104128 110551 -155856 -259635 -372333 -68389 -47860 14225 -206843 95503 -239737
18777c07662c2131k84649g2314n3823B2599J08123a85907O3548j73342e7996A45212
$$ -307662 -32131 -316780 -72314 -126137 22599 130722 -185907 -122359 -295701 -57996 145212
18765B991J98614b1570k22286b2862B8563M8316J54577r0306m6684k5635m183
$$ 2991 201605 -21570 -243856 -22862 28563 76879 231456 141150 94466 68831 64648
18754F4648M8320a24215j64148A59910a97077B08010b96789J38659A25188A3540
$$ 64648 112968 -124215 -288363 159910 -197077 208010 -296789 -158130 125188 13540
18743I6667a38122r4884j86088A11281b9945D4505a91453j08480A0361g2666C13617
$$ 96667 -138122 -233006 -419094 111281 -29945 44505 -191453 -299933 10361 -72666 313617
18731A48542g8987m6710r6827e9894r15k65023B41973j11117k9693J90913b24506
$$ 148542 -78987 -125697 -222524 -59894 -60809 -325832 241973 130856 101163 292076 -224506
18719F5091a02206B3335f6363c0868G560P6345B460b14641j86412L7191Q5128
$$ 65091 -102206 23335 -66363 -30868 7560 83905 2460 -214641 -401053 -363862 -278734
18708b78734b9224A51481B2877J2670c27256F4583K0640J29759b21059B04441
$$ -278734 -29224 151481 22877 35547 -327256 64583 85223 214982 -221059 204441
18697e6929G0326a20799B03263F008a99588I4544b35937k0679g6461m9602j7062
$$ -56929 70326 -120799 203263 6008 -199588 94544 -235937 -256616 -76461 -126063 -143125
18686a43125k0424D6439c6703k33805P600M335a00649A76598g6636l55298P5724
$$ -143125 -163549 46439 -36703 -270508 -262908 -258573 -100649 176598 -76636 -431934 -356210
18675c56210a73755G0825a01400B1364J8614a76425j0193E893L6475P3885b53985
$$ -356210 -173755 70825 -101400 21364 39978 -176425 -186618 5893 42368 116253 -253985
18663e13411K19102N2352D0364g5577J0494A13783K6351a57585f1733A576c92830
$$ -513411 -294309 -241957 40364 -75577 -65083 113783 140134 -157585 -61733 1576 -392830
18651h3405j07283C8945a12392l7387B02324b65076a23108A32982J22207A9496
$$ -83405 -190688 38945 -112392 -149779 202324 -265076 -123108 132982 255189 19496
18640F2222o05b17007L6519f9834A40792K2500D9571Q0841l0201b20199j3039
$$ 62222 61617 -217007 -180488 -69834 140792 163292 49571 130412 100211 -220199 -233238
18629b33238a0042B74918g8843l7014A0362c1921j27004B4721a6552j67980q3433
$$ -233238 -10042 274918 -78843 -115857 10362 -31921 -158925 24721 -16552 -184532 -267965
18618b67965j24201c1308k679B11446c35385J18117A73349f4391C30909i6394
$$ -267965 -392166 -31308 -33987 211446 -335385 -217268 173349 -64391 330909 -96394
18607B66273D314J5508b92464a20284B96438g7156l09697H0306a92212i4767B8745
$$ 266273 4314 19822 -292464 -120284 296438 -77156 -386853 80306 -192212 -94767 28745
18595A70064B7339a27495o8999A17443b88381b5399l02454a15382j19137I8071
$$ 170064 27339 -127495 -196494 117443 -288381 -25399 -327853 -115382 -234519 98071
18584i3448B5288K50844a27473G9716c89121l3560A87885j8936a52293j57979
$$ -93448 25288 276132 -127473 79716 -389121 -422681 187885 168949 -152293 -310272
18574c10272a3365C9502i8038j760j42258B20014d7617p4281j04636b1654A65737
$$ -310272 -13365 39502 -98038 -99798 -242056 220014 -47617 -121898 -226534 -21654 165737
18562c2370r021A48453b91620A86250B5678a42760A03326D6386K06267E3831L5519
$$ -32370 -41391 148453 -291620 186250 25678 -142760 103326 46386 252653 53831 89350
18551H9350j0017N8163b80594a30800b593p1679A12298a79954A17594J13517c7934
$$ 89350 79333 137496 -280594 -130800 -2593 -74272 112298 -179954 117594 231111 -37934
18539A421R5563a79106c6089k53615A1108A91K91284d42291C4690b56920N9246
$$ 1421 96984 -179106 -36089 -289704 11108 191 291475 -442291 34690 -256920 -197674
18528a97674h1814e811j6883l9883A38549b2387n8252C9569a44558D6360a01340
$$ -197674 -81814 -5811 -22694 -62577 138549 -22387 -80639 39569 -144558 46360 -101340
18516a6143B40979d8118j78402i8913L1099l5998A38596a75602D1813d54741f7180
$$ -16143 240979 -48118 -226520 -98913 -67814 -103812 138596 -175602 41813 -454741 -67180
18504a98293h7474B31837p3982E2933B1088J53878a43428D5760b4317j85643K9173
$$ -198293 -87474 231837 157855 52933 21088 174966 -143428 45760 -24317 -209960 -180787
18493a80787A07501L01606a66507A97730b13557p0778J14174g1629G5300N0296
$$ -180787 107501 409107 -166507 197730 -213557 -284335 -170161 -71629 75300 125596
18483A25596a89682D5265c83388J71924f4338A02496C3380e1857j25876C44955
$$ 125596 -189682 45265 -383388 -211464 -64338 102496 33380 -51857 -177733 344955
18472c55363f5858j57550j20611A19069b34496A03737B1369b0622B33713H2086
$$ -355363 -65858 -223408 -344019 119069 -234496 103737 21369 -20622 233713 82086
18461F1151a35082l5640b9925M894B79806a10573j18587R3047m3267r4j59015
$$ 61151 -135082 -170722 -29925 -25031 279806 -110573 -229160 -136113 -179380 -179474 -338489
18450c38489E0723J84224p3430b17942O9001j66740l9416A28086a50567A57019
$$ -338489 50723 234947 161517 -217942 -148941 -315681 -355097 128086 -150567 157019
18439h3895I092g8258D6551b30169j04739I4246a73064e359C33350a50j31685
$$ -83895 9092 -78258 46551 -230169 -334908 94246 -173064 -5359 333350 -150 -131835
18428a31835B06428J22135A01374J64359c2630A00979M8841K35493a31509k7078
$$ -131835 206428 328563 101374 265733 -32630 100979 149820 385313 -131509 -158587
18418a58587p8717k01743J30399d9134j81309P6317e6613A01877b01235H4491
$$ -158587 -237304 -439047 -308648 -49134 -230443 -154126 -56613 101877 -201235 84491
18407b8389j57339a0274j10111D2063J62299a36896B31269D8254d9922A3002f3103
$$ -28389 -185728 -10274 -120385 42063 204362 -136896 231269 48254 -49922 13002 -63103
18395C77269a6008A69805b99574a34312E1609g3615A59222l0727c37473C03418
$$ 377269 -16008 169805 -299574 -134312 51609 -73615 159222 128495 -337473 303418
18384h5007C42792A7138a44832C5650L2682b7010B00717C0301j4139K1834f4562
$$ -85007 342792 17138 -144832 35650 68332 -27010 200717 30301 16162 37996 -64562
18372a14221j11703j18629j38597c7699F3250b8030H876a07193m4794A88060n6853
$$ -114221 -225924 -344553 -483150 -37699 63250 -28030 8876 -107193 -151987 188060 131207
18361A31207K9058b18743B95635j15020i6265H6114b32271n3436h1109l0258l22893
$$ 131207 160265 -218743 295635 180615 -96265 86114 -232271 -285707 -81109 -111367 -434260
18350d34260A30626K11975D4713O1940a94052q6422A72685h7850l5645d4397j4781
$$ -434260 130626 342601 44713 106653 -194052 -280474 172685 -87850 -123495 -44397 -59178
18339e9178j05846a1314k05214M8527B1061e806A11523J15119a72037B29840q9021
$$ -59178 -165024 -11314 -216528 -168001 21061 -5806 111523 226642 -172037 229840 140819
18328A40819b44570a2958A30412f6206A02801d49279a81550D9002J91176g9766
$$ 140819 -244570 -12958 130412 -66206 102801 -449279 -181550 49002 240178 -79766
18317b80355e8358C4741K8742c49175f2478A30560j0769a59841B21517q1089D2328
$$ -280355 -58358 34741 63483 -349175 -62478 130560 119791 -159841 221517 140428 42328
18305A69607l4761e40185c5960n53662b48399d477r3981A34913a11472L8959A34897
$$ 169607 134846 -540185 -35960 -589622 -248399 -4477 -98458 134913 -111472 -72513 134897
18293b77109a4365l02243G305b27781e3409p0555k7533A02958i4465A27285d40957
$$ -277109 -14365 -316608 7305 -227781 -53409 -123964 -151497 102958 -94465 127285 -440957
18281a33492j83352e0841A13385J32573c8960A94939n4656O1535f5440r333q7354
$$ -133492 -316844 -50841 113385 245958 -38960 194939 140283 201818 -65440 -74773 -162127
18270a62127l4997j93154R7542c4402G4994a80575I8366k8701O3431B9298J61664
$$ -162127 -197124 -390278 -292736 -34402 74994 -180575 98366 69665 133096 29298 190962
18259A90962K01964a9691k18411A30697n3445a23565A10143J10053n7420a15153
$$ 190962 392926 -19691 -238102 130697 77252 -123565 110143 220196 162776 -115153
18248e1785n1083n9481B49152A02941a64111P0217A27626P5109J962D2735c33914
$$ -51785 -102868 -162349 249152 102941 -164111 -93894 127626 202735 204697 42735 -333914
18236a22874j88577B5244K18439b81510a04817A18388b933o8116j99316b6480
$$ -122874 -311451 25244 243683 -281510 -104817 118388 -2933 -71049 -270365 -26480
18225b43459A55978i6374d4064A3913b5829A7617R5931K25605c6976l43774h005
$$ -243459 155978 -96374 -44064 13913 -25829 17617 113548 339153 -36976 -380750 -8005
18213h708l1604A17833K08967a60442L280A28603d7033F5824J66355c0582k09715
$$ -8708 -40312 117833 326800 -160442 -157162 128603 -47033 65824 232179 -30582 -240297
18202b40297M9260P5091j79051J10752B6481b44580a8576r4173o3004j5393K2325
$$ -240297 -191037 -115946 -294997 -184245 26481 -244580 -18576 -112749 -175753 -191146 -168821
18191a68821C18057d03017B87606A39788a7237k94733J10158A64990b04422A54367
$$ -168821 318057 -403017 287606 139788 -17237 -311970 -201812 164990 -204422 154367
18180b11860k2990j6510j09613G0072J62940a3556n7836J1172k36196G0327J64954
$$ -211860 -234850 -251360 -360973 70072 233012 -13556 -71392 -60220 -296416 70327 235281
18169B35281j12778e2395a2354o6157L3615A3687a74220H4254a92974K6170e7828
$$ 235281 122503 -52395 -12354 -78511 -44896 13687 -174220 84254 -192974 -166804 -57828
18157a35495b8395A47307G784c7990B5496J16623d93875A04873Q3876A3065f6780
$$ -135495 -28395 147307 7784 -37990 25496 142119 -493875 104873 188749 13065 -66780
18145H8150a92096C3527b59539d0698j06807A39295a73128F929e74303a46847
$$ 88150 -192096 33527 -259539 -40698 -147505 139295 -173128 6929 -574303 -146847
18134B59331J10562F9318b78869A0138a93762c0139B87988f1809A31085a52732
$$ 259331 369893 69318 -278869 10138 -193762 -30139 287988 -61809 131085 -152732
18123i6474n3379o6317e8390A8522K67358b81323p168i1507j29674B25071a39273
$$ -96474 -149853 -216170 -58390 18522 285880 -281323 -288491 -91507 -221181 225071 -139273
18111g1617F7465J65831l7057b35816r7018F3939a8577A29253k780J9058k3916
$$ -71617 67465 233296 196239 -235816 -332834 63939 -18577 129253 126473 145531 121615
18100A21615d7590I5466K01056F2268M9751i1640j01108k53096B57388a44734
$$ 121615 -47590 95466 296522 62268 112019 -91640 -192748 -445844 257388 -144734
18089C6420a44316o6108P7090l5010G2879J36674F675O9329b4625P045l2583A2924
$$ 36420 -144316 -210424 -133334 -168344 72879 209553 6675 76004 -24625 -17580 -50163 12924
18076a00651k95290a86032B87538C3938j2713K74793a4519l665j30070B38235
$$ -100651 -395941 -186032 287538 33938 21225 296018 -14519 -18184 -148254 238235
18065B96990c00506C2985J60652i9022a4175B474c4843k48101C9229a87150B54853
$$ 296990 -300506 32985 193637 -99022 -14175 2474 -34843 -282944 39229 -187150 254853
18053d2426C03627a96699D6226J5007B8082b84595A44017a09781A54647J51267
$$ -42426 303627 -196699 46226 61233 28082 -284595 144017 -109781 154647 305914
18043C05914H6059d248l39445F6136R1292d5088j01223C69626j55322m9104b39594
$$ 305914 86059 -4248 -343693 66136 157428 -45088 -146311 369626 214304 165200 -239594
18031B64332B8817d17071G6163r726a69138b9567G3191g9204H8610c95550h8492
$$ 264332 28817 -417071 76163 66437 -169138 -29567 73191 -79204 88610 -395550 -88492
18019g4157A77820g8720B7138g0432l8959E8065b85848B46652m1246A1712M9458
$$ -74157 177820 -78720 27138 -70432 -109391 58065 -285848 246652 205406 11712 61170
18008F1170b34853B8068a67423f3532N015D9907Q4943h6465B99915q9180b79383
$$ 61170 -234853 28068 -167423 -63532 -58517 49907 134850 -86465 299915 210735 -279383
17996b52337B4873J93633n9809B2030K43868C1331K7293J05034p3966c79105b6838
$$ -252337 24873 218506 158697 22030 265898 31331 58624 163658 89692 -379105 -26838
17984a267j89603k342Q7120p8035G2280O3436a38079E550b18327K7831j59206
$$ -1267 -190870 -193212 -106092 -184127 72280 135716 -138079 5550 -218327 -190496 -349702
17973c49702A7799q393J93493i4929b8607B0990c0337B88934E252R3443P4852
$$ -349702 17799 9406 202899 -94929 -28607 20990 -30337 288934 5252 98695 173547
17962A73547a11550q1732N3595O4662j596j08075A38037L3673o7408a27195G0391
$$ 173547 -111550 -193282 -139687 -75025 -76621 -184696 138037 171710 104302 -127195 70391
17950B54595o5025k5116A3387a66801A69982a52566D3221e1015a4993r2664K5264
$$ 254595 189570 164454 13387 -166801 169982 -152566 43221 -51015 -14993 -107657 -82393
17939h2393A39651F1071c04178C8047J96390e108A37542R1923i0748a2688A73204
$$ -82393 139651 61071 -304178 38047 234437 -5108 137542 229465 -90748 -12688 173204
17927A64730e7163m9643C8637b59807A67186b00309a3583j25013A11998h279C877
$$ 164730 -57163 -106806 38637 -259807 167186 -200309 -13583 -138596 111998 -8279 3877
17915A08555D819K14814d4359B11876E7315J68795a01499j09117k3052q4705a45229
$$ 108555 4819 219633 -44359 211876 57315 226110 -101499 -210616 -233668 -318373 -145229
17903c03206a50425I8283e8619a6234I5826c03628B9850L5861c108C73719D9766
$$ -303206 -150425 98283 -58619 -16234 95826 -303628 29850 65711 -3108 373719 49766
17891a49899M0114A34601b0520A39326Q6821d8981B54430H2224d2705D7693b55180
$$ -149899 -109785 134601 -20520 139326 226147 -48981 254430 82224 -42705 47693 -255180
17879A04731g7512B94254a16144A28902a02530O993M6109A34869D87Q797c0828
$$ 104731 -77512 294254 -116144 128902 -102530 -95537 -49428 134869 487 9284 -30828
17867e4238m9763C65116G7476h5807C04763a41878B1296O13b34425J02633J5782
$$ -54238 -104001 365116 77476 -85807 304763 -141878 21296 21909 -234425 -131792 -116010
17856a16010c3524j31618H045J63692a69490g9908f770D7689a60877f21C2070
$$ -116010 -33524 -165142 8045 171737 -169490 -79908 -6770 47689 -160877 -621 32070
17844b63297A44982J30754A23902A3568b6316A6550a59801A76424L7866k4351
$$ -263297 144982 275736 123902 13568 -26316 16550 -159801 176424 214290 189939
17834A89939d4393k24718g913H1112j0759e089q0119C62689a55851J5669k68277
$$ 189939 -44393 -269111 -7913 81112 70353 -5089 -85208 362689 -155851 -140182 -408459
17823d08459a24666C07376a22275A79546i8724L5906g353p2889A56413K31318
$$ -408459 -124666 307376 -122275 179546 -98724 -62818 -7353 -80242 156413 387731
17813C87731j92793b57658a144B511L0075b84910B08544i762I804k952c4338D06327
$$ 387731 194938 -257658 -1144 2511 32586 -284910 208544 -9762 9804 6852 -34338 406327
17800a12706F153c04974B57712F8098J39050P3936B6267K20963G7543f0048A8495
$$ -112706 6153 -304974 257712 68098 207148 281084 26267 247230 77543 -60048 18495
17788B11467o2144d09836B75465a12837j82953D8590b70396A09934L4534a65191
$$ 211467 149323 -409836 275465 -112837 -295790 48590 -270396 109934 144468 -165191
17777C6389A6937J55813p1872Q1953j7780M4109a7009B66204O5743j37269n7119
$$ 36389 16937 172750 100878 182831 165051 209160 -17009 266204 331947 194678 137559
17766A37559j5119k5330k5534i0496c3426D87568A04908e0091M038L83j67487
$$ 137559 122440 97110 71576 -90496 -33426 487568 104908 -50091 -46053 -45670 -213157
17755b13157A37296l868M6664G6794J86415a10971A59851c1954H4172P9125a11729
$$ -213157 137296 133428 180092 76794 263209 -110971 159851 -31954 84172 163297 -111729
17743B0164O5977L7913a47455H8108O3269c541G7908L19454c26989C53098E0393
$$ 20164 86141 124054 -147455 88108 151377 -3541 77908 397362 -326989 353098 50393
17731C73726a01313I5148j0967N7137m2754i1344B78830j29618d0154j27107A56403
$$ 373726 -101313 95148 84181 141318 98564 -91344 278830 149212 -40154 -167261 156403
17719I8493E887R6520L568e4666C59324a23340A90916k1222J6582Q7393D5500
$$ 98493 5887 102407 105975 -54666 359324 -123340 190916 169694 186276 273669 45500
17707a97547e5467B64483I953b8891J81k20240B80077a3650r1232D7291K7577
$$ -197547 -55467 264483 9953 -28891 -28710 -248950 280077 -13650 -104882 47291 74868
17696G4868a589p5604K9364B24692k4252o9494b9831B20908q5882K63159d9675
$$ 74868 -1589 -77193 -47829 224692 200440 130946 -29831 220908 135026 398185 -49675
17684D8565b48893L7322A58700b38355i0189J7395B12978A03996B936c658I1994
$$ 48565 -248893 -211571 158700 -238355 -90189 -72794 212978 103996 2936 -3658 91994
17672A6540K45688A10546i3806H1519K85250n7198A9573K79429a47083C7396J04291
$$ 16540 262228 110546 -93806 81519 366769 309571 19573 299002 -147083 37396 141687
17661A41687J0612g918H0809d30947a92903D1682J15920k9445i8468A89211M4181
$$ 141687 152299 -7918 80809 -430947 -192903 41682 157602 128157 -98468 189211 233392
17650B33392p986D4883a1684I4242K02736O6628k1899a86544f9479n571A82764
$$ 233392 225406 44883 -11684 94242 296978 363606 341707 -186544 -69479 -75050 182764
17638B81521e0975l28112I4037J08879L7884k5184b6581C17478J813i054m6403
$$ 281521 -50975 -379087 94037 202916 240800 215616 -26581 317478 319291 -9054 -55457
17627e5457l0525E4795K5395L2697j5725a854n0774B55219d4404C03652a24467
$$ -55457 -85982 54795 80190 112887 97162 -1854 -52628 255219 -44404 303652 -124467
17615A97315d6365E2898K84596G8296O1025a16504l290C185c164H5187Q8800J5537
$$ 197315 -46365 52898 337494 78296 139321 -116504 -119794 3185 -3164 85187 173987 189524
17603A89524a61328B6170K21464D3339d8805K4100A89745L1759K7394l4234f9247
$$ 189524 -161328 26170 247634 43339 -48805 -24705 189745 221504 248898 214664 -69247
17591A8907J30422J65419H7076Q6911k3586k871l913h0395C31303k651J4168C6368
$$ 18907 149329 314748 87076 173987 150401 147530 143617 -80395 331303 328652 342820 36368
17578A77685a00253j1610e1969A13364c0290A39275n9852K91670C9188b20483
$$ 177685 -100253 -111863 -51969 113364 -30290 139275 79423 371093 39188 -220483
17567a07164H2399J91855I2202N8804N4379D0038d9531B12936A00090b72A53891
$$ -107164 82399 274254 92202 151006 205385 40038 -49531 212936 100090 -272 153891
17555A72584j4620O1953O0892o5904H6130B9286Q7746K3466J4251M7022n3310
$$ 172584 157964 219917 280809 214905 86130 29286 117032 140498 154749 201771 148461
17544A48461I889N01176r1527h2938I2028M9292b44614B59677A03356A5259a46906
$$ 148461 9889 511065 419538 -82938 92028 141320 -244614 259677 103356 15259 -146906
17532A79740F1260P1359h6387B44121r1679k0092N1776J60291o5524M6555m9910
$$ 179740 61260 132619 -86387 244121 152442 132350 184126 344417 278893 325448 275538
17521B75538G0201N08007d4852b1797D93437J26698B32422r5008P4179E3793N34718
$$ 275538 70201 578208 -44852 -21797 493437 620135 232422 137414 211593 53793 588511
17510E88511j11300J29741j57925J41720J04643C12298L48280k67414A27605L36070
$$ 588511 477211 606952 449027 590747 695390 312298 660578 393164 127605 463675
17500D63675j16165j40593M64171j64909A27947N01790L97005l93383l454j50751
$$ 463675 347510 206917 671088 506179 127947 629737 1026742 633359 629905 479154
17490D79154m7160M17626C78300M8488k5189o4104q9030O8484R9610J86489j83409
$$ 479154 431994 849620 378300 426788 401599 337495 248465 316949 416559 603048 419639
17479D19639O917j98657K86279B49791j02460M27640A93432K51624A46623n0354
$$ 419639 426556 227899 514178 249791 147331 574971 193432 445056 146623 96269
17469I6269J44902K43208k36160J5052A12740K27952A27647J4661K27878A63182
$$ 96269 241171 484379 248219 263271 112740 340692 127647 142308 370186 163182
17458B84801j0387k3270C1344N2391J01085F1752Q7156K59877m9219E8178r407
$$ 284801 274414 251144 31344 83735 184820 61752 148908 408785 359566 58178 48771
17447D8771L967P1222J79924o0055G0131O833K06554l687m1753l0567J20309m7483
$$ 48771 52738 123960 303884 243829 70131 76964 283518 279831 238078 207511 327820 280337
17435B80337n6960q8605J08111K40572m2091R2546m9641j01272J75210n2256B06610
$$ 280337 223377 134772 242883 483455 441364 533910 484269 382997 558207 505951 206610
17423I328L15072A45711O2348J19237o5481E4623N63682k73923N9572A66117J14286
$$ 9328 324400 145711 208059 327296 261815 54623 618305 344382 403954 166117 280403
17412B80403q9300m4118J80879A52249Q5680K24931B20664L50927B8490J34004
$$ 280403 191103 146985 327864 152249 237929 462860 220664 571591 28490 162494
17402A62494L12145M9322j5469A87117l5005Q8463E6159K94707A41987R474M0290
$$ 162494 474639 523961 508492 187117 152112 240575 56159 350866 141987 151461 191751
17391A91751n7253F4783J25791R9634n3438H1791J37399b1194B36622K69906i6076
$$ 191751 134498 64783 190574 290208 236770 81791 219190 -21194 236622 506528 -96076
17379c5040C86482a10363E05595A34750J40334l4876J59251j21722j25302N6363
$$ -35040 386482 -110363 505595 134750 275084 240208 399459 277737 152435 208798
17369B08798M40381A80363G1634K51915R1354A51488K50356A29733C295J77282
$$ 208798 649179 180363 71634 323549 414903 151488 401844 129733 3295 180577
17359A80577J83853R8199A02419K51251j24965K1840J59637A7695J82046I1695
$$ 180577 364430 462629 102419 353670 228705 250545 410182 17695 199741 91695
17348B14204J22877k3006J65848B9258J55836r0667b2374C85061A72282e6895
$$ 214204 337081 314075 479923 29258 185094 94427 -22374 385061 172282 -56895
17337B39814m886K9311A09874D1766Q9069K63086A44827a10199C60487A426J06439
$$ 239814 234928 264239 109874 41766 130835 393921 144827 -110199 360487 1426 107865
17326A07865J54126j00709o7205K09505A10597K47400A78357R5612O0234A46899
$$ 107865 261991 161282 94077 303582 110597 357997 178357 273969 334203 146899
17315B39315L01496G1884l1311J79964J32429A22621E2076N58304k92124Q0152
$$ 239315 540811 71884 40573 220537 352966 122621 52076 610380 318256 398408
17305C98408j82103m0452N405F1393K59072j4818M4360j51666F3773l893e3979
$$ 398408 216305 175853 181258 61393 320465 305647 350007 198341 63773 59880 -53979
17293A74475J96209j38129K41o2626m0436K39604j38217J6199E0381A8026L54755
$$ 174475 370684 232555 232796 170170 129734 369338 231121 247320 50381 18026 372781
17282C72781J24666J14111B68451J56781B04504p8015K44007A9940N2176L38730
$$ 372781 497447 611558 268451 425232 204504 126489 370496 19940 72116 410846
17272D10846J11132k60121c4168C06837B6859c2736C34676k948p55A48934Q814
$$ 410846 521978 261857 -34168 306837 26859 -32736 334676 331728 330973 148934 157748
17261A57748K23121H0361R0001P5494J0421J52688j92873J99357B8922K84167
$$ 157748 380869 80361 170362 245856 256277 408965 216092 415449 28922 313089
17251C13089l1452F9877L25814j09824r8056J65579K34177m5716j97792K83086
$$ 313089 281637 69877 395691 285867 187811 353390 587567 541851 344059 627145
17241F27145j99300J1453A34958L33231q5331A21998L47600A36077J75928M3218
$$ 627145 427845 439298 134958 468189 382858 121998 469598 136077 312005 355223
17231C55223R0250F2339L01603A57649E8451O3078L849A8333L28349K49565H696
$$ 355223 445473 62339 363942 157649 58451 121529 125378 18333 346682 596247 8696
17219A49056N7069K64291k14064J91066m3044J60522B34101K9486A19271J12319
$$ 149056 206125 470416 256352 447418 404374 564896 234101 263587 119271 231590
17209B31590j00549L5811C4082L86862f2427B09810J04770Q0245l6885L0264l1436
$$ 231590 131041 166852 34082 420944 -62427 209810 314580 394825 357940 388204 356768
17198C56768N837o8162D268R897M2668K36939P1996J1480D1114J72438J16848
$$ 356768 362605 294443 4268 14165 56833 293772 365768 377248 41114 213552 330400
17187C30400m1786J51151M5846m8067J73399k70986o2985J17223A54219N4369
$$ 330400 288614 439765 485611 437544 610943 339957 276972 394195 154219 208588
17177B08588K0420J69617j02113F6796L07145M52584k45570B43134L6623J44712
$$ 208588 229008 398625 296512 66796 373941 826525 580955 243134 279757 424469
17167D24469k8379J08139A30309J15308R8571M83161B43906M07390B18620a8231
$$ 424469 396090 504229 130309 245617 344188 827349 243906 651296 218620 -18231
17156H24361C67632n8005M10372j86909j27962M232I2209K80694A18330N8175
$$ 824361 367632 309627 719999 533090 405128 409360 92209 372903 118330 176505
17146A76505K51228p7659n7954R4749j30178M36753l39110J3213j69153K25446
$$ 176505 427733 350074 292120 386869 256691 693444 354334 367547 198394 423840
17136D23840j58937J76436J45389f1212F63868B52717N54823C95993M26883j84788
$$ 423840 264903 441339 586728 -61212 663868 252717 807540 395993 822876 638088
17126F38088r4454J23229N7562l38146J08346j43944L50217n8738q1953k22085
$$ 638088 543634 666863 724425 386279 494625 350681 700898 642160 560207 338122
17116C38122n8500N9174L04864j30105R0213j39588n6413j24752l6016J47503
$$ 338122 279622 338796 643660 513555 603768 464180 407767 283015 246999 394502
17106C94502J23169j53619J93636j75396L7985j1311B02806J60660K68988r7550
$$ 394502 517671 364052 557688 382292 420277 408966 202806 363466 632454 534904
17096E34904q6062J1452l0421K09542j01221j30581L42409M6487k41456L1586
$$ 534904 448842 460294 429873 639415 538194 407613 750022 796509 555053 586639
17086E86639k802O3811k37967K55770R9179m0562k23783J40626J26122C01166
$$ 586639 583837 647648 409681 665451 764630 724068 500285 640911 767033 301166
17075B14554L15687K30588C51958J67755J08522r1742J92637k6414k57364O09153
$$ 214554 530241 760829 351958 519713 628235 536493 729130 702716 445352 1054505
17065A054505m79830N9996o9795k40643O73811D02319K39478J73562j61972R2947
$$ 1054505 574675 634671 564876 324233 998044 402319 641797 815359 653387 746334
17055G46334L48205m97667m0114J38371J06933j04875k75034L77189k93195L36741
$$ 746334 1094539 596872 556758 695129 802062 697187 422153 799342 506147 842888
17045H42888n9238P9292k49124B07213N64697Q6974k48727M51105k26784k30125
$$ 842888 783650 862942 613818 207213 771910 858884 610157 1061262 834478 604353
17035F04353J35605l11185K73422n7651R4949k0842K5567C65927O30446m59025
$$ 604353 739958 428773 702195 644544 739493 718651 744218 365927 996373 537348
17025E37348K14878R5296k55999J91691j1339K02241m27848R3399J66021r2693
$$ 537348 752226 847522 591523 783214 771875 974116 546268 639667 805688 712995
17015G12995J12105K65402j34911M5066j26482J38328m52355L90656k28376L86204
$$ 712995 825100 1090502 955591 1000657 874175 1012503 560148 950804 722428 1108632
17005A108632n35740J81923J9630R4371L27252n5132k53793k38682L96984k90397
$$ 1108632 572892 754815 774445 868816 1196068 1140936 887143 648461 1045445 755048
16995G55048K25724j00998o3115K25298R9424j57912j40495K86413j45114l23680
$$ 755048 980772 879774 816659 1041957 1141381 983469 842974 1129387 984273 660593
16985F60593J34892Q5050n9323L15274N5953Q1595j11760n0614N9923K6961l53928
$$ 660593 795485 880535 821212 1136486 1192439 1274034 1162274 1111660 1171583 1198544 844616
16974H44616k7889L05391k24283K47250l8639k22151L18911j98735J13335J82302
$$ 844616 816727 1122118 897835 1145085 1106446 884295 1203206 1004471 1117806 1300108
16964A300108j98933K05671p0879J64840k78233N1051K51191n1456J28521j80751
$$ 1300108 1101175 1306846 1235967 1400807 1122574 1173625 1424816 1373360 1501881 1321130
16954A321130l22219l2861L83460j39462J86013j21275k40603M17413p6058k0438
$$ 1321130 998911 966050 1349510 1210048 1396061 1274786 1034183 1451596 1375538 1355100
16944A355100J5673J27850L5796k19511K77536l38689J99713j14688L59627j79643
$$ 1355100 1370773 1498623 1534419 1314908 1592444 1253755 1453468 1338780 1698407 1518764
16934A518764j75625N924L7880J34431n7880Q4445P0900m3638K23861l75952K54804
$$ 1518764 1343139 1349063 1386943 1521374 1463494 1547939 1618839 1575201 1799062 1423110 1677914
16923A677914m2247M67870l76360k43113J52363l5780K29018p1841K81350q5164
$$ 1677914 1635667 2103537 1727177 1484064 1636427 1600647 1829665 1757824 2039174 1954010
16913A954010j02852J39978l6533k38009N91487m95114O5864n3546L38321l23071
$$ 1954010 1851158 1991136 1954603 1716594 2308081 1812967 1878831 1825285 2163606 1840535
16903A840535J33891p8484K37530k68798L87912k46077M77801m89846K69772J4365
$$ 1840535 1974426 1895942 2133472 1864674 2252586 2006509 2484310 1994464 2264236 2278601
16893B278601o2829K77338m74923N21428l98150L39808O8916m68708L43844j89117
$$ 2278601 2215772 2493110 2018187 2539615 2141465 2481273 2550189 2081481 2425325 2236208
16883B236208N70227j43649k57250P8035L08968j36502l63J39451l42851K63769
$$ 2236208 2806435 2662786 2405536 2483571 2792539 2656037 2655674 2795125 2452274 2716043
16873B716043l4181k24211M3285N41557j70924j00787K64290j24300K10050O5463
$$ 2716043 2681862 2457651 2500936 3042493 2871569 2770782 3035072 2910772 3120822 3186285
16863C186285J54234k34276K95924l11372o1690K03700J61933L4517o9809j20991
$$ 3186285 3340519 3106243 3402167 3090795 3029105 3232805 3394738 3429255 3359446 3238455
16853C238455N83312k22713N678j10151L40919k68242K72810k2885M48674l53124
$$ 3238455 3821767 3599054 3604732 3494581 3835500 3567258 3840068 3817183 4265857 3912733
16843C912733L64207L3294J40519q7381j62068q495J37555M20976m28610J50776
$$ 3912733 4276940 4310234 4450753 4363372 4201304 4192809 4330364 4751340 4322730 4473506
16833D473506J99790J92995l1019j27088L69848N4989k41998M44639l69931L51160
$$ 4473506 4673296 4866291 4835272 4708184 5078032 5133021 4891023 5335662 4965731 5316891
16823E316891J37633j75746L10141L49055J56764k28955K77562p970L37741m8514
$$ 5316891 5454524 5278778 5588919 5937974 6094738 5865783 6143345 6135375 6473116 6424602
16813F424602J86939Q2365k27412K47777K62025L42791l37113K67524M55815l28292
$$ 6424602 6611541 6693906 6466494 6714271 6976296 7319087 6981974 7249498 7705313 7377021
16803G377021J26295J02858Q88721j22730k71495L68049O06476m84367P35573
$$ 7377021 7503316 7606174 8494895 8372165 8100670 8468719 9075195 8590828 9326401
16794I326401P469K82110O4571N9880M61155J87206K21346P7969M57993K72730
$$ 9326401 9333870 9615980 9680551 9740431 10201586 10388792 10610138 10688107 11146100 11418830
16784A1418830J64516L40235O466L02807M63485J61100P32884J15558L83426J56214
$$ 11418830 11583346 11923581 11930047 12232854 12696339 12857439 13590323 13705881 14089307 14245521
16774A4245521M90469K24389O61637K52231N25863K81945N82247J97151P33559
$$ 14245521 14735990 14960379 15622016 15874247 16400110 16682055 17264302 17461453 18195012
16765A8195012R25238L13516O52306Q64830N04708O99253K63305J044482P84470
$$ 18195012 19120250 19433766 20086072 20950902 21455610 22154863 22418168 23462650 24247120
16756B4247120N52880R03629R49778Q38986J048437J154573P96701J195772J119777
$$ 24247120 24800000 25703629 26653407 27492393 28540830 29695403 30492104 31687876 32807653
16747C2807653J176553J467683J178594J510305J455572J751203J602921J605525
$$ 32807653 33984206 35451889 36630483 38140788 39596360 41347563 42950484 44556009
16739D4556009J968278J854443K061968K298598K278484K332046K461296L058435
$$ 44556009 46524287 48378730 50440698 52739296 55017780 57349826 59811122 62869557
16731F2869557K530513K866225K795397L129899L532929L315213L440320L725503
$$ 62869557 65400070 68266295 71061692 74191591 77724520 81039733 84480053 88205556
16723H8205556L940303L704959L990303M023219M191076M153616M273229L870559
$$ 88205556 92145859 95850818 99841121 103864340 108055416 112209032 116482261 120352820
16715A20352820L790149L935716L464150L611369K974788K870564J983764K021552
$$ 120352820 124142969 128078685 131542835 135154204 138128992 140999556 142983320 145004872
16707A45004872J350724R72429J30425M2507m98759j354185j439929k334136k276059
$$ 145004872 146355596 147328025 147458450 147500957 147002198 145648013 144208084 141873948 139597889
16698A39597889l189410l117158l843451l330356l878803m158484m180748m238957
$$ 139597889 136408479 133291321 129447870 126117514 122238711 118080227 113899479 109660522
16690A09660522l857443l985145m108951m370908l933574l644861l678847l122234
$$ 109660522 105803079 101817934 97708983 93338075 89404501 85759640 82080793 78958559
16682G8958559l901655l195155l009972l028588k949326k563535k365346k975490
$$ 78958559 75056904 71861749 68851777 65823189 62873863 60310328 57944982 54969492
16674E4969492k075511k140562k057877k153903j492971k277038j721903j527645
$$ 54969492 52893981 50753419 48695542 46541639 45048668 42771630 41049727 39522082
16666C9522082j619196j398492j056397j607367j404675j344796r58109p02689
$$ 39522082 37902886 36504394 35447997 33840630 32435955 31091159 30133050 29430361
16658B9430361j562711r25290q66885q74192r22324n36777o48580q68333q28317
$$ 29430361 27867650 26942360 26075475 25201283 24278959 23742182 23093602 22225269 21396952
16649B1396952o07031m44980j144785m67220l04709n45156p23312j90368o97665
$$ 21396952 20789921 20344941 19200156 18732936 18428227 17883071 17159759 16969391 16271726
16640A6271726p08055j52113k26252p07771o1011l32221m89090k73078m82550
$$ 16271726 15563671 15411558 15185306 14477535 14416524 14084303 13595213 13322135 12839585
16631A2839585j46389m47205m48146j06413l76334K2472n70023k13098k77836
$$ 12839585 12693196 12245991 11797845 11691432 11315098 11337570 10767547 10554449 10276613
16622A0276613j03645m17193m17831K87346j92630l30920m61050l423l49338j45693
$$ 10276613 10172968 9755775 9337944 9625290 9432660 9101740 8640690 8637267 8287929 8142236
16612H142236j45855J53162k89837m52201j53607p1327l65613K98978l05443n6607
$$ 8142236 7996381 8149543 7859706 7407505 7253898 7182571 6816958 7115936 6810493 6753886
16602F753886k65872K92161m71229j62157j05318l06184m765J88831k43651J48785
$$ 6753886 6488014 6780175 6308946 6146789 6041471 5735287 5730522 5919353 5675702 5824487
16592E824487k79699L0288k77763l14454q4173P8028o2945q6689k62090M53596
$$ 5824487 5544788 5575076 5297313 4982859 4898686 4976714 4913769 4827080 4564990 5018586
16582E018586l58488l53962L32840q3767j69589K8136l27568m0559J60640j50101
$$ 5018586 4660098 4306136 4638976 4555209 4385620 4413756 4086188 4045629 4206269 4056168
16572D056168R8593K65881m85896m04385K39360j28574J03746j39166J17570m34523
$$ 4056168 4154761 4420642 3934746 3530361 3769721 3641147 3744893 3605727 3723297 3288774
16562C288774j13024J14152L03918m96870j0742J60340k75098M9538q5198K16643
$$ 3288774 3175750 3289902 3593820 3096950 3086208 3246548 2971450 3020988 2935790 3152433
16552C152433q2815q8847O1188j01025K1596M9594j48646j34120J00705j81196
$$ 3152433 3069618 2980771 3041959 2940934 2962530 3012124 2863478 2729358 2830063 2648867
16542B648867p1062J59405m6783J02049K6132n58160J51708o0608j3497m8282
$$ 2648867 2577805 2737210 2690427 2792476 2818608 2260448 2412156 2351548 2338051 2289769
16532B289769J45113L3203J41180k81285N2640n9976k08296q9654L17834k31676
$$ 2289769 2434882 2468085 2609265 2327980 2380620 2320644 2112348 2022694 2340528 2108852
16522B108852o7523n0902K98761o81845K45072J66982k08843q8816J44263j69903
$$ 2108852 2041329 1990427 2289188 1607343 1852415 2019397 1810554 1721738 1866001 1696098
16512A696098j38594M09152k66596J74482K36622k17202j01306l07983L83323
$$ 1696098 1557504 1966656 1700060 1874542 2111164 1893962 1792656 1484673 1867996
16503A867996j73019j26839j14155K97901j16377J31299k49813J56240l40822
$$ 1867996 1694977 1568138 1453983 1751884 1635507 1766806 1516993 1673233 1332411
16494A332411J78076r3603K41815j36582K33033N472p69046R17257k99799k27024
$$ 1332411 1510487 1416884 1658699 1522117 1755150 1760622 991576 1908833 1609034 1382010
16484A382010j3173J74187j70115K56830l25148J68335j60846N0651j17754P4659
$$ 1382010 1368837 1543024 1372909 1629739 1304591 1472926 1312080 1362731 1244977 1319636
16474A319636j81900K35642p4881j5683J42557m49019K45207O539l05985K82814
$$ 1319636 1137736 1373378 1298497 1282814 1425371 976352 1221559 1228098 922113 1204927
16464A204927K39392j69229j54656K11932j17111J5074k19023M8060L65657j12566
$$ 1204927 1444319 1275090 1120434 1332366 1215255 1230329 1011306 1059366 1425023 1312457
16454A312457k74063p7931o1258M83963k30647q9011o2803K01905n287j85684
$$ 1312457 1038394 960463 899205 1383168 1152521 1063510 1000707 1202612 1197325 1011641
16444A011641N8162J47861k85755J84229k41281k15932N26708k40139k07371K46431
$$ 1011641 1069803 1217664 931909 1116138 874857 658925 1185633 945494 738123 984554
16434I84554J57646L4031j40265k38846O2896L42161k47663j39694Q5575o887
$$ 984554 1142200 1176231 1035966 797120 860016 1202177 954514 814820 900395 893508
16424H93508q5353j25231r925K46482j04757R7425J49746r1605o8716K13412E34490
$$ 893508 808155 682924 672999 919481 814724 912149 1061895 970290 901574 1114986 534490
16412A027906j78681M16906E37586M49513j10692l8314P212k34996K36250L48333
$$ 1027906 849225 1266131 537586 987099 876407 838093 845305 610309 846559 1194892
16402A194892n86950P8125J36381j99989L6290l28357L88669J2249j04149n7111
$$ 1194892 607942 686067 822448 622459 658749 330392 719061 731310 627161 570050
16392E70050K42498K5934k87522K26759l01907K78010l7118K3551K0700K09162
$$ 570050 812548 838482 550960 777719 475812 753822 716704 740255 760955 970117
16382I70117o3487j1356k49999N47J58731j26134j09682j457O44796n00383R8703
$$ 970117 906630 895274 645275 645822 804553 678419 568737 567280 1212076 711693 810396
16371H10396j67964j59115K42388j97338J42124j08696K83528j34152K8391j10895
$$ 810396 642432 483317 725705 528367 670491 561795 845323 711171 739562 628667
16361F28667J28358j87083M8771j90490Q8349N9990A51683M02835J2525J20937
$$ 628667 757025 569942 618713 428223 516572 576562 151683 554518 567043 687980
16351F87980l04335K86485R6228l62729q5407K42288j92500L29618j28339k1015
$$ 687980 383645 670130 766358 403629 318222 560510 368010 697628 569289 548274
16341E48274j4748L36282r3859k96974J8708J68696J58480j50648B15065L37445
$$ 548274 533526 869808 775949 478975 497683 666379 824859 674211 215065 552510
16331E52510L4905m9118B34822J74698N4931p3304P3239L5692J75672k14906R7831
$$ 552510 587415 538297 234822 409520 464451 391147 464386 500078 675750 460844 558675
16320E58675k07820n761r2716L75320J12216k13862k48217k0706J43025A17771
$$ 558675 350855 345094 252378 627698 739914 526052 277835 257129 400154 117771
16309F27673j24514K59683C34275A35134L85391k42495L72367k55998N132N9758
$$ 627673 503159 762842 334275 135134 520525 278030 650397 394399 399531 459289
16299D59289j18565N16582B35491K09828o5081H0511L60620D3752J29622M13464
$$ 459289 340724 857306 235491 445319 380238 80511 441131 43752 173374 586838
16289E86838A38579J66033Q339M25543B9242M72557J5800B02403L75983B62071
$$ 586838 138579 304612 312951 738494 29242 501799 517599 202403 578386 262071
16278D59575A95300J80754A63509n5127J00691K5489K10022j25310P5225q7810
$$ 459575 195300 376054 163509 108382 209073 234562 444584 319274 394499 306689
16268C06689K42360L0779j65925L5635j21346J74729L7050a4045C57740j5181
$$ 306689 549049 579828 413903 449538 328192 502921 539971 -14045 357740 342559
16258C42559j7165A46906K21779j23088j514J30749j75977K19776j68592k5524
$$ 342559 325394 146906 368685 245597 244083 374832 198855 418631 250039 224515
16248B24515L611L49488j79972j04334K69341k44619m822j00829J38943J25114
$$ 224515 228126 577614 397642 293308 562649 318030 313208 212379 351322 476436
16238D76436J47441k01669j41449A06098g03C48942K0594K53529c2812C43191
$$ 476436 623877 422208 280759 106098 -703 348942 369536 623065 -32812 343191
16227D66579A31969e306B67162R6670l4730J6022J85009H655N22370B18064J5137
$$ 466579 131969 -5306 267162 363832 329102 345124 530133 8655 531025 218064 233201
16216B33201Q834j07406J10463M83876k03589r2871A76340L4050R3418j39985
$$ 233201 242035 134629 245092 728968 525379 432508 176340 210390 303808 163823
16206A63823J4973J27606a43715B84376r6566J91111a8181A80011J32804J27677
$$ 163823 178796 306402 -143715 284376 187810 378921 -18181 180011 312815 440492
16196D40492a7041A38503i0295J6815C50231J0986j01960i6906C98330j1007A34683
$$ 440492 -17041 138503 -90295 -73480 350231 361217 259257 -96906 398330 387323 134683
16184C43848j04796o463O031A10255l5192N9643J79812a24494A37487L9169a34719
$$ 343848 239052 232589 238620 110255 75063 134706 314518 -124494 137487 176656 -134719
16172D14109A4752K44504g920B83181j38350D9286K65090j07499E7807a33914
$$ 414109 14752 259256 -7920 283181 144831 49286 314376 206877 57807 -133914
16161A26033J70649I762J51045F8087a45197A60067P9442n2415C5822J51437A5925
$$ 126033 296682 9762 160807 68087 -145197 160067 239509 187094 35822 187259 15925
16149G3243A5552J39935J861p3987J03789a47720C12121A21562J56201N9439h4923
$$ 73243 15552 155487 157348 83361 187150 -147720 312121 121562 277763 337202 -84923
16137B80817o2422c00998A68709D6397a00074E3492J3008q033J74589l4633f2529
$$ 280817 218395 -300998 168709 46397 -100074 53492 66500 58467 233056 198423 -62529
16125B22931R975j5898R9935B245K34291a19691e6549A02561E0932j8586a48408
$$ 222931 232906 217008 316943 2245 236536 -119691 -56549 102561 50932 32346 -148408
16113A97803r7788a93123A71925D4666Q2991g3446A86861e0097l4191L6017G9095
$$ 197803 100015 -193123 171925 44666 127657 -73446 186861 -50097 -84288 -48271 79095
16101A80732n7243O340E0746e4214C35558I3340l3515b34194g0679j81375A45151
$$ 180732 123489 129829 50746 -54214 335558 93340 59825 -234194 -70679 -252054 145151
16089b45292C22427j56086a31238B12737J07526a4409D21484j07922K10335j07276
$$ -245292 322427 166341 -131238 212737 320263 -14409 421484 313562 523897 416621
16079D16621a21558B22683F7462J88281p3104f8042C1070Q5214g3188C37587f4271
$$ 416621 -121558 222683 67462 255743 182639 -68042 31070 116284 -73188 337587 -64271
16067A739K03870a6211f993A16378d14954f906A41432P6952C2157L0133a74065
$$ 1739 205609 -16211 -6993 116378 -414954 -6906 141432 218384 32157 62290 -174065
16055A17386a15248Q225A03028d28755a3221B29979e1244P948k6350j58669L2302
$$ 117386 -115248 -107023 103028 -428755 -13221 229979 -51244 -43296 -69646 -228315 -196013
16044a96013C18511i291A37195K5747b00510A3448a6356D59797A97673J17516
$$ -196013 318511 -9291 137195 162942 -200510 13448 -16356 459797 197673 315189
16034C15189d09611a26638D6828J64597o5198K9483q5887i5056k10639A77295
$$ 315189 -409611 -126638 46828 211425 146227 175710 89823 -95056 -305695 177295
16023B68860b13312E5782L262b17897C20142c1957a3235F0670J7196P6074j4828
$$ 268860 -213312 55782 59044 -217897 320142 -31957 -13235 60670 77866 153940 139112
16012A39112f5390G0504i1489F0929k9878a02684a8736A42669A8120D050c54396
$$ 139112 -65390 70504 -91489 60929 31051 -102684 -18736 142669 18120 4050 -354396
16000B16299I1276a33498G4996k9227J89678a26595J3062L1724D8451L30917a66066
$$ 216299 91276 -133498 74996 45769 235447 -126595 -113533 -81809 48451 379368 -166066
15988F0056K45817p691q3089c99445B97799a46903J6500D32757H5075J22162h3899
$$ 60056 305873 298182 215093 -399445 297799 -146903 -130403 432757 85075 207237 -83899
15976d3496j57300A92450H8717J80119L49074j36134M63412m23785K42849L01126
$$ -43496 -200796 192450 88717 268836 617910 481776 945188 521403 764252 1065378
15966A065378m89570B71484K51377E3512J84507B5035J7690b58086A51013h5090
$$ 1065378 575808 271484 522861 53512 238019 25035 42725 -258086 151013 -85090
15955b37765n020a1354A44606h6527M917c383k26769P8414q1282e3918B17779
$$ -237765 -242785 -11354 144606 -86527 -81610 -3383 -230152 -151738 -233020 -53918 217779
15943a37792a8443e187j98j07587j55527A11130m559a62048P2979C032c0266l23262
$$ -137792 -18443 -5187 -5385 -112972 -268499 111130 106571 -162048 -89069 3032 -30266 -353528
15931c53528B2192K1062K67396a03372l9287A12114d01010G6247i7819M1261D00084
$$ -353528 22192 43254 310650 -103372 -142659 112114 -401010 76247 -97819 -56558 400084
15919b0260E6868a67000e3235j55390A36706b20530f0582k10639a07928o7159
$$ -20260 56868 -167000 -53235 -208625 136706 -220530 -60582 -271221 -107928 -175087
15909a75087m3d8803r1239b4046j03592q6182h5545A51551N4321b92497F1598
$$ -175087 -175130 -48803 -140042 -24046 -127638 -213820 -85545 151551 205872 -292497 61598
15897b27430A07725c85679a00420A54477o6007f1714I325R3298m492a37636B2552
$$ -227430 107725 -385679 -100420 154477 88470 -61714 9325 102623 98131 -137636 22552
15885A80204G6604e098j18727F5551p099A1355c36989A62810b38096P5979B8862
$$ 180204 76604 -5098 -123825 65551 58452 11355 -336989 162810 -238096 -162117 28862
15873b2915q5146A4675f4250H9254g527j62792B21152a8019N601n6152H2896i2413
$$ -22915 -108061 14675 -64250 89254 -7527 -170319 221152 -18019 -12418 -68570 82896 -92413
15860b08799B197b76280a09272M7275a3498E4597j8678a98359m24694B43253I9775
$$ -208799 2197 -276280 -109272 -61997 -13498 54597 35919 -198359 -623053 243253 99775
15848g5642H721O975J62645a06283o6292A51969a10508B1215b0169m2900q1070
$$ -75642 8721 15696 178341 -106283 -172575 151969 -110508 21215 -20169 -63069 -144139
15837a44139m7975I6003O679a78816C1219L94231b35897j81705C3506b02992G3249
$$ -144139 -192114 96003 102682 -178816 31219 425450 -235897 -417602 33506 -202992 73249
15825A19017J60434a91601B49032j4307a41541B19481H378a98820Q5686B07999
$$ 119017 279451 -191601 249032 234725 -141541 219481 8378 -198820 -113134 207999
15814D7780L1500J30719d799j93299b7129l18000B7595g4250P967R007K0201A94907
$$ 47780 79280 209999 -4799 -198098 -27129 -345129 27595 -74250 -66283 -57276 -37075 194907
15801b9089k03299A80020a48082G425Q3011j4924c71210A73228A0093J5533K4637
$$ -29089 -232388 180020 -148082 7425 90436 75512 -371210 173228 10093 25626 50263
15790E0263O2919K25177i5270B31093a43167a6631A55337e3484m9369A10665c09921
$$ 50263 113182 338359 -95270 231093 -143167 -16631 155337 -53484 -102853 110665 -309921
15778A26249a13203E5669I623a04565N994A7015D107a32851I4700C8087f9425
$$ 126249 -113203 55669 9623 -104565 -98571 17015 4107 -132851 94700 38087 -69425
15766B17743i5517k54704J15550D6692a90197m4020B01798b87484F7731a06705
$$ 217743 -95517 -350221 -234671 46692 -190197 -234217 201798 -287484 67731 -106705
15755A86867g678b978A36512a24836j45803O6673B15671i0779J3688C76509A49781
$$ 186867 -7678 -2978 136512 -124836 -270639 -203966 215671 -90779 -77091 376509 149781
15743I3039R1250p3164J85574n8095K6595b15177k37052K02021A06286e4042B81674
$$ 93039 184289 111125 296699 238604 265199 -215177 -452229 -250208 106286 -54042 281674
15731A40662R1420a11613j01650p7252A37198M426N538g7742m8322b2192j19872
$$ 140662 232082 -111613 -213263 -290515 137198 141624 147162 -77742 -126064 -22192 -142064
15720a42064A07648D8939g3449q2956g5387D8360d9747J3039j35611h3829A6687
$$ -142064 107648 48939 -73449 -156405 -75387 48360 -49747 -36708 -172319 -83829 16687
15708a70772B008a57897c4142j99765I9476k1486J93932b90461A41139a42653
$$ -170772 2008 -157897 -34142 -233907 99476 77990 271922 -290461 141139 -142653
15697a65004f4779l449q9192N7266A3200c7299A63332d05917B37754H3124b42735
$$ -165004 -64779 -68228 -157420 -100154 13200 -37299 163332 -405917 237754 83124 -242735
15685a76290q1183R0930j65768b7646l1698H39M0597b39049e2834H5886h1600
$$ -176290 -257473 -166543 -332311 -27646 -59344 839 41436 -239049 -52834 85886 -81600
15673a51333d0251E49062B52831a62067c1792H2240l9388c9647F9651L9490E1964
$$ -151333 -40251 549062 252831 -162067 -31792 82240 42852 -39647 69651 109141 51964
15661e6217C89028b05101M5802Q751H4472K5564c04013a40971n1958A85329h5782
$$ -56217 389028 -205101 -159299 -150548 84472 110036 -304013 -140971 -192929 185329 -85782
15649c85672F0186b89769a16677j23148f8051l86307C10749a87475M0769D5722
$$ -385672 60186 -289769 -116677 -239825 -68051 -454358 310749 -187475 -146706 45722
15638d39392E6298b98408J29915E9110a53439d1922m9669A78639G3789a05734
$$ -439392 56298 -298408 -168493 59110 -153439 -41922 -91591 178639 73789 -105734
15627a03591K1571O708L684p7912A02037P3270b7995n941j50053K3309A44098
$$ -103591 -82020 -75312 -71628 -149540 102037 175307 -27995 -33936 -183989 -160680 144098
15615B24053j02704d4378A82046J1005b3618A8401b09967g4088C57404g8009l6283
$$ 224053 121349 -44378 182046 193051 -23618 18401 -209967 -74088 357404 -78009 -114292
15604a14292A85591a95329l2707A61886a00988I7139b03692b1999A61955j6294
$$ -114292 185591 -195329 -228036 161886 -100988 97139 -203692 -21999 161955 145661
15594A45661d3192j35821j25749E9990Q8094a32856O0154G6644N5201J33253b11500
$$ 145661 -43192 -179013 -304762 59990 148084 -132856 -72702 76644 131845 265098 -211500
15582g09B30377a98076A1785c27917A19038M4504b0073G4965K8643a70664B13931
$$ -709 230377 -198076 11785 -327917 119038 163542 -20073 74965 103608 -170664 213931
15570g6418K4236k6382E9055c39082A03012a00280k01079J5963J34479M3616k78709
$$ -76418 -52182 -78564 59055 -339082 103012 -100280 -301359 -285396 -150917 -107301 -386010
15559c86010g3693m5584M7589g876l02967J09480K5438A71950D7871i5467j12403
$$ -386010 -73693 -119277 -71688 -7876 -310843 -201363 -175925 171950 47871 -95467 -207870
15548b07870h0705D9186e6038k11715N8759O1450A67152e35364B85922j17350
$$ -207870 -80705 49186 -56038 -267753 -208994 -147544 167152 -535364 285922 168572
15538A68572b81391a36312b5993m27714B96345c02454A45137h0810j998p9479
$$ 168572 -281391 -136312 -25993 -453707 296345 -302454 145137 -80810 -82808 -162287
15528a62287a7826q8291M4934p930j62236G7668c30988J14987R1971a9929C42439
$$ -162287 -17826 -106117 -61183 -69113 -231349 77668 -330988 -216001 -124030 -19929 342439
15516b5213A20320b18j40993L2560A45899l3405d9335C15750B976O7677a26211
$$ -25213 120320 -218 -141211 -108651 145899 112494 -49335 315750 2976 70653 -126211
15504c45848a65499c2300j16227A77896J14033j18458h8972A80916k9056O9623
$$ -345848 -165499 -32300 -148527 177896 291929 173471 -88972 180916 151860 221483
15494B21483E3784N7622J76269A1796K22054A08695M0624J128q46P4495m861H2081
$$ 221483 53784 111406 287675 11796 233850 108695 149319 150447 149601 224096 219235 82081
15481a7064E30322k58018n9457L109G9468C7533a92333B50081f0700d202C49031
$$ -17064 530322 272304 212847 215956 79468 37533 -192333 250081 -60700 -4202 349031
15469A5109m905J9283b57828A29862a6275k44994B22961K01623a48868D24276
$$ 15109 10204 29487 -257828 129862 -16275 -261269 222961 424584 -148868 424276
15458I6129K49290L91451A43524L45874I7785N6345a49382g0308B2892K14028
$$ 96129 345419 736870 143524 489398 97785 154130 -149382 -70308 22892 236920
15448B36920a13256d9453B65777l6726J9409a47864B77236a79198f1060C60138
$$ 236920 -113256 -49453 265777 229051 248460 -147864 277236 -179198 -61060 360138
15437b35002B45994Q9911c11642b4812o3113G5130a52025B17537A08389J29851
$$ -235002 245994 335905 -311642 -24812 -87925 75130 -152025 217537 108389 238240
15427B38240J80394k891N4249L34505k07184k2439k14514o1425J20635j33453
$$ 238240 418634 415743 469992 804497 597313 574874 360360 298935 419570 286117
15417B86117f3920D96259A47804C3811A3504c14872A6572f7561o385B18108B8950
$$ 286117 -63920 496259 147804 33811 13504 -314872 16572 -67561 -73946 218108 28950
15405c1236j8515A38290A4849J84836h1948a8422p300j54145d2243o6888B27368
$$ -31236 -49751 138290 14849 199685 -81948 -18422 -25722 -179867 -42243 -109131 227368
15393d8889k18882A69561A4465R4536B1329c02094K1881b6962o7525r5110k16649
$$ -48889 -267771 169561 14465 109001 21329 -302094 -280213 -26962 -94487 -189597 -406246
15382d06246C42775b43050I7890h7916o8418c8127n8286B11248h642B76965E7171
$$ -406246 342775 -243050 97890 -87916 -156334 -38127 -96413 211248 -8642 276965 57171
15370b3558k06658a8442F5681J52635c37469b7165k17467r225f7582C15484K9328
$$ -23558 -230216 -18442 65681 218316 -337469 -27165 -244632 -253857 -67582 315484 344812
15359C44812O0007A08346J31480k0463b5771n332R411j6031B54259m7439N6915
$$ 344812 404819 108346 239826 219363 -25771 -31103 -21692 -37723 254259 206820 263735
15348B63735G1518J75338e9646C274M128N7989L6901J19967M4994f3995k007N620
$$ 263735 71518 246856 -59646 3274 7402 65391 102292 222259 267253 -63995 -66002 -60382
15336f0382A04742R691O2079K41661A32114C462b16979G6611L9883K44404M2921
$$ -60382 104742 114433 176512 418173 132114 3462 -216979 76611 116494 360898 403819
15325D03819A65933M8060E2519P3758K03033j27040a6295A42062Q0189i5358a1990
$$ 403819 165933 213993 52519 126277 329310 202270 -16295 142062 222251 -95358 -11990
15313A29991E967K92935j1315A10390P7534J874p9012E2609a97515O5031G5584
$$ 129991 5967 298902 287587 110390 187924 189798 110786 52609 -197515 -132484 75584
15301f5674j0666B87929O7639A74416a18610D74055a28050C37526b82934D980
$$ -65674 -76340 287929 355568 174416 -118610 474055 -128050 337526 -282934 4980
15290a29228B15575P7283K6399B7522f922j2486A80621c34319d5759A75503E1095
$$ -129228 215575 292858 319257 27522 -6922 -19408 180621 -334319 -45759 175503 51095
15278F8800a94196I4223L7530b28434c8766j31143B80078b65104a1659B9166j4389
$$ 68800 -194196 94223 131753 -228434 -38766 -169909 280078 -265104 -11659 29166 14777
15267A4777K53024o8525c1B05925m6231J40712B9074K19927J75318I066d2360
$$ 14777 267801 199276 -31 205925 159694 300406 29074 249001 424319 9066 -42360
15255C02879j51164p2909a0462E8813k5552a66507H0818J9371h8766d3907C0454
$$ 302879 151715 78806 -10462 58813 33261 -166507 80818 100189 -88766 -43907 30454
15243A2444e8475r3525n9562h0867j68475B47261a38058H5942b6523C29996r1347
$$ 12444 -58475 -152000 -211562 -80867 -249342 247261 -138058 85942 -26523 329996 238649
15232B38649R9996r8603P88335K59514J79520j06446K08844k89493E52067A38834
$$ 238649 338645 240042 1028377 1287891 1467411 1360965 1569809 1280316 552067 138834
15221a33953B25749o1936J50387F7344K6561e1012A17017a1811I9273C4139a01488
$$ -133953 225749 163813 314200 67344 93905 -51012 117017 -11811 99273 34139 -101488
15209e9458A1811b4268B32643o9188L3449N6882f0218I6515j4829a95423g9190
$$ -59458 11811 -24268 232643 163455 196904 253786 -60218 96515 81686 -195423 -79190
15197A26512e49D2592L5902J50292m0063a0425A0645J61943F3026B8342j0402
$$ 126512 -549 42592 78494 228786 188723 -10425 10645 172588 63026 28342 17940
15186A7940b49463F8567K91013a90127A94561J21307I1850D4639b5384A41869
$$ 17940 -249463 68567 359580 -190127 194561 315868 91850 44639 -25384 141869
15175A12782K47562n0854C9931b68199A13900J60770I1009a65955I616J78410
$$ 112782 360344 309490 39931 -268199 113900 274670 91009 -165955 9616 188026
15165A88026B3238K78838I5833f7323B89791c68757a07952B5348J37348G7262
$$ 188026 23238 302076 95833 -67323 289791 -368757 -107952 25348 162696 77262
15154e924B8803b60246A81639J16108j09384a04520D4977A294P94948a59149B19375
$$ -5924 28803 -260246 181639 297747 188363 -104520 44977 1294 796242 -159149 219375
15142H562N874J64108J4377G9744N9921E4791J46968K5244i4518p1116B4851g8307
$$ 8562 14436 178544 192921 79744 139665 54791 201759 227003 -94518 -165634 24851 -78307
15129a02981B22049d1723j19970L9473k120N3405J6719A67543C0023m819L40432
$$ -102981 222049 -41723 -161693 -122220 -124340 -70935 -54216 167543 30023 25204 365636
15118C65636o6357b2731B03036E3551I874K28860m5115A9227L01112f2800G0859
$$ 365636 299279 -22731 203036 53551 9874 238734 193619 19227 320339 -62800 70859
15106F7057K4260L38812j14967k9563A06680O521m4439L96722c0166j6127D94871
$$ 67057 91317 430129 315162 285599 106680 113201 68762 465484 -30166 -46293 494871
15094a91786E00559I1893O6473a8755F2379J27941a27623a8939G0321h5100B54267
$$ -191786 500559 91893 158366 -18755 62379 190320 -127623 -18939 70321 -85100 254267
15082A09902M212P4085j682N062J07681Q7140p1188r6713l2507R7259p2942a58333
$$ 109902 114114 188199 186517 191579 299260 386400 315212 218499 185992 283251 210309 -158333
15069A29432L7391J85571n8014A35391K83007D2347K45163J6766k5637l7486r2437
$$ 129432 166823 352394 294380 135391 418398 42347 287510 304276 278639 241153 148716
15058A48716J451A3299K25467H0569L32125j01148f3303I3170P1223J6340F8054
$$ 148716 150167 13299 238766 80569 412694 311546 -63303 93170 164393 180733 68054
15046G5392L13192b37072B83336K41574e4618A50529J62948Q8033j72530q0610
$$ 75392 388584 -237072 283336 524910 -54618 150529 313477 401510 228980 148370
15036A48370K92791j94253K57170B17225G9203J83010L4710l5098j27158P6225
$$ 148370 441161 246908 504078 217225 79203 262213 296923 261825 134667 210892
15026B10892j0038Q8718J96763j99996K18378B38384n7346Q3522L9182A39918
$$ 210892 200854 289572 486335 286339 504717 238384 181038 264560 303742 139918
15015D53844j0958L08957l57049K29570J99103m06560k7572j6497J53548H6839
$$ 453844 442886 751843 394794 624364 823467 416907 389335 372838 526386 86839
15004D69418J73117k42141j3292Q6901K3876q9373F208L33109j00922j07620K02020
$$ 469418 642535 400394 387102 474003 497879 408506 6208 339317 238395 130775 332795
14993C32795A04114a0938F16366k27706N1370M9251k38155j14051M7120J27962
$$ 332795 104114 -10938 616366 388660 440030 489281 251126 137075 184195 312157
14983C12157K1740N3665M14944C90065N9115J1552L60453B43051P7532A18972
$$ 312157 333897 387562 802506 390065 449180 460732 821185 243051 320583 118972
14972D67992B30891J00550R9941J30625j28794K35512N7909l21184J84496O7337
$$ 467992 230891 331441 431382 562007 433213 668725 726634 405450 589946 657283
14962F57283R5374k80068J36459j93678r7761j19079H9700O85489j60496j2835
$$ 657283 752657 472589 609048 415370 317609 198530 89700 775189 614693 601858
14952F01858j6594k5391B75239K02919h502C97721m2334N046A48671K56175k6345
$$ 601858 585264 559873 275239 478158 -8502 397721 355387 360433 148671 404846 378501
14941C78501F1718L19249j56564J23693J07541A44742K43515R7341n3951j84400
$$ 378501 61718 380967 224403 348096 455637 144742 388257 485598 431647 247247
14931B47247J42167P087J82322j78283J78607q3675J20887l635B26061J27515
$$ 247247 389414 396501 578823 400540 579147 495472 616359 612724 226061 353576
14921C53576J75533p7705K7389j84784K67675M81222j21568j90412L83426j26992
$$ 353576 529109 451404 478793 294009 561684 1042906 921338 730926 1114352 987360
14911I87360K70615l3300n3963L72859L1634k52446J31477j40746Q966K23117
$$ 987360 1257975 1224675 1170712 1543571 1575205 1322759 1454236 1313490 1322456 1545573
14901A545573j38169M02711Q8604k57315j60850l10801J01330m18873k01980K13627
$$ 1545573 1407404 1810115 1898719 1641404 1480554 1169753 1271083 852210 650230 863857
14891H63857j91658P4703M4559k61013B01841M04630k00310j01515j6979n5767
$$ 863857 672199 746902 791461 530448 201841 606471 406161 304646 287667 231900
14881B31900K84954M1489j24697l350j08703J22922j65648M9198P8080n1152l6895
$$ 231900 516854 558343 433646 430296 321593 444515 278867 328065 406145 354993 318098
14870C18098J70762M7542K42438r9788J61885p3369j53684L07760l29451L07890
$$ 318098 488860 536402 778840 679052 840937 767568 613884 921644 592193 900083
14860I00083k00860j61665J32421r510L57272m62775A42621L98676j80893K14697
$$ 900083 699223 537558 669979 660469 1017741 554966 142621 541297 360404 575101
14850E75101J22409R6694k14752J10289C34780K90169l11366Q0107J97992k53406
$$ 575101 697510 794204 579452 689741 334780 624949 313583 393690 591682 338276
14840C38276J32887B31741O5480K75462B56805H3749L90561o9158j39556P7429
$$ 338276 471163 231741 297221 572683 256805 83749 474310 405152 265596 343025
14830C43025K62179B49208J57921N34226j73657K800j82482K45242r061J08208
$$ 343025 605204 249208 407129 941355 767698 770498 588016 833258 824197 932405
14820I32405j71049k03553K85931k26440l1919j2305k38493M78502l07378A67126
$$ 932405 761356 557803 843734 617294 585375 573070 334577 813079 505701 167126
14809E55174r3806J10612j10224r7939J71533J74373l36592N18005l79991J92012
$$ 555174 461368 571980 461756 363817 535350 709723 373131 891136 511145 703157
14799G03157k0827j54610J49273R7529j42400j12006K65153l50773J49698J10380
$$ 703157 682330 527720 676993 774522 632122 520116 785269 434496 584194 694574
14789F94574p9705L46792j95809K83595k61924K21283D93306K04918k02791M9331
$$ 694574 614869 961661 765852 1049447 787523 1008806 493306 698224 495433 544764
14779E44764J90213B84999N23863k15934k73340L26668k53908K21372k92631K90970
$$ 544764 734977 284999 808862 592928 319588 646256 392348 613720 321089 612059
14769F12059K48989j11936p8758k3514j78527M52744j37626Q9045j70166k51211
$$ 612059 861048 749112 670354 646840 468313 921057 783431 872476 702310 451099
14759D51099J33090J05875K53526n0284M5001k28225l2785J02851l18246L71824
$$ 451099 584189 690064 943590 893306 938307 710082 677297 780148 461902 833726
14749H33726k15013N9390q3903J07943k59647O2685J18363K93081l21452J71460
$$ 833726 618713 678103 594200 702143 442496 505181 623544 916625 595173 766633
14739G66633j77553J6207L7588m2041L49414j93079P3464J35291D41411J71122
$$ 766633 589080 605287 642875 600834 950248 757169 830633 965924 441411 612533
14729F12533M83740l60771k77897J37345K76698j81224J58125l5632J67472m28143
$$ 612533 1096273 735502 457605 594950 871648 690424 848549 812917 980389 552246
14719E52246N28380k26829k36658K78806J22893j3431o3529J90258N0801L2701
$$ 552246 1080626 853797 617139 895945 1018838 1005407 941878 1132136 1182937 1215638
14709A215638L92038q8287K66058k50554k14774l07486N3953k15043m7040K02070
$$ 1215638 1607676 1519389 1785447 1534893 1320119 1012633 1066586 851543 804503 1006573
14699A006573j44484J22123k14167q2963K77876J9671p5681M9465j19497k38258
$$ 1006573 862089 984212 770045 687082 964958 984629 908948 958413 838916 600658
14689F00658Q38212m80029P1996L32159N6506J92397M80l73938K31504j75795
$$ 600658 1438870 958841 1030837 1362996 1419502 1611899 1612379 1238441 1469945 1294150
14679A294150k20270R7861k02265K34681j70716L62763n60227r250j14898J89795
$$ 1294150 1073880 1171741 969476 1204157 1033441 1396204 835977 826727 711829 901624
14669I01624k23102M65703k68622l3933J57959k80649L91817l71686k62130L67508
$$ 901624 678522 1144225 875603 841670 999629 718980 1110797 739111 476981 844489
14659H44489K51331k04078j22200J02040J48413q0179Q1772J5985J3809l29473
$$ 844489 1095820 891742 769542 871582 1019995 939816 1021588 1037573 1051382 721909
14649G21909N22195m06134K21879N01738p24086J94869K44877k45892k10993K39267
$$ 721909 1244104 837970 1059849 1561587 837501 1032370 1277247 1031355 820362 1059629
14639A059629J70082m6343j06883k12777K14235M53508r848k82607k60177J08789
$$ 1059629 1229711 1183368 1076485 863708 1077943 1531451 1521603 1238996 978819 1087608
14629A087608N6432K27600J18778j24623l08954K58083J84920k66985p4448J3514
$$ 1087608 1144040 1371640 1490418 1365795 1056841 1314924 1499844 1232859 1158411 1171925
14619A171925L06242j66828P8164J9098j06072J41577j94072K52716l83899N5861
$$ 1171925 1478167 1311339 1389503 1408601 1302529 1444106 1250034 1502750 1118851 1174712
14609A174712M26878r1535k90398j8335j77804M90887m3347j8206k80597L44251
$$ 1174712 1601590 1510055 1219657 1201322 1023518 1514405 1471058 1452852 1172255 1516506
14599A516506m7558q5497J76353j79268O0162J46229L1710N5202l8934N1277k25192
$$ 1516506 1468948 1383451 1559804 1380536 1440698 1586927 1618637 1673839 1634905 1686182 1460990
14588A460990L68564j69485j09809N0251K2802R9925P6738o6881m0167J9644J0735
$$ 1460990 1829554 1660069 1550260 1600511 1623313 1723238 1799976 1733095 1692928 1712572 1723307
14577A723307o3358J1355J79614n5345N9863j93842K26975l54397M43392j98121
$$ 1723307 1659949 1671304 1850918 1795573 1855436 1661594 1888569 1534172 1977564 1779443
14567A779443K22074l90540j26408N52381P5855q1316r0649Q6030k9136j21217
$$ 1779443 2001517 1610977 1484569 2036950 2112805 2031489 1940840 2026870 1997734 1876517
14557A876517K96073K32361m02901N62003j02775m4365j15202K06944q353k10808
$$ 1876517 2172590 2404951 2002050 2564053 2461278 2416913 2301711 2508655 2500302 2289494
14547B289494L33008J18057K09767j64088L41152L92018L5436L10466K95962M09225
$$ 2289494 2622502 2740559 2950326 2786238 3127390 3519408 3554844 3865310 4161272 4570497
14537D570497N41902J145490J481357K050317L812728O113476R226469m72360
$$ 4570497 5112399 6257889 7739246 9789563 13602291 19715767 28942236 28469876
14529B8469876q812990o491604m130764k219781p86944o30704j252780n16259
$$ 28469876 19656886 13165282 9034518 6814737 6027793 5397089 4144309 3628050
14521C628050o12712o23658J97425M0496l15763k8349j29776K60952K09371o7239
$$ 3628050 3015338 2391680 2589105 2629601 2313838 2285489 2155713 2416665 2626036 2558797
14511B558797l93628K69395R4431l47395p97K31820l93937L69904J52134K2096
$$ 2558797 2165169 2434564 2528995 2181600 2180803 2412623 2018686 2388590 2540724 2562820
14501B562820J62266j76980J56356K13930J8864K48004k19224j76572K4525J95273
$$ 2562820 2725086 2548106 2704462 2918392 2937256 3185260 2966036 2789464 2813989 3009262
14491C009262m66658K74952P8650L35087n91349M91731P6782j43068K63992m1966
$$ 3009262 2542604 2817556 2896206 3231293 2639944 3131675 3208457 3065389 3329381 3287415
14481C287415R7730j12320K50094n4719r8189l08049L63579K60212M8403n64742
$$ 3287415 3385145 3272825 3522919 3468200 3370011 3061962 3425541 3685753 3734156 3169414
14471C169414K46972K71699L16249l58096P8852K02202k04448J88285o0930K36138
$$ 3169414 3416386 3688085 4004334 3646238 3725090 3927292 3722844 3911129 3850199 4086337
14461D086337n1752O3551J53024j85449L04411Q613K12827N8890j98518L1050
$$ 4086337 4034585 4098136 4251160 4065711 4370122 4378735 4591562 4650452 4451934 4482984
14451D482984J84064o9930J52561K31338k95608J24352N001J49455j09939L54522
$$ 4482984 4667048 4597118 4749679 4981017 4685409 4809761 4814762 4964217 4854278 5208800
14441E208800L9547K13654l41950K15010j78606M2703R3729M80517j16302o8470
$$ 5208800 5248347 5462001 5120051 5335061 5156455 5199158 5292887 5773404 5657102 5588632
14431E588632M04592p6842j5443K11266l0756k60113O04381l41366K84932N6307
$$ 5588632 5993224 5916382 5900939 6112205 6081449 5821336 6425717 6084351 6369283 6425590
14421F425590L37759j41966p9186K10203n8623L31489L6032j04630L18319K3607
$$ 6425590 6763349 6621383 6542197 6752400 6693777 7025266 7061298 6956668 7274987 7298594
14411G298594K57931J09144O0217J0406J52173m3574N86908l18513L33447J96059
$$ 7298594 7556525 7665669 7725886 7736292 7888465 7844891 8431799 8113286 8446733 8642792
14401H642792K42460M18594m4253j48628K46329K43300k7888Q7934J25036J02998
$$ 8642792 8885252 9303846 9259593 9110965 9357294 9600594 9572706 9660640 9785676 9888674
14391I888674k66294O19867K05718j41418K03018M01094J46079R8087K48708K50236
$$ 9888674 9622380 10242247 10447965 10306547 10509565 10910659 11056738 11154825 11403533 11653769
14381A1653769O1808J28882K81334j08275L60028L25226P6375K70905k14856L66028
$$ 11653769 11715577 11844459 12125793 12017518 12377546 12702772 12779147 13050052 12835196 13201224
14371A3201224O33290J73585K01934J0379L46116L95708M12903M21839J08626
$$ 13201224 13834514 14008099 14210033 14220412 14566528 14962236 15375139 15796978 15905604
14362A5905604N23058K71051M19933o3026M87460J49674L99692j52296N16983
$$ 15905604 16428662 16699713 17119646 17056620 17544080 17693754 18093446 17941150 18458133
14353A8458133L35283M47737N56080M55482L13130O07553Q16272R1354L89429
$$ 18458133 18793416 19241153 19797233 20252715 20565845 21173398 21989670 22081024 22470453
14344B2470453M40671O15166M25985L08357J183853J25059R13977N25096M61014
$$ 22470453 22911124 23526290 23952275 24260632 25444485 25569544 26483521 27008617 27469631
14335B7469631J112642P60068K62349O08127J063204R44306O68730J018356J041626
$$ 27469631 28582273 29342341 29604690 30212817 31276021 32220327 32889057 33907413 34949039
14326C4949039P92816O69535J302236J336983R28255P14534J631608Q98022J512796
$$ 34949039 35741855 36411390 37713626 39050609 39978864 40693398 42325006 43223028 44735824
14317D4735824J372265J365087J946993J497186J437081J737049J597187K099812
$$ 44735824 46108089 47473176 49420169 50917355 52354436 54091485 55688672 57788484
14309E7788484K128706K347161J789524K322818K246542K438129K532882K790999
$$ 57788484 59917190 62264351 64053875 66376693 68623235 71061364 73594246 76385245
14301G6385245K896288L405288K988887L438668L537650L928494L783682M788947
$$ 76385245 79281533 82686821 85675708 89114376 92652026 96580520 100364202 105153149
14293A05153149M672420M729695M889961N282679N838410O502427O521719O987532
$$ 105153149 109825569 114555264 119445225 124727904 130566314 137068741 143590460 150577992
14285A50577992P230383P884719Q011245Q727667Q984536J0040205J0286818J0958619
$$ 150577992 157808375 165693094 173704339 182432006 191416542 201456747 211743565 222702184
14277B22702184J1454854J2332292J2497969J3360259J3835655J4197290J3984349
$$ 222702184 234157038 246489330 258987299 272347558 286183213 300380503 314364852
14270C14364852J4444557J4273396J4310231J3938769J3804289J3098084J1852524
$$ 314364852 328809409 343082805 357393036 371331805 385136094 398234178 410086702
14263D10086702J1338849J0006572R317786P974360P228521M210174L094805M92916
$$ 410086702 421425551 431432123 440749909 448724269 455952790 460162964 463257769 463750685
14255D63750685n52797n339867m544549l658390n287144m567731q093355j2324635
$$ 463750685 463197888 457858021 453313472 449655082 444367938 439800207 431706852 419382217
14247D19382217j3317025j3990483j4461853j4603478j4869828j4582145j4289029
$$ 419382217 406065192 392074709 377612856 363009378 348139550 333557405 319268376
14240C19268376j4372945j3675910j3414467j2438422j1990995j1223769j1254451
$$ 319268376 304895431 291219521 277805054 265366632 253375637 242151868 230897417
14233B30897417j1532030j0973794j0381064j0154596r174841q701180q506861
$$ 230897417 219365387 208391593 198010529 187855933 178681092 169979912 161473051
14226A61473051p842818p076202o999446n978128o072728n619138n257059n085336
$$ 161473051 153630233 146554031 139554585 133576457 127503729 121884591 116627532 111542196
14218A11542196m658309m334226l969951m064245l728291l380765l789545l094526
$$ 111542196 106883887 102549661 98579710 94515465 90787174 87406409 83616864 80522338
14210H0522338k782136k459087l133467k570995k459524k450330k145591k118196
$$ 80522338 77740202 75281115 72147648 69576653 67117129 64666799 62521208 60403012
14202F0403012k081289j871164j535784j590582j572575j664059j891547j319903
$$ 60403012 58321723 56450559 54914775 53324193 51751618 50087559 48196012 46876109
14194D6876109j268985j004978j272091j417540r37370j384452j003166j277404
$$ 46876109 45607124 44602146 43330055 41912515 40975145 39590693 38587527 37310123
14186C7310123o31752p73311r21427j331507p53523j094215p31785m57614r62001
$$ 37310123 36678371 35905060 34983633 33652126 32898603 31804388 31072603 30614989 29652988
14177B9652988p15244m07504p16813q54483j051347K66943j221351k44109n37429
$$ 29652988 28937744 28530240 27813427 26958944 25907597 26174540 24953189 24709080 24171651
14168B4171651o01791m25261o19167m22138n50590o14468l00948n1994p16995
$$ 24171651 23569860 23144599 22525432 22103294 21552704 20938236 20637288 20585294 19868299
14159A9868299l24535n65590l86875j86237p11647j08608m30568k38102l13581
$$ 19868299 19543764 18978174 18591299 18405062 17693415 17584807 17154239 16916137 16602556
14150A6602556l59500l51044k16325l55397Q178j79990o92362q5685k99104j03416
$$ 16602556 16243056 15892012 15675687 15320290 15328468 15148478 14456116 14370431 14071327 13967911
14140A3967911o18666J08877l48592j62576k86031k629j48328l11235j61941j28873
$$ 13967911 13349245 13458122 13109530 12946954 12660923 12658294 12509966 12198731 12036790 11907917
14130A1907917o10280k74031K36427j14981l60012r6305j37319l37430r1007j09990
$$ 11907917 11297637 11023606 11260033 11145052 10785040 10688735 10551416 10213986 10122979 10012989
14120A0012989J77102m10867n9577j8856l25233j81214k57778M66768q63768J71422
$$ 10012989 10190091 9779224 9719647 9700791 9375558 9194344 8936566 9403334 8539566 8710988
14110H710988J28356l25721k34055q5621l5945j17400j08198R3402j61805o8876
$$ 8710988 8839344 8513623 8279568 8193947 8158002 8040602 7932404 8025806 7864001 7795125
14100G795125j62305j17059k19780M2072j97764p156J47085k44180P3050m88661
$$ 7795125 7632820 7515761 7295981 7338053 7140289 7133133 7280218 7036038 7109088 6620427
14090F620427K02604j34950j09507k9713n3983p2783q3541j83678n3006J00344
$$ 6620427 6823031 6688081 6578574 6548861 6494878 6422095 6338554 6154876 6101870 6202214
14080F202214k85501N1162l1859l47469K46179j11437l43353k95087M29160j74007
$$ 6202214 5916713 5967875 5936016 5588547 5834726 5723289 5379936 5084849 5514009 5340002
14070E340002P2182k21029K52086l52596Q0383j11992l74423M74638l28021J24340
$$ 5340002 5412184 5191155 5443241 5090645 5171028 5059036 4684613 5159251 4831230 4955570
14060D955570j39704j89037j68234m1131J08144j42053k54721L36664j9499P4787
$$ 4955570 4815866 4626829 4458595 4417464 4525608 4383555 4128834 4465498 4445999 4520786
14050D520786k03409r4124R4718m5945L47536o01481L69690j52071n5756l13799
$$ 4520786 4317377 4223253 4317971 4272026 4619562 4018081 4387771 4235700 4179944 3866145
14040C866145J89601j12625l6359j42545l18764K30567o9499j46809M09167k1121
$$ 3866145 4055746 3943121 3906762 3764217 3445453 3676020 3606521 3459712 3868879 3847758
14030C847758k91665L01397j3316l21500k59793M79744o71537K58108q5973J85502
$$ 3847758 3556093 3857490 3844174 3522674 3262881 3742625 3071088 3329196 3243223 3428725
14020C428725k73753J60572J6361j90046n661L7511L6561O7950R5239j39341l03014
$$ 3428725 3154972 3315544 3331905 3141859 3136198 3173709 3210270 3278220 3373459 3234118 2931104
14009B931104J55833o2411r7741J42436l81150K96683l08955J12427m04950J65071
$$ 2931104 3086937 3024526 2926785 3069221 2688071 2984754 2675799 2788226 2383276 2548347
13999B548347k69903O03944r0669k99034K20269l5887k97629K12905m21621L07178
$$ 2548347 2278444 2882388 2791719 2492685 2712954 2677067 2379438 2592343 2170722 2477900
13989B477900k46085K12817J39416l75331L82764k04563k04841Q442N45291J29570
$$ 2477900 2231815 2444632 2584048 2208717 2591481 2386918 2182077 2190519 2735810 2865380
13979B865380J16743K27508L8038K30739J312496J550645L170626N608431J0224563
$$ 2865380 2982123 3209631 3247669 3478408 4790904 6341549 9512175 15120606 25345169
13970B5345169M250627o850592o472898m046903l224694j981912j597127r03919
$$ 25345169 29595796 22745204 16272306 12225403 9000709 7018797 5421670 4517751
13962D517751l01437l88454l75054k18359N499j22063j19190l14853k41994N52683
$$ 4517751 4216314 3827860 3452806 3234447 3239946 3117883 2998693 2683840 2441846 2994529
13952B994529k33346m51277J04385K18793j7210j91841M7698r6482k89782L86569
$$ 2994529 2761183 2309906 2414291 2633084 2615874 2424033 2471731 2375249 2085467 2472036
13942B472036k26587p9237n6857j87290k3093j59725L35054K3776J37834l40528
$$ 2472036 2245449 2166212 2109355 1922065 1898972 1739247 2074301 2098077 2235911 1895383
13932A895383R1612j09277K36906r3541j29601O2382J62752l26347L6772j25181
$$ 1895383 1986995 1877718 2114624 2021083 1891482 1953864 2116616 1790269 1827041 1701860
13922A701860J35741k56256K35598K59475l22665o8794J2137J87651l04134J50104
$$ 1701860 1837601 1581345 1816943 2076418 1753753 1684959 1697096 1884747 1580613 1730717
13912A730717p2155l179M83145o12072L15126j98057Q4520k06394k4877J2970
$$ 1730717 1658562 1655383 2138528 1526456 1841582 1643525 1728045 1521651 1496774 1509744
13902A509744J05563J25390k15397K55623J40805m71669J38458j4872p8094k04640
$$ 1509744 1615307 1740697 1525300 1780923 1921728 1450059 1588517 1573645 1495551 1290911
13892A290911K69225j97154P6359j5326N8277k03104K29556k8218k57671K10894
$$ 1290911 1560136 1362982 1439341 1424015 1482292 1279188 1508744 1480526 1222855 1433749
13882A433749k58l8593j03385J45884o1489j57817q3479L68107k09630L19471
$$ 1433749 1433491 1394898 1291513 1437397 1375908 1218091 1134612 1502719 1293089 1612560
13872A612560m61732n7011J88518J28171n37248M01259Q9344k21181Q2215j97892
$$ 1612560 1150828 1093817 1282335 1410506 873258 1274517 1363861 1142680 1224895 1027003
13862A027003M59165l83992M10171j96425l82638L9704K77122n0318L7087J78212
$$ 1027003 1486168 1102176 1512347 1315922 933284 972988 1250110 1199792 1236879 1415091
13852A415091l94299L71280l39701N3922L11652m57847K05914j10465o2202K98242
$$ 1415091 1020792 1392072 1052371 1106293 1417945 960098 1166012 1055547 993345 1291587
13842A291587m33518N01459p3382N4508N225j90042j09281L1434O9673M8542j95394
$$ 1291587 858069 1359528 1286146 1340654 1345879 1155837 1046556 1077990 1147663 1196205 1000811
13831A000811j54719J83179K71098J1470k39252K05649k97949L23339k2035l39262
$$ 1000811 846092 1029271 1300369 1311839 1072587 1278236 980287 1303626 1281591 942329
13821I42329k1827l019J23817l2532j8719J39208k44039p3075J25845m8868J14322
$$ 942329 920502 917483 1041300 1008768 990049 1129257 885218 812143 937988 889120 1003442
13810A003442Q118K3667j83938K87017j27321J8560k26462j65846K20174q199
$$ 1003442 1011560 1035227 851289 1138306 1010985 1029545 803083 637237 857411 849212
13800H49212M2141n0345J90357k79559j27664K50980m123j81001J63127l43157
$$ 849212 891353 841008 1031365 751806 624142 875122 870999 689998 853125 509968
13790E09968N32742j97263k03536j6732N7922K74308K2994k08824R1125M553l76627
$$ 509968 1042710 845447 641911 625179 683101 957409 980403 771579 862704 867257 490630
13779D90630k4377M67729M0500J02572l94714L89307k28439l6383K13010j46593
$$ 490630 466253 933982 974482 1077054 682340 1071647 843208 806825 1019835 873242
13769H73242m03685K80143Q6875j10248K35900j54621L1069k36262B40334M26432
$$ 873242 469557 749700 836575 726327 962227 807606 838675 602413 240334 666766
13759F66766l617J7960j50040K6800K97938k64204L92483l27695J24055j81559
$$ 666766 663149 681109 531069 557869 855807 591603 984086 656391 780446 598887
13749E98887K48093r5755k27938j13081M56034O1431p3926J69756l82013K54368
$$ 598887 846980 751225 523287 410206 866240 927671 853745 1023501 641488 895856
13739H95856p2382N5166j32673L3060m4745n3355N5025l22580L63906j80399j10878
$$ 895856 823474 878640 745967 779027 734282 680927 735952 413372 777278 596879 486001
13728D86001P6906K63999k69517j19476J42743K50205j809l04769j12897l2509
$$ 486001 562907 826906 557389 437913 580656 830861 829052 524283 411386 378877
13718C78877N8936M86268j97667j39562p7115M55961j34239j26508j00690j34249
$$ 378877 437813 924081 726414 586852 509737 965698 831459 704951 604261 470012
13708D70012M7093J25998M24672m55392R1895K62569j86993l10174J0557q4820
$$ 470012 517105 643103 1067775 612383 704278 966847 779854 469680 480237 395417
13698C95417J8857K54958B53166N71945B22203L29278k0589J01934j92644J41774
$$ 395417 414274 669232 253166 825111 222203 551481 530892 632826 440182 581956
13688E81956j43828N42630m59966K93497C47957J53135Q8781A98584M18442P2461
$$ 581956 438128 980758 520792 814289 347957 501092 589873 198584 617026 689487
13678F89487J66344k57609j03003O681k3945R8047k54834M7044L40785L28905
$$ 689487 855831 598222 495219 501900 477955 576002 321168 368212 708997 1037902
13668A037902l01117C36681m8898M22639M1168l37667q7060p0703J91443J03838
$$ 1037902 736785 336681 287783 710422 751590 413923 326863 256160 447603 551441
13658E51441m5805j90868M21176l20655J14985k09109L11018l5671k60784J22095
$$ 551441 505636 314768 735944 415289 530274 321165 632183 596512 335728 457823
13648D57823k17043K26639j37795K24902j43388L08010P0392C69721M46277C88706
$$ 457823 240780 467419 329624 554526 411138 719148 789540 369721 815998 388706
13637F34258m2622m9598R8738k1942k0569m6991o2210J09353j1864o8797k57976
$$ 634258 591636 542038 640776 618834 598265 551274 489064 598417 586553 517756 259780
13626B59780Q5769K15197j58707m3712J31017k35596N2776J59575R4711o6415
$$ 259780 345549 560746 402039 358327 489344 253748 306524 466099 560810 494395
13616D94395L6667A83266N44144C46970n2153K40211o9435M4600j86053J93409
$$ 494395 531062 183266 727410 346970 294817 535028 465593 510193 324140 517549
13606E17549j85714A32802J92897a24435E72398r2807A95987K02501j52720j05786
$$ 517549 331835 132802 325699 -124435 572398 479591 195987 398488 245768 139982
13596A39982M67086j91904J00722L5813J07375j61683j17526J79852K69370A20055
$$ 139982 607068 415164 515886 551699 659074 497391 379865 559717 829087 120055
13585E13355J84663k42288j5766j39533L57451k29449p7673K48687k00949J05287
$$ 513355 698018 455730 439964 300431 657882 428433 350760 599447 398498 503785
13575E03785A47585K30754C4686M80532k51738j12397J23151P8421L0423o5193
$$ 503785 147585 378339 34686 515218 263480 151083 274234 352655 383078 317885
13565C17885N1161J21091k35362J76681i146E19755j87200R9896F9890L65731
$$ 317885 369046 490137 254775 431456 -9146 519755 332555 432451 69890 435621
13555D35621p2818F3101K54565L37354k08428J52419B12707J21917K5281K85841
$$ 435621 362803 63101 317666 655020 446592 599011 212707 334624 359905 645746
13545F45746k03129j46849k5926J64582H9515D2319K95639Q6851l8191p3654j03681
$$ 645746 442617 295768 269842 434424 89515 42319 337958 424809 386618 312964 209283
13534B09283O9079j22872g7493F9045K89696K61528B50371O5704O1074g3328B89366
$$ 209283 278362 155490 -77493 69045 358741 620269 250371 316075 377149 -73328 289366
13522A71547E2227K35774j8297J10966n4124l1055l3402J39988H1261L06136k3486
$$ 171547 52227 288001 269704 380670 326546 295491 262089 402077 81261 387397 363911
13511C63911r9060j30500J95845J1036J08175K11215k89839d6395C66574J25397
$$ 363911 264851 134351 330196 341232 449407 660622 370783 -46395 366574 491971
13501D91971B24057M6159M96624F5013L93007A73837p1770O8464d7650A64507
$$ 491971 224057 270216 766840 65013 458020 173837 102067 170531 -47650 164507
13490D58050j09515K36069k92126J01931p3642q5408J47143H9016J57921J55789
$$ 458050 348535 584604 292478 394409 320767 235359 382502 89016 246937 402726
13480D02726L002j16527E0444J04050j4824I782K25800o7551e0045D07652g4061
$$ 402726 405728 289201 50444 154494 139670 9782 235582 168031 -50045 407652 -74061
13468D21335M7988p69A74973P4217M3167J9101k4099K68518A80108K4968J44480
$$ 421335 469323 468554 174973 249190 292357 311458 287359 555877 180108 205076 349556
13457C49556k0780j63832P6430j18869J62259K664g8915C14546K85337B07176
$$ 349556 328776 164944 241374 122505 284764 287428 -78915 314546 599883 207176
13446B13595D4417Q2529L19128a22569C63893j47616n249r8133J9367J3072J83250
$$ 213595 44417 126946 446074 -122569 363893 216277 211028 112895 132262 145334 328584
13435C28584r7532l8920p7889K63864A54996K16787L2042F9317a88933C60612
$$ 328584 231052 192132 114243 378107 154996 371783 403825 69317 -188933 360612
13424b2624B82565J5274l9760K76202G4149L59151j24084A2237K16732a33605
$$ -22624 282565 297839 258079 534281 74149 433300 309216 12237 228969 -133605
13413C37157K469K448r2696o1495L37868A1912K98845m819J90902k24792P2467
$$ 337157 339626 342074 249378 187883 525751 11912 310757 305938 496840 272048 344515
13402C44515a3438A02571K09477a29982G16245A90916I3703P3968b05879E8366
$$ 344515 -13438 102571 312048 -129982 716245 190916 93703 167671 -205879 58366
13391a529B98401J87617F4286Q1638a59814B33923J77719A40967J86588A13990
$$ -1529 298401 486018 64286 145924 -159814 233923 411642 140967 327555 113990
13380A37640J69681j45031j3120J12970R575b3189B57058m2580L23916A27919
$$ 137640 307321 162290 149170 262140 271715 -23189 257058 214478 538394 127919
13369C60933A05323N89855k85783o6476A12735J31109L15987j41579l1252j41322
$$ 360933 105323 695178 409395 342919 112735 243844 559831 418252 387000 245678
13359B45678l7053M76901C09563l1202n850H2962P5977Q4016R8917P2304A97182
$$ 245678 208625 685526 309563 278361 272511 82962 158939 242955 341872 414176 197182
13347A8688M6373J44345k4117L4194B4334K33883J12911j37976K00786j61878
$$ 18688 65061 209406 185289 219483 24334 258217 371128 233152 433938 272060
13337B72060A31300K46535q2903A42298a89911E3678N2912J9401J59667J28749
$$ 272060 131300 377835 294932 142298 -189911 53678 106590 125991 285658 414407
13327D14407B4614K29148K25848B30101N4026J91447l1359m192N8319j49191j51294
$$ 414407 24614 253762 479610 230101 284127 475574 444215 440023 498342 349151 197857
13316A97857M8287n1350B5844K49477o1130D2637J65978f8663B47996f3557n574
$$ 197857 246144 194794 25844 275321 214191 42637 208615 -68663 247996 -63557 -69131
13305f9131E79511k71195j48756K5036b52622B96787m0976f1046C44035E7686
$$ -69131 579511 308316 159560 184596 -252622 296787 255811 -61046 344035 57686
13294A76151R7237c21758D41327a14467A94271H3628R9501P3145K2556l6775J26084
$$ 176151 273388 -321758 441327 -114467 194271 83628 183129 256274 278830 242055 368139
13283C68139J18783a0034C77201F5379J15459p0122M2993M2898L09948k29106
$$ 368139 486922 -10034 377201 65379 180838 110716 153709 196607 506555 277449
13273B77449j8208A5643J04506N0996M2250K07376j60381E5494j0439G735c2289
$$ 277449 259241 15643 120149 171145 213395 420771 260390 55494 45055 7735 -32289
13261b9028A92383h0108c1100A28930D7072K73457b6903G2146j9799J72101b1630
$$ -29028 192383 -80108 -31100 128930 47072 320529 -26903 72146 52347 224448 -21630
13249A60867K0183D4712J15691J46482B8301J05906J46503o4148h8134B22938
$$ 160867 181050 44712 160403 306885 28301 134207 280710 216562 -88134 222938
13238A22137Q5946H3625G796i4504D15666r771o6928b6609r3330B64793f501B01940
$$ 122137 208083 83625 7796 -94504 415666 405895 338967 -26609 -119939 264793 -6501 201940
13225a9492G9136K16899f9825A71461J30779I7756J201j1141J20917a95o5422
$$ -19492 79136 296035 -69825 171461 302240 97756 98957 87816 208733 -195 -65617
13214f5617n3682j75488A54011l3124N2539b62618a165B86200j36277o5814a92672
$$ -65617 -119299 -294787 154011 120887 173426 -262618 -1165 286200 149923 84109 -192672
13202f5885B07186J72706I1552J87888m5431c8767p6500C7577a0557I5111a48331
$$ -65885 207186 379892 91552 279440 234009 -38767 -115267 37577 -10557 95111 -148331
13190A81001J12160q8477B3100K76421j46043l948n7464J71349n0983M0914A557
$$ 181001 293161 204684 23100 299521 153478 149530 92066 263415 212432 253346 1557
13178E30911b78389d3378A96861q6925g827C9334J82575p0695B3329L67358G4026
$$ 530911 -278389 -43378 196861 109936 -7827 39334 221909 151214 23329 390687 74026
13166b7623j20340q3615h9117j02456I932J5941R1686m6814b3887m0123I850a45511
$$ -27623 -147963 -231578 -89117 -191573 9932 25873 117559 70745 -23887 -64010 9850 -145511
13153G2685b14234f5991B17887G0775B3277J10693K2416G4621a16540A96075B6519
$$ 72685 -214234 -65991 217887 70775 23277 133970 156386 74621 -116540 196075 26519
13141h5302A59374O189K0769a0512j75027A36693Q0981j03111g866A80976p0204
$$ -85302 159374 165563 186332 -10512 -185539 136693 217674 114563 -7866 180976 110772
13130A10772O6828L3366G1129b75292C2509K24920m3586I1588L37703G8538d6185
$$ 110772 177600 210966 71129 -275292 32509 257429 213843 91588 429291 78538 -46185
13118A08412R9870l1068c25525A36972A605a3264j4972j45757B50867J27252a5805
$$ 108412 208282 177214 -325525 136972 1605 -13264 -28236 -173993 250867 378119 -15805
13106H1680n60b2213A46965C3277d53197C9386K54328a22856I0791a97345D56780
$$ 81680 81120 -22213 146965 33277 -453197 39386 293714 -122856 90791 -197345 456780
13094a68373D14364b6252B07844b14153i559C6215b53564B71816O135D5705J01057
$$ -168373 414364 -26252 207844 -214153 -9559 36215 -253564 271816 277951 45705 146762
13083A46762i17C70000h8387c0128M424C03875A1029L26643K084A54287N2755
$$ 146762 -917 370000 -88387 -30128 -25704 303875 11029 337672 339756 154287 207042
13072B07042b8637e520A58936M2862a04367j58611A41548O5903a72723g2774B99917
$$ 207042 -28637 -5520 158936 201798 -104367 -262978 141548 207451 -172723 -72774 299917
13060A89524N4220p5973c0345A1984a93158A53815F2631J02122d4241C25818H950
$$ 189524 243744 167771 -30345 11984 -193158 153815 62631 164753 -44241 325818 8950
13048A99698O8764j5546h7864b9864B10058J62659n3675r3894J75567a11323A71990
$$ 199698 268462 252916 -87864 -29864 210058 372717 319042 225148 400715 -111323 171990
13036D6917K88913F2276C0258e3909A00277j2144J4101C3595N72659b16365A40629
$$ 46917 335830 62276 30258 -53909 100277 88133 102234 33595 606254 -216365 140629
13024b00645B66188r6347P4826a3952j46202B18432k5626m5953Q8778i8572B2071
$$ -200645 266188 169841 244667 -13952 -160154 218432 192806 146853 235631 -98572 22071
13012A70334L1360r5796k5744b35197a4434C05130J59461j26876a22351A9203
$$ 170334 201694 105898 80154 -235197 -14434 305130 464591 337715 -122351 19203
13001b3720C93605a59176B06666j01654M6342K41435A66083K1875e9519B57849
$$ -23720 393605 -159176 206666 105012 151354 392789 166083 187958 -59519 257849
12990C6721J36725J26022j7862b1738p5047B44078o7867e7127j74764A6760K96140
$$ 36721 173446 299468 281606 -21738 -96785 244078 176211 -57127 -231891 16760 312900
12979C12900c24387b2201j79781B17356J3071a76771b0163A56687D9301e5983
$$ 312900 -324387 -22201 -201982 217356 230427 -176771 -20163 156687 49301 -55983
12968i5428A77919e1237D2086b22259F6420c5293A09530J22565g8752C7974c06197
$$ -95428 177919 -51237 42086 -222259 66420 -35293 109530 232095 -78752 37974 -306197
12956C23647c22621j0951h9616o3460B67243e141A19322k1992a06084c5248A00056
$$ 323647 -322621 -333572 -89616 -153076 267243 -5141 119322 97330 -106084 -35248 100056
12944i1824C03674g5422m0521n2730C50526e2318F6537b55414C09415A14306J59441
$$ -91824 303674 -75422 -115943 -168673 350526 -52318 66537 -255414 309415 114306 273747
12933B73747g3800c0700n2147G8135O878J58911b0940j68118j34124A91416i5160
$$ 273747 -73800 -30700 -82847 78135 85013 243924 -20940 -189058 -323182 191416 -95160
12921B12082g854n6634A73245n5162P2334G7790g0556q2264e0062j20286l983
$$ 212082 -7854 -64488 173245 118083 190417 77790 -70556 -152820 -50062 -170348 -174331
12910a74331n4489b4250A1974J31628A0626J8210J22830K8718a19920I8026j0283
$$ -174331 -228820 -24250 11974 143602 10626 28836 151666 180384 -119920 98026 87743
12899H7743b50590A17895d0347A05481f0193B61464E0957J79912F3758k130K7906
$$ 87743 -250590 117895 -40347 105481 -60193 261464 50957 230869 63758 61628 89534
12888H9534J20353d0509r9003j61206E8372K761N5815Q1518a45081d6360B10176
$$ 89534 209887 -40509 -139512 -300718 58372 61133 116948 198466 -145081 -46360 210176
12876a5605B5474J48979M161c48032J52574B09221F0647a1183m2328n951B7916
$$ -15605 25474 174453 178614 -348032 -195458 209221 60647 -11183 -53511 -59462 27916
12864A63272p9461b4939E9554K06489J28105j40648p6729f9845A52112a03926
$$ 163272 83811 -24939 59554 266043 394148 253500 176771 -69845 152112 -103926
12853a62610I3735D0063P5458L08007A84031l5799J15309B739h1926A00575a55613
$$ -162610 93735 40063 115521 423528 184031 148232 263541 2739 -81926 100575 -155613
12841C15059b7922j86637H6792d151j13962B79579I2854N8217h5266B2089P5480
$$ 315059 -27922 -214559 86792 -4151 -118113 279579 92854 151071 -85266 22089 97569
12830I7569b74748M3216f9468A76976A0075M4210J28355a06805n6797A37373J4780
$$ 97569 -274748 -231532 -69468 176976 10075 54285 182640 -106805 -163602 137373 152153
12819A52153f4318a5975A14379a1437j11216B70891A21146I80R7030B0911J1823
$$ 152153 -64318 -15975 114379 -11437 -122653 270891 121146 980 98010 20911 32734
12808C2734d0410k12722i5051G9326K16189q2890A168h1708A07889a80909O7319
$$ 32734 -40410 -253132 -95051 79326 295515 212625 1168 -81708 107889 -180909 -113590
12797a13590N4951A26904d06286A22158L75180a616p9968L5566B05830a45843
$$ -113590 -58639 126904 -406286 122158 497338 -1616 -81584 -46018 205830 -145843
12786a55534A81631O4307D255J07327a13509b48j30040O3469A73926a19275A88878
$$ -155534 181631 245938 4255 111582 -113509 -248 -130288 -66819 173926 -119275 188878
12774b06401M2420l380m79100A63411a95415A79603l3926B8352J90196H7538b03543
$$ -206401 -163981 -167361 -646461 163411 -195415 179603 145677 28352 218548 87538 -203543
12762a94528A8180J50066k946p1394c8891e364C38763a74944A64551e130o4591
$$ -194528 18180 168246 165300 93906 -38891 -5364 338763 -174944 164551 -5130 -69721
12751f9721D6102f2446c0610j09581b5705j16716C28677a76908B4713L40949C8136
$$ -69721 46102 -62446 -30610 -140191 -25705 -142421 328677 -176908 24713 365662 38136
12739a51565p5216f0245K8882D463J81279H2662O2315a42380A53930b94916F7255
$$ -151565 -226781 -60245 -31363 4463 185742 82662 144977 -142380 153930 -294916 67255
12727a26477A16315K70733j39444o9688b7969p6636f813j08537P56A03209e7954
$$ -126477 116315 387048 247604 177916 -27969 -104605 -6813 -115350 -114594 103209 -57954
12715C20691r945D7681a88085h7800F3262a70348B78003n2971H473b34990H5234
$$ 320691 310746 47681 -188085 -87800 63262 -170348 278003 225032 8473 -234990 85234
12703E0568Q4084K33572h4669K7147l812j65496F2775L35102j68738J4445b16363
$$ 50568 134652 368224 -84669 -57522 -61334 -226830 62775 397877 229139 243584 -216363
12691A06568c8994A51472D5176b3900A79398A2726K96408A6796b5185n2315B16052
$$ 106568 -38994 151472 45176 -23900 179398 12726 309134 16796 -25185 -77500 216052
12679b91567r4471B61311a09584j32324E1463c5612B38392j12063b4234A43723
$$ -291567 -386038 261311 -109584 -241908 51463 -35612 238392 126329 -24234 143723
12668C7779a32282D07818D604J47279c4412C56030E0268c49374A36449F5750K90165
$$ 37779 -132282 407818 4604 151883 -34412 356030 50268 -349374 136449 65750 355915
12657C55915j46000h7477r7792A28421E3657p808A7093d03910D53937j86565j33264
$$ 355915 209915 -87477 -185269 128421 53657 45849 17093 -403910 453937 267372 134108
12646A34108a00148B66765a01330o7163C3378K77173a55489A68506A0144a45751
$$ 134108 -100148 266765 -101330 -168493 33378 310551 -155489 168506 10144 -145751
12635A47658i5277C79008d9970H9504c33938D957a81689A64381a80700A59019
$$ 147658 -95277 379008 -49970 89504 -333938 4957 -181689 164381 -180700 159019
12624b08847C8131M09994D437g9247A29479d1527B76953I1775m4522d0693E1906
$$ -208847 38131 448125 4437 -79247 129479 -41527 276953 91775 47253 -40693 51906
12612C82657j0750H8839P1194a73302A16363N45595a15178e0900A9706K41580
$$ 382657 371907 88839 160033 -173302 116363 661958 -115178 -50900 19706 261286
12602B61286j23737O2852N0389a35757A19718a42437b2041A79404i2746o1265
$$ 261286 137549 200401 250790 -135757 119718 -142437 -22041 179404 -92746 -154011
12592a54011A36561J53747a38271B92113a58644O6287p8862L8208C19539A4352
$$ -154011 136561 290308 -138271 292113 -158644 -92357 -171219 -133011 319539 14352
12581B43170e5319j63274J00640B30505G2511J126i5492A33265A7487a43203B87503
$$ 243170 -55319 -218593 -117953 230505 72511 73637 -95492 133265 17487 -143203 287503
12569A05148L02556B7095g4121L3053C7409a20806B58451a39925j40625B82354
$$ 105148 407704 27095 -74121 -41068 37409 -120806 258451 -139925 -280550 282354
12558h859C095O4531J81462g097j49837b6434k46222C89Q6070c2437k64519B5812
$$ -8859 3095 67626 249088 -7097 -156934 -26434 -272656 389 86459 -32437 -296956 25812
12545E5934K2620c4835k9094j92018g6514L833j54685f5618l01491A32361k6151
$$ 55934 78554 -34835 -63929 -255947 -76514 -72681 -227366 -65618 -367109 132361 106210
12534A06210b17782B29152o9514B0849Q9020c35808A07469b1400B92811B3732
$$ 106210 -217782 229152 159638 20849 109869 -335808 107469 -21400 292811 23732
12523d78854C09102a25199a796A19560A4978J17393a85201E8858C70d815k652
$$ -478854 309102 -125199 -1796 119560 14978 132371 -185201 58858 370 -4815 -7467
12512g467E6586e190j55037A03720f974A99570O097B6304K72066e0486o0164K6041
$$ -7467 56586 -5190 -160227 103720 -6974 199570 205667 26304 298370 -50486 -110650 -84609
12500h4609C62607a11940o3023A20633a5634B17708b67103a10324G6108i1465
$$ -84609 362607 -111940 -174963 120633 -15634 217708 -267103 -110324 76108 -91465
12489a0585j07587A98488a77247a1060n9419A42876f46038K93747j1364E8304
$$ -10585 -118172 198488 -177247 -11060 -70479 142876 -646038 -352291 -363655 58304
12478a8668l9944B7675R4137b44416h95G0262N713h9625k24540a53597p5621e9648
$$ -18668 -58612 27675 121812 -244416 -895 70262 75975 -89625 -314165 -153597 -229218 -59648
12465A7840c244G7486J45274H872M1959a68888P9509o0140A84453b09068B34956
$$ 17840 -3244 77486 222760 8872 50831 -168888 -89379 -149519 184453 -209068 234956
12453c1361l5698b2612A25518b87828I3332L03d7712m93174a40930A89099a66286
$$ -31361 -67059 -22612 125518 -287828 93332 93635 -47712 -540886 -140930 189099 -166286
12441f1970N769o4094b4352F7947B5167M4993a00935k16825c6158a6205j42927
$$ -61970 -56201 -120295 -24352 67947 25167 70160 -100935 -317760 -36158 -16205 -159132
12430a59132m5784a01003j25876G2693a95288A43904J11714D9431R9821k1442
$$ -159132 -204916 -101003 -226879 72693 -195288 143904 255618 49431 149252 127810
12420A27810L8455H2280i9645k2001N8805a3996l65438B19280K27077f0904A9551
$$ 127810 166265 82280 -99645 -121646 -62841 -13996 -379434 219280 446357 -60904 19551
12408D3434J96570p5016a2099C5720K40981A06268k4073m0189O6010b40760B54796
$$ 43434 240004 164988 -12099 35720 276701 106268 82195 42006 108016 -240760 254796
12396B06279b21385p6742C38662F9791b45031J16977B44851a45143k9619L0278
$$ 206279 -221385 -298127 338662 69791 -245031 -128054 244851 -145143 -174762 -144484
12386a44484l647j15120h6535p1477M2623E8002L6164A6909b10536m9165B51547
$$ -144484 -148131 -263251 -86535 -158012 -115389 58002 94166 16909 -210536 -259701 251547
12374A8559p775b31977c8800n8301C59747G9978C8829c14685A84324a05965j3447
$$ 18559 10784 -231977 -38800 -97101 359747 79978 38829 -314685 184324 -105965 -119412
12363a19412A06174C0138a54817E3540J40769f8096B39312h5355D503O8486J92621
$$ -119412 106174 30138 -154817 53540 194309 -68096 239312 -85355 4503 72989 265610
12352B65610B3940b9519I5622d6223B58018a6446o0695g93m4776D6190M6765B4149
$$ 265610 23940 -29519 95622 -46223 258018 -16446 -77141 -793 -45569 46190 92955 24149
12339B0975K10328C4963b98132J19175j227p2568B78033a44118k47698h6344q1687
$$ 20975 231303 34963 -298132 -178957 -180184 -252752 278033 -144118 -391816 -86344 -168031
12328a68031e7620G4639g3396i450p2418B48854a6805B77637H0079a48473C69123
$$ -168031 -57620 74639 -73396 -9450 -81868 248854 -16805 277637 80079 -148473 369123
12316B88624A16052K70590A20650K13325K2288d6876B82387J08307c5B45091I0957
$$ 288624 116052 386642 120650 333975 356263 -46876 282387 390694 -35 245091 90957
12304c7648B40632G2795F088J27623a72436Q5951g849F6524J49828j1156J27320
$$ -37648 240632 72795 6088 133711 -172436 -86485 -7849 66524 216352 205196 332516
12293C32516A2175J85153b61254f1519j57943C06440A21072J58556A12416c36878
$$ 332516 12175 197328 -261254 -61519 -219462 306440 121072 279628 112416 -336878
12282b58349R6607A05329K21015D4155Q736N7647J43400a50738l9299A27775A2939
$$ -258349 -161742 105329 326344 44155 52891 110538 253938 -150738 -190037 127775 12939
12270A1774L40933i9931B61479e824A10069n0274J78986R6162A08433m4024a73484
$$ 11774 352707 -99931 261479 -5824 110069 59795 238781 334943 108433 64409 -173484
12258B08691k7054A0799J50498c7591e674I0903K36559o3732A21668b33808D11836
$$ 208691 181637 10799 161297 -37591 -5674 90903 327462 263730 121668 -233808 411836
12246F0830j4530F209J41044n7013M3232J85965p4087j5979g1795k29617K6158
$$ 60830 46300 6209 147253 90240 133472 319437 245350 229371 -71795 -301412 -275254
12235b75254C02366B5202i0115F8554b875k99428E13451A07794O7417h1328B14692
$$ -275254 302366 25202 -90115 68554 -2875 -302303 513451 107794 175211 -81328 214692
12223C18249L6534G7890J01764B3078a22208A55142a51589I7027L4684q729L3760
$$ 318249 354783 77890 179654 23078 -122208 155142 -151589 97027 131711 122982 156742
12212A56742p512M9854K8550J44743C7292h0394B03301a0663H2068J15860Q2542
$$ 156742 149230 199084 227634 372377 37292 -80394 203301 -10663 82068 197928 280470
12201B80470K17111r1411P3071I1223J94396J63889j00353J985j35240K311J245
$$ 280470 497581 406170 479241 91223 285619 449508 349155 351140 215900 218211 219456
12190B19456M9601A34463Q1606l2235o4092R0973C2192L02662h4217A47253C5268
$$ 219456 269057 134463 216069 183834 119742 210715 32192 334854 -84217 147253 35268
12178H1647A5087K09132J23332H1852J03446o1127J1373l0476a5211n4252A17399
$$ 81647 15087 224219 347551 81852 185298 124171 135544 105068 -15211 -69463 117399
12166B52666j8495e4489B12739a71334A40892J34133q2883P054q7153Q7161J33293
$$ 252666 234171 -54489 212739 -171334 140892 275025 192142 199196 112043 199204 332497
12155C32497H9992J25696K0449p5727J22774H4176J5078K20984K31166k40350
$$ 332497 89992 215688 236137 160410 283184 84176 99254 320238 551404 311054
12145C11054j4294j28249J32475j5590A40701D6931J25298N97851B1630d8055
$$ 311054 296760 168511 300986 285396 140701 46931 172229 770080 21630 -48055
12134G8477b625A82734k0348b30979J08646B64553e1605A40770o3031g5756j64582
$$ 78477 -2625 182734 162386 -230979 -122333 264553 -51605 140770 77739 -75756 -240338
12123b40338H3950c0166l3774B46862L9995a52092o2826n1253A52272j7333K11221
$$ -240338 83950 -30166 -63940 246862 286857 -152092 -214918 -266171 152272 134939 346160
12112C46160I5842b36177h6745c7438B22281m8718C297a34343A01560e4368C85890
$$ 346160 95842 -236177 -86745 -37438 222281 173563 3297 -134343 101560 -54368 385890
12100f9612D93846I5489a83341h023C73432A34673K33033a17794K6762B27462
$$ -69612 493846 95489 -183341 -8023 373432 134673 367706 -117794 -91032 227462
12089a18126R334C51642b926q567B05171p6510L4823n3290a5942G5841J84591
$$ -118126 -108792 351642 -2926 -11493 205171 128661 163484 110194 -15942 75841 260432
12078B60432F4521M4442N9052n3906B1013a91117A35139l8631a03327C75237i6500
$$ 260432 64521 108963 168015 114109 21013 -191117 135139 96508 -103327 375237 -96500
12066a18652C62210A13292l4331J3064L39462A80539f0670a9029C92177a2989
$$ -118652 362210 113292 78961 92025 431487 180539 -60670 -19029 392177 -12989
12055A25111B0251K95579n4271A25833K59307b48006B75259A11417J02697a40944
$$ 125111 20251 315830 261559 125833 385140 -248006 275259 111417 214114 -140944
12044f7636G7116b69235J29150A58677a39350A52567b18165F4997K39582j12254
$$ -67636 77116 -269235 -140085 158677 -139350 152567 -218165 64997 304579 192325
12034A92325c81101B32779p5674b85002a38481B17643e7710B46117r757a69924
$$ 192325 -381101 232779 157105 -285002 -138481 217643 -57710 246117 236360 -169924
12023c5231j79045h747k6497j75760A08614g9567H7001a21481J944A09048l8343
$$ -35231 -214276 -8747 -35244 -211004 108614 -79567 87001 -121481 -119537 109048 70705
12012G0705L37434n1669b83170G2968K61023H6239c62726A11883b32657b5642
$$ 70705 408139 356470 -283170 72968 333991 86239 -362726 111883 -232657 -25642
12001G7306K7007a65560g9450b3017m88A1927J95123K9357K12301A74236K8749
$$ 77306 104313 -165560 -79450 -23017 -23505 11927 207050 236407 448708 174236 202985
11990B02985m99A5523a61427E7369j3864J20820i7083o0235q1223b1524j89347
$$ 202985 202486 15523 -161427 57369 43505 164325 -97083 -157318 -238541 -21524 -210871
11979b10871A03899a91494H3983c9306K89k98873A90655a89276B11969a44873
$$ -210871 103899 -191494 83983 -39306 -39017 -337890 190655 -189276 211969 -144873
11968b39579c003G1242d7536a5100I0392g5543I070g9212K1750q0218e5194k38726
$$ -239579 -3003 71242 -47536 -15100 90392 -75543 9070 -79212 -57462 -137680 -55194 -293920
11956b93920J28972o0359p272f5879C37161A46510d2757j02213r4236a17670l767
$$ -293920 -164948 -225307 -232579 -65879 337161 146510 -42757 -144970 -239206 -117670 -121437
11945a21437e2210A11453a08302D5114g5924j12133k4955g6169o5998K9580A64641
$$ -121437 -52210 111453 -108302 45114 -75924 -188057 -213012 -76169 -142167 -112587 164641
11933D10910d6425C345K1439a15217F8087L5914j698a9359k59710E99807d1631
$$ 410910 -46425 3345 24784 -115217 68087 104001 102303 -19359 -279069 599807 -41631
11921I5915b72755A74595g2045l9119C77171a9008A2900b3144A51968i1843i889
$$ 95915 -272755 174595 -72045 -111164 377171 -19008 12900 -23144 151968 -91843 -9889
11909b79478B21507a9922j67303d7678J2966C59662I4491C2610e3290A36267F7947
$$ -279478 221507 -19922 -187225 -47678 -34712 359662 94491 32610 -53290 136267 67947
11897a21046A47951g6432j7207D04552A37534E8985J04452e149p9472a0317A42922
$$ -121046 147951 -76432 -93639 404552 137534 58985 163437 -5149 -84621 -10317 142922
11885C0000a43266j74751A6056a82762H0038a60452r2205C9266a92139l7859i8500
$$ 30000 -143266 -318017 16056 -182762 80038 -160452 -252657 39266 -192139 -229998 -98500
11873F3786L2512K6309c6489F2668M1204f8701B07920b21022B05673b36132D9253
$$ 63786 96298 122607 -36489 62668 103872 -68701 207920 -221022 205673 -236132 49253
11861D7882b39842d2852j18000K3832C995J67007g2834R467l11397a4361I3015
$$ 47882 -239842 -42852 -160852 -137020 3995 171002 -72834 -63367 -374764 -14361 93015
11849a89973F926J75427e1240F7838K9015a4249j28404d7233j20726h2266j01545
$$ -189973 6926 182353 -51240 67838 96853 -14249 -142653 -47233 -167959 -82266 -183811
11838a83811i0225R214j17411r6104a20551E4556a46063F8043h3760b0325m53529
$$ -183811 -90225 -81011 -198422 -294526 -120551 54556 -146063 68043 -83760 -20325 -473854
11827d73854B38135D8752A4589b49998D1389a23099N4568A47260b38635A84532
$$ -473854 238135 48752 14589 -249998 41389 -123099 -68531 147260 -238635 184532
11816A36753J35811F174K56272f1568a2161k4341A54050b04704R4519p5525C1898
$$ 136753 272564 6174 262446 -61568 -12161 -36502 154050 -204704 -110185 -185710 31898
11804b13739R2221k14196A8755a6724j76836h2170A94199R9582m5582a31439C032
$$ -213739 -121518 -335714 18755 -16724 -193560 -82170 194199 293781 248199 -131439 3032
11792b07753r7834J15390c1666j86709o8182c7426k18116d7598q57A33613n0501
$$ -207753 -305587 -190197 -31666 -218375 -286557 -37426 -255542 -47598 -48455 133613 83112
11781H3112c7785j61957c9905I8309a21863C28431o2863a16121j9912D4635b59516
$$ 83112 -37785 -199742 -39905 98309 -121863 328431 265568 -116121 -136033 44635 -259516
11769a0612F3681J90918h7293A33862R4081g8395o66202b53025A07195e4012q0014
$$ -10612 63681 254599 -87293 133862 227943 -78395 -744597 -253025 107195 -54012 -134026
11758a34026k49950F7122Q2023G1822a3597A57962a32892k24820c8665q8232A65644
$$ -134026 -383976 67122 149145 71822 -13597 157962 -132892 -357712 -38665 -126897 165644
11746c0032j91559A13717R7169r1000b01490C90684a45183r6095R5687I7547B2148
$$ -30032 -221591 113717 210886 119886 -201490 390684 -145183 -241278 -145591 97547 22148
11734b55822e8725D6662b03604A40326c02115b578A87036q8546c78607E2583b80340
$$ -255822 -58725 46662 -203604 140326 -302115 -2578 187036 98490 -378607 52583 -280340
11722c40789A1686d66071A07164J8250b15462e5508j31016e8484A8560J78841
$$ -340789 11686 -466071 107164 125414 -215462 -55508 -186524 -58484 18560 197401
11712A97401a12549k8559A23564h4321L8704l5976j82166G6101A520K32994H299
$$ 197401 -112549 -141108 123564 -84321 -45617 -81593 -263759 76101 1520 234514 8299
11700c6613k3674O044B73048C3506g4827A43338J51968h8097H3234J23758c46599
$$ -36613 -60287 -54243 273048 33506 -74827 143338 295306 -88097 83234 206992 -346599
11688B91848a19877j11199f4581A69846k253a56562B29304b6263B7702R1863J3692
$$ 291848 -119877 -231076 -64581 169846 167593 -156562 229304 -26263 27702 119565 133257
11677A33257a15953l4392M0370A99579l8402f6676j5413K5876A55213J16665A5149
$$ 133257 -115953 -150345 -109975 199579 161177 -66676 -82089 -56213 155213 271878 15149
11665a04146N514B92705j2252h6727I3109A2335b88355h4098n5839A22995J28257
$$ -104146 -98632 292705 280453 -86727 93109 12335 -288355 -84098 -139937 122995 251252
11654B51252j01915A1691K7480J18663o1026l4444L084f0611B38495a01280m0105
$$ 251252 149337 11691 39171 157834 96808 62364 65448 -60611 238495 -101280 -141385
11643a41385c5662j84591g8127C624c56878J46919C7112K21300e65739B59535
$$ -141385 -35662 -220253 -78127 3624 -356878 -209959 37112 258412 -565739 259535
11632h0099A92282a47582j19681Q7714l3161B0641J8485a45823l82228E5919f4036
$$ -80099 192282 -147582 -267263 -179549 -212710 20641 39126 -145823 -528051 55919 -64036
11620a79854A2854R2838m8635J23521J09660a94002B88656E4582I719i9645A21080
$$ -179854 12854 105692 57057 180578 290238 -194002 288656 54582 9719 -99645 121080
11608c3276l3272B65300d5996b2819j57689e6692a2095A03855b69883G1894J473
$$ -33276 -66548 265300 -45996 -22819 -180508 -56692 -12095 103855 -269883 71894 73367
11597G3367J80699k9597i821C1876a75694M6626J789A57606m133E9021b59275
$$ 73367 254066 224469 -9821 31876 -175694 -129068 -127279 157606 153473 59021 -259275
11585B62956a40272k45535A21100b22574H8016c9097j30166d9880m8347A76594
$$ 262956 -140272 -385807 121100 -222574 88016 -39097 -169263 -49880 -98227 176594
11574b734A54684P8509I0969Q3491J29886J56079A33432J7093d6096o6570k3798
$$ -2734 154684 233193 90969 174460 304346 460425 133432 150525 -46096 -112666 -136464
11563a36464A37643K9192k415n4009J53718A2769R3476J14272R4044j26340b0958
$$ -136464 137643 166835 164420 110411 264129 12769 106245 220517 314561 188221 -20958
11551A71194f6171b2131p2686A00455J35060A05127J02526b52814b2473k41991
$$ 171194 -66171 -22131 -94817 100455 235515 105127 207653 -252814 -22473 -264464
11541b64464B08644a53020f4645r5616F527b2848l4139B57563B9588d0628D0743
$$ -264464 208644 -153020 -64645 -160261 6527 -22848 -56987 257563 29588 -40628 40743
11529C84461j59197h1864A24055K52295I9612a5405p1373l9412h783m9905A31441
$$ 384461 225264 -81864 124055 376350 99612 -15405 -86778 -126190 -8783 -58688 131441
11517B96728H3570d3071A63632m95j2066D1779j1089b19173j83184J90811A74632
$$ 296728 83570 -43071 163632 163137 151071 41779 30690 -219173 -402357 -211546 174632
11505a27983B2302b93030G8827C2161b72730a13110o2577C17015I5262g4698r1101
$$ -127983 22302 -293030 78827 32161 -272730 -113110 -175687 317015 95262 -74698 -165799
11494a65799B35421E5512L00338b32506R4223d359C40272j63168J20440k3678
$$ -165799 235421 55512 355850 -232506 -138283 -4359 340272 177104 297544 273866
11484B73866E0073L48514j81897P6030I1619M05221A93445G1244a31391C2389
$$ 273866 50073 398587 216690 292720 91619 496840 193445 71244 -131391 32389
11473B9227J43207a21282F4663Q5531e889B81436K6533q6192J28603K5492j25266
$$ 29227 172434 -121282 64663 150194 -5889 281436 307969 221777 350380 375872 250606
11462B50606D7570a68321a1303B58857k5756E0282d2973n4881A86703J42938k2565
$$ 250606 47570 -168321 -11303 258857 233101 50282 -42973 -97854 186703 329641 307076
11451C07076A27854b07079b523G4207a05892B70738j05223C6994G463i4967A8558
$$ 307076 127854 -207079 -2523 74207 -105892 270738 165515 36994 7463 -94967 18558
11439B51017f1850B42203J7256a67398e3895k6315L9286k27085e5789A33574a6202
$$ 251017 -61850 242203 259459 -167398 -53895 -80210 -40924 -268009 -55789 133574 -16202
11427H2111J7594k4046h7974r7031a9082B56988l6890M8064J02008f0988H8617
$$ 82111 99705 75659 -87974 -185005 -19082 256988 220098 268162 370170 -60988 88617
11415a68733D6278a80501k00335D2113b42900C61250G4961a2528A68965b43567
$$ -168733 46278 -180501 -380836 42113 -242900 361250 74961 -12528 168965 -243567
11404G377J08508g7821A82671b232C6871L0694f0780a5152j91291f23D3984M2011
$$ 7377 115885 -77821 182671 -2232 36871 67565 -60780 -15152 -206443 -623 43984 85995
11392H5995b48870J01986p6531A53066J79238E0163J6424h7841A76656J98287
$$ 85995 -248870 -146884 -223415 153066 332304 50163 66587 -87841 176656 374943
11382C74943A22283J55298n1666q1018b52501o6297J12351B30189c3541I1965
$$ 374943 122283 277581 225915 144897 -252501 -318798 -206447 230189 -33541 91965
11371b62515C58144A524b59638A66495a34476j29672A97277p3291d2481g503H8595
$$ -262515 358144 1524 -259638 166495 -134476 -264148 197277 123986 -42481 -7503 88595
11359F2391E299i4798K5607A20604K16964L1943c31045a09868A76007A036d03441
$$ 62391 5299 -94798 -69191 120604 337568 369511 -331045 -109868 176007 1036 -403441
11347a23078D01647b21582F7874f9871F1764a55146c6192j68481A82741i1189
$$ -123078 401647 -221582 67874 -69871 61764 -155146 -36192 -204673 182741 -91189
11336G1107e0288k0714A51784P3175c03062B4627O4930b11431L2531d5325C6449
$$ 71107 -50288 -71002 151784 224959 -303062 24627 89557 -211431 -178900 -45325 36449
11324I3307a03534j35697c3271I0403e2628B14278b93143J22045C75315A24121
$$ 93307 -103534 -239231 -33271 90403 -52628 214278 -293143 -171098 375315 124121
11313A98013A6157a5532o7R32k13339e7052D3209Q3711M4219h4723p9823p6731
$$ 198013 16157 -15532 -15599 -14667 -228006 -57052 43209 126920 171139 -84723 -164546 -241277
11301b41277F0818a26292k92849J92886I8712b11097b9214k13512M3232F0695
$$ -241277 60818 -126292 -419141 -226255 98712 -211097 -29214 -242726 -199494 60695
11290g954k25406M7805b5828q0890D02795A84988q9299N9066I589J6296a80440
$$ -7954 -233360 -185555 -25828 -106718 402795 184988 95689 154755 9589 25885 -180440
11278C8630c6710j17574A3084a66628M8868A185Q3524J11898p7567b06962o5911
$$ 38630 -36710 -154284 13084 -166628 -117760 1185 84709 196607 119040 -206962 -272873
11267b72873M2314g8399H2762b44685a19447B62435a19770r8227f4244H838K34127
$$ -272873 -230559 -78399 82762 -244685 -119447 262435 -119770 -217997 -64244 8838 242965
11256B42965i8316l4627A13264d0760o9818j94242B4207a94083j07878k248J16086
$$ 242965 -98316 -132943 113264 -40760 -110578 -304820 24207 -194083 -301961 -304209 -188123
11245a88123A66400b49752C6332a24660B30569I6894d0432j63357a00306I9767
$$ -188123 166400 -249752 36332 -124660 230569 96894 -40432 -203789 -100306 99767
11234a35403n9865A91097c4539r1817p3720B95283a34560j8847g0271F6874a60185
$$ -135403 -195268 191097 -34539 -126356 -200076 295283 -134560 -153407 -70271 66874 -160185
11222a2352k25914a15908D6378B3043g2678A06998J66196F4900h8912j08777k39464
$$ -12352 -238266 -115908 46378 23043 -72678 106998 273194 64900 -88912 -197689 -437153
11211d37153a17225E2800a02673k1185a3856B43268B7139L418Q7925a31897M5159
$$ -437153 -117225 52800 -102673 -123858 -13856 243268 27139 30557 118482 -131897 -86738
11200h6738j98497G731P5227f4474l8360m33730J98791a17164j70227B273Q7649
$$ -86738 -285235 7731 82958 -64474 -102834 -536564 -337773 -117164 -287391 2273 89922
11189H9922J99953a44681O2875m52765J24282b2404k39878A94210E7381j7018
$$ 89922 289875 -144681 -81806 -534571 -410289 -22404 -262282 194210 57381 40363
11179D0363b86011A1566a02448L9323l00802a2672l81361E7324b63395k90572
$$ 40363 -286011 11566 -102448 -63125 -363927 -12672 -394033 57324 -263395 -553967
11169e53967a63151C8596J29869C5873Q287c5508j01112p0684A13371b22952C42483
$$ -553967 -163151 38596 168465 35873 44160 -35508 -136620 -207304 113371 -222952 342483
11157d61446e240j14914A79328i36A61357g4527B8538L678J65867H0470b34898
$$ -461446 -5240 -120154 179328 -936 161357 -74527 28538 32216 198083 80470 -234898
11145h9822l001A52182F4014J4795b010j27441F7311a46273A33054L8668a21752
$$ -89822 -92823 152182 64014 78809 -2010 -129451 67311 -146273 133054 171722 -121752
11133d9046C07918b2982j75787L068l0802b7665p8381A61687e6646a6441A17172
$$ -49046 307918 -22982 -198769 -195701 -226503 -27665 -106046 161687 -56646 -16441 117172
11121a70931A85889E6777a69612b6192B11748n7816J29868d4492B80987r6129
$$ -170931 185889 56777 -169612 -26192 211748 153932 283800 -44492 280987 184858
11111A84858B8134a24282I5005b59581b0155B364M64206B5649K03956H5709a73036
$$ 184858 28134 -124282 95005 -259581 -20155 2364 466570 25649 229605 85709 -173036
11099a76405p4513B5297J19419o0842m682a40183d3750A14647E0299P6507d8939
$$ -176405 -250918 25297 144716 83874 79192 -140183 -43750 114647 50299 126806 -48939
11087B1888i3982B00936i2360p5807B61371a9703H4668b1437F57319a43966G9868
$$ 21888 -93982 200936 -92360 -168167 261371 -19703 84668 -21437 657319 -143966 79868
11075b26724B41461k7169j06518J01336r9560c2876A74610L9584J87634A63159
$$ -226724 241461 214292 107774 209110 109550 -32876 174610 214194 401828 163159
11064B17180b33859B39311A4092K26109a11194B14169a10166A9435L79548q1399
$$ 217180 -233859 239311 14092 240201 -111194 214169 -110166 19435 398983 317584
11054C17584R7583o8001D2630L39611j01493j14844K44014j94595K7886J61951
$$ 317584 415167 347166 42630 382241 280748 165904 409918 215323 243209 405160
11044D05160A52919K92640J28621k4130j41730R0569J69057N4538k68642L21832
$$ 405160 152919 445559 574180 550050 408320 498889 667946 722484 453842 775674
11034G75674k1672Q894C76917K85879K48075l31019B79751O26057k63360J17353
$$ 775674 754002 762896 376917 662796 910871 579852 279751 905808 642448 759801
11024G59801j80728o3995M8703K08158j06359O2741j47288B73875K95125J22706
$$ 759801 579073 515078 563781 771939 665580 728321 581033 273875 569000 691706
11014F91706j47116Q7035O2445n6329Q8598r7362j08330N0277K69896j68562r4824
$$ 691706 544590 631625 694070 637741 726339 628977 520647 570924 840820 672258 577434
11003E77434j45194J27855j30283K26411r0209j94678N6446L82467l80563j4342
$$ 577434 432240 560095 429812 656223 566014 371336 427782 810249 429686 415344
10993D15344J14938j08159J50195j6840R1470J30320k95971K9247K4177p6910
$$ 415344 530282 422123 572318 555478 646948 777268 481297 510544 534721 457811
10983D57811P5959o1725j26050K88543k74304J89575j8857N5593j69453M0070
$$ 457811 533770 472045 345995 634538 360234 549809 530952 586545 417092 457162
10973D57162Q3361K17175O9599j04222j74380M12611j50815p6695J5753K80480
$$ 457162 540523 757698 827297 723075 548695 961306 810491 733796 749549 1030029
10963A030029p0353J40743R2697P1409j27917M60584J86259r0198K90893j85599
$$ 1030029 959676 1100419 1193116 1264525 1136608 1597192 1783451 1693253 1984146 1798547
10953A798547O65874j02367j88968j93351J98043q518n08169K2558r9064j47608
$$ 1798547 2464421 2362054 2173086 1979735 2177778 2169260 1661091 1683649 1584585 1436977
10943A436977k37112K23829k56005J97602J83130Q9285j40324j69590o7679k11046
$$ 1436977 1199865 1423694 1167689 1365291 1548421 1637706 1497382 1327792 1260113 1049067
10933A049067l33550k31685N48566j92756B28764J46707M9390A63219m1280J85572
$$ 1049067 715517 483832 1032398 839642 228764 375471 424861 163219 121939 307511
10923C07511G0597j5500a73002B10344J28901E8172J67231H8202j7647c12727
$$ 307511 70597 55097 -173002 210344 339245 58172 225403 88202 70555 -312727
10912E0362d892r6084B82318K1206C9672a38967k4793J8836B91348A31664B66
$$ 50362 -4892 -100976 282318 303524 39672 -138967 -163760 -144924 291348 131664 266
10900A75172c4155k9158l2515o5569f5982j25142d3013B23809a54069L0984n1962
$$ 175172 -34155 -63313 -95828 -161397 -65982 -191124 -43013 223809 -154069 -123085 -175047
10889a75047K7047b2570h045j70196A296a58658D1299c2210B2248a05079n40944
$$ -175047 -148000 -22570 -8045 -178241 1296 -158658 41299 -32210 22248 -105079 -646023
10878f46023A70057D5403a07805Q534k76149b7160k710k19372c3382A91327c19646
$$ -646023 170057 45403 -107805 -99271 -375420 -27160 -29870 -249242 -33382 191327 -319646
10866a86001H2099c1919j19808I8863P2871j2584B6126a39272A20648k2694b57914
$$ -186001 82099 -31919 -151727 98863 171734 159150 26126 -139272 120648 97954 -257914
10854a0835B12019n1990e6740l11606O473K4648J50781A66058M866b16032A44362
$$ -10835 212019 160029 -56740 -368346 -361873 -337225 -186444 166058 170924 -216032 144362
10842a81907G8356C2268a4631A81518a40489E0909P1184A4515a4059j40004A1270
$$ -181907 78356 32268 -14631 181518 -140489 50909 122093 14515 -14059 -154063 11270
10830A6247K82573C5493a86047N927D3312c64897B87342m8194c1811H8483a01874
$$ 16247 298820 35493 -186047 -180120 43312 -364897 287342 239148 -31811 88483 -101874
10818f40C7828a97364E7540c351j16143a4148A72490a73326B04040h5956j18769
$$ -640 37828 -197364 57540 -3351 -119494 -14148 172490 -173326 204040 -85956 -204725
10807b04725o1282a3451q99H9822A6802b6724j49643j47917J55587B39310b2211
$$ -204725 -266007 -13451 -14350 89822 16802 -26724 -176367 -324284 -168697 239310 -22211
10795a93246m9154B7627R7772a18126n5068M8199G7928a67983N5409C0097K13717
$$ -193246 -242400 27627 125399 -118126 -173194 -124995 77928 -167983 -112574 30097 243814
10784B43814d6433n8453F1663i3898k11739e4831k23559h0062B20351a67116D4150
$$ 243814 -46433 -104886 61663 -93898 -305637 -54831 -278390 -80062 220351 -167116 44150
10772A69928P0221a05929E0963a07863I9304O8338c7514j12300b0458l19804b1135
$$ 169928 240149 -105929 50963 -107863 99304 167642 -37514 -149814 -20458 -340262 -21135
10760B1309f9481N176F3863b50358i8091j06323B2345a00162E7299a58732b711
$$ 21309 -69481 -64305 63863 -250358 -98091 -204414 22345 -100162 57299 -158732 -2711
10748A76208d3011B95946c10278J43872P8305b4617a40A17287a49120k8537R300
$$ 176208 -43011 295946 -310278 -166406 -88101 -24617 -140 117287 -149120 -177657 -168357
10737a68357B2593K6553a55919p0273m9512G3013b08736Q7968n71E5430E215J41162
$$ -168357 22593 49146 -155919 -226192 -275704 73013 -208736 -120768 -121339 55430 5215 146377
10725A46377M5859J01033h1448A57468R8662b02949B25015G335J37259b76176
$$ 146377 192236 293269 -81448 157468 256130 -202949 225015 7335 144594 -276176
10714b02449N1916j80158B49086Q2180d6759r5151F5328J5516A5793a88778D3540
$$ -202449 -150533 -330691 249086 331266 -46759 -141910 65328 80844 15793 -188778 43540
10702g0276l2419c4955B22216q9192b68039G50a85883c6664F9604M9123i2838
$$ -70276 -102695 -34955 222216 133024 -268039 750 -185883 -36664 69604 118727 -92838
10690d0285j37132d2064G4853b13060c6087o9759j59108J6299c7206n20437a02964
$$ -40285 -177417 -42064 74853 -213060 -36087 -105846 -264954 -248655 -37206 -557643 -102964
10678C10824i2328C59006h6035I1579A2743a81276a5390l13846F7168b2488j16751
$$ 310824 -92328 359006 -86035 91579 12743 -181276 -15390 -329236 67168 -22488 -139239
10667a39239n4455E7001f3236A28060o1033a79471g319k43553L1053d9028D6367
$$ -139239 -193694 57001 -63236 128060 67027 -179471 -7319 -250872 -219819 -49028 46367
10655A12877a93708B0548i6152k29205A22772a5921F8578c0225A6806J32222C6549
$$ 112877 -193708 20548 -96152 -325357 122772 -15921 68578 -30225 16806 149028 36549
10643H117L05647b42299H4050i1888j01654o5373A86559G6583O5957p0331B5140
$$ 8117 313764 -242299 84050 -91888 -193542 -258915 186559 76583 142540 72209 25140
10631h7041A44126a08900j4570B35630D5112K6187a0572I3698c60887h9300k73244
$$ -87041 144126 -108900 -123470 235630 45112 71299 -10572 93698 -360887 -89300 -362544
10620c62544a1883k62035a09102B6111b11670h1742b9853A76030c15278J34114
$$ -362544 -11883 -273918 -109102 26111 -211670 -81742 -29853 176030 -315278 -181164
10610a81164h6522J579j15255E2910d40497a14401d3243G2766J5783d06755e9587
$$ -181164 -86522 -84943 -200198 52910 -440497 -114401 -43243 72766 88549 -406755 -59587
10598b7614m2871A31350b1305l12765B15079b563k77795A0477b15809A57479l1991
$$ -27614 -70485 131350 -21305 -334070 215079 -2563 -280358 10477 -215809 157479 125488
10587A25488a59430C63900e8265B70571c22768a00311p4940O6547k76717c0498
$$ 125488 -159430 363900 -58265 270571 -322768 -100311 -175251 -108704 -385421 -30498
10576A5170a26972N0331l6153H1877e121l76274d1577C741a79417N2325A8569
$$ 15170 -126972 -76641 -112794 81877 -5121 -381395 -41577 3741 -179417 -127092 18569
10564a41021j24712A27842l2027d8524j8935C3817h3501A6988J54213a9745B25765
$$ -141021 -265733 127842 95815 -48524 -67459 33817 -83501 16988 171201 -19745 225765
10552b56037G1563c4027j59276E1030c3321k33188A71224b94275a00226j10182
$$ -256037 71563 -34027 -193303 51030 -33321 -266509 171224 -294275 -100226 -210408
10542b10408P2482e5494I0696d08798A16566a20890H5778A0145a74388Q119p3221
$$ -210408 -137926 -55494 90696 -408798 116566 -120890 85778 10145 -174388 -166269 -239490
10531b39490c0628I555f2688m4214G3016J64151D1951j3690a770j72845I1242
$$ -239490 -30628 9555 -62688 -106902 73016 237167 41951 28261 -1770 -174615 91242
10519G5927b26834h2456j09860O5849K6543A39498a40631a3434k20686J0579f9114
$$ 75927 -226834 -82456 -192316 -126467 -99924 139498 -140631 -13434 -234120 -223541 -69114
10507F8379b5565B95412D5268b86144I2089a58738j11093D0288K5715b06230i7929
$$ 68379 -25565 295412 45268 -286144 92089 -158738 -269831 40288 66003 -206230 -97929
10495h6181k16856A02829H925a86674a2697H0012a92313k51691h8780E8571I16
$$ -86181 -303037 102829 8925 -186674 -12697 80012 -192313 -444004 -88780 58571 916
10483I4893J49431a12686j18800B43278i2197o2207A76955O2757j07489a28673
$$ 94893 244324 -112686 -231486 243278 -92197 -154404 176955 239712 132223 -128673
10472C4168c1533k74420N5360E9102g7065a8106o5138l7198A40904C9102J13712
$$ 34168 -31533 -305953 -250593 59102 -77065 -18106 -83244 -120442 140904 39102 152814
10461A52814R3449J01858A54944R215J57965j22430R7007l3249b6528A29162b05029
$$ 152814 246263 348121 154944 164159 322124 199694 296701 263452 -26528 129162 -205029
10449b1625j72368e9508k19996f1158j94012F9198C2580a5457k40982C28950j646
$$ -21625 -193993 -59508 -279504 -61158 -255170 69198 32580 -15457 -256439 328950 327304
10438C27304E0005a9841j31038d1667C70436A24228n3291a35698E4641a3899F6467
$$ 327304 50005 -19841 -150879 -41667 370436 124228 70937 -135698 54641 -13899 66467
10426b12752i912C1409L26694e0503D879P9150h5390G2510g0288o226m8454Q040
$$ -212752 -9912 31409 358103 -50503 4879 84029 -85390 72510 -70288 -76514 -124968 -116928
10414a16928G8794M9037b32286n7076a34877j46387A08526P131M6437j9722g5424
$$ -116928 78794 127831 -232286 -289362 -134877 -281264 108526 115657 162094 142372 -75424
10402a00961c710B5713K14657b42467A03082M77002G0764d4542H4436l8611b06523
$$ -100961 -3710 25713 240370 -242467 103082 580084 70764 -44542 84436 45825 -206523
10390d4700l13310I5635K31211g8096j03409k6888i2484L5379n7938C3395a22410
$$ -44700 -358010 95635 326846 -78096 -181505 -208393 -92484 -57105 -115043 33395 -122410
10378a53081f9250B77603e8347G7732b9131A11133Q3396m6175e6652K3864C15550
$$ -153081 -69250 277603 -58347 77732 -29131 111133 194529 148354 -56652 -32788 315550
10366H1567A8811q322J37063B6204K7297q352c003A33814O5693K56142G5719K95639
$$ 81567 18811 10489 147552 26204 53501 45149 -3003 133814 199507 455649 75719 371358
10354C71358N031Q4069j55348R1686E7045K19626A01492K6883M04516k55136R346
$$ 371358 376389 460458 305110 396796 57045 276671 101492 128375 532891 277755 287101
10343B87101N3967J03020C1553i7121C42467j3778e8941C53930n2085O1066A21825
$$ 287101 341068 444088 31553 -97121 342467 328689 -58941 353930 301845 362911 121825
10331D40665j47514A08686C6257K81482J47571A50439J941J36489a4560B2564
$$ 440665 293151 108686 36257 317739 465310 150439 152380 288869 -14560 22564
10320A24485b9493o6418C31750a64278A3940e1460k4811c242B61767a64313B70702
$$ 124485 -29493 -95911 331750 -164278 13940 -51460 -76271 -3242 261767 -164313 270702
10308b4709A63697J27780D9176J55877l2074A0929a61801I219K50901a59702c1404
$$ -24709 163697 291477 49176 205053 172979 10929 -161801 9219 260120 -159702 -31404
10296D1353d16248A40924D6563a45727g0001J5589J7803G7373a42993n6377A65430
$$ 41353 -416248 140924 46563 -145727 -70001 -54412 -36609 77373 -142993 -199370 165430
10284C12573a20972k5734A91528h4998m6024A63484R030h8189a6615k79718Q9891
$$ 312573 -120972 -146706 191528 -84998 -131022 163484 172514 -88189 -16615 -296333 -206442
10273b06442P5940G3227b86101A96924m2566g643A50841P9387a58122D7450a17616
$$ -206442 -130502 73227 -286101 196924 154358 -7643 150841 230228 -158122 47450 -117616
10261g6003c2307C0988A1654i6202A97977a56830e9298A12233P510b94361L6026
$$ -76003 -32307 30988 11654 -96202 197977 -156830 -59298 112233 119743 -294361 -258335
10250b58335E0164b83658Q9905A11954J97400b3957B84276A00379J23698r9307
$$ -258335 50164 -283658 -193753 111954 309354 -23957 284276 100379 224077 124770
10240A24770e4525D06055A28510J27079b7496A04940K50094f9831B05101a80861
$$ 124770 -54525 406055 128510 255589 -27496 104940 355034 -69831 205101 -180861
10229B32270l8361a20338a0995r9096j30657A10222m8914b27161j13607B64516
$$ 232270 193909 -120338 -10995 -110091 -240748 110222 61308 -227161 -340768 264516
10218e3613o2772E4190b36891l0236A60826L3820D2867c4439B5935a55809a9762
$$ -53613 -116385 54190 -236891 -267127 160826 194646 42867 -34439 25935 -155809 -19762
10206d9595A46510b21409B88987o9012q4097b39096a6881B3571M1336J81089b49280
$$ -49595 146510 -221409 288987 219975 135878 -239096 -16881 23571 64907 245996 -249280
10194b14695J1918j1468c0750l96737J96813k71445a47041f9332j15002L0629
$$ -214695 -202777 -214245 -30750 -427487 -230674 -502119 -147041 -69332 -184334 -153705
10184a53705A31258b18216e0938F3323e1424A2430b15830F5555d8849B79961F8541
$$ -153705 131258 -218216 -50938 63323 -51424 12430 -215830 65555 -48849 279961 68541
10172d5004n0949F8766k1537M8365K67405c4821j10044J1437j06311a8395M106
$$ -45004 -95953 68766 47229 95594 362999 -34821 -144865 -133428 -239739 -18395 -14289
10161a4289k35772f5790q7942C27001a68252C954L8080J46723d9965A6918K67203
$$ -14289 -250061 -65790 -153732 327001 -168252 3954 42034 188757 -49965 16918 284121
10150B84121a45061G7268a00394j80131J32895k59949i4385j6553D6750a27350
$$ 284121 -145061 77268 -100394 -280525 -147630 -407579 -94385 -110938 46750 -127350
10139A18689Q6350a60995l0870D0983j574O2368j1011c38471i7581J3439k6167
$$ 118689 205039 -160995 -191865 40983 39409 101777 90766 -338471 -97581 -84142 -110309
10128a10309a7218k22848I6319Q5991c30904a62652A0678K38727b41707F4589
$$ -110309 -17218 -240066 96319 182310 -330904 -162652 10678 249405 -241707 64589
10117B96939C7614e5488r3641A7996Q1259d37340a73672A16621J4839a36389b3097
$$ 296939 37614 -55488 -149129 17996 99255 -437340 -173672 116621 131460 -136389 -23097
10105a34390j21184a17235k38060A5392a93664A09564b2553C6711a53565A34962
$$ -134390 -255574 -117235 -355295 15392 -193664 109564 -22553 36711 -153565 134962
10094F7465a85935i1100B9021a67899B31726g9952A33228c4590j57701A17880
$$ 67465 -185935 -91100 29021 -167899 231726 -79952 133228 -34590 -192291 117880
10083A02595a89529d8l06729B0601J43105G7764A7474b08007A0327b36261J870
$$ 102595 -189529 -48 -306777 20601 163706 77764 17474 -208007 10327 -236261 -234391
10072b34391B76931I683P0934d7196A94980a1256C3083c28125J54215B33593a08564
$$ -234391 276931 9683 80617 -47196 194980 -11256 33083 -328125 -173910 233593 -108564
10060b05336k27681A04528a14776D665i4770K0167q832m2344E956J37571a52712
$$ -205336 -433017 104528 -114776 4665 -94770 -74603 -83435 -125779 5956 143527 -152712
10048a34684Q898k6755o683J9408A7223N2537m554O007a81502j75591A65910b15993
$$ -134684 -125786 -152541 -159224 -139816 17223 69760 65206 71213 -181502 -357093 165910 -215993
10035b31388C22747A6875J04217d5567o575H034p83i0384c9285j49250K5357m219
$$ -231388 322747 16875 121092 -45567 -52142 8034 7251 -90384 -39285 -188535 -163178 -167397
10023a67397b8729F2127b66299a10561C0502c3881j08940N8574j78240b5577k02905
$$ -167397 -28729 62127 -266299 -110561 30502 -33881 -142821 -84247 -262487 -25577 -228482
10012b28482F4842Q1686P4364q0892b02011N2814A86541P5956a05764A56741a84766
$$ -228482 64842 146528 220892 140000 -202011 -149197 186541 262497 -105764 156741 -184766
10000b88280A35962b41669r3357F7594L0127j0472o2k7003c00176o4341A19031
$$ -288280 135962 -241669 -335026 67594 97721 87249 87187 60184 -300176 -364517 119031
9988e1197j94162n2583d8120k34099J28329O7008q7441b4867D480a95426B87668
$$ -51197 -245359 -297942 -48120 -282219 -153890 -86882 -174323 -24867 4480 -195426 287668
9976a16271j61729j3857A8291b18552I1961b40363j64169a3866j48899b6534m3492
$$ -116271 -278000 -291857 18291 -218552 91961 -240363 -404532 -13866 -162765 -26534 -70026
9965g0026A41889b73137J05290J4040M4337j41259E1156f5391A8727b56790C3647
$$ -70026 141889 -273137 -167847 -153807 -109470 -250729 51156 -65391 18727 -256790 33647
9953C3603c93605B94537h9006q6792f710j32542A46967F058e520j8699C21019
$$ 33603 -393605 294537 -89006 -175798 -6710 -139252 146967 6058 -5520 -24219 321019
9941C4145L1189J38445c62272J47873b9361Q573j15405m9812g9367p0020a7945
$$ 34145 65334 203779 -362272 -214399 -29361 -20788 -136193 -186005 -79367 -149387 -17945
9929G6212a5865N429j13455J0237o9297L1533o4366g7128k05922a11599B05159
$$ 76212 -15865 -10436 -123891 -113654 -182951 -151418 -215784 -77128 -283050 -111599 205159
9917E996a56474A29005a92442G5822a04330k20235G6784C3532N8577a58277F6553
$$ 5996 -156474 129005 -192442 75822 -104330 -324565 76784 33532 92109 -158277 66553
9905G5296c31439J63519J2433j55486h4436C5414g9020A14551P6490a47318A37370
$$ 75296 -331439 -167920 -155487 -310973 -84436 35414 -79020 114551 191041 -147318 137370
9893b69264G48c5092q8894k09442Q5054a4701j93072k75896a11143A05971K14713
$$ -269264 748 -35092 -123986 -333428 -248374 -14701 -207773 -483669 -111143 105971 320684
9882C20684h5412l70129A64828r039f9905j78333A86307N3555a95218E5926c34601
$$ 320684 -85412 -455541 164828 155789 -69905 -248238 186307 239862 -195218 55926 -334601
9870H2464B604c23913D761J30036m0652a67272A91705a92832c8458D5370g9381
$$ 82464 2604 -323913 4761 134797 94145 -167272 191705 -192832 -38458 45370 -79381
9858H7481b02279K9391f795A81646a12447J2110j29754h7522I3580b77865h76
$$ 87481 -202279 -172888 -6795 181646 -112447 -100337 -230091 -87522 93580 -277865 -876
9846b08274C21078a68263d0414l03480a4570A44939b99992R5504B4974M4980a62314
$$ -208274 321078 -168263 -40414 -343894 -14570 144939 -299992 -204488 24974 69954 -162314
9834A69115k5853B311a2849j83507A80836c66507a07222j87816a4926k79646Q3454
$$ 169115 143262 2311 -12849 -196356 180836 -366507 -107222 -295038 -14926 -294572 -211118
9823b11118o4082J27210B48581q2993b21998f8798j1147L0273K470j3982A23872
$$ -211118 -275200 -147990 248581 165588 -221998 -68798 -79945 -49672 -47202 -61184 123872
9811b23338N43k09351B2625J06673b64728g3364m4215B9947d1966A1981c34881
$$ -223338 -222795 -432146 22625 129298 -264728 -73364 -117579 29947 -41966 11981 -334881
9799A44433l3452A5867b3229h182q2437K663m01819a68963g4215B59784c38704
$$ 144433 110981 15867 -23229 -8182 -90619 -87956 -489775 -168963 -74215 259784 -338704
9787A09751C9598A5158d90586a42535D4051h3044j40539A6600O4440O5417i0143
$$ 109751 39598 15158 -490586 -142535 44051 -83044 -223583 16600 81040 146457 -90143
9775C35500F4989b5386k27493M2029b6884J0153j64827q9224A62294p6581C4498
$$ 335500 64989 -25386 -252879 -210850 -26884 -16731 -181558 -270782 162294 85713 34498
9763b6399j19644A49011f2231k02374J25237B08307I3433i5918A2313e1687G7108
$$ -26399 -146043 149011 -62231 -264605 -139368 208307 93433 -95918 12313 -51687 77108
9751B194b51572j41544c9275E9815c05724C6418i1437C10140a82620d9423n4323
$$ 2194 -251572 -393116 -39275 59815 -305724 36418 -91437 310140 -182620 -49423 -103746
9740a03746r3460b1974k60946Q098I0430a47380c8310B74648c1181k85573D9003
$$ -103746 -197206 -21974 -282920 -274822 90430 -147380 -38310 274648 -31181 -316754 49003
9728b36253n1166b5196l15680A70260F7156c51817A90267g7748j14543k15122
$$ -236253 -287419 -25196 -340876 170260 67156 -351817 190267 -77748 -192291 -407413
9718d07413A1417c9893p9213J4425H2550b03147O5075k3908N4405j52886A16020
$$ -407413 11417 -39893 -119106 -104681 82550 -203147 -138072 -161980 -107575 -260461 116020
9706B8734P9287J49446d44385d7403A66880a50866I0794K50783f7849A16405a90532
$$ 28734 108021 257467 -444385 -47403 166880 -150866 90794 341577 -67849 116405 -190532
9694a42093E2017b3151H5266J10614P6066b59824i6310n7255A66758a67515A49899
$$ -142093 52017 -23151 85266 195880 271946 -259824 -96310 -153565 166758 -167515 149899
9682E612a16076F1532a05860k02366l5810E0617E573h6036k34710J50047j9682
$$ 5612 -116076 61532 -105860 -308226 -344036 50617 5573 -86036 -320746 -170699 -190381
9671a90381b4603l38044D6753d47416J89718R7207C10941a46137B2230a38545
$$ -190381 -24603 -362647 46753 -447416 -257698 -160491 310941 -146137 22230 -138545
9660A10275a51015i974j43993A89590b60097f2868p8471B71874b14504i1698L3795
$$ 110275 -151015 -9974 -153967 189590 -260097 -62868 -141339 271874 -214504 -91698 -57903
9649e7903n3804k83583j83226A06547N4974b04835B345a11392A09158a83062D36567
$$ -57903 -111707 -395290 -578516 106547 161521 -204835 2345 -111392 109158 -183062 436567
9637A15558a41626b3324l6969k48298Q2688E3624i8055C7293J35866C744L937
$$ 115558 -141626 -23324 -60293 -308591 -225903 53624 -98055 37293 173159 3744 7681
9626G681h0781B9944K4250j3226J2729K38994I9783r277a01944c3103k31352b8621
$$ 7681 -80781 29944 54194 40968 53697 292691 99783 90506 -101944 -33103 -264455 -28621
9613a5354j76389j58414G9414a63788P794C84736c55357e2961J1293l559b157
$$ -15354 -191743 -350157 79414 -163788 -155994 384736 -355357 -52961 -41668 -45227 -2157
9601b03375a9590j94773B67359I1932a35113j47148K7130h0788C67995b60261
$$ -203375 -19590 -214363 267359 91932 -135113 -282261 -255131 -80788 367995 -260261
9590a13179K2999j07597D5691R5725d2611j42858r2267A11675b46260C25896a23809
$$ -113179 -90180 -197777 45691 141416 -42611 -185469 -277736 111675 -246260 325896 -123809
9578I7727b77343f6926C39262A19489f3408k10154P1217O3970p9641e3810l05387
$$ 97727 -277343 -66926 339262 119489 -63408 -273562 -202345 -138375 -218016 -53810 -359197
9567c59197P7475J37728E1412b39000e2570j64120D4876O9750b5483F8264b93400
$$ -359197 -281722 -143994 51412 -239000 -52570 -216690 44876 114626 -25483 68264 -293400
9555a10133K5313j34081A89413d1086j30219C4540J34951A5183J29536I384c27247
$$ -110133 -84820 -218901 189413 -41086 -171305 34540 169491 15183 144719 9384 -327247
9543i692F9731d30065b1901C4849a3691C089J64220f6828j84620j25467m1227
$$ -9692 69731 -430065 -21901 34849 -13691 3089 167309 -66828 -251448 -376915 -418142
9532d18142i9251E2760h2376j24497P8148C5476f6968j04119a4275j69000A01393
$$ -418142 -99251 52760 -82376 -206873 -128725 35476 -66968 -171087 -14275 -183275 101393
9520a9363A77779b48505a15845r2591A11953b29319E9794K20130d31960J75521
$$ -19363 177779 -248505 -115845 -208436 111953 -229319 59794 279924 -431960 -256439
9510b56439D5963a50175B31729C8339d0512j07982J0646C88071j44225c10771
$$ -256439 45963 -150175 231729 38339 -40512 -148494 -137848 388071 243846 -310771
9499b19931Q1427A48339a69606j72113A76064B305c72210J40283A2677a98158
$$ -219931 -138504 148339 -169606 -341719 176064 2305 -372210 -231927 12677 -198158
9488C0482b38700B6366c70658J60065c8524A08853c51405a28861l4471e659j97900
$$ 30482 -238700 26366 -370658 -210593 -38524 108853 -351405 -128861 -163332 -5659 -203559
9477b03559g9569k87910a07945l3388p0589J6454j67148A27704h2611c3953B67024
$$ -203559 -79569 -367479 -107945 -141333 -211922 -195468 -362616 127704 -82611 -33953 267024
9465B10454b27218A11571Q4503J08013H6665a20152b2927D8927R3339M3237a35928
$$ 210454 -227218 111571 196074 304087 86665 -120152 -22927 48927 142266 185503 -135928
9453a84408A27716B3384b17231A67328A265a12990L1961l46330a0750A07139D9240
$$ -184408 127716 23384 -217231 167328 1265 -112990 -81029 -427359 -10750 107139 49240
9441C3014K6308f9313A3833c3228C3043c5995j43838d2422j05916k7709A03215
$$ 33014 59322 -69313 13833 -33228 33043 -35995 -179833 -42422 -148338 -176047 103215
9429B44312a49408A18105a43488K5329K6875l09943a45485j1410k7450f6816j4286
$$ 244312 -149408 118105 -143488 -118159 -91284 -401227 -145485 -156895 -184345 -66816 -81102
9418h1102K4172j45099A99934a08692H9642c37421E3958R0808a53183d626o5978
$$ -81102 -56930 -202029 199934 -108692 89642 -337421 53958 144766 -153183 -4626 -70604
9407g0604L3976m9039A15411b7303l31821M3384c4781l72812e9555K6815E2692
$$ -70604 -36628 -85667 115411 -27303 -359124 -315740 -34781 -407593 -59555 -32740 52692
9395f1248j5016B48048b14996I1918k1370B3828K31783j11798c4913C15576c20487
$$ -61248 -76264 248048 -214996 91918 70548 23828 255611 143813 -34913 315576 -320487
9383b19155Q2134L220j25823e2988A38244D7211B0827a50681A14549c3253C7994
$$ -219155 -137021 -133801 -259624 -52988 138244 47211 20827 -150681 114549 -33253 37994
9371a98182q3449a3155l6462J9278k5284G6197M8335a03419j74482A8307b46182
$$ -198182 -281631 -13155 -49617 -30339 -55623 76197 124532 -103419 -277901 18307 -246182
9359b64356q2548J39478q1907c9155j56882j2271A67079Q78e455j20172A18204
$$ -264356 -346904 -207426 -289333 -39155 -196037 -208308 167079 167957 -5455 -125627 118204
9347C6185L66390c9455a7880k29201A59491a98449b1901k12468a17100B25988
$$ 36185 402575 -39455 -17880 -247081 159491 -198449 -21901 -234369 -117100 225988
9336b89860h6699j39419Q3039K9149B1716Q970a06416H2494l6886R2741a53801
$$ -289860 -86699 -226118 -143079 -113930 21716 30686 -106416 82494 45608 138349 -153801
9324A12908l0114J0332L5773j6529J63965a86917m340c6360m5042A60432c57582
$$ 112908 82794 93126 128899 112370 276335 -186917 -191257 -36360 -81402 160432 -357582
9312a07488m1257C2897d5562M074j75649a3725k90773C29791A24433c5618a5891
$$ -107488 -148745 32897 -45562 -41488 -217137 -13725 -304498 329791 124433 -35618 -15891
9300b7541k29345c529q6390c3162o7446j62827A95306f207k49833A34851a2839
$$ -27541 -256886 -3529 -89919 -33162 -100608 -263435 195306 -6207 -256040 134851 -12839
9288a60527B45454g0037j38813e1067j13714l5150F5925b15451p225k04445D6394
$$ -160527 245454 -70037 -208850 -51067 -164781 -199931 65925 -215451 -222676 -427121 46394
9276b35930c512D64855g7807G3514f1334j50946G5906c9126k3509C69007e5622
$$ -235930 -3512 464855 -77807 73514 -61334 -212280 75906 -39126 -62635 369007 -55622
9264A427a42691L2365n2594N0217n797p4561j8175G2911a35544k5702J3355D1175
$$ 1427 -142691 -110326 -162920 -112703 -118500 -193061 -211236 72911 -135544 -161246 -147891 41175
9251c50579B46757a96956A22074c75868a29926m7287G4998j9384f0392C94256
$$ -350579 246757 -196956 122074 -375868 -129926 -177213 74998 55614 -60392 394256
9240a29565k14151C519a43003f6515k0994M0054k99783a54880B32532f7431A53141
$$ -129565 -343716 3519 -143003 -66515 -87509 -47455 -347238 -154880 232532 -67431 153141
9228A40416c87369G5630e3296j70858H7289a80929P7491F1623M1252O615b93521
$$ 140416 -387369 75630 -53296 -224154 87289 -180929 -103438 61623 102875 109490 -293521
9216A50386F6136c57715f2515j63326J09830k57793A1838b30520a11075j40445
$$ 150386 66136 -357715 -62515 -225841 -116011 -373804 11838 -230520 -111075 -251520
9206b51520A49279B7702J53425J86837a74733O1420A23232C9306b55686F3430
$$ -251520 149279 27702 181127 367964 -174733 -113313 123232 39306 -255686 63430
9195A02195i326E0193d2247q3218A3602e4949n4984B74752i8380A07161d0784
$$ 102195 -9326 50193 -42247 -125465 13602 -54949 -109933 274752 -98380 107161 -40784
9183d8491C31094g6882A82446d45670a34124B54609a61121a3599j10805e7855
$$ -48491 331094 -76882 182446 -445670 -134124 254609 -161121 -13599 -124404 -57855
9172c69845J77826E5589b75655h4195q3230D225a02589j24118a03650j02477Q5238
$$ -369845 -192019 55589 -275655 -84195 -167425 4225 -102589 -226707 -103650 -206127 -120889
9161a20889C6899f6397h032l57597A81578a17196A39101P291b60300Q2418A13641
$$ -120889 36899 -66397 -8032 -365629 181578 -117196 139101 146392 -260300 -177882 113641
9149C8612K01458M8703C204a5C62190a27424l21907d41j84802r279A34106L98459
$$ 38612 240070 288773 3204 -15 362190 -127424 -449331 -441 -185243 -194522 134106 532565
9137E32565g8432B29617I9868k2890a84027D6134c8383A31923b13496A28610a11970
$$ 532565 -78432 229617 99868 76978 -184027 46134 -38383 131923 -213496 128610 -111970
9125A64512d01012a51107D540b83739a13324o4101l8038F0423c2506j36522f8379
$$ 164512 -401012 -151107 4540 -283739 -113324 -177425 -215463 60423 -32506 -169028 -68379
9113B7931a15458E265P0244J6284a64109r7741A66972B7421a17371A14929D2131
$$ 27931 -115458 5265 75509 91793 -164109 -261850 166972 27421 -117371 114929 42131
9101d05260e9482j51882Q6743j67293B87902A10267c51900J46545O282D9215g9991
$$ -405260 -59482 -211364 -124621 -291914 287902 110267 -351900 -205355 -199073 49215 -79991
9089d1497H7345B4352N5061K3244B0547N5353b32788B69693D4123K76588i7184
$$ -41497 87345 24352 79413 102657 20547 75900 -232788 269693 44123 320711 -97184
9077b56889a08910R631j14319Q1139a8631p8921N562C93883a38407B36262m8028
$$ -256889 -108910 -99279 -213598 -132459 -18631 -97552 -91990 393883 -138407 236262 188234
9066A88234a76995D2453J21793J77841b92980a3226C72746A7717J11007b54108
$$ 188234 -176995 42453 164246 342087 -292980 -13226 372746 17717 128724 -254108
9055b91921J44037A26716L1266b20930A97123e8251j99254r5774a31984F8328
$$ -291921 -147884 126716 157982 -220930 197123 -58251 -257505 -353279 -131984 68328
9044c18056A19495a03494A23549a37155f0487A8493b10041l9806a00829k43862
$$ -318056 119495 -103494 123549 -137155 -60487 18493 -210041 -249847 -100829 -344691
9034c44691D1110c63408A96007a12235A18708P8698c83465J01794i039E7224K1927
$$ -344691 41110 -363408 196007 -112235 118708 197406 -383465 -281671 -9039 57224 79151
9023G9151R8596b30973K9489B32698c54490A58670J72702D576L28122F0649c77095
$$ 79151 177747 -230973 -201484 232698 -354490 158670 331372 4576 332698 60649 -377095
9011b68937N7329Q0487A38610b29816A10556a33464a2917f457j44344c0676n2891
$$ -268937 -211608 -131121 138610 -229816 110556 -133464 -12917 -6457 -150801 -30676 -83567
9000h3567B07192g0702K0340D8819J34162a59273M7220j10350A90794b28920R6888
$$ -83567 207192 -70702 -50362 48819 182981 -159273 -112053 -222403 190794 -228920 -132032
8989a32032B656M2611R1480E1045c55985a65384J6028c2916o2168A38411B4379
$$ -132032 2656 45267 136747 51045 -355985 -165384 -149356 -32916 -95084 138411 24379
8977A45400R8452d4212k7372D2018a34586j12920O4817Q9051q0518Q0232H4780
$$ 145400 243852 -44212 -71584 42018 -134586 -247506 -182689 -93638 -174156 -93924 84780
8965c0983N382C97a21384j24272P281P8757b9556A36423K0419R073c27733f225
$$ -30983 -25601 397 -121384 -245656 -238375 -159618 -29556 136423 156842 165915 -327733 -6225
8952D1339a06132l17575B16560i7576h317j00030D1584b1184A72545a91865e2986
$$ 41339 -106132 -423707 216560 -97576 -8317 -108347 41584 -21184 172545 -191865 -52986
8940b9340k75799A46120c8285A85152a20490B10803r4516c09920A58768M9803
$$ -29340 -305139 146120 -38285 185152 -120490 210803 116287 -309920 158768 208571
8930B08571g5116k56847b0497l47886F3520c0456A13854a96617A47880B3087K51015
$$ 208571 -75116 -331963 -20497 -368383 63520 -30456 113854 -196617 147880 23087 274102
8919B74102J70144B04034a42436A40242Q93N371F3057J97490H9033K55010R1266
$$ 274102 444246 204034 -142436 140242 141135 146506 63057 260547 89033 344043 435309
8908D35309J30874L10528J002064R38163L136138K61735k790984j688426l14145
$$ 435309 566183 876711 1878775 2816938 5953076 6214811 3423827 1735401 1421256
8899A421256m31670m85287a64660C07659q2632R6547f2726A06294K38076Q8824
$$ 1421256 989586 504299 -164660 307659 225027 321574 -62726 106294 344370 433194
8889D33194b72970A80710q2282a73614p769O1349I7469j3326d8619m5486A5330
$$ 433194 -272970 180710 98428 -173614 -181383 -120034 97469 84143 -48619 -94105 15330
8877b71323J18726b811k24465I461O9166J95310O2556a56000M0036j2079b4780
$$ -271323 -152597 -2811 -227276 9461 78627 273937 336493 -156000 -115964 -128043 -24780
8865A60481b43417e9881k51725i6080A57931a73134j9855B39507F979a63149A38416
$$ 160481 -243417 -59881 -311606 -96080 157931 -173134 -192989 239507 6979 -163149 138416
8853a36409k26271B24340C7808K92950A08611c15829a0709n59065a56952o8324
$$ -136409 -362680 224340 37808 330758 108611 -315829 -10709 -569774 -156952 -225276
8843b25276G4484c33737a38080F6665d5233j75644O1487I3360N9996i5721l4417
$$ -225276 74484 -333737 -138080 66665 -45233 -220877 -159390 93360 153356 -95721 -130138
8832a30138q956b9819A31763a74102A02208A4824a20702A39816e8200A86216a92761
$$ -130138 -139094 -29819 131763 -174102 102208 14824 -120702 139816 -58200 186216 -192761
$$ [...]
##END NTUPLES=NMR SPECTRUM
##END=
