
##TITLE=AC1086_CCIN01_5835837_6RdfhfLT20
##JCAMPDX= 6.0         $$ Bruker NMR JCAMP-DX V2.0
##DATA TYPE= NMR SPECTRUM
##DATA CLASS= NTUPLES
##ORIGIN= BRUKER
##OWNER= Administrator
$$ 1.72 TOPSPIN		Version 2.1
$$ 2012-04-10 10:33:23.968 -0500  Administrator@TOPSPIN
$$ Compression mode = diff/dup
##.OBSERVE FREQUENCY= 400.13188235
##.OBSERVE NUCLEUS= ^1H
##.ACQUISITION MODE= SIMULTANEOUS (DQD)
##.ACQUISITION SCHEME= undefined
##.AVERAGES= 64
##.DIGITISER RES= 22
##SPECTROMETER/DATA SYSTEM= spect
##.PULSE SEQUENCE= noesygpps1d.comp
##.SOLVENT NAME= COFFEE_meoh
##.SHIFT REFERENCE= INTERNAL, COFFEE_meoh, 1, 14.96815
##AUDIT TRAIL= $$ (NUMBER, WHEN, WHO, WHERE, PROCESS, VERSION, WHAT)
$$ ##TITLE= Audit trail, TOPSPIN		Version 2.1
$$ ##JCAMPDX= 5.01
$$ ##ORIGIN= Bruker BioSpin GmbH
$$ ##OWNER= Administrator
$$ $$ C:\Bruker\TOPSPIN/data/COFFEE/nmr/AC1086_CCIN01_5835837_6RdfhfLT20/12/pdata/1/auditp.txt
$$ ##AUDIT TRAIL=  $$ (NUMBER, WHEN, WHO, WHERE, PROCESS, VERSION, WHAT)
(   1,<2012-03-28 00:18:24.250 -0500>,<Administrator>,<TOPSPIN>,<go>,<TOPSPIN 2.1>,
      <created by zg
	started at 2012-03-28 00:06:52.312 -0500,
	POWCHK enabled, PULCHK disabled,
       configuration hash MD5:
       1A 1E CE 29 27 FD 77 03 67 4E F0 E3 C4 B2 CB 90
       data hash MD5: 64K
       62 35 81 D2 15 8F B1 AE CE B6 59 CB DA 00 4F 73>)
(   2,<2012-03-28 00:18:29.468 -0500>,<Administrator>,<TOPSPIN>,<proc1d>,<TOPSPIN 2.1>,
      <Start of raw data processing
       efp LB = 0.3 FT_mod = 6 PKNL = 1 PHC0 = 0 PHC1 = 0 SI = 128K 
       data hash MD5: 128K
       1C 3C 2F 06 48 75 A4 74 73 D2 16 6C FE DD 29 95>)
(   3,<2012-03-28 00:18:30.750 -0500>,<Administrator>,<TOPSPIN>,<proc1d>,<TOPSPIN 2.1>,
      <pk PHC0 = 36.14502 PHC1 = 0 
       data hash MD5: 128K
       CF 55 19 64 B4 AE CA 14 78 BB 5F AC 6F A7 3F 6E>)
(   4,<2012-03-28 00:18:31.625 -0500>,<Administrator>,<TOPSPIN>,<proc1d>,<TOPSPIN 2.1>,
      <abs ABSG = 1 
       data hash MD5: 128K
       EC E8 D4 29 0D 39 3E 36 B1 43 5A 32 81 CF 2A 48>)
(   5,<2012-03-28 00:18:31.718 -0500>,<Administrator>,<TOPSPIN>,<proc1d>,<TOPSPIN 2.1>,
      <abs ABSG = 2 
       data hash MD5: 128K
       E5 B5 37 F9 BC 9B C2 A7 34 2B 07 C6 7C 93 1C A8>)
(   6,<2012-03-28 00:18:31.875 -0500>,<Administrator>,<TOPSPIN>,<proc1d>,<TOPSPIN 2.1>,
      <abs ABSG = 3 
       data hash MD5: 128K
       B6 E6 35 4F 32 59 72 47 92 3C 2F 61 7F 4E 27 08>)
(   7,<2012-03-28 00:18:32.015 -0500>,<Administrator>,<TOPSPIN>,<proc1d>,<TOPSPIN 2.1>,
      <abs ABSG = 4 
       data hash MD5: 128K
       47 62 E7 CC A7 B7 33 02 0B 1D C4 0A F1 6E 16 AE>)
(   8,<2012-03-28 00:18:32.093 -0500>,<Administrator>,<TOPSPIN>,<proc1d>,<TOPSPIN 2.1>,
      <abs ABSG = 5 
       data hash MD5: 128K
       0D 84 30 F1 2A A6 69 E1 CD 1B 13 69 77 A3 F4 4C>)
(   9,<2012-03-28 00:18:33.265 -0500>,<Administrator>,<TOPSPIN>,<audit>,<TOPSPIN 2.1>,
      <user comment:
       ICON-NMR User ID: COFFEE
       data hash MD5: 128K
$$ [...]
##$TP07= 0
##$TPNAME0= <>
##$TPNAME1= <>
##$TPNAME2= <>
##$TPNAME3= <>
##$TPNAME4= <>
##$TPNAME5= <>
##$TPNAME6= <>
##$TPNAME7= <>
##$TPOAL= (0..7)
0.5 0.5 0.5 0.5 0.5 0.5 0.5 0.5
##$TPOFFS= (0..7)
0 0 0 0 0 0 0 0
##$TUNHIN= 0
##$TUNHOUT= 0
##$TUNXOUT= 0
##$USERA1= <user>
##$USERA2= <user>
##$USERA3= <user>
##$USERA4= <user>
##$USERA5= <user>
##$V9= 5
##$VALIST= <valist>
##$VCLIST= <CCCCCCCCCCCCCCC>
##$VD= 0
##$VDLIST= <DDDDDDDDDDDDDDD>
##$VPLIST= <PPPPPPPPPPPPPPP>
##$VTLIST= <TTTTTTTTTTTTTTT>
##$WBST= 2048
##$WBSW= 25
##$XGAIN= (0..3)
0 0 0 0
##$XL= 0
##$YL= 0
##$YMAX_a= 12985947
##$YMIN_a= -5667892
##$ZGOPTNS= <>
##$ZL1= 120
##$ZL2= 120
##$ZL3= 120
##$ZL4= 120
##$ABSF1= 14.96815
##$ABSF2= -5.58438
##$ABSG= 5
##$ABSL= 3
##$ALPHA= 0
##$AQORDER= 0
##$ASSFAC= 0
##$ASSFACI= 0
##$ASSFACX= 0
##$ASSWID= 0
##$AUNMP= <proc_prof1d_extract.lims>
##$AXLEFT= 0
##$AXNAME= <>
##$AXNUC= <1H>
##$AXRIGHT= 0
##$AXTYPE= 0
##$AXUNIT= <>
##$AZFE= 0.1
##$AZFW= 0.1
##$BCFW= 0
##$BC_mod= 0
##$BYTORDP= 0
##$COROFFS= 0
##$CY= 15
##$DATMOD= 1
##$DC= 0
##$DFILT= <>
##$DTYPP= 0
##$F1P= 0
##$F2P= 0
##$FCOR= 0.5
##$FTSIZE= 131072
##$FT_mod= 6
##$GAMMA= 0
##$GB= 0
##$INTBC= 1
##$INTSCL= 1
##$ISEN= 128
##$LB= 0.3
##$LEV0= 0
##$LPBIN= 0
##$MAXI= 10000
##$MC2= 0
##$MEAN= 0
##$ME_mod= 0
##$MI= 0
##$NCOEF= 0
##$NC_proc= -3
##$NLEV= 6
##$NOISF1= 0
##$NOISF2= 0
##$NSP= 0
##$NTH_PI= 0
##$NZP= 0
##$OFFSET= 14.96815
##$PC= 1
##$PHC0= 36.14502
##$PHC1= 0
##$PH_mod= 1
##$PKNL= yes
##$PPARMOD= 0
##$PPDIAG= 0
##$PPIPTYP= 0
##$PPMPNUM= 2147483647
##$PPRESOL= 1
##$PSCAL= 4
##$PSIGN= 0
##$PYNMP= <proc.py>
##$REVERSE= no
##$SF= 400.130004986618
##$SI= 131072
##$SIGF1= 0
##$SIGF2= 0
##$SINO= 400
##$SIOLD= 131072
##$SPECTYP= <>
##$SREGLST= <1H.CDCl3>
##$SSB= 0
##$STSI= 131072
##$STSR= 0
##$SW_p= 8223.68421052632
##$SYMM= 0
##$S_DEV= 0
##$TDeff= 65536
##$TDoff= 0
##$TI= <>
##$TILT= no
##$TM1= 0
##$TM2= 0
##$TOPLEV= 0
##$USERP1= <user>
##$USERP2= <user>
##$USERP3= <user>
##$USERP4= <user>
##$USERP5= <user>
##$WDW= 1
##$XDIM= 131072
##$YMAX_p= 440191373
##$YMIN_p= -312182677
##$CURPLOT= <Network HP LaserJet P1505>
##$CURPRIN= <$Network HP LaserJet P1505>
##$DFORMAT= <normdp>
##$LAYOUT= <+/1D_H.xwp>
##$LFORMAT= <normlp>
##$PFORMAT= <normpl>
##$SURQMSG= 1
$$ End of Bruker specific parameters
$$ ---------------------------------
##NTUPLES= NMR SPECTRUM
##VAR_NAME=  FREQUENCY,     SPECTRUM/REAL,   SPECTRUM/IMAG
##SYMBOL=    X,             R,               I
##VAR_TYPE=  INDEPENDENT,   DEPENDENT,       DEPENDENT
##VAR_FORM=  AFFN,          ASDF,            ASDF
##VAR_DIM=   131072,        131072,          131072
##UNITS=     HZ,            ARBITRARY UNITS, ARBITRARY UNITS
##FACTOR=    0.0627417313425165, 1,          1
##FIRST=     8223.62146879498, 4898,         -88040
##LAST=      0,             5499,            -87143
##MIN=       0,             -312182677,      0
##MAX=       8223.62146879498, 440191373,    0
$$ Real data points
##PAGE= N=1
##DATA TABLE= (X++(R..R)), XYDATA
$$ [...]
62974C234788N9893N8339N6267N3380M9124M3282L6204K8057J8296O513o404j8805
62962C618934k9926m0159m9475n6821o1807o5829p0217p3931p4649p1984o7932
62951B956204o3957n9331n3106m6183m0101l4742k8731k1635j4379p627j068N433
62939B590777J1065J5080J7845K0342K3002K5534K7646K9331L0510L0833L0035
62928B852000K8308K6147K3870K1365J8148J3599P301n34r034j7283k5113l3023
62916B905751m1255m9323n6550o2680o7659p1332p3811p5826p7954p9589p9362
62905B170410p6747p2813o9268o7004o5535o3603o0397n6398n2815m9973m6822
62894A489035m2540l8018l4846l3152l1528k8952k5736k2581j9711j7232j5355
$$ plain form
62974 3234788 3294681 3353020 3409287 3462667 3511791 3555073 3591277 3619334 3637630 3644143 3637739 3618934
62962 3618934 3589008 3548849 3499374 3442553 3380746 3314917 3244700 3170769 3096120 3024136 2956204
62951 2956204 2892247 2832916 2779810 2733627 2693526 2658784 2630053 2608418 2594039 2586412 2585344 2590777
62939 2590777 2601842 2616922 2634767 2655109 2678111 2703645 2731291 2760622 2791132 2821965 2852000
62928 2852000 2880308 2906455 2930325 2951690 2969838 2983437 2990738 2990204 2981170 2963887 2938774 2905751
62916 2905751 2864496 2815173 2758623 2695943 2628284 2556952 2483141 2407315 2329361 2249772 2170410
62905 2170410 2093663 2020850 1951582 1884578 1819043 1755440 1695043 1638645 1585830 1535857 1489035
62894 1489035 1446495 1408477 1373631 1340479 1308951 1279999 1254263 1231682 1211971 1194739 1179384
62883A179384j4026j3039j2595j2904j3320j2909j1812j0911j0194q945p659p880
62871A043190r539j0457r550q693r818j1724j1850j0073q626q626q873q122o743
62858I20496n724n401n605o055o237n667m515l398k639k240k317k827l172k938
62844H61761k645k868k970j851K35J724J582K17j287j896r43J098K350J408o94
62829H55221j648r61l49j035k291l069l392l457k796j381m15j014k850m790o074
62814H19699o186m685k155m31p63k280l254l402l809m933n877n784n048m671m916
62799G61505n108m643l871l661m164m520m107l464l301l177k267r87n52r07o21
62784G16155P59J766J092n79j691j679q73M54J848K336J476K13k09K49Q38J281
$$ plain form
62883 1179384 1165358 1152319 1139724 1126820 1113500 1100591 1088779 1077868 1067674 1058729 1051070 1043190
62871 1043190 1033651 1023194 1013644 1004951 995133 983409 971559 961486 952860 944234 935361 927239 920496
62858 920496 914772 909371 903766 897711 891474 885807 881292 877894 875255 873015 870698 867871 864699 861761
62844 861761 859116 856248 853278 851427 851662 853386 854968 855185 853898 852002 851059 852157 854507 855915 855221
62829 855221 853573 852612 852263 851228 848937 845868 842476 839019 836223 834842 834427 833413 830563 825773 819699
62814 819699 813513 808828 806673 806242 805479 803199 799945 796543 792734 787801 781924 776140 771092 766421 761505
62799 761505 756397 751754 747883 744222 740058 735538 731431 727967 724666 721489 719222 718235 717683 716776 716155
62784 716155 716914 718680 719772 719193 717502 715823 714950 715404 717252 719588 721064 721277 721068 721317 722155 723436
62768G23436J623J491P09K57J388L774N611N694M555L530L375L966M731N194N342
62753G74676N452N490N138M594M707N822P179Q076Q912J0305J1936J3269J4670
62740H80226J6563J8044J7984J7270J8190K1325K4740K6809K8334L0884L4306
62729A134675L7251L9400M1704M4727M8059N1580N6045O1840O8004P3265P7676
62718A734226Q2322Q7656R2948R7484J01346J04578J06524J06810J06132J04974
62708B725000J02102R5752Q6181P5410O4376N1923L7091K0754M142j2640k9545
62697C220546m5417n9267p1599q2990r2376r8352j01405j03219j04379j04494
62687B357048j03938j03431j02206r8662r2980q7216q2559p8284p3701o9196o4800
$$ plain form
62768 723436 725059 726550 727259 727516 728904 732678 738289 743983 748538 752068 755443 759409 764140 769334 774676
62753 774676 780128 785618 790756 795350 800057 805879 813058 821134 830046 840351 852287 865556 880226
62740 880226 896789 914833 932817 950087 968277 989602 1014342 1041151 1069485 1100369 1134675
62729 1134675 1171926 1211326 1253030 1297757 1345816 1397396 1453441 1515281 1583285 1656550 1734226
62718 1734226 1816548 1904204 1997152 2094636 2195982 2300560 2407084 2513894 2620026 2725000
62708 2725000 2827102 2922854 3009035 3084445 3148821 3200744 3237835 3258589 3262731 3250091 3220546
62697 3220546 3175129 3115862 3044263 2961273 2868897 2770545 2669140 2565921 2461542 2357048
62687 2357048 2253110 2149679 2047473 1948811 1855831 1768615 1686056 1607772 1534071 1464875 1400075
62676A400075n9605n3474m7754m3400l9732l5966l2478k9637k6807k3654k1124
62665I86444j9815j8593j6270j3553j1696j0124p278l289K8J766K817M050N281
62652H99768O462Q443J1726J5411J8246K0245K2587K6193L0817L5375L8931M1490
62640A175694M3902M6963N0701N4696N8753O2798O6438O9274P1525P3691P5575
62629A850010P6290P5277P2781O9135O4199N7731M9737M0160K8768J5737K041
62618B401866j1213k3519l4713m4449n2556n9595o6298p2340p6378p7668p7057
62607A806080p6007p4959p3300p0657o7583o4853o2640o0568n8098n4715n0224
62596A092476m5228m0912l7938l5850l3931l2154l0743k9186k6611k3182k0238
$$ plain form
62676 1400075 1340470 1286996 1239242 1195842 1156110 1120144 1087666 1058029 1031222 1007568 986444
62665 986444 966629 948036 931766 918213 906517 896393 889115 885826 885854 887620 890437 894487 899768
62652 899768 906230 914673 926399 941810 960056 980301 1002888 1029081 1059898 1095273 1134204 1175694
62640 1175694 1219596 1266559 1317260 1371956 1430709 1493507 1559945 1629219 1700744 1774435 1850010
62629 1850010 1926300 2001577 2074358 2143493 2207692 2265423 2315160 2355320 2384088 2399825 2401866
62618 2401866 2390653 2367134 2332421 2287972 2235416 2175821 2109523 2037183 1960805 1883137 1806080
62607 1806080 1730073 1655114 1581814 1511157 1443574 1378721 1316081 1255513 1197415 1142700 1092476
62596 1092476 1047248 1006336 968398 932548 898617 866463 835720 806534 779923 756741 736503
62585G36503j8678j7853j6532j4566j2966j2437j2477j2097j1073r989r159q053
62573E80623o251m404l564l633l499k826k688l776m978m736l052j034R47L179
62559E40308M964M888L067J671K319M132N253N460O122Q029J0308J1639J1842
62546F20002J1936J2893J4699J6749J8960K1811K5174K7866K9165L0111L2250
62535H61616L5620L9141M2537M6237M9588N1188N1353N2271N4719N6483N5291
62524A396044N1679M7445M2807L7057L0945K5941K1395J4727M881o140j5746k3438
62512A627597l0307l6870m2255m5192m5475m4584m4652m6337m7964m7508m5055
62501A151398m2383m0354l8056l4719l1155k8620k7172k5925k4428k2979k1837
$$ plain form
62585 736503 717825 699972 683440 668874 655908 643471 630994 618897 607824 597835 588676 580623
62573 580623 574372 569968 566404 562771 559272 556446 553758 549982 545004 540268 537216 536182 537129 540308
62559 540308 545272 550160 553227 554898 557217 561349 566602 572062 578184 586213 596521 608160 620002
62546 620002 631938 644831 659530 676279 695239 717050 742224 770090 799255 829366 861616
62535 861616 897236 936377 978914 1025151 1074739 1125927 1177280 1229551 1284270 1340753 1396044
62524 1396044 1447723 1495168 1537975 1575032 1605977 1631918 1653313 1668040 1672921 1666781 1651035 1627597
62512 1627597 1597290 1560420 1518165 1472973 1427498 1382914 1338262 1291925 1243961 1196453 1151398
62501 1151398 1109015 1068661 1030605 995886 964731 936111 908939 883014 858586 835607 813770
62490H13770k0721j9199j7290j5585j4765j4894j5283j5199j4456j3168j1250
62479F41960q747o335m848m284l839l042k302k125k126j179J451N065P810Q415
62465F25874P658P538Q857J0574J1973J4114J7841K1467K2404K0910K0234K2610
62453H12054K6798L0327L2600L4562L6517L7811L8327L8796L9610M0243M0032
62442A207677L8763L6243L2021K5933J8682J1388M634j781q143j4168j9255k3120
62430A308874k5962k8088k9851l1729l3869l5415l5117l2990l0557k8851k7047
62419I69398k4011k0479j8303j7782j7278j5695j3898j3061j2763j1778j0038
62408G94312q677q272p946o529m157k262k032l091l959l577j985M21L466O695
$$ plain form
62490 813770 793049 773850 756560 740975 726210 711316 696033 680834 666378 653210 641960
62479 641960 633213 626878 622030 617746 613907 610865 608563 606438 604312 603133 604584 609649 617459 625874
62465 625874 633532 641070 649927 660501 672474 686588 704429 725896 748300 769210 789444 812054
62453 812054 838852 869179 901779 936341 972858 1010669 1048996 1087792 1127402 1167645 1207677
62442 1207677 1246440 1282683 1314704 1340637 1359319 1370707 1375341 1373560 1365417 1351249 1331994 1308874
62430 1308874 1282912 1254824 1224973 1193244 1159375 1123960 1088843 1055853 1025296 996445 969398
62419 969398 945387 924908 906605 888823 871545 855850 841952 828891 816128 804350 794312
62408 794312 785635 777363 769417 762888 758731 756469 754437 751346 747387 743810 741825 742246 745712 752407
62394G52407R021R654Q968P887O871O175O370P563Q669Q714Q435R261J0834J1162
62380H71991R271O210L075l37m268p837j0114j1369j2361j3240j3896j4626j5621
62367G86878j6370j6325j5604j4498j2975j1244j0048r741r606q755p184n446
62355F49082l916k755j889p12J333L482M172L386L119M578O391O883O704P494
62341F87352R006R781R948J1026J3041J4090J3250J1951J1647J1840J1378J0339
62329H24649R480Q774P604N884M056K421J156O19R65J749K475L247M386N754P001
62314H90220Q234R797J1544J2998J4263J6181J9320K3326K7635L2437L8244M4537
62302A148736M9644N2511N4182N6761O0948O5380O8369O9469O8922O6539O2062
$$ plain form
62394 752407 761428 771082 780050 787937 794808 800983 807353 814916 823585 832299 840734 849995 860829 871991
62380 871991 881262 887472 890547 890210 885942 878105 867991 856622 844261 831021 817125 802499 786878
62367 786878 770508 754183 738579 724081 711106 699862 689814 680073 670467 661712 654528 649082
62355 649082 645166 642411 640522 639810 641143 644625 648797 652183 655302 659880 666271 673154 679858 687352
62341 687352 696358 706139 716087 727113 740154 754244 767494 779445 791092 802932 814310 824649
62329 824649 834129 842903 850507 856391 860447 862868 864024 864643 865608 867357 869832 873079 877465 883219 890220
62314 890220 898454 908251 919795 932793 947056 963237 982557 1005883 1033518 1065955 1104199 1148736
62302 1148736 1198380 1250891 1305073 1361834 1422782 1488162 1556531 1626000 1694922 1761461 1823523
62291A823523N6155N0005M4000L7500L0037K2022J4112O400j499r806j8254k6257
62279B027938l3303l9267m4295m8396n1396n3401n4866n5964n6280n5484n3892
62268A481394n1881m9160m5382m1217l8023l6380l5549l4498l2871l0824k8483
62257A057126k5999k3740k1982k0379j8125j4843j1225q471p012o066m732l089
62245H91463j637j02K131M472N302M011J785k11k100l937m529k983n45P40N90
62230H94450K10k1o55j189p2K831N485O306O096O449P433Q063Q322R337J1602
62215I64647J4084J5387J5429J5625J7418K0660K3735K5350K5901K6780K8795
62204A193811L1805L5372L9043M2285M5069M8216N2308N6580N9824O1985O3541
$$ plain form
62291 1823523 1879678 1929683 1973683 2011183 2041220 2063242 2077354 2083754 2082255 2072449 2054195 2027938
62279 2027938 1994635 1955368 1911073 1862677 1811281 1757880 1703014 1647050 1590770 1535286 1481394
62268 1481394 1429513 1380353 1334971 1293754 1255731 1219351 1183802 1149304 1116433 1085609 1057126
62257 1057126 1031127 1007387 985405 965026 946901 932058 920833 912362 905350 899284 894552 891463
62245 891463 889826 889724 891855 896327 901629 905640 907425 907214 905114 901177 896648 893665 893120 893860 894450
62230 894450 894660 894639 893984 892795 892723 895554 901039 907345 913441 919890 927323 935386 943708 953045 964647
62215 964647 978731 994118 1009547 1025172 1042590 1063250 1086985 1112335 1138236 1165016 1193811
62204 1193811 1225616 1260988 1300031 1342316 1387385 1435601 1487909 1544489 1604313 1666298 1729839
62193A729839O3805O1466N6830N1658M6396L9388K9596J8470Q152q28r098j6993
62181B078681k4684l2543m0251m6517n0713n3735n6171n6969n5392n2978n1685
62170A557043n1015m8957m5148m0986l7038l2729k8569k6198k5593k4359k0948
62159A175503j6778j3913j2044r382n634k464j278j745k533k534j339P95L166
62146A109820N136O580P732Q715R392R559R376R521J0634J2288J3065J2331J1508
62133A235657J2440J4826J6750J7920K0461K5501L0594L2278L0328K7772K7070
62122A491597K7903K8639K8210K6244K2897J9325J7311J7538J8857J9944K1053
62111A739518K3552K8109L4006L9803M4217M6621M7265M6889M5956M4477M2525
$$ plain form
62193 1729839 1793644 1855110 1911940 1963598 2009994 2049382 2078978 2097448 2105600 2104772 2095674 2078681
62181 2078681 2053997 2021454 1981203 1934686 1883973 1830238 1774067 1717098 1661706 1608728 1557043
62170 1557043 1506028 1457071 1411923 1370937 1333899 1301170 1272601 1246403 1220810 1196451 1175503
62159 1175503 1158725 1144812 1132768 1123386 1117752 1115288 1114010 1112265 1109732 1107198 1105859 1106654 1109820
62146 1109820 1114956 1121536 1129268 1137983 1147375 1156934 1166310 1175831 1186465 1198753 1211818 1224149 1235657
62133 1235657 1248097 1262923 1279673 1297593 1318054 1343555 1374149 1406427 1436755 1464527 1491597
62122 1491597 1519500 1548139 1576349 1602593 1625490 1644815 1662126 1679664 1698521 1718465 1739518
62111 1739518 1763070 1791179 1825185 1864988 1909205 1955826 2003091 2049980 2095936 2140413 2182938
62100B182938M0255L7239L2654K6639K0590J5423J0438M818o25m534p293j0636
62088B347906j5128j9493k2575k4604k6157k7178k7407k6686k4523k0678j6610
62077B096867j4735j5334j5628j3264r514p532q270r737r704p570l903K05L290
62064A985171M462M541N251P242R801J2327J4811J6970J8294J9179K0697K2972
62052B141718K5044K6682K8872L1900L4380L5186L5289L6544L9413M2951M6392
62041B524371M9669N2607N4606N5119N4003N1654M9192M8031M8638N0073N1228
62030C089191N2088N3225N4529N5178N4637N3126N1338N0185N0511N2417N5072
62019C671497N7566N9705O1596O2955O3555O3886O4641O5685O6274O6148O5753
$$ plain form
62100 2182938 2223193 2260432 2293086 2319725 2340315 2355738 2366176 2370994 2370369 2365835 2358542 2347906
62088 2347906 2332778 2313285 2290710 2266106 2239949 2212771 2185364 2158678 2134155 2113477 2096867
62077 2096867 2082132 2066798 2051170 2037906 2028392 2020860 2012590 2002853 1993149 1985579 1981676 1981881 1985171
62064 1985171 1989633 1994174 1999425 2006667 2016468 2028795 2043606 2060576 2078870 2098049 2118746 2141718
62052 2141718 2166762 2193444 2222316 2254216 2288596 2323782 2359071 2395615 2435028 2477979 2524371
62041 2524371 2574040 2626647 2681253 2736372 2790375 2842029 2891221 2939252 2987890 3037963 3089191
62030 3089191 3141279 3194504 3249033 3304211 3358848 3411974 3463312 3513497 3564008 3616425 3671497
62019 3671497 3729063 3788768 3850364 3913319 3976874 4040760 4105401 4171086 4237360 4303508 4369261
62008D369261O5467O5369O5686O6678O7934O8459O7747O6197O4240O1569N7684
61997E086291N2792M7707M3016L8826L5234L2419K9955K6637K1721J6260J2420
61986E443278J1064J0683R281O776M777M410N317O670Q075R255R787R602R185
61973E548160Q993R139R636J0269J0292R121P415O383N912M603K002m31j226o96
61959E629572j56m30j762l995n972o068m316k883l222l955l052r28M32N42O63
61944E594470J471K502L797O061R004J1235J2127J2334J2159J0908Q306N227K399
61931E692000m53l696p041j0181j3290j6388j9043k0998k2475k3621k4441k5284
61919E505089k6595k8091k9075k9482k9721k9699k9174k8878k9818l1482l2323
$$ plain form
62008 4369261 4434728 4500097 4565783 4632461 4700395 4768854 4836601 4902798 4967038 5028607 5086291
61997 5086291 5139083 5186790 5229806 5268632 5303866 5336285 5366240 5392877 5414598 5430858 5443278
61986 5443278 5454342 5465025 5474306 5481082 5485859 5490269 5495586 5502256 5510331 5519586 5529373 5538975 5548160
61973 5548160 5557153 5566292 5575928 5586197 5596489 5605610 5613025 5619408 5625320 5629923 5631925 5631494 5630268 5629572
61959 5629572 5629416 5628986 5627224 5623229 5617257 5611189 5606873 5603990 5600768 5596813 5593761 5592833 5593265 5593807 5594470
61944 5594470 5595941 5598443 5602240 5608301 5617305 5628540 5640667 5653001 5665160 5676068 5684374 5689601 5692000
61931 5692000 5691547 5687851 5680810 5670629 5657339 5640951 5621908 5600910 5578435 5554814 5530373 5505089
61919 5505089 5478494 5450403 5421328 5391846 5362125 5332426 5303252 5274374 5244556 5213074 5180751
61908E180751l2205l2595l3960l4782l3848l1914l0278k9341k9292l0469l1963
61897D830104l1645k9007k6389k5789k5921k4249k0697j7374j5486j4512j3790
61886D585245j2891j0910p268l124k30J427L269N753Q162J0446J3287J6320J8473
61873D627959K0388K4250L0399L6092L8866L9527M0574M3061M6473N0673N6204
61862E054466O3025P0152P6725Q2858Q9604R8372J09835J23078J36583J50447
61852F055145J66669J86655K09339K32676K56043K80227L06000L33970L65142
61843H391866M00021M37439M75561N13834N52592N90772O25508O53928O73740
61834A3315261O81561O72067O39907N82022M98185L90763K64817J27438j4080
$$ plain form
61908 5180751 5148546 5115951 5081991 5047209 5013361 4981447 4951169 4921828 4892536 4862067 4830104
61897 4830104 4798459 4769452 4743063 4717274 4691353 4667104 4646407 4629033 4613547 4599035 4585245
61886 4585245 4572354 4561444 4554176 4551052 4550822 4552249 4555518 4561271 4569433 4579879 4593166 4609486 4627959
61873 4627959 4648347 4672597 4702996 4739088 4777954 4817481 4858055 4901116 4947589 4998262 5054466
61862 5054466 5117491 5187643 5264368 5347226 5436830 5535202 5645037 5768115 5904698 6055145
61852 6055145 6221814 6408469 6617808 6850484 7106527 7386754 7692754 8026724 8391866
61843 8391866 8791887 9229326 9704887 10218721 10771313 11362085 11987593 12641521 13315261
61834 13315261 13996822 14668889 15308796 15890818 16389003 16779766 17044583 17172021 17157941
61825A7157941j53266k83786l99300m95110n69271o21673o53344o67566o69806
61816A2644819o64394o51923o31729o05943n78513n50628n20205m86643m53173
61807G501668m22772l94117l64023l32372l02152k75304k51042k28173k06773
61798D724940j87042j68316j50067j32693j16733j02208q9255p8377o9507o1681
61788C569061n4296m7858m2908l8943l5165l1711k9341k8205k7644k7012k6109
61777C179869k4948k3534k1745j9156j5271j0341n613k252j52J671L721N597O929
61764C074775Q016R293J0528J0972J0184Q470O566N171M786N646P525R770J1974
61751C183676J4566J8364K3396K8657L3251L7388M1963M7621N4557O2685P1493
$$ plain form
61825 17157941 17004675 16720889 16321589 15826479 15257208 14635535 13982191 13314625 12644819
61816 12644819 11980425 11328502 10696773 10090830 9512317 8961689 8441484 7954841 7501668
61807 7501668 7078896 6684779 6320756 5988384 5686232 5410928 5159886 4931713 4724940
61798 4724940 4537898 4369582 4219515 4086822 3970089 3867881 3778626 3700249 3630742 3569061
61788 3569061 3514765 3466907 3423999 3385056 3349891 3318180 3288839 3260634 3232990 3205978 3179869
61777 3179869 3154921 3131387 3109642 3090486 3075215 3064874 3059261 3057009 3056857 3058528 3062249 3067846 3074775
61764 3074775 3082791 3092084 3102612 3113584 3123768 3132238 3138804 3143975 3148761 3154407 3161932 3171702 3183676
61751 3183676 3198242 3216606 3240002 3268659 3301910 3339298 3381261 3428882 3483439 3546124 3617617
61740C617617Q0256Q8958R8408J08828J19052J28170J37304J48298J61090J74062
61730D862043J86907K01224K17778K35150K52182K70241K91572L16432L43321
61721G176850L71447M01622M35113M72785N15182N62318O13455O67830P25595
61712A1942197P87401Q53281R22385R93327J063986J131149J190872J238671J268728
61703B1391997J273593J245745J179388J070596R17284P21315M90767K38708k0580
61694B8508813k73739n08116p12422q79349j006919j097037j153529j181497j186666
61685B0509539j173936j146960j109358j065146j017188r66370r13193q59209
61677A2258179q05707p52049o97053o41688n88767n39912m94421m51423m11634
$$ plain form
61740 3617617 3697873 3786831 3885239 3994067 4113119 4241289 4378593 4526891 4687981 4862043
61730 4862043 5048950 5250174 5467952 5703102 5955284 6225525 6517097 6833529 7176850
61721 7176850 7548297 7949919 8385032 8857817 9372999 9935317 10548772 11216602 11942197
61712 11942197 12729598 13582879 14505264 15498591 16562577 17693726 18884598 20123269 21391997
61703 21391997 22665590 23911335 25090723 26161319 27078603 27799918 28290685 28529393 28508813
61694 28508813 28235074 27726958 27014536 26135187 25128268 24031231 22877702 21696205 20509539
61685 20509539 19335603 18188643 17079285 16014139 14996951 14030581 13117388 12258179
61677 12258179 11452472 10700423 10003370 9361682 8772915 8233003 7738582 7287159 6875525
61668F875525l76017l43809l13183k83557k56181k32472k12625j95861j81253
61659D480567j68015j55613j44156j34348j26561j20025j13334j05727r7638r0109
61649C225041q3939p9379p6187p3733p1156o7577o2466n6178n0208m6277m4582
61638B513359m3427m1305l8983l8418l9783m0971m0402l8899l7891l6996l4818
61627B081466l1480k8761k7825k7992k7930k6977k5130k2705k0490j9478j9875
61616A802823k0717k0716j9231j6438j3090j0296q944r021r733j0363j0728j0875
61604A642671j0917j1145j1741j2176j1587r984q457p824p653p072o090n322m747
61591A527956l647j951q88j636l505m217k354R38L212L383K423J529Q24K78O98
$$ plain form
61668 6875525 6499508 6155699 5842516 5558959 5302778 5070306 4857681 4661820 4480567
61659 4480567 4312552 4156939 4012783 3878435 3751874 3631849 3518515 3412788 3315150 3225041
61649 3225041 3141102 3061723 2985536 2911803 2840647 2773070 2710604 2654426 2604218 2557941 2513359
61638 2513359 2469932 2428627 2389644 2351226 2311443 2270472 2230070 2191171 2153280 2116284 2081466
61627 2081466 2049986 2021225 1993400 1965408 1937478 1910501 1885371 1862666 1842176 1822698 1802823
61616 1802823 1782106 1761390 1742159 1725721 1712631 1702335 1693391 1684370 1674637 1664274 1653546 1642671
61604 1642671 1631754 1620609 1608868 1596692 1585105 1575121 1566664 1558840 1551187 1544115 1538025 1532703 1527956
61591 1527956 1524309 1522358 1521470 1519834 1516329 1512112 1509758 1510696 1513908 1517291 1519714 1521243 1522067 1522345 1523043
61576A523043K631M943N885N377M937N390N969N944N765N914N743M502K833K158
61562A591034K827L698L555K234L47j606l569n642p673r280j0320j1131j2018
61549A542456j2742j2931j2827j2979j3244j2892j1763j0582r835r255q632q316
61537A406458q290p721o271n074n302o204n796l436o11J044J542K068L419N422
61523A371248P488R248J0825J2798J5654J9104K2052K3536K3727K3936K5499K8641
61511A593756L2322L5316L7427L9496M2124M4684M5867M5206M3728M2986M3503
61500B046415M4277M3861M1941L9573L7770L6200L3907L1070K9101K8645K8324
61489B441084K6270K2472J8803J6739J5707J3855J0031M987P44j242j577k346
$$ plain form
61576 1523043 1525674 1530617 1536502 1541879 1546816 1552206 1558175 1564119 1569884 1575798 1581541 1586043 1588876 1591034
61562 1591034 1593861 1597559 1601114 1603348 1603695 1602089 1598520 1592878 1585205 1575925 1565605 1554474 1542456
61549 1542456 1529714 1516783 1503956 1490977 1477733 1464841 1453078 1442496 1432661 1423406 1414774 1406458
61537 1406458 1398168 1390447 1384176 1379102 1373800 1367596 1361800 1358364 1357753 1358797 1360339 1362407 1365826 1371248
61523 1371248 1378736 1387984 1398809 1411607 1427261 1446365 1468417 1491953 1515680 1539616 1565115 1593756
61511 1593756 1626078 1661394 1698821 1738317 1780441 1825125 1870992 1916198 1959926 2002912 2046415
61500 2046415 2090692 2134553 2176494 2216067 2253837 2290037 2323944 2355014 2384115 2412760 2441084
61489 2441084 2467354 2489826 2508629 2525368 2541075 2554930 2564961 2569948 2570692 2569450 2567873 2565527
61477B565527m810p980r909j0046r602r719j0068r420o895k501K813P412J0078
61464B504880J1478J3870J8734K5258L1888L8634M6535N5267O3024O9234P5814
61453B954616Q4668R5174J05545J15783J27522J41233J55572J69799J84920K01493
61443D336325K17852K31984K44099K55690K66596K74608K77758K75366K66773
61434F647051K50698K26596J95428J58567J17057P2705K8799j1622m7810q0655
61424G556814j10243j35082j53740j66278j73741j76892j75996j71636j65050
61415F128156j57373j48871j39194j28276j16455j03643q9167p3075n6936m2564
61405E072602l0124j8368o485N327J6907K8450L9480M8759N5837O1729O7382P2365
$$ plain form
61477 2565527 2560717 2552737 2542828 2532782 2523180 2513461 2503393 2493973 2487078 2484577 2487390 2494802 2504880
61464 2504880 2516358 2530228 2548962 2574220 2606108 2644742 2691277 2746544 2809568 2878802 2954616
61453 2954616 3039284 3134458 3240003 3355786 3483308 3624541 3780113 3949912 4134832 4336325
61443 4336325 4554177 4786161 5030260 5285950 5552546 5827154 6104912 6380278 6647051
61434 6647051 6897749 7124345 7319773 7478340 7595397 7668102 7696901 7685279 7637469 7556814
61424 7556814 7446571 7311489 7157749 6991471 6817730 6640838 6464842 6293206 6128156
61415 6128156 5970783 5821912 5682718 5554442 5437987 5334344 5245177 5172102 5115166 5072602
61405 5072602 5042478 5024110 5017625 5022952 5039859 5068309 5107789 5156548 5212385 5274114 5341496 5413861
61393E413861P5837P8033P9794Q1140Q1332Q0133P8265P6590P5282P3794P1477
61382F265538O8401O5543O3609O1810N8720N4267M9629M4907L8726L0879K3673
61371F825702J9144J6276J2764Q339M235L14m754j0672j5364j8001k0051k2649
61359F795283k4938k5889k6057k6467k7074k7371k7327k6895k5698k4137k3594
61348F509836k4549k5525k5047k3612k2620k2366k2463k3212k4898k6293k5539
61337F243712k2383j8021j2940o352K286J2720K4917L9078N4435O9641Q4890J02090
61325F574073J22040J42966J63007J82793K03851K25340K44478K60075K73565
61316H392188K85916K95082K97637K91852K77947K56216K26615J90182J49325
$$ plain form
61393 5413861 5489698 5567731 5647525 5728665 5809997 5890130 5968395 6044985 6120267 6194061 6265538
61382 6265538 6333939 6399482 6463091 6524901 6583621 6637888 6687517 6732424 6771150 6802029 6825702
61371 6825702 6844846 6861122 6873886 6882225 6886460 6886774 6882020 6871348 6855984 6837983 6817932 6795283
61359 6795283 6770345 6744456 6718399 6691932 6664858 6637487 6610160 6583265 6557567 6533430 6509836
61348 6509836 6485287 6459762 6434715 6411103 6388483 6366117 6343654 6320442 6295544 6269251 6243712
61337 6243712 6221329 6203308 6190368 6184016 6186302 6199022 6223939 6263017 6317452 6387093 6471983 6574073
61325 6574073 6696113 6839079 7002086 7184879 7388730 7614070 7858548 8118623 8392188
61316 8392188 8678104 8973186 9270823 9562675 9840622 10096838 10323453 10513635 10662960
61307A0662960J05985O0544J3425l3095p5839j13468j47242j78775k07861k32890
61297I853744k52773k67695k78247k84635k86981k85978k82659k77586k70535
61288G366655k61150k49753k37248k24206k10416j95461j79518j63226j46947
61279E498730j30636j14388r8576q3377o8616n4334m1062k9127j8032o913M446
61268D858115J5456K5366L3709M0297M5259M9230N2929N6302N8356N8274N6538
61257E349831N4540N3067N1493M8734M4635L9987L5250K9960K3731J7245J1538
61246E760011O489Q68o037j3555k0684k7285l3638l9469m4253m8207n2071n5902
61234E426267n8921o0693o1702o2461o2748o2224o1145n9907n8261n5628n2030
$$ plain form
61307 10662960 10768945 10829489 10842914 10809819 10733980 10620512 10473270 10294495 10086634 9853744
61297 9853744 9600971 9333276 9055029 8770394 8483413 8197435 7914776 7637190 7366655
61288 7366655 7105505 6855752 6618504 6394298 6183882 5988421 5808903 5645677 5498730
61279 5498730 5368094 5253706 5155130 5071753 5003137 4948803 4907741 4878614 4860582 4853669 4858115
61268 4858115 4873571 4898937 4932646 4972943 5018202 5067432 5120361 5176663 5235019 5293293 5349831
61257 5349831 5404371 5457438 5508931 5557665 5602300 5642287 5677537 5707497 5731228 5748473 5760011
61246 5760011 5766500 5767368 5761331 5747776 5727092 5699807 5666169 5626700 5582447 5534240 5482169 5426267
61234 5426267 5367346 5306653 5244951 5182490 5119742 5057518 4996373 4936466 4878205 4822577 4770547
61223D770547m8199m4872m2385m0583l8702l5722l1588k7815k6000k5913k6022
61212D382746k5774k5938k6460k5667k2667j9102j6973j5587j2464o970j081L605
61200D187668P794J2785J8455K4014K9642L6200M4023N3071O3539P5094Q6056
61189D638341R4751J01635J08688J16321J21998J22514J16898J06470R2751P6126
61179E696493N6292L3024O296k3483n4638q3961j08331j26963j41467j53290j61829
61168D938143j65768j65528j63053j59340j53805j46383j38694j32099j25793
61159C587680j18169j09302j00846r3808q7552q0851p2920o3718n4227m6272m0956
61148B719059l7213l2712k6238j8584j1378n907k647p74J723O137J1203J4380
$$ plain form
61223 4770547 4722348 4677476 4635091 4594508 4555806 4520084 4488496 4460681 4434681 4408768 4382746
61212 4382746 4356972 4331034 4304574 4278907 4256240 4237138 4220165 4204578 4192114 4185144 4184063 4187668
61200 4187668 4195462 4208247 4226702 4250716 4280358 4316558 4360581 4413652 4477191 4552285 4638341
61189 4638341 4733092 4834727 4943415 5059736 5181734 5304248 5421146 5527616 5620367 5696493
61179 5696493 5752785 5785809 5792105 5768622 5713984 5630023 5521692 5394729 5253262 5099972 4938143
61168 4938143 4772375 4606847 4443794 4284454 4130649 3984266 3845572 3713473 3587680
61159 3587680 3469511 3360209 3259363 3165555 3078003 2997152 2924232 2860514 2806287 2760015 2719059
61148 2719059 2681846 2649134 2622896 2604312 2592934 2587027 2584380 2583606 2585329 2591466 2602669 2617049
61136B617049J4971J4557J4238J3160J0469P061M193J554j809n412p752q585r554
61123B664140j2257j6547k0866k3777k4957k5096k5010k4900k4546k4137k4430
61112B417617k5921k8220l0485l2141l3144l3958l5283l7294l9119l9735l9392
61101B042925l9286l9617l9030l6561l3170l0601k9420k9006k8879k9097k9631
61090A678627l0203l0698l1301l2200l3359l4301l4147l2453l0034k8188k6948
61079A334795k5138k2382j9786j7991j6019j3111j0427r420r391q354n794l013
61067A173969r65P63K795N099P361R237J0287J0564J0937J1957J2830J2731J2579
61054A280144J3909J6264J7473J6734J5671J5896J6990J7450J6308J3306Q811
$$ plain form
61136 2617049 2632020 2646577 2660815 2673975 2684444 2691505 2695698 2697252 2695443 2690031 2682279 2673694 2664140
61123 2664140 2651883 2635336 2614470 2590693 2565736 2540640 2515630 2490730 2466184 2442047 2417617
61112 2417617 2391696 2363476 2332991 2300850 2267706 2233748 2198465 2161171 2122052 2082317 2042925
61101 2042925 2003639 1964022 1924992 1888431 1855261 1824660 1795240 1766234 1737355 1708258 1678627
61090 1678627 1648424 1617726 1586425 1554225 1520866 1486565 1452418 1419965 1389931 1361743 1334795
61079 1334795 1309657 1287275 1267489 1249498 1233479 1220368 1209941 1200521 1191130 1182776 1176982 1173969
61067 1173969 1173004 1173767 1176562 1181661 1189022 1198259 1208546 1219110 1230047 1242004 1254834 1267565 1280144
61054 1280144 1294053 1310317 1327790 1344524 1360195 1376091 1393081 1410531 1426839 1440145 1448956
61043A448956M280J549Q35L93j248l681n763p173q056q169p436o514o000n750
61029A396223n663o225p518q497q265p338o708o421n972n452n168m792m005l425
61015A310774l672l920k776m12J425J539K38j745l954n584n416l154j22J972K495
61000A287688J864O59n96j227n07J857N307Q430R675Q701P107P245R927J3624
60986A359754J6178J7007J7349J8587K0782K2927K4284K5121K6183K7804K9891
60975A605867L2443L5544L8804M1438M3162M4592M6449M8832N1553N4857N9153
60964B102694O4286O9420P3813P7603Q1868Q7693R4882J01930J07850J13772J21721
60953C097532J31938J42690J52891J63246J74283J85018J94955K05850K19754
$$ plain form
61043 1448956 1453236 1454785 1455620 1456013 1454765 1451084 1445321 1438148 1430092 1421923 1414487 1407973 1401973 1396223
61029 1396223 1390560 1384335 1376817 1368320 1360055 1352717 1346009 1339588 1333616 1328164 1322996 1318204 1314199 1310774
61015 1310774 1307102 1303182 1300406 1299994 1301419 1302958 1303196 1301451 1297497 1291913 1286497 1283343 1283221 1285193 1287688
61000 1287688 1289552 1290211 1289615 1288388 1287881 1289738 1295045 1303475 1313150 1321851 1328958 1336203 1346130 1359754
60986 1359754 1375932 1392939 1410288 1428875 1449657 1472584 1496868 1521989 1548172 1575976 1605867
60975 1605867 1638310 1673854 1712658 1754096 1797258 1841850 1888299 1937131 1988684 2043541 2102694
60964 2102694 2166980 2236400 2310213 2387816 2469684 2557377 2652259 2754189 2862039 2975811 3097532
60953 3097532 3229470 3372160 3525051 3688297 3862580 4047598 4242553 4448403 4668157
60944D668157K36333K53998K72932K94977L20973L50205L82358M18170M58417
60935G656520N04283N58545O24140P01527P89965Q91677J011622J152014J310075
60926A5200368J483215J674231J889722K135290K410943K701020K958261L102001
60918C3555051L050690K773537K316037J774979J250264Q17524N27413M00396
60910D6465891M02827M35394L69570J17302l23103q80416j460338j984134k397944
60901D0745049k670666k796770k797480k709595k568032k396506k209492k017179
60893B0579329j827831j648598j485594j342213j217444j107310j008099r17251
60885A0024989q32030p49821o70238n95272n26826m65204m10135l61699l19941
$$ plain form
60944 4668157 4904490 5158488 5431420 5726397 6047370 6397575 6779933 7198103 7656520
60935 7656520 8160803 8719348 9343488 10045015 10834980 11726657 12738279 13890293 15200368
60926 15200368 16683583 18357814 20247536 22382826 24793769 27494789 30453050 33555051
60918 33555051 36605741 39379278 41695315 43470294 44720558 45538082 46065495 46465891
60910 46465891 46868718 47304112 47673682 47790984 47467881 46587465 45127127 43142993 40745049
60901 40745049 38074383 35277613 32480133 29770538 27202506 24806000 22596508 20579329
60893 20579329 18751498 17102900 15617306 14275093 13057649 11950339 10942240 10024989
60885 10024989 9192959 8443138 7772900 7177628 6650802 6185598 5775463 5413764 5093823
60876E093823k84851k56818k35519k18282k01592j84848j70636j60444j52237
60867C228596j43577j34970j27997j21789j14085j05023r7236r2106q8174q3682
60857B119957p8721p4134o9846o5285o0490n5991n2175m9227m7039m4953m2379
60846A479717l9887l8705l8657l7743l4520k9992k6206k3794k2063k0800k0433
60835A146917k0460j9378j6728j4033j2738j2099j0215o740l403j795j687j849
60823A025792j593r20J47J483K475K556K038J800K209K992M003N233O016N239
60809A059470K899O35o2L76K62j139k835l438k726j728j631k651l838l997k843
60794A036754j001R73L076N208O764P388P591Q133R143J0342J1693J3160J4273
$$ plain form
60876 5093823 4808972 4552154 4316635 4098353 3896761 3711913 3541277 3380833 3228596
60867 3228596 3085019 2950049 2822052 2700263 2586178 2481155 2383919 2291813 2203639 2119957
60857 2119957 2041236 1967102 1897256 1831971 1771481 1715490 1663315 1614088 1567049 1522096 1479717
60846 1479717 1439830 1401125 1362468 1324725 1290205 1260213 1234007 1210213 1188150 1167350 1146917
60835 1146917 1126457 1107079 1090351 1076318 1063580 1051481 1041266 1034526 1031123 1029328 1027641 1025792
60823 1025792 1024199 1023279 1023426 1024909 1027384 1029940 1031978 1033778 1035987 1038979 1042982 1048215 1054231 1059470
60809 1059470 1062369 1063004 1062942 1063318 1063580 1062441 1059606 1056168 1053442 1051714 1050083 1047432 1043594 1039597 1036754
60794 1036754 1035753 1036726 1039802 1045010 1051774 1059162 1066753 1074886 1084029 1094371 1106064 1119224 1133497
60781A133497J4554J4082J3026J1201Q846P353P968R889J0821R591P263N559N197
60768A258847N970P294Q234P911O665O002O805Q073Q104O448M192K739K804M088
60754A344176N369N332L878K264J524J155J2k063m234o003p562q915r571r444
60740A315918r341j0060j1388j2392j2512j2044j1555j1182j0641r733q607p445
60728A189018o225m963l922l155k084r2K394M157M678M823N660P137Q443R275
60714A215144J0125J1432J3013J4380J5324J6098J7109J8378J9359J9562J9302
60703A389226J9321J9553J8922J6777J3924J1706J0500R803R310R107Q894Q012
60691A545055O421M979M471M757N092M956M362L612L009K607K181J414J87j415
$$ plain form
60781 1133497 1148051 1162133 1175159 1186360 1195206 1202559 1210527 1220416 1231237 1240828 1248091 1253650 1258847
60768 1258847 1264817 1272111 1280345 1288256 1294921 1300923 1307728 1315801 1323905 1330353 1334545 1337284 1340088 1344176
60754 1344176 1349545 1354877 1358755 1361019 1362543 1363698 1363710 1361647 1357413 1351410 1343848 1334933 1325362 1315918
60740 1315918 1306577 1296517 1285129 1272737 1260225 1248181 1236626 1225444 1214803 1205070 1196463 1189018
60728 1189018 1182793 1177830 1173908 1170753 1168669 1168577 1170971 1175128 1179806 1184629 1190289 1197426 1205869 1215144
60714 1215144 1225269 1236701 1249714 1264094 1279418 1295516 1312625 1331003 1350362 1369924 1389226
60703 1389226 1408547 1428100 1447022 1463799 1477723 1489429 1499929 1509732 1519042 1528149 1537043 1545055
60691 1545055 1551476 1556455 1560926 1565683 1570775 1575731 1580093 1583705 1586714 1589321 1591502 1592916 1593103 1591688
60677A591688l253n087o484o974o493n557n005n430o704q087r097j0034j1302
60664A502181j2328j2023j0412q941q610q678p887o360n206m746m190l029j733
60651A408038r31o91p68j005j259j444j740k363l176l944m768n727o342o101n383
60636A362396n070n311n416n011m376l695k864k240k556l763m874n367n929p344
60622A298580r427j1483j3085j3944j3874j3425j3712j4893j5643j4959j3686
60611A150449j3276j3635j3538j2697j2021j1811j1069r080o604m795l601k015
60599A036307K79K218K553J466O28J512L826N953O832O810O620O296N586M769
60585A091655M299M121M070M527N760O801O103L565J084O62K503N213P362Q538
$$ plain form
60677 1591688 1588435 1583348 1576864 1569890 1563397 1557840 1552835 1547405 1540701 1532614 1523517 1513483 1502181
60664 1502181 1489853 1477830 1467418 1458477 1449867 1441189 1433302 1426942 1421736 1416990 1412800 1409771 1408038
60651 1408038 1407107 1406416 1405648 1404643 1403384 1401940 1400200 1397837 1394661 1390717 1385949 1380222 1373880 1367779 1362396
60636 1362396 1357326 1352015 1346599 1341588 1337212 1333517 1330653 1328413 1325857 1322094 1317220 1311853 1305924 1298580
60622 1298580 1289153 1277670 1264585 1250641 1236767 1223342 1209630 1194737 1179094 1164135 1150449
60611 1150449 1137173 1123538 1110000 1097303 1085282 1073471 1062402 1053322 1046718 1041923 1038322 1036307
60599 1036307 1036586 1038804 1041357 1042823 1043451 1044963 1048789 1054742 1061574 1068384 1075004 1081300 1086886 1091655
60585 1091655 1095954 1100075 1104145 1108672 1114432 1121233 1127336 1130901 1131985 1132647 1135150 1140363 1147725 1156263
60571A156263R176R773J0262J0156R569R665J1537J4626J7062J7777J7600J7935
60559A311401J9015K0136K1069K2361K4168K5586K5653K4704K4109K4429K4288
60548A566919K1816J7148J2714J0423R248O495J154n061j0051j3496j6309j8942
60536A582058k1028k2090k1864k0384j8404j7344j7941j9165j9232j7571j5163
60525A371872j2991j1048r035p168n787m681l387j961r35m75k0R63K090K283J143
60510A320863j62J20K355N035O482O645O785P731R113J0103J0282R785R171R148
60496A413456R913J0756J0882J0758J1809J4471J7214J8104J6914J5229J4769
60485A564275J6093J8591K1150K3016K4465K6497K9534L2730L4972L6101L6385
$$ plain form
60571 1156263 1165439 1175212 1185474 1195630 1205199 1214864 1226401 1241027 1258089 1275866 1293466 1311401
60559 1311401 1330416 1350552 1371621 1393982 1418150 1443736 1469389 1494093 1518202 1542631 1566919
60548 1566919 1588735 1605883 1618597 1629020 1638268 1644763 1645917 1640856 1630805 1617309 1601000 1582058
60536 1582058 1561030 1538940 1517076 1496692 1478288 1460944 1443003 1423838 1404606 1387035 1371872
60525 1371872 1358881 1347833 1338798 1331630 1325843 1321162 1317775 1315814 1314879 1314404 1314384 1315347 1317437 1319720 1320863
60510 1320863 1320701 1320821 1323176 1328211 1334693 1341338 1348123 1355854 1364967 1375070 1385352 1395137 1404308 1413456
60496 1413456 1423369 1434125 1445007 1455765 1467574 1482045 1499259 1517363 1534277 1549506 1564275
60485 1564275 1580368 1598959 1620109 1643125 1667590 1694087 1723621 1756351 1791323 1827424 1863809
60474A863809L5146L1037K3885J5253O765j224q774j5071j9045k0846k1560k1514
60462A867861j9950j6667j2883r702o467j770M159R327J2479J4639J7473K0894
60450A879393K3441K4679K6075K9269L4354M0277M6218N2178N8749O6843P7195
60439B358671Q9537J02598J15355J28021J41475J56161J72017J88867K06218K23122
60429C882042K39283K55965K74758K95201L14384L28781L35470L31576L13722
60420F571182K79075K26764J58450P8396o802q9654j64106k26622k75318l09174
60410F242191l28609l35887l33969l25222l11660k95623k79192k63108k47009
60401C521912k30609k14111j97731j81562j65866j51070j37452j25085j13818
$$ plain form
60474 1863809 1898955 1929992 1953877 1969130 1975895 1974671 1965897 1950826 1931781 1910935 1889375 1867861
60462 1867861 1847911 1831244 1818361 1808659 1802192 1800422 1804581 1813908 1826387 1841026 1858499 1879393
60450 1879393 1902834 1927513 1953588 1982857 2017211 2057488 2103706 2155884 2214633 2281476 2358671
60439 2358671 2448208 2550806 2666161 2794182 2935657 3091818 3263835 3452702 3658920 3882042
60429 3882042 4121325 4377290 4652048 4947249 5261633 5590414 5925884 6257460 6571182
60420 6571182 6850257 7077021 7235471 7313867 7307065 7217411 7053305 6826683 6551365 6242191
60410 6242191 5913582 5577695 5243726 4918504 4606844 4311221 4032029 3768921 3521912
60401 3521912 3291303 3077192 2879461 2697899 2532033 2380963 2243511 2118426 2004608
60392B004608j03194r2818q3046p4666o7535o0382n2681m5851m1546l9317l7258
60381A306314l4480l1529k8539k4679j9925j5883j3984j3759j3663j2961j1971
60370A084941j0960r762q387p351p229q111r401j0039r192p055m854l773l850
60357I84977m060l443k022o02K23O43J082J422J326J261K291M520O587P403P596
60342A009204Q212Q750P811N549L907M208N724P020P668Q017Q222Q223Q048P637
60328A108200O852O083O160P113P704O774M697K908K361K947L992M684M233K264
60314A176972p10l403m436l209n74J426J146j001k928l061j670N6J472K588L343
60299A166011L523L149K626K576L600N790Q355J0300J1532J2712J3897J4198J3208
$$ plain form
60392 2004608 1901414 1808596 1725550 1650884 1583349 1522967 1470286 1424435 1382889 1343572 1306314
60381 1306314 1271834 1240305 1211766 1187087 1167162 1151279 1137295 1123536 1109873 1096912 1084941
60370 1084941 1073981 1064219 1055832 1048481 1041252 1033141 1023740 1013701 1004509 997454 992600 988827 984977
60357 984977 980917 977474 975452 974850 975073 975716 976798 978220 979546 980807 983098 987618 994205 1001608 1009204
60342 1009204 1017416 1026166 1033977 1039526 1043433 1047641 1053365 1060385 1068053 1076070 1084292 1092515 1100563 1108200
60328 1108200 1115052 1121135 1127295 1134408 1142112 1148886 1153583 1156491 1158852 1161799 1165791 1170475 1174708 1176972
60314 1176972 1176262 1172859 1168423 1165214 1164640 1166066 1167212 1166211 1163283 1160222 1158552 1158608 1160080 1162668 1166011
60299 1166011 1169534 1172683 1175309 1177885 1181485 1187275 1195630 1205930 1217462 1230174 1244071 1258269 1271477
60286A271477J1854J1158J0830R913Q322O880O062N478M572L230J646n5j913l809
60272A345645n110m901l093j003k5J80J107L018M319L809K259J079M75k30j429
60257A346100l245n748q205r079p908o263n654n402m061j996q34r39j330j690
60243A283746k388k611q00K498M251K620n35j990r08R55J853J564P12j65p11p40
60227A287351m17j95l65p09n46P37K985N269O815P690Q277Q581Q672R266J0858
60212A354269J2656J3538J3884J5042J6905J7677J6639J5681J6892J9648K1448
60201A534279K1120J9988K0062K2152K5761K9836L3262L5362L6512L8060M1249
60190A857643M6090N1465N6440O1328O7206P4366Q1731Q8092R3511R8998J05075
$$ plain form
60286 1271477 1283331 1294489 1305319 1315232 1323554 1330434 1336496 1341974 1346546 1349776 1351422 1351367 1349454 1345645
60272 1345645 1340535 1335634 1332541 1331538 1331513 1331693 1332800 1335818 1340137 1343946 1346205 1347284 1347759 1347529 1346100
60257 1346100 1342855 1337107 1328902 1319823 1311915 1305652 1299998 1294596 1290535 1288539 1287705 1286766 1285436 1283746
60243 1283746 1281358 1278747 1277947 1280445 1284696 1287316 1286781 1284791 1283883 1284838 1286691 1288255 1288967 1288802 1288091 1287351
60227 1287351 1286934 1286739 1286374 1285665 1285119 1285856 1288841 1294110 1300925 1308615 1316892 1325473 1334145 1343411 1354269
60212 1354269 1366925 1380463 1394347 1409389 1426294 1443971 1460610 1476291 1493183 1512831 1534279
60201 1534279 1555399 1575387 1595449 1617601 1643362 1673198 1706460 1741822 1778334 1816394 1857643
60190 1857643 1903733 1955198 2011638 2072966 2140172 2214538 2296269 2384361 2477872 2576870 2681945
60179B681945J11366J17510J23803J30762J38518J46531J53519J57853J58821
60170C920628J57392J55036J51821J46487J38323J27978J16203J02981Q8353P3129
60160E178331N8019M2920K7741J3432J273q480j6513k3168k7757k9241k7286k2734
60148E166537j6967j0539k589P914K0492L3496M5972N8211P0483Q2615R5060J08717
60136E659402J22807J34384J41256J44245J45137J43564J37796J27914J15953
60127F872458J02948Q7933P0203N0796L1007J1043q995k8196m5841o2127p6726
60116G004503q7850r3994r5826r4931r1474q4790p5685o5997n5639m2250k4781
60105F191286n697J1761K7202M2213N6796O8819P6954Q2223Q5949Q7823Q6902
$$ plain form
60179 2681945 2793311 2910821 3034624 3165386 3303904 3450435 3603954 3761807 3920628
60170 3920628 4078020 4233056 4384877 4531364 4669687 4797665 4913868 5016849 5105202 5178331
60160 5178331 5236350 5279270 5307011 5320443 5321716 5313236 5296723 5273555 5245798 5216557 5189271 5166537
60148 5166537 5149570 5139031 5136442 5144356 5164848 5198344 5244316 5302527 5373010 5455625 5550685 5659402
60136 5659402 5782209 5916593 6057849 6202094 6347231 6490795 6628591 6756505 6872458
60127 6872458 6975406 7063339 7133542 7184338 7215345 7226388 7217393 7189197 7143356 7081229 7004503
60116 7004503 6916653 6822659 6726833 6631902 6540428 6455638 6379953 6313956 6258317 6216067 6191286
60105 6191286 6185589 6197350 6224552 6266765 6323561 6392380 6469334 6551557 6637506 6725329 6812231
60094F812231Q3205P7116O8300N6877M5041L5678K9206K3328J6516J0367P627
60083G265492R045J3402K0064K9830M3152N8956P6061R4814J16188J39640J63271
60072H029915J86403K10747K38025K67197K95401L21450L46936L73424L99840
60063A0669338M23582M43394M59736M72517M79724M78883M69293M52186M28840
60054A4777493L98968L61272L15421K62936K05947J45599Q2471J8034m5625j07491
60044A6415025j67542k24463k74923l16203l48347l72465l88012l93413l88771
60035A3540886l76217l57747l34228l06499k75826k42998k08189j72059j36004
60026A1131119j01211o8352l8286j1912J0694K9905M5168N5045N8716N6491M8924
$$ plain form
60094 6812231 6895436 6972552 7040852 7097729 7142770 7178448 7207654 7230982 7247498 7257865 7265492
60083 7265492 7274537 7287939 7308003 7337833 7380985 7439941 7516002 7610816 7727004 7866644 8029915
60072 8029915 8216318 8427065 8665090 8932287 9227688 9549138 9896074 10269498 10669338
60063 10669338 11092920 11536314 11996050 12468567 12948291 13427174 13896467 14348653 14777493
60054 14777493 15176461 15537733 15853154 16116090 16322037 16467636 16550107 16568141 16522516 16415025
60044 16415025 16247483 16023020 15748097 15431894 15083547 14711082 14323070 13929657 13540886
60035 13540886 13164669 12806922 12472694 12166195 11890369 11647371 11439182 11267123 11131119
60026 11131119 11029908 10961556 10923270 10911358 10922052 10951957 10997125 11052170 11110886 11167377 11216301
60015A1216301L6636K0989L577j5150l5513n6822p7390r6409j14357j31399j47070
60004A0603393j61711j76224j89805j99870k05114k06857k06453k03319j96787
59995H857253j87895j77648j65052j48795j29672j09527q8850o7334m5769k5286
59985G711425n256J6045L8763O1102Q1370R9013J13759J25292J33627J38533J38780
59974H652453J33279J22807J09203R3007P3218M9446K3090l893l0375n6101q1070
59963I085064j04831j25840j42043j52854j59922j64867j66915j63976j55559
59954G748257j43309j29113j14048r8686q2843o5157m4481k1639J550K4686M8688
59943G123905P3519R7759J20603J42465J63336J82056J97601K09675K17698K20604
$$ plain form
60015 11216301 11252937 11273926 11277503 11262353 11226840 11170018 11092628 10996219 10881862 10750463 10603393
60004 10603393 10441682 10265458 10075653 9875783 9670669 9463812 9257359 9054040 8857253
59995 8857253 8669358 8491710 8326658 8177863 8048191 7938664 7849814 7782480 7736711 7711425
59985 7711425 7706169 7722214 7760977 7822079 7903449 8002462 8116221 8241513 8375140 8513673 8652453
59974 8652453 8785732 8908539 9017742 9110749 9183967 9233413 9256503 9252610 9222235 9166134 9085064
59963 9085064 8980233 8854393 8712350 8559496 8399574 8234707 8067792 7903816 7748257
59954 7748257 7604948 7475835 7361787 7263101 7180258 7115101 7070620 7048981 7050531 7075217 7123905
59943 7123905 7197424 7295183 7415786 7558251 7721587 7903643 8101244 8310919 8528617 8749221
59933H749221K17940K09936J96357J76816J52341J24948R5374O3112K9018m312
59923A0010751l5596o6064r6183j23133j43434j56688j64792j68452j66648j59172
59913H730589j47647j33764j17852r9561p9056n7136l4714j2367R839L1989N3698
59902H144018P4179R2963J09935J24517J35775J43695J49407J53409J54544J51592
59892I434034J45124J36838J27762J18225J08946J00807R3732Q7161Q1706P9154
59882A0513489Q0602Q5621R3707J05566J22184J43137J66834J92531K21341K54667
59872A1979679K91725L29172L63437L93152M18951M41085M57752M65609M61412
59863A5601974M43173M10513L64348L06066K36945J58573P3697j3788r9714j80137
$$ plain form
59933 8749221 8967161 9177097 9373454 9550270 9702611 9827559 9922933 9986045 10015063 10010751
59923 10010751 9975155 9909091 9812908 9689775 9546341 9389653 9224861 9056409 8889761 8730589
59913 8730589 8582942 8449178 8331326 8231765 8152709 8095573 8060859 8048492 8058331 8090320 8144018
59902 8144018 8218197 8311160 8421095 8545612 8681387 8825082 8974489 9127898 9282442 9434034
59892 9434034 9579158 9715996 9843758 9961983 10070929 10171736 10265468 10352629 10434335 10513489
59882 10513489 10594091 10679712 10773419 10878985 11001169 11144306 11311140 11503671 11725012 11979679
59872 11979679 12271404 12600576 12964013 13357165 13776116 14217201 14674953 15140562 15601974
59863 15601974 16045147 16455660 16820008 17126074 17363019 17521592 17595289 17581501 17481787 17301650
59853A7301650k51376l10665l57147l91674m15391m28888m32665m27663m15074
59844A3871107l96230l72668l45542l14887k80310k42679k04098j65878j27496
59835A1421319q8218m8834j1088K3896N5767Q4046J07877J26301J38158J42016
59825A1951240J36829J22497R9467O8314L0148j3075n9281j06984j54771k00597
59815A1873787k42146k77743l06588l28494l43829l53351l57567l56424l49973
59806H957672l39043l25063l09487k93357k76853k59218k39833k19490j99733
59797F495595j80817j61542j41550j22434j05736r1124p7786o6542n8933n4706
59787E434425n1860m8958m5987m3004l9535l5724l2694l1000k9705k7821k6063
$$ plain form
59853 17301650 17050274 16739609 16382462 15990788 15575397 15146509 14713844 14286181 13871107
59844 13871107 13474877 13102209 12756667 12441780 12161470 11918791 11714693 11548815 11421319
59835 11421319 11333101 11284267 11273179 11297075 11352842 11436888 11544765 11671066 11809224 11951240
59825 11951240 12088069 12210566 12310033 12378347 12408495 12395420 12336139 12229155 12074384 11873787
59815 11873787 11631641 11353898 11047310 10718816 10374987 10021636 9664069 9307645 8957672
59806 8957672 8618629 8293566 7984079 7690722 7413869 7154651 6914818 6695328 6495595
59797 6495595 6314778 6153236 6011686 5889252 5783516 5692392 5614606 5548064 5489131 5434425
59787 5434425 5382565 5333607 5287620 5244616 5205081 5169357 5136663 5105663 5075958 5048137 5022074
59776E022074k6245k9050l3147l6616l8779m0324m2086m4291m6888m9757n2135
59765D582756n2546n0225m6271m2463l9041l4702k8729k2007j5845j0980p808
59754D232139o139m185O66Q990J8464K6747L4077M1944N0409N8178O4657P0354
59742D596301P5653Q0278Q3613Q4649Q2337P7102P1329O6984O3439N8890N3360
59731E393935M8758M6398M6067M7362N0357N4931O0830O8511P8698R1110J04827
59720F091784J19831J36945J56352J77458K00164K24872K51293K78728L07342
59711G944769L37477L67579L94615M16675M33042M40925M34205M06900L57065
59702A1533252K86950K01520J08232J6453o5531j33350j85920k23122k45322k54251
$$ plain form
59776 5022074 4995829 4966779 4933632 4897016 4858237 4817913 4775827 4731536 4684648 4634891 4582756
59765 4582756 4530210 4479985 4433714 4391251 4352210 4317508 4288779 4266772 4250927 4239947 4232139
59754 4232139 4226000 4221815 4222481 4231471 4249935 4276682 4310759 4352703 4403112 4461290 4525947 4596301
59742 4596301 4671954 4752232 4835845 4920494 5002831 5079933 5151262 5218246 5281685 5340575 5393935
59731 5393935 5442693 5489091 5535158 5582520 5632877 5687808 5748638 5817149 5895847 5986957 6091784
59720 6091784 6211615 6348560 6504912 6682370 6882534 7107406 7358699 7637427 7944769
59711 7944769 8282246 8649825 9044440 9461115 9894157 10335082 10769287 11176187 11533252
59702 11533252 11820202 12021722 12129954 12146407 12080876 11947526 11761606 11538484 11293162 11038911
59692A1038911k52529k42402k25909k05795j84645j62966j39359j12933q4739
59683I427634n6567k9092j699K6335N5044Q4094J13563J44079J75965K08464K40299
59672A0388119K71155L02230L35177L70815M08902M48654M89344N30926N74292
59663A4119614O20400O68864P17986P66373Q13852Q60385R04740R44845R78954
59654B1396013J005885J024504J033773J033160J022744J003313R76889R46905
59646B9443186R17080Q89924Q66343Q46453Q30227Q17176Q05393P91206P70398
59637C6977386P40261P00276O50380N89455N16734M34268L46394K56661J67107
59628D1378922Q0972L891n9227j07173j40829j59857j62907j50158j23561q4651
$$ plain form
59692 11038911 10786382 10543980 10318071 10112276 9927631 9764665 9625306 9512373 9427634
59683 9427634 9371067 9341975 9340276 9366611 9421655 9505749 9619312 9763391 9939356 10147820 10388119
59672 10388119 10659274 10961504 11296681 11667496 12076398 12525052 13014396 13545322 14119614
59663 14119614 14740014 15408878 16126864 16893237 17707089 18567474 19472214 20417059 21396013
59654 21396013 22401898 23426402 24460175 25493335 26516079 27519392 28496281 29443186
59646 29443186 30360266 31250190 32116533 32962986 33793213 34610389 35415782 36206988 36977386
59637 36977386 37717647 38417923 39068303 39657758 40174492 40608760 40955154 41211815 41378922
59628 41378922 41459894 41463785 41404558 41297385 41156556 40996699 40833792 40683634 40560073 40475422
59618D0475422l3925K7765R8910J78424K65228L56678M49280N41344O32867P21923
59608D3713916Q02890Q69298R16698R41250R37203Q98258Q21205P06568N56220
59599E1163506L72649J61198o8470l04177n34077p47878r36979j095093j218946
59590D6791733j308003j363675j388991j388524j367830j332636j288498j241009
59582C6112567j196017j159408j136209j129175j137611j157288j181438j202294
59574B6813127j212947j209278j190794j159552j118166j068930j014210r56431
59566A7882819q97338q37927p79406p23412o70790o20938n73039n27411m84844
59557A1767714m45199m07605l71731l37960l06469k77031k49746k25245k04076
$$ plain form
59618 40475422 40441497 40469262 40568172 40746596 41011824 41368502 41817782 42359126 42991993 43713916
59608 43713916 44516806 45386104 46302802 47244052 48181255 49079513 49900718 50607286 51163506
59599 51163506 51536155 51697353 51628883 51324706 50790629 50042751 49105772 48010679 46791733
59590 46791733 45483730 44120055 42731064 41342540 39974710 38642074 37353576 36112567
59582 36112567 34916550 33757142 32620933 31491758 30354147 29196859 28015421 26813127
59574 26813127 25600180 24390902 23200108 22040556 20922390 19853460 18839250 17882819
59566 17882819 16985481 16147554 15368148 14644736 13973946 13353008 12779969 12252558 11767714
59557 11767714 11322515 10914910 10543179 10205219 9898750 9621719 9371973 9146728 8942652
59548H942652j86460j72458j61611j52675j44694j38278j34866j34590j35916
59539G581104j37411j38788j39878j39847j38093j34962j30984j26166j20558
59530F374417j14649j08499j01319r2558q2704p2476o2069n1791m2453l4356k6780
59519E584763j9237j2207n786J186R445J7855K4996L1181L7353M3118M7660N1769
59507E812096N6780O2097O6174O9663P5085Q3151R1820R9586J07469J16797J27302
59496F768020J38539J51296J66103J81845J97350K13005K29448K45986K61913
59487H553505K78211K96060L14382L30727L44164L55545L64987L70924L71987
59478A1580492L68501L61443L50668L34776L12552K84438K52806K20505J88904
$$ plain form
59548 8942652 8756192 8583734 8422123 8269448 8124754 7986476 7851610 7717020 7581104
59539 7581104 7443693 7304905 7165027 7025180 6887087 6752125 6621141 6494975 6374417
59530 6374417 6259768 6151269 6049950 5957392 5874688 5802212 5740143 5688352 5645899 5611543 5584763
59519 5584763 5565526 5553319 5547533 5548719 5558164 5576019 5601015 5632196 5669549 5712667 5760327 5812096
59507 5812096 5868876 5930973 5997147 6066810 6141895 6225046 6316866 6416452 6523921 6640718 6768020
59496 6768020 6906559 7057855 7223958 7405803 7603153 7816158 8045606 8291592 8553505
59487 8553505 8831716 9127776 9442158 9772885 10117049 10472594 10837581 11208505 11580492
59478 11580492 11948993 12310436 12661104 12995880 13308432 13592870 13845676 14066181 14255085
59469A4255085J57655J26537R6727O9711M5782K4570O421p780j7641k2927k2556
59458A4711584j5281j440J7083L8723O3072Q9732J17284J43617J66322J82584
59448A5513280J89749J86531J72940J48747J12947O5406Q286n5014j21676j89374
59438A6031822k54842l14024l64138m04777m36478m58784m70594m72102m65460
59429A2390623m53038m35714m13422l86884l57949l28153k97799k66705k35243
59420I215716k04130j73564j43089j12276q1257n0612k0833Q191L7104O6250R4969
59409H636469J22121J47180J70355J91633K10469K26522K39750K49288K53018
59400A0446805K48975K36751K17081J90639J57820J19059P4675K5102k7818q0372
$$ plain form
59469 14255085 14412740 14539277 14636004 14705715 14751497 14776067 14782488 14774708 14757067 14734140 14711584
59458 14711584 14696303 14694863 14711946 14750669 14813741 14903473 15020757 15164374 15330696 15513280
59448 15513280 15703029 15889560 16062500 16211247 16324194 16389600 16397886 16342872 16221196 16031822
59438 16031822 15776980 15462956 15098818 14694041 14257563 13798779 13328185 12856083 12390623
59429 12390623 11937585 11501871 11088449 10701565 10343616 10015463 9717664 9450959 9215716
59420 9215716 9011586 8838022 8694933 8582657 8501400 8450788 8429955 8438146 8475250 8541500 8636469
59409 8636469 8758590 8905770 9076125 9267758 9478227 9704749 9944499 10193787 10446805
59400 10446805 10695780 10932531 11149612 11340251 11498071 11617130 11691805 11716907 11689089 11608717
59390A1608717j29099j73112k13309k49468k79651l02650l19518l31877l39707
59381I270326l42027l39159l33087l25449l16017l03664k88382k71732k55289
59372F495520k39156k22389k04694j87061j70572j55259j40556j26424j13275
59363D936134j01000q8912p6746o5037n4272m4189l4295k4623j5461o624K364
59352D427339J1349J9305K5268K9069L0887L0528K7985K4689K3237K5264L0080
59341D705000L5947M2287M9825N8902O8522P7107Q3379Q6700Q7702Q8766R2777
59330E476914J00808J11752J24386J38695J54774J71832J89450K08804K31298
59321F908713K56454K82415L08356L35335L64877L97671M33463M71314N10038
$$ plain form
59390 11608717 11479618 11306506 11093197 10843729 10564078 10261428 9941910 9610033 9270326
59381 9270326 8928299 8589140 8256053 7930604 7614587 7310923 7022541 6750809 6495520
59372 6495520 6256364 6033975 5829281 5642220 5471648 5316389 5175833 5049409 4936134
59363 4936134 4835134 4746222 4669476 4604439 4550167 4505978 4471683 4447060 4431599 4424975 4427339
59352 4427339 4438688 4457993 4483261 4512330 4543217 4573745 4601730 4626419 4649656 4674920 4705000
59341 4705000 4740947 4783234 4833059 4891961 4960483 5037590 5120969 5207669 5295371 5384137 5476914
59330 5476914 5577722 5689474 5813860 5952555 6107329 6279161 6468611 6677415 6908713
59321 6908713 7165167 7447582 7755938 8091273 8456150 8853821 9287284 9758598 10268636
59312A0268636N49100N88951O29716O69831P06786P38829P64933P83331P91565
59303A6491678P88282P74050P50179P17734O78066O33291N85651N36847M88088
59294B2443866M39990L91933L42251K89557K33527J74279J11566M4813k6716j03853
59284B4341213j86662k72956l58441m39020n12709n78951o36867o85081p22805
59275A9947721p50108p67185p74095p71424p60655p43554p21389o94813o64333
59266A3300165o30856n95824n60626n25659m90170m53382m15833l79217l44778
59257H903820l12305k81052k51371k24591k01073j79143j56809j34175j13028
59248G050273r4118p6144n8082m1132k7055j5244l151J0482K4303L6557M7290
$$ plain form
59312 10268636 10817736 11406687 12036403 12706234 13413020 14151849 14916782 15700113 16491678
59303 16491678 17279960 18054010 18804189 19521923 20199989 20833280 21418931 21955778 22443866
59294 22443866 22883856 23275789 23618040 23907597 24141124 24315403 24426969 24471782 24445066 24341213
59284 24341213 24154551 23881595 23523154 23084134 22571425 21992474 21355607 20670526 19947721
59275 19947721 19197613 18430428 17656333 16884909 16124254 15380700 14659311 13964498 13300165
59266 13300165 12669309 12073485 11512859 10987200 10497030 10043648 9627815 9248598 8903820
59257 8903820 8591515 8310463 8059092 7834501 7633428 7454285 7297476 7163301 7050273
59248 7050273 6956155 6880011 6821929 6780797 6753742 6738498 6735347 6745829 6770132 6806689 6853979
59237F853979N7595O7765P7189Q5575R3328J00724J07286J12042J14236J14023
59227G783742J12747J12105J12656J13311J12707J10920J09389J09357J10770
59218H787704J12595J13758J13630J12051J09168J05296J00882R6511R2646Q9006
59208I833247Q4235P6636O5502N1514L5621J7769k695k5373m8204o8950q7004
59197I932298j03095j17348j28324j34323j35172j32306j27349j20917j12760
59188H820704j02728r1341p9389o7145n4427m1537k9592j9383j0293j119Q177
59177H331927J6344K2391K6511K9562L2474L6111M0683M5246M9028N3310O0581
59166H744168P1481Q4192R7520J12898J32227J55249J80506K07609K36818K67400
$$ plain form
59237 6853979 6911574 6979339 7056528 7142103 7235431 7336155 7443441 7555483 7669719 7783742
59227 7783742 7896489 8008594 8121250 8234561 8347268 8458188 8567577 8676934 8787704
59218 8787704 8900299 9014057 9127687 9239738 9348906 9454202 9555084 9651595 9744241 9833247
59208 9833247 9917482 9994118 10059620 10111134 10146755 10164524 10161829 10136456 10088252 10019302 9932298
59197 9932298 9829203 9711855 9583531 9449208 9314036 9181730 9054381 8933464 8820704
59188 8820704 8717976 8626635 8547246 8480101 8425674 8384137 8354545 8335162 8324869 8323750 8331927
59177 8331927 8348271 8370662 8397173 8426735 8459209 8495320 8536003 8581249 8630277 8683587 8744168
59166 8744168 8815649 8899841 8997361 9110259 9242486 9397735 9578241 9785850 10022668 10290068
59156A0290068K97997L27834L55971L80126L97901M08415M10928M02706L80436
59147A3652382L43446K93608K32498J60959Q1231l006q8908j74461k55958l28258
59137A3913533l88562m37813m77361n06283n23236n28936n25380n14169m97013
59128I514780m76493m54600m31492m06774l81084l55497l30432l06099k82862
59119F089447k60333k37537k14895j94589j77691j62520j47111j31817j17941
59110D445013j05341r3238q2046p2367o3307n3794m4610l6910k9797k1760j3768
59099C828075q060m167J010Q834J7246K4184L0254L6884M3760M9512N3765N7400
59087D138697O1624O7339P4547Q1872Q7630R1748R5646J00010J03979J06860J09167
$$ plain form
59156 10290068 10588065 10915899 11271870 11651996 12049897 12458312 12869240 13271946 13652382
59147 13652382 13995828 14289436 14521934 14682893 14764124 14761118 14672210 14497749 14241791 13913533
59137 13913533 13524971 13087158 12609797 12103514 11580278 11051342 10525962 10011793 9514780
59128 9514780 9038287 8583687 8152195 7745421 7364337 7008840 6678408 6372309 6089447
59119 6089447 5829114 5591577 5376682 5182093 5004402 4841882 4694771 4562954 4445013
59110 4445013 4339672 4246434 4164388 4092021 4028714 3974920 3930310 3893400 3863603 3841843 3828075
59099 3828075 3820015 3815848 3816858 3825692 3842938 3867122 3897376 3934260 3978020 4027532 4081297 4138697
59087 4138697 4200321 4267660 4342207 4424079 4511709 4603457 4699103 4799113 4903092 5009952 5119119
59076E119119J11187J11883J10421J07692J05211J03052R9931R4961Q8439Q1071
59066F132967P3268O5219N7352N0480M5342M1845L9216L7414L7807M1395M6827
59055F669132N1584N5040N8845O4180P0447P7168Q5317R5636J07082J18280J29438
59044G582149J41482J54239J66845J79147J91301K02535K11734K18752K23682
59035I271866K25174K20956K10036J93109J70907J43424J10973P4670L5657m976
59025A0651796m5291q2750j16038j45587j71826j94001k11410k24893k35940k44868
59015H979192k50999k54370k56339k58349k60699k62557k62691k60144k54805
59006F658239k47607k39915k32479k25070k17117k08527j99744j91155j82597
$$ plain form
59076 5119119 5230306 5342189 5452610 5560302 5665513 5768565 5868496 5963457 6051896 6132967
59066 6132967 6206235 6271454 6328806 6379286 6424628 6466473 6505689 6543103 6580910 6622305 6669132
59055 6669132 6720716 6775756 6834601 6898781 6969228 7046396 7131713 7227349 7334431 7452711 7582149
59044 7582149 7723631 7877870 8044715 8223862 8415163 8617698 8829432 9048184 9271866
59035 9271866 9497040 9717996 9928032 10121141 10292048 10435472 10546445 10621115 10656772 10651796
59025 10651796 10606505 10523755 10407717 10262130 10090304 9896303 9684893 9460000 9224060 8979192
59015 8979192 8728193 8473823 8217484 7959135 7698436 7435879 7173188 6913044 6658239
59006 6658239 6410632 6170717 5938238 5713168 5496051 5287524 5087780 4896625 4714028
58997D714028j73613j64163j54863j46336j38467j30672j22766j15143j08013
58988C459992j01084r4228q7903q2455p7505p2564o7911o4072o0742n7036n2682
58977B641810m8151m3648l8978l4578l1472k9646k7468k3694j9258j5950j3875
58966B315092j1548q334n325l470k122j77K149L571L292J769J79m36J17Q57M41
58951B296055j136k073o43K686N790P368P951Q472Q834Q443P345O046M563K475
58937B362176p9k144k869k361j433q92j137j975k476j445J291M245N538M968M272
58922B365679N105P303R474J0786J1604J2609J3935J5258J6274J7057J8097J9950
58910B523131K2580K5240K7275K8779L0169L1375L2123L2827L4393L6990L9633
$$ plain form
58997 4714028 4540415 4376252 4221389 4075053 3936586 3805914 3683148 3568005 3459992
58988 3459992 3358908 3264680 3176777 3094322 3016817 2944253 2876342 2812270 2751528 2694492 2641810
58977 2641810 2593659 2550011 2511033 2476455 2444983 2415337 2387869 2364175 2344917 2328967 2315092
58966 2315092 2303544 2295210 2289885 2286415 2284293 2284116 2286265 2289836 2293128 2294897 2295076 2294640 2294757 2295614 2296055
58951 2296055 2294919 2292846 2292203 2294889 2300679 2308047 2315998 2324470 2333304 2341747 2349092 2355138 2359701 2362176
58937 2362176 2362097 2359953 2357084 2354723 2353290 2352398 2351261 2349286 2346810 2345365 2346656 2350901 2356439 2361407 2365679
58922 2365679 2370784 2378087 2387561 2398347 2409951 2422560 2436495 2451753 2468027 2485084 2503181 2523131
58910 2523131 2545711 2570951 2598226 2627005 2657174 2688549 2720672 2753499 2787892 2824882 2864515
58899B864515M1229M1698M1921M2895M5014M7765N0119N1654N3217N6028O0225
58888C396280O4880O9365P3854P8524Q3128Q7607R2353R7495J02864J08868J16421
58877D371639J25422J34258J41623J48023J54787J62467J71271J82153J95933
58868E787576K11586K26871K40876K54862K70391K87722L06428L26607L48735
58859H261654L72901L98788M26143M54837M84696N15726N48348N82983O19355
58850A2665431O56347O92770P28113P62525P95880Q26853Q52906Q71119Q79039
58841A9730983Q74880Q57145Q24121P73815P04768O17286N13642L96675K68621
58832B5561936J32075q221j45798k75203l93570m99300n90304o64522p21654p63380
$$ plain form
58899 2864515 2905744 2947442 2989363 3032258 3077272 3125037 3175156 3226810 3280027 3336055 3396280
58888 3396280 3461160 3530525 3604379 3682903 3766031 3853638 3945991 4043486 4146350 4255218 4371639
58877 4371639 4497061 4631319 4772942 4920965 5075752 5238219 5409490 5591643 5787576
58868 5787576 5999162 6226033 6466909 6721771 6992162 7279884 7586312 7912919 8261654
58859 8261654 8634555 9033343 9459486 9914323 10399019 10914745 11463093 12046076 12665431
58850 12665431 13321778 14014548 14742661 15505186 16301066 17127919 17980825 18851944 19730983
58841 19730983 20605863 21463008 22287129 23060944 23765712 24382998 24896640 25293315 25561936
58832 25561936 25694011 25685790 25539992 25264789 24871219 24371919 23781615 23117093 22395439 21632059
58822B1632059p91838q08344q13483q08184p94551p75379p52458p25743o95073
58813A4667006o62266o30048n98906n66828n32879m99261m68537m40400m12906
58804I854975l85671l59861l35807l12689k90303k69225k49234k29438k10036
58795G212711j92327j76641j61901j47547j34257j22193j10110r7076q3833p1468
58785E915358n9811m8142l6645k5980j5957n635N525J7378K9782M2737N5721O7589
58773E941920P7500Q5930R4468J04469J15931J28000J40472J54034J68926J84181
58763G195831J99018K14160K30856K49174K68435K88772L11013L35200L60696
58754I653155L87621M16741M47830M79648N11751N45055N80167O16508O53421
$$ plain form
58822 21632059 20840221 20031877 19218394 18410210 17615659 16840280 16087822 15362079 14667006
58813 14667006 14004740 13374692 12775786 12208958 11676079 11176818 10708281 10267881 9854975
58804 9854975 9469304 9109443 8773636 8460947 8170644 7901419 7652185 7422747 7212711
58795 7212711 7020384 6843743 6681842 6534295 6400038 6277845 6167735 6070659 5986826 5915358
58785 5915358 5855547 5807405 5770760 5744780 5728823 5723188 5728713 5746091 5775873 5818610 5874331 5941920
58773 5941920 6019420 6105350 6199818 6304287 6420218 6548218 6688690 6842724 7011650 7195831
58763 7195831 7394849 7609009 7839865 8089039 8357474 8646246 8957259 9292459 9653155
58754 9653155 10040776 10457517 10905347 11384995 11896746 12441801 13021968 13638476 14291897
58745A4291897O90663P27223P60951P90011Q13359Q29134Q34113Q25786Q03646
58736B1366783P67178P13884O40974N48436M39188L16924J85245M8316q9286k23345
58726B4714297l49680m63638n61649o43282p10271p63223q00755q22430q31069
58717A8768300q30977q24553q11732p92391p68012p40726p11591o80580o47900
58708A1959838o14539n81411n48695n16380m84927m54842m25988l97999l71154
58699G563903l46054l22618l00290k79105k59598k41652k24479k08049j93320
58690E188738j80552j68614j56678j45494j35946j27195j17753j07890r9517r3499
58680C855600q8395q2351p5515o9814o6692o5560o4466o1945n8029n3761n0153
$$ plain form
58745 14291897 14982560 15709783 16470734 17260745 18074104 18903238 19737351 20563137 21366783
58736 21366783 22133961 22847845 23488819 24037255 24476443 24793367 24978612 25026928 24937642 24714297
58726 24714297 24364617 23900979 23339330 22696048 21985777 21222554 20421799 19599369 18768300
58717 18768300 17937323 17112770 16301038 15508647 14740635 13999909 13288318 12607738 11959838
58708 11959838 11345299 10763888 10215193 9698813 9213886 8759044 8333056 7935057 7563903
58699 7563903 7217849 6895231 6594941 6315836 6056238 5814586 5590107 5382058 5188738
58690 5188738 5008186 4839572 4682894 4537400 4401454 4274259 4156506 4048616 3949099 3855600
58680 3855600 3767205 3684854 3609339 3539525 3472833 3407273 3342807 3280862 3222833 3169072 3118919
58669C118919m7772m6658m6093m4880m2713m0940m1033m2435m3186m2754m2758
58658B637697m4362m6465m7463m7563m7957m8608m8502m7642m7187m7504m7413
58647B117031m5713m2553l8946l5808l3821l3459l4433l5408l4925l2688k9740
58636A719537k7352k5919k5032k4427k4365k4865k5040k3899k1678j9615j8412
58625A458933j7674j6952j6369j5902j4949j3254j1478j0152q701o281l234q66
58613A323121Q8K09P71K605N413P955R241R566R854J0127R551P982O161M092Q66
58598A407602l075n286m497l000l877o682q158o858m655l414k489m73K421N076
58584A362635P359R814J2172J3573J4062J4799J6663J9509K2874K6710L0998L5159
$$ plain form
58669 3118919 3071147 3024489 2978396 2933516 2890803 2849863 2808830 2766395 2723209 2680455 2637697
58658 2637697 2593335 2546870 2499407 2451844 2403887 2355279 2306777 2259135 2211948 2164444 2117031
58647 2117031 2071318 2028765 1989819 1954011 1920190 1886731 1852298 1816890 1781965 1749277 1719537
58636 1719537 1692185 1666266 1641234 1616807 1592442 1567577 1542537 1518638 1496960 1477345 1458933
58625 1458933 1441259 1424307 1407938 1392036 1377087 1363833 1352355 1342203 1333502 1327221 1323987 1323121
58613 1323121 1323209 1323418 1324189 1326794 1332207 1340162 1349403 1358969 1368823 1378950 1388501 1396483 1402644 1406736 1407602
58598 1407602 1404527 1399241 1394744 1391744 1387867 1381185 1373027 1366169 1361514 1358100 1355611 1355138 1357559 1362635
58584 1362635 1369994 1379808 1391980 1405553 1419615 1434414 1451077 1470586 1493460 1520170 1551168 1586327
58572A586327L8444M0796M2856M5113M7476M9954N3160N7707O3307O9083P4591
58561B168814P9924Q5119R0275R6220J03927J13036J21945J29858J37877J47505
58551C274500J58884J71012J83008J94554K05682K16622K27144K35774K40551
58542E107731K40929K37749K30790K17707J96393J67246J32105R2304M9239N610
58532F677803l5769p3810j08370j38407j62623j81126j94726k03255k06530k06234
58522E166953k04484k00911j93731j83665j73916j65811j57205j46443j35211
58513C605576j25809j17652j08675r8738q9595q2330p6663p2230o8808o5666o2166
58502B637244n8746n6101n3756n0673m7065m4100m1927l9486l6508l4365l4234
$$ plain form
58572 1586327 1624771 1665567 1708423 1753536 1801012 1850966 1904126 1961833 2025140 2094223 2168814
58561 2168814 2248738 2333857 2424132 2520352 2624279 2737315 2859260 2989118 3126995 3274500
58551 3274500 3433384 3604396 3787404 3981958 4187640 4404262 4631406 4867180 5107731
58542 5107731 5348660 5586409 5817199 6034906 6231299 6398545 6530650 6622954 6672193 6677803
58532 6677803 6642034 6568224 6459854 6321447 6158824 5977698 5782972 5579717 5373187 5166953
58522 5166953 4962469 4761558 4567827 4384162 4210246 4044435 3887230 3740787 3605576
58513 3605576 3479767 3362115 3253440 3154702 3065107 2982777 2906114 2833884 2765076 2699410 2637244
58502 2637244 2578498 2522397 2468641 2417968 2370903 2326803 2284876 2245390 2208882 2174517 2140283
58491B140283l5466l6551l6998l7380l7962l8185l7519l6234l5051l4380l4070
58480A740487l3639l2539l0472k7741k5175k3435k2388k1449k0429j9595j8942
58469A464683j7973j6409j4665j3255j2136j1061j0186r895j0153j0409j0045
58458A328496q890p500o984p979r684j0564j0243r912j0609j2037j3503j4814
58446A205777j5508j4528j2010j0186j0766j2217j1570q562n840n041m820l433
58434A091296j343j45l09j100j876k343k221j594j160j402j793j439k88P17N43
58419A075543j004k992l943l163j583q34j514k869l937m302l796k513j239r66
58405A040888j623k166k087j945k068j775m25J460K863L444L525L506L781M647
$$ plain form
58491 2140283 2104817 2068266 2031268 1993888 1955926 1917741 1880222 1843988 1808937 1774557 1740487
58480 1740487 1706848 1674309 1643837 1616096 1590921 1567486 1545098 1523649 1503220 1483625 1464683
58469 1464683 1446710 1430301 1415636 1402381 1390245 1379184 1368998 1359103 1348950 1338541 1328496
58458 1328496 1319606 1312106 1305122 1297143 1287459 1276895 1266652 1256740 1246131 1234094 1220591 1205777
58446 1205777 1190269 1175741 1163731 1153545 1142779 1130562 1118992 1110430 1104590 1099549 1094729 1091296
58434 1091296 1089953 1089808 1089499 1088399 1086523 1084180 1081959 1080365 1079205 1077803 1076010 1074571 1074283 1075000 1075543
58419 1075543 1074539 1071547 1067604 1064441 1062858 1062024 1060510 1057641 1053704 1049402 1045606 1043093 1041854 1040888
58405 1040888 1039265 1037099 1035012 1033067 1030999 1029224 1028799 1030259 1033122 1036566 1040091 1043597 1047378 1052025
58391A052025N716N966M894L225J886P93o46k183k723j784l20K18n77j746k052
58376A062692j134M52K015L193L917M451N335O558O756M383J6l573m433l590l251
58361A083787l985m817n240n442n093l634j589j47N90J478K658L443L929N092
58347A071030P061Q766R677J0510J1822J3235J4435J5743J7138J7868J7484J6322
58335A231091J4616J2262R765Q248P995P882O752M561K123N07N24J636J669r31
58321A308700m678o615o227n693o107n941m085j886p11L14K257L847L267J352
58307A277794P54K314M255M927M803N435P490J0130J1924J2270J2015J2397J3462
58294A379970J4172J4011J3474J2857J1885J0903J1005J2224J2937J2140J1151
$$ plain form
58391 1052025 1057741 1063707 1068601 1071826 1073712 1074505 1073859 1071676 1068953 1067169 1066849 1067067 1066490 1064744 1062692
58376 1062692 1061558 1062010 1064025 1067218 1071135 1075586 1080921 1087479 1094235 1098618 1098634 1095061 1090628 1087038 1083787
58361 1083787 1079802 1074985 1069745 1064303 1059210 1055576 1053987 1053840 1054430 1055908 1058566 1062009 1065938 1071030
58347 1071030 1078091 1086857 1096534 1107044 1118866 1132101 1146536 1162279 1179417 1197285 1214769 1231091
58335 1231091 1245707 1257969 1267734 1275982 1283977 1291859 1298611 1303172 1305295 1305802 1306326 1307962 1309631 1308700
58321 1308700 1304022 1297407 1291180 1285487 1279380 1273439 1269354 1267468 1266757 1267071 1269328 1273175 1276442 1277794
58307 1277794 1278548 1280862 1285117 1290044 1294847 1300282 1307772 1317902 1329826 1342096 1354111 1366508 1379970
58294 1379970 1394142 1408153 1421627 1434484 1446369 1457272 1468277 1480501 1493438 1505578 1516729
58283A516729J1805J3664J4406J2673R563P331P178Q328R065Q718Q353R174J0721
58270A647708J1590J1371J0714R943R155R349J1610J5188J8165K0122K2220K4689
58258A821824K6492K7659K9458L1649L2177L0650K9511L0493L2191L2707L2385
58247B157196L2201L1525K9515K7061K5506K4883K4974K6425K9092L1015L1033
58236B470426L0828L2391L4952L6615L7716M0045M3466M5761M5711M4640M4853
58225B907404M7496N1648N5000N6103N6334N8317O2204O5500O7140O9259P3595
58214C570000P8671Q2369Q5156Q8624R2757R6768J01036J06092J11152J15697
58204D528322J20973J28024J35672J42489J49231J57398J66775J76307J86116
$$ plain form
58283 1516729 1528534 1542198 1556604 1569277 1578840 1586171 1593349 1601677 1610742 1619460 1627813 1636987 1647708
58270 1647708 1659298 1670669 1681383 1691326 1700481 1709830 1721440 1736628 1754793 1774915 1797135 1821824
58258 1821824 1848316 1875975 1905433 1937082 1969259 1999909 2029420 2059913 2092104 2124811 2157196
58247 2157196 2189397 2220922 2250437 2277498 2303004 2327887 2352861 2379286 2408378 2439393 2470426
58236 2470426 2501254 2533645 2568597 2605212 2642928 2682973 2726439 2772200 2817911 2862551 2907404
58225 2907404 2954900 3006548 3061548 3117651 3173985 3232302 3294506 3360006 3427146 3496405 3570000
58214 3570000 3648671 3731040 3816196 3904820 3997577 4094345 4195381 4301473 4412625 4528322
58204 4528322 4649295 4777319 4912991 5055480 5204711 5362109 5528884 5705191 5891307
58195E891307J96905K08705K21575K35816K50214K62351K72204K83007K96826
58186H118910L11888L26280L41252L58393L76474L93976M12239M33119M55859
58177A1528390M79101N03573N30187N58110N87471O21118O60845P04929P52275
58168A6925999Q05285Q65016R27357R88393J050483J118871J195436J279895J373575
58159B6530310J477202J588034J703928J827483J962171K107956K264876K436551
58151D1898511K625593K830195L050435L293485L568480L882540M246659M677447
58143G0073345N186187N773790O443508P210732Q095915R122496J0329782J1764694
58135A34000449J3435313J5282227J7220968J9215755K1307465K3580898K6081574
$$ plain form
58195 5891307 6088212 6296917 6518492 6754308 7004522 7266873 7539077 7822084 8118910
58186 8118910 8430798 8757078 9098330 9456723 9833197 10227173 10639412 11072531 11528390
58177 11528390 12007491 12511064 13041251 13599361 14186832 14807950 15468795 16173724 16925999
58168 16925999 17731284 18596300 19523657 20512050 21562533 22681404 23876840 25156735 26530310
58159 26530310 28007512 29595546 31299474 33126957 35089128 37197084 39461960 41898511
58151 41898511 44524104 47354299 50404734 53698219 57266699 61149239 65395898 70073345
58143 70073345 75259532 81033322 87476830 94687562 102783477 111905973 122235755 134000449
58135 134000449 147435762 162717989 179938957 199154712 220462177 244043075 270124649
58128B70124649K8653468L0738570L1360820K9492866K4635676J7143608Q041716
58121D40191373j427574j0144286j7251759k2249485k5073325k6040755k5645477
58114C12358712k4363756k2586263k0618844j8673800j6869166j5260404j3861597
58107A80124882j2632640j1484583j0331786r134234p891441o640050n489963
58100A16520185m624905m199541m212722m498597m845382n112710n253911n274250
58092G8498167n194499n037913m825658m576285m308423m037852l769724l499974
58084D3247839l227163k958416k703161k467226k254339k066773j901368j749432
58076B3919961j603519j462126j327608j203127j092046r96194r13397q39483
$$ plain form
58128 270124649 298778117 329516687 360877507 390370373 415006049 432149657 440191373
58121 440191373 438763799 428619513 411367754 389118269 364044944 338004189 312358712
58114 312358712 287994956 265408693 244789849 226116049 209246883 193986479 180124882
58107 180124882 167492242 156007659 145675873 136541639 128650198 122010148 116520185
58100 116520185 111895280 107695739 103483017 98984420 94139038 89026328 83772417 78498167
58092 78498167 73303668 68265755 63440097 58863812 54555389 50517537 46747813 43247839
58084 43247839 40020676 37062260 34359099 31891873 29637534 27570761 25669393 23919961
58076 23919961 22316442 20854316 19526708 18323581 17231535 16235341 15321944 14482461
58068A4482461p72987p14970o64490o17776n72408n29209m89601m53835m22207
58059I244978l95475l73518l55392l40579l28465l17237l05272k92973k81327
58050F254740k69635k56859k44001k32708k22551k12014k01182j90993j81004
58041D243793j70579j61144j54348j48811j41652j32605j23811j16090j08345
58032B986408j00395r3578q8487q4373q0747p7586p4280p0336o6590o3892o1369
58021B124775n7937n4490n2336n0642m7967m5219m4192m4042m2401l9353l7201
58010A608995l6532l5637l3802l2137l1004k9506k7725k6713k6014k3978k0938
57999A285009j9213j9398j9279j7304j4640j2901j2098j1742j1936j2375j2129
$$ plain form
58068 14482461 13709474 12994504 12330014 11712238 11139830 10610621 10121020 9667185 9244978
58059 9244978 8849503 8475985 8120593 7780014 7451549 7134312 6829040 6536067 6254740
58050 6254740 5985105 5728246 5484245 5251537 5028986 4816972 4615790 4424797 4243793
58041 4243793 4073214 3912070 3757722 3608911 3467259 3334654 3210843 3094753 2986408
58032 2986408 2886013 2792435 2703948 2619575 2538828 2461242 2386962 2316626 2250036 2186144 2124775
58021 2124775 2066838 2012348 1960012 1909370 1861403 1816184 1771992 1727950 1685549 1646196 1608995
58010 1608995 1572463 1536826 1503024 1470887 1439883 1410377 1382652 1355939 1329925 1305947 1285009
57999 1285009 1265796 1246398 1227119 1209815 1195175 1182274 1170176 1158434 1146498 1134123 1121994
57988A121994j1184j0635j0723j0467r734r721j0762j1486j0970r937r124q147
57976I99104o801n771n290m537l149j811p73N78J886J444j317m481n987n986n691
57961I51418n198l825j776k10n5j485l939n996o120m361k669k792m399n842o143
57946H96608n587m972m920n601o586p197p176o743o033n094m350m262m450l911
57932H19726k392q90n99j857m107o186o718n126k477p48j063l036n465o970o329
57917G65763l363M86L246M137L542J827o28k551k523q53O39R36P50Q51P78k03
57901G72834j881l500m651n153m751l411j675m60o25k363m620n656m905l748l544
57886G21891l727l060j917j537j534l83J668K453J117o26j227j376k224l322l672
$$ plain form
57988 1121994 1110810 1100175 1089452 1078985 1069251 1059530 1048768 1037282 1026312 1016375 1007251 999104
57976 999104 992303 986532 981242 976705 973556 971745 970972 971550 973436 974880 973563 969082 963095 957109 951418
57961 951418 946220 942395 940619 940409 940354 938869 934930 928934 922814 918453 915784 912992 908593 902751 896608
57946 896608 891021 886049 881129 875528 868942 861745 854569 847826 841793 836699 832349 828087 823637 819726
57932 819726 817334 816444 815845 813988 809881 803695 796977 791851 789374 788626 787563 784527 779062 772092 765763
57917 765763 762400 762886 766132 770269 773811 775638 775010 772459 769936 769083 769722 770658 771408 772259 773037 772834
57901 772834 770953 767453 762802 757649 752898 749487 747812 747352 746727 744364 739744 734088 729183 725435 721891
57886 721891 718164 715104 713187 711650 710116 709733 711401 713854 714971 714345 713118 711742 709518 706196 702524
57871G02524l620m215n539o840p839q940j0497j2359j3695j3183j0351o917n490
57858E93039o440p459o849n648n418n508m278j959l10K53J250L665O389P766P721
57843E76214P521P855P904O599M395L151L988N775O462N464L832K310N86j336
57829F40720k416k077j427k036l970n949p054p550q018q355p837o103l833k193
57815E71902j503j007k64L4n88j088l19R67J143N54J358M290P405Q649Q140P142
57799F06815O234N395M666L844K551J203P23P63k58k516l926l160j938k653m868
57784F12875o136n468m170l594l844m674o079p649q474q088p014o217o367p375
57770E27726q267p922o380m984m835n723o923q200r397r968r731r330r232r116
$$ plain form
57871 702524 698904 694689 689150 682310 674471 665531 655034 642675 628980 615797 605446 598529 593039
57858 593039 586599 579140 572291 566643 561225 555717 551439 549480 549170 549423 550673 554338 560727 568493 576214
57843 576214 583735 591590 599494 606093 610488 613639 617627 623402 629864 635328 639160 641470 642056 640720
57829 640720 638304 636227 634800 632764 628794 622845 615791 608241 600223 591868 584031 577928 574095 571902
57815 571902 570399 569392 569128 569162 568574 567486 567167 568134 569277 569831 571189 575479 582884 591533 599673 606815
57799 606815 613049 618444 623110 626954 629505 630708 631431 632194 631936 629420 625494 622334 620396 617743 612875
57784 612875 606739 601271 597101 593507 589663 584989 578910 571261 562787 554699 547685 541468 535101 527726
57770 527726 519459 511537 505157 500173 495338 489615 482692 474492 465095 455127 445396 436066 426834 417718
57756D17718q880r184r942r576p121m111k806l263l842l900m087m285l251o22
57742C42848K380M603O037O791O294M251J651J59P13K769M594M707L442K696L604
57727C97539N176N957O042O175N744L666Q89p2J573L722M012K140q49m045o680
57712D30989q021q253q586r646j0464r840p975o094n008m781n233o115o927p094
57698C26952o275m543k578j400j224q00J141L883N396N169M882N805P065P373
57684C50846P065P104P269O891O580P363Q611Q682P667P419Q380Q387N878K777
57670D50919K357M935P628Q278P704P583P812P354O517O677Q019R143R151Q877
57656E52954R474J0860J2221J3238J4051J4679J5242J6244J7888J9488K0407K1092
$$ plain form
57756 417718 408838 399654 389712 380136 373015 368904 366098 362835 358993 355093 351006 346721 343470 342848
57742 342848 345228 349831 355868 362659 368953 373204 374855 375014 375727 378496 383090 387797 391239 393935 397539
57727 397539 402715 408672 414714 420889 426633 430299 431188 431116 432689 436411 440423 442563 441714 437669 430989
57712 430989 422968 414715 406129 396483 386019 376179 368204 362110 357102 352321 347088 340973 334046 326952
57698 326952 320677 316134 313556 312156 310932 310132 311273 315156 320552 325721 330603 336408 343473 350846
57684 350846 357911 365015 372284 379175 385755 393118 401729 410411 418078 425497 433877 442264 448142 450919
57670 450919 453276 458211 465839 474117 481821 489404 497216 504570 511087 517764 525783 534926 544077 552954
57656 552954 562428 573288 585509 598747 612798 627477 642719 658963 676851 696339 716746 737838
57644G37838K2355K4004K5235K6089K7514K9904L2585L4874L6766L8454M0076
57633A075694M2216M5760N0722N5839N9859O2919O6199P0641P6373Q3177R1123
57622A780522J00618J11795J23902J35786J47284J59688J74209J90419K06940
57613C131163K23237K39715K56172K71390K84020K92363K92763K79915K50216
57604E520954K04565J47636Q5383K3687l2316p9664j18384j49747j73960j90490
57594E237664k00175k05447k08130k08196k05199j99836j93161j84979j74253
57585C458288j61121j47547j35410j24520j13225j00909q9036p9266p1147o2629
57575B373478n2769m2889l4620k7621k0189j1630l027M376J0626J6566K2645K8806
$$ plain form
57644 737838 760193 784197 809432 835521 863035 892939 925524 960398 997164 1035618 1075694
57633 1075694 1117910 1163670 1214392 1270231 1330090 1393009 1459208 1529849 1606222 1689399 1780522
57622 1780522 1881140 1992935 2116837 2252623 2399907 2559595 2733804 2924223 3131163
57613 3131163 3354400 3594115 3850287 4121677 4405697 4698060 4990823 5270738 5520954
57604 5520954 5725519 5873155 5958538 5982225 5949909 5870245 5751861 5602114 5428154 5237664
57594 5237664 5037489 4832042 4623912 4415716 4210517 4010681 3817520 3632541 3458288
57585 3458288 3297167 3149620 3014210 2889690 2776465 2675556 2586520 2507254 2436107 2373478
57575 2373478 2320709 2277820 2243200 2215579 2195390 2183760 2180733 2185109 2195735 2212301 2234946 2263752
57563B263752L5191M2260N0255N8935O7931P7088Q6492R6358J06832J17557J27453
57552C130104J35520J41972J47996J53813J57524J56683J50649J40310J25529
57543D440100J04552P6781M4960J3106j7160m6760p5856j02173j23298j39254
57533D174998j51755j61650j68228j70791j69806j66457j61779j56492j51025
57524B717015j45300j38722j30891j22353j14411j07949j02408r6199q8374p9722
57514A590686p1892o5572o0068n4622m9459m5151m1618l8351l5220l2317k9358
57503A067058k6039k2936k0959j9775j7806j4378j0937r229q896q056n945l550
57491H98552j655L13K897N408P085Q473J0419J2473J3696J4577J6547J9607K2181
$$ plain form
57563 2263752 2298943 2341203 2391458 2450393 2518324 2595412 2681904 2778262 2885094 3002651 3130104
57552 3130104 3265624 3407596 3555592 3709405 3866929 4023612 4174261 4314571 4440100
57543 4440100 4544652 4621433 4666393 4679499 4662339 4615579 4539723 4437550 4314252 4174998
57533 4174998 4023243 3861593 3693365 3522574 3352768 3186311 3024532 2868040 2717015
57524 2717015 2571715 2432993 2302102 2179749 2065338 1957389 1854981 1758782 1670408 1590686
57514 1590686 1518794 1453222 1393154 1338532 1289073 1243922 1202304 1163953 1128733 1096416 1067058
57503 1067058 1041019 1018083 997124 977349 959543 945165 934228 924999 916103 908047 902102 898552
57491 898552 896897 897210 900107 905515 912600 921073 931492 943965 957661 972238 988785 1008392 1030573
57478A030573K3710K5753K9566L3930L6687L7692L8946M2177M7274N2899N7720
57467A456927O1258O4414O8970P5820Q3777R0857R6580J02088J08196J14302J19445
57456B442634J23325J25798J26133J23477J17693J09226R8249Q4374O7100M6388
57446C464397K2946j817k6243m9019o9426q7034j01293j11545j17554j20016j20327
57435B683069j19475j17262j12993j06976j00630r4943q9521q3589p7284p1207
57425A709189o5227n8594n1076m3361l6340l0471k5625k1020j5627r276l179J404
57413A350797M753Q230J2393J6614K0605K5222L1236L7935M3816M8449N3062N9121
57401A712233O6549P3841P9966Q5661R2273R9618J05940J10013J11990J11786
$$ plain form
57478 1030573 1054283 1080036 1109602 1143532 1180219 1217911 1256857 1299034 1346308 1399207 1456927
57467 1456927 1518185 1582599 1651569 1727389 1811166 1902023 1998603 2100691 2208887 2323189 2442634
57456 2442634 2565959 2691757 2817890 2941367 3059060 3168286 3266535 3350909 3418009 3464397
57446 3464397 3487343 3485526 3459283 3410264 3340838 3253804 3152511 3040966 2923412 2803396 2683069
57435 2683069 2563594 2446332 2333339 2226363 2125733 2030790 1941269 1857680 1780396 1709189
57425 1709189 1643962 1585368 1534292 1490931 1454591 1424120 1398495 1377475 1361848 1352572 1349393 1350797
57413 1350797 1355550 1363780 1376173 1392787 1413392 1438614 1469850 1507785 1551601 1600050 1653112 1712233
57401 1712233 1778782 1852623 1932589 2018250 2110523 2210141 2316081 2426094 2538084 2649870
57391B649870J07981R9393Q6682P1256N3286L2207Q584j5831l9539o1619q1088
57380B911182r7348j10920j22329j30569j34185j33677j31283j28415j24860j20352
57370A677244j15284j09741j03574r7608r2976q9028q3705p6530o9325o3554n8895
57359G17024n5060n2675n1209m8322m2954l7278l3759l1824k9418k6449k4475
57348B83601k3851k3411k2464k1201j9497j7199j5341j5204j6158j6069j4021
57337G9185j1253r325q701r085r795r693q084n971B093c937o914o553n398m485
57323b7287m065l949m228m832n048m217k647j417j331k261l267l364k480j571
57309g1964j537k217k912l546m605o036p013o921n937m546l118k081j886k410
$$ plain form
57391 2649870 2757851 2857244 2943926 3015182 3068468 3100675 3109259 3093428 3053889 2992270 2911182
57380 2911182 2813834 2702914 2580585 2450016 2315831 2182154 2050871 1922456 1797596 1677244
57370 1677244 1561960 1452219 1348645 1251037 1158061 1069033 985328 908798 839473 775919 717024
57359 717024 661964 609289 558080 509758 466804 429526 395767 363943 334525 308076 283601
57348 283601 259750 236339 213875 192674 173177 155978 140637 125433 109275 93206 79185
57337 79185 67932 58607 49906 40821 31026 21333 13249 7278 2093 -3937 -10851 -17404 -22802 -27287
57323 -27287 -31352 -35301 -39529 -44361 -49409 -53626 -56273 -57690 -59021 -61282 -64549 -67913 -70393 -71964
57309 -71964 -73501 -75718 -78630 -82176 -86781 -92817 -99830 -106751 -112688 -117234 -120352 -122433 -124319 -126729
57295a26729k677j679N27K566K827J043j126j575K7J990K730K426K167K275K292
57280a12916K092K022K218K504K785K900K487J664J421K470M047M753M294L542
57266g3717L204L424M384O142P970Q970R333R975i316B313J1774J2323J3695J5152
57252E5257J5931J6090J5766J4729J3153J1905J1436J1170J0644J0400J1060J2177
57240B09718J2909J3201J3498J3674J3245J2553J2758J4400J6613J8200J9073
57229C69842K0185K2099K4158K5369K5794K6523K8206L0202L1615L2695L4555
57218F71243L7668M1079M3192M3018M0865L8162L6348L5387L3608K9445K3237
57207A073252J6603J0384M039k815r303j4253j7610k0236k2569k4111k4319k3580
$$ plain form
57295 -126729 -129406 -131085 -130558 -127992 -125165 -124122 -125248 -126823 -126796 -124806 -122076 -119650 -117483 -115208 -112916
57280 -112916 -110824 -108802 -106584 -104080 -101295 -98395 -95908 -94244 -92823 -90353 -86306 -81553 -77259 -73717
57266 -73717 -70513 -67089 -62705 -56563 -48593 -39623 -30290 -20315 -9316 2313 14087 26410 40105 55257
57252 55257 71188 87278 103044 117773 130926 142831 154267 165437 176081 186481 197541 209718
57240 209718 222627 235828 249326 263000 276245 288798 301556 315956 332569 350769 369842
57229 369842 390027 412126 436284 461653 487447 513970 542176 572378 603993 636688 671243
57218 671243 708911 749990 793182 836200 877065 915227 951575 986962 1020570 1050015 1073252
57207 1073252 1089855 1100239 1104278 1101463 1092160 1077907 1060297 1040061 1017492 993381 969062 945482
57195I45482k2972k3135k3722k4058k3916k3269k1739j9080j6024j3580j1351
57184G22636p803k726J764L633L474L534M893O790Q279R264J0039J0946J2418
57171G87141J4626J7051J9058K0539K1357K0913J9287J8186J9284K1928K3860
57160A003230K4102K3777K4090K5031K6276K7926K9876L1582L2954L4514L6234
57149A319592L7320L7617L8346M0823M4991M9704N3923N7356O0307O3004O4917
57138A867900O5026O3311O1300O0168N8931N5777N0728M5465M0750L5805L0289
57127B435450K5125K1001J7736J5612J5596J7517J9669K1102K2891K6018K9424
57116B667141L1425L2022L2434L3041L3060L1982L0362K9344K9805L1552L3007
$$ plain form
57195 945482 922510 899375 875653 851595 827679 804410 782671 763591 747567 733987 722636
57184 722636 714833 712107 713871 717504 720978 724512 729405 736195 744474 753738 763777 774723 787141
57171 787141 801767 818818 837876 858415 879772 900685 919972 938158 957442 979370 1003230
57160 1003230 1027332 1051109 1075199 1100230 1126506 1154432 1184308 1215890 1248844 1283358 1319592
57149 1319592 1356912 1394529 1432875 1473698 1518689 1568393 1622316 1679672 1739979 1802983 1867900
57138 1867900 1932926 1996237 2057537 2117705 2176636 2232413 2283141 2328606 2369356 2405161 2435450
57127 2435450 2460575 2481576 2499312 2514924 2530520 2548037 2567706 2588808 2611699 2637717 2667141
57116 2667141 2698566 2730588 2763022 2796063 2829123 2861105 2891467 2920811 2950616 2982168 3015175
57105C015175L2239K8778K3916J9121J4984J1858J0383J0846J2938J6564K1957
57094C218759K8507L4627L9570M4412N0511N7547O3499O5912O3059N5014M4148
57083C765565L3472K4115J5252O574r45p154j3755k2202l2189m3393n6995p3856
57071C594489r2619j11467j30742j51895j74511j96359k16432k36289k58400k84474
57061A741301l15496l52104l94301B37926b55133n49185o10703o79091p56213
57052b850325q44079r44743j059943j190634j337697j504215j696343j920468
57044a3348447k180283k479293k826828l240044l739710m345080n070661n921554
57036d3151900o887914p947038r077146j0272258j1541749j2888658j4278300
$$ plain form
57105 3015175 3047414 3076192 3100108 3119229 3134213 3146071 3156454 3167300 3180238 3196802 3218759
57094 3218759 3247266 3281893 3321463 3365875 3416386 3473933 3537432 3603344 3666403 3721417 3765565
57083 3765565 3799037 3823152 3838404 3844978 3844033 3836879 3823124 3800922 3768733 3725340 3668345 3594489
57071 3594489 3501870 3390403 3259661 3107766 2933255 2736896 2520464 2284175 2025775 1741301
57061 1741301 1425805 1073701 679400 237926 -255133 -804318 -1415021 -2094112 -2850325
57052 -2850325 -3694404 -4639147 -5699090 -6889724 -8227421 -9731636 -11427979 -13348447
57044 -13348447 -15528730 -18008023 -20834851 -24074895 -27814605 -32159685 -37230346 -43151900
57036 -43151900 -50039814 -57986852 -67063998 -77336256 -88878005 -101766663 -116044963
57029a16044963j5620816j6789631j7674533j8233874j8499624j8522745j8295241
57022b39681427j7702531j6538838j4586951j1734145q065824l872961M40959
57015c11741718M493608Q017335J0884283J3089964J4720260J5899832J6726382
57008b27910054J7224851J7354066J7058176J6323293J5205821J3825273J2334472
57001a18584102J0886098R607933Q586122P850821P369183P058541O819898O571941
56993e3833565O266759N887585N440532M946338M431982L923374L441619L001546
56985a6493830K610527K268874J972931J718033J499057J310533J147959J008295
56977b957621Q88530P85012e89276B7007N47774M87131M33416L87028L47433L12651
$$ plain form
57029 -116044963 -131665779 -148455410 -166129943 -184363817 -202863441 -221386186 -239681427
57022 -239681427 -257383958 -273922796 -288509747 -300243892 -308309716 -312182677 -311741718
57015 -311741718 -307248110 -299230775 -288346492 -275256528 -260536268 -244636436 -227910054
57008 -227910054 -210685203 -193331137 -176272961 -159949668 -144743847 -130918574 -118584102
57001 -118584102 -107698004 -98090071 -89503949 -81653128 -74283945 -67225404 -60405506 -53833565
56993 -53833565 -47566806 -41679221 -36238689 -31292351 -26860369 -22936995 -19495376 -16493830
56985 -16493830 -13883303 -11614429 -9641498 -7923465 -6424408 -5113875 -3965916 -2957621
56977 -2957621 -2069091 -1284079 -589276 27007 574781 1061912 1495328 1882356 2229789 2542440
56967B542440K81733K55540K33880K14259J94973J77185J62222J48986J36048
56958D347266J24258J14917J07156R9595R3067Q9079Q6537Q2569P5876O7474N9284
56947E347078N3900N3809N7704N8607M8943K7031m130m3228r1225j44982j94894
56936E168613k31642k53207k63318k65192k59468k46997k30654k13631j97437
56927C007067j82140j67867j55294j44996j36934j30789j26365j23119j19702
56918A719861j14933j09226j03899r8903r2628q4629p6943p1537o7665o3167n7379
56907G78952n1241m5385l9780l4565k9591k3634j5780p344q08K954N018O367P062
56894E52225P001N840K517l211q982j1604j0858r555r498r494p954n436l443k289
$$ plain form
56967 2542440 2824173 3079713 3313593 3527852 3722825 3900010 4062232 4211218 4347266
56958 4347266 4471524 4586441 4693597 4793192 4886259 4975338 5061875 5144444 5220320 5287794 5347078
56947 5347078 5400978 5454787 5512491 5571098 5620041 5647072 5642942 5599714 5508489 5363507 5168613
56936 5168613 4936971 4683764 4420446 4155254 3895786 3648789 3418135 3204504 3007067
56927 3007067 2824927 2657060 2501766 2356770 2219836 2089047 1962682 1839563 1719861
56918 1719861 1604928 1495702 1391803 1292900 1200272 1115643 1038700 967163 899498 836331 778952
56907 778952 727711 682326 642546 607981 578390 554756 538976 531632 530824 533778 538796 545163 552225
56894 552225 559226 565066 567583 564372 555390 543786 532928 523373 513875 504381 496427 490991 487548 485259
56880D85259j387m84O14K503N386Q460J0957J3099J5340J7289J8115J7375J4914
56867F07440J0648N107m33n013q728j1930j4328j5396j5153j4061j2666j1704
56855E13783j1804j2552j2523j0929q680p175o571o029n152m179k960q03K443
56842D26869N781P905Q347P697O958O893P674Q859R730R958J0002J0733J2476
56829E39882J4560J5968J6348J6034J5228J3697J1303Q267M703M96m054q037j0804
56816F33591j2462j3164j2577j0597p919n166k088J561N052P593R767J2874J7084
56803F23549K1248K4426K6621K8058K8695K8384K6664K2554J5563O897j169p103
56791H44387j0644j1954j1441j0200r371q913p936o136l718j62N450J2625J9498
$$ plain form
56880 485259 483872 483388 484002 486505 491891 500351 511308 524407 539747 557036 575151 592526 607440
56867 607440 618088 623195 622762 617749 609021 597091 582763 567367 552214 538153 525487 513783
56855 513783 501979 489427 476904 465975 457295 450120 443549 437520 432368 428189 425229 424426 426869
56842 426869 432650 440555 448902 456599 463557 470450 478124 486983 496713 506671 516673 527406 539882
56829 539882 554442 570410 586758 602792 618020 631717 643020 651287 655990 656486 652432 644395 633591
56816 633591 621129 607965 595388 584791 576872 571706 569618 571179 576231 583824 593591 606465 623549
56803 623549 644797 669223 695844 723902 752597 780981 807645 830199 845762 852659 851490 844387
56791 844387 833743 821789 810348 800148 790777 781864 773928 767792 764074 763912 769362 781987 801485
56778H01485K5044K9951L4895L9363M2620M4431M4055M0030L1972K1576J0801
56767A166223K5j0949k1045k8435l2350l3376l2337k9834k6535k2955j9124j5067
56755H94241j1247p911m454j15N074J0578J6080K1029K4037K3759K0264J4685
56743A006020P726n54r581j7862k4109k8095l0140l0352k8821k6212k3636k1815
56731G72569k0539j9011j6651j3451r612n297r73K448M474N868P711R557R368
56718G26461N812m8n852j0278j3701j6891j9741k1383k1287j9957j8494j7413
56706E67228j6296j4870j3849j3858j4023j2907j0774r518r961j0706j0328r253
56694D20885q355p087m662k262k025l915n332m292j736J1kp95j094o49j64m28
$$ plain form
56778 801485 826529 856480 891375 930738 973358 1017789 1061844 1101874 1133846 1155422 1166223
56767 1166223 1166248 1155299 1134254 1105819 1073469 1040093 1007756 977922 951387 928432 909308 894241
56755 894241 882994 875083 870629 870514 875588 886166 902246 923275 947312 971071 991335 1006020
56743 1006020 1013746 1013192 1003611 985749 961640 933545 903405 873053 844232 818020 794384 772569
56731 772569 752030 733019 716368 702917 693305 688008 687035 689483 693957 699825 707536 717093 726461
56718 726461 732273 732225 726373 716095 702394 685503 665762 644379 623092 603135 584641 567228
56706 567228 550932 536062 522213 508355 494332 481425 470651 461133 451172 440466 430138 420885
56694 420885 412530 405443 400781 398519 396494 392579 387247 382955 381219 381230 381228 380433 379339 378690 378526 378098
56678C78098j582k972l676l268k129j123r03j395j799j311K2J369K025J954J408
56663C64718M75p01j658j976j653r19j9N30M8j408k662k596j431l26J05K01K95
56646C51023J39n24j419k103k559l090l707l895l136j634l43K2k22k83o1j03l81
56629C27724p5R43J390K84j230j019J184L311L595K656K283K963L594L373K908
56614C53884L065L543L351K438J916K432L220L345L128L394L808L351K295K226
56600C95396L622M918M759L969M040M720M607L568K888L034K952J945R64J209
56586D42591K329K923K332J165J24r63k781n403p827q804q107o697n585n061n163
56571C95073o199p975r152q509o744n807o311o841o215n203n039n340m731l007
$$ plain form
56678 378098 376516 373544 369868 366600 364471 363348 362445 361050 359251 357940 357962 359331 361356 363310 364718
56663 364718 365193 364492 362834 360858 359205 358286 358267 358797 358845 357437 354775 352179 350748 350422 350527 350728 351023
56646 351023 351162 350638 349219 347116 344557 341467 337760 333865 330729 329095 328752 328774 328552 328269 328208 328105 327724
56629 327724 327649 328592 329982 330266 329036 328017 329201 332512 336107 338763 341046 344009 347603 350976 353884
56614 353884 356949 360492 363843 366281 368197 370629 373849 377194 380322 383716 387524 390875 393170 395396
56600 395396 399018 403936 408695 412664 416704 421424 426031 429599 432487 435521 438473 440418 441382 442591
56586 442591 444920 447843 450175 451340 451464 450501 447720 442317 434490 425686 417579 410882 405297 400236 395073
56571 395073 388874 380899 371747 363238 356494 350687 344376 337535 331320 326117 321078 315738 311007 308000
56557C08000j321l89K16Q01Q08j17j205j430p05L45J281J845J561K77j074j167
56541C07726J27J566K068J711J124O29L71N88J232J782J917J931K073K016J536
56526C28397J107J154J260J001R46J812K879K614R06n62m79O11J489J891K299
56511C47325K838L130K924K333J656J228J175J273J427K196M044O066O586N384
56497C89585M248M597N598N632M759M396N024N552M988L552J908L44q53j025R6
56482D38401J694K539K301J646J097K93j272l187m407m505m041l500k665j499
56468D22895q06j105j503q15M95Q12k75j581k375l243m380m579k949n18R79J125
56452D02177O69J45l47n40l10j71o36j421j920j958j523n08N32K62j691l652l747
$$ plain form
56557 308000 306679 306290 306506 307307 308115 307998 306793 305363 304658 305003 306284 308129 309690 309967 308893 307726
56541 307726 307853 309419 311487 313198 314322 314951 315322 315910 317142 318924 320841 322772 324845 326861 328397
56526 328397 329504 330658 331918 332919 333865 335677 338556 341170 342076 341514 341035 341646 343135 345026 347325
56511 347325 350163 353293 356217 358550 360206 361434 362609 363882 365309 367505 371549 377615 384201 389585
56497 389585 393833 398430 404028 409660 414419 418815 423839 429391 434379 437931 439839 440183 439330 438305 438401
56482 438401 440095 442634 444935 446581 447678 447971 446699 443512 439105 434600 430559 427059 424394 422895
56468 422895 422089 420984 419481 418666 419161 419973 419698 418117 415742 412499 408119 403540 400591 400073 401052 402177
56452 402177 402846 402991 402644 402104 401794 401623 400987 399566 397646 395688 394165 393657 394189 394451 392760 389108 385361
56435C85361k297j075p74n54J47R39J492J861J689M61j267k090j559p08m82o25
56419C80519n25k17q3j18M7Q71K657N001O476N792L446J515J496L013M757N956
56403D20603O608O866O728O063M845L560L035L430L812L462L176M108N683O043
56389D88022M609K664J255O1j012r50N04J475O7k845m545l863k289j739k497l644
56373D75273m412m587m259l680l126k608j949j350j432k493l906m692m527l878
56359D28374l162k263j092k69n82j790k649k388j625j398j745j899j532r87m36
56344D04557L36J090R61l52j837k257j685j298j654j967j378l39Qk99J66K229
56328C96281M673N647N002M191M129M348M310M209M041L240J959J445K160K707
$$ plain form
56435 385361 383064 381989 381215 380661 380808 381747 383239 385100 386789 387250 385983 383893 382334 381626 381144 380519
56419 380519 379994 379777 379694 379576 379623 380494 383151 388152 394628 400420 403866 405381 406877 409890 414647 420603
56403 420603 427211 434077 440805 446868 451713 455273 458308 461738 465550 469012 472188 476296 481979 488022
56389 488022 492631 495295 496550 496611 495599 494649 495153 496628 496695 493850 489305 485442 483153 481414 478917 475273
56373 475273 470861 466274 462015 458335 455209 452601 450652 449302 447870 445377 441471 436779 432252 428374
56359 428374 425212 422949 421857 421588 421006 419216 416567 414179 412554 411156 409411 407512 405980 404993 404557
56344 404557 404893 405983 406944 406592 404755 402498 400813 399515 397861 395894 394516 394177 394185 393886 394052 396281
56328 396281 400954 406601 411603 415794 419923 424271 428581 432790 436831 440071 442030 443475 445635 448342
56314D48342J830L83j91k91j209k336j640J030L327L639L085L321M100M283M001
56299D71674M223M834M664L343J961J636K194K623K377J897J887K370K791L045
56285E11519L808N379O610N837K947j92j498m10J949L787L822K307R13J059K340
56270E50177L352L814M763O498P671P101N488M566N081O413P688Q529Q933R049
56256F39123R052Q994Q880Q909R323R976J0549J1110J1937J2669J2602J2029J2282
56243G77435J3862J5446J5600J4783J4548J5250J5753J5344J4666J4348J3778
56232I40813J2125J0039R276J0460J1998J1891J0328R717J1993J6345K0157K1822
56220A096964K2137K2940K5071K7966L0856L3667L6639L9651M2493M5608M9810
$$ plain form
56314 448342 450172 450555 450364 450073 448864 446528 444888 445918 449245 452884 455969 459290 463390 467673 471674
56299 471674 475897 480731 485395 488738 490699 492335 494529 497152 499529 501426 503313 505683 508474 511519
56285 511519 515327 520706 527316 533153 536100 535908 534410 534000 535949 539736 543558 545865 546778 547837 550177
56270 550177 553529 557343 562106 568604 576275 583376 588864 593430 598511 604924 612612 621141 630074 639123
56256 639123 648175 657169 666049 674958 684281 694257 704806 715916 727853 740522 753124 765153 777435
56243 777435 791297 806743 822343 837126 851674 866924 882677 898021 912687 927035 940813
56232 940813 952938 962977 972253 982713 994711 1006602 1016930 1026647 1038640 1054985 1075142 1096964
56220 1096964 1119101 1142041 1167112 1195078 1225934 1259601 1296240 1335891 1378384 1423992 1473802
56209A473802N5036O0173O4598O9156P4735Q0739Q6345R2550J01067J11337J20839
56198B390377J28866J37704J48962J60882J70833J78569J85049J89740J91518
56189C882500J91099J89941J87274J80732J69642J55347J38537J18734R6561P3965
56179E384332N1753K9145O386j4532l2581m8982o4613p8135q8080r5272j01645
56168D947776j07891j13576j18548j22814j25882j27589j29079j31736j35404
56159C835257j38511j39741j38991j36948j34307j31297j27720j23561j19283
56150B644898j15064j10195j04100r7642r2249q7884q3190p7517p1438o5295n8839
56139A681485n2654m8199m5826m4083m1635l8530l5046l0643k5020j9185j4736
$$ plain form
56209 1473802 1528838 1589011 1653609 1722765 1797500 1878239 1964584 2057134 2158201 2269538 2390377
56198 2390377 2519243 2656947 2805909 2966791 3137624 3316193 3501242 3690982 3882500
56189 3882500 4073599 4263540 4450814 4631546 4801188 4956535 5095072 5213806 5310367 5384332
56179 5384332 5436085 5465230 5471616 5457084 5424503 5375521 5310908 5232773 5144693 5049421 4947776
56168 4947776 4839885 4726309 4607761 4484947 4359065 4231476 4102397 3970661 3835257
56159 3835257 3696746 3557005 3418014 3281066 3146759 3015462 2887742 2764181 2644898
56150 2644898 2529834 2419639 2315539 2217897 2125648 2037764 1954574 1877057 1805619 1740324 1681485
56139 1681485 1628831 1580632 1534806 1490723 1449088 1410558 1375512 1344869 1319849 1300664 1285928
56128A285928j2630j2784j3938j3936j1592q326o516o095m704j448J667K847K976
56115A201449L767N229O418P266Q243R272J0269J1841J4455J7683K0943K4024
56103A340859K6456K7644K8164K9458L1580L2971L3113L3553L5329L7165L7614
56092A693906L7343L7918L9626M1804M4106M6350M8434N1302N6508O3948P1754
56081B232999P9419Q8958J01536J15066J26862J36812J45904J53280J56883J55828
56071C493547J50323J40606J27965J15541J05849R8218R0239Q0781P0014N7702
56061D530785M3444K7923J2308k878j7373l0874m4180n9154p6268r3875j10805
56050D179053j27376j42363j51863j53811j51179j47947j43932j36784j27048
$$ plain form
56128 1285928 1273298 1260514 1246576 1232640 1221048 1212722 1206206 1200111 1195407 1193959 1195626 1198473 1201449
56115 1201449 1205216 1210445 1216863 1224129 1232372 1241644 1251913 1263754 1278209 1295892 1316835 1340859
56103 1340859 1367315 1394959 1423123 1452581 1484161 1517132 1550245 1583798 1619127 1656292 1693906
56092 1693906 1731249 1769167 1808793 1850597 1894703 1941053 1989487 2040789 2097297 2161245 2232999
56081 2232999 2312418 2401376 2502912 2617978 2744840 2881652 3027556 3180836 3337719 3493547
56071 3493547 3643870 3784476 3912441 4027982 4133831 4232049 4322288 4403069 4473083 4530785
56061 4530785 4574229 4602152 4614460 4611582 4594209 4563335 4519155 4460001 4383733 4289858 4179053
56050 4179053 4051677 3909314 3757451 3603640 3452461 3304514 3160582 3023798 2896750
56041B896750j17590j09240j00605r1385q2545p3810o4245n4889m7744m2404l6618
56030B075675k9959k4086j9588j5368j1121p687n061k479m13O2m10j93O16P58
56016A960746O92J959L976M556L839M489P412J0168J0669R994J0380J2371J5013
56003B056264J7322J8753J9383K0217K2278K5237K7831K9481L0494L1119L1463
55992B329842L1876L2471L3068L4312L7501M2290M6270M8180M9589N1860N3787
55981B791046N4254N4777N6785N8793N9189N9587O2204O6082O9268P2553P7326
55970C481864Q1873Q3924Q5179Q9078R5598J02279J08706J15711J22036J26523
55960D492771J31931J41597J53755J64240J73276J84129J96470K07166K16646
$$ plain form
56041 2896750 2779160 2669920 2569315 2477930 2395385 2321575 2257330 2202441 2154697 2112293 2075675
56030 2075675 2045716 2021630 2002042 1986674 1975553 1967866 1962805 1960326 1959913 1959975 1959565 1959372 1959988 1960746
56016 1960746 1961438 1963397 1967373 1971929 1975768 1980257 1987669 1997837 2008506 2018500 2028880 2041251 2056264
56003 2056264 2073586 2092339 2111722 2131939 2154217 2179454 2207285 2236766 2267260 2298379 2329842
55992 2329842 2361718 2394189 2427257 2461569 2499070 2541360 2587630 2635810 2685399 2737259 2791046
55981 2791046 2845300 2900077 2956862 3015655 3074844 3134431 3196635 3262717 3331985 3404538 3481864
55970 3481864 3563737 3647661 3732840 3821918 3917516 4019795 4128501 4244212 4366248 4492771
55960 4492771 4624702 4766299 4920054 5084294 5257570 5441699 5638169 5845335 6061981
55951F061981K28137K41077K51674K59896K69617K81748K93625L05574L21311
55942H514640L40815L59255L74407L89263M06122M23937M42750M64873M90291
55933A2206353N16482N43916N76236O14277O55733P01144P53630Q11813Q69978
55924A8249562R26692R86934J054535J128995J210570J301439J400762J505493
55916B7764982J616990J739862J874294K017215K170866K341289K528579K728570
55908D4782647K944876L189757L473619L804446M196431M665630N216846N848233
55900G8122485O568510P395085Q338351R407572J0629590J2034711J3620013J5353330
55892A61469647J7219185J9231513K1391023K3644861K5847274K7647399K8368508
$$ plain form
55951 6061981 6290118 6531195 6782869 7042765 7312382 7594130 7887755 8193329 8514640
55942 8514640 8855455 9214710 9589117 9978380 10384502 10808439 11251189 11716062 12206353
55933 12206353 12722835 13266751 13842987 14457264 15112997 15814141 16567771 17379584 18249562
55924 18249562 19176254 20163188 21217723 22346718 23557288 24858727 26259489 27764982
55916 27764982 29381972 31121834 32996128 35013343 37184209 39525498 42054077 44782647
55908 44782647 47727523 50917280 54390899 58195345 62391776 67057406 72274252 78122485
55900 78122485 84690995 92086080 100424431 109832003 120461593 132496304 146116317 161469647
55892 161469647 178688832 197920345 219311368 242956229 268803503 296450902 324819410
55885C24819410K7127190K3283781J6900263Q779548P7304q122751j4995038k0013455
55877C57856252k3011438k4205913k4064521k3083810k1651969k0037521j8414185
55870B03386895j6874888j5460899j4199598j3107480j2167547j1333341j0560910
55863A09682232r821504r088389q337548p568099o804900o075161n394130m773171
55855E1819330m223962l748359l335991k976870k667278k401416k168510j961890
55847B8335054j781964j627264j490990j368839j261978j169602j086170j008418
55839A7539829r38048q75236q16240p59411p07265o60683o17062n75572n38416
55830A1051896n05628m74501m45096m20345l99648l78558l55853l34877l16768
$$ plain form
55885 324819410 351946600 375230381 392130644 400910192 400987496 392864745 377869707 357856252
55877 357856252 334844814 310638901 286574380 263490570 241838601 221801080 203386895
55870 203386895 186512007 171051108 156851510 143744030 131576483 120243142 109682232
55863 109682232 99860728 90772339 82434791 74866692 68061792 61986631 56592501 51819330
55855 51819330 47595368 43847009 40511018 37534148 34866870 32465454 30296944 28335054
55847 28335054 26553090 24925826 23434836 22065997 20804019 19634417 18548247 17539829
55839 17539829 16601781 15726545 14910305 14150894 13443629 12782946 12165884 11590312 11051896
55830 11051896 10546268 10071767 9626671 9206326 8806678 8428120 8072267 7737390 7420622
55821G420622k98640k79928k64206k52708k42008k30242k19983k12629k05359
55812E214919j96130j86705j78355j69283j58813j49565j42955j36653j28841
55803C767619j21179j15368j10728j07078j06049j07411j07915j05932j03616
55794B782343j02455j00482r5972r0315q5029p9434p3430o9023o6741o3954n9036
55783A896472n3937n0371m6884m2254l8415l7056l6266l3658l0172k7827k5994
55772A473638k2955j9245j6478j4567j2743j1795j2572j3600j2817j0729r636
55761A316501j0474j2379j4539j6757j8759k0459k2254k4033k4729k3749k1946
55750A106423k0490j9787j9900k0605k0712j9129j6903j6188j6771j6126j3529
$$ plain form
55821 7420622 7121982 6842054 6577848 6325140 6083132 5852890 5632907 5420278 5214919
55812 5214919 5018789 4832084 4653729 4484446 4325633 4176068 4033113 3896460 3767619
55803 3767619 3646440 3531072 3420344 3313266 3207217 3099806 2991891 2885959 2782343
55794 2782343 2679888 2579406 2483434 2393119 2308090 2228656 2155226 2086203 2019462 1955508 1896472
55783 1896472 1842535 1792164 1745280 1703026 1664611 1627555 1591289 1557631 1527459 1499632 1473638
55772 1473638 1450683 1431438 1414960 1400393 1387650 1375855 1363283 1349683 1336866 1326137 1316501
55761 1316501 1306027 1293648 1279109 1262352 1243593 1223134 1200880 1176847 1152118 1128369 1106423
55750 1106423 1085933 1066146 1046246 1025641 1004929 985800 968897 952709 935938 919812 906283
55739I06283j1337j1002j0686q589n961m714m280l136j505k47J141L081L999K288
55725H55335q89l040l520l294k584r42R37J605O52j393m320p833j0591j1426j1074
55710G97623j1178j1962j2296j1638j0510r281p776o087m934n177p361j1091j4574
55697F73758j5702j4379j2825j2944j4326j5481j5856j5591j4540j2781j1302
55686E18031j0989j1487j1908j1877j1265r824q009p046p234p166n736l882l105
55673D08503l184k689j250Nm2j422l295m552m610l986l728m077m350m218m088
55658C63017m147m144m276m894n286m378k833k496l406l567k335j466j791j462
55644C16536P69L011L088J786R18J02j873m013m362l277k726k957k558j376q85
$$ plain form
55739 906283 894946 883944 873258 864669 858708 853994 849714 846578 845073 844826 845967 849048 853047 855335
55725 855335 854446 851406 847886 844592 842008 841066 842003 843608 844260 842867 838547 830714 820123 808697 797623
55710 797623 786445 774483 762187 750549 740039 730758 722982 716895 711961 706784 699423 688332 673758
55697 673758 658056 643677 630852 617908 603582 588101 572245 556654 542114 529333 518031
55686 518031 507042 495555 483647 471770 460505 450681 442672 435626 428392 421226 415490 411608 408503
55673 408503 405319 402630 401380 401385 401343 399921 396626 392074 387464 383478 379750 375673 371323 367105 363017
55658 363017 358870 354726 350450 345556 340270 335892 333059 330563 327157 323590 321255 319789 317998 316536
55644 316536 317305 320316 323404 325190 326108 326210 324337 320324 315962 312685 309959 307002 304444 303068 302183
55629C02183j635k477k369j202Q58L206M427L838K920L419M717N209N434P155
55615C35683R611R681O305K137k1l35n38j377k565l742m351l677j913k82M81Q06
55599C45903J099J034N44L84J024J915K344K352K333K431K634K866K877K628K566
55584C74934K766K203J45k090k386q67L2j134l079l980l836l776m268n027n758
55569C43879o106n699m911m861n932p163p677p805q147q582r015j0040j1689j2459
55555B33793j0916p831n343m294l791l243l352m498n428m444j514J569L017K566
55541A86291J241J16m62p16r72j465k291l220l661l236k361j870k008k166j869
55526A61351j534j867k710l099k575j890k086l190m303m802m728l964j892J400
$$ plain form
55629 302183 300548 298071 295702 294500 295358 298564 302991 306829 309749 313168 317885 323094 328528 335683
55615 335683 345294 354975 361280 363417 363396 363061 362523 361146 358581 354839 350488 346811 344898 344616 345097 345903
55599 345903 347002 348036 348580 348964 349988 351903 354247 356599 358932 361363 363997 366863 369740 372368 374934
55584 374934 377700 379903 380048 377958 375572 374705 374737 373603 370524 366544 362708 358932 354664 349637 343879
55569 343879 337773 332074 327163 322302 316370 309207 301530 293725 285578 276996 267981 257941 246252 233793
55555 233793 222877 215046 209703 205409 201618 198375 195023 190525 185097 180653 179139 180708 183725 186291
55541 186291 187532 187648 187186 186470 185498 184033 181742 178522 174861 171625 169264 167394 165386 163220 161351
55526 161351 159817 157950 155240 152141 149566 147676 145590 142400 138097 133295 128567 124603 122711 124111
55512A24111M230M687K785L87j044j673k157k415k097j413q22m35k72n14r56r06
55496A21496j82L98J86l24m13l22o38j210j620k075k718k709j342L14M53q87j854
55479A06553j429n15j7N51J785K979L114K363J677J358J040O70N96P79O66N6m49
55462A21777n2J272K641L076K443J465P80L16k13o04n00j85l03q35r83k53R56
55445A30798J963K465K320J277n73k350k938k100q96p59j964l147k706q09M92
55430A21073n61l430n866o135m330j984q05j358k359j860K43J573J26k912m619
55415H6796m099l120k963k625q73J539K809K210K43k335m550n131l760j912j310
55400F0919j792j850j024l66n56q77n28J42M26M41O97J050R04J94o08j263j847
$$ plain form
55512 124111 128341 133028 135813 136200 135156 133483 131326 128911 126814 125401 124579 124144 123872 123358 122402 121496
55496 121496 121314 121712 121898 121574 121161 120839 120201 118991 117371 115296 112578 109869 108527 108841 109294 108407 106553
55479 106553 105124 104609 104592 105143 106928 109907 113021 115384 117061 118419 119459 120129 120725 121504 122170 122226 121777
55462 121777 121725 122997 125638 128714 131157 132622 133402 133718 133505 132901 132401 132216 131913 131078 130095 129842 130798
55445 130798 132761 135226 137546 138823 138250 135900 132962 130862 129966 129207 127243 124096 121390 120581 121073
55430 121073 120512 117082 111216 105081 100751 98767 97962 96604 94245 92385 92628 94201 94327 91415 86796
55415 86796 82697 79577 76614 73989 73116 74655 77464 79674 79917 77582 73032 67901 64141 62229 60919
55400 60919 59127 57277 56253 55887 55331 54454 53926 54068 54494 54935 55632 56682 57586 57780 57172 55909 54062
55383E4062k076j422q2Q53P26J78L43J491K856L458K756J018m56j40J861L241
55367F8667J901j351l660l586k359j591j331r47n65m65j22J012K280K431J178
55352F1492m79j160q4K080L062R81k826m491k338O10N21k129l644k376k49P61
55336D9731R33J068R18M08M19J122J155k62j769j702m31M29K31m89j197j556j052
55319D7956L01J358J094J36l6Q65J688J521N81n11j314j426o27N20R74M84Q2R42
55301E4588K947M619M375J844j808m661n334l729r06J525K196Q31j359k542j889
55286E0697k40R73J190R38Q66R46N88n55j961k518j699l03L77J9n36m58K39J056
55268D9619J602J693J371R98Q81P34K1j155k082k350k060j125O36K533L228K368
$$ plain form
55383 54062 51986 50564 50482 51335 52061 52239 52582 54073 56929 60387 63143 64161 63705 63565 65426 68667
55367 68667 70568 69217 65557 61971 59612 58021 56690 55743 55178 54713 54591 55603 57883 60314 61492
55352 61492 61013 59853 59769 61849 64911 65892 63066 58575 56237 56847 57368 55239 51595 49219 48970 49731
55336 49731 50664 51732 52650 53058 53477 54599 55754 55492 53723 52021 51590 52019 52250 51761 50564 49008 47956
55319 47956 48257 49615 50709 50845 50809 51674 53362 54883 55464 54953 53639 52213 51586 52106 53080 53564 53646 54588
55301 54588 57535 62154 66529 68373 66565 61904 56570 52841 51935 53460 55656 56487 55128 52586 50697
55286 50697 50457 51430 52620 53558 54424 55370 55958 55403 53442 50924 49225 48922 49299 49318 48782 48324 48563 49619
55268 49619 51221 52914 54285 55283 56164 56898 56919 55764 53682 51332 49272 48147 48783 51316 54544 56912
55252E6912J030L9j045k501l225k171j66J037J053Q58Q47M00o03j274j070n44
55236D9577k94j61M5j5m22n19Q8P14O27K64M40Q05K64j068j676p66N41Q77N76
55217D9897Q25J545J489L74n15l03J64j86q01l04J348K676K507J045p69k106k457
55200E4429j860j074p43m19P57K393K930J657l43j716k295k470k097j043q7j07
55184D7912p19p40Q3P36M36m10q91o27K81J693L256M109L455J629Km78l07n10
55166E8910j150j523j614k132k758j890Q21K992K264k17j100N64K189J554k83
55151E6627r95j97P67J060R36P73Q37J434K300K324J014l41j17J370K175J106
55135G1073j124k992l536k785j606j013j098r52j06O21M19j40j39K1o47j774j962
$$ plain form
55252 56912 57942 57981 56936 54435 51210 49039 48873 49910 50963 51821 52668 53068 52465 51191 50121 49577
55236 49577 49283 49122 49167 49152 48730 48211 48299 49013 49640 49904 50344 51149 51413 50345 48669 47903 48444 49321 49897
55217 49897 50722 52267 53756 54130 53615 53312 53476 53290 52489 52185 53533 56209 58716 59761 58992 56886 54429
55200 54429 52569 51495 50752 50333 51090 53483 56413 58070 57727 56011 53716 51246 49149 48106 48019 47912
55184 47912 47193 46453 46536 47272 47708 47298 46407 45780 46061 47754 51010 55119 58574 60203 60205 59727 59420 58910
55166 58910 57760 56237 54623 52491 49733 47843 48664 51656 53920 53703 52603 53167 55356 56910 56627
55151 56627 55632 55435 56202 57262 58198 58971 59808 61242 63542 65866 66880 66539 66422 67792 69967 71073
55135 71073 69949 66957 63421 60636 59030 58017 56919 55967 55861 56482 56901 56761 56622 56643 55996 54222 52260
55118E2260q94K56N70K46k47n97k67R19J782R38q74j436l74J27j171k346j155
55101D7737J515K962K390J268N24m33j791k453j797q84j039k064k573j643L70
55086D2089K197K621J552L65N58J913K771K381J959K667L548K775N18j014n42
55071F6358O47P63L7L8J034J475L21j254j233P20K849L333K142P60N65J730L437
55054H3722M701M968M370L564L183L206K989K138J130P01Q02O90M0o61r75j159
55038A13409j514j772j653j572k011k520k119o66Q89J578J226K42o86p83J80J414
55022A03642J854J418Q50N00J30o6N09J513J568J94j265j441q02o43r53o57L26
55005A06677O09p19k621l118j482R73K186J380k90j198j114j047j453j537o92
$$ plain form
55118 52260 51366 51622 52192 52438 52191 51594 51327 52246 54028 54966 54092 52656 52282 52409 51238 48892 47737
55101 47737 49252 52214 54604 55872 56396 55963 54172 51719 49922 49038 47999 45935 43362 41719 42089
55086 42089 44286 46907 48459 48824 49382 51295 54066 56447 58406 61073 64621 67396 67914 66900 66358
55071 66358 67005 67768 67805 67843 68877 70352 70673 69419 68186 68906 71755 75088 77230 77990 78555 80285 83722
55054 83722 88423 93391 97761 101325 104508 107714 110703 112841 113971 114672 115474 116164 116204 115543 114568 113409
55038 113409 111895 110123 108470 106898 104887 102367 100248 99582 100471 102049 103275 103517 102831 102048 102228 103642
55022 103642 105496 106914 107764 108264 108394 108328 108837 110350 111918 112112 110847 109406 108604 107961 107008 106351 106677
55005 106677 107286 106567 103946 100828 99346 100319 102505 103885 103595 102397 101283 100236 98783 97246 96554
54990I6554L95Q20R27J635K790L220K375R61k9k38J27O47Q33M97K9NM90J048J287
54971A14373J078N23M3K25J109J922K021J742J778K008J690O01o18j157o59N71
54955A27250J533J123n29j803j450j85N13O49J358K610K876J499q1k41O76J064
54939A36862K78o91n90N31J255K54k034l485k563k35J137N98o45j253j337j706
54923A26376k611l740m584m325k323O57K576K326J065N82J084J616J904K405K804
54908A25812K059K25j075o71O53J472J740K427L514L783K835K120K975M542M877
54893A57288L802L133L844M547L776K493K854N130P452Q462Q610Q678Q572Q232
54879B36873Q459R849J1628J2447J1917J0678R382Q202O948M994J568l225p841
$$ plain form
54990 96554 96949 97769 98696 100331 103121 106341 108716 109677 109648 109410 109537 110184 111017 111514 111543 111548 112038 113086 114373
54971 114373 115451 115974 116017 116242 117351 119273 121294 123036 124814 126822 128512 129113 128495 127338 126679 127250
54955 127250 128783 129906 129377 127574 126124 125939 126452 127101 128459 131069 133945 135444 135363 135122 135798 136862
54939 136862 137140 136449 135859 136390 137645 137899 135865 132380 129817 129582 130719 131317 130672 129419 128082 126376
54923 126376 123765 120025 115441 111116 108793 109450 112026 114352 115417 115999 117083 118699 120603 123008 125812
54908 125812 127871 128096 127021 126350 127003 128475 130215 132642 136156 139939 142774 144894 147869 152411 157288
54893 157288 161090 164223 168067 172614 176390 178883 181737 186867 194319 202781 211391 220069 228641 236873
54879 236873 245332 255181 266809 279256 291173 301851 311233 319435 326383 331377 332945 329720 321879
54866C21879j0554j1154j0870j0688j0457r787r047q990r611j0035r539q383p317
54853A95447o569n699m450l124j896m13J384K596K335J095L18O68J587K580M020
54838A89879O301Q900J0768J1299J0728R946R919J0698J0989R473O523L765J752
54825C00940p08m482q425j0655j0708r615q529q175r015j0778j2098j1718j0087
54812A85947q846q752q870q016o202m306k851j591k31P19J43k361n413o700n282
54797A17388k554n66R4K12L84N18O19R72J385J114o4j298j642j231j062j739k771
54780A09759l160k553j677j427j644j313j63O15j8j180r34J043K770K355J93j835
54764A00831k622k453j846q49M02J340J638J757K337L242L641K962J493J32k72
$$ plain form
54866 321879 311325 300171 289301 278613 268156 258369 249322 240332 230721 220686 211147 202764 195447
54853 195447 188878 183179 178729 175605 173709 173296 174680 177276 179611 180706 181024 181692 183279 185859 189879
54838 189879 196180 205080 215848 227147 237875 247821 257740 268438 279427 288900 295423 299188 300940
54825 300940 300232 295750 287325 276670 265962 256347 247818 239643 230628 219850 207752 196034 185947
54812 185947 177101 168349 159479 151463 145261 140955 138104 136513 136282 137001 137144 134783 129370 122670 117388
54797 117388 114834 114268 114362 114574 114958 115476 116095 117067 118452 119566 119502 118204 116562 115331 114269 112530 109759
54780 109759 106599 104046 102369 100942 99298 97985 97822 98437 98419 97239 96305 97348 100118 102473 102666 100831
54764 100831 98209 95756 93910 93061 93463 94803 96441 98198 100535 103777 107418 110380 111873 112005 111733
54749A11733N16J843K542K013J025J062K666M714N521M474K430Q14M29J003J630
54734A44415J921K546M303O697Q216Q230P840Q407R956J1686J3179J4238J4314
54721B55948J3352J2620J3268J4278J3344R838N502K020p00l256n291o187o284
54708C18452o455p093q105r210r736q868o793m858l995l660k872j551j91R19J417
54693B47401P19p88j211R75M844P949R043Q994R283J0623J2899J5484J7495J8370
54679C62080J8241J7420J5900J3831J1843J0064P458L158j976o185q955j1082
54667D31797j2994j4355j5284j6447j7595j7454j5608j3452j2507j2652j2725
54656B70724j2067j0758q989p181o317p184r134j0360r567p173m586k701j372
$$ plain form
54749 111733 112249 114092 116634 118647 119672 120734 123400 128114 133635 138109 140539 141353 141782 142785 144415
54734 144415 146336 148882 153185 159882 168098 176328 184168 192575 202531 214217 227396 241634 255948
54721 255948 269300 281920 295188 309466 322810 332648 338150 340170 339470 336214 330923 324736 318452
54708 318452 311997 304904 296799 287589 277853 268985 262192 257334 253339 249679 246807 245256 245065 245984 247401
54693 247401 248120 247332 246121 247096 251940 259889 268932 277926 287209 297832 310731 326215 343710 362080
54679 362080 380321 397741 413641 427472 439315 449379 456837 459995 458019 451834 442879 431797
54667 431797 418803 404448 389164 372717 355122 337668 322060 308608 296101 283449 270724
54656 270724 258657 247899 238910 231729 225412 218228 209094 198734 189167 181994 177408 174707 173335
54643A73335l37j4q65k234k749k076j469j954k725k191j67K007L160L132K157
54628A67010N54q70j302j020j112j855k357k091j616j272l28J668L614M078L194
54613A66295K202J546P40M8Q13L525O588P920P288O251O021O218N849M739L580
54598B29623L000L036L339L370K550P73j128j830n95K139N224P463Q046O941N037
54583B76988L512K940L320M683O926R168J0274J0309J0608J2076J4352J6769J8962
54570D00887K0033J8620J4865J0975Q613O696L291j409n611q596j0919j2526j2828
54557D32091j2472j2874j3836j3694j2190j1074j1233j1349j0450r711j0237j0765
54545B92206r409o660m759m684n405n832o007o229o284n857n066m375m216m600
$$ plain form
54643 173335 172998 172984 172119 169885 167136 165060 163591 161637 158912 156721 156554 158561 161721 164853 167010
54628 167010 167564 166694 165392 164372 163260 161405 159048 156957 155341 154069 153741 155409 159023 163101 166295
54613 166295 168497 170043 170783 170831 171644 175169 181757 189677 196965 203216 209237 215455 221304 226043 229623
54598 229623 232623 235659 238998 242368 244918 245691 244563 242733 242138 244277 249501 256964 265010 271951 276988
54583 276988 280500 283440 286760 291443 298369 307537 317811 328120 338728 350804 365156 381925 400887
54570 400887 420920 439540 454405 465380 473993 480689 483980 482571 476960 468364 457445 444919 432091
54557 432091 419619 406745 392909 379215 367025 355951 344718 333369 322919 313208 302971 292206
54545 292206 282797 276137 271378 266694 261289 255457 249450 243221 236937 231080 226014 221639 217423 212823
54531B12823m916m473l426k677k577k533k207k215k973l727l636l108l148l916
54517A67291m814n410n445m565l096k399l262m401l921j921k03L34M19M89j21
54502A28975j536k511k161j306r83o96N27K086K365J270O67J874L755M114K375
54487A38815M8j147q10N35K307L868M304L200J539Q62J388J785J173N44J389L537
54471A63337N363N977O138O761P460P254O239N721O581Q052Q507P321N546M498
54457B54755M167L531K212R42J33j027l232n488o138n401n566p977j0883j1342
54443B08686q855n905m809n163n014l660k125j239n71L28Q33J29j366k489k810
54428A65970k788k681k289j705j380j269q19j4L91M8m09l52K9L59Q08J503J944
$$ plain form
54531 212823 207907 203434 200008 197331 194754 192221 190014 187799 184826 181099 177463 174355 171207 167291
54517 167291 162477 157067 151622 147057 143961 141562 138300 133899 129978 128057 127854 128188 128607 129096 128975
54502 128975 127439 124928 122767 121461 120478 119782 120309 122395 124760 126030 126697 128571 132326 136440 138815
54487 138815 138863 137716 136906 137441 139748 143616 147920 151120 152659 153521 154909 156694 157867 158411 159800 163337
54471 163337 168700 174677 180815 187576 195036 202290 208529 214250 220831 228883 237390 244711 250257 254755
54457 254755 258922 262453 264665 265607 265740 264713 261481 255993 249855 244454 238888 230911 220028 208686
54443 208686 199831 193926 189117 183954 178940 175280 173155 171916 171345 171673 172506 172635 171269 168780 165970
54428 165970 163182 160501 158212 156507 155127 153858 153039 153025 153416 153464 153055 152703 152732 153091 153899 155402 157346
54411A57346J691J152R60J036R20O94Q04J291J829K300K675K617J892R70N25M95
54395A79197L28q0l85o14j079j500j126K9R01P01j41q29j340k106k886k796j531
54378A64743K0P79P54P87J173J092k42k366l980m333l655k520j481j095j464j730
54362A46482r98K33N95Ko2J120K223J923R39Q51J775K632K959L046K762J795R17
54345A69194J497L590N630O171N106L307K004K182L560M414L643K548L183N219
54331B21248O326N481L958K687R20j677l659l896l347l327l395k618j700j975
54317B15026l123l742l714m105m929m898l631k415k147k009j088j49n98k209l101
54302A73168k065r4Q33J08r82j003j15M86L38K09P19J429J653J493J415J396J134
$$ plain form
54411 157346 159037 160189 161149 162185 163105 163799 164603 165894 167723 170023 172698 175315 177207 178177 178702 179197
54395 179197 179525 179445 179060 178446 177367 175867 174741 174770 175671 176372 176231 175402 174062 171956 169070 166274 164743
54378 164743 164763 165542 166296 167083 168256 169348 169106 166740 162760 158427 154772 152252 150771 149676 148212 146482
54362 146482 145484 145717 146312 146314 146252 147372 149595 151518 152457 153308 155083 157715 160674 163720 166482 168277 169194
54345 169194 170691 174281 179911 186082 191188 194495 196499 198681 202241 206655 210298 212846 216029 221248
54331 221248 227574 233055 237013 239700 240620 238943 235284 231388 228041 224714 221319 218701 217001 215026
54317 215026 211903 208161 204447 200342 195413 190515 186884 184469 182322 180313 179225 179076 178478 176269 173168
54302 173168 171103 171009 171842 171950 170968 169965 169850 170336 170674 170883 171602 173031 174684 176177 177592 178988 180122
54285A80122Q36J090J998K905K965J793j28j498j175N01J838J738R84R41J575
54270A96485J623M75j207k619l643m326m351l501k204j251j137j760k548l001
54256A67035l217l712m505m773l844k206q85j41N16J149J087j08j896l228l386
54241A37886k517j650k015l696n110m533k085L98J459J194M21m22j218j778j953
54226A14381j769j236l34P05J462J723J408L87j112k158k033j284r96j220j172
54211A06752q17q39r60K2K079L480L220K378K032J491M2j034j88J650K232J394
54195A22934J146K398L716L695K751J914J280M56n62j609k626l310l357l190l433
54180A22203l535k289L1J618J790J923K860L167J585l74l27J358K110J016q1M29
$$ plain form
54285 180122 180958 182048 184046 186951 189916 191709 191581 190083 188908 189409 191247 192985 193969 194910 196485
54270 196485 198108 198583 197376 194757 191114 186788 182437 178936 176732 175481 174344 172584 170036 167035
54256 167035 163818 160106 155601 150828 146984 144778 143893 143752 144268 145417 146504 146396 144500 141272 137886
54241 137886 135369 133719 131704 128008 122898 118365 116280 116678 118137 119331 119752 119330 118112 116334 114381
54226 114381 112612 111376 111042 111747 113209 114932 116340 116727 115615 113457 111424 110140 109144 107924 106752
54211 106752 105935 105096 104136 104158 106237 109717 112937 115315 117347 118838 118880 117846 117658 119308 121540 122934
54195 122934 124080 126478 130194 133889 136640 138554 139834 140290 139728 138119 135493 132183 128826 125636 122203
54180 122203 118668 116379 116410 118028 119818 121741 124601 127768 129353 128979 128652 130010 132120 133136 133055 133484
54164A33484J769K371K066J729J640J303L63r25k016k453k210j769j657j825j866
54149A30004j624j124j30J465K925L276K697K353K654K665J629O8j127j836k191
54134A41704j901r60l77j120k641l485l095k224j683j544j515j369r07k47n4q12
54118A17770j843j824m28J143J582Q35j20l17N34J833K352J318n33j559j153l50
54102A19240j96m73o72j240k621l747l146j334m70j188j548l3J946K054M86m71
54086A06587R5O69k9j232j678j456j231r04k58P2m03p66N4J405J771J250J308
54069A05254K148K141M67j411j753o89N43J297J440O72q54k053k253k316l203
54054I9430m154l713k094q51m42K05J551K479J983N38q44j752j977j065P29J936
$$ plain form
54164 133484 135253 137624 139690 141419 143059 144362 144725 143800 141784 139331 137121 135352 133695 131870 130004
54149 130004 128380 127256 127126 128591 131516 134792 137489 139842 142496 145161 146790 146858 145731 143895 141704
54134 141704 139803 138843 138466 137346 134705 131220 128125 125901 124218 122674 121159 119790 118883 118636 118582 117770
54118 117770 115927 114103 113675 114818 116400 117235 117115 116798 117332 119165 121517 122835 122302 120743 119590 119240
54102 119240 119044 118571 117899 116659 114038 110291 107145 105811 105341 104153 102605 102572 104518 106572 107058 106587
54086 106587 106682 107351 107322 106090 104412 102956 101725 100821 100563 100635 100232 99466 99520 100925 102696 103946 105254
54069 105254 107402 109543 110010 108599 106846 106157 106700 107997 109437 110109 109255 107202 104949 102633 99430
54054 99430 95276 91563 89469 88618 88176 88381 89932 92411 94394 94932 94088 92336 90359 89294 90023 91959
54038I1959J377j96r74l09Q38J522J914K498K910K294N81j160j809j282k66Q10
54022A00707K010L262M181M713N147N125L610O00j989k337j071k46m41m97M0K32
54006A23046j55J10J387J955O35q98k68J998L135J921p5r96o21N06K137L737M228
53989A41782L221J763J098J411K287L651N435O827O819N401L677K843L292M517
53975A94024N659O314O908P944R041R267Q583Q049Q143P881O373M571M242N597
53961B92596P038P197O238N024M084L610L577L379K181J31j481j773j315j097
53947C29389j222j359j804k917l973l866k957k921m432o147o576o009n755o258
53933B73193o884p118o907o047m320k347j337j584j938j341k54J2r26k101k389
$$ plain form
54038 91959 93336 93140 92166 91857 92695 94217 96131 98629 101539 103833 104414 103254 101445 100163 99897 100707
54022 100707 102717 105979 110160 114873 120020 125145 128755 129355 127366 125029 123958 123712 123271 122774 122814 123046
54006 123046 122891 123001 124388 126343 126978 126080 125812 127810 130945 132866 132791 131795 131174 131680 133817 137554 141782
53989 141782 145003 146766 147864 149275 151562 155213 160648 167475 174294 179695 183372 186215 189507 194024
53975 194024 199683 205997 212905 220849 229890 239157 247740 255789 263932 271813 278186 282757 286999 292596
53961 292596 299634 306831 313069 318093 322177 325787 329364 332743 334924 335055 333574 331801 330486 329389
53947 329389 328167 326808 325004 322087 318114 314248 311291 308370 303938 297791 291215 285206 279451 273193
53933 273193 266309 259191 252284 246237 241917 239570 238233 236649 234711 233370 233116 233128 232202 230101 227712
53918B27712j535k1J452K152J595J04j298j967k365l200m073l755j942M9Q03L42
53902B14053l67r09j498j862j254K34J248P65n39j059j83J049J168j40j620j565
53886B07521N01L287N154N820O082O187N520M087L166L823N662P632R209J0064
53872B83715R551P647N661M805M608L896K784K277K404K314K074K655L929M423
53858C42743L593K801L372M870O061O472O234N477M671M712N835P125P710P607
53844D19283P007N853M826N275P174Q337P032M218J836%k311m625n263m052k730
53829D51860k554l237m366o049p792q565q607r512j1636j2969j1810r255p750
53816C47758q019q816q968q396p472o641o525p244p736o784m762l429l833n174
$$ plain form
53918 227712 226177 226156 227608 229760 231355 231459 230161 228194 225829 222629 218556 214801 212859 212908 213711 214053
53902 214053 213686 212777 211279 209417 208163 208397 209645 210410 209871 208812 208629 209678 210846 210706 209086 207521
53886 207521 208022 211309 216463 222283 228365 234552 240072 244159 247325 251148 256810 264442 273651 283715
53872 283715 293266 300913 306574 311379 315987 319883 322667 324944 327348 329662 331736 334391 338320 342743
53858 342743 346336 349137 352509 357379 363440 369912 376146 381623 386294 391006 396841 403966 411676 419283
53844 419283 426290 432143 436969 442244 449418 457755 464787 469005 470841 470841 468530 463905 458642 454590 451860
53829 451860 449306 446069 441703 435654 427862 419297 410690 401178 389542 376573 364763 355508 347758
53816 347758 339739 330923 321955 313559 306087 299446 292921 285677 277941 271157 266395 262966 259133 253959
53802B53959n954n505m163k656j801k236l816n433n935n274m522m694n658o226
53788A90086n348l269j397q54j265j363o14K33M10J98J82N3q62j990j707L37K174
53771A75004J782k33j459q79J87M51M21J008J760J762J364J589K143J648j17j704
53755A84727k004j446o20R21L507N927O511N243L767L404M062M942N343M842L554
53740B32680K404K383L275L872L723L884N375P593Q945Q676P359N913M872M501
53726C05455M755N067M765L947L395L464L616L191K130P92l57o88J83J437J389
53711C42541n29k714l267k321j554j844k692l671m900n902n670m430l896m905
53697B94246o001n577m253l708l966l553k089r98j367k634l821m873n978o567
$$ plain form
53802 253959 248005 242500 238337 235681 233880 231644 227828 222395 216460 211186 206664 201970 196312 190086
53788 190086 184738 181469 180072 179218 177953 176590 175976 176209 176619 176817 176999 177052 176190 174200 172493 172830 175004
53771 175004 176786 176553 175094 174215 174402 174853 175274 176282 178042 179804 181168 182757 184900 186548 186431 184727
53755 184727 182723 181277 180657 181578 185085 191012 197523 202766 206533 209937 213999 218941 224284 229126 232680
53740 232680 235084 237467 240742 244614 248337 252221 257596 265189 274134 282810 290169 296082 300954 305455
53726 305455 310210 315277 320042 323989 327384 330848 334464 337655 339785 340577 340220 339532 339715 341152 342541
53711 342541 342012 339298 336031 333710 332156 330312 327620 323949 319049 313147 307477 303047 299151 294246
53697 294246 288245 282668 278415 274707 270741 267188 265099 264101 262734 260100 256279 251406 245428 238861
53683B38861n944m455l206k692k349j397J37J334J233q7j340j242J03J278J067
53668B21301l96j896k162p28J642L246K801Q68m76K43K361L975L986K922J972
53653B39659J690J782J887K249L288M507M443K357k75r55R50L419M260L606L208
53638B76075L847M534M194L136K503K746L159K866J941J400K002L349M418M842
53624C21012M997M720K980m46l634m107j681J326K901L275L637L986L356J631
53610C43953j02r94j269j318r16J76J409J902J410L01j042k193k404j292K44O76
53594C38541l67j638j867j075J41J666L478M742M331K147o53k710l276k397r09
53579C40154rq5j80P77K436L529L540K952K148J268R86J949L253L072J328K16
$$ plain form
53683 238861 232917 228462 225256 222564 220215 218818 218955 220289 221522 221435 220095 218853 218956 220234 221301
53668 221301 220905 219009 216847 216119 217761 221007 223808 224676 224200 224443 226804 230779 234765 237687 239659
53653 239659 241349 243131 245018 247267 250555 255062 259505 261862 261587 260632 261582 265001 269261 272867 276075
53638 276075 279922 284456 288650 291786 294289 297035 300194 303060 305001 306401 308403 311752 316170 321012
53624 321012 326009 330729 333709 333263 329629 325522 323841 325167 328068 331343 334980 338966 342322 343953
53610 343953 343851 342857 341588 340270 339354 339530 340939 342841 344251 344552 343510 341317 338913 337621 337865 338541
53594 338541 338174 336536 334669 333594 333735 335401 338879 343621 347952 350099 349446 346736 343460 341063 340154
53579 340154 340145 340060 339880 340657 343093 346622 350162 353114 355262 356530 357516 359465 362718 365790 367118 367334
53563C67334J257L206M075L860L772L895L487L001L708N416O427O076N515N529
53549D26558N323M338L727M675O382P156O871O816P412P548O407M816M298N366
53535E07693P241Q793R482R485R136Q267O534M492L683M792O237N766L456J789
53521E96846K391L947M164K724J201P01Q78J008P99J12j042j988j756k43J611
53506F11353K986L772L957L336K252J685K104K779K728J777M15o68o41Q64K673
53491F41372K760Q98m98N65K785L373J957P33J023J884K445L462N545P526P960
53476F83790P120O256N757N418N727P362R650J0936J0729J0421J1444J3574J5313
53463H03497J5577J4557J3422J3426J5090J7859K0511K2114K2728K3257K4519
$$ plain form
53563 367334 368591 371797 375872 379732 383504 387399 390886 393887 397595 403011 409438 415514 421029 426558
53549 426558 431881 436219 439946 444621 451003 458159 465030 471846 479258 486806 493213 498029 502327 507693
53535 507693 514934 523727 533209 542694 551830 560097 566631 571123 574806 579598 585835 591601 595057 596846
53521 596846 599237 603184 607348 610072 611273 611974 612852 613860 614659 614771 613729 611741 609985 609742 611353
53506 611353 614339 618111 622068 625404 627656 629341 631445 634224 636952 638729 639144 638476 637835 638699 641372
53491 641372 644132 645030 644532 645097 647882 651255 653212 653945 654968 656852 659297 662759 668304 675830 683790
53476 683790 690910 697166 702923 708341 714068 721430 731080 742016 752745 763166 774610 788184 803497
53463 803497 819074 833631 847053 860479 875569 893428 913939 936053 958781 982038 1006557
53452A006557K6334K7678K7974K8011K9087L1217L2936L3101L2422L2586L4215
53441A342118L6205L7130L6945L7144L9201M2872M6259M7707M7295M6170M4952
53430A803998M3643M2597M2375M2648M2479M1965M2206M3238M3558M2471M1395
53419B272573M1540M1707M0221L7976L7345L8432L8626L6214L2534K9866K8702
53408B675736K7894K6241K3175J8945J4955J2974J3108J3288J1539Q059M309Q26
53396B851049k873o825j0291j2874j4924j6830j8664k0584k2833k5126k6814k7881
53384B644530k9227l1640l4814l7638l9167l9206l8322l7438l7063l6720l5571
53373B247724l3661l2033l1252l0393k8180k4755k1570j9654j8638j7541j5862
$$ plain form
53452 1006557 1032891 1060569 1088543 1116554 1145641 1176858 1209794 1242895 1275317 1307903 1342118
53441 1342118 1378323 1415453 1452398 1489542 1528743 1571615 1617874 1665581 1712876 1759046 1803998
53430 1803998 1847641 1890238 1932613 1975261 2017740 2059705 2101911 2145149 2188707 2231178 2272573
53419 2272573 2314113 2355820 2396041 2434017 2471362 2509794 2548420 2584634 2617168 2647034 2675736
53408 2675736 2703630 2729871 2753046 2771991 2786946 2799920 2813028 2826316 2837855 2845914 2850223 2851049
53396 2851049 2848176 2841351 2831060 2818186 2803262 2786432 2767768 2747184 2724351 2699225 2672411 2644530
53384 2644530 2615303 2583663 2548849 2511211 2472044 2432838 2394516 2357078 2320015 2283295 2247724
53373 2247724 2214063 2182030 2150778 2120385 2092205 2067450 2045880 2026226 2007588 1990047 1974185
53362A974185j3689j1369r233p221m696j262K192M211M916O334R844J4263J7575
53349A986050J9659K1822K4300K6133K7448K9865L3999L8285M1164M2991M4841
53338B336557M6755M8475N0727N4264N8296O1441O3756O6415O9687P2744P5311
53327C004428P8019Q0903Q3007Q3879Q4361Q5392Q6956Q8577Q9943R0560Q9725
53316C945750Q7495Q5008Q3088Q1118P7995P3808O9737O6348O2722N7543N0862
53305D741474M4253L9119L4985L0003K3237J5723Q783K058n739j4513k2567k8817
53293D867999l4059l9646m5898n2281n8216o3157o6728o9570p3177p8015q2364
53282D204888q4083q3140q1496q0715q0806q1256q1950q2568q2086p9745p6144
$$ plain form
53362 1974185 1960496 1949127 1939894 1932673 1927977 1926715 1928907 1933118 1938034 1944368 1954212 1968475 1986050
53349 1986050 2005709 2027531 2051831 2077964 2105412 2135277 2169276 2207561 2248725 2291716 2336557
53338 2336557 2383312 2431787 2482514 2536778 2595074 2656515 2720271 2786686 2856373 2929117 3004428
53327 3004428 3082447 3163350 3246357 3330236 3414597 3499989 3586945 3675522 3765465 3856025 3945750
53316 3945750 4033245 4118253 4201341 4282459 4360454 4434262 4503999 4570347 4633069 4690612 4741474
53305 4741474 4785727 4824846 4859831 4889834 4913071 4928794 4937577 4939635 4933896 4919383 4896816 4867999
53293 4867999 4833940 4794294 4748396 4696115 4637899 4574742 4508014 4438444 4365267 4287252 4204888
53282 4204888 4120805 4037665 3956169 3875454 3794648 3713392 3631442 3548874 3466788 3387043 3310899
53271C310899p2769p0392o8528o6343o3675o1038n8920n7278n5566n3113m9672
53260B633605m5755m2276l9701l7702l5861l4269l3056l1612k9120k5840k3063
53249B255350k1509k0517j9131j7216j4990j2282r070o165m452l674k699p72K043
53236B124916N191P801R070R331J0166J2645J5908J8551K0798K3951K8066L1714
53224B318108L3953L5066L5478L5466L5938L7688L9612L9517L7217L5037L4437
53213B717517L3988L1830K8402K5317K2864K0267J7404J4746J2281R818P627N615
53201B947676K702j689o329r742j2307j5290j8585k1092k2830k4889k7582l0389
53189B759654l3420l7156m0792m2748m2977m3066m3840m4587m4909m5418m6047
$$ plain form
53271 3310899 3238130 3167738 3099210 3032867 2969192 2908154 2849234 2791956 2736390 2683277 2633605
53260 2633605 2587850 2545574 2505873 2468171 2432310 2398041 2364985 2333373 2304253 2278413 2255350
53249 2255350 2233841 2213324 2194193 2176977 2161987 2149705 2140635 2134470 2130018 2126344 2123645 2122873 2124916
53236 2124916 2130107 2137908 2146978 2156309 2166475 2179120 2195028 2213579 2234377 2258328 2286394 2318108
53224 2318108 2352061 2387127 2422605 2458071 2494009 2531697 2571309 2610826 2648043 2683080 2717517
53213 2717517 2751505 2783335 2811737 2837054 2859918 2880185 2897589 2912335 2924616 2934434 2942061 2947676
53201 2947676 2950378 2948689 2942360 2932618 2920311 2905021 2886436 2865344 2842514 2817625 2790043 2759654
53189 2759654 2726234 2689078 2648286 2605538 2562561 2519495 2475655 2431068 2386159 2340741 2294694
53178B294694m5539m3503m1319m0072l9133l7874l7077l7340l7414l5937l3697
53167A865789l2436l2168l1571l0522l0148l0369k9405k6342k2611k0150j9344
53156A560723j9539k0434k1840k2900k2829k2096k1755k1785k1259k0167j9803
53145A326316k0708k1445k0392j8230j7240j8327j9988k0529k0151k0083k0554
53134A108669k0620j9656j8162j7141j7305j8711k0608k1720k1345k0005j8672
53123H94724j7588j6540j5831j5981j6596j6599j5714j4736j4199j3796j3438
53112G23706j3715j4707j5319j4607j3055j1747j0927j0273r996j0631j1883j2706
53100E74140j2459j1332r711p924o580o385p272q222q289p466o510o136o429o785
$$ plain form
53178 2294694 2249155 2205652 2164333 2124261 2085128 2047254 2010177 1972837 1935423 1899486 1865789
53167 1865789 1833353 1801185 1769614 1739092 1708944 1678575 1649170 1622828 1600217 1580067 1560723
53156 1560723 1541184 1520750 1498910 1476010 1453181 1431085 1409330 1387545 1366286 1346119 1326316
53145 1326316 1305608 1284163 1263771 1245541 1228301 1209974 1189986 1169457 1149306 1129223 1108669
53134 1108669 1088049 1068393 1050231 1033090 1015785 997074 976466 954746 933401 913396 894724
53123 894724 877136 860596 844765 828784 812188 795589 779875 765139 750940 737144 723706
53112 723706 709991 695284 679965 665358 652303 640556 629629 619356 609360 598729 586846 574140
53100 574140 561681 550349 540638 532714 526134 519749 512477 504255 495966 488500 481990 475854 469425 462640
53086D62640o486n484m509m125m014l666l383l815m599m461l040j766k228m183
53072D06881n869o061n059l756k621j808j516j548j076L40J682J351p17k727l290
53057C74206l159l852n253n876n235m459m314m042k959j936k137l075l307k574
53043C22028j890j649j035L29J450J269N1j216k099k762l251l528l859m401m624
53028B94813l777j938JJ274J760J586R21L02M77J604K894L471L277K888K676K561
53012C14790K393K184J985J788J542J096K52q44j582j595j349j533j921j683r34
52997C14589j031k728m899n916n620m971m238k999j753j872l504m864m490l110
52983B62594k323k394k452k300k597l479m226m300l836l079k208j720j986k398
$$ plain form
53086 462640 456154 450670 446161 442036 438022 434356 430973 427158 422559 418098 415058 413292 411064 406881
53072 406881 401012 394951 389892 386136 383515 381707 380191 378643 377567 377907 379589 380940 380223 377496 374206
53057 374206 371047 367195 361942 356066 350831 346372 342058 338016 335057 333121 330984 327909 324602 322028
53043 322028 320138 318489 317454 317783 319233 320502 320553 319337 317238 314476 311225 307697 303838 299437 294813
53028 294813 291036 289098 289099 290373 292133 293719 294640 294942 295419 297023 299917 303388 306665 309553 312229 314790
53012 314790 317183 319367 321352 323140 324682 325778 326030 325186 323604 322009 320660 319127 317206 315523 314589
52997 314589 313558 310830 305931 300015 294395 289424 285186 282187 280434 278562 275058 270194 265704 262594
52983 262594 260271 257877 255425 253125 250528 247049 242823 238523 234687 231608 229400 227680 225694 223296
52969B23296j911n72L64R9q45j631k007j970j512j161j645k597k660j492m34l95
52953B02927m23M24J119L19j023q10Q63J706N50j316k418k648k106n31J202J114
52937A98949r22k071k21K691L233J226m32k40K29o06j989k394j643l45J274K853
52921A99592L266J859k79j403j016M4R65J513J652J400R74M93j63q17q60k32J36
52904B07124l44q40l89M20M10LP45K578L476K392Q98Q48J749J885J069O44J178
52887B23846J778J836K116L498N469O447N334K552j12p97P61K915L925L860L981
52872B67409M499M283L039K338L504N483O004M431K275J150J303K145L137L833
52858C14833L819L061J940Q01j42m82J31J254J796J179j9q42r29n25k4J91q1p18
$$ plain form
52969 223296 221385 220813 221177 221276 220431 218800 216793 214823 213311 212150 210505 207908 205248 203756 203322 202927
52953 202927 202504 202928 204047 204366 203343 202533 203396 205102 205652 204336 201918 199270 197164 196633 197835 198949
52937 198949 198027 195956 195735 198426 201659 202885 202453 202213 202442 201836 199847 197453 195810 195465 196739 199592
52921 199592 202858 204717 204438 203035 202019 202063 203028 204541 206193 207593 208567 209060 208897 208080 207220 206988 207124
52904 207124 206780 205940 205551 205971 206381 206384 207129 209707 213183 215575 216473 217321 219070 220955 222024 222668 223846
52887 223846 225624 227460 229576 233074 238543 244990 250324 252876 252764 251967 252728 255643 259568 263428 267409
52872 267409 271908 276191 279230 281568 285072 290555 296559 300990 303265 304415 305718 307863 311000 314833
52858 314833 318652 321713 323653 324454 324312 323830 323961 325215 327011 328190 328171 327329 326400 325875 325851 326042 325961 325243
52840C25243j463k335l302l724k972j636j076j435j248K27J503Q19j288k717k589
52825C02007j861j398r69l03K24L73M84P02O16O6m03k64M26J460K630L305K683
52808C09778R22q72k096l243m493m798l302r15O01P42N01P69J315J325L98j001
52792B95631j696p94J161K487K365J924K558L838M128K918J214k76j904l605m108
52777C05841k548q0J222P59k32n34k19J62O23J343J759J061m48j445j342j079
52761C04843j574k213j904r66n74n90L04K047K734J457k6J22R87N28j097j889
52745C02189j256o43p41l29J368K972K813J189l73j189j506j365p52m93j550l389
52729B96945m182l050j272p24j705k935l422l638m556o067o983o515n187m066
$$ plain form
52840 325243 323780 321445 318143 314419 311447 309811 308735 307300 306052 306279 307782 308601 307313 304596 302007
52825 302007 300146 298748 297779 297476 297700 298073 298557 299259 299875 299941 299538 299274 299700 301160 303790 307095 309778
52808 309778 310700 309828 307732 304489 299996 295198 291896 290981 291582 292324 292825 293594 294909 296234 296632 295631
52792 295631 293935 293141 294302 296789 299154 301078 303636 307474 311602 314520 315734 315458 313554 309949 305841
52777 305841 303293 303213 304435 305194 304962 304428 304209 304371 304994 306337 308096 309157 308709 307264 305922 304843
52761 304843 303269 301056 299152 298186 297612 297022 297326 299373 302107 303564 303538 303660 304647 305175 304078 302189
52745 302189 300933 300290 299549 299220 300588 303560 306373 307562 307189 306000 304494 303129 302377 301884 300334 296945
52729 296945 292763 289713 288441 287717 286012 283077 279655 276017 271461 265394 258411 251896 246709 242643
52715B42643l595l639m140n069n900n838m659k954j524r30j366k445l294l368
52701A93922l046k877k628j909j330j857l127l664l001k211k007j714q24j85n49
52686A62993j120q66m39j271l229m525l972k126k62P62O47k89j126j315j559k727
52670A39576l992l434q81J331J222l24j010k03P56R00P52R27R27P9j078j287k45
52653A34016Q94Q73l00j518j897j515r65o13m77n76r37j230q31M18J737K042J114
52636A30235j42o93m21pk0m37r32j239j127l00J295L107M211M019K811J477O84
52619A42521L23o4m23j15J008J895J362l20j658j781j205n29N28K058L007K409
52603A49016J054O04J207J407M87l29M48K662M904O045N856M655L029J557L78
$$ plain form
52715 242643 239048 235409 231269 226200 220300 214462 209803 206849 205325 204395 203029 200584 197290 193922
52701 193922 190876 187999 185371 183462 182132 180275 177148 173484 170483 168272 166265 164551 163727 163542 162993
52686 162993 161873 161007 160568 159297 156068 151543 147571 145445 145183 145945 146592 146303 145177 143862 142303 139576
52670 139576 135584 132150 131269 132600 133822 133498 132488 132285 133041 133941 134693 135620 136547 136626 135548 134261 134016
52653 134016 134910 135783 135483 133965 132068 130553 129588 128975 128498 127922 126985 125755 124924 125342 127079 129121 130235
52636 130235 130093 129400 128979 128972 128952 128515 127583 126344 125217 124917 126212 129319 133530 137549 140360 141837 142521
52619 142521 142844 142780 142357 142242 143250 145145 146507 146187 144529 142748 141543 141014 141542 143600 146607 149016
52603 149016 150070 150674 151881 153288 153775 153446 153894 156556 161460 167505 173361 178016 181045 182602 182980
52588A82980p01j507j468o25mm38j472k037j821j333j003r23j217j948k607k373
52572A61503j019P53J884J674J88j634k552k288j994k833m115l880j568Q18J001
52557A45938p32j987j402j98k01j311j840r06O43J565J526Q15k40j064q67L27
52541A40066J374J494J381J978K793K587J357K47k81p63j207p81O27J851K044
52526A54767J623J158N46n7K58J793L369L786L223K391J320nq20n90P3O06J571
52509A75012L181L869K210n09j620o28O42J231K073L555M394L845L044K993K821
52494B06113J470k57q15j98M11N59O94R02R22J106J976K960K898J883J179J106
52478B22909M48j301k468j204J828M060M044K639J339O70N66J146K289L157K968
$$ plain form
52588 182980 182279 180772 179304 178679 178675 178237 176765 174728 172907 171574 170571 169648 168431 166483 163876 161503
52572 161503 160484 161237 163121 164795 164983 163349 160797 158509 156515 153682 149567 145687 144119 144937 145938
52557 145938 145206 143219 141817 141619 141418 140107 138267 137361 138004 139569 141095 141910 141670 140606 139739 140066
52541 140066 141440 142934 144315 146293 149086 151673 153030 153277 152996 152233 151026 150245 150872 152723 154767
52526 154767 156390 157548 158094 158037 158295 160088 163457 167243 170466 172857 174177 174172 173352 172762 172835 173441 175012
52509 175012 178193 182062 184272 183763 182143 181515 182157 183388 185461 189016 193410 197255 200299 203292 206113
52494 206113 207583 207326 206511 206313 206724 207283 207977 208879 209801 210907 212883 215843 218741 220624 221803 222909
52478 222909 223357 222056 219588 218384 220212 224272 228316 230955 232294 232964 233530 234676 236965 240122 243090
52463B43090J917P38k08p88o31K15O37m17k277l172k615j874j837j835j170m90
52447B29283o41j097q10J50Q24Q16L82m54j722k716k461j018O15J726K217J945
52431B27039Q16m32o59J89Q08J53j296k138j467L74K083K444J537P34J094K123
52415B33402K675K616K579K507J723L98l17L2N07K51l16l17L19J037J535J902
52399B50533K234K518K705K744K753K959L111K224j86k824l607k148k45L90no3
52383B63093R10K475L670L596J963l60j862j842j014m89p54j720k966l683l265
52368B57752k312k155k921l060j482Q04K065K061J787J638J066r1j097j332r88
52353B51735n52j51K80O61Q40Q31Q59J141J653K152K473K685K801K570J913J327
$$ plain form
52463 243090 245007 245745 245537 244749 244118 244333 244970 244553 242276 239104 236489 234615 232778 230943 229773 229283
52447 229283 228642 227545 226735 226885 227709 228525 228907 228453 226731 224015 221554 220536 221151 222877 225094 227039
52431 227039 227855 227423 226764 226953 227761 227914 226618 224480 223013 223387 225470 227914 229451 230185 231279 233402
52415 233402 236077 238693 241272 243779 245502 245900 245583 245615 246122 246373 246057 245740 246059 247096 248631 250533
52399 250533 252767 255285 257990 260734 263487 266446 269557 271781 271595 268771 265164 263016 262771 263161 263156 263093
52383 263093 264003 266478 270148 273744 275707 275347 273485 271643 270629 270140 269386 267666 264700 261017 257752
52368 257752 255440 253285 250364 247304 245822 246626 248691 250752 252539 254177 255243 255152 254055 252723 251735
52353 251735 251183 251032 251312 251973 252813 253644 254503 255644 257297 259449 261922 264607 267408 269978 271891 273218
52337B73218J328J766K236K901L962M607L773K020J226J938K404J129r08j732
52323B99868j130n49p67j020l73J019K158K107P88o09m80J348L099L163K208K129
52307C12959L250L891K852J137O35J798L322L769K968J903J546J991K630K997
$$ plain form
52337 273218 274546 276312 278548 281449 285411 290018 293791 295811 297037 298975 301379 302508 301600 299868
52323 299868 298738 298189 297422 296402 296029 297048 299206 301313 302101 301492 301012 302360 305459 308622 310830 312959
52307 312959 316209 320100 322952 324089 324724 326522 329844 333613 336581 338484 340030 342021 344651 347648
$$ [...]
##END NTUPLES=NMR SPECTRUM
##END=
