
##TITLE=AC1086_CCIN01_5835837_6RdfhfLT20
##JCAMPDX= 6.0         $$ Bruker NMR JCAMP-DX V2.0
##DATA TYPE= NMR SPECTRUM
##DATA CLASS= NTUPLES
##ORIGIN= BRUKER
##OWNER= Administrator
$$ 1.72 TOPSPIN		Version 2.1
$$ 2012-04-16 19:09:31.281 -0500  Administrator@TOPSPIN
$$ Compression mode = diff/dup
##.OBSERVE FREQUENCY= 400.13188235
##.OBSERVE NUCLEUS= ^1H
##.ACQUISITION MODE= SIMULTANEOUS (DQD)
##.ACQUISITION SCHEME= undefined
##.AVERAGES= 8
##.DIGITISER RES= 22
##SPECTROMETER/DATA SYSTEM= spect
##.PULSE SEQUENCE= zg30
##.SOLVENT NAME= COFFEE_meoh
##.SHIFT REFERENCE= INTERNAL, COFFEE_meoh, 1, 14.98061
##AUDIT TRAIL= $$ (NUMBER, WHEN, WHO, WHERE, PROCESS, VERSION, WHAT)
$$ ##TITLE= Audit trail, TOPSPIN		Version 2.1
$$ ##JCAMPDX= 5.01
$$ ##ORIGIN= Bruker BioSpin GmbH
$$ ##OWNER= Administrator
$$ $$ C:\Bruker\TOPSPIN/data/COFFEE/nmr/AC1086_CCIN01_5835837_6RdfhfLT20/20/pdata/1/auditp.txt
$$ ##AUDIT TRAIL=  $$ (NUMBER, WHEN, WHO, WHERE, PROCESS, VERSION, WHAT)
(   1,<2012-04-15 12:44:36.265 -0500>,<Administrator>,<TOPSPIN>,<go>,<TOPSPIN 2.1>,
      <created by zg
	started at 2012-04-15 12:43:29.421 -0500,
	POWCHK enabled, PULCHK disabled,
       configuration hash MD5:
       1A 1E CE 29 27 FD 77 03 67 4E F0 E3 C4 B2 CB 90
       data hash MD5: 64K
       50 88 38 57 FC 92 8B 42 33 DA 16 10 5C ED 4D B5>)
(   2,<2012-04-15 12:44:39.531 -0500>,<Administrator>,<TOPSPIN>,<proc1d>,<TOPSPIN 2.1>,
      <Start of raw data processing
       efp LB = 0 FT_mod = 6 PKNL = 1 PHC0 = 0 PHC1 = 0 SI = 32K 
       data hash MD5: 32K
       39 F5 5F AC BB 0E 0C 6B DC D9 8A 37 97 56 C1 DE>)
(   3,<2012-04-15 12:44:39.859 -0500>,<Administrator>,<TOPSPIN>,<proc1d>,<TOPSPIN 2.1>,
      <pk PHC0 = 209.9597 PHC1 = 0 
       data hash MD5: 32K
       50 0C FF D0 63 25 34 9E ED A6 94 08 1E 8C F3 EC>)
(   4,<2012-04-15 12:44:39.921 -0500>,<Administrator>,<TOPSPIN>,<proc1d>,<TOPSPIN 2.1>,
      <abs ABSG = 1 
       data hash MD5: 32K
       73 76 92 74 EA 8B E7 EB 96 D8 67 CE 9B 12 4C D8>)
(   5,<2012-04-15 12:44:39.953 -0500>,<Administrator>,<TOPSPIN>,<proc1d>,<TOPSPIN 2.1>,
      <abs ABSG = 2 
       data hash MD5: 32K
       B8 39 A2 16 D5 35 B8 F1 F4 A3 4F 20 31 64 B3 33>)
(   6,<2012-04-15 12:44:40.000 -0500>,<Administrator>,<TOPSPIN>,<proc1d>,<TOPSPIN 2.1>,
      <abs ABSG = 3 
       data hash MD5: 32K
       82 48 F3 17 9E E4 91 D5 70 CC A0 CD 42 1D 9E D5>)
(   7,<2012-04-15 12:44:40.031 -0500>,<Administrator>,<TOPSPIN>,<proc1d>,<TOPSPIN 2.1>,
      <abs ABSG = 4 
       data hash MD5: 32K
       9E 02 07 1A F7 B5 72 78 5C 07 67 16 79 9D 4C 6F>)
(   8,<2012-04-15 12:44:40.062 -0500>,<Administrator>,<TOPSPIN>,<proc1d>,<TOPSPIN 2.1>,
      <abs ABSG = 5 
       data hash MD5: 32K
       9D 8C 5B 31 69 81 00 51 5D 8A 54 A2 16 64 65 0A>)
(   9,<2012-04-15 12:44:44.015 -0500>,<Administrator>,<TOPSPIN>,<audit>,<TOPSPIN 2.1>,
      <user comment:
       ICON-NMR User ID: COFFEE
       data hash MD5: 32K
       9D 8C 5B 31 69 81 00 51 5D 8A 54 A2 16 64 65 0A>)
$$ ##END=
$$ 
$$ [...]
##$TP= (0..7)
150 150 150 150 150 150 150 150
##$TP07= 0
##$TPNAME0= <>
##$TPNAME1= <>
##$TPNAME2= <>
##$TPNAME3= <>
##$TPNAME4= <>
##$TPNAME5= <>
##$TPNAME6= <>
##$TPNAME7= <>
##$TPOAL= (0..7)
0.5 0.5 0.5 0.5 0.5 0.5 0.5 0.5
##$TPOFFS= (0..7)
0 0 0 0 0 0 0 0
##$TUNHIN= 0
##$TUNHOUT= 0
##$TUNXOUT= 0
##$USERA1= <user>
##$USERA2= <user>
##$USERA3= <user>
##$USERA4= <user>
##$USERA5= <user>
##$V9= 5
##$VALIST= <valist>
##$VCLIST= <CCCCCCCCCCCCCCC>
##$VD= 0
##$VDLIST= <DDDDDDDDDDDDDDD>
##$VPLIST= <PPPPPPPPPPPPPPP>
##$VTLIST= <TTTTTTTTTTTTTTT>
##$WBST= 2048
##$WBSW= 25
##$XGAIN= (0..3)
0 0 0 0
##$XL= 0
##$YL= 0
##$YMAX_a= 496121
##$YMIN_a= -608546
##$ZGOPTNS= <>
##$ZL1= 120
##$ZL2= 120
##$ZL3= 120
##$ZL4= 120
##$ABSF1= 14.98061
##$ABSF2= -5.57192
##$ABSG= 5
##$ABSL= 3
##$ALPHA= 0
##$AQORDER= 0
##$ASSFAC= 0
##$ASSFACI= 0
##$ASSFACX= 0
##$ASSWID= 0
##$AUNMP= <proc_prof1d_extract_pilot.lims>
##$AXLEFT= 0
##$AXNAME= <>
##$AXNUC= <1H>
##$AXRIGHT= 0
##$AXTYPE= 0
##$AXUNIT= <>
##$AZFE= 0.1
##$AZFW= 0.1
##$BCFW= 0
##$BC_mod= 0
##$BYTORDP= 0
##$COROFFS= 0
##$CY= 15
##$DATMOD= 1
##$DC= 0
##$DFILT= <>
##$DTYPP= 0
##$F1P= 0
##$F2P= 0
##$FCOR= 0.5
##$FTSIZE= 32768
##$FT_mod= 6
##$GAMMA= 0
##$GB= 0
##$INTBC= 1
##$INTSCL= 1
##$ISEN= 128
##$LB= 0
##$LEV0= 0
##$LPBIN= 0
##$MAXI= 10000
##$MC2= 0
##$MEAN= 0
##$ME_mod= 0
##$MI= 0
##$NCOEF= 0
##$NC_proc= -8
##$NLEV= 6
##$NOISF1= 0
##$NOISF2= 0
##$NSP= 0
##$NTH_PI= 0
##$NZP= 0
##$OFFSET= 14.98061
##$PC= 1
##$PHC0= 209.9597
##$PHC1= 0
##$PH_mod= 1
##$PKNL= yes
##$PPARMOD= 0
##$PPDIAG= 0
##$PPIPTYP= 0
##$PPMPNUM= 2147483647
##$PPRESOL= 1
##$PSCAL= 4
##$PSIGN= 0
##$PYNMP= <proc.py>
##$REVERSE= no
##$SF= 400.13
##$SI= 32768
##$SIGF1= 0
##$SIGF2= 0
##$SINO= 400
##$SIOLD= 32768
##$SPECTYP= <>
##$SREGLST= <1H.CDCl3>
##$SSB= 0
##$STSI= 32768
##$STSR= 0
##$SW_p= 8223.68421052632
##$SYMM= 0
##$S_DEV= 0
##$TDeff= 65536
##$TDoff= 0
##$TI= <>
##$TILT= no
##$TM1= 0
##$TM2= 0
##$TOPLEV= 0
##$USERP1= <user>
##$USERP2= <user>
##$USERP3= <user>
##$USERP4= <user>
##$USERP5= <user>
##$WDW= 1
##$XDIM= 32768
##$YMAX_p= 461179984
##$YMIN_p= -690659
##$CURPLOT= <Network HP LaserJet P1505>
##$CURPRIN= <$Network HP LaserJet P1505>
##$DFORMAT= <normdp>
##$LAYOUT= <+/1D_H.xwp>
##$LFORMAT= <normlp>
##$PFORMAT= <normpl>
##$SURQMSG= 1
$$ End of Bruker specific parameters
$$ ---------------------------------
##NTUPLES= NMR SPECTRUM
##VAR_NAME=  FREQUENCY,     SPECTRUM/REAL,   SPECTRUM/IMAG
##SYMBOL=    X,             R,               I
##VAR_TYPE=  INDEPENDENT,   DEPENDENT,       DEPENDENT
##VAR_FORM=  AFFN,          ASDF,            ASDF
##VAR_DIM=   32768,         32768,           32768
##UNITS=     HZ,            ARBITRARY UNITS, ARBITRARY UNITS
##FACTOR=    0.250966925370066, 1,           1
##FIRST=     8223.43324360095, 179606,       12430
##LAST=      0,             -128482,         -176457
##MIN=       0,             -690659,         0
##MAX=       8223.43324360095, 461179984,    0
$$ Real data points
##PAGE= N=1
##DATA TABLE= (X++(R..R)), XYDATA
$$ [...]
19476b4535G4641a23080D73724d18523a47484A53100a52270l83954b14700G2045
19465a07497A8188a28124j28770M1011J0490j03229K8601a05028o7810j36433
19455c09271j708e1326n6050l28062a81712F0665A2820N1291J6271b3238A04436
19443a32597K1692p3531N9965d5817j96120i7803q9139N4925H5757K58455b2492
19431g1215j7396k64868a14062G6967a19056E6158R1088D2325c22985a38416F6085
19419a23221j8759m1808h3631E8597f1924K8495D1018J47145F0562r706Q0825
19408A31681Q0489a24503b4883L107k43760J10376q2669i5524L5482C4434e864
19396B28334e7186r0181I8530b2538l74324c1994B40211a04805c0891j45473A5467
$$ plain form
19476 -24535 74641 -123080 473724 -418523 -147484 153100 -152270 -536224 -214700 72045
19465 -107497 18188 -128124 -256894 -215883 -205393 -308622 -280021 -105028 -172838 -309271
19455 -309271 -310979 -51326 -107376 -435438 -181712 60665 12820 64111 80382 -23238 104436
19443 -132597 -110905 -184436 -124471 -45817 -241937 -97803 -186942 -132017 85757 344212 -22492
19431 -71215 -88611 -353479 -114062 76967 -119056 56158 147246 42325 -322985 -138416 66085
19419 -123221 -141980 -183788 -83631 58597 -61924 -33429 41018 188163 60562 50856 131681
19408 131681 212170 -124503 -24883 -21776 -265536 -155160 -237829 -95524 -60042 34434 -5864
19396 228334 -57186 -147367 98530 -22538 -396862 -31994 240211 -104805 -30891 -176364 15467
19384d21410B43691a68407F4042a37829m7243E7387d10827J90744O6656f0335
19373C02832a23733C21630a95260B00529c09558j83687g9060k07826A82080c89615
19362c60913c2343k25682A73298q4953d08747a33403F0773b16719B3528J9037
19352D2565K9458k6673R5594a47712B82707B1325c5850E1700L4072b04864d0199
19340f1892C1729a11027F9337d10337I8773J69017j2186q2973C3411Q0509O5277
19329A79197b90087A86741d07734J93146f2964n4540k7853o7141j57432a8105
19318A40377a76727I310a76118H8327b55511J01716j9275k08910a12942B78501
19307A05010e9467I5607c44611C62702b3019g954p2565q7444c0088B06208a04663
$$ plain form
19384 -421410 243691 -168407 64042 -137829 -185072 57387 -410827 -220083 -153427 -60335
19373 302832 -123733 321630 -195260 200529 -309558 -493245 -79060 -286886 182080 -389615
19362 -360913 -32343 -258025 173298 88345 -408747 -133403 60773 -216719 23528 42565
19352 42565 72023 45350 140944 -147712 282707 21325 -35850 51700 85772 -204864 -40199
19340 -61892 31729 -111027 69337 -410337 98773 267790 255604 172631 33411 113920 179197
19329 179197 -290087 186741 -407734 -214588 -62964 -117504 -145357 -212498 -369930 -18105
19318 140377 -176727 9310 -176118 88327 -255511 -153795 -173070 -381980 -112942 278501
19307 105010 -59467 95607 -344611 362702 -23019 -7954 -80519 -167963 -30088 206208 -104663
19295a40978J356j34555F2175a06831j31336o6423O5649D1874j7469a79986D4044
19283i4760C14498h8327p4970d6982H8280J03630o9157B0322b8909p8414j757
19272a09080m9053j32162f1052j9512L4565r6048c4218B2689h925j68269c0727
19260e0740C287a73041g2138C4524b07290F0503e9012E7949b31444j714H1595
19248a04316l204k57774a7166k04818a6771j5192a2892A00125E710J4721b48349
19236B26574r8137J28474A08231a2507j6003A9010Q0469c6363r9293l6984o89
19225a73329j76235L603A4996H05J58082b76778i7967K674j51718A79664b33140
19213b62438a1400A0006d6348A54871c25618J31229j49752A39351b26104j6150
$$ plain form
19295 -140978 -139622 -274177 62175 -106831 -238167 -304590 -238941 41874 24405 -179986 44044
19283 -94760 314498 -88327 -163297 -46982 88280 191910 122753 20322 -28909 -107323 -109080
19272 -109080 -158133 -290295 -61052 -80564 -45999 -142047 -34218 22689 -8925 -177194 -30727
19260 -50740 3287 -173041 -72138 34524 -207290 60503 -59012 57949 -231444 -233158 81595
19248 -104316 -107520 -365294 -17166 -221984 -16771 -31963 -12892 100125 5710 20431 -248349
19236 226574 128437 256911 108231 -12507 -28510 19010 99479 -36363 -135656 -172640 -173329
19225 -173329 -349564 -345961 14996 805 158887 -276778 -97967 -95293 -247011 179664 -233140
19213 -262438 -11400 10006 -46348 154871 -325618 -194389 -344141 139351 -226104 -242254
19203b42254n9555a13639D0527b64997J15147p1128g7881c7593E2647K64776g0298
19191a42439D9523a467j02933k86222J11566B5883a44086B14182a92149E2403
19180a50814j75382h8555A13101b31111h7970I605a8900B06814n5675m1974a87295
19168i880n30280B32821b3613I3591b9791D9334b99707A89853f5006A02518L9819
19157A42337a5887k12568e0420m07425h0137A34479d09668A20828a20194A3905
19146A92728a87298a4927L226k65053A5538d948j20692j16938q3335B37170R8489
19135C35659b13537g2355p3863O4186J6618b0288j5772j48359c6835j00025a8192
19123a52647f2477m0853A70595C3523b43494p2608a15055F1547a20892A35756
$$ plain form
19203 -242254 -301809 -113639 40527 -264997 -149850 -220978 -77881 -37593 52647 317423 -70298
19191 -142439 49523 -1467 -104400 -390622 -279056 25883 -144086 214182 -192149 52403
19180 -150814 -326196 -88555 113101 -231111 -87970 9605 -18900 206814 151139 109165 -187295
19168 -9880 -540160 232821 -23613 93591 -29791 49334 -299707 189853 -65006 102518 142337
19157 142337 -15887 -228455 -50420 -457845 -80137 134479 -409668 120828 -120194 13905
19146 192728 -187298 -14927 -11701 -276754 15538 -4948 -125640 -242578 -325913 237170 335659
19135 335659 -213537 -72355 -146218 -82032 -65414 -20288 -36060 -184419 -36835 -136860 -18192
19123 -152647 -62477 -103330 170595 33523 -243494 -316102 -115055 61547 -120892 135756
19112B8357J27217a35505B02807B9100J28617D4182B0279a39065B2240i1048L3371
19101e7677j27108O8839C58090A4522i6578d4061A07635b81049a11972A83597
19090A09166a3775k26391i9899o036H7418e0003B22628d9506A13527i028k01029
19079b10057A8916a76109A21271n175a25210p1152j8071d3072k9106j07392B33123
19067H0168b19936j06461E3440b36879i0065p5541i280k54147a09759H299L22009
19056C30308j17740m4274c32719B2811a25789b5632j07035D2855f82978d1030
19045C4479b70250Q3721e5984C40511G8822a07580k02575F7609k5767i1965A79465
19033a51370B79290i6722p9986m1151D7525a19263j12407E6165c6416A79199m6793
$$ plain form
19112 28357 155574 -135505 202807 29100 157717 44182 20279 -139065 22240 -91048 -57677
19101 -57677 -184785 -115946 358090 14522 -96578 -44061 107635 -281049 -111972 183597
19090 109166 -13775 -240166 -99899 -105935 87418 -50003 222628 -49506 113527 -9028 -210057
19079 -210057 18916 -176109 121271 116096 -125210 -196362 -214433 -43072 -72178 -179570 233123
19067 80168 -219936 -326397 53440 -236879 -90065 -165606 -9280 -263427 -109759 8299 330308
19056 330308 212568 168294 -332719 22811 -125789 -25632 -132667 42855 -682978 -41030
19045 34479 -270250 -186529 -55984 340511 78822 -107580 -310155 67609 41842 -91965 179465
19033 -151370 279290 -96722 -176708 -217859 47525 -119263 -231670 56165 -36416 179199 132406
19022A32406c6907E7675b16785J3570B2789J83781c21414C3032L19942E5687f1436
19010C6402M48410a63201K6536B7734a56710C22449b1263I9135b59837i6277F4408
18998A22778B0902J43908d3427B9875a79677c5336H2734M44522b35647A4572k92
18987A4280Q5157a93416H3583a05634H0224J10974b38303B57142E3275f4667n8510
18976a23177H2573f9637L2622j04268m2166h3151n8856J06A20844h1218L7576
18965d3642c139l01083J13816E6608a02171o7111C9556A4794L47809J58165H753
18953H7878a74901K8696B60760f4199F0863d63470A11443L3086g6993p7965c1845
18941f8425k77587B2083O151K09142a83522F5175B5479L0115N6554l0188c6499
$$ plain form
19022 132406 -36907 57675 -216785 -203215 22789 206570 -321414 33032 352974 55687 -61436
19010 36402 484812 -163201 -136665 27734 -156710 322449 -21263 99135 -259837 -96277 64408
18998 122778 20902 164810 -43427 29875 -179677 -35336 82734 527256 -235647 14572 14280
18987 14280 99437 -193416 83583 -105634 80224 191198 -238303 257142 53275 -64667 -123177
18976 -123177 82573 -69637 -37015 -141283 -183449 -83151 -142007 -141901 120844 -81218 -43642
18965 -43642 -3139 -304222 -190406 56608 -102171 -169282 39556 14794 362603 520768 8753
18953 87878 -174901 -146205 260760 -64199 60863 -463470 111443 144529 -76993 -154958 -31845
18941 -68425 -346012 22083 28234 237376 -183522 65175 25479 55594 112148 81960 -36499
18929a8833A18025c27353i6591c4365j54395e7548C8597a42711n4836f1072a0729
18917b2462A48375N3862i3964A58441d3029B29902d846A81573p9191k3641K10917
18906B89658d08039B04347a45344e2594C3797P2097K00957b90574c2828n63048
18896e95876f5924c2654B99749P3778l0846j50486a47883C5107e8658B11260c63932
18884a30585m5149j42045D4682a97485R5593C4852a63619j35472j29300B19577
18873E279J03774N604K9179b0272k65603e4271j11167N3628a3586k70716B75769
18861b30292C9019p615c762l9770C141a00682k32993a8408k27980j8890M2039
18850b23239l28463C01318j16097c3659B04701D9421J46072h8546J732c8360B21956
$$ plain form
18929 -18833 118025 -327353 -96591 -34365 -188760 -57548 38597 -142711 -197547 -61072 -10729
18917 -22462 148375 202237 -93964 158441 -43029 229902 -4846 181573 102382 78741 289658
18906 289658 -408039 204347 -145344 -52594 33797 105894 306851 -290574 -32828 -595876
18896 -595876 -65924 -32654 299749 373527 342681 192195 -147883 35107 -58658 211260 -363932
18884 -130585 -175734 -317779 44682 -197485 -101892 34852 -163619 -299091 -428391 219577
18873 5279 109053 114657 143836 -20272 -285875 -54271 -165438 -111810 -13586 -284302 275769
18861 -230292 39019 31404 -3762 -43532 3141 -100682 -333675 -18408 -246388 -265278 -223239
18850 -223239 -551702 301318 185221 -33659 204701 49421 195493 -88546 -86814 -38360 221956
18838c167A30494N1372e111r54F4583f0538A03566i6671B44470J7704G2621b3229
18825B9293b23882p5852F7399a93812L3428J2337A5979b70764Q575A82704c32966
18813A54880f5381j09671k34302a19516e0353E7495J5499C5524a39339c2030A26744
18801C57694a05923B44912I8549A2384J08879g9188j3962A32736a39841K1618
18791a18223r3423g6125B6310O7665D5462a70993B0363f0002l26766a77846A2465
18779c2813p9441j2049d7482F3429r879c07084h5881B97160b87568k533P6951
18768b13150B62567h0622c5360k76739b5900j71202j40954J52978m0437M7737
18758a77778A12820m158J5312b63600C8845J96141a8751D4242a04671p2610j02401
$$ plain form
18838 -3167 130494 181866 -5111 -6065 64583 -60538 103566 -96671 244470 262174 72621 -23229
18825 29293 -223882 -299734 67399 -193812 -160384 -148047 15979 -270764 -262189 182704 -332966
18813 154880 -65381 -175052 -409354 -119516 -50353 57495 72994 35524 -139339 -32030 126744
18801 357694 -105923 244912 98549 12384 121263 -79188 -93150 132736 -139841 -118223
18791 -118223 -211646 -76125 26310 93975 45462 -170993 20363 -60002 -386768 -177846 12465
18779 -32813 -112254 -124303 -47482 63429 53550 -307084 -85881 297160 -287568 -290101 -213150
18768 -213150 262567 -80622 -35360 -312099 -25900 -197102 -338056 -185078 -225515 -177778
18758 -177778 112820 108662 123974 -263600 38845 234986 -18751 44242 -104671 -177281 -279682
18747b79682A85429h2416o0384b9383l37077A9837a81041a668A5854a39228o3041
18736b02269N3346c0576I0520b04619d4813k55814a12117k57817I2162J46297
18726B38459j04689d1886A27357a38553A42758b19613H3815J55772b86372J14778
18716a71594b8779L637C73890b69162f0524A5137h8528b9006k18176H467h7444
18704B11971c51577H1315c24886N6681A36947K5993i5218E1181a29782p9376j37521
18693c46679J63142J0137p3724g4086A54297a21442A17086g4549A59972c50774
18682b68803j2078H2236b16863E0917K94756i3285D9060k2794e9620D3794b48887
18670a25024k44540R5474B12984a47573k8168b580k02911A12683a92910Q6016
$$ plain form
18747 -279682 185429 -82416 -142800 -29383 -366460 19837 -181041 -1668 15854 -139228 -202269
18736 -202269 -148923 -30576 90520 -204619 -44813 -300627 -112117 -369934 92162 238459
18726 238459 133770 -41886 127357 -138553 142758 -219613 83815 239587 -286372 -171594
18716 -171594 -28779 -25142 373890 -269162 -60524 15137 -88528 -29006 -247182 8467 -87444
18704 211971 -351577 81315 -324886 -268205 136947 162940 -95218 51181 -129782 -209158 -346679
18693 -346679 -183537 -173400 -247124 -74086 154297 -121442 117086 -74549 159972 -350774
18682 -268803 -280881 82236 -216863 50917 345673 -93285 49060 26266 -59620 43794 -248887
18670 -125024 -369564 -274090 212984 -147573 -175741 -2580 -205491 112683 -192910 -106894
18660a06894r8140B27845p2918E95Q5110m0687a32987A18973K9251h3113l20728
18649d03841a9616A47314l9635g4675h307j97179l0558O8755j21521E7525a52221
18637A94805b81159F8599a36140j34815g5669A20585l1249j1434h0057d128n2850
18626e6978H2159c6511D8184a49344i463j50336g6276j71984b6556m9092k92753
18615c68401J69794h1496A4117R5772J05592a58124F8503a85528A74413c13977
18604H0053P0556K6382B2098a75047G5087i0266j06720A55961n2053k5722b20560
18592a68195A81717a55005j32349A15681n1828c286A59290h117I8927K10302a32808
18580d5970k65726J27173r9165a13832m7005c2377J2886B01127l3182a2744m51
$$ plain form
18660 -106894 -205034 227845 154927 595 85705 45018 -132987 118973 148224 -83113 -403841
18649 -403841 -19616 147314 107679 -74675 -8307 -205486 -236044 -167289 -288810 57525 -152221
18637 194805 -281159 68599 -136140 -270955 -75669 120585 89336 77902 -80057 -4128 -56978
18626 -56978 82159 -36511 48184 -149344 -9463 -159799 -76276 -248260 -26556 -75648 -368401
18615 -368401 -198607 -81496 14117 109889 215481 -158124 68503 -185528 174413 -313977
18604 80053 150609 176991 22098 -175047 75087 -90266 -196986 155961 103908 78186 -220560
18592 -168195 181717 -155005 -287354 115681 63853 -3286 159290 -8117 98927 309229 -132808
18580 -45970 -311696 -184523 -283688 -113832 -160837 -32377 -19491 201127 167945 -12744 -13195
18569a3195l27970J69614B49756c7916A04839c6235A62598b73852b8549q8245
18559a16794e4962A32739a48070E1526f8024k12458e2209k03950A00682b4858
18548A73008h4292H2006l6324h3736n5730k18551a43051L1766j52050o5372I8232
18536a85788A89713q2206D4421g933A59848l6881c8582k29113g4527G8541B4204
18524a65669E1709a7655j92786D2842c29095A45719a61253l2907A15066h6563
18513A61506M0379b1141j77852c3338E887M2679b43353f1349k3223A12421d7936
18501A61878J1618q5400J51185d7344D180g1178j24371A28598k2990K3784b40064
18489A56969n3277c19779B85707A25003b10155a3860k93060b7273n1825n6249
$$ plain form
18569 -13195 -341165 -171551 249756 -37916 104839 -36235 162598 -273852 -28549 -116794
18559 -116794 -54962 132739 -148070 51526 -68024 -280482 -52209 -256159 100682 -24858
18548 173008 -84292 82006 45682 -83736 -139466 -358017 -143051 -111285 -263335 -328707 98232
18536 -185788 189713 107507 44421 -7933 159848 122967 -38582 -267695 -74527 78541 24204
18524 -165669 51709 -17655 -210441 42842 -329095 145719 -161253 -194160 115066 -86563
18513 161506 201885 -21141 -198993 -33338 5887 48566 -243353 -61349 -84572 112421 -47936
18501 161878 173496 88096 239281 -47344 4180 -71178 -195549 128598 105608 129392 -240064
18489 156969 103692 -319779 285707 125003 -210155 -13860 -306920 -27273 -79098 -135347
18479a35347j45295B30920C051b9740C58878b59502I9039c07854H034J94898M4255
18468B47187a7497j32553r8197A28217J42485b37203r4223F3058h9454H9369g5851
18456A15017a30367o6522A91017h400k16154p0627A32365a6723k66834f3185n9063
18445a22248I7559a76570o2462d9984H8527h2649g506k20387c4479j91530f7952
18433a16348G5827J35176k9836K8318a49199A31035C7560b08039A41002d69035
18422b50945e5805B77283B3731a12733j29192c7250o7522A7850J70786a6276F8308
18410a60143J8069G9894K9324M273d507B6382c06929a43151A34490b06002p780
18399b13782J05757d822j1710H4178b80327B17737a06062G4040a017A79352a01505
$$ plain form
18479 -135347 -280642 230920 3051 -29740 358878 -259502 99039 -307854 8034 202932 247187
18468 247187 -17497 -150050 -248247 128217 270702 -237203 -331426 63058 -89454 89369 -75851
18456 115017 -130367 -196889 191017 -8400 -224554 -295181 132365 -16723 -283557 -63185 -122248
18445 -122248 97559 -176570 -239032 -49984 88527 -82649 -7506 -227893 -34479 -226009 -67952
18433 -116348 75827 211003 181167 209485 -149199 131035 37560 -208039 141002 -469035
18422 -250945 -55805 277283 23731 -112733 -241925 -37250 -104772 17850 188636 -16276 68308
18410 -160143 -142074 79894 109218 113491 -4507 26382 -306929 -143151 134490 -206002 -213782
18399 -213782 -108025 -4822 -16532 84178 -280327 217737 -106062 74040 -1017 179352 -101505
18387g7957D2765K5271J31543a46281j17535E0888b04935O5924A68983c54900
18376a05237B06504b30161A77944O8934c07304B08225A1253c03492J50367A71565
18365d9196A05126a13673A71523a4157j06291e788k37955i107j94328B1603a85813
18353a70601j09003H812a39949A92673c59066B69016b53827C38428j67009a29673
18342B3683K60565A37473B4797b42825f8269G4769c61905M0560c4509A83395H4083
18330a25524F0194b87624Q9576B3216a69952M7560F9995J06446a61064r2925n714
18319b59703Q8377b1202G7165h2611j88668F7139a46168E7487f2703C8965a18321
18307B49009a03067A89359l8090c78734G1971a81459O2536j1256A49371a69195
$$ plain form
18387 -77957 42765 68036 199579 -146281 -263816 50888 -204935 -139011 168983 -354900
18376 -105237 206504 -230161 177944 246878 -307304 208225 11253 -303492 -153125 171565
18365 -49196 105126 -113673 171523 -14157 -120448 -5788 -243743 -9107 -203435 21603 -185813
18353 -170601 -279604 8812 -139949 192673 -359066 269016 -253827 338428 171419 -129673
18342 23683 284248 137473 24797 -242825 -68269 74769 -361905 -321345 -34509 183395 84083
18330 -125524 60194 -287624 -198048 23216 -169952 -122392 69995 176441 -161064 -253989 -259703
18319 -259703 -171326 -21202 77165 -82611 -271279 67139 -146168 57487 -62703 38965 -118321
18307 249009 -103067 189359 151269 -378734 71971 -181459 -118923 -130179 149371 -169195
18296D33419d7721h746C8043b68453d6390k91338a4430o1113j78719d9557A21756
18284b7648o7462B62099i4282l84042B7585c04911G4432a42060p8862G6057e1278
18272A19903K26208b14285A66761a85958a7687l73317E3182k5240J62998d8707
18261a29495A34898L5727E8558b34381o9029O3263Q4201I428a82267M4573A0179
18249A35962C4341a64090D4055a27018A163J63560o4196c4962C59998G3054f7042
18237g3580j06629B11662a79527m9979h7271d0351j86857E2908d6101l7007j18255
18226b01363k5526P8935I9005J7801c60096o3834A54128m8198J11864a68014Q1730
18215h6284B51730H4451k48j58M2635o138b70228P0203H3488e4215K534A17173
$$ plain form
18296 433419 -47721 -8746 38043 -268453 -46390 -337728 -14430 -75543 -254262 -49557 121756
18284 -27648 -95110 262099 -94282 -478324 27585 -304911 74432 -142060 -220922 76057 -51278
18272 119903 346111 -214285 166761 -185958 -17687 -391004 53182 27942 190940 -48707
18261 -129495 134898 170625 58558 -234381 -303410 -240147 -155946 9428 -182267 -137694 10179
18249 135962 34341 -164090 44055 -127018 1163 164723 100527 -34962 359998 73054 -67042
18237 -73580 -180209 211662 -179527 -229506 -87271 -40351 -227208 52908 -46101 -83108 -201363
18226 -201363 -226889 -147954 99005 116806 -360096 -423930 154128 105930 217794 -168014 -86284
18215 -86284 251730 84451 84203 84045 126680 120542 -270228 -200025 83488 -54215 -51681 117173
18202b1125j42751G3008J29983k2419m6545D2586K01913A8870i3087k34592n8043
18191c85722a5259P33l35026C29899c9563k01750g3011e163G1290a69867q4761
18180b54628H5043L27895F8103f9391a6210j4351j28868j868m2431R3264l2627
18169a43091A15867k3389J93953B4687K8680a40006k3217N9782G8118b87488a03910
18157B04736d206C6318f8420p5134d0098G1427r67a15274b1049P981j00053E5048
18144B15840Q2438K3593d71043c7574j21756l694L2062k2634a5655I5224a87379
18132a3833j81026O9664F7629m499M7249B4032g3467r8277B71700h3288p0093
18121a53381C97256I1269c04306O3634J6858j24485I5053a80756A00753a63951
$$ plain form
18202 -21125 -163876 73008 202991 180572 134027 42586 244499 18870 -93087 -327679 -385722
18191 -385722 -15259 -14526 -349552 329899 -39563 -241313 -73011 -5163 71290 -169867 -254628
18180 -254628 85043 412938 68103 -69391 -16210 -30561 -159429 -161297 -203728 -110464 -143091
18169 -143091 115867 92478 286431 24687 53367 -140006 -163223 -103441 78118 -287488 -103910
18157 204736 -4206 36318 -68420 -143554 -40098 71427 70460 -115274 -21049 -13068 -113121 55048
18144 215840 298278 321871 -471043 -37574 -159330 -163024 -130962 -153596 -15655 95224 -187379
18132 -13833 -194859 -125195 67629 63130 110379 24032 -73467 -171744 271700 -83288 -153381
18121 -153381 397256 91269 -304306 -240672 -223814 -348299 95053 -180756 100753 -163951
18110c50954B20603C3203J69042j1503d3299J1185B09797j3175a51017A91838
18099f7511j54915C1336J1293e3025C2250b75530E0474N6802M5027b39419B86962
18087A13582i4273M4674B8311L2302a43677R626F8122b83479A75892a62292C617
18075c77480f0337i417B69778P782g2854k0494j84418A00484a35332F2536g5383
18063B11961Q0737b6915k70300F1432a31914D39018d3928I5713C2878K0903a50134
18051A47214D2172K57108e3486n713l6376a474j0831D11649a21266j46138n0031
18040c17435A8515R2529a28786H8595M9049P7636r3029h9412E7609Q5327i4846
18028A34415Q4255j04790k5656a23215i2k40961R5346K5644N1196A01883m5176
$$ plain form
18110 -350954 220603 33203 202245 190742 -43299 -32114 209797 196622 -151017 191838
18099 -67511 -222426 31336 42629 -53025 32250 -275530 50474 107276 152303 -239419 286962
18087 113582 -94273 -49599 28311 60613 -143677 -134051 68122 -283479 175892 -162292 3617
18075 -377480 -60337 -9417 269778 277560 -72854 -93348 -277766 100484 -135332 62536 -75383
18063 211961 292698 -26915 -297215 61432 -131914 439018 -43928 95713 32878 53781 -150134
18051 147214 42172 299280 -53486 -59199 -95575 -1474 -12305 411649 -121266 -267404 -317435
18040 -317435 18515 111044 -128786 88595 137644 215280 122251 -89412 57609 142936 -94846
18028 134415 218670 113880 88224 -123215 -92 -241053 -145707 -120063 -68867 101883 56707
18017E6707a92743f2862B62108D5394i2969k5419I3269J16799a70406A48133l9922
18006A08211b5712B59020c46228A92222K2337b0876F3098c77195a78064m234C62349
17994b87585D332d6183A52437b18032A7476M0079a82989E2468K2103g2453j88536
17983b60989A9891J36460l7208J27617a15022M5302a2310j08591g613H3607c61822
17971B00014a79681F9211L9949p701b4698q4606B14451d27445J64620B9233b50396
17959f3817A76083J30527j22710d655C5879c48732c5159l04737A46867F7388j3290
17948E4098d90354D01827I662J04475J39734i0173B45567a62127D2536a77022
17937c62332O4018H3121a2823A65272b04005D1667J5615L58827b43951a0624j21229
$$ plain form
18017 56707 -192743 -62862 262108 45394 -92969 -118388 93269 210068 -170406 148133 108211
18006 108211 -25712 259020 -346228 192222 214559 -20876 63098 -377195 -178064 -182298 362349
17994 -287585 4332 -46183 152437 -218032 17476 57555 -182989 52468 74571 -72453 -260989
17983 -260989 19891 156351 119143 246760 -115022 -69720 -12310 -120901 -7613 83607 -361822
17971 200014 -179681 69211 109160 101459 -24698 -109304 214451 -427445 -262825 29233 -250396
17959 -63817 176083 306610 183900 -4655 35879 -348732 -35159 -339896 146867 67388 54098
17948 54098 -490354 401827 9662 114137 253871 -90173 245567 -162127 42536 -177022
17937 -362332 -298314 83121 -12823 165272 -204005 41667 57282 416109 -243951 -10624 -131853
17926a31853C57159C3651L5235b10337j41959A05414f5331A94927B8976c50226
17915b6082A31656B8988K4494B674b0206G4179b09933B56273F3066f4643K4419
17904d0224J1821j12172B56141q4249a23007k6956D56884C4123j2750K34455D0047
17892f2624A74618a87129A92433A0515J22255a06643K0275c4108m894A04623g9737
17880b02980D4343J04560i1155l8580l4142I9944J60912H0842b0461A64356b76679
17868A23184j1147a75339l2553i0132b8343A12604a47193A66387h7352M2150m6685
17857i1887l1426D1135O9572C3915g2402j32472G6314c4323j66961h3267j58212
17846b41479N1925m8202d4553j2036J0629k40968C20731j16961q9798a48094g1058
$$ plain form
17926 -131853 357159 33651 68886 -210337 -352296 105414 -65331 194927 28976 -350226
17915 -26082 131656 28988 53482 2674 -20206 74179 -209933 256273 63066 -64643 -40224
17904 -40224 -28403 -140575 256141 171892 -123007 -149963 456884 34123 21373 255828 40047
17892 -62624 174618 -187129 192433 10515 132770 -106643 -86368 -34108 -39002 104623 -79737
17880 -202980 44343 148903 -91155 -129735 -163877 99944 260856 80842 -20461 164356 -276679
17868 123184 112037 -175339 -207892 -90132 -28343 112604 -147193 166387 -87352 -45202 -91887
17857 -91887 -123313 41135 110707 33915 -72402 -204874 76314 -34323 -201284 -83267 -241479
17846 -241479 -189554 -237756 -44553 -56589 -45960 -286928 320731 203770 113972 -148094 -71058
17834a44960A41147c31595B54097b53735F6696f8312J0875B85583E2622L430J19946
17823A75998a12000G8039c1122k2965A50023J73202e1451G1257L3482M058R8348
17812B07145G0532a58998H5503a70097L7828A5656b30147B3967a20894D9105f92
17800a08844A23617a76805d7656f147G0824P8072L17251I1546c2330m2931C7839
17788D31623j17665r900O2097d2559E1914c36368B29659J23908c2374l3919B17910
17776c1070B65763f9472k79474C09124c9985B01768o3395F6515a9785n4882B75377
17764G7009a94542j71835d8487A66448G2161a6663B78298m7831M8999d5350B37512
17752D5378R778O8125e3842D1924h1467F16741C5383K16984L557j1181l7871r6438
$$ plain form
17834 -144960 141147 -331595 254097 -253735 66696 -68312 -57437 285583 52622 56052 175998
17823 175998 -112000 78039 -31122 -54087 150023 323225 -51451 71257 104739 108797 207145
17812 207145 70532 -158998 85503 -170097 -132269 15656 -230147 23967 -120894 49105 -692
17800 -108844 123617 -176805 -47656 -6147 70824 148896 466147 91546 -32330 -75261 37839
17788 431623 313958 304058 366155 -42559 51914 -336368 229659 353567 -32374 -66293 217910
17776 -31070 265763 -69472 -348946 309124 -39985 201768 138373 66515 -19785 -74667 275377
17764 77009 -194542 -366377 -48487 166448 72161 -16663 278298 230467 279466 -45350 237512
17752 45378 55156 123281 -53842 41924 -81467 616741 35383 252367 255924 244743 206872 110434
17740A10434n3406i4136C26515H7497f4929D143a21005A93517h2630A66418G0392
17728B08914O388a14931n0525B40923c6056k7913B26899c15068L0168D20445E2547
17716B22481D9363L22711B5348R835M50659h066j69094A69421b519E0611B0850
17704I6870J3328K91030H2979K63868r9994M9982B3963a37764A78903B6580K1976
17693D8556e9368j36220B19175H7864O8797J0415g9755p1032P5263B26286p6393
17682A49893a92505O3738j08712C34130j59375R8291a19722H4019k2253i6285
17671b92598D4956J51958a71831A53311m0314K5038A0499J12346L7088L6189c6537
17659h1092Q882E3601F666J30824n6681C0478c0950A62942L11481A8913O8875
$$ plain form
17740 110434 57028 -94136 326515 87497 -64929 4143 -121005 193517 -82630 166418 70392
17728 208914 215302 -114931 -165456 240923 -36056 -63969 226899 -315068 -284900 420445 52547
17716 222481 49363 372074 25348 35183 485842 -8066 -177160 169421 -2519 50611 20850
17704 96870 110198 401228 82979 346847 246853 296835 23963 -137764 178903 26580 48556
17693 48556 -59368 -195588 219175 87864 156661 167076 -79755 -150787 -75524 226286 149893
17682 149893 -192505 -128767 -237479 334130 174755 273046 -119722 84019 61766 -96285
17671 -292598 44956 196914 -171831 153311 112997 138035 10499 122845 159933 196122 -36537
17659 -81092 -72210 53601 6666 137490 80809 30478 -30950 162942 474423 18913 87788
17648H7788L8000a8099j3221C62886A891b40312B92045m4913E4152J64440H7043
17636B5686M2274a37118e8591o1277B19374k5806f8632C849a47664B10582a8767
17624A82105k6617k0823J07615A04746b48498c2500B12373k5107l3760C05P8493
17613G8798a02356m6179B3893b12774R781g6333B85413E8608r497c4371B7315
17601a14010A06324J17047b364A54929K09385a83375Q0553d6454j882k30286c8287
17589b41707J14853r686L359A33028d6120B05184K68234I1926N03660D4249L59
17578D4608J53244b30427B43062A8577M05688a4532A48201m1234j1984B8501J81998
17567B10499e922B66973I7584c35830A17572n3957C1003J80800l858H7499K83726
$$ plain form
17648 87788 125788 -18099 -31320 362886 1891 -240312 292045 247132 54152 218592 87043
17636 25686 67960 -137118 -58591 -119868 219374 193568 -68632 3849 -147664 210582 -18767
17624 182105 155488 134665 242280 104746 -248498 -32500 212373 187266 153506 305 78798
17613 78798 -102356 -148535 23893 -212774 -202993 -76333 285413 58608 49111 -34371 27315
17601 -114010 106324 223371 -2364 154929 364314 -183375 -102822 -46454 -48336 -278622 -38287
17589 -241707 -126854 -136540 -133181 133028 -46120 205184 473418 91926 595586 44249 44608
17578 44608 197852 -230427 243062 18577 424265 -14532 148201 106967 94983 28501 210499
17567 210499 -5922 266973 97584 -335830 117572 63615 31003 211803 207945 87499 371225
17556C71225A13554J42858A5841L07027A17570g171A34997K67892H8289A7648
17545C87631D9650R2227E6168a32413A75917p2447J94055g5107B8899K02974A14379
17533C69682A46216n6220k5012R2735E5605A9549L57699p6050J69678B7773K56388
17522B84161o2594l2512a71246B28557J92932A86222C1446J74396J79538E6108
17511C54326J97989r1600K68549M657J12017o3014A48517O57806l73301p4760
17501C58262j21900r1952K34036r3313J32778B04820J25382M04870J06077k86495
17491E54654J83636Q6720B11778L26558k00271J82712A55283J62519B0950P4218
17481I5168L1332K69280J24684k09952N234F3545Q8322L12927g6887A02585K51421
$$ plain form
17556 371225 113554 256412 15841 322868 117570 -7171 134997 402889 88289 17648
17545 387631 49650 141877 56168 -132413 175917 103470 297525 -75107 28899 231873 114379
17533 369682 146216 89996 64984 157719 55605 19549 377248 301198 470876 27773 284161
17522 284161 221567 189055 -171246 228557 421489 186222 31446 205842 385380 56108
17511 354326 552315 460715 729264 733921 845938 782924 148517 806323 433022 358262
17501 358262 236362 144410 378446 285133 417911 204820 330202 735072 841149 554654
17491 554654 738290 825010 211778 538336 338065 520777 155283 317802 20950 95168
17481 95168 126500 395780 520464 310512 315746 63545 151867 464794 -76887 102585 354006
17470C54006A44108l9197K00594E3722K17460J36469m0165N3305n9186q7888R2774
17459C66491o8014A28372J42127E1534q883L94152j92196L2207E0363M87476A43066
17447C73659M0493A79092p8594g3522C3598L19365L964A62957O5070L03559r1661
17436D39925R3559k09372l9806J25738j58774M52672B75801J17102K20340A62946
17425B42290J71363A81505P3693o577L85185A81822O6976Q9470n6554j24495m3422
17414A13797J32754k3480N1225N5377j39202L97603a55761C61473C8189M26400
17404D64589K9298j52746J05643j65142J51414N112j73614M8549j8376P979M97244
17393G99950r7845A62008K75035j44891a63678D53014j03243j72846p0543K44203
$$ plain form
17470 354006 144108 104911 305505 53722 271182 407651 367486 420791 361605 273717 366491
17459 366491 298477 128372 270499 51534 42651 436803 244607 276814 50363 537839 143066
17447 373659 414152 179092 100498 -73522 33598 352963 356927 162957 228027 531586 439925
17436 439925 533484 324112 284306 410044 251270 703942 275801 392903 613243 162946
17425 242290 413653 181505 255198 248621 633806 181822 248798 338268 281714 157219 113797
17414 113797 246551 223071 274296 329673 190471 588074 -155761 361473 38189 464589
17404 464589 493887 341141 446784 281642 433056 438168 264554 313103 294727 302706 799950
17393 799950 702105 162008 437043 292152 -163678 453014 349771 176925 106382 350585
17383C50585m6466L6561J8831r6503E1522J74086N2038E9424L43851A82971K991
17372A85962P5709o0309L58881A29085L85266B48805F7140A141O1173i9145C46558
17360B10155Q3372A28458J19159l8233l080J6204J50196L9513A31731J01409c348
17348E7899B7755K47927O5187q1766j04035D7827O09927H3389j6802a42350B22227
17336A05694J77854J05112j47652E7702g9185A81210K8597b30946A35451J11152
17326B46603b05095A49356e3426E14178B43450K1100o6432B2205J55005F6784
17315I6617c5195C73864j42077J59909A42701o0823J33889J86506A53847r145
17305A44702d9341a9658C07390J0252J13056E6612L39475k5028K00166k39643
$$ plain form
17383 350585 304119 340680 359511 263008 51522 225608 277646 59424 403275 182971 185962
17372 185962 261671 201362 560243 129085 514351 248805 67140 1141 62314 -99145 346558
17360 210155 293527 128458 247617 209384 206304 222508 372704 412217 131731 233140 -3348
17348 57899 27755 275682 340869 259103 155068 47827 657754 83389 66587 -142350 222227
17336 105694 283548 388660 241008 57702 -79185 181210 209807 -230946 135451 246603
17326 246603 -205095 149356 -53426 514178 243450 264550 198118 22205 177210 66784
17315 96617 -35195 373864 231787 391696 142701 81878 215767 402273 153847 144702
17305 144702 -49341 -19658 307390 317642 430698 56612 396087 371059 571225 331582
17295C31582J6067j32897A01802J36053K83137J06122d3989D31571A66404q1611
17285H4793b7708A5572J53131f2573C43271r1055J4628J70126k10200H2464a22740
17273A68009K12542i0924J8290a7336C32054j23640n7355J86049p5509K26410
17263D88009j12936P4801j28294j07888b5719k7251B68711J70671i512B08116
17252B63061k6874d6798A15062L20513j79861G34J28934L60639A15157L0347R7238
17241B42742K60145M6744A9383N27770k04587K18923A97028B7708K98484A3108
17230A94651J44439J54088j70866L6536j46395C912M340K21763j12644M80315
17220E97686e439B68992a05009B33055A4209M50907B26555M2526m0090K40052
$$ plain form
17295 331582 347649 214752 101802 237855 520992 627114 -43989 431571 166404 84793
17285 84793 -27708 15572 168703 -62573 343271 252216 266844 436970 226770 82464 -122740
17273 168009 380551 -90924 -72634 -17336 332054 208414 151059 337108 261599 488009
17263 488009 375073 449874 321580 213692 -25719 -52970 268711 439382 -9512 208116
17252 263061 236187 -46798 115062 435575 255714 734 129668 490307 115157 145504 242742
17241 242742 502887 549631 19383 547153 342566 561489 197028 27708 326192 13108
17230 194651 339090 493178 322312 358848 212453 3912 8252 230015 117371 597686
17220 597686 -5439 268992 -105009 233055 14209 465116 226555 269081 228991 469043
17210D69043J5020A15197J76962K9388P8565m2561o7318a13668A80987c8735A42278
17198D10106k7927J38076A60800M3568J3237E1566d7148A31754n6158L67375j66946
17187B76025J91241o9290j89710K77304n6358j17411k0710A35093P8464K46878
17177D60435m2181j2264j94813K84699r8771A95798L32630r9213H725L61723Q7916
17166D58364A82605J03586Q7147j23488K11615K3680j29421L13038B47409N4971
17156C02380L77446B14169K98993a47420D57659A22684J3773K28221q4528A19647
17145G30574l57917j13959J80130j18317P6007j43057I0508K08279o7417L44802
17135E76172k03437J58968R9486B04285J17591B7862M63399q4168r3798K60438
$$ plain form
17210 469043 484063 115197 292159 321547 400112 357551 290233 -113668 180987 -38735 142278
17198 410106 382179 520255 160800 204368 217605 51566 -47148 131754 75596 442971 276025
17187 276025 467266 397976 208266 485570 429212 311801 291091 135093 213557 460435
17177 460435 418254 405990 211177 495876 397105 195798 528428 429215 8725 370448 458364
17166 458364 182605 286191 373338 249850 461465 485145 355724 668762 247409 302380
17156 302380 679826 214169 513162 -147420 457659 122684 136457 364678 280150 119647
17145 730574 372657 258698 438828 320511 396518 253461 90508 298787 231370 576172
17135 576172 372735 531703 631189 204285 321876 27862 491261 407093 313295 573733
17125E73733E3540N45546j11808j70675j11360N86019B71401J59574A87448Q332
17115A95780O4998L4298N61435C40044L7035r4675k4899L45657k0947A52476K40251
17104C92727K86643m3372j3182B65734P1137L78512k44473r0854m627k5513Q5694
17093D35610C6726N55469H9584L93179F4038M03490j46968J67711B26397K50684
17083D77081J18709k48337K77122k92371K55708k9429J7454j15429o6016K61375
17073F55867N1948j77313k14672J81333N03922C35122n4350J6812Q0513L65749
17063G43846k96026K12890j21045L6494J81020j66427L11097l61949m5436j31948
17053C62516K18234B29074M36852k35953N40722C39603J24183J05498o9683m0702
$$ plain form
17125 573733 53540 599086 487278 316603 205243 791262 271401 430975 187448 195780
17115 195780 260778 295076 856511 340044 377079 282404 257505 603162 582215 152476 392727
17104 392727 679370 635998 622816 265734 336871 715383 470910 380056 375429 349916 435610
17093 435610 36726 592195 89584 482763 64038 467528 320560 488271 226397 477081
17083 477081 595790 347453 624575 332204 587912 558483 575937 460508 394492 655867
17073 655867 707815 530502 315830 497163 1001085 335122 280772 297584 378097 743846
17063 743846 447820 660710 539665 576159 757179 590752 901849 539900 494464 362516
17053 362516 580750 229074 665926 429973 970695 339603 463786 569284 499601 458899
17043D58899p8839K16109k6390M44573k44471k59565R9140K99547l35838J75908
17033G49073j20966K9957P9956r002K2931K91967k97755l00541L63706R2879k57678
17022F44527J50503J6612k97474L87044k94034L75063j65977l34431J29714L67631
17012I79178r6504m02013L87628n6130L10139m98221j45071L70605m0779r7994
17002G10838R1229J4802j81111M825L37544j04341k23365j3785L87688l23682
16992G00642J56056Q9615j60732K41811j85582J09554j43004L12432k99697K76177
16982A097272q6215k52907J9889L20597j93759Q8535k77084M39196j59924P3209
16972A068809j61603J7090K70012r1112j04368K51345K6718l27421J44250k10528
$$ plain form
17043 458899 380060 596169 569779 1014352 769881 510316 609456 909003 573165 749073
17033 749073 628107 658064 738020 729018 751949 1043916 746161 445620 809326 902205 644527
17022 644527 795030 811642 514168 901212 607178 982241 816264 481833 611547 979178
17012 979178 882674 480661 868289 812159 1122298 624077 479006 849611 808832 710838
17002 710838 802067 816869 635758 640583 978127 873786 650421 636636 1024324 700642
16992 700642 856698 946313 785581 1027392 841810 951364 808360 1120792 821095 1097272
16982 1097272 1011057 758150 778039 1098636 904877 993412 716328 1155524 995600 1068809
16972 1068809 907206 924296 1194308 1103196 998828 1250173 1276891 949470 1093720 883192
16962H83192j40979O66675l23611n9857L23858N9929E76445P59200j23678n8794
16952A153173L03548l32808j50561M33865r4426p4448r4866J38629l3681K7899
16942A276324k14938L71234K1440k57723J01533K53132j15272N0496k1119k32942
16932A232165L18410k74556J01867m6558k3961J9981L38361j35430R2772m00472
16922A222579K63574n9735K13550k49448M88182j63942j53376L26409J20553n24803
16912A483543J26543k4036K96560m9194m21972L97787k8962K85051k00939L5788
16902A900169K0224l31770N24392m95848M79137j33224j90497K98113j08158k4002
16892A938536M5854p9692K10740K04061o27093L78388J25715l13307M54307J8721
$$ plain form
16962 883192 742213 1408888 1085277 1025420 1349278 1409207 576445 1335645 1211967 1153173
16952 1153173 1456721 1123913 973352 1407217 1312791 1238343 1143477 1282106 1248425 1276324
16942 1276324 1061386 1432620 1454060 1196337 1297870 1551002 1435730 1486226 1465107 1232165
16932 1232165 1550575 1276019 1377886 1331328 1307367 1327348 1665709 1530279 1623051 1222579
16922 1222579 1486153 1426418 1639968 1390520 1878702 1714760 1561384 1887793 2008346 1483543
16912 1483543 1610086 1586050 1882610 1833416 1411444 1809231 1780269 2065320 1864381 1900169
16902 1900169 1920393 1588623 2113015 1617167 2096304 1963080 1772583 2070696 1962538 1938536
16892 1938536 1984390 1904698 2115438 2319499 1692406 2070794 2196509 1883202 2337509 2356230
16882B356230o9988k12695J79138K74032k90240L72860l13191M30481l43261r0798
16872B292568P34543o16712L52375J15879n36714M11823M045L48630m42665m1852
16862B621920O8916l01871P19454r7939j84342L16549n3522J93810k66967J17643
16852C133651K73674j14197N0208J39572j76201L57793j25630J6423L16764k3606
16842C848451R8296j19992Q8262N7377k88151J22667o7215K59255K21594q415
16832D212129J66469K46104n4481K7430P8725j16559K14357J99990M2103O824
16822E023091Q0435j96384L85559q4569L13735m23486M94215J53223J89039p2482
16812E862376p5114L73882Q5535J63907K03389M182M15379J66493k10976M80111
$$ plain form
16882 2356230 2286242 2073547 2252685 2526717 2236477 2609337 2296146 2726627 2383366 2292568
16872 2292568 3027111 2410399 2762774 2878653 2341939 2753762 2757807 3106437 2663772 2621920
16862 2621920 2690836 2388965 3108419 3010480 2826138 3142687 3089165 3282975 3016008 3133651
16852 3133651 3407325 3293128 3343336 3482908 3306707 3664500 3538870 3555293 3872057 3848451
16842 3848451 3946747 3826755 3915017 3972394 3684243 3806910 3739695 3998950 4220544 4212129
16832 4212129 4378598 4624702 4570221 4597651 4676376 4559817 4774174 4974164 5016267 5023091
16822 5023091 5103526 4907142 5292701 5208132 5521867 5098381 5592596 5745819 5934858 5862376
16812 5862376 5787262 6161144 6246679 6410586 6613975 6618157 7033536 7200029 6989053 7469164
16802G469164K06419j52397K65173L99194l47165Q5486N09740J83523Q6543L85254
16792I090934O2864L86642j25466M59889J8766L34540n3335J27296O29122j59632
16782A0771620O10423j86727Q15024J74493O97284j72251M09315O65097J64665
16773A3948943K25931L97596M12348K95065O59112M27977N32719L67994M44512
16764A7712197P62837O44091N34445M61155L28569Q45008Q56314P26653R77153
16755B3848422O36078R45470P36805J174230O97668J120896J145707J128813Q25354
16746C2259443J524179J377126J553283J194322J684276J415241K145259J479998
16738D4633127J890272J786754K210289K348707J955428K993648K502035K298601
$$ plain form
16802 7469164 7675583 7523186 7788359 8187553 7840388 7925874 8435614 8619137 8705680 9090934
16792 9090934 9153798 9540440 9414974 9874863 9893629 10228169 10174834 10302130 10931252 10771620
16782 10771620 11382043 11195316 12010340 12184833 12882117 12709866 13119181 13784278 13948943
16773 13948943 14174874 14572470 14984818 15279883 15938995 16366972 16899691 17267685 17712197
16764 17712197 18475034 19119125 19653570 20114725 20443294 21288302 22144616 22871269 23848422
16755 23848422 24484500 25429970 26166775 27341005 28038673 29159569 30305276 31434089 32259443
16746 32259443 33783622 35160748 36714031 37908353 39592629 41007870 43153129 44633127
16738 44633127 46523399 48310153 50520442 52869149 54824577 57818225 60320260 62618861
16730F2618861K880859L070876L108317L142330L158948L180619L765342L869337
16722H8795489L433390L975229L938179L730381L918107L709554L604261L927988
16714A19032578L396048K869887L266706K720407K390905J899359J347262J141753
16706A38064905p2960M75636p78276p34468j807073k123241k224887k684874k894807
16697A25219955l363579l665473l697335l437908m253040l610447l669115m061351
16689I5461707l938810l924032l676427l764361l179668l253458l269766k996266
16681F7458919l101888k948994k652787k535174k258327k338543j958218j986523
16673D7678465k405940j748361j966572j751343j050094j870622j560845j026648
$$ plain form
16730 62618861 65499720 68570596 71678913 74821243 77980191 81160810 84926152 88795489
16722 88795489 92228879 96204108 100142287 103872668 107790775 111500329 115104590 119032578
16714 119032578 122428626 125298513 128565219 131285626 133676531 135575890 136923152 138064905
16706 138064905 137991945 138467581 137689305 136954837 135147764 133024523 130799636 128114762 125219955
16697 125219955 121856376 118190903 114493568 111055660 106802620 103192173 99523058 95461707
16689 95461707 91522897 87598865 83922438 80158077 76978409 73724951 70455185 67458919
16681 67458919 64357031 61408037 58755250 56220076 53961749 51623206 49664988 47678465
16673 47678465 45272525 43524164 41557592 39806249 38756155 36885533 35324688 34298040
16665C4298040j657505r80786j575836r43251q58591j303273q10809p45795j336334
16656B4085860o09335n89716j048288l49744r76365n79933m61331q36686o42143
16647A7992319k89234q46373l22543n57474l77547m41238l61326k79621l62865
16638A4154098o00325k20739l43651m06146j83918n39798m17315m3089l49347
16629A1049770j13882n93274k52929m37349K98044l03877m80952K26083k52162
16620I139472k98370l2093k77108k51988l57562Q4002k92548m54464L31984m97018
16610G094307k11464K18372l63833k81745j70216K39966m4135n56700O5246l34858
16600E654940k0382L5574l15384L16698j89479j91321r6723n228j41090q6639
$$ plain form
16665 34298040 32640535 31659749 30083913 29140662 28282071 26978798 26167989 25422194 24085860
16656 24085860 23476525 22886809 21838521 21488777 20512412 19932479 19471148 18634462 17992319
16647 17992319 17703085 16856712 16534169 15976695 15599148 15157910 14796584 14516963 14154098
16638 14154098 13553773 13333034 12989383 12583237 12399319 11859521 11442206 11399117 11049770
16629 11049770 10935888 10342614 10089685 9652336 9950380 9646503 9165551 9391634 9139472
16620 9139472 8841102 8809009 8531901 8279913 7922351 8006353 7713805 7259341 7591325 7094307
16610 7094307 6882843 7101215 6737382 6455637 6285421 6525387 6481252 5924552 5989798 5654940
16600 5654940 5634558 5670132 5354748 5671446 5481967 5290646 5193923 5188695 5047605 4960966
16590D960966o8197k16592J30657l87175J17050K51484m63344l0576Q1214n27956
16580C847531M83110j96228k1875N3495j17594j91145j75006J68649k59152J37348
16570C729133j26918j81712l12385r9935M09220m4944j82548J46967k5296q430
16560C303152k10420k7496k36438K11413l03189K0363k10576L39653k49621L41912
16550B978753l41158o4670Q5901j32728L1200r8087K08453l45172J54486J65582
16540B642560j62177l61438M88555l29753m6867K4607m6989q372l7791K60681
16530B423016l61428j95810K74281R1016R2757n77265N18192l89267N696k28549
16520A652639L91740j17174J25149l09750K61509j79357j67487K28063O7665r5015
$$ plain form
16590 4960966 4892769 4676177 4806834 4419659 4536709 4788193 4324849 4294273 4375487 3847531
16580 3847531 4330641 4134413 4112538 4166033 4048439 3857294 3682288 3850937 3591785 3729133
16570 3729133 3602215 3420503 3108118 3008183 3417403 3372459 3189911 3336878 3311582 3303152
16560 3303152 3092732 3065236 2828798 3040211 2737022 2757385 2546809 2886462 2636841 2978753
16550 2978753 2637595 2572925 2658826 2526098 2557298 2459211 2667664 2322492 2476978 2642560
16540 2642560 2480383 2118945 2607500 2277747 2230880 2255487 2208498 2200126 2162335 2423016
16530 2423016 2061588 1865778 2140059 2231075 2323832 1746567 2264759 1875492 1881188 1652639
16520 1652639 2044379 1927205 2052354 1742604 2004113 1824756 1657269 1885332 1952997 1857982
16510A857982r891k72017j49193L02711j50673j7722R8163j307Q6950r8320j84754
16499A461929J1124J77236j41793k23337J27032K11174K1314j90242j56648M2953
16489A340742M27305k99499l81796J09737K12568P1170l8637n8872J098k74038
16479A109778K25194j34624O3659M4894j06001Q4920j90321K58857j0171q9408
16469A256777j35776J34930k96539J30683J40786R6422k59732o4398K22213j58649
16459A066717P8902j93676J95320L2742J9795n791n7526K63004m45334k41201
16449G12952M14540M4808k12336l8018p0961J32992k23825N302K52542J5531k68420
16438G65107K04477L6680j4941o0341J57562l80196M16180k79944R9186j3831
$$ plain form
16510 1857982 1848091 1576074 1426881 1729592 1578919 1561197 1659360 1658053 1745003 1646683 1461929
16499 1461929 1473053 1650289 1508496 1285159 1412191 1623365 1644679 1454437 1297789 1340742
16489 1340742 1768047 1468548 1086752 1196489 1409057 1480227 1441590 1382718 1383816 1109778
16479 1109778 1334972 1200348 1264007 1308901 1202900 1287820 1097499 1356356 1346185 1256777
16469 1256777 1121001 1255931 959392 1090075 1230861 1327283 1067551 1003153 1225366 1066717
16459 1066717 1145619 951943 1147263 1180005 1199800 1194009 1136483 1399487 954153 712952
16449 712952 1127492 1172300 959964 921946 850985 983977 760152 765454 1017996 1033527 765107
16438 765107 969584 1006264 991323 930982 1088544 708348 1124528 844584 943770 929939
16428I29939N4332l33966M25250k91831j31260J18215K50425o7538j27270J73676
16418I99972k79536q519j56293K7449L01622l3168l45322L00906O3128j07811
16408G62428J1529j87712p4874m8422L41820J43498l85052j30829M33385k05073
16398F60698j12664p5060M46292L5387m62446L77786l65483K19545N5490C87374
16387E37519L11228B55161J94106N51211k18379k58387n0056L82553k54704L1369
16377F32874j48P5053N5894j02429J55760l12344L10043l42783J18823J40513
16367G31256j42624L8516j11383j38106P07064l15791R1196l23033J09204p4380
16357E71919K77099C89606L28601k28728p045k35555L66217J54409o4528k94430
$$ plain form
16428 929939 984271 650305 1075555 783724 652464 770679 1021104 953566 826296 999972
16418 999972 720436 711917 555624 583073 884695 851527 506205 807111 870239 762428
16408 762428 773957 586245 511371 462949 804769 948267 563215 432386 865771 660698
16398 660698 548034 472974 919266 954653 492207 869993 504510 724055 779545 387374
16387 537519 848747 255161 449267 1000478 782099 523712 473656 856209 601505 632874
16377 632874 632726 707779 763673 661244 817004 504660 814703 471920 590743 731256
16367 731256 588632 627148 515765 377659 1084723 768932 860128 537095 646299 571919
16357 571919 849018 389606 718207 489479 482434 246879 613096 767505 702977 408547
16347D08547K59006J35688C79611J68782K24719C66929m1602J34172J22073A75765
16336G35443J24835D20882M0313j95562N06325B47050K16802j80132L57209k9417
16326F11512A90298K64798J40733k40606m2849j6767L65931j45530j65736J13458
16316D63730k27187K04920o5824Q321j9599M43897k67410R0297j5357A14882N19712
16305F34594j50759A2984M83318P488B12686o9125L31428I1391J23938M26592
16295F41921j88094p4321j10047A9603M71037j22086j68396R2202K86149I9986
16284D18353j12128R9198J35220J10347k46158J11062p2838R68j69645K65972
16274E40351A38848J72173q0453O6714L12036k21571j18492L51277J035A36774
$$ plain form
16347 408547 667553 803241 379611 548393 773112 366929 325327 459499 581572 175765
16336 735443 860278 420882 461195 265633 771958 247050 463852 283720 640929 611512
16326 611512 190298 455096 595829 355223 312374 295607 661538 516008 350272 463730
16316 463730 236543 441463 375639 383960 364361 808258 540848 631145 615788 114882 634594
16305 634594 483835 12984 496302 503790 212686 143561 474989 91391 215329 641921
16295 641921 453827 379506 269459 19603 490640 368554 200158 292360 578509 99986
16284 418353 306225 405423 540643 650990 404832 515894 443056 444024 274379 540351
16274 540351 138848 311021 230568 297282 609318 387747 269255 620532 621567 136774
16263C43899j07836M6752L09113O982k49757j18864J4305O4860j2517b06031C87106
16251A84867L17421j71591M0480r097j56375k7280L65345O5337k85585p4993I5883
16239D4434K36083K78415A65125Q49D1911K71907j25867g0975B34546E0869k3080
16228B7789K46058K02431G1919N4163M5881B5052K97088J34845i8340D87107E0637
16216C24167J21327B19835H1149K83938J75721A11982K43854i4270B15786P3630
16206B89416q1927k8242J45629j03874K90609k28555j13138K57815H5111L88905
16196D74016c0784A56449N0932N8282I4144M14703j91468O183r3594J11517H8778
16184A10393O713b0440A99879O3581J32279F9027f7227B50017O0444K04395A91365
$$ plain form
16263 343899 236063 282815 591928 598910 349153 230289 244594 309454 296937 -206031 387106
16251 184867 502288 330697 371177 362080 205705 178425 543770 609107 323522 248529 95883
16239 44434 280517 558932 165125 165974 41911 313818 187951 -70975 234546 50869 27789
16228 27789 273847 476278 71919 126082 171963 25052 322140 456985 -98340 487107 50637
16216 324167 445494 219835 81149 365087 540808 111982 355836 -94270 215786 289416
16206 289416 207489 179247 324876 221002 511611 283056 169918 427733 85111 474016
16196 474016 -30784 156449 207381 265663 94144 508847 317379 323562 229968 341485 88778
16184 110393 117106 -20440 199879 263460 395739 69027 -67227 250017 310461 514856 191365
16172E67924A19435L19340o1097J20211K1450A460M75991j70436F6503j3725J24163
16161A76941R1545A21662C6991J33700b9223B65933d4499A51973o8560J95029
16151B78442L0749P6575j8539A39266b34447C35242a48541H0281h9936H3967P8871
16140A62838p40a92855C33458q9101L27650a20835C79806G6991Q9149G0452J01279
16129A71731J45118L2917A11989K5217E805K87963H9296K41273m246A18644e0048
16117a63644B10559G3331b271D13720A23241J83894E5588K17186I9015B9594a60910
16105a20524B55967K94621a76780D10688j91254q2974O3193H7260J29626b16159
16094B79516F1519J57940g8587A453J51869E0085d2634K0714B8969K98038j57469
$$ plain form
16172 567924 119435 438775 377678 497889 519339 1460 477451 307015 66503 52778 176941
16161 176941 268486 121662 36991 170691 -29223 265933 -44499 151973 83413 278442
16151 278442 309191 385766 367227 139266 -234447 335242 -148541 80281 -89936 83967 162838
16140 162838 162098 -192855 333458 244357 572007 -120835 379806 76991 166140 70452 171731
16129 171731 316849 349766 111989 137206 5805 293768 89296 330569 326323 118644 -50048
16117 -163644 210559 73331 -2271 413720 123241 307135 55588 272774 99015 29594 -160910
16105 -120524 255967 550588 -176780 410688 219434 136460 199653 87260 216886 -216159
16094 279516 61519 219459 -78587 1453 153322 50085 -42634 -21920 28969 327007 169538
16083A69538E9492N1717J55321L2566A03127J76503K2031o8439H5467P3126i3740
16071b50951A47736h6909d0135j42874B44103h1213m70425e9499G9423b40964
16060A54961o4672l3112q399K24190a28004H6755K38272j39775h0970A57902J9241
16049A77143a49184j5106A37289J05439A18180J52781A17271Q9942Q0459a53222
16038A7146a48980D08382A91099e7642C54990b13785A12212J89518C7015J90931
16028B27946o4499e2893n1874A6434b2182A41121b63706O8015l5557c0494D2866
16016A50960e6257b412A19280d5863B78279B4394J96829n8947f2093J4224C39267
16004F3550c6015B06775g4109j2248r087q2125A54356Q7855B9164N90701C08290
$$ plain form
16083 169538 59492 111209 266530 299096 103127 279630 301661 233222 85467 158593 -93740
16071 -250951 147736 -86909 -40135 -183009 244103 -81213 -551638 -59499 79423 -240964
16060 154961 90289 57177 48778 272968 -128004 86755 325027 185252 -80970 157902 177143
16049 177143 -149184 -164290 137289 242728 118180 270961 117271 207213 287672 -153222
16038 17146 -148980 408382 191099 -57642 354990 -213785 112212 301730 37015 227946
16028 227946 163447 -52893 -104767 16434 -22182 141121 -263706 -195691 -231248 -30494 42866
16016 150960 -56257 -2412 119280 -45863 278279 24394 221223 162276 -62093 -47869 339267
16004 63550 -36015 206775 -74109 -86357 -95444 -177569 154356 242211 29164 619865 308290
15992F90J72077a5653A01082b85005l615a5093r7496C13578c6322r2559B749d7938
15979F1292b56F6494A1359i0050j39666B60549K82876j82789J42731K92443L80
15968G96190L43402m91017B79079J50803l1107a37420L7831C89254e993F8102
15957H7597J2195K06518b48941B0523g4670A71611o7749C460a17484A44236F4822
15945b59736L1654L3310L5596I5314c83528J25642G3037J8236K5958f3599I6164
15933c6125k48073a7357E8785j9923J77225M5482C225c5185l8052A32625b28562
15921b8259A02039a35680G8863g2121a6074m4951p0954r886l0127E9776d6153
15909D2804a32415J7588A26351a80943N5327o1107A12301M8437J18144H9525a48298
$$ plain form
15992 690 172767 -15653 101082 -285005 -288620 -15093 -112589 313578 -36322 -128881 2749 -47938
15979 61292 -256 66494 11359 -90050 -229716 260549 543425 360636 503367 795810 796190
15968 796190 1139592 648575 279079 429882 398775 -137420 -99589 389254 -5993 68102
15957 87597 99792 306310 -248941 20523 -74670 171611 103862 3460 -117484 144236 64822
15945 -259736 -228082 -194772 -159176 95314 -383528 -257886 73037 91273 117231 -63599 96164
15933 -36125 -284198 -17357 58785 38862 216087 261569 3225 -35185 -73237 132625 -228562
15921 -28259 102039 -135680 78863 -72121 -16074 -61025 -131979 -141865 -171992 59776 -46153
15909 42804 -132415 -114827 126351 -180943 -125616 -186723 112301 160738 278882 89525 -148298
15897H8929c73552A95010a03086q6888R1936m51c3246l2297k2252j05827i77j58122
15885a59099g385l22021B92603J53469k01905f3149D9957c03019J45233C18753
15874a69100E7029c75792F2962B7966M279J10262h3716a585o8716q7358j52054
15863c09713J31508G0088A6839J63582K829B1928a85944O2103B53886F195a03290
15851a61717o7304A9473Q1968P259a64927O5467C9444a3796k69159R4811n5623
15840b43767f4006m156C4139a12399A48681a97806B56943c11605J36483A0621
15829A45873f2373K7130j0954k25015Q4452R2611J0861A71644b43206B05975f4876
15817a54411A88506L616C5177i0979q3791c4680A90181a7580r5906a0721j86025
$$ plain form
15897 88929 -373552 195010 -103086 -189974 -98038 -98489 -33246 -65543 -87795 -193622 -977 -159099
15885 -159099 -7385 -329406 292603 446072 244167 -63149 49957 -303019 -157786 318753
15874 -169100 57029 -375792 62962 27966 32245 142507 -83716 -1585 -70301 -157659 -309713
15863 -309713 -178205 70088 16839 180421 183250 21928 -185944 -123841 253886 6195 -103290
15851 -161717 -229021 19473 101441 108700 -164927 -99460 39444 -13796 -282955 -188144 -243767
15840 -243767 -64006 -68162 34139 -112399 148681 -197806 256943 -311605 -175122 10621
15829 145873 -62373 -35243 -46197 -271212 -186760 -94149 -83288 171644 -243206 205975 -64876
15817 -154411 188506 192122 35177 -90979 -174770 -34680 190181 -17580 -113486 -10721 -196746
15806a96746j50246d8769A30310b2457H6652c36092J11058e7357j6332A48338
15795a57481f6864B79159i3091a2571o7484c7812H2495a98434e0994F8403J1841
15784H0244l5169K42350i5625j40561B35717a6804A62458G2543d8907k24588A9209
15772g2737J7356A3166Q7981i1969j76064A34100g1510j5494J6326A70439p7614
15761I2825b01308A91880a64461n3291P5781J4894C26281A17140b929k12988P9913
15750a36004B193O377a18242o0505A34382A9838a15226A69673c40q2194j8085
15739a00619o7449B15190b1821D9916J16680I32a70067M6879o671B1863j0410
15728A1453K56932a01425A01983f0602D18905h1657q4784A39163a68682j23574
$$ plain form
15806 -196746 -346992 -48769 130310 -22457 86652 -336092 -225034 -57357 -73689 148338
15795 -157481 -66864 279159 -93091 -12571 -80055 -37812 82495 -198434 -50994 68403 80244
15784 80244 45075 287425 -95625 -236186 235717 -16804 162458 72543 -48907 -273495 19209
15772 -72737 -55381 13166 101147 -91969 -268033 134100 -71510 -87004 -70678 170439 92825
15761 92825 -201308 191880 -164461 -217752 -141971 -127077 326281 117140 -2929 -215917 -136004
15750 -136004 2193 8570 -118242 -178747 134382 19838 -115226 169673 -340 -82534 -100619
15739 -100619 -168068 215190 -21821 49916 166596 932 -170067 -123188 -129859 21863 11453
15728 11453 268385 -101425 101983 -60602 418905 -81657 -166441 139163 -168682 -292256
15718b92256B67517b10232N6515A92327a04800k15448N5087i2298l84478f1082
15707a70098c0024B71531n6125P1405a15494L6600o9280J4841B57871b44328e736
15695e240l91538m4215H3217e11826A44893F4923A9369J3713J96022a48699k33559
15684c82258B35986c06334B13649c24058C3035J93921n7030H1597A0311e4544
15673a07805C8450K0404r652a68856G6134q748J26b57500A3857a30221A89543
15661B9886a51759C92666A3343J92425K1981b7108j44128f1187G4929a90276A59975
15649a42383b7654j8781k58912a23218o562A01752a1902j39020k8292A06057k647
15638A03410b80544B5493b47781L6792K3702P1676m0796B19437c51385d2011j42566
$$ plain form
15718 -292256 267517 -210232 -153717 192327 -104800 -320248 -265161 -92298 -476776 -61082
15707 -170098 -30024 271531 215406 286811 -115494 -78894 -148174 -133333 257871 -244328 -5736
15695 -5240 -396778 -440993 83217 -511826 144893 64923 19369 33082 229104 -148699 -382258
15684 -382258 235986 -306334 213649 -324058 33035 226956 169926 81597 10311 -54544
15673 -107805 38450 58854 49202 -168856 76134 67386 67512 -257500 13857 -130221 189543
15661 29886 -151759 392666 13343 205768 227749 -27108 -171236 -61187 74929 -190276 159975
15649 -142383 -27654 -46435 -305347 -123218 -129780 101752 -11902 -150922 -179214 106057 103410
15638 103410 -280544 25493 -247781 -210989 -187287 -115611 -156407 219437 -351385 -42011 -184577
15627a84577f9901j45481q2458J32571H6574a29238a6366k6979G99b1837c03A69122
15614F8606a32737H6868a60863h0263A28008C928L08842E3688c3424A39343b96942
15602a65063q9504A16177D3208c6269A61492a54493A5894P9791f6501k33037j32808
15591d32346A404c25103m5501i9279H8842K23351i663j27956A06599a26184B5885
15579C0107J26807J41968r3972b02355B40443C4363D050f8691A62004E7061a07413
15567B45168K5b37305A7783a19420l1870A06569C5516P4242a82388f6233n1470
15556a17703A97150a85335O7799C93J75248l9457f852o7158C92755f7732A71870
15544a28014j37206J6925A82744f2299K2648l88831h8670o1389M7385p1667A16110
$$ plain form
15627 -184577 -69901 -215382 -297840 -165269 86574 -129238 -16366 -43345 799 -21837 -303 169122
15614 68606 -132737 86868 -160863 -80263 128008 3928 312770 53688 -33424 139343 -296942
15602 -165063 -254567 116177 43208 -36269 161492 -154493 15894 95685 -66501 -299538 -432346
15591 -432346 1404 -325103 -370604 -99279 88842 312193 -9663 -137619 106599 -126184 25885
15579 30107 156914 298882 204910 -202355 240443 34363 4050 -68691 162004 57061 -107413
15567 245168 245193 -237305 17783 -119420 -151290 106569 35516 109758 -182388 -66233 -117703
15556 -117703 197150 -185335 -117536 393 175641 136184 -6852 -74010 392755 -67732 171870
15544 -128014 -265220 -248295 182744 -62299 -39651 -428482 -88670 -150059 -102674 -174341 116110
15532E1987f9448k9426n8297J2675f0654C1731J82613b15860A8592a1770k74069
15521b85839H5686j208P0568a9497C7127i9066m1221n3868Q4660k23027a43515
15509b5589A27030B7646d0394A74078j6624K49356i1349B98694H7723Q2686F0972
15497a35380M1332B21748b91960a6158j17820G8216K34400j27188J35717j46139
15487A75006l3649k5004D9287J90413O0697e828j71116D0274b56430C67145q9459
15476B77686a05231A55838N3471J18042a1659j21758o7372A34527g7498I3054
15465B49073q0231l3908b25581d0557A66123K16893Q1813A03124M94378k10681
15455C86821j718j86733l5344N3056N9293q1510b3590B9753e5645k09958J09082
$$ plain form
15532 51987 -69448 -98874 -157171 -144496 -60654 31731 214344 -215860 18592 -11770 -285839
15521 -285839 85686 84478 155046 -19497 37127 -99066 -140287 -194155 -109495 -332522 -143515
15509 -25589 127030 27646 -40394 174078 157454 406810 -91349 298694 87723 170409 60972
15497 -135380 -94048 221748 -291960 -16158 -133978 78216 312616 185428 321145 175006
15487 175006 141357 116353 49287 239700 300397 -5828 -176944 40274 -256430 367145 277686
15476 277686 -105231 155838 209309 327351 -11659 -133417 -200789 134527 -77498 93054
15465 249073 168842 134934 -225581 -40557 166123 383016 464829 103124 597502 386821
15455 386821 385103 198370 163026 216082 275375 193865 -23590 29753 -55645 -265603 -156521
15444a56521C49973a36389e6942l30432A52396b25189A07566f53A73350E3687
15433C35162a29115J2958e3958A61137J42382M6536J18188A54056M81526O1256
15423F96838J69423n4465C69755p9737H3016J86955K7008c03046B15250a03560
15412B85188j07943f6387n6347I9854a77523N1006N1004o3939L2140L2815I2629
15400c00737J08634A28130R5558f0018A81247d9555A43905B4250J14422D5673
15389a20180j58872A40224d60795a68158B65510e2303j86049I1061J2247B4737
15378h2235B15062N8430b20117O6753N5071A92133d9784B54324A6824K1691Q0967
15367A19482k3147a22094G2720h2213b6351g014E42979F1216O294R7268J4269
$$ plain form
15444 -156521 349973 -136389 -56942 -387374 152396 -225189 107566 -653 173350 53687
15433 335162 -129115 -116157 -53958 161137 303519 350055 468243 154056 635582 696838
15423 696838 866261 811796 369755 290018 83016 269971 296979 -303046 215250 -103560
15412 285188 177245 -66387 -122734 99854 -177523 -126517 -75513 -139452 -107312 -74497 92629
15400 -300737 -192103 128130 223688 -60018 181247 -49555 143905 24250 138672 45673
15389 -120180 -279052 140224 -460795 -168158 265510 -52303 -238352 91061 103308 24737
15378 -82235 215062 273492 -220117 -153364 -98293 192133 -49784 254324 16824 38515 119482
15367 119482 96335 -122094 72720 -82213 -26351 -7014 542979 61216 67510 164778 179047
15356A79047a76061A50174J44746A4899J01851R4861a7363A28570J45496E5498
15345E2256a30002j45879E99645A21560J17427k0893I5685J09568F3152J30132
15335A93284F6509M0918k2735d2055A94160I2223l1462K43929I9937J22490L3744
15324B56171j01253J69288f2976c0325A04125f5831j2298A08900K9652N7082r0242
15313A05392J62076r6886j9209J99922n315G6090k9989J62341o1217i8888B52166
15301h8853j0247D6541J7739a7676r915I4556J08855g2835G8146R3755L17992
15290D89893a41402A88642a57962h232A44171P8508b13987H7980J27094e8147
15279h9013I4905g7100B595d8536j14269D3516P1840r485B8591I694O1018a72121
$$ plain form
15356 179047 -176061 150174 294920 14899 116750 211611 -17363 128570 274066 55498
15345 52256 -130002 -275881 599645 121560 238987 218094 95685 205253 63152 193284
15335 193284 66509 107427 84692 -42055 194160 92223 60761 304690 99937 222427 256171
15324 256171 154918 324206 -62976 -30325 104125 -65831 -78129 108900 138552 195634 105392
15313 105392 267468 170582 151373 351295 345980 76090 46101 208442 147225 -98888 252166
15301 -88853 -99100 46541 64280 -17676 -27591 94556 203411 -72835 78146 171901 489893
15290 489893 -141402 188642 -157962 -8232 144171 222679 -213987 87980 215074 -58147
15279 -89013 94905 -77100 2595 -48536 -162805 43516 115356 105871 28591 9694 70712 -172121
15266D8049h8456A20313D6054h7171C1258H149d040j47999k96251F305a10098
15254F6197J87029I2657a4593A77475j7165D4851M770a22814D3816i8474L5663
15243f2811A8536d5271B0844P7906P1393c05465C18451B1965J9869J92587H8251
15231B17698K02065L19137P13087J3935k65467L27108G52663C36196K0983q5098
15221B72081G1563B1982K47542a32862a4850A81284b50963A88492B8535J85715
15211B14250a34569N2262A85961C628P7101d1682A56969P3635f5195A7370a65353
15199h7696B08615O1345a73883A76196a05998G442K09935I1960D4361L85487a0016
15187B78297g331m8939j6096A00606e3178G8176j6051B3576K9661g8685G7677
$$ plain form
15266 48049 -88456 120313 46054 -87171 31258 8149 -4040 -152039 -448290 6305 -110098
15254 66197 253226 92657 -14593 177475 160310 44851 49621 -122814 43816 -98474 -62811
15243 -62811 18536 -45271 20844 98750 170143 -305465 318451 21965 41834 234421 88251
15231 217698 419763 738900 1451987 1465922 1200455 1527563 752663 336196 357179 272081
15221 272081 71563 21982 269524 -132862 -14850 181284 -250963 188492 28535 214250
15211 214250 -134569 -82307 185961 3628 80729 -41682 156969 230604 -65195 17370 -165353
15199 -87696 208615 269960 -173883 176196 -105998 7442 217377 91960 44361 429848 -10016
15187 278297 -7331 -56270 -72366 100606 -53178 78176 62125 23576 53237 -78685 77677
15175e9583k94277H9806L6030C4057g835B03169G8739L40991b81266D5780a0921
15163H6857O5439C7854b1333k7904E2318c6843A1166J62513O3545a05881r065
15152a14946B57984E1512i2697n8321E3433a6534E6669L62130F3301a77073j31979
15141c09052A06492K2326R6719F7489i8837B13422E9458a46669B00209a81424
15130a03163j04707B67329j24374K09050n0561q1241F6448J43407a33238A99125
15119B25250J95470B10266G0384b08650L0613A47403F0656L11881j78607r0739
15109A03191J65461r4502j4381a6087E4140M12560B27636k089J38500j50949n7826
15098A55272R1624g8285B39222j17187J17309b31275d8497B4605J95187J00554
$$ plain form
15175 -59583 -353860 89806 125836 34057 -7835 203169 78739 419730 -281266 45780 -10921
15163 86857 152296 37854 -21333 -49237 52318 -36843 11166 173679 237224 -105881 -114946
15152 -114946 257984 51512 -92697 -151018 53433 -16534 56669 418799 63301 -177073 -309052
15141 -309052 106492 128818 225537 67489 -98837 213422 59458 -146669 200209 -181424
15130 -103163 -207870 267329 142955 352005 301444 220203 66448 209855 -133238 199125
15119 225250 420720 210266 70384 -208650 -178037 147403 60656 372537 193930 103191
15109 103191 268652 174150 159769 -16087 54140 466700 227636 225547 364047 213098 155272
15098 155272 246896 -78285 239222 122035 239344 -231275 -48497 24605 219792 320346
15088C20346a25109A79464l1399J01140j14200b47323C79171p4821b43882e2687
15077G3540l2551b1632A3474L79113A0562E53J80978b15495A07487J86261d0552
15065C52963d3572a8692C83488f814B78407E6999K10664D0679L5797A222J26857
15054A28079J3180J57362D0714J67467r600e3327G2414K67956j21899I8882J53716
15043B52598f3701A67013J96872D4697J97259I7829D0860K61253q6029j6545l0210
15032A69329n493k8640J25802l3925N8100o1753J25916o168A65506j6648J37274
15021B86132n8643L49311B53520K15021k24672K7490K93552J2689Q8530k95834
15011C70296R7374j4972K7518J10681j53363k416J39945q3338A73873L00863j8078
$$ plain form
15088 320346 -125109 179464 148065 249205 135005 -247323 379171 304350 -243882 -52687
15077 73540 40989 -21632 13474 392587 10562 553 181531 -215495 107487 293748 -40552
15065 352963 -43572 -18692 383488 -6814 278407 56999 267663 40679 76476 1222 128079
15054 128079 141259 298621 40714 208181 198581 -53327 72414 340370 218471 98882 252598
15043 252598 -63701 167013 363885 44697 241956 97829 40860 302113 216084 199539 169329
15032 169329 163836 135196 260998 227073 285173 223420 349336 343168 165506 148858 286132
15021 286132 227489 576800 253520 468541 243869 271359 564911 577600 666130 370296
15011 370296 467670 452698 480216 590897 437534 435118 575063 491725 173873 474736 456658
15000D56658K23887B44761J4936e0960C00029J60956J21177B35697O3182J35877
14990D34756R2656j12296k9736B5982J59038a49744H9249R6390L46722A30015
14979E10902L1726j38738n8478B5691L44195j47100K44880J56601k18526j71970
14969B33771K16680O9646j81607K73830j68783L01391l4881m4289l04995A27282
14958C61002A56317M03665B61055K01167K44230B33474L50608k74677D4204L99238
14948D43442J00657B61540m7116K85119j95991m2728r0390J05968H8993K2251
14938A11244J06868K38768L9562A46975J28357J01806p5925A36587R3870K28831
14928D59288I3464J44444K89492q5227J31954J71237B30550K37098K07745C21457
$$ plain form
15000 456658 680545 244761 259697 -50960 300029 460985 582162 235697 298879 434756
14990 434756 527412 415116 385380 25982 185020 -149744 89249 185639 532361 130015
14979 510902 542628 403890 345412 25691 369886 222786 467666 624267 405741 233771
14969 233771 450451 520097 338490 612320 443537 744928 710047 665758 360763 127282
14958 361002 156317 559982 261055 462222 706452 233474 584082 309405 44204 443442
14948 443442 544099 261540 214424 499543 303552 260824 170434 276402 88993 111244
14938 111244 218112 456880 496442 146975 275332 377138 301213 136587 230457 459288
14928 459288 93464 237908 527400 442173 574127 745364 230550 467648 675393 321457
14917D28799j72319M44496B85567N67138j44855L91494j48697M03870L03177k26612
14907A431082m3445k28147K164M2849q5468K79931J4179O6804p3797j67117j09927
14896A129108j95137J48894m06399q0189k07896L37425B01158J32184K92199j29808
14886D95733B29537o6256K48944L24940B41818N7750k2984j05667E8358K77518
14876C35876K24404A04533M85541j39881j85705L32638n0405k08862K13752j47034
14866D04577L54702j41761j71040L249K61313j07226R4366j1907j33552B29538
14855B62181L59123B73575J03346J51433j1835j13683L39686k49808p995l5726
14845D48993k11555K45825l8120J30026A50838L84891B38247M78938C52113J82164
$$ plain form
14917 428799 256480 700976 285567 852705 707850 1099344 950647 1354517 1657694 1431082
14907 1431082 1387637 1159490 1161654 1204503 1119035 1398966 1413145 1479949 1406152 1239035 1129108
14896 1129108 933971 1082865 676466 596277 388381 725806 201158 333342 625541 495733
14886 495733 229537 163281 412225 737165 241818 299568 276584 170917 58358 335876
14876 335876 560280 104533 590074 450193 264488 597126 546721 337859 551611 404577
14866 404577 759279 617518 446478 449727 711040 603814 698180 686273 552721 229538
14855 262181 621304 273575 376921 528354 516519 402836 742522 492714 484719 448993
14845 448993 237438 483263 445143 575169 150838 535729 238247 717185 352113 534277
14835E34277k2340j5987j69227K45776j48599j95124O2505L13916J76974K60833
14825A043004m54874O59958l61077K57811j13590j23328k66434o4627j10052R1142
14815E57933m2149J49884q0993j25688K34262l30207J38696k4965N7645K9997
14805E64415K41916j79227j3580J07921m6254M3434I9036N90113j07693j24479
14795D56977M35799k98192l8423B76151M26202j25097N2286n0498n0435L13167
14785H41776k03043k3219O7621J48305k63061l6450p8315M9159j67688J43409
14775D78494O1166o474B10215r9034N23515o8397m3048L50930j96675J0099K65740
14764I53345B69432M92734p0897J02391k09670L1900P5387o3712K02562o1700
$$ plain form
14835 534277 511937 495950 326723 572499 423900 228776 291281 605197 782171 1043004
14825 1043004 588130 1248088 887011 1144822 1031232 907904 641470 576843 466791 557933
14815 557933 515784 665668 584675 458987 693249 363042 501738 476773 534418 564415
14805 564415 806331 627104 613524 721445 675191 718625 99036 689149 581456 456977
14795 456977 892776 594584 556161 276151 702353 577256 629542 579044 528609 841776
14785 841776 638733 615514 683135 831440 568379 531929 453614 502773 335085 478494
14775 478494 539660 533186 210215 111181 634696 566299 523251 874181 677506 687605 953345
14764 953345 269432 762166 691269 793660 583990 615890 691277 627565 830127 768427
14754G68427K2939l68796K19086J3644M6309k01214j70065K66011m9296j21153
14744D25892K021j50425J50415j4711J94713A77553P06174n0781j04459j34477
14734E94010j0426J19988j08658q2682J98415j93499J51032j96440L80690j46310
14724G06120J162p3990K48740C53262J96325m3885K70079B84426M16866M4462
14714G45754J91092L1492k05589M72545Q0212M5290j43042J31964j67364k84791
14704H97563K08814k94632R5012j73118J63422J57338k66452n9678R2648R1579
14694I12496J94370l93929P227M86312l84170k38798L92898K70387O2517k70416
14684A038894R3967N60213l03083k8521j67498J41435k92814K1541j90790M2973
$$ plain form
14754 768427 791366 422570 641656 655300 701609 500395 330330 596341 547045 425892
14744 425892 427913 277488 427903 413192 607905 177553 883727 832946 728487 594010
14734 594010 583584 703572 594914 512232 710647 517148 668180 471740 852430 706120
14724 706120 707282 633292 882032 353262 549587 505702 775781 284426 701292 745754
14714 745754 936846 968338 762749 1235294 1315506 1360796 1217754 1349718 1182354 897563
14704 897563 1106377 811745 906757 733639 897061 1054399 787947 728269 820917 912496
14694 912496 1106866 712937 720164 1206476 822306 583508 976406 1246793 1309310 1038894
14684 1038894 1132861 1693074 1389991 1361470 1193972 1335407 1042593 1064134 873344 916317
14674I16317K06242k96634M0726l9859J00058j28686J01512K05835m34704Q6075
14664G56882p0504P9542J00323O7019J3571D72769N30059Q2486j06268l08644
14654F70402K17889K09257K83734j28708l70025j03364j15045L83440J13746M417
14644A165743j70879m23855O43902j56172P6722L10397m55322J52731L7022J33228
14634A313517m70900M22761l0067l47171J20964J83202p1305j36149N8872J52069
14624A195793m26781M46471J39296l58444P7389M79781k40413n36250J73249K86964
14614A237055l0273k20110M26890m99954K48019J56912k6436j84467o9184K42474
14604A280926k03113M35475l99041o0766L60972k40037M7746M2694k26046L14598
$$ plain form
14674 916317 1122559 825925 866651 826792 926850 798164 899676 1105511 670807 756882
14664 756882 686378 765920 866243 933262 946833 472769 1002828 1085314 979046 670402
14654 670402 888291 1097548 1381282 1252574 882549 779185 664140 1047580 1161326 1165743
14644 1165743 994864 571009 1214911 1058739 1135461 1445858 990536 1143267 1180289 1313517
14634 1313517 842617 1265378 1235311 888140 1009104 1192306 1121001 984852 1043724 1195793
14624 1195793 769012 1215483 1354779 996335 1073724 1553505 1313092 776842 950091 1237055
14614 1237055 1206782 986672 1413562 913608 1161627 1318539 1292103 1107636 1038452 1280926
14604 1280926 1077813 1513288 1114247 1053481 1414453 1174416 1222162 1264856 1038810 1353408
14594A353408j58873L3013J63265j7178k19487L85354j3573l27902L10332l27625
14584A180734K96625j24372N1058P8478L3844M80628o47961J57761j01258L80999
14574A786536m08243k6008N20935l85055K8555K36981j55101L26702n31571L1369
14564A425100k8863N7787L84250r6601o516r9208K38943K98980l91970K25610
14554B007512k74372j25280M61946k08671K55872n1353J50436N57079l79972J90649
14544B583846J33800j06334M71555j98672L29190N30714M23988Q93938M26794
14535E488819R14589K704777M219714O427662R608291j422856j1287371o020448
14527A0633177l803876j785064k23538O10608j297877r44900o39048k87531L08497
$$ plain form
14594 1353408 1194535 1227548 1390813 1373635 1154148 1539502 1525929 1198027 1508359 1180734
14584 1180734 1477359 1352987 1404045 1482523 1516367 1996995 1349034 1506795 1405537 1786536
14574 1786536 1378293 1352285 1873220 1488165 1516720 1753701 1598600 1925302 1393731 1425100
14564 1425100 1396237 1454024 1838274 1741673 1735157 1635949 1874892 2173872 1781902 2007512
14554 2007512 1733140 1607860 2069806 1861135 2117007 2065654 2216090 2773169 2393197 2583846
14544 2583846 2717646 2611312 3082867 2884195 3213385 3744099 4168087 5062025 5488819
14535 5488819 6403408 9108185 13327899 19755561 29363852 27940996 16653625 10633177
14527 10633177 6829301 5044237 4820699 5431307 4133430 3188530 2549482 2261951 2570448
14518B570448o61206K14702P3776j84993q2809l2712M03442k84605K60910j18028
14508B158925q6647p6093J05734J85961k48508j66770N89311J59010j43715l38483
14498B138725L67103o4124j9465J60911j09480j60307K1998L6501K34313M9692
14488B655867j24486L6086L26028N323j48455L30045m30910K55930j42280M25900
14478C189048K4833j42607J07923m44777K02220j8936P4881J25329L29755o5142
14468C382527k71043q9078M8070K82790M4175m5501J27329L11579j4423m05506
14458C370919M55032o5855k18593Q86M70481J26730l19401J42143K66819j42830
14448D086331p8686J29562r8377N05434j52517j44911L37322l01231O37881m90440
$$ plain form
14518 2570448 1909242 2123944 2197720 2012727 1929918 1897206 2300648 2016043 2276953 2158925
14508 2158925 2072278 1996185 2101919 2287880 2039372 1872602 2461913 2620923 2477208 2138725
14498 2138725 2505828 2441704 2422239 2583150 2473670 2313363 2335361 2371862 2606175 2655867
14488 2655867 2531381 2567467 2893495 2898818 2750363 3080408 2649498 2905428 2763148 3189048
14478 3189048 3213881 3071274 3179197 2734420 2936640 2917704 2992585 3117914 3447669 3382527
14468 3382527 3111484 3022406 3070476 3353266 3397441 3351940 3479269 3790848 3776425 3370919
14458 3370919 3825951 3760096 3541503 3542389 4012870 4139600 3820199 3962342 4229161 4086331
14448 4086331 4007645 4137207 4038830 4544264 4391747 4246836 4584158 4282927 4920808 4430368
14438D430368j40362j25476M71463K22598O1379j47052N49848k91426J10871J3535
14428E155746R612J85366K45j2071R483L59764j62897K71654m1535l4592J71921
14417E912696M8204J97984N3604j41249M18409P0602j50308L01919M28484n15539
14407F624806O59861k37400J68582J06208L10270K42267q1281L09960l0014K52780
14397H326039j96601J39531N1717K39975o8025K64824J26189Q5742R6894K25392
14387I291677K79960K44893j60450K50597R9960K51353J51127p0073K97785j40116
14377A0496713J69283M31827J22354k2712O91421J08447O4239J53603M12564K2224
14367A2649963K61778J12663N19457M74507k09619R79898k18386N13083p0484
$$ plain form
14438 4430368 4290006 4164530 4635993 4858591 4919970 4772918 5322766 5031340 5142211 5155746
14428 5155746 5165358 5350724 5350969 5338898 5348381 5708145 5545248 5816902 5775367 5740775 5912696
14417 5912696 5960900 6158884 6212488 6071239 6489648 6560250 6409942 6711861 7140345 6624806
14407 6624806 7284667 7047267 7215849 7322057 7632327 7874594 7793313 8103273 8073259 8326039
14397 8326039 8129438 8268969 8320686 8560661 8492636 8757460 8883649 8969391 9066285 9291677
14387 9291677 9571637 9816530 9656080 9906677 10006637 10257990 10409117 10339044 10636829 10496713
14377 10496713 10665996 11097823 11220177 11197465 11888886 11997333 12061572 12215175 12627739 12649963
14367 12649963 12911741 13024404 13543861 14018368 13808749 14788647 14570261 15083344 15012860
14358A5012860j17635Q71983P9171K98584M16959J75709L89093L87480K54265
14349A7768469N30889N65413M39177L18536K54505Q08235M13333L61058L87169
14340B1846784N81253M91540L88068L56469Q49746N13035R68630Q51281L81881
14331B7228687L63645Q89331J032409O43784J211508M01170Q80461J016810J022324
14322C4690129P11535J274385R71898J275000J074555J619904R08658J713409
14314D4239473J480808J282669J621495J906113J377421J878302K035328K189121
14306E8010730K062442K019505K638554K351745K681615K099655L332452L331933
14298G8528631K939264L663839L312915L636632M430061M573541M585488M747543
$$ plain form
14358 15012860 14895225 15767208 15846379 16144963 16561922 16737631 17126724 17514204 17768469
14349 17768469 18299358 18864771 19303948 19622484 19876989 20685224 21098557 21459615 21846784
14340 21846784 22428037 22919577 23307645 23664114 24513860 25026895 25995525 26846806 27228687
14331 27228687 27592332 28481663 29514072 30157856 31369364 31770534 32650995 33667805 34690129
14322 34690129 35401664 36676049 37647947 38922947 39997502 41617406 42526064 44239473
14314 44239473 45720281 47002950 48624445 50530558 51907979 53786281 55821609 58010730
14306 58010730 60073172 62092677 64731231 67082976 69764591 71864246 75196698 78528631
14298 78528631 81467895 85131734 88444649 92081281 96511342 101084883 105670371 110417914
14290A10417914N375024N789262O320313O183942O898363P368111P462694Q380502
14282A64196125Q564421R293514R738882J0777059J1254125J1690546J2438093
14275B37952765J3003036J3787823J4127358J4060969J5148433J4935122J5311879
14268C38327385J4852366J4905598J3952434J3171727J2176633J1598005J0369606
14261D29353754R060867Q903775P628419N030961J202208n12559K98918m627377
14253D56338966q420121p219363p584936j2856589j3094694j3595625j4363371
14246C79204267j4343585j5242451j4736873j4917527j4612113j4339197j4154960
14239B76857561j3498905j2723220j2511880j1683220j0642860j1475726j1016675
$$ plain form
14290 110417914 115792938 121582200 127902513 134086455 140984818 148352929 155815623 164196125
14282 164196125 172760546 182054060 191792942 202570001 213824126 225514672 237952765
14275 237952765 250955801 264743624 278870982 292931951 308080384 323015506 338327385
14268 338327385 353179751 368085349 382037783 395209510 407386143 418984148 429353754
14261 429353754 438414621 447318396 454946815 459977776 461179984 460667425 460966343 456338966
14253 456338966 447918845 440699482 433114546 420257957 407163263 393567638 379204267
14246 379204267 364860682 349618231 334881358 319963831 305351718 291012521 276857561
14239 276857561 263358656 250635436 238123556 226440336 215797476 204321750 193305075
14232A93305075j0783797r716094q989045q309770p845650p527877o571875o542246
14224A27018721n915246n685808n227829m956958m703004m382460m013403m024200
14216H8109813l576399l231687l510471l021375k934486k772526k554175k522674
14208F3986020k468215k044486j988107k099030j973521j708302j870235j591527
14200D8242597j193682j763180r84040j318614j336588j764984q52435r14764
14192C8114310j024115q74704j300315j067048p46782j217914m21003p40462j129093
14183B9592874p51381p24292q83507o62615k03769j149859m31073n59983p25797
14174B3500598k50107q10365o09710m17918m98507n90517m15461k42741q59077
$$ plain form
14232 193305075 182521278 172805184 163816139 155506369 147660719 140132842 133560967 127018721
14224 127018721 121103475 115417667 110189838 105232880 100529876 96147416 92134013 88109813
14216 88109813 84533414 81301727 77791256 74769881 71835395 69062869 66508694 63986020
14208 63986020 61517805 59473319 57485212 55386182 53412661 51704359 49834124 48242597
14200 48242597 47048915 45285735 44301695 42983081 41646493 39881509 39029074 38114310
14192 38114310 37090195 36215491 34915176 33848128 33101346 31883432 31462429 30721967 29592874
14183 29592874 28841493 28117201 27233694 26571079 26367310 25217451 24786378 24226395 23500598
14174 23500598 23250491 22440126 21830416 21412498 20913991 20323474 19908013 19665272 18806195
14165A8806195n1877n7626p59704k67394n83560j63672j82015k93789p08028k33970
14155A5504560j99066l28476j84769l27011k42126m69440M6150l01367l94593
14146A3103862m9267k76212j4564m02225l53618Q0949p06412N1960l68809k41493
14136A0824171l69156J93390k92227l16551K26151l16613R6007l61372O3822m07275
14126I340347P5356j22792k66609j95450k71990K70607j3186k45052j48513p6428
14116H346290k23587m15774J27898j69288k11145j34008j41291J0713Q2033q0525
14106G191316l26410L51861l66800j02960P3708l80025j86990K94357p0877J83671
14096F660851m99439k29962N8378R765l32294j8878M01155n72296K71818m33441
$$ plain form
14165 18806195 18754318 18696692 17936988 17669594 17086034 16922362 16740347 16446558 15738530 15504560
14155 15504560 15305494 14977018 14792249 14465238 14223112 13753672 13799822 13498455 13103862
14146 13103862 13054595 12778383 12763819 12361594 12007976 12088925 11382513 11434473 11065664 10824171
14136 10824171 10455015 10648405 10356178 10039627 10265778 9949165 10045172 9683800 9747622 9340347
14126 9340347 9415703 9292911 9026302 8830852 8558862 8829469 8816283 8571231 8422718 8346290
14116 8346290 8122703 7706929 7834827 7665539 7454394 7320386 7179095 7189808 7271841 7191316
14106 7191316 6864906 7216767 6849967 6747007 6820715 6440690 6253700 6548057 6477180 6660851
14096 6660851 6161412 5931450 5989828 5999593 5667299 5648421 6049576 5477280 5749098 5315657
14086E315657J6992k97903N58106j90652m15267K31471n92440L06179l969K52629
14076E180803m60215J55016l39783J42806J37777L0772n32088L59781m52154L68016
14066D590731k65809j90898Q2512l070L4593L6556J39083m28182J05163k97795
14056C802884J50508j13485J67694k55597J73342k31680r9606K93377J26873l02190
14046C712120m55080N02267l04181K49703j58564K23504j13436j60591k89628
14037C206114o1498j02513J60082k34447j82290M33183j52309k9927j86989k47298
14027B602108M46330m9341k31371K40949k22969K912j3779j61844M28213l03367
14017B737841K01149k21033J42242R7019l27651J19745O1304j59738j07466l4031
$$ plain form
14086 5315657 5332649 5034746 5592852 5402200 4986933 5218404 4625964 4932143 4928174 5180803
14076 5180803 4720588 4875604 4535821 4678627 4816404 4847176 4315088 4674869 4222715 4590731
14066 4590731 4324922 4134024 4216536 4213466 4248059 4284615 4423698 3995516 4100679 3802884
14056 3802884 3953392 3839907 4007601 3752004 3925346 3693666 3594060 3887437 4014310 3712120
14046 3712120 3257040 3759307 3455126 3704829 3546265 3769769 3656333 3495742 3206114
14037 3206114 3144616 3042103 3202185 2967738 2785448 3218631 3066322 3036395 2849406 2602108
14027 2602108 3048438 2999097 2767726 3008675 2785706 2788618 2774839 2612995 3041208 2737841
14017 2737841 2938990 2717957 2860199 2957218 2629567 2749312 2810616 2650878 2543412 2509381
14007B509381j8835k11325J11198k62316N2264M65093P5420m31195j46503L59229
13997B502411l83135l28193J67712J52434J24784n79804K84903L79049k65278
13988B054883j91959J21053K26926o7226J22648l09006J67025j3652O37001J0980
13978B758673N6365L06325M49055O54209J602030L592143N639994J0146422M571494
13969B9776710r343355p065918m107769k345371j491142q59903m53279m77028
13961C632945n44011M5225k25789j96142j03538K3559k95468n3910q5577J0963
13951B208257k10979J65925k91710L18408J88134n86944j94102N75591p54908
13942A417672L50213q7404L26676n16726p053L30683j81277K22942k8443k78542
$$ plain form
14007 2509381 2490546 2279221 2390419 2128103 2180367 2645460 2720880 2289685 2143182 2502411
13997 2502411 2119276 1791083 1958795 2111229 2236013 1656209 1941112 2320161 2054883
13988 2054883 1862924 1983977 2210903 2143677 2266325 1957319 2124344 2110692 2747693 2758673
13978 2758673 2815038 3121363 3570418 4224627 5826657 9418800 15058794 25205216 29776710
13969 29776710 20433355 13367437 9259668 6914297 5423155 4563252 4109973 3632945
13961 3632945 3088934 3134159 2908370 2712228 2608690 2632249 2336781 2282871 2197294 2208257
13951 2208257 1997278 2163203 1871493 2189901 2378035 1791091 1596989 2172580 1417672
13942 1417672 1767885 1680481 2007157 1490431 1483378 1814061 1632784 1855726 1827283 1548741
13932A548741K03375m6425j96844K39481m6768J41603k99761J50425N1990j57683
13922A588134m11355K80680J44699l4858j40693j77173L35272n1450j93606P6952
13912A416602j68470J52663J63072r6958j56380J51495q3670P4279K05001l83906
13902A273728O5994P4844j74110m8726o5889J06644j33128K2848J38429J73285
13892A433919l21328L30360l84645J78011J12691n7696m53467L41045r3346m13318
13882F72226N27898j47441K3585L4821P6251K02979j73966Q7672k77000k51456
13872G75569N57486m00802J46841J21934k27565J7373R0181K15254n82301O42087
13862A356057m13110J87844k55698m7796K82438k72320K94699k20472M834K08687
$$ plain form
13932 1548741 1752116 1705691 1508847 1748328 1701560 1843163 1543402 1693827 1745817 1588134
13922 1588134 1176779 1457459 1602158 1567300 1426607 1249434 1584706 1533256 1339650 1416602
13912 1416602 1248132 1400795 1563867 1466909 1310529 1462024 1378354 1452633 1657634 1273728
13902 1273728 1339722 1414566 1240456 1191730 1125841 1232485 1099357 1122205 1260634 1433919
13892 1433919 1112591 1442951 1058306 1236317 1349008 1291312 837845 1178890 1085544 672226
13882 672226 1200124 1052683 1076268 1111089 1187340 1390319 1216353 1304025 1027025 775569
13872 775569 1333055 932253 1079094 1201028 973463 990836 1081017 1296271 713970 1356057
13862 1356057 942947 1130791 875093 827297 1109735 837415 1132114 911642 916476 1125163
13852A125163m10708k1706j24820L50434k87439M45265j20908j06535J38040n0958
13842I35828p5084P1293m0811k21999J17847K3452K38936n9721k33134O7048K19718
13831A043373j38340l5560j70562J54755j16946j88830K71036p95J13659q9739
13821H42051N244l8111N2156j51305L24035k64841L19457l85550K60669k50069
13811G13736J58754J24583l67462J79571M7420q0510p9863K04195k19432M9957
13801G30949K26252j6188k24582J62055D04657M49787k01559J7788K90817J14811
13791A076301k47121J1670j69268J33830J7774r3973J27086l47137r0203R1367
13781E10326R1631N1134H0900N62733p9642K32566Q1625k06564P924j426k48992
$$ plain form
13852 1125163 714455 692749 567929 918363 630924 1076189 955281 848746 986786 935828
13842 935828 860744 932037 891226 669227 787074 810526 1049462 989741 756607 823655 1043373
13831 1043373 905033 869473 698911 853666 736720 547890 818926 818131 931790 842051
13821 842051 847295 809184 861340 710035 1034070 769229 1088686 703136 963805 713736
13811 713736 872490 997073 629611 809182 856602 776092 696229 900424 680992 730949
13801 730949 957201 941013 716431 878486 404657 854444 652885 670673 961490 1076301
13791 1076301 829180 840850 671582 805412 823186 729213 856299 509162 418959 510326
13781 510326 601957 653091 80900 643633 563991 796557 878182 671618 679542 678116 429124
13770D29124K51723K5628j28558J11974M9658J53063l37911k0455L9472J36881
13760G10599M8313o5289j71665j61443O04408l65785K44070C98242L06053k11202
13750D93093K0970J21758L15998l24461j26906K61996k28570K35422k13092q1583
13740D74625o6169K92472L2549j44042k34440L33253J39416k69928j0279k67155
13730B80302J68160Q103K56725l51605J37228J80763k06482K71680j91129j68031
13720C85714K8904R6537J28886J05880C32051A33821O05464j87730n4988j25946
13710C70621K24224k66938J92421J61905C33664j38261J52142L02755l8064l9680
13700E72556r633k36787j57783O05188C83700q5275N07125k61900J74320k71944
$$ plain form
13770 429124 680847 706475 577917 689891 739549 892612 554701 534246 573718 710599
13760 710599 758912 693623 521958 360515 964923 599138 843208 398242 704295 493093
13750 493093 514063 635821 951819 627358 500452 762448 533878 769300 556208 474625
13740 474625 408456 700928 733477 589435 354995 688248 827664 557736 547457 280302
13730 280302 448462 456565 713290 361685 498913 679676 473194 744874 553745 385714
13720 385714 414618 511155 640041 745921 332051 133821 739285 551555 496567 370621
13710 370621 594845 327907 520328 682233 333664 195403 347545 650300 612236 572556
13700 572556 562923 326136 168353 773541 383700 298425 805550 543650 717970 446026
13690D46026N4989J34943k27448o3222J91218k5104j53853N0109F7096Q3679J27180
13679B77955J21807J04662m9201J86640k79734Q0207K6176j15896j61011J97930
13669C89535n7553K60952r6556A39933K91688J4611n4785l8009G0739J23738J94483
13658C88960j29240J91931r4740J56630m1153j58269L47194A41876K35210K26138
13648F03224k90981K04896o8424K5313k00827Q4543l7047Q8893K0550j0234P5067
13637D94973J71355A82890K50389j79671R6388j05834K92480k36055J72831j33079
13627C40339O8164j70068a5694H6919M83398B52369j878K3909L37126A17204J54931
13616B72135l4947J38534P8452r7039G0795L85488N0528k28218M8415j50438J56697
$$ plain form
13690 446026 501015 635958 408510 345288 536506 511402 357549 407658 67096 150775 277955
13679 277955 399762 504424 455223 641863 362129 442336 468512 352616 191605 389535
13669 389535 331982 592934 496378 139933 431621 446232 391447 353438 70739 194477 388960
13658 388960 259720 451651 356911 513541 472388 314119 661313 141876 377086 603224
13648 603224 312243 517139 448715 474028 273201 357744 320697 409590 430140 419906 494973
13637 494973 666328 182890 433279 253608 349996 244162 536642 300587 473418 340339
13627 340339 408503 238435 -15694 86919 570317 252369 250491 274400 611526 117204 272135
13616 272135 237188 375722 454174 357135 70795 456283 506811 278593 327008 176570 333267
13605C33267j05985m1507L96755M3193M1672j42504J3749j94035O1046r7301L52777
13594F61127A83528M7306j6347C5239L55889j56232K24912D3898K73166K7988
13584C45052K65635j37279A44459K14247J82698l534B20857H8548A8513K65318
13574B83831a5030C62505j45197k50K14895J48024B86888A9633M87736A74646
13563F3169L54521A25150L39525k04517J51997l8763K40365k48560R9214j11329
13553C53082J13180A23307n7343L8905Q1721a04703D45764r0423D0443L15662
13543C56105A21012K17572M6419J74843k15720L7379Q037r2321K4442q4497a42139
13531A30966K83603A01904c0245A64609J48594J83202A75936J01653L8849H0722
$$ plain form
13605 333267 227282 185775 582530 625723 667395 524891 538640 344605 405651 308350 661127
13594 661127 183528 230834 214487 35239 391128 234896 459808 43898 317064 345052
13584 345052 610687 473408 144459 358706 541404 537870 220857 88548 18513 283831
13574 283831 -15030 362505 217308 217058 431953 579977 286888 19633 507369 174646
13563 63169 417690 125150 464675 260158 412155 373392 613757 365197 464411 353082
13553 353082 466262 123307 65964 104869 186590 -104703 445764 355341 40443 356105
13543 356105 121012 338584 385003 559846 344126 381505 389542 297221 321663 237166 -142139
13531 130966 414569 101904 -30245 164609 313203 496405 175936 277589 316438 80722
13520A55465J78426j06288G7264O187K30343J86357B45044j08507Q2687J05214
13510C24438J77689J369A72605D8739L30618h6806h164C02352I6344j9447a45313
13498A44975L00623j20470j19374L581J04275Q0351j66173q6221J76513J48897
13488D66977A87514m8804a4609B46702J50085A01739J76891j23958J62872p663
13478C09881A32259J35082o4767N4379L51970a22525B46017G437J90143M3625
13468B41205a44168B62131P2041a26042A44047b52502D98223j36835k651A07631
13457b20037D90774k22970p4798M9377n5282G941J85215L2468a49845F8567L16374
13446C84941m1072N3975p9882a0834C37068K28886C7475K3527A835K02922m396
$$ plain form
13520 155465 333891 227603 77264 83451 313794 500151 245044 136537 219224 324438
13510 324438 502127 503496 172605 48739 379357 -86806 -8164 302352 96344 76897 -145313
13498 144975 445598 325128 205754 209335 313610 393961 227788 141567 318080 466977
13488 466977 187514 138710 -14609 246702 396787 101739 278630 154672 317544 309881
13478 309881 132259 267341 202574 256953 608923 -122525 246017 7437 197580 241205
13468 241205 -144168 262131 334172 -126042 144047 -252502 498223 361388 358737 107631
13457 -220037 490774 267804 193006 242383 187101 7941 193156 225624 -149845 68567 384941
13446 384941 343869 397844 317962 -10834 337068 565954 37475 61002 1835 204757 200361
13435B00361N8379k3281N0524K8968b6116A44731L7779M5217A7859J78421a50270
13423C75183e1350F2610J57144l8595F6101N4405a28809c3230A16189Q8670R9211
13412C04070l6851h2850B25964e6912D10638A22313A6789J33569l4006l9283K66702
13401C43771M3156b18102D80894d5419a5095A23882l7264k772J38502j7914c55433
13389A12110D7651J97632j158A4155J72390n9581K46009A22066c2886j3574B86119
13377A22428C3569L75053H0880g3508A78806K19069A53839j7665J63375q4166
13367B15383O8131B4067J12554A7653M42708o5946c4442D8115k935J61215a1833
13355E6088J72750F3315a48821B28768j02795J31826H9744R4678L44782A41144
$$ plain form
13435 200361 258740 235459 285983 314951 -26116 144731 182510 227727 17859 196280 -150270
13423 375183 -51350 62610 219754 181159 66101 120506 -128809 -33230 116189 204859 304070
13412 304070 267219 -82850 225964 -56912 410638 122313 16789 150358 116352 77069 343771
13401 343771 386927 -218102 480894 -45419 -15095 123882 86618 83846 222348 204434 -355433
13389 112110 47651 245283 244125 14155 186545 126964 372973 122066 -32886 -46460 286119
13377 122428 33569 408622 80880 -73508 178806 397875 153839 136174 299549 215383
13367 215383 283514 24067 136621 17653 460361 394415 -34442 48115 45180 206395 -11833
13355 56088 228838 63315 -148821 228768 125973 257799 89744 184422 529204 141144
13344B90401P9386I9501A4245O3980B2061K3563K30772j31293J53013A06124J52015
13333B58139a91357A05358J33411J46839H1819J10712F4373K30575L47556A55554
13322I1649K73458J38785A73953g7432C25627J42503G7157b2460B35573K5779
13312B61352M1669j6061a2103C19991A04653k4519J4028J03286O2292L08945A39980
13300a7334A59805k7858n3795B7714g1309A99497F2268L22023a0959A75786f8746
13288e068D4199J36181L7553Q2875B3824M880J59753J9291M8559f2701A12519
13276B57804B6330K28767K9574L6298j25003p1884J2716J79137k408A32243Q0183
13265B12426m9363l2428J7160K144j1339A1360c690B04757Q2577j35892J07537
$$ plain form
13344 290401 369787 99501 14245 78225 22061 45624 276396 145103 298116 106124 258139
13333 258139 -191357 105358 238769 385608 81819 192531 64373 294948 642504 155554
13322 91649 365107 503892 173953 -77432 325627 468130 77157 -22460 235573 261352
13312 261352 303021 286960 -12103 319991 104653 80134 94162 197448 259740 568685 139980
13300 -17334 159805 131947 78152 27714 -71309 199497 62268 384291 -10959 175786 -68746
13288 -5068 44199 180380 217933 300808 23824 28704 188457 207748 256307 -62701 112519
13276 257804 26330 255097 284671 320969 195966 124082 136798 315935 313527 132243 212426
13265 212426 163063 130635 147795 149939 138600 11360 -3690 204757 287334 151442 258979
13254B58979K06125j66203j18811r688M4114a14794B5988F729J08108R475a35325
13242A89579a90959I4802L70303d3846D2730M3316J83284b14095g1671R096B78195
13230A32059c6016A74597k133c84m3837B4893e513B48864E2624L56517I1591j3705
13218G7886K13937f8694G6731P2218b22092E0613J18263N8440Q6478q7693m3791
13207A82310a25845E2802i7239A36788a36721j0496A24940J42148a7868A26725
13196A61887C060Q7092J74104Q8717g2645r4943j9162A83830j8263b11080P7647
13185a33433I0745a29654A55954i9578E0090b20166A77706M1644a698A46358N0067
13174A96425d06343d5526A66508J15577I7697a3507j97266A29284L7891m9385
$$ plain form
13254 258979 465104 298901 180090 170402 214516 -114794 25988 6729 114837 124312 -135325
13242 189579 -190959 94802 465105 -43846 42730 86046 269330 -214095 -71671 -62575 278195
13230 132059 -36016 174597 172464 -384 -44221 24893 -5513 248864 52624 409141 91591 77886
13218 77886 291823 -68694 76731 148949 -222092 50613 168876 227316 313794 226101 182310
13207 182310 -125845 52802 -97239 136788 -136721 -147217 124940 267088 -17868 126725
13196 161887 3060 90152 264256 352973 -72645 -167588 -186750 183830 165567 -211080 -133433
13185 -133433 90745 -129654 155954 -99578 50090 -220166 177706 219350 -1698 146358 196425
13174 196425 -406343 -45526 166508 282085 97697 -13507 -210773 129284 167175 117790
13164A17790Q4413e6335C05782i0668A83977m4742a62114A30024h7911A88509
13153A47796A2950a31813B72558p3092Q2405F996J98116a23763B61442A6838L7073
13142E3911K4562a64971K3409e4092o9519b4704B50707J63522b14100m014m3389
13131b61503B51100f1324D1913a63883K1150I7671N3375p1866K599a4526k06201
13120b20727I2553a1861E0801R8975f9433c885j53454A17884d9217A27041m6366
13109H0675b25728e323D52847E4816a00507j17284A90666b14309a9642G1928C0392
13097b04729A24197a20453B72142h050A92195F2050a25544N8117B37249F7665
13086d06357B3962K90030j05749D6002J80445G0018b10284a02767G573N1416K80013
$$ plain form
13164 117790 202203 -56335 305782 -90668 183977 139235 -162114 130024 -87911 188509
13153 147796 12950 -131813 272558 199466 281871 6996 205112 -123763 261442 16838 53911
13142 53911 78473 -164971 -141562 -54092 -123611 -24704 250707 414229 -214100 -218114 -261503
13131 -261503 251100 -61324 41913 -163883 -142733 97671 151046 79180 81779 -14526 -220727
13120 -220727 92553 -11861 50801 149776 -69433 -3885 -157339 117884 -49217 127041 80675
13109 80675 -225728 -5323 452847 54816 -100507 -217791 190666 -214309 -19642 71928 30392
13097 -204729 124197 -120453 272142 -8050 192195 62050 -125544 -67427 237249 67665
13086 -406357 23962 313992 208243 46002 226447 70018 -210284 -102767 7573 58989 339002
13075C39002G0297b27426A13936I783b13271c7228F8998L0631a39547D59773f4281
13063B07256a83099a0080B40750m2471F7537N432K52289b66888B17417k3467b9789
13051g0327l4162A17834J52711a76581A03527d9261J7555a2704B06102e2657A89199
13039B5988e7044I3899J97591a34306D2062J16469a97990D11371a25446d8467
13028H1434b16892M4444b9761A66672M2199G6213J91508D0013i3176I917J06592
13017A16509O4638e9670o78k18627A1782f8987L280b534k2777A91889k1842K25302
13005C95349A62471n5542J2738b53349C9572N2577b72607B61889d4475B56974
12994A64571N8509I5411Q8778o9384k1352M9506J72323D6897J03499b64941B53030
$$ plain form
13075 339002 70297 -227426 113936 9783 -213271 -37228 68998 99629 -139547 459773 -64281
13063 207256 -183099 -10080 240750 198279 67537 72969 325258 -266888 217417 193950 -29789
13051 -70327 -104489 117834 270545 -176581 103527 -49261 -31706 -12704 206102 -52657 189199
13039 25988 -57044 93899 291490 -134306 42062 158531 -197990 411371 -125446 -48467
13028 81434 -216892 -172448 -29761 166672 208871 76213 267721 40013 -93176 9917 116509
13017 116509 181147 -59670 -60348 -278975 11782 -68987 -65707 -2534 -25311 191889 170047 395349
13005 395349 162471 106929 119667 -253349 39572 92149 -272607 261889 -44475 256974
12994 164571 223080 95411 184189 114805 93453 142959 315282 46897 150396 -264941 253030
12982A48152P9684c0115C18990A18328N449k9370a63056o5962a9304E0497J60335
12971B10832a56045F588P7278c5968j702A03985M0240a44730O0795K8739F01R3776
12959I4377j3685g3431k76581f9740q5409g2764C4675K10934E9430p489d1498
12947a13909B15016C6910K77149a68658c811B92812a00014B96223E3722f7435
12936I1963e4899A42670j8174J04553k167R7572C6091d03070A19568a18155B40669
12924a59121r3999N7365A25302c22377H5285H103O4058b36450G9422J6489j1035
12913H4876J75801i4013A81902l3564n0591a38171k92419B17593p2501a32407
12902A67180R1457g8361f225D24179h9781I034J6957i6793i947E2122a26161E8528
$$ plain form
12982 148152 227836 -30115 318990 118328 123777 94407 -163056 -229018 -19304 50497 210832
12971 210832 -156045 6588 83866 -35968 -37670 103985 144225 -144730 -83935 -55196 601 94377
12959 94377 80692 -73431 -350012 -69740 -155149 -72764 34675 245609 59430 51941 -41498
12947 -113909 215016 36910 314059 -168658 -3811 292812 -100014 296223 53722 -67435
12936 91963 -54899 142670 124496 229049 226882 324454 36091 -403070 119568 -118155 240669
12924 -159121 -253120 -195755 125302 -322377 85285 8103 72161 -236450 79422 95911 84876
12913 84876 260677 -94013 181902 148338 97747 -138171 -430590 217593 145092 -132407
12902 167180 258637 -78361 -6225 424179 -89781 9034 25991 -96793 -9947 52122 -126161 58528
12889a51542K4933N8539A39238a33651A90183N3338e3103A02116D9210e407A78733
12877a42497P0324j88809F6323a35894q676N6466p4477d2604F3373b36997A87028
12865F394c0780q9862A34356k4958A0533J0639a084j53871D6749h8137K2869k34257
12853b99525h3118I7039f8323c0422M111p5547j07270M0396A92840H6466J25294
12842B11760j2923b19455b8533q5568G2486b72921F6464K13466A17377k1516f6187
12830A80435a27439p4284A75721H3179d79170I8861C2523a74114A91722e591A33481
12818d2037A06908a22705B1995b81173i7650B68532H498i438A13675N5554F7520
12806h8009A48496b9786I7183M6665O9968I2258e3211j17139K6440j83781h807
$$ plain form
12889 -151542 -126609 -68070 139238 -133651 190183 243521 -53103 102116 49210 -5407 178733
12877 -142497 -72173 -260982 66323 -135894 -144570 -88104 -162581 -42604 63373 -236997 187028
12865 6394 -30780 -120642 134356 109398 10533 21172 -1084 -154955 46749 -88137 -65268 -299525
12853 -299525 -83118 97039 -68323 -30422 -26311 -101858 -209128 -168732 192840 86466 211760
12842 211760 198837 -219455 -28533 -114101 72486 -272921 66464 279930 117377 95861 -66187
12830 180435 -127439 -201723 175721 83179 -479170 98861 32523 -174114 191722 -5591 133481
12818 -42037 106908 -122705 21995 -281173 -97650 268532 8498 -9438 113675 169229 67520
12806 -88009 148496 -29786 97183 143848 213816 92258 -53211 -170350 -143910 -327691 -8807
12794I6857a43107M7457I9612e7513A33419e8915A0863c3629k5085n6075A40831
12782A30155k0290a6109k58924A62999e6947A17386L8961l3526d8797j90592f3402
12770a26793C0404J90713g6566j21604A17381b4445K456B71303n9483a716E1555
12758B087L1649c70830D538b42310L5471j04381B0835a707j10726b8148j83223
12747b11371A03769a4469l3476m6995D1713K69426a65726g3017q0893l3822C24181
12735A77614i4345L2244B80594a29799G871b66246j42849A80635B4579M9007b5623
12723A29193a34125B31041l2785q1140A6248i3554A39784L1805a9769D8719R2219
12712A40938J38084b15068I5523a05382j04336b6250k47078J27422C17387g7065
$$ plain form
12794 96857 -143107 -95650 99612 -57513 133419 -58915 10863 -33629 -58714 -114789 140831
12782 130155 109865 -16109 -275033 162999 -56947 117386 156347 122821 -48797 -239389 -63402
12770 -126793 30404 221117 -76566 -198170 117381 -24445 -21989 271303 211820 -1716 51555
12758 2087 33736 -370830 4538 -242310 -206839 -311220 20835 -1707 -112433 -28148 -211371
12747 -211371 103769 -14469 -47945 -94940 41713 311139 -165726 -73017 -153910 -187732 324181
12735 177614 -94345 -62101 280594 -129799 7871 -266246 -409095 180635 24579 73586 -25623
12723 129193 -134125 231041 198256 117116 16248 -93554 139784 171589 -19769 48719 140938
12712 140938 279022 -215068 95523 -105382 -209718 -26250 -273328 -145906 317387 -77065
12701B46606j9249H4103B67b8851A38965f3418B96710j26836O825D9824l271J17169
12689A63722J32802m8091a39043K2707B69439r321E5443a06508A19207K4001d7016
12677a02833L7119a0057h7j36219A2691K41639f1397E64068A08094j9031e623
12665i4129n7097D10017A65658g4328j64509A00406K02585b77935B14162r1229
12655A22933m5801J4948O6672b06513A25802a17569G5047B22g9559A46146J21561
12644B67707M5162a70293B7158J6958A5192c8195a7846B35270G7136a2680m5288
12633e7968a7775A73996b95163B09765c09827a15398K9920k01033g2573j00267
12623a72840A62382L5554D2249J56644K17556H5515J10686e179H6508R5974Q782
$$ plain form
12701 246606 227357 84103 267 -28851 138965 -63418 296710 169874 176699 49824 46553 163722
12689 163722 296524 248433 -139043 -116336 269439 260118 55443 -106508 119207 143208 -47016
12677 -102833 -65714 -10057 -87 -136306 12691 254330 -61397 564068 108094 89063 -5623
12665 -94129 -151226 410017 165658 -74328 -238837 100406 302991 -277935 214162 122933
12655 122933 77132 92080 158752 -206513 125802 -117569 75047 222 -79559 146146 267707
12644 267707 312869 -170293 27158 44116 15192 -38195 -17846 235270 77136 -12680 -57968
12633 -57968 -17775 173996 -295163 209765 -309827 -115398 -85478 -286511 -72573 -172840
12623 -172840 162382 197936 42249 198893 416449 85515 196201 -5179 86508 182482 191264
12612A91264b04135b6971C08921j44263R4357O844C0452I814a49307A6311c07944
12600E5764f8625C66745j47253b1838j34075g0927r6605B07961g6509A43447C405
12588h1008n935D4107l224J81472p442a64117j46816D7111p831J99492a63943
12576C28711g1473j4344A66272D2384j3043a76930L8047C32503a52222B65919
12565A25644C8473b20915B05695p2137a84711A50697a54790O1897G5877c02699
12554b11327G8737B1803J33199k0970a16516j3698q5628B08885J52946I1152M3642
12543A34794f1587j27380A69552a22625k0894n5963q7633l8525a9729r1167a7227
12531B22670b60554B50064E5198M0355B1105M4500O4164e4355J6730k72145B19413
$$ plain form
12612 191264 -204135 -26971 308921 164658 259015 265859 30452 9814 -149307 16311 -307944
12600 55764 -68625 366745 219492 -21838 -155913 -70927 -167532 207961 -76509 143447 3405
12588 -81008 -86943 44107 40883 222355 214913 -164117 -310933 47111 39280 238772 -163943
12576 328711 -71473 -85817 166272 42384 29341 -176930 -138883 332503 -152222 265919
12565 125644 38473 -220915 205695 133558 -184711 150697 -154790 -92893 75877 -302699
12554 -211327 78737 21803 155002 134032 -116516 -130214 -215842 208885 361831 91152 134794
12543 134794 -61587 -188967 169552 -122625 -143519 -199482 -287115 -325640 -19729 -110896 -17227
12531 222670 -260554 250064 55198 95553 21105 65605 129769 -54355 -37625 -309770 219413
12519C7605f0097A4801K25119G6333A5865a19354M9958k22661A06320L1893b72460
12507h8538k35846l8780A01062J69239b16555A4318L10062A44358b1370j92122
12497b13492E5204e1420p7384B90045I6158D8020h3647k03599A34334b1162f928
12485h3600p1520e918C5426M12193A92776e2216A83050g443n0322I7969c99745
12473g4190B62878q8663C5126J01904m6491J08636J9561K5625G4110K88537a67531
12461A38281c97595A95749e2666F6956a2682C08263a59973d6472k65537o998f4376
12449B1642d20583A2165a49792j55102A63554b1293n06821h4220e816k08669k8164
12438b42649h4835j92422n5942H284N9040J93178J29435f4249k11429A03496K9674
$$ plain form
12519 37605 -60097 14801 239920 76333 15865 -119354 -69396 -292057 106320 138213 -272460
12507 -88538 -324384 -363164 101062 270301 -216555 14318 324380 144358 -21370 -213492
12497 -213492 55204 -51420 -128804 290045 96158 48020 -83647 -287246 134334 -21162 -6928
12485 -83600 -155120 -5918 35426 447619 192776 -52216 183050 -7443 -57765 97969 -399745
12473 -74190 262878 174215 35126 137030 90539 199175 218736 244361 74110 362647 -167531
12461 138281 -397595 195749 -52666 66956 -12682 308263 -159973 -46472 -312009 -319007 -64376
12449 21642 -420583 12165 -149792 -304894 163554 -21293 -528114 -84220 -5816 -214485 -242649
12438 -242649 -84835 -277257 -333199 8284 67324 260502 389937 -64249 -275678 103496 133170
12427A33170c80605J84354F6132A5614f4530b6263H7381e9573M930D1548b71011
12415a90134k7434A65274m8829J3286b66261N1724m5389l6513E3464R0828E2726
12403c7221A8791M7047a97352N6540C07857a81923d8131A81379k1577c12836B00699
12391I6539a54589A57009J19007c34694C5214a73752B34537D5588M64345b1580
12380A65658F7329A7254O3785a09904c8685F9144j887c71633A64098d7048B47171
12368A69162c5976A18472f6850n0647A40545j4748a2328j5744j58955a8104A9643
12356a22288B92824d3237D866J22906d1471p9759D4117P665j1961b55387g6743
12344C92513j79551c7372B7988i5256k52225c0816o8666A4941b31357C9038a00969
$$ plain form
12427 133170 -380605 -196251 66132 15614 -64530 -26263 87381 -59573 -54643 41548 -271011
12415 -190134 -217568 165274 116445 129731 -266261 -214537 -259926 -296439 53464 144292 52726
12403 -37221 18791 65838 -197352 -140812 307857 -181923 -48131 181379 159802 -312836 200699
12391 96539 -154589 157009 276016 -334694 35214 -173752 234537 45588 509933 -21580
12380 165658 67329 17254 81039 -109904 -38685 69144 67257 -371633 164098 -47048 247171
12368 169162 -35976 118472 -66850 -117497 140545 125797 -12328 -28072 -187027 -18104 19643
12356 -122288 292824 -43237 4866 127772 -41471 -121230 44117 51782 39821 -255387 -76743
12344 392513 212962 -37372 27988 -95256 -347481 -30816 -99482 14941 -231357 39038 -100969
12332a1871H0053J67023a05918j46648B9226R6601a4687H2717N2867J00700b1216
12320B531J72028o6913A8185J42379a4189I6651L03502m7882H1511L3747k2861
12309I2397D2742f8213D16636A79641M424b4832j03295B34252c0091A05805a76684
12297E0955N1366Q2425P404E1634b97811g030k3661h173I2307b1685B4928b7791
12284c36C30383D316b16788F0398J01784K6522n2170n4725A633K83363A12844
12272a97086g3636a6334C2731b54108O07c0864D4319K2835J77147q6665c350k03003
12260b06353e4986D2448L9460b4548q066E9718J29282a07664D82818j34734a57216
12248B07995G2526M2214L20304j97580j5572j04795F326b0564F4895J88538A04336
$$ plain form
12332 -11871 80053 247076 -105918 -252566 29226 125827 -14687 82717 135584 236284 -21216
12320 2531 174559 107646 18185 160564 -14189 96651 400153 352271 81511 115258 92397
12309 92397 42742 -68213 416636 179641 184065 -24832 -128127 234252 -30091 105805 -176684
12297 50955 102321 184746 192150 51634 -297811 -7030 -30691 -8173 92307 -21685 24928 -27791
12284 -336 330383 4316 -216788 60398 162182 188704 136534 81809 1633 284996 112844
12272 -197086 -73636 -16334 32731 -254108 -253501 -30864 44319 67154 244301 157636 -3350 -206353
12260 -206353 -54986 42448 81908 -24548 -32614 59718 189000 -107664 482818 348084 -157216
12248 207995 72526 114740 435044 237464 221892 117097 6326 -20564 64895 253433 104336
12236a44599A75716F6834K4084A8829L4178e3752B27973A2381K44369F712K73959
12225B80671q8265n3345F5120K87813j28921a73463C47861l3194C6604J50027
12215A86631P447r2852j0010O2628g2437m1930B74874j1139p7965R6738n1727
12204B30781j8424J12035N0448A30712a81079A47703I294K08976a45926c6878
12193B8511L28899A20895K93550i9697L7336j01760e0099d471j81322g3766A84953
12181C86598F3895K02509j11738o5616d6476A24189R1370f0040B32206J2295C2604
12169D5257K71177A48170D0083J87901D3248c8393A16956P5223I2176b09559A92200
12157A13736R8982a40336B5670c02817a45682B16869K21259r9413q4728R9956
$$ plain form
12236 -144599 175716 66834 90918 18829 53007 -53752 227973 12381 256750 6712 280671
12225 280671 192406 139061 65120 352933 224012 -173463 347861 314667 36604 186631
12215 186631 194078 101226 91216 153844 -72437 -114367 274874 263735 185770 282508 230781
12204 230781 212357 324392 374840 130712 -181079 147703 9294 218270 -145926 -36878
12193 28511 357410 120895 414445 -99697 -62361 -164121 -50099 -4471 -185793 -73766 184953
12181 386598 63895 266404 154666 89050 -46476 124189 215559 -60040 232206 244501 32604
12169 45257 316434 148170 40083 227984 43248 -38393 116956 192179 92176 -209559 192200
12157 113736 212718 -140336 25670 -302817 -145682 216869 438128 338715 253987 353943
12147C53943E6682O1637J2054n5888k1530K12228e4384B0344E319a60716N2014
12136a08702C54937h9817J6690A3292P5328Q644A6483Q7290P255k7111h8341P555
12124h0786A46870J10209a73293I1206k1128O1410i6755C07520d5578F0849f2287
12112d4807F5699J65637f5750A39212C9468O1094O8677m0991L0551o0118J53905
12101B52586J4006q4280p1497M8669C186J61319b1445j06578A11823a3497B1304
12089c3052G5133c04427g8310b2628B5784g7138j66231d399k1961B65923D1890
12077E5134B2516a38848A38304a2345A24884c5674C10873g6257G1328J62995j3180
12066B21143D0487g4638A84845c6580B94088e6201j24728O5846m6818o5033B34279
$$ plain form
12147 353943 56682 118319 130373 74485 52955 265183 -54384 20344 5319 -160716 -108702
12136 -108702 354937 -89817 -73127 13292 88620 97264 16483 103773 111028 83917 -88341 -80786
12124 -80786 146870 257079 -173293 91206 70078 131488 -96755 307520 -45578 60849 -62287
12112 -44807 65699 231336 -65750 139212 39468 100562 169239 128248 158799 98681 252586
12101 252586 266592 182312 110815 159484 3186 164505 -21445 -128023 111823 -13497 21304
12089 -33052 75133 -304427 -78310 -22628 25784 -77138 -243369 -4399 -26360 265923 41890
12077 55134 22516 -138848 138304 -12345 124884 -35674 310873 -76257 71328 234323 221143
12066 221143 40487 -74638 184845 -36580 294088 -56201 -180929 -115083 -161901 -226934 234279
12054A06859A8620b1341e40C72565m8078f604B12637r0475c27960B07076n792
12043B01284a97701A2301P9501a02495l2773e0642F4959J12998a91866M2628A03323
12031B08820o4669N6613a34465N181j86390A99224d317k3846j57673E5279a6060
12019f6498J6151L09C17169q7737H4459a13159B88842p4427b8252A52790E2829
12007a5099B27917r7467j6059L6725K17519b5458C26957b15244B24103i5017F9823
11995a22831A06829l084g139E2269f7732a3785j53659F6905Q9746K063b27291
11983a69664f6825B43759b16A04950A7284J75894k2613a72049H3751J16677d8647
11971a29200j39987b9228A85198d5351E3624J26509b482A4781J1720b85469B00480
$$ plain form
12054 106859 18620 -21341 -540 372565 324487 -6604 212637 122162 -327960 207076 201284
12043 201284 -197701 12301 91802 -102495 -135268 -50642 64959 177957 -191866 -149238 103323
12031 208820 144151 200764 -134465 -129284 -315674 199224 -4317 -28163 -185836 55279 -16060
12019 -66498 -50347 -50038 317169 229432 84459 -113159 288842 214415 -28252 152790 52829
12007 -15099 227917 130450 114391 151116 368635 -25458 326957 -215244 224103 -95017 69823
11995 -122831 106829 103745 -7139 52269 -67732 -13785 -167444 66905 156651 158714 -227291
11983 -169664 -66825 243759 -216 104950 17284 193178 170565 -172049 83751 200428 -48647
11971 -129200 -269187 -29228 185198 -45351 53624 180133 -2482 14781 26501 -285469 200480
11959B65244b66663J27323K4168G0434a49801j08200H4656O1700a50722N1782
11949i8940G1677h7974o9917F0052b04866A35083a87068B15559p9667a89606j51534
11938c41140A7175J58226i9529j80330A66712H0312a19160L7868j21902D7460
11927A17727O5491f4283B1209J56550a59753d5922C0573Q7703A5962a98727c0440
11915A31290B4633a85761L6486J6968M6988m2771j0344A50706o1797K39322A27988
11903A42661D2065b68312F0041b88306A7147L6048b1023A90834b62134C3812a7457
11891G9036J55238a27674B15559b59418a6559A47612P3040R2145D312c35928a5902
11879a70227a6076k13566i9157k08822B6048q886J87150c3075k00578F1819e944
$$ plain form
11959 265244 -266663 -139340 -115172 70434 -149801 -258001 84656 146356 -150722 -98940
11949 -98940 71677 -87974 -157891 60052 -204866 135083 -187068 215559 135892 -189606 -341140
11938 -341140 17175 175401 -99529 -279859 166712 80312 -119160 -81292 -203194 47460
11927 117727 183218 -64283 21209 177759 -159753 -45922 30573 118276 15962 -198727 -30440
11915 131290 24633 -185761 -149275 -132307 -85319 -128090 -138434 150706 88909 328231 127988
11903 142661 42065 -268312 60041 -288306 17147 53195 -21023 190834 -262134 33812 -17457
11891 79036 234274 -127674 215559 -259418 -16559 147612 220652 312797 4312 -335928 -15902
11879 -170227 -16076 -229642 -99157 -307979 26048 17162 204312 -33075 -233653 61819 -5944
11867c75196B7308b35955G3806P5280J59259e4999K2288A87831e9262k5453j11881
11856a96596b5222B35637c28789J7255A8340J3380O6462a65163j36450i3128r289
11845a02417D535b39594O6325k5449C05802A25330f4582A63754g0927B57483j28674
11834A28809h7772B21729c35022J32188R121P6915j9099c828l15689e6007M89
11823e5518l08493a39940B66354b70715i0124A08611a14851D6881f6002n4808
11813a20810H2206c24706e4900m6738C4935K05248a79610K3794A70175g523D5867
11801a28409A36402O253D5131c70755C59768h4380A93772c72442a59752B79974
11790c92789e3075A5116K08572Q4312N5276f9966k18284B62495A12468D6415a22991
$$ plain form
11867 -375196 27308 -235955 73806 149086 308345 -54999 -32711 187831 -59262 -84715 -196596
11856 -196596 -25222 235637 -328789 -311534 18340 31720 98182 -165163 -301613 -93128 -102417
11845 -102417 4535 -239594 -173269 -198718 305802 125330 -64582 163754 -70927 257483 128809
11834 128809 -87772 221729 -335022 -202834 -193713 -116798 -135897 -3828 -319517 -56007 -55518
11823 -55518 -364011 -139940 266354 -270715 -90124 108611 -114851 46881 -66002 -120810
11813 -120810 82206 -324706 -54900 -101638 34935 240183 -179610 -155816 170175 -7523 45867
11801 -128409 136402 142655 45131 -370755 359768 -84380 193772 -372442 -159752 279974
11790 -392789 -53075 15116 223688 308000 363276 -69966 -288250 262495 112468 46415 -122991
11778B71434a00596D7603r616B381h5052j09830b7964l2080j93302e66k66852
11767b67418A73384e24590F6870a9277E8917b31785d7831N090p2663M9673j60411
11756b26142P1784F6444L6000b03633B48743G7721N972C0584b35710e7032A90465
11744A64148J13345b39901A54805a09802r001c2841j83353a3378G6456c2879B679
11732b08309J7743l4687F2014a99525F9544J0706b68564a3247p4553A4475K3520
11721C7995K23844g4788J1645A80492a55191J6825r1162N1782m5540g1755A24792
11709C7727i2502o4724B10583a11937D9430b41625B2348h3287p5768n4060e4385
11697b07969I3273J35377e2665j27598q4502C47265a18286K2082B3196k367a48769
$$ plain form
11778 271434 -100596 47603 37987 2381 -85052 -194882 -27964 -60044 -253346 -566 -267418
11767 -267418 173384 -524590 66870 -19277 58917 -231785 -47831 -42741 -115404 -65731 -226142
11756 -226142 -154358 66444 102444 -203633 248743 77721 83693 30584 -235710 -57032 190465
11744 164148 277493 -239901 154805 -109802 -118803 -32841 -216194 -13378 76456 -32879 2679
11732 -208309 -190566 -225253 62014 -199525 69544 80250 -268564 -13247 -87800 14475 37995
11721 37995 261839 -74788 -63143 180492 -155191 -138366 -229528 -177746 -223286 -71755 124792
11709 37727 -92502 -157226 210583 -111937 49430 -241625 22348 -83287 -159055 -213115 -54385
11697 -207969 93273 228650 -52665 -180263 -264765 347265 -118286 -96204 23196 20829 -148769
11685A76737a58059P1105p8906a6917j29336F0086E786J01892k0547b8079F1631
11673B46686a09992p8413H9872a51100B33194b46056R6840B67717a40520d197
11662A76364a01511K9405C9373J29728c3700E5413k0777J42358J07466c04907
11651e18684h532B97374j15569k8721E2711b1697A15792L9115a8244j11880E89687
11639d6878p1478A60891N3515f6017r883j12476d0322j42568A85234P9952c6117
11627a77444H8535D413a24220G0473k4372f0385b5845l033A71012a06631n1404
11616a58035A51395b18247d6039j56138l1055A41852c2109k2123j54548J00853
11606a07927A774K53852f0727k23346c5844J5239k58474H6273d1663n7100A47064
$$ plain form
11685 176737 -158059 -86954 -165860 -16917 -146253 60086 5786 107678 87131 -28079 61631
11673 246686 -109992 -188405 89872 -151100 233194 -246056 -149216 267717 -140520 -4197
11662 176364 -101511 -72106 39373 169101 -33700 55413 34636 176994 284460 -304907
11651 -518684 -8532 297374 181805 153084 52711 -21697 115792 154907 -18244 -130124 589687
11639 -46878 -118356 160891 214406 -66017 -75900 -188376 -40322 -182890 185234 265186 -36117
11627 -177444 88535 4413 -124220 70473 46101 -60385 -25845 -28878 171012 -106631 -158035
11616 -158035 151395 -218247 -46039 -202177 -233232 141852 -32109 -54232 -208780 -107927
11606 -107927 1774 255626 -60727 -284073 -35844 -20605 -279079 86273 -41663 -98763 147064
11594G6086N4615c05338a4283B22122I6639C2840M4725K12076A23751a913j07573
11583a09486p1384B43482a75155A51683k2480o2192b38731g251A11242i2875J8567
11572g4308q7638f3366B06678h0998A74289d6752C3968p088M0176R8279a58373
11560a68838F9467A1288J8851L0083b28499e6577A57447D4554M40066A53256g135
11548A71887R1635a45145b1700B3440Q1241N4284l9934Q3594I095Q449i3057d0298
11535a64652B88685A38796h7449A23221K0888O6213n3314i4578p697a3659N42
11524a3117k63367A43295i5245H7762d21121L4327A48997l7821c41591A56172
11513B04294n7467M6705a803F2026g1602A11410J740J18902b41953B4765R0724
$$ plain form
11594 76086 130701 -305338 -14283 222122 96639 32840 77565 289641 123751 -1913 -109486
11583 -109486 -180870 243482 -175155 151683 129203 67011 -238731 -7251 111242 -92875 -74308
11572 -74308 -161946 -63366 206678 -80998 174289 -46752 33968 26880 67056 165335 -158373
11560 -168838 69467 11288 30139 60222 -228499 -56577 157447 44554 484620 153256 -7135
11548 171887 263522 -145145 -21700 23440 104681 158965 119031 202625 9095 17544 -93057 -40298
11535 -164652 288685 138796 -87449 123221 144109 210322 157008 -94578 -102275 -13659 -13117
11524 -13117 -276484 143295 -95245 87762 -421121 -386794 148997 111176 -341591 156172
11513 204294 146827 193532 -1803 62026 -71602 111410 113150 232052 -241953 24765 115489
11502A15489O8501D7699b89656A36937b26513A98806l9422a70778K3457e2957
11491B5781a0068G5999a1055C12645O3670j81745I6829b51499N9690B17515R6185
11480C13700K7442C5053e3187F996c1650B72892R4570E5493l124g2546B40564
11468A04916D302K67501a16150b9131C84960j42164n2616o7062J07837A9244J2981
11457C2225b13049A824J37330J02741D947a15717A93578c72792f7950j237A66339
11445g5097B37291d607j98680A63104p5791O2987K56527g184j5819j212j07808
11434a32023e1294n3769b8747A45370c47602C57077Q7917a04259A3475J75560
11424A89035J42870a15239e7320a9988d304k60760k57061F8507c7572q8035k60965
$$ plain form
11502 115489 183990 47699 -289656 136937 -226513 198806 159384 -170778 -147321 -52957
11491 25781 -10068 75999 -11055 312645 376315 194570 96829 -251499 -191809 217515 313700
11480 313700 341142 35053 -53187 6996 -31650 272892 367462 55493 52369 -72546 240564
11468 104916 4302 271803 -116150 -29131 384960 242796 190180 123118 230955 19244 32225
11457 32225 -213049 1824 139154 241895 4947 -115717 193578 -372792 -67950 -69187 166339
11445 -75097 237291 -4607 -203287 163104 87313 150300 406827 -7184 -23003 -24215 -132023
11434 -132023 -51294 -105063 -28747 145370 -347602 357077 444994 -104259 13475 189035
11424 189035 331905 -115239 -57320 -19988 -4304 -265064 -522125 68507 -37572 -125607 -386572
11413c86572B01620m2240J01209l6234L713C8006q630J82814o0561e6507j01051
11402a57558f3477k0619j2593A04536o607a99569B203J2622Q4488b14747l7696
11391b52443A15103b50073j23983O4189B36848b33136A58125c66645D10047c20171
11380C49856C2531a97616m2128A11099M3600e4151A76439c05515a33333l4658
11370a67991B5595J58161B2672g6528C3200a93184L0964b2199B0193h564p2305
11359h0869j36633H5516J01246p1662c61813B15211e0333D3454D308b01078A57573
11347a26214r0546F5469a76092A28172D7301a81939a0796l4202n827C3322a70301
11335A3008M6770a37484j10627E8376g9815r0905B07857b9988A37901F1246h829
$$ plain form
11413 -386572 201620 159380 260589 224355 228068 38006 29376 212190 151629 -56507 -157558
11402 -157558 -63477 -84096 -96689 104536 97929 -199569 2203 14825 99313 -214747 -252443
11391 -252443 115103 -250073 -374056 -309867 236848 -233136 158125 -366645 410047 -320171
11380 349856 32531 -197616 -239744 111099 154699 -54151 176439 -305515 -133333 -167991
11370 -167991 25595 183756 22672 -76528 33200 -193184 -162220 -22199 20193 -8564 -80869
11359 -80869 -217502 85516 186762 115100 -361813 215211 -50333 43454 4308 -201078 157573
11347 -126214 -216760 65469 -176092 128172 47301 -181939 -10796 -44998 -50825 33322 -170301
11335 13008 59778 -137484 -248111 58376 -79815 -170720 207857 -29988 137901 61246 -8829
11323a26584k9781B92150H384a5574H774b02145p6853J05202o8510C14027a13646
11311c20621D14031A14999a83693B6352J04926l3601a93662R4638A4342h257A52044
11299B33716O8199j04149m3504J39661d8417D3281d4248A26630m2895J55837f5399
11287a62393b8033C7505J96448C3874R4927n8123l0508i5592b5040J1083p1793
11276h5750k17977j04070N0349a49481k39368I6291a26989C864d4320a7301A20246
11264A02031a02033p9009B48767B2102J50512a54527A71931b33528B09493b30232
11253I4424b9529A20947a49863A35784O8400a70192E2484i9148B28708b39532
11242C6019a32093f984l13834a57834j52039a03878j74032D0712a13568B95950
$$ plain form
11323 -126584 -156365 292150 8384 -15574 8774 -202145 -278998 -173796 -242306 314027 -113646
11311 -320621 414031 114999 -183693 26352 131278 97677 -193662 -99024 14342 -8257 152044
11299 233716 301915 197766 154262 293923 -48417 43281 -44248 126630 83735 239572 -65399
11287 -162393 -28033 37505 233953 33874 128801 70678 40170 -95592 -25040 -13957 -85750
11276 -85750 -303727 -407797 -357448 -149481 -388849 96291 -126989 3864 -44320 -17301 120246
11264 102031 -102033 -181042 248767 22102 172614 -154527 171931 -233528 209493 -230232
11253 94424 -29529 120947 -149863 135784 204184 -170192 52484 -99148 228708 -239532
11242 36019 -132093 -6984 -320818 -157834 -309873 -103878 -277910 40712 -113568 295950
11231F8015a50098k17464M7016a21893k62982a22518j2234p7780C099c64575J57633
11220b06942l3290B6954g8273k00032O6913p5256A28479J35772a62226k94595
11210d56821J14107A83137a67178j88920d0207B42795E5888a84353A40700C2454
11199a76471n3435D4420L6580b83042b1059H2592L072J3395J58932a33313j50799
11188b84112L7927g0935j09952g0156j99651E5875c78113a20762L3515l5456d6965
11176a31949o3141E7647a40344k1762j59210a11844K3386B7911b84407J8686A24903
11164b103H5979d4914H6552h1999A49979l7655B4014a54807p4768F7544a86802
11152h0771n070I1345a97677N3964c6571B1000g331k2803j01045B54086a21658
$$ plain form
11231 68015 -150098 -367562 -320546 -121893 -384875 -122518 -134752 -212532 3099 -364575 -206942
11220 -206942 -240232 26954 -78273 -278305 -211392 -286648 128479 264251 -162226 -456821
11210 -456821 -342714 183137 -167178 -356098 -40207 242795 55888 -184353 140700 32454
11199 -176471 -229906 44420 81000 -283042 -21059 82592 85664 99059 257991 -133313 -284112
11188 -284112 -246185 -70935 -180887 -70156 -269807 55875 -378113 -120762 -87247 -122703 -46965
11176 -131949 -195090 57647 -140344 -162106 -321316 -111844 -88458 27911 -284407 -265721 124903
11164 -2103 85979 -44914 86552 -81999 149979 112324 24014 -154807 -229575 67544 -186802
11152 -80771 -85841 91345 -197677 -143713 -36571 21000 -7331 -30134 -131179 254086 -121658
11140f4332I2648a6899A71552P7579c15705j9534f6957k61005B84990a16630N6168
11129f0462B25518b08453B15744a26085A49722p2336i5774A20877a57370G9132
11118f2956a8213j43119C23707f3131b2690B15972b3402H3553J6725B3176J36224
11107A59400B4195J29305h6607E4819g8831H1905a7885l91263Q6983a29702H6258
11095A12971J25913A0629c19844A50725f0864A47747M9027a70058A92023h4152
11084C04858D4567r162N3061R9065q795A5486K93683n9160A12604J64253e7447
11072B97485j30777p1926m5107a31813C8224i8977c3247o4940k4344C06530J5246
11061C21776r4099K81888B04140L96163j99268B0580O46235B91785A20309N2012
$$ plain form
11140 -64332 92648 -16899 171552 249131 -315705 -335239 -66957 -327962 284990 -116630 -60462
11129 -60462 225518 -208453 215744 -126085 149722 77386 -95774 120877 -157370 79132
11118 -62956 -18213 -161332 323707 -63131 -22690 215972 -23402 83553 100278 23176 159400
11107 159400 24195 153500 -86607 54819 -78831 81905 -17885 -409148 -322165 -129702 86258
11095 112971 238884 10629 -319844 150725 -60864 147747 196774 -170058 192023 -84152
11084 304858 44567 35405 88466 187531 178736 15486 309169 250009 112604 276857 -57447
11072 297485 166708 94782 49675 -131813 38224 -98977 -33247 -98187 -122531 306530 321776
11061 321776 227677 509565 204140 600303 401035 20580 666815 291785 120309 172321
11051A72321J68491M9608L2315j44746n9585H8859L02545K25073j40712R3891
11041E69656K183m1966r3440K66856C46822K87493j13033K05505l47848L19016
11031F97955k4180K80012o201m62823K61065P786j3103k2850P772j42590K53945
11020H36788l21870L27193J15103n6323j26134j91845J18926J98499C70494K57613
11010F28107A64414N23281j54994L1492J66770k05063L2303J83685C32099K65504
11000E97603J0532j50910K52093l2917J8078q3080K25816C70957Q2417J42973
10990E96347J40218Q9761k14410j14408P5684j55015N6548J7360J61261J64099
10980H17445q0433B45306L53672J00653l07169K88662C40507M66041j18861o7969
$$ plain form
11051 172321 340812 390420 422735 277989 218404 88859 391404 616477 475765 569656
11041 569656 571839 529873 436433 703289 346822 634315 521282 726787 378939 697955
11031 697955 673775 953787 947586 484763 745828 753614 740511 717661 725433 582843 836788
11020 836788 514918 842111 957214 900891 774757 582912 701838 900337 370494 628107
11010 628107 164414 687695 532701 564193 730963 525900 558203 741888 332099 597603
11000 597603 608135 457225 709318 676401 694479 611399 837215 370957 453374 596347
10990 596347 736565 826326 611916 497508 573192 418177 474725 492085 653346 817445
10980 817445 737012 245306 598978 699631 392462 681124 340507 806548 687687 619718
10970F19718r6045M6753K98279k68975J59797K94687k61975N7028J6633K55167
10960A121067J22424L08263j0141j05011R52831k71117m0967R5888j81683j77861
10950A813693N59784l39836M54032r47182k46077J58861O3632k48168k73045K98085
10940A293779K02107k65387j76469L9475j27425k22688M26075m51731J95931C60980
10929C62910K8284L2557K1199k01318k612F9371O9251J43877r498G7565J47537
10918B25102i5800K243B59386c4555B13203a34986B37214D5278a72852a9550A25295
10906B60769b677A51234a89453G6960J03592a28592C12437K34986G0244a10496
10895b18551K402r937A103K10727e6725A08344a6055j20194e3900n5544Q987B16770
$$ plain form
10970 619718 523673 570426 868705 599730 759527 1054214 792239 849267 865900 1121067
10960 1121067 1243491 1551754 1541613 1436602 2389433 2118316 2077349 2173237 1991554 1813693
10950 1813693 2373477 2033641 2487673 1540491 1294414 1453275 1516907 1268739 995694 1293779
10940 1293779 1495886 1230499 1054030 1093505 966080 743392 1169467 717736 913667 360980
10929 362910 391194 423751 444950 243632 241020 69371 138622 282499 273001 77565 225102
10918 225102 -95800 -93557 259386 -34555 213203 -134986 237214 45278 -172852 -19550 125295
10906 260769 -2677 151234 -189453 76960 180552 -128592 312437 547423 70244 -110496
10895 -218551 -216149 -226086 1103 211830 -56725 108344 -16055 -136249 -53900 -109444 -100457 216770
10882b6707l71789d6749j1093j70532j0445G2257f8735c0745C330a73462B8833
10870A52034h2407I3255J16916f6793I68c6884G2618M4569d9191k51990I7922
10858a98749g0774F9065J37964a81253k38691J84991G7957b06490A44199h3242
10847e3123A48627o2942L6682a02741k18096A2372b9216C21840b06742P2021l4991
10836a69712f2938b4681D9834J64871G5574e9538o092C5839a85898B1930L48893
10825C70823c6983C8403M2047N8309a8779A35049O2297C6419Q3247D4332b7155
10813G1486b77038A98073p1577b0159k32962i9497k043c165k17593N5711D4435
10801c13122E6342b60910M0322E4548J32175a66905A7686a5741k06288d080j69599
$$ plain form
10882 -26707 -398496 -46749 -57842 -228374 -238819 72257 -68735 -30745 3330 -173462 28833
10870 152034 -82407 93255 210171 -66793 968 -36884 72618 117187 -49191 -301181 97922
10858 -198749 -70774 69065 207029 -181253 -419944 -234953 77957 -206490 144199 -83242
10847 -53123 148627 85685 122367 -102741 -320837 12372 -29216 321840 -206742 -134721 -169712
10836 -169712 -62938 -24681 49834 214705 75574 -59538 -65630 35839 -185898 21930 370823
10825 370823 -36983 38403 80450 138759 -18779 135049 197346 36419 119666 44332 -27155
10813 71486 -277038 198073 126496 -20159 -253121 -99497 -101540 -3165 -220758 -165047 44435
10801 -313122 56342 -260910 -220588 54548 186723 -166905 17686 -15741 -222029 -4080 -173679
10790a73679H730b53404a4594j29584E1410C226L3890b7514I0567a4828l63876
10779c78704A71279i0693D1476f5403j12271h3528o0048n8398M3347P1556k61095
10768c48166A2727b51812g6038k33931A04812J34523H7201j080L9807g140B23553
10756D4795c11766A41702g6708E2512c7446j55088c6503I7902d1083a9537j3012
10745c2549k95297M6637C889M2057b43822B07147a1236D7864g7425H8508a33651
10733b35357j77002A84564P1095I7440a74241b2947B37144k3528B5601b6474k7604
10722e4078n05967B25386J26770r9565A012b46605Q5939l927A13442d08354F255
10710f143A53757M3495b65927G7928b01145i0627A30637F2514a25619j68889A58733
$$ plain form
10790 -173679 8730 -253404 -14594 -144178 51410 3226 37116 -27514 90567 -14828 -378704
10779 -378704 171279 -90693 41476 -65403 -177674 -83528 -143576 -201974 -158627 -87071 -348166
10768 -348166 12727 -251812 -76038 -309969 104812 239335 87201 86121 125928 -7140 223553
10756 44795 -311766 141702 -76708 52512 -37446 -192534 -36503 97902 -41083 -19537 -32549
10745 -32549 -327846 -281209 3889 45946 -243822 207147 -11236 47864 -77425 88508 -133651
10733 -235357 -412359 184564 255659 97440 -174241 -22947 237144 213616 25601 -26474 -54078
10722 -54078 -560045 225386 352156 252591 1012 -246605 -160666 -164593 113442 -408354 6255
10710 -6143 153757 197252 -265927 77928 -201145 -90627 130637 62514 -125619 -294508 158733
10698a29669j39575Q1984L4183C3491J72485d545A93000a40421B0854b90815A14193
10686A11096k7600A7624c9949B76572J730a08998k28755d2998l06884q1222F0493
10674b3774A68693A3561i3279H7729a98441p8289a16103e7436l10286i2595A48594
10662E6153j3968d76787a38383C9808L7368a2331j0091p4717j27674Q8982r7773
10651b33604A36084i0147J3415R343j60967C6837J6986K19892a92355n6937H4896
10639a59532j94649G1937c35920h0572A70860m5605c33208A74272p9386b04042
10628a68754F8754a20764L0821k15158G590c49320B69076a21920a6305A73549
10617i7718B76638i049k47260R684a12102b4283j84006B10812Q5810d4351A0079
$$ plain form
10698 -129669 -269244 -187260 -153077 33491 205976 -4545 193000 -140421 20854 -290815 114193
10686 111096 83496 17624 -39949 276572 278302 -108998 -337753 -42998 -349882 -431104 60493
10674 -23774 168693 13561 -93279 87729 -198441 -276730 -116103 -57436 -367722 -92595 148594
10662 56153 42185 -476787 -138383 39808 77176 -12331 -22422 -97139 -224813 -135831 -233604
10651 -233604 136084 -90147 -76732 -67389 -228356 36837 53823 273715 -192355 -249292 84896
10639 -159532 -354181 71937 -335920 -80572 170860 125255 -333208 174272 94886 -204042
10628 -168754 68754 -120764 -89943 -305101 7590 -349320 269076 -121920 -16305 173549
10617 -97718 276638 -9049 -256309 -246625 -112102 -24283 -208289 210812 296622 -44351 10079
10605A590J6822a93170h4806j78898L6667G7694R0643o9874c32277d639B23528
10593b30624E2472q239p492h7625k93898c8548l8499G8909l5089c2151j17697
10582a49848B85463c80384J87235A40199m4954a79283p4830n8474l889a33151
10571e86278a64006A35209a8091B14433f0470B1601k006c3483j09364G8039a16541
10559a47730B2150J67865a92253D2618c74840D0515c99151A49368b47373K4209
10549b23164c5121j05917C5091a89280n6639B782a03051m0466J9721r0146f518
10537d2515E5307J09257a57306A30744b39970L3166I7740b45134A62278b4806
10526A24323n4893r663g2067B53453a72977g3054a0044l2717l45694J89430B28181
$$ plain form
10605 1590 18412 -193170 -84806 -263704 -227037 77694 168337 98463 -332277 -4639 223528
10593 -230624 52472 44233 36741 -87625 -381523 -38548 -77047 78909 43820 -32151 -149848
10582 -149848 285463 -380384 -193149 140199 95245 -179283 -254113 -312587 -316476 -133151
10571 -586278 -164006 135209 -18091 214433 -60470 21601 19595 -33483 -142847 78039 -116541
10559 -147730 22150 190015 -192253 42618 -374840 40515 -399151 149368 -247373 -223164
10549 -223164 -35121 -141038 35091 -189280 -245919 2782 -103051 -143517 -123796 -213942 -6518
10537 -42515 55307 164564 -157306 130744 -239970 -206804 97740 -245134 162278 -24806
10526 124323 69430 59767 -72067 253453 -172977 -73054 -10044 -42761 -388455 -199025 228181
10514b42833i8076k03823O5253B49750H721a67656J7679j56408d3286k84367e6316
10502H8561k4763h5069B02888p89A4281J6443K9894b78802B15839o5503f5706
10490f0937F3275d2306H5892b24704l0804A97754E0329B1812g6286k01916e7291
10478b8062A66644J05854C3699J50115H3143c2718B64358k3203F9586g111B29148
10466c17987a46169B17242r9350n6565M0205J92051J1077A43950Q7514o3593j9021
10455A48850L8884b06058b2664O333k8874C87876E1994b3021n1379a6652m5600
10444f2252o8241B16144b41286a02689B043L2760b02946J0694j34320i8956C4132
10432D2521a41137N3J2003N7139H6170Q1345K09517I5106i1396B2708b56337B60455
$$ plain form
10514 -242833 -98076 -301899 -236646 249750 8721 -167656 -149977 -306385 -43286 -327653 -56316
10502 88561 63798 -85069 202888 202099 14281 30724 60618 -278802 215839 150336 -65706
10490 -60937 63275 -42306 85892 -224704 -255508 197754 50329 21812 -76286 -278202 -57291
10478 -28062 166644 272498 33699 183814 83143 -32718 264358 241155 69586 -7111 229148
10466 -317987 -146169 217242 117892 61327 101532 293583 304660 143950 231464 167871 148850
10455 148850 187734 -206058 -22664 -16331 -45205 387876 51994 -23021 -74400 -16652 -62252
10444 -62252 -130493 216144 -241286 -102689 2043 34803 -202946 -192252 -326572 -98956 34132
10432 42521 -141137 -141084 -129081 -71942 86170 167515 377032 95106 -91396 22708 -256337 260455
10419B7684a43106l47675a40835f8969p8474H3820P5871a38362N6067c9211l6151
10408g5362K6223j1111I6987K4704e6341j04503j33945O8263D051J38240a29030
10396a86220j52433J12901A58222c1529o1017H0539K74605a5242F6184P3077a2576
10384B13754a30135C4317a29368E5805n629K66573H6610i5279B04065h1632m2702
10373a24334D36152a29861d6951q917H7663a1493B04467H4418f3870l09895F1833
10361A35530L2091L3366a56908A75636k7507J69067p7030e0940A60456N9058K62153
10350D81667B33229L77763j886B83891P9745n5715j37699A9467K79466E8834R2354
10339A51188L14574B20656n1241c5795A44996Q3536L40722j18892A88382J01725
$$ plain form
10419 27684 -143106 -490781 -140835 -68969 -147443 83820 159691 -138362 -82295 -39211 -75362
10408 -75362 -49139 -60250 96987 121691 -56341 -160844 -294789 -226526 4051 142291 -129030
10396 -186220 -338653 -225752 158222 -31529 -92546 80539 355144 -15242 66184 139261 -12576
10384 213754 -130135 34317 -129368 55805 50176 316749 86610 -95279 204065 -81632 -124334
10373 -124334 436152 -129861 -46951 -55868 87663 -11493 204467 84418 -63870 -373765 61833
10361 135530 167621 200987 -156908 175636 148129 317196 240166 -50940 160456 219514 481667
10350 481667 233229 610992 609106 283891 363636 307921 170222 19467 298933 58834 151188
10339 151188 465762 220656 169415 -35795 144996 228532 569254 450362 188382 290107
10329B90107K04694e2434D03573j40417G8734M3773L34998j73447j12172J75271
10319C47157j11316d3602A65278D8085j7101c5861B72915A23253J69547i6530
10308B80335b14085A57341A1462i8159B10605l2007C0340g4459F2053f5218B36287
10296A12107b88678D7976P0544a98387A37070c34381J0009R6416J10782N1376
10286f5798k11275B68157b14255L8370g7423k89129k4471J80835D0842Q0344A4306
10274d76791G1544k8256h4135l41602E8555f6175p1402N0462A13169a69907B9663
10262F2287J88626h6304k10665D4236h3112j20532h6928I3481a72299A02957K78695
10251C81652h9366A56990I956b31656L6785e0223p2139j3574E23113A73221A6253
$$ plain form
10329 290107 494801 -52434 403573 263156 78734 122507 457505 284058 171886 347157
10319 347157 235841 -43602 165278 48085 30984 -35861 272915 123253 292800 -96530
10308 280335 -214085 157341 11462 -98159 210605 178598 30340 -74459 62053 -65218 236287
10296 112107 -288678 47976 118520 -198387 137070 -334381 -324372 -227956 -117174 -65798
10286 -65798 -277073 268157 -214255 -175885 -77423 -366552 -391023 -210188 40842 121186 14306
10274 -476791 71544 43288 -84135 -425737 58555 -66175 -137577 -87115 113169 -169907 29663
10262 62287 250913 -86304 -296969 44236 -83112 -203644 -86928 93481 -172299 102957 381652
10251 381652 -89366 156990 9956 -231656 -194871 -50223 -122362 -135936 523113 173221 16253
10239C53393j13050j87J1233J6988A10349P2512K5534b3339k33664a01381B56083
10227A86467c02157H4451d791C0680m48a67544H2583b07185H213a99485B17402
10215d5428n6248I464P7678j1541a25090B20022g6226p4529o8045a5130n8144
10204g3274k8060N0534E5860C663d12670J06536g0030B9397N7726O5051b70088
10192E9084J3708J96519B0916O8968m2244d9246k27805G8331g5203J3675D60288
10180a17997A70300b81784a24041B7746c9512a8168H7358a89080a8388B70410
10169c44584d302j41969j07276N0350k48250G8534d04444i8345C21081A41396
10158i3311r9933H7890b84770l9293A64620j6184l1424h1550E4838J97637b3600
$$ plain form
10239 353393 240343 240156 251389 268377 110349 182861 208395 -23339 -257003 -101381 256083
10227 186467 -302157 84451 -4791 30680 30232 -167544 82583 -207185 8213 -199485 217402
10215 -45428 -101676 9464 87142 75601 -125090 220022 -76226 -150755 -218800 -15130 -73274
10204 -73274 -101334 -50800 55860 3663 -412670 -306134 -70030 29397 87123 152174 -270088
10192 59084 72792 269311 20916 89884 47640 -49246 -277051 78331 -75203 -61528 460288
10180 -117997 170300 -281784 -124041 27746 -39512 -18168 87358 -189080 -18388 270410
10169 -344584 -4302 -146271 -253547 -203197 -451447 78534 -404444 -98345 321081 141396
10158 -93311 -193244 87890 -284770 -324063 164620 148436 117012 -81550 54838 252475 -23600
10146f4153I1032e0690F5747d83880J25418I3362a22151e0852p6294a2801D3210
10134A08498i0980J6961R257A31807c34032H9132a39898j8569A376Q0595d8374
10122c03710N2087A86506a7506A09788a56002M2820c2952a3765r0797k519j95608
10111c02689a01078K0857j8803d669l9565j48522N0147j55132h2751a4963o8418
10100h3381F928J30210k8228h4039J4954K0376B62939C7891b81561i8818k6668
10089a25486M9225q7999A15834e4257A63998a01883A05331e9970C36740A39845
10078G2048a53951j80351a30363B40976a03856n3363A63686b94276H4806J06205
10068A91011c923k94641G7177h0100C436c7981k1873k26753B03964b83009a08511
$$ plain form
10146 -64153 91032 -50690 65747 -483880 -358462 93362 -122151 -50852 -127146 -12801 43210
10134 108498 -90980 -74019 -64762 131807 -334032 89132 -139898 -158467 1376 81971 -48374
10122 -303710 -251623 186506 -17506 109788 -156002 -113182 -32952 -13765 -104562 -107081 -302689
10111 -302689 -101078 -80221 -99024 -4669 -44234 -192756 -142609 -297741 -82751 -14963 -83381
10100 -83381 6928 137138 108910 -84039 -69085 -48709 262939 37891 -281561 -98818 -125486
10089 -125486 -76261 -164260 115834 -54257 163998 -101883 105331 -59970 336740 139845
10078 72048 -153951 -334302 -130363 240976 -103856 -157219 163686 -294276 84806 191011
10068 191011 -3923 -298564 77177 -80100 3436 -37981 -59854 -286607 203964 -283009 -108511
10056B15971b87790M5243Q3593j2034d0702j45552B69220h3697E1882f5412j12842
10045a78254J5696D47850A46653c15218e286j43634C16049p3326c4601k4112k2893
10034h1606j66996R9985l64790J73795B53825b80148E2192c68713A8275b20796
10023d0527a4325k77571j5751E2397b03923a9942q4776p793L8826j55097M8005
10012a80777Q1111C85141d28972C6347c76709G8143b34536A8914K272A296a77673
10000a17377C9113b95869a16105e157j83104B90449h2403o6634B4968i0400K5881
9989f4519B82405d18985o4568C9585J8517B1809a6597k36493A98013q0672J35227
9978B52568d559j95627l3563F8349a22877a3691A37473P1133A4657J30100m2176
$$ plain form
10056 215971 -287790 -242547 -158954 -170988 -40702 -186254 269220 -83697 51882 -65412 -178254
10045 -178254 -162558 447850 146653 -315218 -5286 -148920 316049 242723 -34601 -58713 -81606
10034 -81606 -248602 -148617 -513407 -339612 253825 -280148 52192 -368713 18275 -220796
10023 -40527 -14325 -291896 -307647 52397 -203923 -19942 -104718 -112511 -73685 -228782 -180777
10012 -180777 -99666 385141 -428972 36347 -376709 78143 -234536 18914 21186 1296 -177673
10000 -117377 39113 -295869 -116105 -5157 -188261 290449 -82403 -149037 24968 -90400 -64519
9989 -64519 282405 -418985 -483553 39585 58102 21809 -16597 -253090 198013 117341 252568
9978 252568 -4559 -200186 -233749 68349 -122877 -13691 137473 208606 14657 144757 102581
9967A02581c67053a01192d5081A45012a98498C04252b54185B5364a08029k78678
9957c86707a82141q0805J29240B85619A25767c87132a40962H5467d37839A29501
9946b70779B52134b0862p283r8179A18102a07572N088M4491j7315c33D1522M2239
9934H3761R0435F0195a47261p7367l3528i0038j18760K0627p1842i033B53850
9922B00334e7937j50712e1919l36015B32027a2440F4328c32827F5690h8915A87969
9910a49680j7428J2428N6609B03328a00952K0313k9383j17672A10490a17540a7192
9898e117C6566b22709N235m4697M328A35243c21386J14895C7000a2920A33667
9886c1855M59j22785i555o0420J5121l1074j69541J18398A51886D3414i2926o5227
$$ plain form
9967 102581 -367053 -101192 -45081 145012 -198498 304252 -254185 25364 -108029 -386707
9957 -386707 -182141 -262946 -133706 285619 125767 -387132 -140962 85467 -437839 129501
9946 -270779 252134 -20862 -28145 -126324 118102 -107572 -102484 -57993 -75308 -333 41522 83761
9934 83761 174196 60195 -147261 -224628 -258156 -90038 -208798 -188171 -260013 -9033 253850
9922 200334 -57937 -208649 -51919 -387934 232027 -12440 64328 -332827 65690 -88915 187969
9910 -149680 -167108 -154680 -98071 203328 -100952 -80639 -110022 -227694 110490 -117540 -17192
9898 -5117 36566 -222709 -217474 -262171 -257843 135243 -321386 -206491 37000 -12920 133667
9886 -31855 -31396 -154181 -9555 -69975 -54854 -85928 -255469 -137071 151886 43414 -92926 -158153
9874a58153n1462C80572a38915m15330b07296B27646a25347j77815A9283G8a03749
9862d36741a04776B88397c05151P4625D5293f9445G3040c35049L4359O8055h8586
9850G0260b34259A34176i9952A72775i7173b4398k2614j32607B22108K3178A13084
9838b6358k05760j32547a77280g679I6724b7525A67721b46937E3533g0374E9890
9826A15601a72131r302k33769J66901E7545a20919A81555a31248A98077A6083
9815a23364L4780A38082B783i877j45482k11356a59658P0721I2928N5461b85271
9803b58370P6985N7333o5983O9531A67161a2376E5303D194b46754B29889E4800
9791i6672D5060c43164P4024I7571d01025e3530k562A7242R3388L2349o5622c12083
$$ plain form
9874 -158153 -209615 380572 -138915 -554245 -207296 227646 -125347 -303162 19283 78 -103749
9862 -436741 -104776 288397 -305151 -230526 45293 -69445 73040 -335049 -300690 -232635 -88586
9850 70260 -234259 134176 -99952 172775 -97173 -24398 -47012 -179619 222108 245286 113084
9838 -26358 -232118 -364665 -177280 -7679 96724 -27525 167721 -246937 53533 -70374 59890
9826 115601 -172131 -181433 -415202 -248301 57545 -120919 181555 -131248 198077 16083
9815 -123364 -88584 138082 2783 -9877 -155359 -366715 -159658 -88937 92928 148389 -285271
9803 -258370 -181385 -124052 -190035 -120504 167161 -12376 55303 4194 -246754 229889 54800
9791 -96672 45060 -343164 -269140 97571 -401025 -53530 -56092 17242 110630 142979 77357 -312083
9778a19130d8007A7250b87760h8385k01966h9223p5705A29037O7979G2799d1837
9766c2817j00389j2002P2433j42049k93542Q6987e0772H63a5770C1486J20162
9755A51648a31114e0140O965A37029a83312K5618O1050C75305a28422A9000J54112
9744A73112c23070B7306g3977A64426a46108f8679j83l00628g3702K4080F0810
9732f6585K3953A03426a17239j94603d018o4046K7026E049a25875B09019I1519
9720B80194a84129K7894j30278a23853q7954k771a6441j37177A35597a89637k15110
9709d04747I6505a7950j31760M2786a5739l54662a23966l2483O0301k21346I4828
9697h8772j91407k22766D4493a99157B0760b3917k32910J9684F2486h2660H5503
$$ plain form
9778 -119130 -48007 17250 -287760 -88385 -290351 -89223 -164928 129037 197016 72799 -41837
9766 -32817 -133206 -145208 -72775 -214824 -508366 -421379 -50772 863 -15770 31486 151648
9755 151648 -131114 -50140 -43175 137029 -183312 -157694 -96644 375305 -128422 19000 173112
9744 173112 -323070 27306 -73977 164426 -146108 -68679 -68862 -369490 -73702 -49622 60810
9732 -66585 -42632 103426 -117239 -311842 -4018 -68064 -41038 5049 -125875 209019 91519
9720 280194 -184129 -156235 -286513 -123853 -211807 -214578 -16441 -153618 135597 -189637 -404747
9709 -404747 96505 -17950 -149710 -106924 -15739 -370401 -123966 -156449 -96148 -317494 94828
9697 -88772 -280179 -502945 44493 -199157 20760 -23917 -256827 -237143 62486 -82660 85503
9685H8387a63305G0766g3896r0710j50463K1080B5014d09160A84620a65650j08541
9674b74191F8324A7580b96096M6673M3060B8917b31482j24891a65124M3308j27402
9663b49218D4580a85881j50376e4875j34090h4307b9966j09156o3876N3928b236
9651a07102c3261j00772f5888b2604j7951l4226A63245R7589E9198b1896i720
9639A0004b03579p552N9364l9018e6681J894B56135I5426r992K5868a42241d975
9626a29377A71570D6288J85321a04400m9288A0654b41471p413I9996a62176c9442
9614a67708J4517A39114f3434A10009k588J03287a90688g1924n9516k39083B39919
9602B04931A4828b70631B20227G3504d316A15557a6505j10507B30605e6764j80154
$$ plain form
9685 88387 -163305 70766 -73896 -164606 -315069 -293989 25014 -409160 184620 -165650 -274191
9674 -274191 68324 17580 -296096 -249423 -206363 28917 -231482 -356373 -165124 -121816 -249218
9663 -249218 44580 -185881 -336257 -54875 -188965 -84307 -29966 -139122 -202998 -149070 -2236
9651 -107102 -33261 -134033 -65888 -22604 -40555 -74781 163245 260834 59198 -21896 -9720
9639 10004 -203579 -211131 -151767 -190785 -56681 -54787 256135 95426 85434 111302 -142241 -4975
9626 -129377 171570 46288 231609 -104400 -153688 10654 -241471 -248884 99996 -162176 -39442
9614 -167708 -153191 139114 -63434 110009 107421 210708 -190688 -71924 -131440 -370523 239919
9602 204931 14828 -270631 220227 73504 -4316 115557 -16505 -127012 230605 -56764 -236918
9591b36918R8930C00496I2692L6374c1543f388B05231b59571R80J13550A53410
9579B94804c59048a59297O1950A27198b91468M6499k5879f5778A6779a6903j71398
9568a88301I9902K48346b8072F8719b43127J516A71433c50465c5753o3657j31102
9557b30512M9398A11856h3278q7709a6790n1335k07863j61066F7470f9009B1677
9545F0056a95818L2913B4082L51439a7848o9580i858k05489B28801a75981N2994
9534a22987n6668j10858B68236E8236a47964o8723P713H8027a82281n1426F776
9522c55461a9706B77253a85378O2781M2774B32293b1903k44665a03841a5709C10874
9510a92459h9837j48974J3967a10911o7356A65000J9402b67119d542j50605a6766
$$ plain form
9591 -236918 -137988 300496 92692 129066 -31543 -6388 205231 -259571 -258591 -145041 153410
9579 294804 -359048 -159297 -97347 127198 -291468 -244969 -270848 -65778 16779 -16903 -188301
9568 -188301 99902 348248 -28072 68719 -243127 -241611 171433 -350465 -35753 -99410 -230512
9557 -230512 -181114 111856 -83278 -170987 -16790 -68125 -275988 -437054 67470 -69009 21677
9545 60056 -195818 -162905 24082 375521 -17848 -87428 -9858 -215347 228801 -175981 -122987
9534 -122987 -179655 -290513 268236 58236 -147964 -216687 -208974 88027 -182281 -233707 6776
9522 -355461 -19706 277253 -185378 -122597 -79823 232293 -21903 -266568 -103841 -15709 310874
9510 -192459 -89837 -238811 -224844 -110911 -178267 165000 184402 -267119 -4542 -155147 -16766
9498b47227a09994j9944g41B75301b10831J5005B41568i076A29531b84292A66456
9486B29497q5837b57542J05375A52452b82565J1187h7685j62212A90312H5895
9475i8045A75943h5104p723D9509c05785c4939k7264G8872k6427c4162j77183
9464b11345K2802i0435A87584n1406a23485o6454b1540A58293d66000a34005c6649
9452I8145a32912o4414C9233J15315B565i9801B2434J68251a16425C65062I4076
9440b94191A45988f2162A70313e0830A24223c40897a43921m1396n5145A46126
9429B05679c11399H5617J15577e4134j21264E9182a18935D2778c08208A05871
9418I7573j3603a25879G0578f81867a12785p6449m2542p5322I2139b82485H9780
$$ plain form
9498 -247227 -109994 -129938 -741 275301 -210831 -195826 241568 -9076 129531 -284292 166456
9486 229497 143660 -257542 -152167 152452 -282565 -271378 -87685 -249897 190312 85895
9475 -98045 175943 -85104 -92827 49509 -305785 -34939 -62203 78872 52445 -34162 -211345
9464 -211345 -188543 -90435 187584 136178 -123485 -189939 -21540 158293 -466000 -134005 -36649
9452 98145 -132912 -197326 39233 154548 2565 -99801 22434 190685 -116425 365062 94076
9440 -294191 145988 -62162 170313 -50830 124223 -340897 -143921 -185317 -240462 146126
9429 205679 -311399 85617 201194 -54134 -175398 59182 -118935 42778 -308208 105871
9418 97573 83970 -125879 70578 -681867 -112785 -189234 -231776 -307098 92139 -282485 89780
9406a47601O0021p1766j24290a01984L5111I1938K1645a36388B7530a36552e6888
9394b32318A23284K21586f3861B84382g0590C9393a28385C8521j1370B170K18667
9383B20837F5801b67068M4873r7984k15450B319a54208g2310n1171C3141b77597
9371b03514B06191a0747B8089c4553n6267M1734G0769k8650a50941g372B2718
9359b91352A47434A3463J17505b66447b4794k21852J15529c1038q775j16248L380
9348a52681d5892j02189B9176i1477L7884E9664M1869a23766A23524b49631a8334
9336a37248f5896j88142a15843k5424r1578C59293b67143D2622K34814d12613
9325a03953A30126a4017j50747j236K6611f1673I4624b19608B75249j20190P838
$$ plain form
9406 -147601 -87580 -159346 -283636 -101984 -66873 91938 113583 -136388 27530 -136552 -56888
9394 -232318 123284 344870 -63861 284382 -70590 39393 -128385 38521 27151 2170 220837
9383 220837 65801 -267068 -222195 -320179 -535629 2319 -154208 -72310 -123481 33141 -277597
9371 -203514 206191 -10747 28089 -34553 -90820 -49086 70769 42119 -150941 -7372 22718
9359 -291352 147434 13463 130968 -266447 -24794 -246646 -131117 -31038 -39813 -156061 -152681
9348 -152681 -45892 -148081 29176 -91477 -53593 59664 101533 -123766 123524 -249631 -18334
9336 -137248 -65896 -254038 -115843 -141267 -232845 359293 -267143 42622 277436 -412613
9325 -103953 130126 -14017 -164764 -166000 -139389 -61673 94624 -219608 275249 155059 162897
9314A62897b89463C44078E9271J98756d78298J74751L1027J4389B00321r3911
9304A06410b00207f3507G3872a05782B02627b57241l9868O2845A02070J41278
9294B43348d60763A29109a39417f339b146C66443j74923a90246d5095k37019J40396
9283a41718c3932k22457N1690R7706M8857k4232D381b04834E46a24920C36595
9271C4699N8079C3717K09299c5891q8913k06420a49996g2459A61881a1561k34984
9260b46545A26595b86990a4293m9769l98847a75275P4722n6185l0412d4908n6681
9249a01589l4728c0417o5543A35847d00576f1201a561l60398a52131f074j55734
9238a61808A44531b5981n4916E0885N3525a54425M7646C06213C7302a44275E6543
$$ plain form
9314 162897 -289463 344078 59271 258027 -478298 -303547 -272520 -258131 200321 106410
9304 106410 -200207 -63507 73872 -105782 202627 -257241 -297109 -234264 102070 243348
9294 243348 -460763 129109 -139417 -6339 -2146 366443 191520 -190246 -45095 -282114 -141718
9283 -141718 -33932 -256389 -204699 -106993 -58136 -82368 4381 -204834 546 -124920 336595
9271 34699 92778 33717 243016 -35891 -124804 -331224 -149996 -72459 161881 -11561 -246545
9260 -246545 126595 -286990 -14293 -64062 -462909 -175275 -100553 -156738 -187150 -44908 -101589
9249 -101589 -136317 -30417 -95960 135847 -400576 -61201 -1561 -361959 -152131 -6074 -161808
9238 -161808 144531 -25981 -80897 50885 104410 -154425 -106779 306213 37302 -144275 56543
9226a50317A05728C6925A3742c25083N5387a09815m2864N8118B77894a3232j65036
9215a78268k58850a92587M5972A25831b24293f3257B1648N8713a7869C3081e6217
9203I1841M4310J7314a50775B2252b38373a01185C07984a64836H2236g3064l94540
9192d67604a43600q7599m9222j48751C04132a50156B43962A3244d7965k63727
9182c11692A12257c55645B8420i426B35771B0163d92671B2433g7925D4587c03280
9170c42446a01078l1958d9552I1867L0584b52804B08288H090N1702b5370C4305
9158c37239I8686O4461a13609k94348a02107B23715a9427D6780c6725j03406A25531
9146E7165K50926a14777N1236G741b94340f9758j21641H8397E601K11566i3278
$$ plain form
9226 -150317 105728 36925 13742 -325083 -269696 -109815 -152679 -94561 277894 -13232 -178268
9215 -178268 -437118 -192587 -146615 125831 -224293 -63257 21648 80361 -17869 33081 -56217
9203 91841 136151 153465 -150775 22252 -238373 -101185 307984 -164836 82236 -73064 -467604
9192 -467604 -143600 -231199 -280421 -429172 304132 -150156 243962 13244 -47965 -311692
9182 -311692 112257 -355645 28420 -9426 235771 20163 -492671 22433 -77925 44587 -303280
9170 -342446 -101078 -133036 -49552 91867 122451 -252804 208288 8090 59792 -25370 34305
9158 -337239 98686 163147 -113609 -407957 -102107 223715 -19427 46780 -36725 -140131 125531
9146 57165 308091 -114777 -63541 7741 -294340 -69758 -191399 88397 5601 217167 -93278
9134E02376C067h104k74220d0801j00627M2582C54163c8501r5380k4661j09964
9123b68506J09370B21238D4306R0007C0150R7034a08450G5512J92330F3392c00388
9111b41760A77101o3523j2289a32723j04363a06412A42547K15801a48746B56894
9100b13819j64574A20012P0237d04246a52124f9766j18833H7720M5568k9387d22829
9088e3368K1240C85801a32586k32127a08360l2251A13928o073f8293r7794L0068
9077a36019A97657a54712R100l5546c7715j8629B8870a22075o3793D5094c1316
9065b25846I5578b5660j50681d8401A36309a43479C660A819b77201A66461a36338
9053a53888M0001A78814p0434a74786k2446k9667A93382a5338A3870d33316a83993
$$ plain form
9134 502376 3067 -8104 -282324 -40801 -141428 -98846 354163 -38501 -133881 -158542 -268506
9123 -268506 -159136 221238 44306 134313 30150 127184 -108450 75512 267842 63392 -300388
9111 -241760 177101 113578 101289 -132723 -237086 -106412 142547 358348 -148746 256894
9100 -213819 -378393 120012 190249 -404246 -152124 -69766 -188599 87720 133288 103901 -422829
9088 -53368 -32128 385801 -132586 -364713 -108360 -140611 113928 107855 -68293 -166087 -136019
9077 -136019 197657 -154712 -145612 -181158 -37715 -56344 28870 -122075 -185868 45094 -31316
9065 -225846 95578 -25660 -176341 -48401 136309 -143479 3660 1819 -277201 166461 -136338
9053 -153888 -113887 178814 108380 -174786 -197232 -226899 193382 -15338 13870 -433316 -183993
9041g079C9012M486L4116d3133j03035k15118a56396p4849d1987A46332b8645
9029a46266J6849e7893F6375J54196d5998C04844D8567J68763b63986h0140k2561
9018a02701B6202c55786J76701A39957A2125J03338K73126A91620e551A02252
9007e6783B90426c55247J66221b8234l9337j52687m5834F8212c6953m05370B7282
8995a64532j58835h7524B3534c14657A33701P8801a95181R0174M7354k38331k12129
8984e08113A89203b39691i4855A84083b44932A05053l4003d68661K17001H2056
8973b23720A9985d8097J4111k80516a25290l705j07844k54128D4914a41020J553
8962a39467A05900i6700M6658A15020c49999D9767f73346G7388i683E6786a05143
$$ plain form
9041 -7079 39012 43498 77614 -43133 -146168 -361286 -156396 -231245 -41987 146332 -28645
9029 -146266 -129417 -57893 66375 220571 -45998 304844 48567 217330 -263986 -80140 -102701
9018 -102701 26202 -355786 -179085 139957 12125 115463 388589 191620 -5551 102252
9007 -56783 290426 -355247 -189026 -28234 -67571 -220258 -266092 68212 -36953 -442323 27282
8995 -164532 -323367 -87524 23534 -314657 133701 212502 -195181 -105007 -57653 -295984 -508113
8984 -508113 189203 -239691 -94855 184083 -244932 105053 71050 -468661 -251660 82056
8973 -223720 19985 -48097 -33986 -314502 -125290 -128995 -236839 -490967 44914 -141020 -139467
8962 -139467 105900 -96700 -50042 115020 -349999 49767 -673346 77388 -9683 56786 -105143
8950b11649E8048J93856E2247K15275D4175a51056C40950E4953K3290i6806k20329
8939c17135A98603r9269C9775a0955F9989h2837C7237K70146I1975i9176d4789
8927i678C9346K6264c17358G2759d2160A73878a39350A4738J57663n7314a73143
8915g176C68938a93263C3051c6151I3102H669M78009A61131K88025N94829Q22755
8904A866740J817471R36709A790435l57498m99685C54537A09580P542J94315b63916
8893A25575o1268L6416J18852i094A00229J49385a17236M2105a8900r0432B0758
8881b70332i8754K6523l2358A0737b756A26877a64083c3095k8319J4559l0516
8870g7371b3524j21027B4520A406J66229b7006j65388A56647c6877H836K5526
$$ plain form
8950 -211649 58048 251904 52247 267522 44175 -151056 340950 54953 78243 -96806 -317135
8939 -317135 198603 99334 39775 -10955 69989 -82837 37237 307383 91975 -99176 -44789
8927 -9678 39346 65610 -317358 72759 -42160 173878 -139350 14738 172401 115087 -173143
8915 -7176 368938 -193263 33051 -36151 93102 8669 486678 161131 449156 1043985 1866740
8904 1866740 3684211 4620920 1790435 1432937 933252 354537 109580 117122 311437 -263916
8893 125575 64307 100723 219575 -9094 100229 249614 -117236 -75131 -18900 -109332 20758
8881 -270332 -98754 -72231 -104589 10737 -2756 126877 -164083 -33095 -61414 -46855 -77371
8870 -77371 -23524 -144551 24520 1406 167635 -27006 -192394 156647 -36877 8836 34362
8859C4362d482p0516k61940E2127a45106Q686k3213e3977k39446D534d62447C8052
8846A18980f8991B37015C9211b74985I0221c77872C701O3795K00962a53181l2422
8835a85603C6372d22206J14840J14718A01541a37993c3996j26707J3503J5566
8825a31634B13478a75420j09405C08728q6245K9871b05026p8092A65553D5852
$$ plain form
8859 34362 -4482 -74998 -336938 52127 -145106 -136420 -159633 -53977 -293423 4534 -462447 38052
8846 118980 -68991 237015 39211 -274985 90221 -377872 3701 67496 268458 -153181 -185603
8835 -185603 36372 -422206 -307366 -192648 101541 -137993 -33996 -160703 -147200 -131634
8825 -131634 213478 -175420 -284825 308728 222483 252354 -205026 -283118 165553 45852
$$ [...]
##END NTUPLES=NMR SPECTRUM
##END=
