
##TITLE=AC1086_CCIN01_5835837_6RdfhfLT20
##JCAMPDX= 6.0         $$ Bruker NMR JCAMP-DX V2.0
##DATA TYPE= NMR SPECTRUM
##DATA CLASS= NTUPLES
##ORIGIN= BRUKER
##OWNER= Administrator
$$ 1.72 TOPSPIN		Version 2.1
$$ 2012-04-16 19:09:38.671 -0500  Administrator@TOPSPIN
$$ Compression mode = diff/dup
##.OBSERVE FREQUENCY= 400.13188235
##.OBSERVE NUCLEUS= ^1H
##.ACQUISITION MODE= SIMULTANEOUS (DQD)
##.ACQUISITION SCHEME= undefined
##.AVERAGES= 64
##.DIGITISER RES= 22
##SPECTROMETER/DATA SYSTEM= spect
##.PULSE SEQUENCE= noesygpps1d.comp
##.SOLVENT NAME= COFFEE_meoh
##.SHIFT REFERENCE= INTERNAL, COFFEE_meoh, 1, 14.96813
##AUDIT TRAIL= $$ (NUMBER, WHEN, WHO, WHERE, PROCESS, VERSION, WHAT)
$$ ##TITLE= Audit trail, TOPSPIN		Version 2.1
$$ ##JCAMPDX= 5.01
$$ ##ORIGIN= Bruker BioSpin GmbH
$$ ##OWNER= Administrator
$$ $$ C:\Bruker\TOPSPIN/data/COFFEE/nmr/AC1086_CCIN01_5835837_6RdfhfLT20/22/pdata/1/auditp.txt
$$ ##AUDIT TRAIL=  $$ (NUMBER, WHEN, WHO, WHERE, PROCESS, VERSION, WHAT)
(   1,<2012-04-15 12:58:13.218 -0500>,<Administrator>,<TOPSPIN>,<go>,<TOPSPIN 2.1>,
      <created by zg
	started at 2012-04-15 12:46:41.562 -0500,
	POWCHK enabled, PULCHK disabled,
       configuration hash MD5:
       1A 1E CE 29 27 FD 77 03 67 4E F0 E3 C4 B2 CB 90
       data hash MD5: 64K
       42 47 97 55 82 21 CC B3 C5 0F 7F 41 75 BB 7B 37>)
(   2,<2012-04-15 12:58:16.078 -0500>,<Administrator>,<TOPSPIN>,<proc1d>,<TOPSPIN 2.1>,
      <Start of raw data processing
       efp LB = 0.3 FT_mod = 6 PKNL = 1 PHC0 = 0 PHC1 = 0 SI = 128K 
       data hash MD5: 128K
       58 FC 10 EA 74 45 E1 F8 82 34 C3 66 27 03 21 DD>)
(   3,<2012-04-15 12:58:17.328 -0500>,<Administrator>,<TOPSPIN>,<proc1d>,<TOPSPIN 2.1>,
      <pk PHC0 = 33.07434 PHC1 = 0 
       data hash MD5: 128K
       81 67 BF 21 76 EA F6 8F 87 18 46 C6 6A B5 67 08>)
(   4,<2012-04-15 12:58:17.796 -0500>,<Administrator>,<TOPSPIN>,<proc1d>,<TOPSPIN 2.1>,
      <abs ABSG = 1 
       data hash MD5: 128K
       85 10 9A 3A C1 03 BA 63 4E 3D 2B 5B CF 01 33 F8>)
(   5,<2012-04-15 12:58:17.890 -0500>,<Administrator>,<TOPSPIN>,<proc1d>,<TOPSPIN 2.1>,
      <abs ABSG = 2 
       data hash MD5: 128K
       C5 65 22 0F 7C 01 5D FB 04 A4 9E 51 8C 49 A4 AD>)
(   6,<2012-04-15 12:58:17.937 -0500>,<Administrator>,<TOPSPIN>,<proc1d>,<TOPSPIN 2.1>,
      <abs ABSG = 3 
       data hash MD5: 128K
       D5 4D 69 A6 A2 AE 0B FB 2B 19 B4 68 E2 C8 23 40>)
(   7,<2012-04-15 12:58:18.000 -0500>,<Administrator>,<TOPSPIN>,<proc1d>,<TOPSPIN 2.1>,
      <abs ABSG = 4 
       data hash MD5: 128K
       A8 DA 3B 32 9E DC BC 07 15 FB 02 A7 07 6A B9 FC>)
(   8,<2012-04-15 12:58:18.046 -0500>,<Administrator>,<TOPSPIN>,<proc1d>,<TOPSPIN 2.1>,
      <abs ABSG = 5 
       data hash MD5: 128K
       18 1B B0 11 04 9C 63 90 97 F0 F7 A0 54 01 A6 F0>)
(   9,<2012-04-15 12:58:18.281 -0500>,<Administrator>,<TOPSPIN>,<audit>,<TOPSPIN 2.1>,
      <user comment:
       ICON-NMR User ID: COFFEE
       data hash MD5: 128K
$$ [...]
##$TP07= 0
##$TPNAME0= <>
##$TPNAME1= <>
##$TPNAME2= <>
##$TPNAME3= <>
##$TPNAME4= <>
##$TPNAME5= <>
##$TPNAME6= <>
##$TPNAME7= <>
##$TPOAL= (0..7)
0.5 0.5 0.5 0.5 0.5 0.5 0.5 0.5
##$TPOFFS= (0..7)
0 0 0 0 0 0 0 0
##$TUNHIN= 0
##$TUNHOUT= 0
##$TUNXOUT= 0
##$USERA1= <user>
##$USERA2= <user>
##$USERA3= <user>
##$USERA4= <user>
##$USERA5= <user>
##$V9= 5
##$VALIST= <valist>
##$VCLIST= <CCCCCCCCCCCCCCC>
##$VD= 0
##$VDLIST= <DDDDDDDDDDDDDDD>
##$VPLIST= <PPPPPPPPPPPPPPP>
##$VTLIST= <TTTTTTTTTTTTTTT>
##$WBST= 2048
##$WBSW= 25
##$XGAIN= (0..3)
0 0 0 0
##$XL= 0
##$YL= 0
##$YMAX_a= 11390558
##$YMIN_a= -6408231
##$ZGOPTNS= <>
##$ZL1= 120
##$ZL2= 120
##$ZL3= 120
##$ZL4= 120
##$ABSF1= 14.96813
##$ABSF2= -5.5844
##$ABSG= 5
##$ABSL= 3
##$ALPHA= 0
##$AQORDER= 0
##$ASSFAC= 0
##$ASSFACI= 0
##$ASSFACX= 0
##$ASSWID= 0
##$AUNMP= <proc_prof1d_extract.lims>
##$AXLEFT= 0
##$AXNAME= <>
##$AXNUC= <1H>
##$AXRIGHT= 0
##$AXTYPE= 0
##$AXUNIT= <>
##$AZFE= 0.1
##$AZFW= 0.1
##$BCFW= 0
##$BC_mod= 0
##$BYTORDP= 0
##$COROFFS= 0
##$CY= 15
##$DATMOD= 1
##$DC= 0
##$DFILT= <>
##$DTYPP= 0
##$F1P= 0
##$F2P= 0
##$FCOR= 0.5
##$FTSIZE= 131072
##$FT_mod= 6
##$GAMMA= 0
##$GB= 0
##$INTBC= 1
##$INTSCL= 1
##$ISEN= 128
##$LB= 0.3
##$LEV0= 0
##$LPBIN= 0
##$MAXI= 10000
##$MC2= 0
##$MEAN= 0
##$ME_mod= 0
##$MI= 0
##$NCOEF= 0
##$NC_proc= -2
##$NLEV= 6
##$NOISF1= 0
##$NOISF2= 0
##$NSP= 0
##$NTH_PI= 0
##$NZP= 0
##$OFFSET= 14.96813
##$PC= 1
##$PHC0= 33.07434
##$PHC1= 0
##$PH_mod= 1
##$PKNL= yes
##$PPARMOD= 0
##$PPDIAG= 0
##$PPIPTYP= 0
##$PPMPNUM= 2147483647
##$PPRESOL= 1
##$PSCAL= 4
##$PSIGN= 0
##$PYNMP= <proc.py>
##$REVERSE= no
##$SF= 400.130004995441
##$SI= 131072
##$SIGF1= 0
##$SIGF2= 0
##$SINO= 400
##$SIOLD= 131072
##$SPECTYP= <>
##$SREGLST= <1H.CDCl3>
##$SSB= 0
##$STSI= 131072
##$STSR= 0
##$SW_p= 8223.68421052632
##$SYMM= 0
##$S_DEV= 0
##$TDeff= 65536
##$TDoff= 0
##$TI= <>
##$TILT= no
##$TM1= 0
##$TM2= 0
##$TOPLEV= 0
##$USERP1= <user>
##$USERP2= <user>
##$USERP3= <user>
##$USERP4= <user>
##$USERP5= <user>
##$WDW= 1
##$XDIM= 131072
##$YMAX_p= 224847618
##$YMIN_p= -302644345
##$CURPLOT= <Network HP LaserJet P1505>
##$CURPRIN= <$Network HP LaserJet P1505>
##$DFORMAT= <normdp>
##$LAYOUT= <+/1D_H.xwp>
##$LFORMAT= <normlp>
##$PFORMAT= <normpl>
##$SURQMSG= 1
$$ End of Bruker specific parameters
$$ ---------------------------------
##NTUPLES= NMR SPECTRUM
##VAR_NAME=  FREQUENCY,     SPECTRUM/REAL,   SPECTRUM/IMAG
##SYMBOL=    X,             R,               I
##VAR_TYPE=  INDEPENDENT,   DEPENDENT,       DEPENDENT
##VAR_FORM=  AFFN,          ASDF,            ASDF
##VAR_DIM=   131072,        131072,          131072
##UNITS=     HZ,            ARBITRARY UNITS, ARBITRARY UNITS
##FACTOR=    0.0627417313425165, 1,          1
##FIRST=     8223.62146879498, -2676,        -44665
##LAST=      0,             174,             -45019
##MIN=       0,             -302644345,      0
##MAX=       8223.62146879498, 224847618,    0
$$ Real data points
##PAGE= N=1
##DATA TABLE= (X++(R..R)), XYDATA
$$ [...]
62072A008972m151l761l452k748j624m29O43J614K551L621N035O608P733Q215
62058A028827Q710R891J1450J2554J2967J3163J3531J4134J5075J6399J7726J8655
62046A193082J9503K0864K2562K3786K4394K5156K6494K7806K8397K8289K7722
62035A468055K6644K5302K4596K5073K6028K6410K6193K6124K6383K6384K5899
62024A753091K5532K5913K6998K8290K9337K9937L0275L0932L2303L3839L4392
62013B080839L3566L2305L1843L2374L3144L3672L4265L5291L6415L6882L6390
62002B456986L5303L3955L2201K9835K7194K4846K2795K0447J7442J4159J1176
61991B726339Q583O074L530J165p79k292l528m611n509o107o424o672o841o428
$$ y = [1008972, 1004821, 1001060, 997608, 994860, 993236, 992807, 993450, 995064, 997615, 1001236, 1006271, 1012879, 1020612, 1028827, 1037537, 1047428, 1058878, 1071432, 1084399, 1097562, 1111093, 1125227, 1140302, 1156701, 1174427, 1193082, 1212585, 1233449, 1256011, 1279797, 1304191, 1329347, 1355841, 1383647, 1412044, 1440333, 1468055, 1494699, 1520001, 1544597, 1569670, 1595698, 1622108, 1648301, 1674425, 1700808, 1727192, 1753091, 1778623, 1804536, 1831534, 1859824, 1889161, 1919098, 1949373, 1980305, 2012608, 2046447, 2080839, 2114405, 2146710, 2178553, 2210927, 2244071, 2277743, 2312008, 2347299, 2383714, 2420596, 2456986, 2492289, 2526244, 2558445, 2588280, 2615474, 2640320, 2663115, 2683562, 2701004, 2715163, 2726339, 2734922, 2740996, 2744526, 2745691, 2744912, 2742620, 2739092, 2734481, 2728972, 2722865, 2716441, 2709769, 2702928, 2696500]
61977B696500n091l401k453k520k758k471k041k133k598k823k750k811l106l345
61963B656199l520l955m688n368n802o097o201n846n049m241l757l520l288k912
61949B591955k314j528p52r2P33K066L775N360O530P248P345O663N547M672M180
61934B641388L477J993k78l026n885q385j0194j1670j3591j6082j8259j9271j9285
61921B520932j9064j9022j9084j9198j9399j9586j9590j9438j9291j9190j9088
61910B308982j8975j8803j8415j7752j7002j6355j5782j5268j5003j5056j5047
61899B125524j4463j3330j2275j1852j1961j2016j1545j0542r242p722n899l946
61887B000731k403j698j585j317l53J264L131M920O579Q243R972J1497J2505J3173
$$ y = [2696500, 2691409, 2688008, 2685555, 2683035, 2680277, 2677806, 2675765, 2673632, 2671034, 2668211, 2665461, 2662650, 2659544, 2656199, 2652679, 2648724, 2644036, 2638668, 2632866, 2626769, 2620568, 2614722, 2609673, 2605432, 2601675, 2598155, 2594867, 2591955, 2589641, 2588113, 2587361, 2587269, 2588002, 2590068, 2593843, 2599203, 2605733, 2612981, 2620326, 2626989, 2632536, 2637208, 2641388, 2644865, 2646858, 2646580, 2643554, 2637669, 2629284, 2619090, 2607420, 2593829, 2577747, 2559488, 2540217, 2520932, 2501868, 2482846, 2463762, 2444564, 2425165, 2405579, 2385989, 2366551, 2347260, 2328070, 2308982, 2290007, 2271204, 2252789, 2235037, 2218035, 2201680, 2185898, 2170630, 2155627, 2140571, 2125524, 2111061, 2097731, 2085456, 2073604, 2061643, 2049627, 2038082, 2027540, 2018298, 2010576, 2004677, 2000731, 1998328, 1996630, 1995045, 1993728, 1993375, 1994639, 1997770, 2002690, 2009269, 2017512, 2027484, 2038981, 2051486, 2064659]
61873B064659J4079J5339J6350J6779J7282J8638K0532K2100K3369K5171K7668
61862B281966L0049L1949L4180L7638M2288M7681N3674O0184O6904P3817Q1449
61851B841779R0098R9462J09488J20876J34115J48669J63897J80146J98069K17303
61841D303902K36846K56420K76421K96554L15356L31031L41860L45709L40002
61832G044101L22505K91773K46940J88052J17159L8657m1794j18719j87621k45355
61822G655698k90464l23021l43955l54515l56261l51002l40420l25758l07962
61813D662340k88030k67185k46753k27625k09772j92505j75487j59233j44440
61804B751310j31190j19220j08505r9006r0109q1109p2190o4243n7643n1784m5894
$$ y = [2064659, 2078738, 2094077, 2110427, 2127206, 2144488, 2163126, 2183658, 2205758, 2229127, 2254298, 2281966, 2312015, 2343964, 2378144, 2415782, 2458070, 2505751, 2559425, 2619609, 2686513, 2760330, 2841779, 2931877, 3031339, 3140827, 3261703, 3395818, 3544487, 3708384, 3888530, 4086599, 4303902, 4540748, 4797168, 5073589, 5370143, 5685499, 6016530, 6358390, 6704099, 7044101, 7366606, 7658379, 7905319, 8093371, 8210530, 8249187, 8207393, 8088674, 7901053, 7655698, 7365234, 7042213, 6698258, 6343743, 5987482, 5636480, 5296060, 4970302, 4662340, 4374310, 4107125, 3860372, 3632747, 3422975, 3230470, 3054983, 2895750, 2751310, 2620120, 2500900, 2392395, 2293389, 2203280, 2122171, 2049981, 1985738, 1928095, 1876311, 1830417]
61793A830417l9832l3999k8952k5148k2530k0371j7941j5391j3453j2324j1499
61782A588977j0759j0520j0962j1569j1867j1978j1977j1340r639p362n381l892
61770A471731k453q18Q65K539M286N858O670O431N535M612L946L375K637J711
61756A516925R20O90J179K143L267M511O109Q304J1200J4759J8780K2840K6482
61743A638109K9591L2565L6030M0255M4842M9099N2758N6204O0048O4620O9911
61732B174032P5736Q1826Q8093R4885J02652J11095J19262J26882J35184J45573
61722C255220J57971J71314J85530K01862K21074K42504K65350K90022L17467
61713E308314L47851L80667M15645M52669M90940N28884N64729N96591O22013
$$ y = [1830417, 1790585, 1756586, 1727634, 1702486, 1679956, 1659585, 1641644, 1626253, 1612800, 1600476, 1588977, 1578218, 1567698, 1556736, 1545167, 1533300, 1521322, 1509345, 1498005, 1488366, 1481004, 1475623, 1471731, 1469278, 1468460, 1469325, 1471864, 1476150, 1482008, 1488678, 1495109, 1500644, 1505256, 1509202, 1512577, 1515214, 1516925, 1517845, 1518535, 1519714, 1521857, 1525124, 1529635, 1535744, 1544048, 1555248, 1570007, 1588787, 1611627, 1638109, 1667700, 1700265, 1736295, 1776550, 1821392, 1870491, 1923249, 1979453, 2039501, 2104121, 2174032, 2249768, 2331594, 2419687, 2514572, 2617224, 2728319, 2847581, 2974463, 3109647, 3255220, 3413191, 3584505, 3770035, 3971897, 4192971, 4435475, 4700825, 4990847, 5308314, 5656165, 6036832, 6452477, 6905146, 7396086, 7924970, 8489699, 9086290, 9708303]
61704I708303O37967O41145O27856N93822N35063M49726L39385K09129O6857p7861
61694A3731392k15447l38063m40500n20129n76628o11751o28610o30523o20309
61685I149432o00472n73597n42207n08279m73128m37748m03153l70226l39281
61676D901341l10068k82423k56882k34248k14547j96840j80203j64562j50251
61667B911317j37224j25221j14403j05160r7288r0030q3084p6993p2267o8557
61657A941090o5079o1545n8217n5271n2513m9719m6868m4014m1197l8529l6141
61646A391997l3906l1503k8946k6830k5763k5570k5373k4442k2815k0993j9380
61635A106476j8191j7622j7674j7907j7748j7100j6358j5717j4908j3739j2637
$$ y = [9708303, 10346270, 10987415, 11615271, 12209093, 12744156, 13193882, 13533267, 13742396, 13809253, 13731392, 13515945, 13177882, 12737382, 12217253, 11640625, 11028874, 10400264, 9769741, 9149432, 8548960, 7975363, 7433156, 6924877, 6451749, 6014001, 5610848, 5240622, 4901341, 4591273, 4308850, 4051968, 3817720, 3603173, 3406333, 3226130, 3061568, 2911317, 2774093, 2648872, 2534469, 2429309, 2332021, 2241991, 2158907, 2081914, 2009647, 1941090, 1876011, 1814466, 1756249, 1700978, 1648465, 1598746, 1551878, 1507864, 1466667, 1428138, 1391997, 1358091, 1326588, 1297642, 1270812, 1245049, 1219479, 1194106, 1169664, 1146849, 1125856, 1106476, 1088285, 1070663, 1052989, 1035082, 1017334, 1000234, 983876, 968159, 953251, 939512, 926875]
61624I26875j2215j2424j2503j1787j0450r236q647q474q205p679p212p021o810
61611H04212o191n360n024n557o523p174p210o924o728o710o592o065n181m321
61597G18652l788l459l134k942l029k965k070m80P06O87m5l99K4P26J137J107
61581G00728P71L88K72N44R77J388J973K904L770L957L477K937K659K378J922
61566G31045J625J868K559L273L657L454K480Q60r11k372l490m486n421o125o445
61551G21571o451o385o450o603o654o510o306o178o117o124o215o121n316l850
61537F36291k755l021m240m928m189k404l83J377K507K760K583K845L572L819
61523F33834L336L373M910O998Q095Q375R289J1056J2312J2412J2468J3488J4835
$$ y = [926875, 914660, 902236, 889733, 877946, 867496, 858260, 849613, 841139, 832934, 825255, 818043, 811022, 804212, 798021, 792661, 787637, 782080, 775557, 768383, 761173, 754249, 747521, 740811, 734219, 728154, 722973, 718652, 714864, 711405, 708271, 705329, 702300, 699335, 697265, 696785, 697491, 698178, 698133, 697734, 697758, 698484, 699621, 700728, 701499, 701887, 702159, 702703, 703680, 705068, 707041, 709945, 713715, 717672, 721149, 724086, 726745, 729123, 731045, 732670, 734538, 737097, 740370, 744027, 747481, 749961, 750821, 749910, 747538, 744048, 739562, 734141, 728016, 721571, 715120, 708735, 702285, 695682, 689028, 682518, 676212, 670034, 663917, 657793, 651578, 645457, 640141, 636291, 633536, 630515, 626275, 621347, 617158, 614754, 614371, 615748, 618255, 621015, 623598, 626443, 630015, 633834, 637170, 640543, 645453, 652451, 660546, 668921, 678210, 689266, 701578, 713990, 726458, 739946, 754781]
61510G54781J5469J5651J6324J7523J8573J9393K0476K1716K2321K1958K1156
61499I65341K0396J9575J8601J7811J7483J7326J6858J5952J4790J3519J2168
61488A149820J0729R154P432N717M221K978J920J129O36N0j200l074m825n785
61474A178902o051o117o167n931m980l100n45J959L807N130O557Q342J0192J2079
61460A194077J4582J8038K1906K5404K8480L1612L5109L9057M3662M9027N4820
61449A555774O0722O7006P4107Q1793Q9450R6980J04696J12373J19232J25008
61439B487141J30188J34820J37816J37842J34345J27193J15914J00010P9858N6778
61429C641905L2352Q025j4838l5183n2580o7016p8399q6581r1777r4523r5095
$$ y = [754781, 770250, 785901, 802225, 819748, 838321, 857714, 878190, 899906, 922227, 944185, 965341, 985737, 1005312, 1023913, 1041724, 1059207, 1076533, 1093391, 1109343, 1124133, 1137652, 1149820, 1160549, 1169703, 1177135, 1182852, 1187073, 1190051, 1191971, 1193100, 1193736, 1193786, 1192586, 1189512, 1184687, 1178902, 1172851, 1166734, 1160567, 1154636, 1149656, 1146556, 1146011, 1147970, 1151777, 1156907, 1163464, 1171806, 1181998, 1194077, 1208659, 1226697, 1248603, 1274007, 1302487, 1334099, 1369208, 1408265, 1451927, 1500954, 1555774, 1616496, 1683502, 1757609, 1839402, 1928852, 2025832, 2130528, 2242901, 2362133, 2487141, 2617329, 2752149, 2889965, 3027807, 3162152, 3289345, 3405259, 3505269, 3585127, 3641905, 3674257, 3682282, 3667444, 3632261, 3579681, 3512665, 3434266, 3347685, 3255908, 3161385, 3066290]
61418C066290r3348q9311q3734p7760p2034o6262n9709n2114m4071l6436k9502
61407B362009k2864j6127r430l129K764Q490J4004J8936K3124K6917L0686L4227
61395B469607L6924L8460L9135L9397L9289L8601L7392L6099L5073L4281L3579
61384B877837L2944L2397L1831L1138L0217K8766K6408K3334K0448J8412J6764
61373C170496J4502J1444Q444O244M685L098R93j775m974p956j0026j1123j1814
61360C172238j2515j3126j3593j4194j4964j5303j4664j3350j2159j1405j0739
61349C026226r840q960q715r426j0647j1451j1427j1245j1734j2515j2267j0586
61337B897413q699p766p215n445j689L616R913J7019K4709L2659M0940M9882N9444
$$ y = [3066290, 2972942, 2883631, 2799897, 2722137, 2650103, 2583841, 2524132, 2472018, 2427947, 2391511, 2362009, 2339145, 2323018, 2313588, 2310459, 2313223, 2321713, 2335717, 2354653, 2377777, 2404694, 2435380, 2469607, 2506531, 2544991, 2584126, 2623523, 2662812, 2701413, 2738805, 2774904, 2809977, 2844258, 2877837, 2910781, 2943178, 2975009, 3006147, 3036364, 3065130, 3091538, 3114872, 3135320, 3153732, 3170496, 3184998, 3196442, 3204886, 3211130, 3215815, 3218913, 3219906, 3218131, 3213157, 3205201, 3195175, 3184052, 3172238, 3159723, 3146597, 3133004, 3118810, 3103846, 3088543, 3073879, 3060529, 3048370, 3036965, 3026226, 3016386, 3007426, 2998711, 2989285, 2978638, 2967187, 2955760, 2944515, 2932781, 2920266, 2907999, 2897413, 2888714, 2880948, 2873733, 2868288, 2866599, 2870215, 2880128, 2897147, 2921856, 2954515, 2995455, 3045337, 3104781]
61324C104781O9225P9118Q9313R9639J09552J18886J27927J36498J43528J47845
61314D226312J48907J46512J40221J29490J14219R4948P2688M8635K3801j139
61304E144594k5463m7968o7512q3992r8300j11047j21874j30246j36351j40724
61294D181117j43377j43894j42250j39037j34844j29786j23686j16468j08430
61285B999345j00207r2413q5168p8041p0576o2745n4828m7099l9846l3389k7714
61274B307319k2199j6130r536l204K207O810J1093J5168J8676K1401K3662K5892
61262B381159K7957K9199K9236K8437K7431K6329K4795K2748K0606J8714J6921
61251B653532J4893J2619J0295P910N214K078j298m622p823j1073j4534j8020
$$ y = [3104781, 3174006, 3253124, 3342437, 3442076, 3551628, 3670514, 3798441, 3934939, 4078467, 4226312, 4375219, 4521731, 4661952, 4791442, 4905661, 5000609, 5073297, 5121932, 5145733, 5144594, 5119131, 5071163, 5003651, 4919659, 4821359, 4710312, 4588438, 4458192, 4321841, 4181117, 4037740, 3893846, 3751596, 3612559, 3477715, 3347929, 3224243, 3107775, 2999345, 2899138, 2806725, 2721557, 2643516, 2572940, 2510195, 2455367, 2408268, 2368422, 2335033, 2307319, 2285120, 2268990, 2259454, 2256250, 2258457, 2265267, 2276360, 2291528, 2310204, 2331605, 2355267, 2381159, 2409116, 2438315, 2467551, 2495988, 2523419, 2549748, 2574543, 2597291, 2617897, 2636611, 2653532, 2668425, 2681044, 2691339, 2699249, 2704463, 2706541, 2705243, 2700621, 2692798, 2681725, 2667191, 2649171]
61239B649171k1089k3514k5573k7613k9405l0303l0089k9387k9033k9249k9628
61228B344288k9646k9000k7662k5876k3962k1988j9780j7450j5577j4535j3907
61217B104905j3034j1941j1224j1115j1260j1423j1762j2181j2079j1171j0028
61206A977687r217q312o434l562o07J805L927O178Q561J1082J4078J7690K1493
61193B034369K5208K9340L4507M0364M5872N0475N4353N7565N9681O0314N9372
61182B551420N6504N0954M2261L0704J6850J227j5258l1204m5541n8046o8639
61171B531232p6679q1617q3982q4895q4787q3287q0325p6593p2744o8706o4079
61160A673538n8826n3361m8190m3561l9348l5286l1420k8135k5463k2756j9535
$$ y = [2649171, 2628082, 2604568, 2578995, 2551382, 2521977, 2491674, 2461585, 2432198, 2403165, 2373916, 2344288, 2314642, 2285642, 2257980, 2232104, 2208142, 2186154, 2166374, 2148924, 2133347, 2118812, 2104905, 2091871, 2079930, 2068706, 2057591, 2046331, 2034908, 2023146, 2010965, 1998886, 1987715, 1977687, 1968470, 1960158, 1953724, 1950162, 1949555, 1951360, 1955287, 1961465, 1970026, 1981108, 1995186, 2012876, 2034369, 2059577, 2088917, 2123424, 2163788, 2209660, 2260135, 2314488, 2372053, 2431734, 2492048, 2551420, 2607924, 2658878, 2701139, 2731843, 2748693, 2749920, 2734662, 2703458, 2657917, 2599871, 2531232, 2454553, 2372936, 2288954, 2204059, 2119272, 2035985, 1955660, 1879067, 1806323, 1737617, 1673538, 1614712, 1561351, 1513161, 1469600, 1430252, 1394966, 1363546, 1335411, 1309948, 1287192, 1267657]
61149A267657j6359j4125j2693j0973q351n240k132R59L805N697O452O938P899
61136A229534Q804Q607P240N550M069K667J215j84j613l286m933n973o426p038
61122A238233q235r542j0441j1198j2357j3701j4407j4123j3389j2937j2998j3454
61110A091451j4234j5247j6202j6862j7389j8135j9058j9692j9714j9267j8600
61099H97051j7718j6588j5438j4544j3852j3141j2447j2022j1949j2118j2561
61088G44673j3408j4466j5234j5431j5304j5176j4948j4245j2888j1156r614q683
61076E84120q274p819o868n580m401l414k347j218m19oN67J692K918L559L734
61061E56244M306N778P632Q873R041Q499P884P482P261P275P611P933P522O199
$$ y = [1267657, 1251298, 1237173, 1224480, 1213507, 1205156, 1199916, 1197784, 1198743, 1202548, 1208245, 1214697, 1221635, 1229534, 1238338, 1246945, 1254185, 1259735, 1263804, 1266471, 1267686, 1267502, 1265889, 1262603, 1257670, 1251697, 1245271, 1238233, 1229998, 1220456, 1210015, 1198817, 1186460, 1172759, 1158352, 1144229, 1130840, 1117903, 1104905, 1091451, 1077217, 1061970, 1045768, 1028906, 1011517, 993382, 974324, 954632, 934918, 915651, 897051, 879333, 862745, 847307, 832763, 818911, 805770, 793323, 781301, 769352, 757234, 744673, 731265, 716799, 701565, 686134, 670830, 655654, 640706, 626461, 613573, 602417, 592803, 584120, 575846, 568027, 561159, 555579, 551178, 547764, 545417, 544199, 543780, 543774, 544341, 546033, 548951, 552510, 556244, 560550, 566328, 573960, 582833, 591874, 600373, 608257, 615739, 623000, 630275, 637886, 645819, 653341, 659540]
61047F59540M868M580N139N267M192K397O95p79k277l679m583m872m781m552m301
61032F56854m119m045m086m268m442m115k989j756j620k740l819l758l043k858
61018F09196l308l378k395p72O07J162Q11M4l43k9L97K15m35r30j148j358j288
61001E97048l18J329K512K584K195K241K738L132L228L286L533M060M976O225
60987F38769P377P949P946P947Q595R974J1466J2310J2473J2711J3606J4789J5584
60974G81496J6094J7053J8716K0608K2348K4000K5527K6689K7751K9541L2342
60963A042165L5315L7476L8830M0195M2376M5720N0016N4450N8173O1325O5007
60952A571048O9897P5392Q0528Q5080Q9295R3204R6962J01351J07189J14553J23215
$$ y = [659540, 664408, 668988, 674127, 679394, 683586, 685983, 686678, 685899, 683622, 679943, 675360, 670488, 665707, 661155, 656854, 652735, 648690, 644604, 640336, 635894, 631779, 628790, 627034, 625414, 622674, 618855, 615097, 612054, 609196, 605888, 602510, 600115, 599343, 599950, 601112, 601923, 601967, 601624, 601595, 601992, 602207, 601772, 600842, 599694, 598336, 597048, 596730, 598059, 600571, 603155, 605350, 607591, 610329, 613461, 616689, 619975, 623508, 627568, 632544, 638769, 646146, 654095, 662041, 669988, 678583, 688557, 700023, 712333, 724806, 737517, 751123, 765912, 781496, 797590, 814643, 833359, 853967, 876315, 900315, 925842, 952531, 980282, 1009823, 1042165, 1077480, 1114956, 1153786, 1193981, 1236357, 1282077, 1332093, 1386543, 1444716, 1506041, 1571048, 1640945, 1716337, 1796865, 1881945, 1971240, 2064444, 2161406, 2262757, 2369946, 2484499, 2607714]
60941B607714J33361J45149J58074J71601J86047K02087K20164K41517K69127
60932D334841L05995L52668M07987M72050N46406O31319P25071Q26578R36487
60923I539402J055474J184786J328000J482377J617630J666790J557279J269594
60915B0701332Q68738M70636J71904Q607l0179K7114J35282K15971J72377n3770
60905B2688012m33431q62615j227147j461430j560066j552913j477776j367353
60897A2745281j245439j125817j013955r10860q15632p26147o40600n59735m86421
60888E220675m22817l69015l24401k88414k59404k34459k11549j90838j73023
60879B746755j57487j43186j30269j19431j10243j01528r3189q6338q1511p7808
$$ y = [2607714, 2741075, 2886224, 3044298, 3215899, 3401946, 3604033, 3824197, 4065714, 4334841, 4640836, 4993504, 5401491, 5873541, 6419947, 7051266, 7776337, 8602915, 9539402, 10594876, 11779662, 13107662, 14590039, 16207669, 17874459, 19431738, 20701332, 21570070, 22040706, 22212610, 22221217, 22191038, 22218152, 22353434, 22569405, 22741782, 22688012, 22254581, 21391966, 20164819, 18703389, 17143323, 15590410, 14112634, 12745281, 11499842, 10374025, 9360070, 8449210, 7633578, 6907431, 6266831, 5707096, 5220675, 4797858, 4428843, 4104442, 3816028, 3556624, 3322165, 3110616, 2919778, 2746755, 2589268, 2446082, 2315813, 2196382, 2086139, 1984611, 1891422, 1805084, 1723573, 1645765]
60869A645765p4061p0070o6338o3190o0452n7707n4627n1252m7938m4882m1871
60858A013377l8726l5726l3265l1335k9727k8442k7433k6292k4755k3225k2121
60847F92330k1055j9435j7593j6388j5793j4901j3448j2204j1627j1130j0208
60836E28548r288q876q640q073p364o819n960m182j976n84m94r53r75k26J084
60821D65222K555L733M269M161L649K970K343K007J895J552P02k37p10q47j225
60806D92039j898k324k294k324k814l316l028j815m16L39K86q4k23L9O17J506
60790D74290K757M163N314O044O570P087P524P772P808P488O655N727N584O457
60776E61240P398P365O440N352M379L453K899L059L330K741J568J244K292L383
$$ y = [1645765, 1571704, 1501634, 1435296, 1372106, 1311654, 1253947, 1199320, 1148068, 1100130, 1055248, 1013377, 974651, 938925, 905660, 874325, 844598, 816156, 788723, 762431, 737676, 714451, 692330, 671275, 651840, 634247, 617859, 602066, 587165, 573717, 561513, 549886, 538756, 528548, 519260, 510384, 501744, 493671, 486307, 479488, 473528, 469346, 467370, 466786, 466292, 465339, 464364, 464138, 465222, 467777, 471510, 475779, 479940, 483589, 486559, 488902, 490909, 492804, 494356, 495058, 494821, 494111, 493264, 492039, 490141, 487817, 485523, 483199, 480385, 477069, 474041, 472226, 471810, 472149, 472435, 472351, 472128, 472167, 472784, 474290, 477047, 481210, 486524, 492568, 499138, 506225, 513749, 521521, 529329, 536817, 543472, 549199, 554783, 561240, 568638, 576003, 582443, 587795, 592174, 595627, 598526, 601585, 604915, 607656, 609224, 610468, 612760, 616143]
60762F16143L104J828J023J200J488J039J27l26J50J091J583J174K91l44o71j255
60746F27645k390l678m707n605o597p420p707p552p311p045o606o034n475m859
60732E44659m170l683l499l102k026p61j86j77L47J758L026L205K823L094M244
60717E45552N414N980O150O286O432O669P227P980Q431Q466Q649R331R963R838
60703F52368R136Q627Q557Q448P951P226O442N544M648M099L865L417K474J494
60689G34296J044J120J401J707J811J278pj414k210k477k844l506m043m152m034
60674G17970l980m015m034m037m182m703n618o388o256n259m484m699n186m683
60660F50446l215k003j658j518r69l94l05l98r4N48J079J339J346R72K20n12r71
$$ y = [616143, 619247, 621075, 622098, 623298, 624786, 625825, 625952, 625626, 625776, 626867, 628450, 629624, 629915, 629571, 628900, 627645, 625255, 621577, 616870, 611265, 604668, 597248, 589541, 581989, 574678, 567633, 561027, 554993, 549518, 544659, 540489, 536806, 533307, 530205, 528179, 527418, 527232, 527055, 527402, 529160, 532186, 535391, 538214, 541308, 545552, 550966, 556946, 563096, 569382, 575814, 582483, 589710, 597690, 606121, 614587, 623236, 632567, 642530, 652368, 661504, 670131, 678688, 687136, 695087, 702313, 708755, 714299, 718947, 723046, 726911, 730328, 732802, 734296, 735340, 736460, 737861, 739568, 741379, 742657, 742650, 741236, 739026, 736549, 733705, 730199, 726156, 722004, 717970, 713990, 709975, 705941, 701904, 697722, 693019, 687401, 681013, 674757, 669498, 665014, 660315, 655129, 650446, 647231, 645228, 643570, 642052, 641083, 640689, 640384, 639986, 639892, 640440, 641519, 642858, 644204, 645176, 645396, 644884, 643913]
60643F43913j448k231k985l245l150l083k941k412j769j608j937k218k283k462
60629F10141k786k747k164j705k139l423m839n715n866n624n676o522p825q590
60615E44520q317p659p562p955p926p118o275o088o126n434l923k406j323k11
60601D66197J255K390K317J260L56L13R49J921L110M155M413L822L238L398L972
60586E03066M109L597L000K790K848K764K329J812J826K688L805M149L607L281
60572E45671L948M808M577L453L020M185O165P673Q293Q388Q347Q432Q940R944
60558F35844J1100J1996J2460J2417J1761J0679R682R020Q284O982N250L679K540
60545G51694J547K44j631m019o519q597j0044j1110j1932j2123j1368j0215r696
$$ y = [643913, 642465, 640234, 637249, 634004, 630854, 627771, 624830, 622418, 620649, 619041, 617104, 614886, 612603, 610141, 607355, 604608, 602444, 600739, 598600, 595177, 590338, 584623, 578757, 573133, 567457, 560935, 553110, 544520, 536203, 528544, 520982, 513027, 505101, 497983, 491708, 485620, 479494, 474060, 470137, 467731, 466408, 466197, 467452, 469842, 472159, 473419, 473775, 474088, 475037, 476958, 480068, 484223, 488636, 492458, 495696, 499094, 503066, 507175, 510772, 513772, 516562, 519410, 522174, 524503, 526315, 528141, 530829, 534634, 538783, 542390, 545671, 549619, 554427, 559004, 562457, 565477, 569662, 575827, 583500, 591793, 600181, 608528, 616960, 625900, 635844, 646944, 658940, 671400, 683817, 695578, 706257, 715939, 724959, 733243, 740225, 745475, 749154, 751694, 753241, 753485, 751854, 747835, 741316, 732719, 722675, 711565, 699633, 687510, 676142, 665927, 656231]
60532F56231j0046j0360r691q122o412m980l693k504j705j387j059j86J034J826
60518E98946J774J353J275J632J965K036K067K145J932J253O14P42J748L098M304
60503F26884N153N398M835L841L304L673M423M782M704M668M796M752M428M216
60489F89857M413M821N084N232N592O409P689R338J1285J3458J5688J7635J8892
60476H15393J9291J8985J8072J6284J3327R394M988L87m233q270j0886j1967j2179
60463H68586j1941j0892q838o445m425k551k89K087L802M837N921P318Q490R159
60449H64819R850J1110J2857J4877J7315K0243K3255K6057K9169L3368L8623M4038
60437A145581M8995N3900N9615O6370P3569Q0693Q8044R6230J05126J13968J22700
$$ y = [656231, 646185, 635825, 626134, 618012, 611600, 606620, 602927, 600423, 598718, 597331, 596272, 596086, 597120, 598946, 600720, 602073, 603348, 604980, 606945, 608981, 611048, 613193, 615125, 616378, 616992, 617734, 619482, 622580, 626884, 632037, 637435, 642270, 646111, 649415, 653088, 657511, 662293, 666997, 671665, 676461, 681213, 685641, 689857, 694270, 699091, 704175, 709407, 714999, 721408, 729097, 738435, 749720, 763178, 778866, 796501, 815393, 834684, 853669, 871741, 888025, 901352, 910746, 915734, 916121, 911888, 903618, 892732, 880765, 868586, 856645, 845753, 836915, 830470, 826045, 823494, 823205, 825292, 829094, 833931, 839852, 847170, 855660, 864819, 874669, 885779, 898636, 913513, 930828, 951071, 974326, 1000383, 1029552, 1062920, 1101543, 1145581, 1194576, 1248476, 1308091, 1374461, 1448030, 1528723, 1616767, 1712997, 1818123, 1932091, 2054791]
60426B054791J32405J43727J55268J64343J68901J67723J59011J40386J11044
60417C397599P3007K9668j6105o1690j03550j37760j61940j76085j81654j80442
60407B481048j74272j64920j53943j42551j31553j21128j10851j00333q9825q0002
60397A211670p1303o3790n7439n2113m7381m2778l8302l4375l1340k9147k7416
60386G16286k5532k2979j9922j7283j5804j5116j4267j3004j1951j1413j0692
60375E38323r022o758n103m708m993n048m783m823n342n608m987l924l359l336
60361D66529k984j886p35l03m35n87o91q75q15r9R58J609J719J823K221K551K418
60344D70418J879J230P69Q09J510K505L091L021K812L130M006M846N072M657M080
$$ y = [2054791, 2187196, 2330923, 2486191, 2650534, 2819435, 2987158, 3146169, 3286555, 3397599, 3470606, 3500274, 3484169, 3422479, 3318929, 3181169, 3019229, 2843144, 2661490, 2481048, 2306776, 2141856, 1987913, 1845362, 1713809, 1592681, 1481830, 1381497, 1291672, 1211670, 1140367, 1076577, 1019138, 967025, 919644, 876866, 838564, 804189, 772849, 743702, 716286, 690754, 667775, 647853, 630570, 614766, 599650, 585383, 572379, 560428, 549015, 538323, 529301, 522543, 517440, 512732, 507739, 502691, 497908, 493085, 487743, 482135, 477148, 473224, 469865, 466529, 463545, 461659, 460924, 460621, 460186, 459599, 458908, 458033, 457218, 457119, 458077, 459686, 461405, 463228, 465449, 468000, 470418, 472297, 473527, 474296, 475105, 476615, 479120, 482211, 485232, 488044, 491174, 495180, 500026, 505098, 509755, 513835]
60329E13835L782L739L668L544L601L770L599K904K057J347N14o23j588j854j628
60314E40667j447j264p24j01o2n85r07o77l63l06j23N92J561K220K440K517K701
60297E46139L078L607M119M404M471M504M532M408M154M056M320M874N521O025
60283F08212O073N503M528L576K809K118J470R59O56N55N47K66o08j556j308N33
60267F34333K519K947K039J366J372R46m59j787k108k036k524l309l595l482l604
60252F22618l875l665k950k304j940j566j106q13p33p13q17j085j081l70N62O95
60236F00857j23q66o71J19N03N4p85j311j195o89l90o12r74p78J33J150J695J988
60218E98105K741M217N807O684O671O309O191O394O702P081P672Q379Q815Q730
$$ y = [513835, 517617, 521356, 525024, 528568, 532169, 535939, 539538, 542442, 544499, 545846, 546360, 545737, 544149, 542295, 540667, 539220, 537956, 537232, 537131, 537069, 536484, 535577, 534900, 534537, 534231, 534108, 534700, 536261, 538481, 540921, 543438, 546139, 549217, 552824, 556943, 561347, 565818, 570322, 574854, 579262, 583416, 587472, 591792, 596666, 602187, 608212, 614285, 619788, 624316, 627892, 630701, 632819, 634289, 635248, 635904, 636459, 637006, 637272, 636664, 635108, 633800, 634333, 636852, 639799, 641838, 643204, 644576, 645522, 645063, 643276, 641168, 639132, 636608, 633299, 629704, 626222, 622618, 618743, 615078, 612128, 609824, 607884, 606318, 605212, 604399, 603666, 602953, 602136, 601051, 599970, 599600, 600162, 600857, 600734, 599868, 599197, 599316, 599819, 599873, 599088, 597777, 596582, 595893, 595503, 594891, 593917, 593139, 593272, 594422, 596117, 598105, 600846, 605063, 610870, 617554, 624225, 630534, 636725, 643119, 649821, 656902, 664574, 672953, 681768, 690498]
60204F90498Q344Q188Q700R905J1289J2074J1989J1687J2112J3474J5207J6908
60192H30375J8709K0703K2625K4368K6290K8629L1075L3285L5474L8093M1282
60181A150908M5000M9274N3883N8150O1626O4747O8241P2017P5178P7075P7826
60170A853925P7792P6977P5049P1695O6878O0983N4636M8177M1342L3734K5457
60159B486645J7082R076J624n109j0853j5333j8304j9562j9188j7667j5437j2395
60147B380579q190k927K784Q543J4570K1223K8357L5338M1690M7600N3677O0154
60135B683398O6398P1392P4594P6059P5771P3353O8625O1976N3922M4629L4201
60124C384318K3074J1745M63j0520k0655k9552l7378m4281m9639n2489n2636n0847
$$ y = [690498, 698842, 707030, 715730, 725635, 736924, 748998, 760987, 772674, 784786, 798260, 813467, 830375, 849084, 869787, 892412, 916780, 943070, 971699, 1002774, 1036059, 1071533, 1109626, 1150908, 1195908, 1245182, 1299065, 1357215, 1418841, 1483588, 1551829, 1623846, 1699024, 1776099, 1853925, 1931717, 2008694, 2083743, 2155438, 2222316, 2283299, 2337935, 2386112, 2427454, 2461188, 2486645, 2503727, 2512803, 2514427, 2509318, 2498465, 2483132, 2464828, 2445266, 2426078, 2408411, 2392974, 2380579, 2372389, 2369462, 2372246, 2380789, 2395359, 2416582, 2444939, 2480277, 2521967, 2569567, 2623244, 2683398, 2749796, 2821188, 2895782, 2971841, 3047612, 3120965, 3189590, 3251566, 3305488, 3350117, 3384318, 3407392, 3419137, 3419600, 3409080, 3388425, 3358873, 3321495, 3277214, 3227575, 3175086, 3122450, 3071603]
60112C071603m7983m4354l9833l4115k6894j8316r270p38P191J5233K3810L2413
60100B928747M0070M5973M9614N0832M9964M7584M4016L9323L3783K7926K2020
60089C379852J6002J0078M935J088j578l290l759k404J007O240J2973K0986L0107
60076C472237M0213N1251O3044P5198Q7357R9564J12218J25698J40015J54798
60066D421593J69479J83563J96760K08795K19161K27262K32809K35816K36018
60057F331256K32597K24722K12340J96092J76467J53413J26935R7749O6932L5097
60047G853600K272l1259o4389r5717j24275j49448j70452j86442j97083k02612
60037F634195k03340j99495j91548j80175j65888j49122j30786j12085r3565p4888
$$ y = [3071603, 3023620, 2979266, 2939433, 2905318, 2878424, 2860108, 2850838, 2850100, 2857291, 2872524, 2896334, 2928747, 2968817, 3014790, 3064404, 3115236, 3165200, 3212784, 3256800, 3296123, 3329906, 3357832, 3379852, 3395854, 3405932, 3410867, 3411955, 3410377, 3407087, 3403328, 3400924, 3401931, 3408171, 3421144, 3442130, 3472237, 3512450, 3563701, 3626745, 3701943, 3789300, 3888864, 4001082, 4126780, 4266795, 4421593, 4591072, 4774635, 4971395, 5180190, 5399351, 5626613, 5859422, 6095238, 6331256, 6563853, 6788575, 7000915, 7197007, 7373474, 7526887, 7653822, 7751571, 7818503, 7853600, 7855872, 7824613, 7760224, 7664507, 7540232, 7390784, 7220332, 7033890, 6836807, 6634195, 6430855, 6231360, 6039812, 5859637, 5693749, 5544627, 5413841, 5301756, 5208191, 5133303]
60027E133303n5873l7209j9741l674J0942K3370L2583L8284M0964M1096L8812
60016E242857L4202K7390J8500Q005l083j3957k4800l6204m7915n8844o8312p6565
60004E001274q4064r0846r6806j01840j05482j06930j05860j02853r8724r3746
59994D014123q7743q0583p2389o3395n3826m3695l2746k0877q623L157J4097K4481
59982C591981L4508M3949N2557O0321O7046P2061P4697P4632P1686O5692N6905
59971D266035M6227L4616K2470R736l667j7694l2064m6023n8549o9009p7390q3678
59959C991010q7435q8335q6777q3504p8833p2652o5052n6450m7193l7355k6995
59948C260429j6331n591N150J6028K7368L9392N1771O3612P4179Q3503R2092J00141
$$ y = [5133303, 5077430, 5040221, 5020480, 5016806, 5027748, 5051118, 5083701, 5121985, 5162949, 5204045, 5242857, 5277059, 5304449, 5322949, 5330954, 5327871, 5313914, 5289114, 5252910, 5204995, 5146151, 5077839, 5001274, 4917210, 4826364, 4729558, 4627718, 4522236, 4415306, 4309446, 4206593, 4107869, 4014123, 3926380, 3845797, 3773408, 3710013, 3656187, 3612492, 3579746, 3558869, 3550246, 3553403, 3567500, 3591981, 3626489, 3670438, 3722995, 3783316, 3850362, 3922423, 3997120, 4071752, 4143438, 4209130, 4266035, 4312262, 4346878, 4369348, 4379084, 4375417, 4357723, 4325659, 4279636, 4221087, 4152078, 4074688, 3991010, 3903575, 3815240, 3728463, 3644959, 3566126, 3493474, 3428422, 3371972, 3324779, 3287424, 3260429, 3244098, 3238507, 3243657, 3259685, 3287053, 3326445, 3378216, 3441828, 3516007, 3599510, 3691602, 3791743]
59936C791743J07188J12400J14824J13629J08521J00052Q9166P6381O1682M5244
59926D720830K7856J0391o891k4143m1091n6711o9889q0134q7489r1897r3011
59915D207821r0709q5520p8285o9558n9522m8369l6482k4175j1620R14J2924K4033
59903C741452L4278M3885N2800O0561O6660P0962P3823P5782P6994P6968P4984
59892D449149P0912O5483N9672N3899M8040M2084L6526L2027K8919K7250K7191
59881D941152K9140L3326L9627M7888N8218P0729Q5161J01088J18373J36979J56297
59870E817978J75140J92582K08340K22034K32430K37841K37082K29699K15398
59861G768524J93713J64325J27572Q4761L8117r712n6371j00013j38934j71475
$$ y = [3791743, 3898931, 4011331, 4126155, 4239784, 4348305, 4448357, 4537523, 4613904, 4675586, 4720830, 4748686, 4759077, 4752186, 4728043, 4686952, 4630241, 4560352, 4480218, 4392729, 4300832, 4207821, 4117112, 4031592, 3953307, 3883749, 3824227, 3775858, 3739376, 3715201, 3703581, 3704495, 3717419, 3741452, 3775730, 3819615, 3872415, 3932976, 3999636, 4070598, 4144421, 4220203, 4297197, 4374165, 4449149, 4520061, 4585544, 4645216, 4699115, 4747155, 4789239, 4825765, 4857792, 4886711, 4913961, 4941152, 4970292, 5003618, 5043245, 5091133, 5149351, 5220080, 5305241, 5406329, 5524702, 5661681, 5817978, 5993118, 6185700, 6394040, 6616074, 6848504, 7086345, 7323427, 7553126, 7768524, 7962237, 8126562, 8254134, 8338895, 8377012, 8367300, 8310929, 8210916, 8071982, 7900507]
59851G900507j96609k14333k25187k29677k28498k22882k14037k02404j87874
59842E979006j70652j51466j31096j10192q9411o9128m9113k8982r060R690K6603
59831E206199M1669N4972O6211P4859Q0383Q2220P9866P3048O1619M5503K5125
59820E891674J614k3785n0309p7122j02624j25100j43916j59247j70829j77987
59810D862369j80971j81107j79325j75356j68856j60451j51148j41391j31119
59801C392645j20320j09056r7513q6203p5705o5966n6607m7937m0855l5410l0554
59790B626519k5790k2101k0388j9946j9417j8561j8013j7844j7496j6812j6101
59779B414050j5331j4249j3274j3317j4602j6380j7894j9065k0137k1243k2390
$$ y = [7900507, 7703898, 7489565, 7264378, 7034701, 6806203, 6583321, 6369284, 6166880, 5979006, 5808354, 5656888, 5525792, 5415600, 5326189, 5257061, 5207948, 5178966, 5169906, 5179596, 5206199, 5247868, 5302840, 5369051, 5443910, 5524293, 5606513, 5686379, 5759427, 5821046, 5866549, 5891674, 5893288, 5869503, 5819194, 5742072, 5639448, 5514348, 5370432, 5211185, 5040356, 4862369, 4681398, 4500291, 4320966, 4145610, 3976754, 3816303, 3665155, 3523764, 3392645, 3272325, 3163269, 3065756, 2979553, 2903848, 2837882, 2781275, 2733338, 2692483, 2657073, 2626519, 2600729, 2578628, 2558240, 2538294, 2518877, 2500316, 2482303, 2464459, 2446963, 2430151, 2414050, 2398719, 2384470, 2371196, 2357879, 2343277, 2326897, 2309003, 2289938, 2269801, 2248558, 2226168]
59768B226168k3445k4146k4447k4739k5183k5076k3493k0469j6969j3681j0499
59757A994021p241m248k030o45M79K266N437R765J4109J7711K1220K5746L1060
59744B107650L5582L8303L9809M1053M1906M1619M0125L8095L5825L2910K9132
59733B522009K5173K2031J9971J8492J7343J7149J8649K1576K4901K8296L2804
59722B768394L9529M8152N7302O6264P5698Q6624R9256J13019J27328J41995J57031
59711C780592J72345J87655K02442K15675K25398K28742K22712K05285J75866
59702E616712J35222Q5725L1759k0885o6945j03309j29045j44524j50967j50257
59692E103486j44334j34667j22345j08278r2931p6336n8924m1937k6437j2201
$$ y = [2226168, 2202723, 2178577, 2154130, 2129391, 2104208, 2079132, 2055639, 2035170, 2018201, 2004520, 1994021, 1986780, 1982532, 1980502, 1979857, 1980336, 1982602, 1988039, 1997804, 2011913, 2029624, 2050844, 2076590, 2107650, 2143232, 2181535, 2221344, 2262397, 2304303, 2345922, 2386047, 2424142, 2459967, 2492877, 2522009, 2547182, 2569213, 2589184, 2607676, 2625019, 2642168, 2660817, 2682393, 2707294, 2735590, 2768394, 2807923, 2856075, 2913377, 2979641, 3055339, 3141963, 3241219, 3354238, 3481566, 3623561, 3780592, 3952937, 4140592, 4343034, 4558709, 4784107, 5012849, 5235561, 5440846, 5616712, 5751934, 5837659, 5869418, 5848533, 5781588, 5678279, 5549234, 5404710, 5253743, 5103486, 4959152, 4824485, 4702140, 4593862, 4500931, 4424595, 4365671, 4323734, 4297297, 4285096]
59682D285096J650J5324K8457M1293N4626O8490Q1946R4573J07323J21344J36545
59671E036667J51988J67232J82739J99106K16503K34886K54407K75328K97668
59662G016524L21034L44939L69167L93571M17473M39600M58887M74985M87641
59653A0723821M95957M98743M95428M86251M71987M54150M35137M17255M01575
59644A4880304L88390L78478L72762L70494L68827L64789L56936L44761L27387
59635A8153128L03635K72950K35632J92590J45508R6928M9476N231l3956o6057
59625A9355065q9577j04433j11394j10690j01807q4576n9826k8790P594M8579
59615A8720145R3286J40863J90681K42057K93804L44094L90765M31702M64988
$$ y = [4285096, 4286746, 4302070, 4330527, 4371820, 4426446, 4494936, 4576882, 4671455, 4778778, 4900122, 5036667, 5188655, 5355887, 5538626, 5737732, 5954235, 6189121, 6443528, 6718856, 7016524, 7337558, 7682497, 8051664, 8445235, 8862708, 9302308, 9761195, 10236180, 10723821, 11219778, 11718521, 12213949, 12700200, 13172187, 13626337, 14061474, 14478729, 14880304, 15268694, 15647172, 16019934, 16390428, 16759255, 17124044, 17480980, 17825741, 18153128, 18456763, 18729713, 18965345, 19157935, 19303443, 19400371, 19449847, 19455078, 19421122, 19355065, 19265488, 19161055, 19049661, 18938971, 18837164, 18752588, 18692762, 18663972, 18671566, 18720145, 18813431, 18954294, 19144975, 19387032, 19680836, 20024930, 20415695, 20847397, 21312385]
59606B1312385M88632N00087M96146M73641M30450L65868K80406J75889N6112
59597B4579616p2840k03518l28745m42562n40169o17804o73434p07516p22595
59588B0270433p21806p07832o83168o50929o14873n78806n46218n20328n03906
59579A4742567m98641n04418n18821n37208n53779n63659n64590n56889n42026
59570I902536n21460m96507m68470m38502m07631l77004l47748l20296k94191
59561F230727k68938k44811k22559k02475j84140j67042j51079j36508j23598
59552D529577j12436j02786r4112q5950p8406p2115o7598o4723o2997o2212o2490
59541C663752o3668o5077o6174o7094o8112o8794o8250o6307o3800o1442n8917
$$ y = [21312385, 21801017, 22301104, 22797250, 23270891, 23701341, 24067209, 24347615, 24523504, 24579616, 24506776, 24303258, 23974513, 23531951, 22991782, 22373978, 21700544, 20993028, 20270433, 19548627, 18840795, 18157627, 17506698, 16891825, 16313019, 15766801, 15246473, 14742567, 14243926, 13739508, 13220687, 12683479, 12129700, 11566041, 11001451, 10444562, 9902536, 9381076, 8884569, 8416099, 7977597, 7569966, 7192962, 6845214, 6524918, 6230727, 5961789, 5716978, 5494419, 5291944, 5107804, 4940762, 4789683, 4653175, 4529577, 4417141, 4314355, 4220243, 4134293, 4055887, 3983772, 3916174, 3851451, 3788454, 3726242, 3663752, 3600084, 3535007, 3468833, 3401739, 3333627, 3264833, 3196583, 3130276, 3066476, 3005034, 2946117]
59530B946117n5500n1193m6700m2442l8187l3542k8491k3366j8593j4387j0485
59519B583231o323j779K470N717Q197J0784J3870J7066K0003K2766K5366K7380
59507B728748K8524K9243L0355L2309L5029L8328M2121M6291N0647N5147O0040
59496C176782O5697P2180P9111Q6094R3237J00963J09366J18105J27023J36357
59486D164915J46015J55145J62964J69591J75448J80087J82378J81840J79086
59477E697469J74827J68892J60369J48351J32688J14452R5615P7746O1036M5021
59467F876466K9927J6552N044n158j4015k0512k3880k4342k2216j7146q842K196
59455F794074J5378L0706M7972O5683Q1664R4559J03964J09265J09097J02091
$$ y = [2946117, 2890617, 2839424, 2792724, 2750282, 2712095, 2678553, 2650062, 2626696, 2608103, 2593716, 2583231, 2576908, 2575129, 2577599, 2583316, 2591513, 2602297, 2616167, 2633233, 2653236, 2676002, 2701368, 2728748, 2757272, 2786515, 2816870, 2849179, 2884208, 2922536, 2964657, 3010948, 3061595, 3116742, 3176782, 3242479, 3314659, 3393770, 3479864, 3573101, 3674064, 3783430, 3901535, 4028558, 4164915, 4310930, 4466075, 4629039, 4798630, 4974078, 5154165, 5336543, 5518383, 5697469, 5872296, 6041188, 6201557, 6349908, 6482596, 6597048, 6692663, 6770409, 6831445, 6876466, 6906393, 6922945, 6927989, 6922831, 6908816, 6888304, 6864424, 6840082, 6817866, 6800720, 6791878, 6794074, 6809452, 6840158, 6888130, 6953813, 7035477, 7130036, 7234000, 7343265, 7452362, 7554453]
59445G554453Q7709O6351L9095P405k7307o3862j00930j36643j69018j96722k19052
59434F841479k35311k44732k47248k43965k36583k26368k13819j99161j82876
59425D811416j65669j48115j30576j13441r7112q1621o6578n1790l7610k4329
59415C894575j1446J864J5697K9378M2439N4984O7046P8357Q8925R9187J09132
59404D470138J17827J24176J27703J28230J25334J18605J08063R3795P5562N3399
59394E542832K8351K013k4573n1047p6843j00709j21352j38245j51697j62223
59384D746507j69883j74231j74965j72567j68078j62210j55066j46750j37870
59375C284887j29188j21004j13114j05117r6665q7825p9286p1830o5394n9172
$$ y = [7554453, 7642162, 7708513, 7747608, 7755013, 7727706, 7663844, 7562914, 7426271, 7257253, 7060531, 6841479, 6606168, 6361436, 6114188, 5870223, 5633640, 5407272, 5193453, 4994292, 4811416, 4645747, 4497632, 4367056, 4253615, 4156503, 4074882, 4008304, 3956514, 3918904, 3894575, 3883129, 3884993, 3900690, 3930068, 3972507, 4027491, 4094537, 4172894, 4261819, 4361006, 4470138, 4587965, 4712141, 4839844, 4968074, 5093408, 5212013, 5320076, 5413871, 5489433, 5542832, 5571183, 5573196, 5548623, 5497576, 5420733, 5320024, 5198672, 5060427, 4908730, 4746507, 4576624, 4402393, 4227428, 4054861, 3886783, 3724573, 3569507, 3422757, 3284887, 3155699, 3034695, 2921581, 2816464, 2719799, 2631974, 2552688, 2480858, 2415464, 2356292]
59365B356292n2726m6499m0891l5517k9910k4375j9512j5256j1072o809k742J066
59353B072049M897Q926J3024J6739J9128J9078J6471J2849J0254R526J0192J1737
59341B224870J4228J7813K2412K7811L3440L8035M0363M0519L9994M0306M2097
59330B581888M5523N0715N7481O5189P3392Q2147R1382J00570J09545J19183J30661
59319C507676J44133J58776J73983J89938K06976K25026K43898K63700K84451
59310E398557L05550L25961L44853L61618L75305L84482L87895L85033L75997
59301H645251L61226L41725L19114K94909K69846K44227K18668J93901J69967
59292A1058834J46189J21901R6648O9764M0496Q615k5812o3190j03964j47079
$$ y = [2356292, 2303566, 2257067, 2216176, 2180659, 2150749, 2126374, 2106862, 2091606, 2080534, 2073725, 2070983, 2072049, 2076946, 2085872, 2098896, 2115635, 2134763, 2153841, 2170312, 2183161, 2193415, 2202941, 2213133, 2224870, 2239098, 2256911, 2279323, 2307134, 2340574, 2378609, 2418972, 2459491, 2499485, 2539791, 2581888, 2627411, 2678126, 2735607, 2800796, 2874188, 2956335, 3047717, 3148287, 3257832, 3377015, 3507676, 3651809, 3810585, 3984568, 4174506, 4381482, 4606508, 4850406, 5114106, 5398557, 5704107, 6030068, 6374921, 6736539, 7111844, 7496326, 7884221, 8269254, 8645251, 9006477, 9348202, 9667316, 9962225, 10232071, 10476298, 10694966, 10888867, 11058834, 11205023, 11326924, 11423572, 11493336, 11533832, 11542447, 11516635, 11453445, 11349481, 11202402]
59282A1202402j89833k29821k66237k98830l26596l48486l64634l75723l81521
59273H420721l81265l75333l65443l53081l38561l21832l03380k84006k64292
59264E433528k44596k25258k06592j88844j72156j56361j40996j25841j11337
59255C861547r8093q6203p5369o5462n6503m8285m0492l3019k5795j8549j1238
59244C302539m361J689P238J2692J7703K1821K5612L0032L4750L8237L9688L9854
59232C567494L9658L8998L7504L5620L4206L3432L2766L1824L0849L0377L0720
59221C943448L1745L3161L5135L8326M2816M7254M9796N0027M9289M8982M9193
59210D419172M9152M8359M6726M4094M0074L4227K6249J6269N038o508j7954k9203
$$ y = [11202402, 11012569, 10782748, 10516511, 10217681, 9891085, 9542599, 9177965, 8802242, 8420721, 8039456, 7664123, 7298680, 6945599, 6607038, 6285206, 5981826, 5697820, 5433528, 5188932, 4963674, 4757082, 4568238, 4396082, 4239721, 4098725, 3972884, 3861547, 3763454, 3677251, 3601882, 3536420, 3479917, 3431632, 3391140, 3358121, 3332326, 3313777, 3302539, 3298178, 3299867, 3307105, 3319797, 3337500, 3359321, 3384933, 3414965, 3449715, 3487952, 3527640, 3567494, 3607152, 3646150, 3683654, 3719274, 3753480, 3786912, 3819678, 3851502, 3882351, 3912728, 3943448, 3975193, 4008354, 4043489, 4081815, 4124631, 4171885, 4221681, 4271708, 4320997, 4369979, 4419172, 4468324, 4516683, 4563409, 4607503, 4647577, 4681804, 4708053, 4724322, 4729360, 4722852, 4704898, 4675695]
59198D675695l9680m8386n4841n9322o1985o2470o0772n7749n4267n0316m5450
59187D080457l9628l3191k6505k0140j4981j1529r354p650o115m890l970l170
59175C899334k526k201k090j843j101N30L520Q067J3843K0448K7973L6879M7478
59162D048311N9780P3598Q8583J04322J20625J37439J54321J70359J84893J97859
59152E340090K08956K16782K19265K14834K02792J82959J55592J21583Q2231L8763
59142F983847p573n4993j01229j44187j82292k14328k39398k57102k67565k71213
59132E243967k68797k61582k51149k38818k25344k11044j96120j80856j65775
59123C244482j51526j38442j26274j14618j03521r3442q4632p6817o9539o2575
$$ y = [4675695, 4636015, 4587629, 4532788, 4473466, 4411481, 4349011, 4288239, 4230490, 4176223, 4125907, 4080457, 4040829, 4007638, 3981133, 3960993, 3946012, 3934483, 3925129, 3917479, 3911364, 3906474, 3902504, 3899334, 3896808, 3894607, 3892517, 3890674, 3889573, 3890103, 3893623, 3901690, 3915533, 3935981, 3963954, 4000833, 4048311, 4108091, 4181689, 4270272, 4374594, 4495219, 4632658, 4786979, 4957338, 5142231, 5340090, 5549046, 5765828, 5985093, 6199927, 6402719, 6585678, 6741270, 6862853, 6945084, 6983847, 6976274, 6921281, 6820052, 6675865, 6493573, 6279245, 6039847, 5782745, 5515180, 5243967, 4975170, 4713588, 4462439, 4223621, 3998277, 3787233, 3591113, 3410257, 3244482, 3092956, 2954514, 2828240, 2713622, 2610101, 2516659, 2432027, 2355210, 2285671, 2223096]
59113B223096n5968m9833m4246l9168l4432k9879k5569k1749j8501j5491j2170
59102A876090q357m505j223J489M274P550J0947J3860J6292J8697K1196K3632
59090A979942K6233K9540L3379L6699L8808M0212M1766M3515M4963M6094M7402
59079B408553M8960N0058M9848M8003M4845M1128L7609L4487L1297K7578K3475
59068B845841J9457J5709J2194R126O847N389M613M703N975Q240J0876J3623J6830
59055B979423K0784K5307L0151L5331M0852M6462N1947N7368O2801O8186P3624
59044C492236P9464Q5679R1568R6484J00801J05566J11149J16526J20045J20650
59034D520168J18246J13076J05057R3739P8766O0324L9171J6310p368l1198n4494
$$ y = [2223096, 2167128, 2117295, 2073049, 2033881, 1999449, 1969570, 1944001, 1922252, 1903751, 1888260, 1876090, 1867733, 1863228, 1862005, 1863494, 1867768, 1875318, 1886265, 1900125, 1916417, 1935114, 1956310, 1979942, 2006175, 2035715, 2069094, 2105793, 2144601, 2184813, 2226579, 2270094, 2315057, 2361151, 2408553, 2457513, 2507571, 2557419, 2605422, 2650267, 2691395, 2729004, 2763491, 2794788, 2822366, 2845841, 2865298, 2881007, 2893201, 2902327, 2909174, 2914563, 2919176, 2923879, 2929854, 2938094, 2948970, 2962593, 2979423, 3000207, 3025514, 3055665, 3090996, 3131848, 3178310, 3230257, 3287625, 3350426, 3418612, 3492236, 3571700, 3657379, 3748947, 3845431, 3946232, 4051798, 4162947, 4279473, 4399518, 4520168, 4638414, 4751490, 4856547, 4950286, 5029052, 5089376, 5128547, 5144857, 5137489, 5106291, 5051797]
59023E051797p6226r5087j10149j21521j30184j37016j42098j45128j46222j46032
59013C802134j45131j43604j41253j37867j33310j27742j21832j16368j11469
59004B623558j06536j01214r5973r1333q6886q1719p5749p0029o5550o2187n9024
58993A727358n5403n1447m7699m4545m1874l9223l6316l3414l0972k9032k7230
58982A290203k5344k3491k1800k0333j9297j8772j8109j6409j3848j1761j0817
58971A090222r951p943n312l498k623j477M17K119K876L133L413L379K672J740
58957A079167J089N24j28l47J85P51N57J6J34J064K186L195M119M621M388L968
58941A105489M125M456L781K023N34K47M47n2j311k392k562j925j158r05j203
$$ y = [5051797, 4975571, 4880484, 4770335, 4648814, 4518630, 4381614, 4239516, 4094388, 3948166, 3802134, 3657003, 3513399, 3372146, 3234279, 3100969, 2973227, 2851395, 2735027, 2623558, 2517022, 2415808, 2319835, 2228502, 2141616, 2059897, 1984148, 1914119, 1848569, 1786382, 1727358, 1671955, 1620508, 1572809, 1528264, 1486390, 1447167, 1410851, 1377437, 1346465, 1317433, 1290203, 1264859, 1241368, 1219568, 1199235, 1179938, 1161166, 1143057, 1126648, 1112800, 1101039, 1090222, 1080271, 1072328, 1067016, 1063518, 1060895, 1059418, 1059835, 1061954, 1064830, 1067963, 1071376, 1074755, 1077427, 1079167, 1080256, 1080780, 1080652, 1080305, 1080490, 1081241, 1081798, 1081814, 1081948, 1083012, 1085198, 1088393, 1092512, 1097133, 1101521, 1105489, 1109614, 1114070, 1117851, 1119874, 1120408, 1120655, 1121102, 1121050, 1119739, 1117347, 1114785, 1112860, 1111702, 1110797, 1109594]
58926A109594j356o33Q76K393L341L648L416K963L093M506O796Q705R558R826
58912A166726J0186J0773J1513J2467J3514J4350J4984J5681J6269J6281J5990
58901A318734J6386J7661J8727J8812J8698J9566K1296K2811K3641K4217K4965
58890A545514K6034K7713L0227L3095L5436L7034L8497M0355M2571M4972M7663
58879A949111N0748N4132N7727O1558O5523O9334P2932P6697Q1080Q6116R1507
58868B716465R7117J03158J09875J17166J24770J32735J41454J51093J61356J72024
58858D027213J83437J96023K09593K23663K38363K54399K71999K90437L08847
58849F203974L27007L45131L63205L80772L97069M11151M22027M28736M30005
$$ y = [1109594, 1108238, 1107605, 1108481, 1110874, 1114215, 1117863, 1121279, 1124242, 1127335, 1131841, 1138637, 1147342, 1156900, 1166726, 1176912, 1187685, 1199198, 1211665, 1225179, 1239529, 1254513, 1270194, 1286463, 1302744, 1318734, 1335120, 1352781, 1371508, 1390320, 1409018, 1428584, 1449880, 1472691, 1496332, 1520549, 1545514, 1571548, 1599261, 1629488, 1662583, 1698019, 1735053, 1773550, 1813905, 1856476, 1901448, 1949111, 1999859, 2053991, 2111718, 2173276, 2238799, 2308133, 2381065, 2457762, 2538842, 2624958, 2716465, 2813582, 2916740, 3026615, 3143781, 3268551, 3401286, 3542740, 3693833, 3855189, 4027213, 4210650, 4406673, 4616266, 4839929, 5078292, 5332691, 5604690, 5895127, 6203974, 6530981, 6876112, 7239317, 7620089, 8017158, 8428309, 8850336, 9279072, 9709077]
58840I709077M24088M09368L85297L52201L10216K58996J98776J31269N9281j4157
58830A2224412q6183j54220k16169k70504l16127l52458l79559l97870m07944
58821I643378m10743m07855m00665l89517l74474l56685l38020l19440l00829
58812F345150k82448k65246k49414k34061k18884k04870j92614j81144j69459
58803D347010j58105j47972j38494j28379j17613j07468r8791r1441q5103p9523
58793C194121p4023o7915o1337n4967m8951m2936l6997l1602k6697k1649j6167
58782B710880j0546n010N14N882J0746J5182J9758K4764K9828L4478L8759M3227
58770B918462M8466N4591O1054O7191P3046P9299Q6219R3275J00195J07641J16237
$$ y = [9709077, 10133165, 10542533, 10927830, 11280031, 11590247, 11849243, 12048019, 12179288, 12238569, 12224412, 12138229, 11984009, 11767840, 11497336, 11181209, 10828751, 10449192, 10051322, 9643378, 9232635, 8824780, 8424115, 8034598, 7660124, 7303439, 6965419, 6645979, 6345150, 6062702, 5797456, 5548042, 5313981, 5095097, 4890227, 4697613, 4516469, 4347010, 4188905, 4040933, 3902439, 3774060, 3656447, 3548979, 3450188, 3358747, 3273644, 3194121, 3120098, 3052183, 2990846, 2935879, 2886928, 2843992, 2806995, 2775393, 2748696, 2727047, 2710880, 2700334, 2695324, 2695838, 2701720, 2712466, 2727648, 2747406, 2772170, 2801998, 2836476, 2875235, 2918462, 2966928, 3021519, 3082573, 3149764, 3222810, 3302109, 3388328, 3481603, 3581798, 3689439, 3805676]
58759C805676J25482J34514J43500J53412J64724J77170J90629K05334K21190
58750E321631K37737K54847K72814K91651L10851L29898L48569L66609L83391
58741H117998L97762M08042M12472M10041M00515L83257L56730L19782K72978
58732A1479577K17832J55316Q6195J2644o1613j32883j98582k56875l06405l46620
58722A0648586l77732m00071m13977m20318m20513m15816m06981l94627l79510
58713G019041l62520l44695l27094l10163k93481k76538k59548k43048k27128
58704D374826k11726j97236j84102j72097j60750j50222j40874j32271j23527
58695B902021j14584j06269r9080r2690q6678q0921p5311o9747o4493n9959n6117
$$ y = [3805676, 3931158, 4065672, 4209172, 4362584, 4527308, 4704478, 4895107, 5100441, 5321631, 5559368, 5814215, 6087029, 6378680, 6689531, 7019429, 7367998, 7734607, 8117998, 8515760, 8923802, 9336274, 9746315, 10146830, 10530087, 10886817, 11206599, 11479577, 11697409, 11852725, 11938920, 11951564, 11889951, 11757068, 11558486, 11301611, 10995206, 10648586, 10270854, 9870783, 9456806, 9036488, 8615975, 8200159, 7793178, 7398551, 7019041, 6656521, 6311826, 5984732, 5674569, 5381088, 5104550, 4845002, 4601954, 4374826, 4163100, 3965864, 3781762, 3609665, 3448915, 3298693, 3157819, 3025548, 2902021, 2787437, 2681168, 2582088, 2489398, 2402720, 2321799, 2246488, 2176741, 2112248, 2052289, 1996172]
58684A996172n2648m9458m6532m3571m0435l7588l5431l3564l1447k9340k7761
58673A568397k6496k5171k4229k4116k4081k3138k1916k1892k2942k3354k2450
58662A308612k1417k1203k1170k0628k0252k0977k2478k3637k3853k3329k2636
58651A067032k2410k2807k3033k2162k0499j9259j8762j8095j6793j5585j5055
58640H52572j4705j3966j3098j2470j1863j1089j0453j0074r606r112r227r970
58628G16939j0463j0382j0534j1261j1418r986p783o411o172o040n249l907k395
58615F14938r76J69J117K174L350M262M835N481O215O367N641M696M181L840L164
58600F69454K133Q70o64k115k735k642l026m345n314m700l179k200j805r67M87
$$ y = [1996172, 1943524, 1894066, 1847534, 1803963, 1763528, 1725940, 1690509, 1656945, 1625498, 1596158, 1568397, 1541901, 1516730, 1492501, 1468385, 1444304, 1421166, 1399250, 1377358, 1354416, 1331062, 1308612, 1287195, 1265992, 1244822, 1224194, 1203942, 1182965, 1160487, 1136850, 1112997, 1089668, 1067032, 1044622, 1021815, 998782, 976620, 956121, 936862, 918100, 900005, 883212, 867627, 852572, 837867, 823901, 810803, 798333, 786470, 775381, 764928, 754854, 745248, 736136, 726909, 716939, 706476, 696094, 685560, 674299, 662881, 652895, 645112, 638701, 632529, 626489, 621240, 617333, 614938, 613962, 614131, 615248, 617422, 620772, 625034, 629869, 635350, 641565, 647932, 653573, 658269, 662450, 666290, 669454, 671587, 672457, 671793, 669678, 666943, 664301, 661275, 656930, 651616, 646916, 643737, 641537, 639732, 638765, 639252]
58585F39252J732K464L231M313N423O551Q049R786J1191J2220J3419J4921J6173
58572G48725J6884J7472J8376J9497K0582K1673K2948K4447K6142K8038L0202
58561I94986L2861L6306M0397M4399M7758N0962N5085O0495O6445P2057P7270
58550A579021Q2710Q8798R5282J01551J07262J12453J17057J20489J21995J21093
58540B647711J17398J10202R8889Q3746O5816M5904K4300J532k1211m2675o1918
58529C069694p8051r0315r8785j04418j07974j09334j08119j04561r9472r3775
58519B074890q8201q2959p7530p1318o4607n8371n3082m8377m3983m0169l7089
58508A409204l4496l2371l1018l0198k9052k7269k5518k4328k3303k1941k0436
$$ y = [639252, 640984, 643448, 646679, 650992, 656415, 662966, 671015, 680801, 691992, 704212, 717631, 732552, 748725, 765609, 783081, 801457, 820954, 841536, 863209, 886157, 910604, 936746, 964784, 994986, 1027847, 1064153, 1104550, 1148949, 1196707, 1247669, 1302754, 1363249, 1429694, 1501751, 1579021, 1661731, 1750529, 1845811, 1947362, 2054624, 2167077, 2284134, 2404623, 2526618, 2647711, 2765109, 2875311, 2974200, 3057946, 3123762, 3169666, 3193966, 3195498, 3174287, 3131612, 3069694, 2991643, 2901328, 2802543, 2698125, 2590151, 2480817, 2372698, 2268137, 2168665, 2074890, 1986689, 1903730, 1826200, 1754882, 1690275, 1631904, 1578822, 1530445, 1486462, 1446293, 1409204, 1374708, 1342337, 1311319, 1281121, 1252069, 1224800, 1199282, 1174954, 1151651, 1129710, 1109274]
58497A109274j9169j8121j7318j7132j7582j7983j7831j7434j7245j7247j7374
58486I14838j7773j8210j8039j7223j6563j6428j6084j4941j3486j2421j1628
58475G42042j0735r903r305q622p727p166p208p191o486n445m673m145l698l583
58461F46155l830l895l680m003n232o412o670o578o992p447o988n970n616o171
58447E66671o654o310n336m260l486l272l540l845l893l764l372k408j118l54
58433E15059l20j88N20J150J107P55N10J29l66k51N60R69M90J36N69P07l32j453
58415E19751j350q00j260k276k304j378q69j099j178r15r64j240r68k40N9j44
58399E02825o8M55Q12P92O45K12o48j162n39N59Q59M20K25K33m43j586j914j115
$$ y = [1109274, 1090105, 1071984, 1054666, 1037534, 1019952, 1001969, 984138, 966704, 949459, 932212, 914838, 897065, 878855, 860816, 843593, 827030, 810602, 794518, 779577, 766091, 753670, 742042, 731307, 721404, 712099, 703477, 695750, 688584, 681376, 674185, 667699, 662254, 657581, 653436, 649738, 646155, 642325, 638430, 634750, 630747, 625515, 619103, 612433, 605855, 598863, 591416, 584428, 578458, 572842, 566671, 560017, 553707, 548371, 544111, 540625, 537353, 533813, 529968, 526075, 522311, 518939, 516531, 515413, 515059, 514739, 514551, 515071, 516221, 517328, 518083, 518593, 518722, 518356, 518105, 518665, 519634, 520124, 520260, 520829, 521536, 521204, 519751, 518401, 517601, 516341, 514065, 511761, 510383, 509514, 508415, 507237, 506322, 505358, 504118, 503150, 502910, 502969, 502825, 502757, 503212, 504024, 504816, 505461, 505673, 505025, 503863, 503324, 503883, 504742, 505162, 505387, 505620, 505177, 503591, 501677, 500562]
58381E00562k10K75Q98J825K319K084J904K449L388M006L904L050J876J176J231
58366E30737J311Q22K84K44L3j137k557l012k677k460k068n78J445K388K062J914
58350E26751K744L903M860N848O826P261P235P377P637P467P095P277P731P352
58336F17364O018M761M113L577K808J946Q82n06j502j345o98q33j568j520l45
58321F33152Q46J245J069N86m5j45P97J901J851Q32J15M5R6L97J434K508K455
58304F49139J659J529K174K557K620L228M217M655M872O053P876Q780Q552Q440
58290G16351Q666Q164O883O096O168O219O056O256O275M909K741J698K016K136
58276G90634J740K181L545M167L651L657M944O183O579P090Q167Q731Q391Q339
$$ y = [500562, 500352, 500627, 501525, 503350, 505669, 507753, 509657, 512106, 515494, 519500, 523404, 526454, 528330, 529506, 530737, 532048, 532870, 533154, 533398, 533431, 532294, 529737, 526725, 524048, 521588, 519520, 518942, 520387, 522775, 524837, 526751, 529495, 533398, 538258, 544106, 550932, 558193, 565428, 572805, 580442, 587909, 595004, 602281, 610012, 617364, 623382, 628143, 632256, 635833, 638641, 640587, 641469, 640963, 639461, 638116, 637418, 636585, 635017, 633497, 633152, 633998, 635243, 636312, 636898, 636853, 636708, 637505, 639406, 641257, 642089, 642204, 642249, 642345, 642742, 644176, 646684, 649139, 650798, 652327, 654501, 657058, 659678, 662906, 667123, 671778, 676650, 682703, 690579, 699359, 707911, 716351, 725017, 733181, 740064, 746160, 752328, 758547, 764603, 770859, 777134, 782043, 784784, 786482, 788498, 790634, 792374, 794555, 798100, 802267, 805918, 809575, 814519, 820702, 827281, 834371, 842538, 851269, 859660, 867999]
58262H67999R153R874J0045J0474J1373J1947J2392J3866J5951J6738J5993J5568
58250A021373J6085J6049J5007J4607J5377J5484J3988J2612J2865J3896J4512
58239A181855J4929J5353J5191J4794J5585J7472J8628J8658J9351K1363K3085
58228A376264K3791K4894K6951K8394K8532K8888L0234L1223L1278L1917L3939
58217A696305L6197L8301M1451M5413M7973M8748N0139N3281N6405N8602O1436
58206B234251O5335O8147O9063P0300P3106P5851P7774Q0740Q5393Q9533R2289
58195C081782R5901J01404J06642J10626J15463J21888J27423J31354J36854J45577
58185D274914J54811J62646J71196J81886J92521K02071K13381K27936K42978
$$ y = [867999, 877152, 887026, 897071, 907545, 918918, 930865, 943257, 957123, 973074, 989812, 1005805, 1021373, 1037458, 1053507, 1068514, 1083121, 1098498, 1113982, 1127970, 1140582, 1153447, 1167343, 1181855, 1196784, 1212137, 1227328, 1242122, 1257707, 1275179, 1293807, 1312465, 1331816, 1353179, 1376264, 1400055, 1424949, 1451900, 1480294, 1508826, 1537714, 1567948, 1599171, 1630449, 1662366, 1696305, 1732502, 1770803, 1812254, 1857667, 1905640, 1954388, 2004527, 2057808, 2114213, 2172815, 2234251, 2299586, 2367733, 2436796, 2507096, 2580202, 2656053, 2733827, 2814567, 2899960, 2989493, 3081782, 3177683, 3279087, 3385729, 3496355, 3611818, 3733706, 3861129, 3992483, 4129337, 4274914, 4429725, 4592371, 4763567, 4945453, 5137974, 5340045, 5553426, 5781362, 6024340]
58176F024340K56996K72891K92353L12426L31189L51188L73750L95707M15714
58167I026554M37736M64160M91670N18242N47699N82747O20227O58122P00262
58158A4047419P49006Q00588Q53011R10856R76704J046076J116860J195043J284751
58149B2980314J382057J485583J603268J741406J898029K075354K287048K544977
58141C7998036K852240L218827L669056M222436M882906N656049O552996P559814
58133G6612360Q626445R707681J0798462J1925015J3144453J4544613J6095540
58126A61454569J7343841J7315728J4995868J0132615L604997l057079q545106
58119B13245433j2275287j4295832j4956699j4687551j3896537j2893555j1851148
$$ y = [6024340, 6281336, 6554227, 6846580, 7159006, 7490195, 7841383, 8215133, 8610840, 9026554, 9464290, 9928450, 10420120, 10938362, 11486061, 12068808, 12689035, 13347157, 14047419, 14796425, 15597013, 16450024, 17360880, 18337584, 19383660, 20500520, 21695563, 22980314, 24362371, 25847954, 27451222, 29192628, 31090657, 33166011, 35453059, 37998036, 40850276, 44069103, 47738159, 51960595, 56843501, 62499550, 69052546, 76612360, 85238805, 94946486, 105744948, 117669963, 130814416, 145359029, 161454569, 178798410, 196114138, 211110006, 221242621, 224847618, 221790539, 213245433, 200970146, 186674314, 171717615, 157030064, 143133527, 130239972, 118388824]
58112A18388824j0835202r854328q882942p886095o860117n842482m875007l976370
58104E9376281l155799k428303j807711j313045r95474r26697j128322j521578
58096D6099352j966416k344645k599189k719013k718969k631889k494629k331007
58088B6293595k152311j969226j792526j625306j465409j314540j177324j054100
58080A3742853r42456q43456p59343o87620o24097n69119n24610m87862m54523
58071G849767m24889m00996l80055l57023l31732l07735k85930k64787k45062
58062D851558k28924k15610k02560j89740j78856j69799j61538j54842j50499
58053C199190j46721j41638j36319j32037j27078j19842j12556j07976j04658
$$ y = [118388824, 107553622, 97699294, 88816352, 80930257, 74070140, 68227658, 63352651, 59376281, 56220482, 53792179, 51984468, 50671423, 49675949, 48749252, 47620930, 46099352, 44132936, 41788291, 39189102, 36470089, 33751120, 31119231, 28624602, 26293595, 24141284, 22172058, 20379532, 18754226, 17288817, 15974277, 14796953, 13742853, 12800397, 11956941, 11197598, 10509978, 9885881, 9316762, 8792152, 8304290, 7849767, 7424878, 7023882, 6643827, 6286804, 5955072, 5647337, 5361407, 5096620, 4851558, 4622634, 4407024, 4204464, 4014724, 3835868, 3666069, 3504531, 3349689, 3199190, 3052469, 2910831, 2774512, 2642475, 2515397, 2395555, 2282999, 2175023, 2070365]
58044B070365r9446r2578q6406q1009p4955o8708o3523n8575n2786m7789m5508
58033A299082m4417m1789l8091l5549l3921l1429k8577k7379k7681k7655k7049
58022I35545k6847k6682k5581k4275k3866k3345k1330j9001j8336j8645j7909
58011F89728j6419j5924j6156j5401j3732j2646j2166j1223j0129r922r929q792
57999E37289p214o878p441p280o531o511o876o200m877m544n117n112m557m768
57985D53383n570n509m653m483n108n134m250l547l259k576j602j289j470j076
57971D03857k52m8l17k3N42J15j155j898j967k408l122k889j802j402k128k768
57955C82335k698k645k989l190l185l589m254m315l784l545l725l713l657m247
$$ y = [2070365, 1970919, 1878341, 1791935, 1710926, 1635971, 1567263, 1503740, 1445165, 1392379, 1344590, 1299082, 1254665, 1212876, 1174785, 1139236, 1105315, 1073886, 1045309, 1017930, 990249, 962594, 935545, 908698, 882016, 856435, 832160, 808294, 784949, 763619, 744618, 726282, 707637, 689728, 673309, 657385, 641229, 625828, 612096, 599450, 587284, 576061, 565932, 556010, 546081, 537289, 530075, 523197, 515756, 508476, 501945, 495434, 488558, 482358, 477481, 472937, 467820, 462708, 458151, 453383, 447813, 442304, 437651, 433168, 428060, 422926, 418676, 415129, 411870, 409294, 407692, 406403, 404933, 403857, 403605, 403557, 403240, 403217, 403759, 403874, 402719, 400821, 398854, 396446, 393324, 390435, 388633, 387231, 385103, 382335, 379637, 376992, 374003, 370813, 367628, 364039, 359785, 355470, 351686, 348141, 344416, 340703, 337046, 332799]
57941C32799n141n321m948m979n139m229k358r50m67l9O18Q74R21J770L272L961
57925C10644L254K058J034mp02j91J154J729R33j94q68j354j623j058QK31p08
57908C14343j581j627j436j372q25L02R77O59J32K2j48p52j262j334j455j886
57892C02757k166k162k408k882k756j822r97q10o59j00L64M21N76J084J363J093
57876B90896P50M95k25j421k165k135k327l422m669n186n292n589n782n374m710
57861B43844m365m191l804l355l050k516j394j08O38P04L76p7l79k39K85Q79J571
57844B24819K555L385L303K498K045K308K495K173K015K475K833K388J602J219
57830B58113J031M10n75j414k031k662l271l737m210m790n186n176m908m440l496
$$ y = [332799, 327658, 322337, 317389, 312410, 307271, 303042, 300684, 299734, 299267, 299228, 299846, 300720, 301641, 303411, 306683, 310644, 313898, 315956, 316990, 316986, 316284, 316093, 317247, 318976, 319909, 319715, 318847, 317493, 315870, 314812, 314820, 315051, 314343, 312762, 311135, 309699, 308327, 307502, 307804, 308781, 309440, 309572, 309594, 309446, 308694, 307432, 306098, 304643, 302757, 300591, 298429, 296021, 293139, 290383, 288561, 287564, 286754, 286095, 285995, 286359, 286780, 287356, 288440, 289803, 290896, 291646, 292141, 291916, 290495, 288330, 286195, 283868, 280446, 275777, 270591, 265299, 259710, 253928, 248554, 243844, 239479, 235288, 231484, 228129, 225079, 222563, 221169, 221061, 221699, 222403, 222779, 222702, 222323, 222084, 222369, 223248, 224819, 227374, 230759, 234062, 236560, 238605, 240913, 243408, 245581, 247596, 250071, 252904, 255292, 256894, 258113, 259144, 259554, 258979, 257565, 255534, 252872, 249601, 245864, 241654, 236864, 231678, 226502, 221594, 217154, 213658]
57815B13658k125r77m80k38K35P73J015J166J713K712L787M616N076N193N091
57800B41215M781L986K615J279P43R04R89P17M48K69j59p52j057j300k274l825
57784B48579m666m209l437l364l637l557l338l466l565l028k159j714j646j347
57770B05446q64r54j933l244m165m469m344m120m098m387m833n176n208m856m359
57755A48436m232m652n001m582l647l080l121l100k489j474m03N41J053R59Q18
57740A16026J433K535K970K372J614J321J039L47k80k85J91R31K074L371L976
57725A39635L636L210L333L513L181K637K192J398O1r23q65n65j154k366l107
57710A53816l138l049l024k865k842l362m003l946l183k371j688p78L29J126J374
$$ y = [213658, 211533, 210556, 210076, 209838, 210073, 210846, 211861, 213027, 214740, 217452, 221239, 225855, 230931, 236124, 241215, 245996, 249982, 252597, 253876, 254619, 255523, 256512, 257229, 257677, 257946, 257787, 257035, 255978, 254678, 252404, 248579, 243913, 239704, 236267, 232903, 229266, 225709, 222371, 218905, 215340, 212312, 210153, 208439, 206793, 205446, 204582, 203628, 201695, 198451, 194286, 189817, 185473, 181353, 177255, 172868, 168035, 162859, 157651, 152795, 148436, 144204, 139552, 134551, 129969, 126322, 123242, 120121, 117021, 114532, 113058, 112655, 113196, 114249, 115208, 116026, 117459, 119994, 122964, 125336, 126950, 128271, 129310, 129657, 129377, 129092, 129283, 130214, 132288, 135659, 139635, 143271, 146481, 149814, 153327, 156508, 159145, 161337, 162735, 162796, 161873, 161008, 160443, 159289, 156923, 153816, 150678, 147629, 144605, 141740, 138898, 135536, 131533, 127587, 124404, 122033, 120345, 119567, 119896, 121022, 122396]
57695A22396J175N51l40q15l56N81J244J675K288K822K778K547K932L660L660
57680A46798K835K338K804L484L474K826K039J306Q02Q83J532K158K409K645L204
57665A81537L763L872L681L670M004M531N083N504N579N377N365N883O616O942
57651B51407O755O650P216Q340R292R582R517R845J0841J2086J3155J4141J5251
57638C84078J6289J6989J7554J8400J9468K0393K1211K2395K4084K5821K7283
57627F13965K8863L1220L4519L8389M2498M6882N1751N7142O2918O9014P5599
57616A152760Q2913R0986R9680J08861J18393J27913J36755J44071J48752J49103
57606B360187J42940J28362J04803P3727L8445L043k9158n6372p7970r3870j04654
$$ y = [122396, 123571, 124122, 123782, 122967, 122611, 123192, 124436, 126111, 128399, 131221, 133999, 136546, 139478, 143138, 146798, 149633, 151971, 154775, 158259, 161733, 164559, 166598, 167904, 168706, 169589, 171121, 173279, 175688, 178333, 181537, 185300, 189172, 192853, 196523, 200527, 205058, 210141, 215645, 221224, 226601, 231966, 237849, 244465, 251407, 258162, 264812, 272028, 280368, 289660, 299242, 308759, 318604, 329445, 341531, 354686, 368827, 384078, 400367, 417356, 434910, 453310, 472778, 493171, 514382, 536777, 560861, 586682, 613965, 642828, 674048, 708567, 746956, 789454, 836336, 888087, 945229, 1008147, 1077161, 1152760, 1235673, 1326659, 1426339, 1535200, 1653593, 1781506, 1918261, 2062332, 2211084, 2360187, 2503127, 2631489, 2736292, 2810019, 2848464, 2851507, 2822349, 2765977, 2688007, 2594137, 2489483]
57595B489483j11555j15501j16351j13911j09339j04448r9579r3480q5628p7457
57585A462234p0535o4626n8510n1956m5841m0751l6401l2226k7855k3277j8969
57574I91287j5510j2636r303n222j585O39K355N165R053J2524J4873J7003J9900
57561A028543K3505K7474L1989L7175M2461M7126N1285N5770O1109O6845P1863
57550A545145P5367P7468P8595P8382P5652O9688O0925M9994L6798K1202M063
57539B173279j3245k9937m5617n9416p0366p8444q4239q7733q8480q6981q4745
57528A444076q2623q0075p6356p1675o6716o1810n7127n3013m9584m6305m2520
57517G56272l8223l4032l0591k8071k6102k4131k2094k0530j9736j9049j7583
$$ y = [2489483, 2377928, 2262427, 2146076, 2032165, 1922826, 1818378, 1718799, 1625319, 1539691, 1462234, 1391699, 1327073, 1268563, 1216607, 1170766, 1130015, 1093614, 1061388, 1033533, 1010256, 991287, 975777, 963141, 953838, 948616, 947031, 947670, 950025, 955190, 964243, 976767, 991640, 1008643, 1028543, 1052048, 1079522, 1111511, 1148686, 1191147, 1238273, 1289558, 1345328, 1406437, 1473282, 1545145, 1620512, 1697980, 1776575, 1854957, 1930609, 2000297, 2061222, 2111216, 2148014, 2169216, 2173279, 2160034, 2130097, 2084480, 2025064, 1954698, 1876254, 1792015, 1704282, 1615802, 1528821, 1444076, 1361453, 1281378, 1205022, 1133347, 1066631, 1004821, 947694, 894681, 845097, 798792, 756272, 718049, 684017, 653426, 625355, 599253, 575122, 553028, 532498, 512762, 493713, 476130]
57506D76130j5491j3722j2561j1301r526p913p255p372p448o980n987m635l189
57493C62750k050j465j259j076o51J60J350K604L559M274N221O602Q062R176R909
57478D07166J0474J1029J1724J2717J3990J5396J6897J8579K0363K2080K3817
57467E84232K5858K8211L0566L2793L5107L7724M0679M4040M7859N1819N5306
57456A014194N7976N9859O0876O0647N8920N5716N0862M3820L4318K2884J0507
57445A530579j966j3992k5180l5262m4089n1443n6988o0460o1871o1515n9920
57434A057893n7669n4995n1717m7752m3525l9554l5815l1967k8050k4501k1542
57423F20806j9027j6816j4831j2803j0434p830n387l255j269O97K752N067P497
$$ y = [476130, 460639, 446917, 434356, 423055, 413529, 405616, 398361, 390989, 383541, 376561, 370574, 365939, 362750, 360700, 359235, 357976, 356900, 356249, 356409, 357759, 360363, 363922, 368196, 373417, 380019, 388081, 397257, 407166, 417640, 428669, 440393, 453110, 467100, 482496, 499393, 517972, 538335, 560415, 584232, 610090, 638301, 668867, 701660, 736767, 774491, 815170, 859210, 907069, 958888, 1014194, 1072170, 1132029, 1192905, 1253552, 1312472, 1368188, 1419050, 1462870, 1497188, 1520072, 1530579, 1528613, 1514621, 1489441, 1454179, 1410090, 1358647, 1301659, 1241199, 1179328, 1117813, 1057893, 1000224, 945229, 893512, 845760, 802235, 762681, 726866, 694899, 666849, 642348, 620806, 601779, 584963, 570132, 557329, 546895, 539065, 533678, 530423, 529154, 529851, 532603, 537670, 545167]
57410E45167R482J0923J2803J6003J9793K2581K4045K5450K7786L0758L3894L7420
57398H16105M1465M5464M8930N1993N4535N5692N4886N2567M9155M3930L5923
57387A350645K5393J3605J424j0975k3393l5253m5928n4864o1550o5879o8280
57376A024945o9162o8504o6369o3421o0364n7255n3835n0228m6720m3255l9740
57365D06092l6561l4132l2136k9890k7307k4927k3046k1449j9914j8491j7211
57354A21028j6001j4908j4023j3183j2115j0932j0106r887r884E68g690o935o263
57341b0888o453o890p024p142p692q160p544n962m745m590m658m065l309l417
57327a02539m356n216n417m972m006k880k397l018m115m714m615m155l330k114
$$ y = [545167, 554649, 565572, 578375, 594378, 614171, 636752, 660797, 686247, 714033, 744791, 778685, 816105, 857570, 903034, 951964, 1003957, 1058492, 1114184, 1169070, 1221637, 1270792, 1314722, 1350645, 1376038, 1389643, 1391067, 1380092, 1356699, 1321446, 1275518, 1220654, 1159104, 1093225, 1024945, 955783, 887279, 820910, 757489, 697125, 639870, 586035, 535807, 489087, 445832, 406092, 369531, 335399, 303263, 273373, 246066, 221139, 198093, 176644, 156730, 138239, 121028, 105027, 90119, 76096, 62913, 50798, 39866, 29760, 19873, 9989, 568, -7690, -14625, -20888, -27341, -34231, -41255, -48397, -56089, -64249, -71793, -77755, -82500, -87090, -91748, -95813, -99122, -102539, -106895, -112111, -117528, -122500, -126506, -129386, -131783, -134801, -138916, -143630, -148245, -152400, -155730, -157844]
57313a57844j198j313j962j940j044l33n37j182j467j267j009j140j833k705k931
57298a79705k180j314j378k084k191j344m98l81n97n79n09p15q62l97N95J435
57282a92704J553R03k8n06k27L09L94om15p00j046j232p91K0K79l62j252j773
57264a97584j947j839j257m21j12o14j227j270q55l07L99J090J079J27r42j173
57248b06853n22N63J910L328M277M569M904N881P060P757Q170Q787R223Q810Q007
57233a24129Q035R173J0457J1149J1514J2055J2863J3940J5278c196A3713J6652
57221C0365J6353J6227J5770J4739J3675J3064J2640J1961J1067J0080Q687O554
57209A81182L934J418q29l149n917r226j2832j6175j8635k0041k0712k0893k0403
$$ y = [-157844, -159042, -160355, -162317, -164257, -165301, -165634, -166171, -167353, -168820, -170087, -171096, -172236, -174069, -176774, -179705, -181885, -183199, -184577, -186661, -188852, -190196, -190694, -191075, -191672, -192251, -192760, -193475, -194337, -194734, -194139, -192704, -191151, -190248, -190276, -190782, -191009, -190700, -190306, -190312, -190727, -191427, -192473, -193705, -194496, -194476, -194197, -194559, -195811, -197584, -199531, -201370, -202627, -203048, -203160, -203774, -205001, -206271, -207126, -207433, -207034, -205944, -204865, -204738, -205680, -206853, -207375, -206812, -204902, -201574, -197297, -192728, -187824, -181943, -174883, -167126, -158956, -150169, -140946, -132136, -124129, -116094, -106921, -96464, -85315, -73801, -61746, -48883, -34943, -19665, -3196, 13713, 30365, 46718, 62945, 78715, 93454, 107129, 120193, 132833, 144794, 155861, 165941, 174628, 181182, 185116, 186534, 185705, 182556, 176639, 167413, 154581, 138406, 119771, 99730, 79018, 58125, 37722]
57196C7722A8562H67a5923j6659j6712j6216j4890j3000j1117r689q724p830o680
57183a37440n387m380m018m301m905n329n167m353l121j787o27J13L12J83K24
57168a79983Q22J919L044L705L856M120N389P912J0864J3016J3877J3959J4019
57155h3481J4416J5160J6108J6893c878A2561J5755J5762J6689J8079J9311K0084
57143A18241K0527K0953K1556K2284K2991K3605K4083K4277K4031K3373K2483
57132C68404K1504K0530J9613J8704J7703J6747J6196J6012J5498J4083J2161
57121E57155J0683J0009R686R251Q671Q086P615P445P566P476O811O153O418P372
57107F70397P704O791N535N027N201N365N234M866M182L211K259J253n79l778
$$ y = [37722, 18562, 867, -15923, -32582, -49294, -65510, -80400, -93400, -104517, -114206, -122930, -130760, -137440, -142827, -147207, -151225, -155526, -160431, -165760, -170927, -175280, -178401, -180188, -180815, -180702, -180390, -180207, -179983, -179161, -177242, -174198, -170493, -166637, -162517, -157128, -149216, -138352, -125336, -111459, -97500, -83481, -69065, -53905, -37797, -20904, -3878, 12561, 28316, 44078, 60767, 78846, 98157, 118241, 138768, 159721, 181277, 203561, 226552, 250157, 274240, 298517, 322548, 345921, 368404, 389908, 410438, 430051, 448755, 466458, 483205, 499401, 515413, 530911, 544994, 557155, 567838, 577847, 587533, 596784, 605455, 613541, 621156, 628601, 636167, 643643, 650454, 656607, 663025, 670397, 678101, 684892, 690427, 695454, 700655, 706020, 711254, 716120, 720302, 723513, 725772, 727025, 726446, 722668]
57093G22668p818j1778j5434j9231k3625k8940l5266m2014m8146n3399n8699o4934
57081C13384p2029p9754G3167b4870j07540j16295j25331j35989j47986j60104
57071h18115j72275j85601k00665k17339k36069k57971k83535l12286l43736l77895
57061c405487m15058m56015n02013n53628o10260o71823p40213q17774r05115
57052i077386j001996j109688j230749j367013j519461j689558j879064k089612
57044b0964527k324469k589949k893120l239611l636209m093931m625127n238845
57036d9605788n942411o744950p653316q664233r763392j0927281j2116395j3269246
57028a24687012j4318401j5221238j5972013j6585836j7078187j7441330j7585990
$$ y = [722668, 714850, 703072, 687638, 668407, 644782, 615842, 580576, 538562, 490416, 437017, 378318, 313384, 241355, 161601, 73167, -24870, -132410, -248705, -374036, -510025, -658011, -818115, -990390, -1175991, -1376656, -1593995, -1830064, -2088035, -2371570, -2683856, -3027592, -3405487, -3820545, -4276560, -4778573, -5332201, -5942461, -6614284, -7354497, -8172271, -9077386, -10079382, -11189070, -12419819, -13786832, -15306293, -16995851, -18874915, -20964527, -23288996, -25878945, -28772065, -32011676, -35647885, -39741816, -44366943, -49605788, -55548199, -62293149, -69946465, -78610698, -88374090, -99301371, -111417766, -124687012, -139005413, -154226651, -170198664, -186784500, -203862687, -221304017, -238890007]
57021b38890007j7266600j6098004j3738941j0141372n650743q58678L665199
57014b98979146P556727J0674732J3021275J4661605J5683884J6192976J6317067
57007b04870880J6199196J5959014J5648048J5241740J4679996J3921744J2973764
57000a00247378J1885887J0728842R570881Q462185P431535O492625N651058M906959
56992c5117406M256165L692504L208801K795731K442069K137824J876202J652054
56984a3056056J460000J294909J152821J030342R23991Q30844P48955O76731O12632
56975d324831N55644N05093M59859M18728L81506L48620L19574K92973K68068
56966g74766K45084K24022a01119H5843J71905J58737J46074J33828J23155J14056
$$ y = [-238890007, -256156607, -272254611, -285993552, -296134924, -301785667, -302644345, -298979146, -291422419, -280747687, -267726412, -253064807, -237380923, -221187947, -204870880, -188671684, -172712670, -157064622, -141822882, -127142886, -113221142, -100247378, -88361491, -77632649, -68061768, -59599583, -52168048, -45675423, -40024365, -35117406, -30861241, -27168737, -23959936, -21164205, -18722136, -16584312, -14708110, -13056056, -11596056, -10301147, -9148326, -8117984, -7193993, -6363149, -5614194, -4937463, -4324831, -3769187, -3264094, -2804235, -2385507, -2004001, -1655381, -1335807, -1042834, -774766, -529682, -305660, -101119, 85843, 257748, 416485, 562559, 696387, 819542, 933598]
56956I33598J04914R5004Q5667P8078P1531O4975N8697N3262M8307M3990M2106
56945A680129M3389M3864L6162J5551j5694m9916p9273r9522j10173j12614j08779
56934A243124j01069r2165q3897p6431o9226o2476n6850n2160m7398m2200l7235
56923E22017l3018k9333k6141k4066k3458k3695k3832k3335k2020j9966j7745
56912B55408j5974j4466j2591j0507q942p684n525k218P17J945K038K468L712
56899A88381N205O502P510Q002P739O789N298L292J054p98k005k943l884m529
56885B25613m634m420m036l310k389j838j608p74J134L298M738N528O263P110
56871B30675Q008R026R667Q610N091J25m499p918j0227j1448j1536j0936j0241
$$ y = [933598, 1038512, 1133516, 1219183, 1297261, 1368792, 1433767, 1492464, 1545726, 1594033, 1638023, 1680129, 1723518, 1767382, 1803544, 1819095, 1803401, 1753485, 1674212, 1574690, 1464517, 1351903, 1243124, 1142055, 1049890, 965993, 889562, 820336, 757860, 701010, 648850, 601452, 559252, 522017, 488999, 459666, 433525, 409459, 386001, 362306, 338474, 315139, 293119, 273153, 255408, 239434, 224968, 212377, 201870, 192928, 185244, 179719, 177501, 178218, 180163, 182201, 184669, 188381, 193586, 200088, 207598, 215600, 223339, 230128, 235426, 238718, 239772, 238974, 236969, 234026, 230142, 225613, 220979, 216559, 212523, 209213, 206824, 204986, 203378, 202604, 203738, 207036, 211774, 217302, 223565, 230675, 238683, 247709, 257376, 265986, 271077, 271202, 266703, 258785, 248558, 237110, 225574, 214638, 204397]
56858B04397r477q430p266o110m535k343l57N26O77J072J692J733J268J426K690
56843A76963M108M621M397M359M963N843O399O390O084O054O755Q251J0205J1939
56829B67331J2645J2072J1062J0827J1375J1299R472O350L132L09k290m612o323
56816C42649p412q159q630q700q331p443n857l773j838k98J404L739O355Q715
56802C02421J0824J2755J4124J4682J4704J3988J1348O145k10n454q661j0273
56790C76393j0603r692q264p299o631n259l044r03P93K774N599Q959J2422J5873
56776C71118J8898K0790K1527K1861K2005K1014J7832J2365N325k260r211j4565
56764E06699j8148k0279k0850j9474j6613j3714j1876j0864r687p566m256j66
$$ y = [204397, 194920, 186490, 179224, 173114, 168579, 166236, 165879, 166405, 167082, 168154, 169846, 171579, 172847, 174273, 176963, 181071, 185692, 190089, 194448, 199411, 205254, 211653, 218043, 224127, 230181, 236936, 245187, 255392, 267331, 279976, 292048, 303110, 313937, 325312, 336611, 346083, 352433, 355565, 355874, 353584, 348972, 342649, 335237, 327078, 318448, 309748, 301417, 293974, 288117, 284344, 282506, 282208, 283612, 287351, 293706, 302421, 313245, 326000, 340124, 354806, 369510, 383498, 394846, 400991, 400781, 395327, 386666, 376393, 365790, 356098, 347834, 340535, 333904, 328645, 325601, 324698, 325491, 328265, 333864, 342823, 355245, 371118, 390016, 410806, 432333, 454194, 476199, 497213, 515045, 527410, 532735, 530475, 521264, 506699, 488551, 468272, 447422, 427948, 411335, 397621, 385745, 374881, 365194, 357628, 353372, 353206]
56752C53206L672O408Q281J0222J2514J4544J5820J6348J5831J3447Q826K638
56740D81757l977r980j4367j6459j6574j5785j4782j3573j2218j0937r444p200
56728C36461m621k882k173j282N26K397L435M209N598O961O669M124K86l562o723
56713C49423q917j0179j0960j1751j2498j2727j2172j0986r498q064o989o295
56701B28387n777n336n000m588l847l082k959l431l576k925k196k119k245j765
56687A79541q87m58m90k69K09Oj192k259j996p51M8l15j128j370r19l87k31m35
56669A66717r09j604k210k273j813j388j290j188q38n69n62l12M94J109O42n36
56653A53470j221j030n73k38J86O27O69M63O29J045Q32j37q26n27K17O41P45P46
$$ y = [353206, 356878, 363286, 371567, 381789, 394303, 408847, 424667, 441015, 456846, 470293, 479119, 481757, 477780, 467800, 453433, 436974, 420400, 404615, 389833, 376260, 364042, 353105, 343661, 336461, 331840, 328958, 326785, 325503, 326029, 328426, 331861, 336070, 341668, 348629, 355298, 359422, 359708, 356146, 349423, 340506, 330327, 319367, 307616, 295118, 282391, 270219, 259233, 249735, 241671, 234682, 228387, 222610, 217274, 212274, 207686, 203839, 200757, 197798, 194367, 190791, 187866, 185670, 183551, 181306, 179541, 178654, 178196, 177706, 177437, 177646, 177652, 176460, 174201, 172205, 171454, 171502, 171187, 170059, 168689, 167770, 167383, 167152, 166717, 165808, 164204, 161994, 159721, 157908, 156520, 155230, 154042, 153204, 152635, 152073, 151761, 152255, 153364, 154006, 153470, 152249, 151219, 150646, 150408, 150594, 151221, 151890, 152353, 152982, 154027, 154859, 154722, 153896, 153369, 153586, 154227, 154972, 155718]
56635A55718M61j35n60n97o45q39o74k8L44l6o35q34p94o58l8R51J151m2j416
56616A50694j443l52M61N01M05N62P67J047J624K167J997J092J5r23j676j890
56600A55048j256l36j11o96j341j621j816k122k253k043j749j708k035k653l158
56585A30150k852j483K04J185J262J046J083J499K187K761K693K087J888K648
56571A46358L550L470K596K022K016J821J051J88l90q81j376j547j273q91o42
56556A56072m54l08k98k84j39j72p06j305j187l58M23P52Q75R18O58J93j2P7l6
56537A54709m89q03p21o06p34q10n47j75j0K5K20O57J140J343J057N10K77N60
56519A55603Q74Q05O44P51Q23N82O15J521K563K411J145K67O28J490J835J532
$$ y = [155718, 156179, 156044, 155484, 154887, 154242, 153403, 152729, 152701, 153045, 153009, 152374, 151540, 150746, 150088, 150050, 151001, 152152, 152110, 150694, 149251, 148899, 149360, 149861, 150266, 150828, 151595, 152642, 154266, 156433, 158430, 159522, 159537, 158614, 156938, 155048, 153792, 153456, 153345, 152649, 151308, 149687, 147871, 145749, 143496, 141453, 139704, 137996, 135961, 133308, 130150, 127298, 125815, 126019, 127204, 128466, 129512, 130595, 132094, 134281, 137042, 139735, 141822, 143710, 146358, 149908, 153378, 155974, 157996, 160012, 161833, 162884, 163072, 162682, 161801, 160425, 158878, 157605, 156714, 156072, 155618, 155310, 155012, 154728, 154589, 154417, 153711, 152406, 151219, 150861, 151284, 152036, 152911, 153829, 154487, 154680, 154668, 154745, 154709, 154220, 153417, 152696, 152090, 151356, 150546, 149999, 149824, 149814, 149839, 150059, 150716, 151856, 153199, 154256, 154766, 155043, 155603, 156477, 157282, 157926, 158677, 159500, 160082, 160697, 162218, 164781, 167192, 168337, 168604, 169232, 170722, 172557, 174089]
56503A74089R60M51M33J216K324K903K954L240L846L939L234K544K384K188J552
56488B08257J099J356J670J209K77k92l92m98p16q52j013j421j883k102k213k509
56472A99977k892l018k747k074j078k09j37p85j158n86L22N92J60l95q32j193
56456A83947j205n51L61P26M01L3J28M56M43j99j206j876j593n23L91L81l16q50
56438A78948p12o2O77J167J240R37M20j78p31r82o98q1L94N72O70P58O39L30J56
56419A83464K44M37P33J180J400R33J77P5O66R85O98P08J530K248K013J529J953
56402B00973L018L555L310L038L086L101K967K900K721K026J112O77O38K32n73
56387B32781q81l01M20N69M03L68K58k51q18r42q78j318k330l224l432l060k506
$$ y = [174089, 175049, 175500, 175933, 177149, 179473, 182376, 185330, 188570, 192416, 196355, 199589, 202133, 204517, 206705, 208257, 209356, 210712, 212382, 213591, 213868, 213576, 213184, 212686, 211970, 211118, 210105, 208684, 206801, 204699, 202486, 199977, 197085, 194067, 191320, 189246, 188168, 187959, 187822, 187037, 185879, 185293, 185615, 186207, 186367, 185972, 185140, 183947, 182742, 182191, 182552, 183278, 183679, 183712, 183840, 184296, 184739, 184540, 183334, 181458, 179865, 179342, 179733, 180114, 179798, 178948, 178236, 178174, 178851, 180018, 181258, 182195, 182615, 182437, 181706, 180724, 180026, 179945, 180339, 180911, 181581, 182339, 182978, 183308, 183464, 183708, 184145, 184878, 186058, 187458, 188391, 188568, 188643, 189309, 190294, 190992, 191700, 193230, 195478, 197491, 199020, 200973, 203991, 207546, 210856, 213894, 216980, 220081, 223048, 225948, 228669, 230695, 231807, 232484, 233122, 233354, 232781, 231900, 231599, 232019, 232588, 232991, 233359, 233617, 233366, 232548, 231606, 230728, 229410, 227080, 223856, 220424, 217364, 214858]
56370B14858k014j704j714k039k421k587k514k316j954j344p03m49o11o57j41
56355A91690P16J394J734J883J778J280O56L99N19N36K02k44o08r53j226j200
56339A98556r67q70q34l98M15Q97O42J19j17j83l93n98m34J08P68J290J388R25
56321B00314L48L97J062J492J259R69J152J345R70L91K94N56O14N70J029K025
56305B14787K892L124K737J921R31K09R4L87N84M46J49J28Q68K388L696L476J745
56288B40562J24m5Q15J553J902K236K477K366K314K857L524L382K501J796J636
56273B70000J593J558J881K479K763K675K779L106K905J868Q17P14J602K877M033
56258C03650M831N171N116M792M213L472L065L480M477N253N373N120M890M820
$$ y = [214858, 212844, 211140, 209426, 207387, 204966, 202379, 199865, 197549, 195595, 194251, 193548, 193099, 192488, 191831, 191690, 192406, 193800, 195534, 197417, 199195, 200475, 201131, 201530, 202049, 202585, 202787, 202543, 201935, 200982, 199756, 198556, 197589, 196719, 195885, 195487, 195902, 196799, 197441, 197560, 197443, 197260, 196867, 196269, 195835, 195943, 196711, 198001, 199389, 200314, 200662, 201059, 202121, 203613, 204872, 205841, 206993, 208338, 209308, 209699, 209993, 210549, 211163, 211733, 212762, 214787, 217679, 220803, 223540, 225461, 226392, 226601, 226695, 227082, 227666, 228112, 228261, 228389, 229257, 231645, 235341, 238817, 240562, 240686, 240641, 241456, 243009, 244911, 247147, 249624, 251990, 254304, 257161, 260685, 264067, 266568, 268364, 270000, 271593, 273151, 275032, 277511, 280274, 282949, 285728, 288834, 291739, 293607, 294424, 295138, 296740, 299617, 303650, 308481, 313652, 318768, 323560, 327773, 331245, 334310, 337790, 342267, 347520, 352893, 358013, 362903, 367723]
56244C67723M993N544O309O797O695O169N650N493N740O019N832N248M986N425
56230D48623N895N535M546M023M652O142P772Q931R264Q999R025J0106J2016J3893
56216E59422J5293J6356J7204J7895J8812K0415K2609K4911K7180K9615L2158
56205H01870L4628L7299M0653M4518M8225N1683N5564O0273O5366P0240P4891
56194A385210P9661Q4574Q9139R2615R4486R4839R4103R2315Q8912Q3517P6449
56183B355820O8046N8033M6204L3301K0530Q414l105j3750k2904l0406l6687m2127
56171B441369m6812n0767n3893n5863n6659n6989n7692n8974o0614o2422o3955
56160A816729o4468o3901o3306o3453o3610o2654o0764n8868n7011n4590n1779
$$ y = [367723, 372716, 378260, 384569, 391366, 398061, 404230, 409880, 415373, 421113, 427132, 432964, 438212, 443198, 448623, 454518, 460053, 464599, 468622, 473274, 479416, 487188, 496119, 505383, 514382, 523407, 533513, 545529, 559422, 574715, 591071, 608275, 626170, 644982, 665397, 688006, 712917, 740097, 769712, 801870, 836498, 873797, 914450, 958968, 1007193, 1058876, 1114440, 1174713, 1240079, 1310319, 1385210, 1464871, 1549445, 1638584, 1731199, 1825685, 1920524, 2014627, 2106942, 2195854, 2279371, 2355820, 2423866, 2481899, 2528103, 2561404, 2581934, 2590348, 2587243, 2573493, 2550589, 2520183, 2483496, 2441369, 2394557, 2343790, 2289897, 2234034, 2177375, 2120386, 2062694, 2003720, 1943106, 1880684, 1816729, 1752261, 1688360, 1625054, 1561601, 1497991, 1435337, 1374573, 1315705, 1258694, 1204104, 1152325]
56149A152325m9309m7023m4091m0617l7649l5506l3412l0916k8422k6165k3870
56138G55345k1631j9990j8796j7140j4758j2534j1255j0670j0104r209p938o472
56126E94848n277m602l994k979j895j235o08M91J403J149K90L54J519K526K957
56111E84947L868N764P601Q451Q747R281J0054J0814J1654J2556J3201J3627J4165
56098G14730J4610J4400J3815J3861J4726J5517J5682J5616J5730J6078J7034
56087H81799J9079K1824K4476K7315L1272L6125M0706M4989N0168N6440O2597
56076A296790O8191P3990P9701Q3274Q3386Q0797P6322O9531O0673N2020M5694
56065B070369M1387L7469L3027K7581K0263J0891J067p268j3724j9068k3873k8599
$$ y = [1152325, 1103016, 1055993, 1011902, 971285, 933636, 898130, 864718, 833802, 805380, 779215, 755345, 733714, 713724, 694928, 677788, 663030, 650496, 639241, 628571, 618467, 609258, 601320, 594848, 589571, 584969, 580975, 577996, 576101, 574866, 574258, 574749, 576152, 577301, 577591, 577945, 579464, 581990, 584947, 588815, 594579, 602180, 610631, 619378, 628659, 638713, 649527, 661181, 673737, 686938, 700565, 714730, 729340, 743740, 757555, 771416, 786142, 801659, 817341, 832957, 848687, 864765, 881799, 900878, 922702, 947178, 974493, 1005765, 1041890, 1082596, 1127585, 1177753, 1234193, 1296790, 1364981, 1438971, 1518672, 1601946, 1685332, 1766129, 1842451, 1911982, 1972655, 2024675, 2070369, 2111756, 2149225, 2182252, 2209833, 2230096, 2240987, 2242054, 2234786, 2221062, 2201994, 2178121, 2149522]
56053B149522l4144m1211m9597n8620o7499p4910p9314q0415p9251p6475p1796
56042A436290o5547n9238n3780m8562m3021l7682l2822k7728k2241j7577j4543
56031A013549j2317r980p843o219m431k147l67J15QK07M84M61N56R47R92N96P27
56014I75338J642K202J948K100L387M633M802M745N483O454O904P444Q707J0002
56000A045791J0784J1895J3884J5644J6210J6417J7233J8118J8473J9136K0775
55989A224360K2369K2894K3045K3738K4412K4411K4494K5465K6785K7982K9773
55978A499728L2436L4759L6033L7255L9139M0924M2393M4772M8205N0881N2174
55967A958699N4021N7500O0876O2963O5373O9254P2893P5013P7418Q1666Q6182
$$ y = [2149522, 2115378, 2074167, 2024570, 1965950, 1898451, 1823541, 1744227, 1663812, 1584561, 1508086, 1436290, 1370743, 1311505, 1257725, 1209163, 1166142, 1128460, 1095638, 1067910, 1045669, 1028092, 1013549, 1001232, 991252, 983409, 977190, 972759, 970612, 970245, 970360, 970368, 970575, 971059, 971520, 972076, 973023, 974015, 974611, 975338, 976980, 979182, 981130, 983230, 986617, 991250, 996052, 1000797, 1006280, 1012734, 1019638, 1027082, 1035789, 1045791, 1056575, 1068470, 1082354, 1097998, 1114208, 1130625, 1147858, 1165976, 1184449, 1203585, 1224360, 1246729, 1269623, 1292668, 1316406, 1340818, 1365229, 1389723, 1415188, 1441973, 1469955, 1499728, 1532164, 1566923, 1602956, 1640211, 1679350, 1720274, 1762667, 1807439, 1855644, 1906525, 1958699, 2012720, 2070220, 2131096, 2194059, 2259432, 2328686, 2401579, 2476592, 2554010, 2635676, 2721858]
55956B721858Q9407R2827R7801J02632J05872J09440J15083J20962J25295J30192
55946C811369J37940J46670J53722J60323J68653J77425J84856J93079K04920
55937E338957K19047K32929K47704K65364K84115L01470L19028L39101L59772
55928G907487L78466L97325M19506M43593M67333M93340N24920N59870N94957
55919A2186797O32780O77285P26326P76089Q28955Q89264R55275J023564J097254
55910A9793589J181332J274398J374192J486408J618250J768924J937591K135106
55902C2569790K376344K667793L015758L438524L954607M567277N277841O103368
55894F3971302P059262Q134892R311832J0593377J1985737J3464258J4982307
$$ y = [2721858, 2811265, 2904092, 3001893, 3104525, 3210397, 3319837, 3434920, 3555882, 3681177, 3811369, 3949309, 4095979, 4249701, 4410024, 4578677, 4756102, 4940958, 5134037, 5338957, 5558004, 5790933, 6038637, 6304001, 6588116, 6889586, 7208614, 7547715, 7907487, 8285953, 8683278, 9102784, 9546377, 10013710, 10507050, 11031970, 11591840, 12186797, 12819577, 13496862, 14223188, 14999277, 15828232, 16717496, 17672771, 18696335, 19793589, 20974921, 22249319, 23623511, 25109919, 26728169, 28497093, 30434684, 32569790, 34946134, 37613927, 40629685, 44068209, 48022816, 52590093, 57867934, 63971302, 71030564, 79165456, 88477288, 99070665, 111056402, 124520660, 139502967]
55887A39502967J6443131J7529305J7551960J5669295J1491691N546225r15597
55880B22818977o623472j0864362j3536455j4871688j5197831j4845920j4101906
55873A32777343j3162142j2134913j1078968j0025752q984598p963583o991957
55866F2435430o108362n331982m659999m086183l604727l200459k852997k550998
55858C0039723k291124k065941j864879j684775j527915j391148j266997j153703
55850A6793241j054336r67441q87667q14342p50661o95561o44507n97266n57069
55841I824391n22920m90186m58012m29186m03428l77675l52338l30655l12341
55832F147650k94142k76168k61466k49589k36605k21561k07412j95422j83933
$$ y = [139502967, 155946098, 173475403, 191027363, 206696658, 218188349, 223734574, 222818977, 216195505, 205331143, 191794688, 176923000, 161725169, 146879249, 132777343, 119615201, 107480288, 96401320, 86375568, 77390970, 69427387, 62435430, 56327068, 50995086, 46335087, 42248904, 38644177, 35443718, 32590721, 30039723, 27748599, 25682658, 23817779, 22133004, 20605089, 19213941, 17946944, 16793241, 15738905, 14771464, 13883797, 13069455, 12318794, 11623233, 10978726, 10381460, 9824391, 9301471, 8811285, 8353273, 7924087, 7520659, 7142984, 6790646, 6459991, 6147650, 5853508, 5577340, 5315874, 5066285, 4829680, 4608119, 4400707, 4205285, 4021352]
55823D021352j72742j63637j56358j48671j40534j33865j28376j21996j15103
55814B740070j09879j05801j00310r3777q9219q7001q4286p9988p5992p3014o9349
55803A771454o4360n9426n4999n0265m6053m4480m5244m5625m4532m3295m2245
55792A230930m0041l6778l4385l3332l2085l0272k9256k9069k7919k5371k3087
55781H89335k1759k0167j7922j6284j5663j4889j3631j2921j2730j1642r481p805
55769G14441p151o280m783l939m256m520m030l711m324n478o930q914j0832j1617
55755F27676j1673j2408j3691j3944j2956j2304j2604j2682j1845j0821r987q884
55743D83877p854p869q395p664n584m049l803l469k232j120p82l33N85Q79J29
$$ y = [4021352, 3848610, 3684973, 3528615, 3379944, 3239410, 3105545, 2977169, 2855173, 2740070, 2630191, 2524390, 2424080, 2330303, 2241084, 2154083, 2069797, 1989809, 1913817, 1840803, 1771454, 1707094, 1647668, 1592669, 1542404, 1496351, 1451871, 1406627, 1361002, 1316470, 1273175, 1230930, 1190889, 1154111, 1119726, 1086394, 1054309, 1024037, 994781, 965712, 937793, 912422, 889335, 867576, 847409, 829487, 813203, 797540, 782651, 769020, 756099, 743369, 731727, 722246, 714441, 707290, 701010, 696227, 692288, 688032, 683512, 679482, 675771, 671447, 665969, 659039, 650125, 639293, 627676, 616003, 603595, 589904, 575960, 563004, 550700, 538096, 525414, 513569, 502748, 492761, 483877, 476023, 468154, 459759, 452095, 446511, 442462, 438659, 435190, 432958, 431838, 431056, 430723, 431308, 432187, 432316]
55728D32316m73k74k60r79j444j154j209k213l031k851k647l353m291m836n817
55713C97484p799r446r333q173p669q097q482q374q086p770p425p345p691q085
55699B83709q215q248q169p464o038m647l869l381k756k205k110k413k911l422
55685B17861l565l074k407k222k290j930j349j373j916k078j788j873k375k361
55671A87260j660j201j317j300j025j352k372k908k419j863j932k007j666j626
55657A62612k215k427j595o61o14q71m88P7k11j166j634j076O6J126J584J169
55641A53676K03n48p99r54j223j296j080r17p65j97N39O09L1j65L96Q70Q26J031
55623A50237J987K997L411L620L985M028L546L310L701L809K832J364K56p33k000
$$ y = [432316, 431843, 431569, 431309, 430330, 428886, 427732, 426523, 424310, 421279, 418428, 415781, 412428, 408137, 403301, 397484, 389685, 380239, 370906, 362733, 355064, 346967, 338485, 330111, 322025, 314255, 306830, 299485, 291794, 283709, 275494, 267246, 259077, 251613, 245575, 240928, 237059, 233678, 230922, 228717, 226607, 224194, 221283, 217861, 214296, 211222, 208815, 206593, 204303, 202373, 201024, 199651, 197735, 195657, 193869, 191996, 189621, 187260, 185600, 184399, 183082, 181782, 180757, 179405, 177033, 174125, 171706, 169843, 167911, 165904, 164238, 162612, 160397, 157970, 156375, 155714, 155100, 154229, 153741, 153818, 153607, 152441, 150807, 149731, 149797, 150923, 152507, 153676, 153879, 153331, 152532, 151578, 150355, 149059, 147979, 147062, 146297, 146100, 146639, 147248, 147279, 147114, 147510, 148380, 149206, 150237, 152224, 155221, 158632, 162252, 166237, 170265, 173811, 177121, 180822, 184631, 187463, 188827, 189083, 188350, 186350]
55608A86350k845k469j540j343j893k053j310l67k7k56m51j44N25R50Q73Q71J463
55591A76334K054J683O43J34L62M26K03O85J934K416J245l53q70n59o04j275k029
55574A82429k528k697k460k192k551l361l661l325l376m071m256l442k907l558
55560A38044m343m167l873m598n474m909l244k137j910j454m08L47L34Q2J5m6
55544A02259k07l24m99r40j454j751j921j996j577n81J82N0n40r06j197j727k012
55527H4859j546q66p32r17q40p27j055j428j284j048j382j826j534q38o81r53
55511F7202p59m3M54O18R89J466J301M54k04j43K63M91L49j51p44r34p21p98j462
55492F7628j957j746j538j974k215j204L67J026Q18R98J718J849J023J88k1K6
$$ y = [186350, 183505, 181036, 179496, 178153, 176260, 174207, 172897, 172530, 172503, 172247, 171796, 171652, 172177, 173127, 174000, 174871, 176334, 178388, 180071, 180714, 180848, 181210, 181636, 181839, 182524, 184458, 186874, 188119, 187766, 186896, 186337, 185733, 184458, 182429, 179901, 177204, 174744, 172552, 170001, 166640, 162979, 159654, 156278, 152207, 147951, 144509, 141602, 138044, 133701, 129534, 125661, 121063, 115589, 110680, 107436, 105299, 103389, 101935, 101527, 101874, 102208, 102290, 102305, 102259, 102052, 101728, 101229, 100289, 98835, 97084, 95163, 93167, 91590, 91009, 91191, 91241, 90701, 89795, 88598, 86871, 84859, 83313, 82447, 81715, 80798, 79958, 79231, 78176, 76748, 75464, 74416, 73034, 71208, 69674, 68836, 68155, 67202, 66443, 66400, 66854, 67472, 68461, 69927, 71228, 71682, 71478, 71335, 71598, 72089, 72438, 72287, 71543, 70609, 69888, 69090, 67628, 65671, 63925, 62387, 60413, 58198, 56994, 57361, 58387, 59205, 60203, 61921, 63770, 64793, 64981, 64960, 64986]
55476F4986R9N25J252J667J564J259P16k70j054n85J000K393K853K781K596K231
55460H4013J860J865J992J631R97Q49J078R29N27P31J336J133np67o84j010k500
55443I3975l953m035l296l059l300k997j939r55o57r36j506k170k655k750k556
55428E7211k280k024j907k031k125j688p66q2j53o60r87r24n95j00M05N83J89
55411D2066n99j230j193n23L4k55j030j065kQ87M13p82j158m83J60J77k7j86m77
55392C4727o72k48M05K16q89j687j314k65N81R48P87J8r79j446j177o11N5R38
55374B9387J587J206mq37p64m67m09j66M10O51K79%J69Q9n83r25j69R49J268Q51
55354C2522N11M39L18K10M26P99R07O83K62l40r05r04k80K45J23l42o80r29j085
$$ y = [64986, 65085, 65610, 66862, 68529, 70093, 71352, 72068, 71798, 70744, 70159, 71159, 73552, 76405, 79186, 81782, 84013, 85873, 87738, 89730, 91361, 92358, 93207, 94285, 95214, 95741, 96472, 97808, 98941, 98936, 98169, 97485, 96475, 93975, 90022, 85987, 82691, 79632, 76332, 73335, 71396, 70441, 69784, 68848, 67342, 65172, 62517, 59767, 57211, 54931, 52907, 51000, 48969, 46844, 45156, 44390, 44308, 44155, 43495, 42508, 41584, 40989, 40889, 41294, 41877, 42066, 41467, 40237, 39044, 38521, 38555, 38300, 37270, 36205, 36203, 37090, 37503, 36721, 35563, 35080, 35240, 35417, 35390, 35204, 34727, 34055, 33807, 34212, 34428, 33539, 31852, 30538, 30273, 30854, 31802, 32589, 32607, 31628, 30182, 29005, 28394, 28449, 29387, 30974, 32180, 32176, 31339, 30575, 30108, 29699, 29533, 29943, 30594, 30873, 30873, 31042, 31131, 30548, 29623, 29454, 30403, 31671, 32522, 33033, 33472, 33790, 34000, 34426, 35225, 36132, 36815, 37077, 36737, 35832, 34928, 34648, 34893, 35016, 34674, 33994, 33065, 31980]
55335C1980p07K17P57K14p81j148p50j51M67J286K080K274J638M43q44j640j541
55318C3794q76n10o89p19j88L10J79k66n61r36j596j922j325l45J03kq6n0j12
55299B4203q2K47L81k05j017j111m36K88P33J075J202Q15J98m1Q2J8k88l64q7
55280B5611J50J56J10K4k84o64p27m44j23Q2J23j98q12j025l61M96M83l40r46
55261B1311r07p39o50j01J061J949J680M93o25j007o49O6O37P42N15L37L20K55
55243B4688P1k2O0J69K02J84J3m63j026j155n85L50J074J243R64P09R17J435J579
55224C0407R70P0m44n12m99m94l16l1J33J58Q1k96r61j304q16M9M67N10Q47J362
55204B9381J188K19m96k80J96N2n58r91j185j441j604j242m70J76M35M19J39m50
$$ y = [31980, 31273, 31490, 32247, 32461, 31680, 30532, 29782, 29631, 30098, 31384, 33464, 35738, 37376, 37819, 36975, 35335, 33794, 32918, 32408, 31719, 31000, 30812, 31122, 31301, 31035, 30474, 29538, 27942, 26020, 24695, 24350, 24453, 24451, 24365, 24315, 24203, 24121, 24368, 24749, 24544, 23527, 22416, 21980, 22268, 23001, 24076, 25278, 26093, 26291, 26250, 26332, 26350, 26062, 25698, 25611, 25761, 25917, 26027, 26051, 25767, 25103, 24376, 23932, 23809, 23891, 24014, 23816, 23004, 21979, 21618, 22114, 22597, 22257, 21311, 20404, 19665, 19015, 18914, 19975, 21924, 23604, 24097, 23472, 22465, 21816, 21882, 22519, 23261, 23776, 24113, 24433, 24688, 24759, 24737, 24797, 24966, 25168, 25352, 25365, 24902, 23876, 22721, 22136, 22486, 23560, 24803, 25767, 26476, 27393, 28828, 30407, 31377, 31447, 31003, 30491, 29992, 29498, 29182, 29151, 29284, 29442, 29523, 29227, 28266, 26962, 26146, 26195, 26662, 27172, 28019, 29381, 30569, 30788, 30292, 30012, 30208, 30260, 29702, 28711, 27526, 26085, 24481, 23239, 22769, 22945, 23380, 23799, 23938, 23488]
55186B3488j011j078p45n96p63o25L06J571K239J973J260O72L14L5j55j38P2K95
55168B7114L63K34J9j8L02P65Q69M66L3M1L20L46L6k30j52K67Q95J393J170P5
55148C4308j058j202m80Q3J01J84O47Q93N01m0j56OK30P46J488J609O36o24j167
55129C6705j147j208j172n18K81K37n45r39n36j52m41j010j219j012o08r7L73
55112B6992N03K81L7l1k5N8L95R66J496J782J687R91k49j302j395o84k1K01K62
55093C1944K91Nn52q42o62m88o65q77p62n43o26r41r94m54M93J175R60l5q79q54
55073B4694l28j09k05P2Q86J573J648J331R48N40K66M54R64J238J156J210J575
55056C7913J754J507J352J633J856J516R80Q88J115J073P34O09Q18Q75L93m42
$$ y = [23488, 22477, 21399, 20654, 20058, 19295, 18670, 18976, 20547, 22786, 24759, 26019, 26691, 27005, 27040, 26885, 26747, 26819, 27114, 27477, 27711, 27730, 27712, 28014, 28779, 29648, 30114, 30147, 30188, 30508, 30854, 30890, 30660, 30508, 30775, 31670, 33063, 34233, 34308, 33250, 32048, 31568, 31651, 31752, 31936, 32583, 33476, 33977, 33937, 33781, 33787, 34017, 34763, 36251, 37860, 38496, 37872, 36705, 35558, 34350, 33178, 32660, 32941, 33178, 32633, 31694, 31158, 31006, 30565, 29555, 28336, 27324, 26716, 26619, 26992, 27495, 27776, 27813, 27782, 27757, 27815, 28210, 29176, 30672, 32454, 34141, 35132, 34883, 33581, 32186, 31502, 31481, 31682, 31944, 32235, 32240, 31688, 30846, 30184, 29696, 29031, 28154, 27392, 26849, 26223, 25282, 24288, 23834, 24327, 25502, 26462, 26427, 25548, 24694, 24366, 24257, 24052, 24124, 25010, 26583, 28231, 29562, 30510, 31050, 31316, 31770, 32734, 33972, 35128, 36338, 37913, 39667, 41174, 42526, 44159, 46015, 47531, 48511, 49399, 50514, 51587, 52321, 52930, 53748, 54623, 55016, 54574]
55040E4574j167j488j325p39M4O45P57L96l0j01R6M1m76r52q49l40O2L57Q13J136
55020E1454P42j13m27J35P20N60m7m89p74j108j149m46O91J434J401R16M56K40
55002E4196K38K32N3j08J02N27N33n7n22k74J74j45j257k218k325j757j004k25
54984D6163O08J317J614J492J298J344J504J286N09l40o52m47k66l82o21q52j013
54967E2562o89N85K303L107K346R12k4m32r06j355j135k04P59J296J483J334O75
54950F2617k52o94j87R19J887K174J626M94n75j044j070j241j587j353j16J349
54934F2947J809J037k3m84m48m75o00m33j3N8n37j295j532j209p57l92l0K71L65
54915E8259L78N33O47L40k23m24j30J05n4j77J68O77Q31P01P66J179J664J929
$$ y = [54574, 53407, 51919, 50594, 49855, 49899, 50544, 51301, 51697, 51667, 51566, 51662, 51703, 51227, 50275, 49426, 49086, 49148, 49505, 50318, 51454, 52196, 52083, 51656, 51791, 52511, 53071, 53024, 52535, 51761, 50653, 49504, 49058, 49749, 51183, 52584, 53500, 53956, 54196, 54434, 54666, 54719, 54611, 54713, 55240, 55773, 55716, 55194, 54920, 55094, 54949, 53692, 51474, 49149, 47392, 46388, 46163, 46771, 48088, 49702, 51194, 52492, 53836, 55340, 56626, 57135, 56795, 56143, 55696, 55430, 55048, 54427, 53575, 52562, 51873, 52458, 54761, 57868, 60214, 61126, 61102, 60670, 59764, 58409, 57274, 57070, 57829, 59125, 60608, 61942, 62617, 62365, 61671, 61484, 62403, 64290, 66464, 68090, 68584, 68009, 66965, 65895, 64654, 63067, 61714, 61598, 62947, 64756, 65793, 65770, 65286, 64838, 64363, 63763, 63330, 63317, 63375, 62838, 61543, 60011, 58802, 58045, 57653, 57623, 57894, 58259, 58637, 59170, 59817, 60157, 59934, 59510, 59380, 59485, 59431, 59254, 59422, 60099, 60930, 61631, 62397, 63576, 65240, 67169]
54897F7169J851J452J011R82J457J961K089K080K356K807L064L228L697M395M783
54882A04382M764M910N601O375O542O061N452N006M521L778K862J845N11j266
54868A61344l054m197m675n162o087p010p224o689n951n379m910m420l921l436
54854H9229l019k770k581k093j278o89o44n18L42J378J457O25J81Q90K180L271
54838H5961M105M789N141N300N855O792P198O582N606M857L792J806m30j773k235
54823A43346k830m135n845p411q303q004o610n240m971n559n851n286m199l001
54809F6101j878j141r86r96n87M3J29n40j372j763j524p52J60N28J66j11M19J027
54791E6923L60j483k771k319q89j4k36q91j152p36K9N33N08L16M19O51N25L2m02
$$ y = [67169, 69020, 70472, 71483, 72465, 73922, 75883, 77972, 80052, 82408, 85215, 88279, 91507, 95204, 99599, 104382, 109146, 114056, 119657, 126032, 132574, 138635, 144087, 149093, 153614, 157392, 160254, 162099, 162610, 161344, 158290, 154093, 149418, 144256, 138169, 131159, 123935, 117246, 111295, 105916, 101006, 96586, 92665, 89229, 86210, 83440, 80859, 78766, 77488, 76799, 76155, 75637, 75979, 77357, 78814, 79439, 79620, 80510, 82690, 85961, 90066, 94855, 99996, 105296, 111151, 117943, 125141, 131723, 137329, 142186, 145978, 147784, 147354, 145581, 143346, 140516, 136381, 130536, 123125, 114822, 106818, 100208, 94968, 89997, 84438, 78587, 73301, 69102, 66101, 64223, 63082, 62096, 61100, 60513, 60556, 60685, 60145, 58773, 57010, 55486, 54734, 54894, 55422, 55588, 55477, 55896, 56923, 57283, 55800, 53029, 50710, 49821, 49807, 49571, 48680, 47528, 46792, 46821, 47354, 47862, 48178, 48597, 49248, 49773, 49805, 49403]
54772D9403o68r25r66l68O44J213Q89O6o87j088r05l4J038J525J256O96J39l91
54754E0837n20J78J187J406P62L70P02Q21P6o21k28P14J015Q36J352K712L643
54737F5242L260K196J582J668J878J791J575J633K181L125M259N433O487P134
54723A09444P175O831O582O610O643O363N613M208K107j24j586k155k713l897
54709A51101n080n183m144k951k401k411k513k493k385k166j723j015k56J67R7
54694A16644p7K24J093K063K776L359L965M414M525M520M758N346O256P509Q901
54679A76276R797R609Q416O843N410M144K654M87k400n377p556q626r004r169
54665A81504r185r004q748q475q015p334o688o188n615m890m282l868l331k625
$$ y = [49403, 48735, 47810, 46844, 46476, 47120, 48333, 49222, 49288, 48601, 47513, 46608, 46574, 47612, 49137, 50393, 51089, 51228, 50837, 50317, 50495, 51682, 53088, 53850, 54220, 54922, 55743, 55819, 55198, 54970, 55684, 56699, 57535, 58887, 61599, 65242, 68502, 70698, 72280, 73948, 75826, 77617, 79192, 80825, 83006, 86131, 90390, 95823, 102310, 109444, 116619, 123450, 130032, 136642, 143285, 149648, 155261, 159469, 161576, 161452, 159866, 157711, 154998, 151101, 146021, 140838, 136694, 133743, 131342, 128931, 126418, 123925, 121540, 119374, 117651, 116636, 116380, 116547, 116644, 116567, 116791, 117884, 119947, 122723, 126082, 130047, 134461, 138986, 143506, 148264, 153610, 159866, 167375, 176276, 186073, 195682, 204098, 210941, 216351, 220495, 223149, 223636, 221236, 215859, 208303, 199677, 190673, 181504, 172319, 163315, 154567, 146092, 138077, 130743, 124055, 117867, 112252, 107362, 103080, 99212, 95881, 93256]
54651I3256k296k631l039k838k228j796j486q60j08J40j17j65L21Q25Q57O30N32
54634G8997M47J8o20p95r6R43J215K69j003j379q72o34j142j400n12Q46J469J443
54616G7194J718K243J961P60l2M52J400J651J334J296J633J766J595J672K277
54601I8920L015L379L219K621J803J102P12L83k81j161j552r28M55J762K342K204
54585A17995J938K127K782L350L382L115L224M030N153O030O583P146P863Q390
54571A83108Q346P792P112O475N647M346K571N03j705l855n610o676p094p229
54557A93731p486q008q515q464p529o035m715l974l614l330l112l004k808k437
54543A20700k194k338k613k643k517k491k378j880j339j397j858j817j085o63
$$ y = [93256, 90960, 88329, 85290, 82452, 80224, 78428, 76942, 76082, 75974, 76114, 75997, 75832, 76153, 76978, 77835, 78465, 78997, 79444, 79462, 78842, 78047, 77951, 78894, 80109, 80378, 79375, 77996, 77124, 76490, 75348, 73948, 73436, 74282, 75751, 77194, 78912, 81155, 83116, 83876, 83844, 84296, 85696, 87347, 88681, 89977, 91610, 93376, 94971, 96643, 98920, 101935, 105314, 108533, 111154, 112957, 114059, 114771, 115154, 114873, 113712, 112160, 111232, 111687, 113449, 115791, 117995, 119933, 122060, 124842, 128192, 131574, 134689, 137913, 141943, 147096, 153126, 159709, 166855, 174718, 183108, 191454, 199246, 206358, 212833, 218480, 222826, 225397, 225900, 224195, 220340, 214730, 208054, 200960, 193731, 186245, 178237, 169722, 161258, 153729, 147694, 142979, 139005, 135391, 132061, 128949, 125945, 123137, 120700, 118506, 116168, 113555, 110912, 108395, 105904, 103526, 101646, 100307, 98910, 97052, 95235, 94150, 93487]
54529I3487j277k169k063r67j65n41j624k370k368j982j718j714j746j470p50
54514G0563J53P17O10j6o93j155j523j998k446k515k136j650j314r92n21j52j93
54497E4739l86j13P22J472J600J390J472J960K346K132J352M93O7K08N74P37O33
54480G1398N37O08P46R00J142J309J072N80O21J646K958L445L011K668L211M292
54464A00144N001M883M123L116K188J582J323J145O97r8j019j818k394k728k841
54449A13304k898l202l890m602m656l800k712k363k863l290k842j843j142q98
54435G2303n65J3K47j79o93o59l66n08j007j068m14K78L56P1O8M42P47P84Q42
54416G0692J117J287R19J06n14m16K90J068J577J842J891J469M69n99r16k28Q45
$$ y = [93487, 92210, 90041, 87978, 87011, 86846, 86305, 84681, 82311, 79943, 77961, 76243, 74529, 72783, 71313, 70563, 70716, 71433, 72043, 72027, 71334, 70179, 68656, 66658, 64212, 61697, 59561, 57911, 56597, 55605, 55084, 54932, 54739, 54353, 54240, 54962, 56434, 58034, 59424, 60896, 62856, 65202, 67334, 68686, 69179, 69246, 69454, 70028, 70765, 71398, 71935, 72543, 73289, 74189, 75331, 76640, 77712, 78292, 78913, 80559, 83517, 86962, 89973, 92641, 95852, 100144, 105145, 110028, 114151, 117267, 119455, 121037, 122360, 123505, 124202, 124104, 123085, 121267, 118873, 116145, 113304, 110406, 107204, 103314, 98712, 94056, 90256, 87544, 85181, 82318, 79028, 76186, 74343, 73201, 72303, 71738, 71751, 71998, 71819, 71126, 70467, 70101, 69593, 68586, 67518, 67104, 67382, 67738, 67809, 67877, 68319, 69066, 69850, 70692, 71809, 73096, 74015, 74121, 73607, 73191, 73481, 74549, 76126, 77968, 79859, 81328, 81797, 81198, 80282, 80054, 80899]
54399H0899J494J460J030N46J52j35l41m88n28m07k27k19m21o36p21p84q77p51
54381G9046k06N04Q71O84J47l94o51n01j64j50o94j361j514j035l30K82P23Q93
54363G6150O81K94R7P0q9l55m09k69l48o37n35J89Q18N95j68m39K95J514K295
54344G9749K143J370R12J523K888L756L270J921Q87O70Q38Q75P57P31R20J175
54328A04385J126M90m66j017q74o42r86j618j801j558j596k021k040j254m36m83
54312H9209j206j737j758j636j488r35R5R21Q51J09m58m14j82k89n90n03J03P10
54294H0802Q10N15K45J72J71J93L57P66J376J961K134J582N57j19R8P67R79M96
54276I3862l8k5L61M95R6m82o40j47N13N32l42j474k034j939j775j928k237k387
$$ y = [80899, 82393, 83853, 84883, 85429, 85581, 85446, 85105, 84617, 84089, 83682, 83455, 83236, 82815, 82179, 81458, 80674, 79797, 79046, 78840, 79344, 80215, 80899, 81046, 80652, 80001, 79500, 79336, 79186, 78492, 77131, 75617, 74582, 74252, 74534, 75257, 76150, 76831, 77125, 77222, 77292, 77203, 76848, 76439, 76170, 75822, 75185, 74650, 74839, 75657, 76252, 76084, 75645, 75940, 77454, 79749, 81892, 83262, 84174, 85697, 88585, 92341, 95611, 97532, 98419, 99089, 99927, 100802, 101559, 102290, 103210, 104385, 105511, 106001, 105535, 104518, 103644, 103002, 102016, 100398, 98597, 97039, 95443, 93422, 91382, 90128, 89692, 89209, 88003, 86266, 84508, 82872, 81384, 80449, 80544, 81465, 82316, 82425, 81967, 81553, 81371, 81082, 80492, 79989, 80092, 80802, 81612, 82127, 82372, 82544, 82715, 82908, 83265, 84031, 85407, 87368, 89502, 91084, 91641, 91522, 91620, 92387, 93366, 93862, 93824, 93799, 94160, 94655, 94751, 94269, 93629, 93482, 93995, 94527, 94185, 92711, 90677, 88738, 86963, 85035, 82798, 80411]
54258H0411k267j934j561j438j627j708j295p21o96j199j444j080p56j103j803
54243E9779k181k213k242k123j386k26M90L15k42n22n55p34j047j048n57J02O01
54226D6211J021J505J737J226P7r33j194r25o82n61k58L04Q20J087J152R96N85
54209E2168K32M27J090J485J148M64pk94o79r76p47j30J85j08m16P1J372K586
54191E7871K767J851O90J56L04N14L63K4k09l40m52l89m3K87J96k27n18n07n41
54172F1797q93j218r33JQ73R96M94J04K22M89M55K93M84J011J386J406J329J281
54154F9577J004L64l67r01j200j184o53J86O18K53m16o69m87l60n46r38j407j774
54136F1100j662q91Q0N98N53K77j47r34j901k289j511R6J431J492K61j145j447
$$ y = [80411, 78144, 76210, 74649, 73211, 71584, 69876, 68581, 67860, 67164, 65965, 64521, 63441, 62685, 61582, 59779, 57598, 55385, 53143, 51020, 49634, 49408, 49898, 50213, 49971, 49449, 48894, 48160, 47113, 46065, 45508, 45610, 46211, 47232, 48737, 50474, 51700, 51777, 50844, 49650, 48725, 48043, 47482, 47224, 47528, 48348, 49435, 50587, 51583, 52168, 52400, 52827, 53917, 55402, 56550, 57014, 57007, 56713, 56034, 55058, 54311, 54181, 54366, 54258, 53842, 53913, 55285, 57871, 60638, 62489, 63179, 63335, 63639, 64153, 64516, 64540, 64331, 63991, 63539, 63150, 63107, 63394, 63590, 63363, 62845, 62338, 61797, 60904, 59686, 58753, 58754, 59627, 60623, 61117, 61221, 61443, 61932, 62387, 62680, 63164, 64175, 65561, 66967, 68296, 69577, 70581, 70945, 70578, 69677, 68477, 67293, 66640, 66826, 67444, 67697, 67281, 66612, 66125, 65765, 65219, 64281, 62874, 61100, 59438, 58547, 58627, 59225, 59778, 60055, 59908, 58974, 57073, 54784, 53273, 53369, 54800, 56292, 56553, 55408, 53961]
54119E3961m66P14J082P51M49M14M19M42O05O13P7o77q74m60k54p36j328j280
54101E3452p03k78k41j51M02J146J270L25j063j666j043r4J31k84o35q76j440
54084D8252k045j892j057n44o60n10M14J268J171N09O3k48p67j055n78J42K45
54067D2708j3K33Q12P87K23J95Q68J009K8r03n74M44P11o1r35j244j081n96K19
54048D2830J012J204P68K97J25K5j26J1N82J031P56l9n34l21J41J76k87o76m64
54029D6511K60R29J106Q66N96N57O74O80L58k27o89o26q1M49O25O98J052J486
54011E5224J417Q00K95L13L81j44j068j627j562j335j184p03L87J534J909J441
53995E6078Q21N91P12J038J631K408K883K676K070J716J803J925J831J872K447
$$ y = [53961, 53495, 54209, 55291, 56042, 56491, 56905, 57324, 57766, 58371, 58984, 59061, 58384, 57510, 57050, 56796, 56060, 54732, 53452, 52749, 52471, 52230, 52079, 52481, 53627, 54897, 55222, 54159, 52493, 51450, 51356, 51487, 51203, 50568, 49692, 48252, 46207, 44315, 43258, 42714, 42054, 41544, 41958, 43226, 44397, 44906, 44969, 44721, 43954, 42899, 42321, 42463, 42708, 42695, 42928, 43740, 44527, 44750, 44945, 45813, 46822, 46850, 45947, 45373, 45817, 46528, 46467, 45532, 44288, 43207, 42611, 42830, 43842, 45046, 45814, 46111, 46236, 46261, 46135, 46146, 46728, 47759, 48515, 48476, 47942, 47621, 47762, 47938, 47651, 46975, 46511, 46771, 47700, 48806, 49672, 50268, 50825, 51499, 52179, 52537, 52310, 51621, 50995, 50914, 51363, 51988, 52686, 53738, 55224, 56641, 57441, 57736, 58049, 58430, 58286, 57218, 55591, 54029, 52694, 51510, 50807, 51194, 52728, 54637, 56078, 56899, 57490, 58202, 59240, 60871, 63279, 66162, 68838, 70908, 72624, 74427, 76352, 78183, 80055, 82502]
53980H2502L223L384K718K008K033K533K645K245K190K993L903L869L030K513
53966A21789K869L473L605L338L054K691K097J626J657J801J352M62O6N62J263
53951A51705J428J125O97j1j178k205k194j235m90q17j829k559k600k253j887
53936A35697j639j602j915k490k921k867k425k003j877j927j838j456q73k82J07
53921A09689P1m66j183j472r97r4N53N56J0p80j421j464p59J42L89j38o20l69
53903A01647K32L10k89q74r24o58m76l53r7J62J17j79l53k62k42n96j028q33K78
53884I5582J744K692K809K511K287K240K364K917M082N380N855N092L702K704
53870A41961K477K545K254J477O57K25J75K25K60L90O40Q47R78J245J746K223
$$ y = [82502, 85725, 89109, 91827, 93835, 95868, 98401, 101046, 103291, 105481, 108474, 112377, 116246, 119276, 121789, 124658, 128131, 131736, 135074, 138128, 140819, 142916, 144542, 146199, 148000, 149352, 149814, 149880, 150442, 151705, 153133, 154258, 154955, 154944, 153766, 151561, 149367, 148132, 147642, 146825, 144996, 142437, 139837, 137584, 135697, 134058, 132456, 130541, 128051, 125130, 122263, 119838, 117835, 115958, 114031, 112193, 110737, 109864, 109582, 109689, 109760, 109294, 108111, 106639, 105642, 105548, 106101, 106657, 106667, 105887, 104466, 103002, 102243, 102385, 102774, 102636, 102016, 101647, 101879, 102189, 101900, 101026, 100102, 99444, 98968, 98615, 98518, 98680, 98797, 98618, 98265, 98003, 97761, 97165, 96137, 95304, 95582, 97326, 100018, 102827, 105338, 107625, 109865, 112229, 115146, 119228, 124608, 130463, 135555, 139257, 141961, 144438, 146983, 149237, 150714, 151371, 151596, 151771, 151996, 152256, 152646, 153286, 154133, 155111, 156356, 158102, 160325]
53854A60325K496K831L518M286M622M502M317M154L750L154K832K989L275L325
53840B10376L052K288Q67p30j478j102o32j040j918k204j817j624k074k739l287
53825A95938l947m772n142m530l333k565k855l917m852m857l979l134l189l923
53811A40943m234l501k321j759k136k847l152k890k489k455k788k957k555j878
53797A02981j608j927k289k177j741j476j511j502j176p28n82q41j071p94r3M37
53781H3902M50J98Mj92m60m78m3L42J04l81k13O35J185R21M71N18P62N64l2m60
53761H7797m64k04R4K06q9o02p04q3P76J350J795K406K773K287J227N81P06R84
53743A00836Q29M85N27J116J995K886L617M048M085L786L405L297L540L669L152
$$ y = [160325, 162821, 165652, 169170, 173456, 178078, 182580, 186897, 191051, 194801, 197955, 200787, 203776, 207051, 210376, 213428, 215716, 216583, 215853, 214375, 213273, 212641, 211601, 209683, 207479, 205662, 204038, 201964, 199225, 195938, 191991, 187219, 182077, 177547, 174214, 171649, 168794, 164877, 160025, 155168, 151189, 148055, 144866, 140943, 136709, 133208, 130887, 129128, 126992, 124145, 120993, 118103, 115614, 113159, 110371, 107414, 104859, 102981, 101373, 99446, 97157, 94980, 93239, 91763, 90252, 88750, 87574, 86846, 86264, 85423, 84352, 83558, 83465, 83902, 84352, 84550, 84554, 84362, 83902, 83424, 83381, 83723, 83827, 83446, 83233, 83868, 85053, 85974, 86445, 86963, 87725, 88289, 88257, 87797, 87333, 87129, 87223, 87429, 87340, 86738, 86034, 85951, 86727, 88077, 89872, 92278, 95051, 97338, 98565, 99146, 99852, 100836, 101665, 102150, 102677, 103793, 105788, 108674, 112291, 116339, 120424, 124210, 127615, 130912, 134452, 138121, 141273]
53728A41273K241J839K131K086R27m56n33P24J835J853J275P73K88k04p4R37J886
53711A58801J719O60l35j066k040l184l655l116k297k017k193k284k162k135k305
53696A32391k437k350k141j958j821j683j557j457j349j240j267j522j822j802
53682A07985j336p32m43o04r79j236j161p53k73m8p0O0N65J027Q86K80l0L77J118
53663A04633J544J384P62lm65k81M06J043J298J240R85N94M61J132K446L353L111
53646A23643K191J569J521J667J774J802J479N96l43n40P5Q16J311J816K416K650
53630A44443K270J736J613J879K201K437K507K253J775J566J862K141J767Q89
53616A71339K21O5M1k18n24m81o6K82Q4o87j455j479n67O14J142O95k43r40j062
$$ y = [141273, 143514, 145353, 147484, 149570, 150497, 150041, 149508, 150232, 152067, 153920, 155195, 155968, 156256, 156052, 155978, 156915, 158801, 160520, 161180, 160845, 159779, 157739, 154555, 150900, 147784, 145487, 143470, 141277, 138993, 136831, 134696, 132391, 129954, 127604, 125463, 123505, 121684, 120001, 118444, 116987, 115638, 114398, 113131, 111609, 109787, 107985, 106649, 105917, 105474, 104870, 103891, 102655, 101494, 100741, 100468, 100420, 100350, 100410, 100975, 102002, 102888, 103168, 103138, 103515, 104633, 106177, 107561, 108323, 108320, 107855, 107574, 107980, 109023, 110321, 111561, 112546, 113140, 113601, 114733, 117179, 120532, 123643, 125834, 127403, 128924, 130591, 132365, 134167, 135646, 136242, 135899, 135359, 135434, 136250, 137561, 139377, 141793, 144443, 146713, 148449, 150062, 151941, 154142, 156579, 159086, 161339, 163114, 164680, 166542, 168683, 170450, 171339, 171560, 171625, 171666, 171448, 170924, 170443, 170377, 170659, 170743, 170056, 168601, 167122, 166555, 167169, 168311, 169006, 168763, 167823, 166761]
53597A66761p89n09m18m10l02j26k2M5K23M29M02J80J70M96O39J28p10j103p61
53578A64323l5P14J332J567J105J86l71m1P37J068O79K08N01J684K981L409K739
53561A82786J707J162J181J310J446J942K864L703M042M024L856L368K507J814
53547B17712J828K256K405K277K607L666M754N112M838M477M155L627L016K851
53533B65581L262L686L624L376L546M024M046L393K849L046L323K556Q93j92J06
53518C07119Q52P39j28o58m27l9k3k53m73o19n06RN10L89j73l61k4J14j42N4J050
53497C07010J684Q83n03p33L86J383J349R82J212J892K269J999J241L46j31K52
53481C21521J206J932K145K318K659K688K209J956K587L682M402M698N084N641
$$ y = [166761, 165972, 165463, 165045, 164635, 164333, 164207, 164185, 164230, 164453, 164882, 165284, 165464, 165634, 166130, 166769, 166897, 166187, 165084, 164323, 164288, 165002, 166334, 167901, 169006, 169192, 168821, 168780, 169517, 170585, 171264, 171472, 171973, 173657, 176638, 180047, 182786, 184493, 185655, 186836, 188146, 189592, 191534, 194398, 198101, 202143, 206167, 210023, 213391, 215898, 217712, 219540, 221796, 224201, 226478, 229085, 232751, 237505, 242617, 247455, 251932, 256087, 259714, 262730, 265581, 268843, 272529, 276153, 279529, 283075, 287099, 291145, 294538, 297387, 300433, 303756, 306312, 307205, 307013, 307119, 307971, 308710, 308582, 307924, 307497, 307458, 307435, 307182, 306709, 306090, 305584, 305593, 306103, 306492, 306319, 305958, 305934, 306048, 305906, 305960, 307010, 308694, 309577, 309074, 308341, 308727, 310110, 311459, 312441, 313653, 315545, 317814, 319813, 321054, 321400, 321269, 321521, 322727, 324659, 326804, 329122, 331781, 334469, 336678, 338634, 341221, 344903, 349305, 354003, 359087, 364728]
53467C64728O060O423P114Q013Q531Q509Q445Q750R272R720J0080J0583J1487
53454D77715J2868J4311J5057J4882J4591J5048J6003J6582J6753J7324J8481
53443F49615J9358J9378J9108J9333K0106K1188K2591K4046K4594K3678K2136
53432H85131K1290K1317K1376K1068K0848K1014K1197K1025K0665K0408K0305
53421A115644K0421K0935K1662K1913K1106J9408J7560J6309J6011J6471J6959
53410A324399J6684J5494J3963J2690J1666J0488Q913P091N351L891K565R96r79
53397A433212l016m622n805o988q325r470j0206j0909j2067j3620j5100j6229
53385A316855j7086j7762j8171j8250j8129j8012j7928j7665j7127j6666j6848
$$ y = [364728, 370788, 377211, 384325, 392338, 400869, 409378, 417823, 426573, 435845, 445565, 455645, 466228, 477715, 490583, 504894, 519951, 534833, 549424, 564472, 580475, 597057, 613810, 631134, 649615, 668973, 688351, 707459, 726792, 746898, 768086, 790677, 814723, 839317, 862995, 885131, 906421, 927738, 949114, 970182, 991030, 1012044, 1033241, 1054266, 1074931, 1095339, 1115644, 1136065, 1157000, 1178662, 1200575, 1221681, 1241089, 1258649, 1274958, 1290969, 1307440, 1324399, 1341083, 1356577, 1370540, 1383230, 1394896, 1405384, 1414297, 1421388, 1426739, 1430630, 1433195, 1434191, 1433212, 1430196, 1425574, 1419769, 1412781, 1404456, 1394986, 1384780, 1373871, 1361804, 1348184, 1333084, 1316855, 1299769, 1282007, 1263836, 1245586, 1227457, 1209445, 1191517, 1173852, 1156725, 1140059, 1123211]
53374A123211j7617j8077j7446j6114j5055j4360j3128j1037r066q123p661o486
53362I69041m511k718j653r45k79J72N85J775M123O819Q811J0032J1128J2435
53348A014815J3848J5412J7206J8760J9356J9170J9389K0848K3051K4935K6209
53337A232999K7388K8839L0410L1957L3597L5247L6471L7120L7763L9056M0889
53326A611736M2553M3630M4324M4966M5554M5902M5919M5611M5087M4588M4289
53315B104159M3947M3068M1464L9420L7167L4664L1985K9461K7041K3988J9793
53304B476157J5131J1262Q577O290L560K54l444p546j1987j6345k0225k3667k6883
53291B411134k9812l2213l4055l5525l6881l8486m0660m3174m5151m5842m5364
$$ y = [1123211, 1105594, 1087517, 1070071, 1053957, 1038902, 1024542, 1011414, 1000377, 991311, 983188, 975527, 969041, 964530, 961812, 960159, 959214, 958935, 959107, 959692, 961467, 965590, 972409, 981220, 991252, 1002380, 1014815, 1028663, 1044075, 1061281, 1080041, 1099397, 1118567, 1137956, 1158804, 1181855, 1206790, 1232999, 1260387, 1289226, 1319636, 1351593, 1385190, 1420437, 1456908, 1494028, 1531791, 1570847, 1611736, 1654289, 1697919, 1742243, 1787209, 1832763, 1878665, 1924584, 1970195, 2015282, 2059870, 2104159, 2148106, 2191174, 2232638, 2272058, 2309225, 2343889, 2375874, 2405335, 2432376, 2456364, 2476157, 2491288, 2502550, 2511127, 2517417, 2520977, 2521231, 2517787, 2510241, 2498254, 2481909, 2461684, 2438017, 2411134, 2381322, 2349109, 2315054, 2279529, 2242648, 2204162, 2163502, 2120328, 2075177, 2029335, 1983971]
53280A983971m4384m3274m2052m0988m0581m0772m0733l9819l8387l7323l6945
53269A538713l6694l5844l4226l2209l0213k8328k6379k4262k2189k0481j9202
53258A228686j8124j7110j6233j5464j4515j3216j1895j1010j0498r822q622p063
53246A075114n497m148l158k602k249j617m68R07K082K992L780M482N077N726
53232A080421O664P958R638J1789J4168J5960J6556J6458J6831J8044J9243J9636
53220A253366J9532J9702K0200K0377J9865J8965J8099J7247J6077J4377J2357
53209A450164J0539R167P778N672K987P75l40j070k482m477o064o876p650r072
53195A449051j0959j2806j4531j6290j8039j9583k0800k1622k2076k2466k3088
$$ y = [1983971, 1939587, 1896313, 1854261, 1813273, 1772692, 1731920, 1691187, 1651368, 1612981, 1575658, 1538713, 1502019, 1466175, 1431949, 1399740, 1369527, 1341199, 1314820, 1290558, 1268369, 1247888, 1228686, 1210562, 1193452, 1177219, 1161755, 1147240, 1134024, 1122129, 1111119, 1100621, 1090799, 1082177, 1075114, 1069617, 1065469, 1062311, 1059709, 1057460, 1055843, 1055375, 1056282, 1058364, 1061356, 1065136, 1069618, 1074695, 1080421, 1087085, 1095043, 1104681, 1116470, 1130638, 1146598, 1163154, 1179612, 1196443, 1214487, 1233730, 1253366, 1272898, 1292600, 1312800, 1333177, 1353042, 1372007, 1390106, 1407353, 1423430, 1437807, 1450164, 1460703, 1469870, 1477648, 1483320, 1486307, 1487082, 1486742, 1485672, 1483190, 1478713, 1472649, 1465773, 1458123, 1449051, 1438092, 1425286, 1410755, 1394465, 1376426, 1356843, 1336043, 1314421, 1292345, 1269879, 1246791]
53184A246791k3691k3703k3209k3035k3563k4103k3927k3348k3061k2873k2029
53173I90249k0582j9468j9121j8851j7986j6878j6273j6206j6096j5653j5141
53162G97994j4782j4403j3747j2753j1521j0240r256q900r098r345r245q844q452
53149F57408q246q356q966r995j0826j0890j0441j0252j0408j0067q725p179o633
53136E36424p240q141q738r166r565r660r283q738q368q230q365q930r743j0177
53122D12080r845r089q465q124p919p782p612p191o594o330o605o822o309n400
53108C07993n001n300n470m865l878l364l646m326m876n118n185n185n014m527
53094B42238l853l358l228l275l272l176k920k347j639j399j901k595k792k557
$$ y = [1246791, 1223100, 1199397, 1176188, 1153153, 1129590, 1105487, 1081560, 1058212, 1035151, 1012278, 990249, 969667, 950199, 931078, 912227, 894241, 877363, 861090, 844884, 828788, 813135, 797994, 783212, 768809, 755062, 742309, 730788, 720548, 711292, 702392, 693294, 683949, 674704, 665860, 657408, 649162, 640806, 631840, 621845, 611019, 600129, 589688, 579436, 569028, 558961, 550236, 543057, 536424, 529184, 521043, 512305, 503139, 493574, 483914, 474631, 465893, 457525, 449295, 440930, 432000, 422257, 412080, 402235, 393146, 384681, 376557, 368638, 360856, 353244, 346053, 339459, 333129, 326524, 319702, 313393, 307993, 302992, 297692, 292222, 287357, 283479, 280115, 276469, 272143, 267267, 262149, 256964, 251779, 246765, 242238, 238385, 235027, 231799, 228524, 225252, 222076, 219156, 216809, 215170, 213771, 211870, 209275, 206483, 203926]
53080B03926k403k368k066j479j011q27p35p10q81r97p13m05q63j942k443j764
53064A82319q50q42j572k084k065j858j542r36l33l00p83j190j376j711k130k080
53048A60667j630j665k478k971k113n34K31k09q07p45l79k90m10n29r33j732k142
53031A41331j359J21R32O00M4J11M66L94K9N7N71R60Q77P04Q85J250J276Q12L99
53012A50460P26J773K630K383J196R4l10m06p00j016j042j073j481j910j818j551
52996A47955j864k542k556j762j261j701k206j771q57o92j490k347k662k725k815
52981A18704k580j698o03j16n24j362j969k074j797j381j001q10r06j193j453
52966I9237j595j648j395m84Q51J579R77k99r80p89n51p56r68p92m89k68J34O96
$$ y = [203926, 201523, 199155, 197089, 195610, 194599, 193772, 193037, 192327, 191446, 190449, 189736, 189331, 188468, 186526, 184083, 182319, 181469, 180627, 179055, 176971, 174906, 173048, 171506, 170570, 170237, 169937, 169154, 167964, 166588, 164877, 162747, 160667, 159037, 157372, 154894, 151923, 149810, 149276, 149507, 149298, 148491, 147746, 147367, 147077, 146667, 146138, 145205, 143473, 141331, 139972, 140093, 141025, 141625, 141669, 141780, 142246, 142640, 142669, 142726, 143297, 144257, 145134, 145838, 146723, 147973, 149249, 150061, 150460, 151186, 152959, 155589, 157972, 159168, 159262, 158952, 158546, 157846, 156830, 155788, 154715, 153234, 151324, 149506, 147955, 146091, 143549, 140993, 139231, 137970, 136269, 134063, 132292, 131435, 130743, 129253, 126906, 124244, 121519, 118704, 116124, 114426, 113823, 113707, 113183, 111821, 109852, 107778, 105981, 104600, 103599, 102789, 101883, 100690, 99237, 97642, 95994, 94599, 94115, 94966, 96545, 97522, 97223, 96243, 95454, 94903, 94147, 93179, 92387, 91898, 91630, 91764, 92460]
52948I2460P34q9j097j566j608j449o94Q16K042J883Q07K07M28O55N43O58J157
52931I5887J345R16N08N05K91o08j537j568q28j99j33m07p25r40q98n53j51P6
52913I0981K23M89Q15J033J144J182J052P64N71N73M77Q1k54o3N41R66R24O80
52895A02179N35M14N5m89p15j27J130K246K593K430K373K362J778N96l18l27J91
52878A16906O12R31J415J958K362K779L202L044J972P59M95J154J780J843J619
52863A42831J361J085J086J655K221J792M91m03k72K3l34p67l36O98J245Q93Q3
52846A53352q29j814k621k815k393j790j302j005j044j399j491p28N58J364J213
52831A37256N19k20r29j560j856j802j679j497q50L22J360J631J241P32M34M08
$$ y = [92460, 93194, 93105, 92008, 90442, 88834, 87385, 86691, 87507, 89549, 91432, 92239, 92446, 92874, 93529, 94072, 94730, 95887, 97232, 98148, 98656, 99161, 99452, 98844, 97307, 95739, 94911, 94712, 94579, 94172, 93447, 92507, 91609, 91056, 90905, 90981, 91204, 91693, 92508, 93541, 94685, 95867, 96919, 97683, 98254, 98827, 99304, 99385, 99131, 99068, 99609, 100575, 101499, 102179, 102714, 103128, 103183, 102694, 101979, 101852, 102982, 105228, 107821, 110251, 112624, 114986, 116764, 117360, 117042, 116715, 116906, 117518, 118449, 119864, 121822, 124184, 126963, 130165, 133209, 135181, 135940, 136435, 137589, 139369, 141212, 142831, 144192, 145277, 146363, 148018, 150239, 152031, 152522, 152119, 151847, 151870, 151536, 150769, 150433, 151131, 152376, 153269, 153352, 152523, 150709, 148088, 145273, 142880, 141090, 139788, 138783, 137739, 136340, 134849, 134121, 134679, 136043, 137256, 137775, 137555, 136626, 135066, 133210, 131408, 129729, 128232, 127382, 127704, 129064, 130695, 131936, 132668, 133102, 133510]
52815A33510O38Q56O30j01p34p18j96K88M50K63k46q43j002n63j40l32q23q42
52797A30095l57l5j26q5N10J318J769J759J556J335J131R65Q18N95L19J81L52
52780A42100Q14J393J779J619Q58n7n78o64p32j062j550j939j995j538p24j25
52764A37599j23l35j99J09k8n50p66m94k92l95l49l0l1n00o07J76J124J404J378
52745A37091J823K457K412J680R83N51J25r1L03P38O2j713l209l469k935k316
52729A34492j638q96o67j269k067k305k092j903j675j189q18j131j943k480k392
52714A10027j986j644j481j524j692j685j324r11q20q89p02l73m51j022j481j302
52698I0740o63r7O6k26q90j617j962j757j355j207j312j295r86p04q65j449j908
$$ y = [133510, 134148, 135004, 135634, 135533, 134799, 134081, 133885, 134173, 134623, 134886, 134640, 133797, 132795, 132232, 132092, 131760, 130937, 130095, 129738, 129703, 129577, 129492, 130002, 131320, 133089, 134848, 136404, 137739, 138870, 139835, 140653, 141248, 141567, 141748, 142100, 142914, 144307, 146086, 147705, 148563, 148506, 147928, 147264, 146532, 145470, 143920, 141981, 139986, 138448, 137724, 137599, 137476, 137141, 136942, 137051, 137023, 136473, 135707, 135213, 134921, 134526, 134177, 134147, 134116, 133616, 133009, 133185, 134309, 135713, 137091, 138914, 141371, 143783, 145463, 146446, 146997, 147122, 147031, 147334, 148072, 148134, 146421, 143212, 139743, 136808, 134492, 132854, 131958, 131291, 130022, 127955, 125650, 123558, 121655, 119980, 118791, 117973, 116842, 114899, 112419, 110027, 108041, 106397, 104916, 103392, 101700, 100015, 98691, 97780, 96960, 96071, 95369, 94996, 94545, 93523, 92042, 90740, 90077, 89980, 90046, 89820, 88930, 87313, 85351, 83594, 82239, 81032, 79720, 78425, 77439, 76735, 75870, 74421, 72513]
52681G2513j732r97l10j86n86j100j481j791k064k067j564p19m6J25J0K7K28L33
52663E8593K52K81N34O28K38k98m37k83l87p77q68m64j44l59p68q75p72p16m85
52644E2893J59P87Q53O44Q24J230J016J14m64r0N91P26M25K55J60k43p10o37q8
52625E8445K91L62O01J004Q15k33j220j195m36J82N22J038J606J544Q80N42J022
52608F5770J620J552J103J032J347J472J311J353J719J862J349M49k92o22n57
52593H0468j45M77J027J251J100P18M16N56J184J762J606O60m40j087j231j185
52577H7137j218j444j777j968j863j661j667j809j764j463j082o29l9L24m3q80
52561F8154j217o79l5r1o20r42r95j108j122n84L75J084J224J079Q60M01l96j173
$$ y = [72513, 70781, 69784, 69474, 69288, 68702, 67602, 66121, 64330, 62266, 60199, 58635, 57916, 57870, 57995, 58005, 58032, 58260, 58593, 58845, 59126, 59660, 60288, 60526, 60228, 59791, 59508, 59121, 58344, 57476, 57012, 56868, 56509, 55741, 54866, 54094, 53378, 52893, 53052, 53839, 54692, 55336, 56160, 57390, 58406, 58520, 58056, 57966, 58557, 59283, 59708, 59963, 60123, 59880, 59170, 58533, 58445, 58736, 59098, 59699, 60703, 61518, 61285, 60065, 58870, 58434, 58616, 59138, 60176, 61782, 63326, 64206, 64748, 65770, 67390, 68942, 70045, 71077, 72424, 73896, 75207, 76560, 78279, 80141, 81490, 81939, 81647, 81025, 80468, 80323, 80800, 81827, 83078, 84178, 84896, 85312, 85868, 87052, 88814, 90420, 91080, 90640, 89553, 88322, 87137, 85919, 84475, 82698, 80730, 78867, 77206, 75539, 73730, 71966, 70503, 69421, 68792, 68753, 69077, 69034, 68154, 66937, 66258, 66223, 66132, 65512, 64570, 63575, 62467, 61345, 60761, 61136, 62220, 63444, 64523, 65383, 65784, 65388, 64215]
52543F4215j446j030j61O11P50K73j91j16K97O08R41J660K423K335J259K42K46
52526G2916R55J308R05L28J73L04J86k43m03K09J279J861J404L58l43k46L33Q12
52508H2096Q81O89O82J165J861K095J596Q56L91O0m16n82K59J754K548J900N99
52491I8434j27o2J17K1o1J92O06P33L81j69l62J23R75J444J130M97L96J077J861
52472A07206J867R90M9j05N19J118J011K12p77j483j568q84K42J016R27L35J4
52455A10689J67L67L32K61L63M60K90j25n53p78p20m79k72k28k56l41o27r96q87
52436A06667p7P03N72k44p90q41r90j261p72O73J843J626N99P4K41K96K6J20Q64
52417A09329J575J580J107P83P73P88O15L30Q5n9r7qK76P75J344J791K035K029
$$ y = [64215, 62769, 61739, 61578, 62189, 62939, 63212, 63021, 62905, 63202, 63810, 64751, 66411, 68834, 71169, 72428, 72670, 72916, 73871, 75179, 76084, 76412, 76585, 76889, 77075, 76832, 76429, 76638, 77917, 79778, 81182, 81540, 81197, 80951, 81284, 82096, 82977, 83666, 84348, 85513, 87374, 89469, 91065, 91921, 92312, 92372, 91956, 91374, 91633, 93387, 95935, 97835, 98434, 98307, 98245, 98362, 98383, 98322, 98514, 99120, 99853, 100234, 100065, 99703, 99826, 100801, 102245, 103375, 103872, 104268, 105345, 107206, 109073, 110063, 110112, 110007, 110526, 111644, 112655, 112867, 112090, 110607, 109039, 108155, 108397, 109413, 110340, 110675, 110689, 110856, 111223, 111555, 111816, 112179, 112639, 112929, 112804, 112251, 111473, 110753, 110274, 110002, 109774, 109518, 109177, 108550, 107554, 106667, 106590, 107293, 107865, 107621, 106831, 105990, 105000, 103739, 102967, 103640, 105483, 107109, 107708, 107782, 108023, 108319, 108345, 108465, 109329, 110904, 112484, 113591, 114374, 115147, 115935, 116550, 116880, 116965, 116906, 116809, 116801, 117077, 117852, 119196, 120987, 123022, 125051]
52399A25051J549M69p55j282q48j24J27r2l32m32m81m13j54K8j48m73n31l50k25
52380A20584j25K10O99R74R65Q39N30j20q09j046r53j070j273p96M18J202O12
52363A20841p20j292n61N87R31J26j102j611q38N95J396R90P7l39j44J03J48K52
52345A19439N35P47P89R25J279J539J395J023Q54J041J367J573J535J235P32K22
52329A36230o0q1n6k21n41p80p73n44j70L55R26J210R07J76l81k65M33J108J176
52310A38649O33J29L74J324K109K034J493J492K281L019K965K451K230K307K044
52295A65534J280P10R61J801K521K811K874K936K916K634K140J717J643J956K430
52280A96864K744K672K137J289O02O78J614K662K867K142J370J301J713J979K061
$$ y = [125051, 126600, 127069, 126314, 125032, 124184, 124060, 124187, 124095, 123763, 123331, 122850, 122437, 122283, 122311, 122163, 121690, 121159, 120809, 120584, 120459, 120669, 121368, 122342, 123307, 124146, 124676, 124556, 123747, 122701, 121748, 120678, 119405, 118609, 119027, 120229, 120841, 120121, 118829, 118268, 118855, 119786, 119912, 118810, 117199, 116361, 116956, 118352, 119342, 119419, 119080, 118936, 119039, 119187, 119439, 119974, 120721, 121510, 122435, 123714, 125253, 126648, 127671, 128525, 129566, 130933, 132506, 134041, 135276, 136008, 136230, 136170, 136089, 136033, 135812, 135271, 134491, 133718, 133174, 133004, 133359, 134285, 135495, 136402, 136578, 136197, 135932, 136365, 137473, 138649, 139282, 139411, 139785, 141109, 143218, 145252, 146745, 148237, 150518, 153537, 156502, 158953, 161183, 163490, 165534, 166814, 167524, 168485, 170286, 172807, 175618, 178492, 181428, 184344, 186978, 189118, 190835, 192478, 194434, 196864, 199608, 202280, 204417, 205706, 206308, 206986, 208600, 211262, 214129, 216271, 217641, 218942, 220655, 222634, 224695]
52265B24695K441L183L755L827L770M033M465M662M680M947N536N992N956N660
52251B87602N663O316P498Q698R298R089Q567Q473Q943R386R374R287R752J0716
52237D08662J1525J1876J2141J2672J3213J3293J2928J2514J2249J2024J1834
52226E44931J1850J1955J1608J0550R339Q749Q743Q498P582O506N836N277M154
52213F55578K530J244Q04Q51P74L97p4m07m34j48N8k44p49n57N36J453J209L86
52195F63207M03J505K468K430K012K246L174M192N182O411P575P896P276O673
52181G22650O940P832Q532Q732Q730Q697Q409P757P005O345N554M349K859J534
52167H15925O49J64j04l81q73j569k220k771l660n278p157q240q070p310o885
$$ y = [224695, 227136, 230319, 234074, 237901, 241671, 245704, 250169, 254831, 259511, 264458, 269994, 275986, 281942, 287602, 293265, 299581, 307079, 315777, 325075, 334164, 342731, 351204, 360147, 369533, 378907, 388194, 397946, 408662, 420187, 432063, 444204, 456876, 470089, 483382, 496310, 508824, 521073, 533097, 544931, 556781, 568736, 580344, 590894, 600233, 608982, 617725, 626223, 633805, 640311, 646147, 651424, 655578, 658108, 659352, 660156, 661007, 661781, 662178, 662104, 661697, 661263, 661115, 661173, 660929, 660180, 659623, 660159, 661612, 662821, 663207, 663610, 665115, 667583, 670013, 672025, 674271, 677445, 681637, 686819, 693230, 700805, 708701, 715977, 722650, 729590, 737422, 745954, 754686, 763416, 772113, 780522, 788279, 795284, 801629, 807183, 811532, 814391, 815925, 816574, 816738, 816634, 816253, 815380, 813811, 811591, 808820, 805160, 799882, 792725, 784485, 776415, 769105, 762220]
52152G62220o980p131p039o868o917p221p453p144o226n330n203n738o046n603
52138F71321m854m407m218l962l631l259k619j796j532k181k844k481j486j018
52124F31033j086o73K65M43o61j797j755j047q56j228j405j262j257j401j348
52109F15965j270j640k267k416j931j448j478j915k426k703k448j745j338j826
52095E89114k645k704j965j512j964k737l107l088k884k375j664j365j683j893
52081E57528j403p54p66j232j326r65q25j144j437j381j202j009n57J05M14J04
52065E44150k84j54L40O34O14O69J046J551J854J886J889K189K881L686M294M830
52049E72075N743P092Q337R003R261R599J0164J0801J1488J2302J3084J3591J3935
$$ y = [762220, 755240, 748109, 741070, 734202, 727285, 720064, 712611, 705467, 699241, 693911, 688708, 682970, 676924, 671321, 666467, 662060, 657842, 653880, 650249, 646990, 644371, 642575, 641043, 638862, 636018, 633537, 632051, 631033, 629947, 629274, 629539, 629982, 629321, 627524, 625769, 624722, 623866, 622638, 621233, 619971, 618714, 617313, 615965, 614695, 613055, 610788, 608372, 606441, 604993, 603515, 601600, 599174, 596471, 594023, 592278, 590940, 589114, 586469, 583765, 581800, 580288, 578324, 575587, 572480, 569392, 566508, 564133, 562469, 561104, 559421, 557528, 556125, 555371, 554605, 553373, 552047, 551082, 550257, 549113, 547676, 546295, 545093, 544084, 543527, 543632, 544046, 544150, 543866, 543712, 544052, 544686, 545300, 545969, 547015, 548566, 550420, 552306, 554195, 556384, 559265, 562951, 567245, 572075, 577818, 584910, 593247, 602250, 611511, 621110, 631274, 642075, 653563, 665865, 678949, 692540, 706475]
52036G06475J4444J5060J5274J4801J3984J3400J3295J3473J3481J2901J1691
52025H58279J0335R362Q668P661O132M504L135J892P01n8k26m87j603l229m248
52010I00818m235l994m424n442o312o641o617o529o341n830m927l893l104k661
51996H29868k307j790j154m99K42J052J632J889K352L528N023N950O143O206O317
51981H64452N888M723L627L279L252K828K175J838J578P46m35j025q84j020k139
51966H88883l613m409m456m573n450p100r069j0713j1463j1265j0759j0719j1336
51953G83958j2154j2672j2766j2609j2464j2582j3133j4006j4757j4918j4443
51942F37454j3851j3731j4160j4686j4868j4690j4380j4068j3812j3746j3921
$$ y = [706475, 720919, 735979, 751253, 766054, 780038, 793438, 806733, 820206, 833687, 846588, 858279, 868614, 877976, 886644, 894305, 900437, 904941, 908076, 909968, 910669, 910611, 910385, 909898, 908295, 905066, 900818, 896583, 892589, 888165, 882723, 876411, 869770, 863153, 856624, 850283, 844453, 839526, 835633, 832529, 829868, 827561, 825771, 824617, 824118, 824360, 825412, 827044, 828933, 831285, 834813, 839836, 845786, 851929, 858135, 864452, 870340, 875063, 878690, 881969, 885221, 888049, 890224, 892062, 893640, 894386, 893951, 892926, 892042, 891022, 888883, 885270, 880861, 876405, 871832, 866382, 859282, 850213, 839500, 828037, 816772, 806013, 795294, 783958, 771804, 759132, 746366, 733757, 721293, 708711, 695578, 681572, 666815, 651897, 637454, 623603, 609872, 595712, 581026, 566158, 551468, 537088, 523020, 509208, 495462, 481541]
51931D81541j4102j3984j3528j2908j2215j1505j1001j0959j1242j1352j0958
51920C47787j0197r484r104r044r016q667p889o874n801m704l765l477m071n014
51906B50680n476n217m621m015l499l252l381l462k931k034j694k204k803k806
51892B03285k456k240k050j657j399j685k182k297k158k388l009l308k846j987
51878A71623j372j266j545j949k277k514k764k918k632j905j349j406j656j424
51864A44646p94l69k25K9K90j4q11j123l86P18J113N46m70j392j897j832j379
51847A36650j002r33r48q77q85j035j039q12p12q76q01k01L14P8n38p09n12o88
51829A24474j186j027Q3J058Q57q4n41j01O43J180J551J725J237j29j665k264
$$ y = [481541, 467439, 453455, 439927, 427019, 414804, 403299, 392298, 381339, 370097, 358745, 347787, 337590, 328106, 319002, 309958, 300942, 292275, 284386, 277512, 271711, 267007, 263242, 259765, 255694, 250680, 245204, 239987, 235366, 231351, 227852, 224600, 221219, 217757, 214826, 212792, 211098, 208894, 206091, 203285, 200829, 198589, 196539, 194882, 193483, 191798, 189616, 187319, 185161, 182773, 179764, 176456, 173610, 171623, 170251, 168985, 167440, 165491, 163214, 160700, 157936, 155018, 152386, 150481, 149132, 147726, 146070, 144646, 143852, 143483, 143258, 143287, 143577, 143563, 142752, 141629, 141243, 141961, 143074, 143620, 143150, 141758, 139861, 138029, 136650, 135648, 134715, 133767, 132890, 132005, 130970, 129931, 129119, 128407, 127531, 126730, 126529, 126843, 126921, 126383, 125674, 125162, 124474, 123288, 122261, 122344, 123402, 124259, 124175, 123634, 123533, 124176, 125356, 126907, 128632, 129869, 129740, 128075, 125811]
51813A25811j590m39J95J43o2j43m13j024j408r26K06J176J613J884K273K469
51797A29765K092J305O50M71Q12J525K216K289J445N2j227k038k338k040j065
51782A33914K48J265J657J632J482J182O15k6m14m46k64R3P28J531K051J908J261
51765A48417P26P37J093J177O14k93q62p70m53n86j190j499q69M24J498J804J373
51748A51341L77r66j976j790m27Q79R77J30m59k23K87L62k8m21l42M20J579K285
51730A52005J843O03k98k14M08Q59R79R64R05R22J234J711J783J294Q93J113J475
51713A68479J197M09n2J26N46J037J882L028L839L877L381K708J959J381J473
51698A95270K187K665K287J626J741K794L983M705N048N111M551L166J531M99
$$ y = [125811, 124221, 123782, 123977, 124120, 124058, 123915, 123502, 122478, 121070, 120144, 120350, 121526, 123139, 125023, 127296, 129765, 131857, 133162, 133812, 134283, 135095, 136620, 138836, 141125, 142570, 142622, 141395, 139357, 137019, 134979, 133914, 134162, 135427, 137084, 138716, 140198, 141380, 141995, 141969, 141555, 141109, 140845, 140938, 141666, 143197, 145248, 147156, 148417, 149143, 149880, 150973, 152150, 152764, 152471, 151609, 150839, 150386, 149800, 148610, 147111, 146242, 146666, 148164, 149968, 151341, 151718, 150752, 148776, 146986, 146559, 147438, 148415, 148545, 148086, 147863, 148150, 148512, 148484, 148063, 147721, 148141, 149720, 152005, 153848, 154451, 154153, 153939, 154347, 155206, 156185, 157149, 158054, 158976, 160210, 161921, 163704, 164998, 165891, 167004, 168479, 169676, 170085, 170033, 170159, 170705, 171742, 173624, 176652, 180491, 184368, 187749, 190457, 192416, 193797, 195270, 197457, 200122, 202409, 204035, 205776, 208570, 212553, 217258, 222306, 227417, 231968, 235134, 236665, 237164]
51684B37164K52K09j50p07j005q53m60j35j01m43r63j181p77q2K21o7m89o61p36
51665B29036q84q16k97K20J34l94o72n41n48r69j352j246p97l77r1Q6M1k44n55
51646B19734p42q75r16o39j38M0l84r24r04k62N89J330J758J628R72L89N10J240
51628B22406J986K415K600K610K461K424K791L400L791L803L534K794J269o93
51614B57591k098k410k165k142k411k588k674l036l666m039l772l123k651k601
51600B18215k765k841k761k655k611k616k681k872l086k978k294j292o10o21j034
51585A84498j322j395j634k207k602k127q87J24J31m50n94j6N78N84K21j26n88
51568A72188j356j987j862j146o64q52j396j865k142k155j696p46L98J373J927
$$ y = [237164, 237416, 237625, 237475, 236768, 235763, 234910, 234450, 234315, 234214, 233771, 232808, 231627, 230850, 230768, 230989, 230922, 230433, 229772, 229036, 228152, 227336, 227039, 227259, 227393, 226999, 226327, 225786, 225238, 224269, 222917, 221671, 220874, 220497, 220406, 220492, 220533, 220289, 219734, 218992, 218117, 217201, 216562, 216424, 216464, 216080, 215156, 214252, 213990, 214579, 215909, 217667, 219295, 220267, 220656, 221166, 222406, 224392, 226807, 229407, 232017, 234478, 236902, 239693, 243093, 246884, 250687, 254221, 257015, 258284, 257591, 255493, 253083, 250918, 248776, 246365, 243777, 241103, 238067, 234401, 230362, 226590, 223467, 220816, 218215, 215450, 212609, 209848, 207193, 204582, 201966, 199285, 196413, 193327, 190349, 188055, 186763, 186153, 185532, 184498, 183176, 181781, 180147, 177940, 175338, 173211, 172324, 172448, 172579, 172129, 171535, 171519, 172097, 172681, 172902, 172776, 172188, 170832, 168845, 166983, 165837, 165173, 164321, 162925, 161060, 158918, 156763, 155067, 154321, 154719, 156092, 158019]
51553A58019J839J108K63j5K86N30L91K84O13J144J511J890K599L272L099J907
51537A78740N58J01P70J902K665K743K434K208K216K284K251K161K075J884J425
51522B06417P04r4p35j088j188j176j105r22p11p58j189j658j731j407r95o14
51506A91750j80K25N28J042K101L270L654L098K394K109J927J516J220J364J493
51491B17511J060L74J08K63K72m0l37l76j12N15J291J470O10n43p84k6P33R53
51473B22942J194J971K871L157K663J667N03m08o77m67m63r78j554j688j464j159
51457B28110q01n08o79j334j792j614j383j846k651k736j822p20j40M9K76N44
51441B10953O10M41K17J03J70L00K27r0k43J45P57Q60L43j02R5O85J097J149R90
$$ y = [158019, 159858, 160966, 161229, 161214, 161500, 162030, 162421, 162705, 163318, 164462, 165973, 167863, 170462, 173734, 176833, 178740, 179298, 179399, 180169, 182071, 184736, 187479, 189913, 192121, 194337, 196621, 198872, 201033, 203108, 204992, 206417, 207121, 207027, 206292, 205204, 204016, 202840, 201735, 200813, 200102, 199344, 198155, 196497, 194766, 193359, 192364, 191750, 191570, 191795, 192323, 193365, 195466, 198736, 202390, 205488, 207882, 209991, 211918, 213434, 214654, 216018, 217511, 218571, 218945, 219053, 219316, 219588, 219548, 219211, 218835, 218723, 219238, 220529, 221999, 222609, 222066, 221282, 221256, 221989, 222942, 224136, 226107, 228978, 232135, 234798, 236465, 236968, 236560, 235883, 235416, 234953, 233975, 232421, 230733, 229269, 228110, 227309, 226801, 226122, 224788, 222996, 221382, 219999, 218153, 215502, 212766, 210944, 210224, 210084, 210133, 210409, 210953, 211563, 212004, 212221, 212324, 212494, 212794, 213021, 212931, 212688, 212833, 213590, 214450, 214793, 214691, 214786, 215471, 216568, 217717, 218707]
51422B18707P25N42Q54J822K895L358L229L171L495L824L830L759L862L815L205
51407B61093K364K056K348K429J778R58Q02J184J259P08Q9j47k25l82k70M02J043
51390B77489Q11j75r33r92q60r65q79j46O78N57o59k042k738k775k610k490k454
51373B58817k622l042l460l570l369l036k530j717q76o82j356k131j978q75N5
51358B27628j42j121j746j519r95p86p10k11P13J444J544J201Q27N21P7n38j005
51341B25182r85o91q24j772k860k965j971j161j698l142m117m128l954m182m354
51326A86378l918l233l000l177l141k693k223j984j797j523j380j638k278l000
51312A51393l366l064k244j556j509j858j903j330m78J28J61m44j397k020j791
$$ y = [218707, 219432, 219974, 220828, 222650, 225545, 228903, 232132, 235303, 238798, 242622, 246452, 250211, 254073, 257888, 261093, 263457, 265513, 267861, 270290, 272068, 273026, 273828, 275012, 276271, 276979, 277068, 276921, 276696, 276314, 276044, 276446, 277489, 278300, 278125, 277192, 276200, 275340, 274375, 273496, 273350, 274028, 274585, 273926, 271884, 269146, 266371, 263761, 261271, 258817, 256195, 253153, 249693, 246123, 242754, 239718, 237188, 235471, 234595, 233913, 232557, 230426, 228448, 227573, 227628, 227486, 226365, 224619, 223100, 222105, 221319, 220609, 220398, 221111, 222555, 224099, 225300, 226127, 226648, 226725, 226187, 225182, 224197, 223506, 222682, 220910, 218050, 215085, 213114, 211953, 210255, 207113, 202996, 198868, 194914, 190732, 186378, 182460, 179227, 176227, 173050, 169909, 167216, 164993, 163009, 161212, 159689, 158309, 156671, 154393, 151393, 148027, 144963, 142719, 141163, 139654, 137796, 135893, 134563, 134085, 134213, 134374, 133930, 132533, 130513, 128722]
51297A28722r92m33m94p97q61o46l59q5J58L48N88R35J159R59N42M61P00N56l06
51278A30155j158j061j6J147J772J771J346Q35P27J292K214K821K749K151J444
51263A48189J062J248J848K389K546K294J481j45k186l435l159k141j703j986
51249A46302k091j697j556k136k802k766k172j727j714j908k085k135j951j591
51235A17971j356j397j432j173q04o98q47r01o98m25l01l22l35k05Q2L85N71O62
51217A08777P11N87J64k39j16M03N02k03r59q08O8N24l8j031j568j413q93k80
51199A04188L04O82P18N70N60P17P02K52m33q83q72o22m89o44j022j469j701j385
51181I9173n16L21M25j59o13l40L36O85N39L01K25J78J62M84J196J754J603Q96
$$ y = [128722, 127730, 127297, 126803, 126006, 125145, 124499, 124140, 124055, 124213, 124561, 125149, 126084, 127243, 128202, 128744, 129205, 129905, 130461, 130155, 128997, 127936, 127920, 129067, 130839, 132610, 133956, 134791, 135518, 136810, 139024, 141845, 144594, 146745, 148189, 149251, 150499, 152347, 154736, 157282, 159576, 161057, 160912, 158726, 155291, 152132, 149991, 148288, 146302, 144211, 142514, 140958, 138822, 136020, 133254, 131082, 129355, 127641, 125733, 123648, 121513, 119562, 117971, 116615, 115218, 113786, 112613, 111809, 111111, 110264, 109363, 108665, 108240, 107939, 107617, 107282, 107077, 107159, 107544, 108115, 108777, 109488, 110075, 110239, 110000, 109884, 110287, 110789, 110586, 109627, 108819, 108887, 109411, 109373, 108342, 106774, 105361, 104468, 104188, 104492, 105174, 105892, 106462, 107022, 107739, 108441, 108693, 108260, 107377, 106505, 105883, 105394, 104750, 103728, 102259, 100558, 99173, 98657, 98978, 99403, 99244, 98631, 98291, 98627, 99312, 99851, 100152, 100377, 100555, 100717, 101201, 102397, 104151, 105754, 106650]
51163A06650K90P1n6l58o64p27o36n78m60j31K06K88M14J181K444L050K106J71
51145A13261j267j340m00P02J384J386P56qk00K90P26L98m71j018p82r3M97Q87
51127A14708J286J655J550O87n20j215j010l88m7p2p7L3o3n51j223j818k206k147
51109A08582j394k13O06N81N1l71n23n91o78p94r77j102q60k79J0m95j413j947
51091I8193j909j767j720j354l73Q44J639J797J578J219P08M5m65m36RJ38n63
51074I7583j567j751p89M52J065J105J043Q51K94l22m92l34l19k96L31J360J707
51057I9921Q41m52j144j132r07o48k73Qj29o01j036j318j546j585j129k00P77
51040H9447J428J713J739J571J280R72P46P03R42J343J545J334R97R89J283J422
$$ y = [106650, 106940, 107011, 106955, 106597, 105933, 105206, 104570, 103992, 103532, 103401, 103607, 103895, 104309, 105490, 107934, 110984, 113090, 113261, 111994, 110654, 110254, 110956, 112340, 113726, 114482, 114474, 114274, 114564, 115290, 115688, 115217, 114199, 113417, 113324, 113821, 114708, 115994, 117649, 119199, 119886, 119366, 118151, 117141, 116753, 116706, 116634, 116557, 116590, 116527, 115976, 114753, 112935, 110729, 108582, 107188, 106975, 107581, 108162, 108213, 107842, 107319, 106728, 106050, 105256, 104279, 103177, 102317, 102038, 102048, 101553, 100140, 98193, 96284, 94517, 92797, 91443, 91070, 91914, 93553, 95350, 96928, 98147, 98855, 98900, 98435, 97999, 98008, 98146, 97583, 96016, 94265, 93476, 93928, 94993, 96098, 97141, 97992, 98286, 97964, 97472, 97138, 96819, 96523, 96854, 98214, 99921, 100762, 100310, 99166, 98034, 97127, 96479, 96206, 96214, 96085, 95484, 94448, 93130, 91584, 89999, 88870, 88670, 89447, 90875, 92588, 94327, 95898, 97178, 98150, 98896, 99599, 100541, 101884, 103429, 104763, 105760, 106749, 108032, 109454]
51024A09454J202J004J220J595J496P44p5k82J41O20P00M50J85N0M8K75Q05J404
51006A21036J630J283O19J11O8M92J114J544J564J276Q83L87k78q95j068q02n68
50989A28396p00r54r17o44n40p25q75o57j28L69N37K88k13o09n42N0Q21J297J325
50970A25579J167J143J223J183J043J094J345J340P80J30J39Q96J770K229K298
50955A43359K140J741J166O80M01K02K04Q63K235L528L931L552L057K681K228
50940A71968J858K131L059L852L912L627L741M338M878N077N202N550O001O290
50926B31484O397O521O824P406Q354R565J0566J0863J0640J0815J2093J4165J6043
50913C61736J7202J7960J8869K0164K1899K4117K6615K8941L0954L3017L5299
$$ y = [109454, 110656, 111660, 112880, 114475, 115971, 116715, 116640, 116358, 116499, 117119, 117819, 118269, 118454, 118504, 118552, 118827, 119632, 121036, 122666, 123949, 124568, 124679, 124747, 125239, 126353, 127897, 129461, 130737, 131620, 132007, 131729, 130834, 129766, 128964, 128396, 127696, 126742, 125825, 125181, 124641, 123916, 123041, 122384, 122256, 122625, 123162, 123450, 123237, 122628, 122086, 122136, 122957, 124254, 125579, 126746, 127889, 129112, 130295, 131338, 132432, 133777, 135117, 135897, 136027, 136166, 137062, 138832, 141061, 143359, 145499, 147240, 148406, 149086, 149487, 149689, 149893, 150756, 152991, 156519, 160450, 164002, 167059, 169740, 171968, 173826, 175957, 179016, 182868, 186780, 190407, 194148, 198486, 203364, 208441, 213643, 219193, 225194, 231484, 237881, 244402, 251226, 258632, 266986, 276551, 287117, 297980, 308620, 319435, 331528, 345693, 361736, 378938, 396898, 415767, 435931, 457830, 481947, 508562, 537503, 568457, 601474, 636773]
50902F36773L7230L8288L8901L9954M1415M2328M2211M1638M1096M0001L7521
50891A077356L3849K9937K6187K2182J7683J3196R289N885K538q81m110o824q773
50878A217514r820j0131j0241j0547j0862j0724j0207j0033j0814j2421j4274
50867A097440j6033j7777j9691k1836k4179k6557k8636l0099l0934l1427l1834
50856H18437l2162l2235l1816l0726k9055k7226k5600k4022k2099j9992j8463
50845E25041j7858j7419j6082j3739j1224r205p635o361n526n127m638l594k240
50832D04393j160m24L37J137J513J357J217J477J712J403R34J259K602M125N088
50817D26970N681O441P313P817P934Q186Q848R619J0191J0792J1888J3545J5304
$$ y = [636773, 674003, 712291, 751192, 791146, 832561, 874889, 917100, 958738, 999834, 1039835, 1077356, 1111205, 1141142, 1167329, 1189511, 1207194, 1220390, 1229679, 1235564, 1238102, 1237221, 1233111, 1226287, 1217514, 1207694, 1197563, 1187322, 1176775, 1165913, 1155189, 1144982, 1134949, 1124135, 1111714, 1097440, 1081407, 1063630, 1043939, 1022103, 997924, 971367, 942731, 912632, 881698, 850271, 818437, 786275, 754040, 722224, 691498, 662443, 635217, 609617, 585595, 563496, 543504, 525041, 507183, 489764, 473682, 459943, 448719, 439514, 431879, 425518, 419992, 414865, 410227, 406633, 404393, 403233, 402809, 403146, 404283, 405796, 407153, 408370, 409847, 411559, 412962, 413896, 415155, 417757, 421882, 426970, 432651, 439092, 446405, 454222, 462156, 470342, 479190, 488809, 499000, 509792, 521680, 535225, 550529]
50804E50529J6653J7518J8319J9617K1623K4089K6645K9189L1747L4200L6448
50793H26577L8888M2300M7074N2760N8502O3767O8557P3115P7644Q2072Q5950
50782A517206Q8778R0615R2100R3591R4396R3202Q9254Q2883P5021O6348N6980
50771B440374M6707L5484K3800J2511K284o683j4279k0145k4004k6105k7020k6991
50759B415933k5940k4101k2161k0660j9646j9214j9989k2572k6755l1659l6715
50748B146521m2105m8156n4634o0798o5942o9656p1820p2668p2732p2420p1544
50737A444046o9566o6296o2099n7384n2336m7216m2481l8179l3720k8686k3602
50726I22481j9255j5566j1898q333n779m587m012l337k791k756k889k759k786
$$ y = [550529, 567182, 584700, 603019, 622636, 644259, 668348, 694993, 724182, 755929, 790129, 826577, 865465, 907765, 954839, 1007599, 1066101, 1129868, 1198425, 1271540, 1349184, 1431256, 1517206, 1605984, 1696599, 1788699, 1882290, 1976686, 2069888, 2159142, 2242025, 2317046, 2383394, 2440374, 2487081, 2522565, 2546365, 2558876, 2561160, 2554477, 2540198, 2520053, 2496049, 2469944, 2442924, 2415933, 2389993, 2365892, 2343731, 2323071, 2303425, 2284211, 2264222, 2241650, 2214895, 2183236, 2146521, 2104416, 2056260, 2001626, 1940828, 1874886, 1805230, 1733410, 1660742, 1588010, 1515590, 1444046, 1374480, 1308184, 1246085, 1188701, 1136365, 1089149, 1046668, 1008489, 974769, 946083, 922481, 903226, 887660, 875762, 867429, 861650, 857063, 853051, 849714, 846923, 844167, 841278, 838519, 835733]
50713H35733l640n073o112o301o040n846n952o510p457q218q237p803p675p923
50699G42946p881p316o737o352n609m134k387q28Q43L028N357P160Q417R683J1232
50684G47422J2892J4461J5857J7003J8048J9465K1558K4037K6453K8833L1518
50673I77547L4641L8170M2153M6358M9991N2413N3939N5272N6304N6241N4871
50662A517900N2806N0339M6970M2482L7581L2845K7635K0887J2642M029m085j1624
50650A830407j8477k3985k7642k9689l0566l0188k8345k5585k3002k1007j8940
50639A552981j6244j3600j2249j2430j3272j4321j6395k0321k5448l0189l3778
50628A344734l6582l8758l9647l8980l7750l7032l6432l4651l1409k7787k4600
$$ y = [835733, 832093, 827020, 820908, 814607, 808567, 802721, 796769, 790259, 782802, 774584, 766347, 758544, 750869, 742946, 735065, 727749, 721012, 714660, 709051, 704917, 702530, 701702, 702545, 705573, 710930, 718090, 726507, 736190, 747422, 760314, 774775, 790632, 807635, 825683, 845148, 866706, 890743, 917196, 946029, 977547, 1012188, 1050358, 1092511, 1138869, 1188860, 1241273, 1295212, 1350484, 1406788, 1463029, 1517900, 1570706, 1621045, 1668015, 1710497, 1748078, 1780923, 1808558, 1829445, 1842087, 1846116, 1842031, 1830407, 1811930, 1787945, 1760303, 1730614, 1700048, 1669860, 1641515, 1615930, 1592928, 1571921, 1552981, 1536737, 1523137, 1510888, 1498458, 1485186, 1470865, 1454470, 1434149, 1408701, 1378512, 1344734, 1308152, 1269394, 1229747, 1190767, 1153017, 1115985, 1079553, 1044902, 1013493, 985706, 961106]
50617I61106k1351j7228j2379p608l262Q30M646P921J0783J3741J6924J9805K1909
50604I95837K3287K4148K4378K3844K2857K1982K1476K1069K0287J8930J7379
50593A235474J6415J6455J6935J6898J6219J5788J6237J7148J7916J8723K0057
$$ y = [961106, 939755, 922527, 910148, 902540, 899278, 900108, 904754, 912675, 923458, 937199, 954123, 973928, 995837, 1019124, 1043272, 1067650, 1091494, 1114351, 1136333, 1157809, 1178878, 1199165, 1218095, 1235474, 1251889, 1268344, 1285279, 1302177, 1318396, 1334184, 1350421, 1367569, 1385485, 1404208, 1424265]
$$ [...]
##END NTUPLES=NMR SPECTRUM
##END=
