
##TITLE=AC1087_CCIN02_5818874_mKTjIqYRFi
##JCAMPDX= 6.0         $$ Bruker NMR JCAMP-DX V2.0
##DATA TYPE= NMR SPECTRUM
##DATA CLASS= NTUPLES
##ORIGIN= BRUKER
##OWNER= Administrator
$$ 1.72 TOPSPIN		Version 2.1
$$ 2012-03-25 00:12:34.000 -0500  Administrator@TOPSPIN
$$ Compression mode = diff/dup
##.OBSERVE FREQUENCY= 400.13188235
##.OBSERVE NUCLEUS= ^1H
##.ACQUISITION MODE= SIMULTANEOUS (DQD)
##.ACQUISITION SCHEME= undefined
##.AVERAGES= 8
##.DIGITISER RES= 22
##SPECTROMETER/DATA SYSTEM= spect
##.PULSE SEQUENCE= zg30
##.SOLVENT NAME= COFFEE_meoh
##.SHIFT REFERENCE= INTERNAL, COFFEE_meoh, 1, 14.98061
##AUDIT TRAIL= $$ (NUMBER, WHEN, WHO, WHERE, PROCESS, VERSION, WHAT)
$$ ##TITLE= Audit trail, TOPSPIN		Version 2.1
$$ ##JCAMPDX= 5.01
$$ ##ORIGIN= Bruker BioSpin GmbH
$$ ##OWNER= Administrator
$$ $$ C:\Bruker\TOPSPIN/data/COFFEE/nmr/AC1087_CCIN02_5818874_mKTjIqYRFi/10/pdata/1/auditp.txt
$$ ##AUDIT TRAIL=  $$ (NUMBER, WHEN, WHO, WHERE, PROCESS, VERSION, WHAT)
(   1,<2012-03-25 00:12:13.390 -0500>,<Administrator>,<TOPSPIN>,<go>,<TOPSPIN 2.1>,
      <created by zg
	started at 2012-03-25 00:11:06.515 -0500,
	POWCHK enabled, PULCHK disabled,
       configuration hash MD5:
       1A 1E CE 29 27 FD 77 03 67 4E F0 E3 C4 B2 CB 90
       data hash MD5: 64K
       42 26 E9 EC 4B 07 BB 4B 82 5B 7C 01 84 08 87 25>)
(   2,<2012-03-25 00:12:22.734 -0500>,<Administrator>,<TOPSPIN>,<proc1d>,<TOPSPIN 2.1>,
      <Start of raw data processing
       efp LB = 0 FT_mod = 6 PKNL = 1 PHC0 = 0 PHC1 = 0 SI = 32K 
       data hash MD5: 32K
       BA 53 2F 11 08 EA 68 85 AF 14 3C C3 71 2A E0 70>)
(   3,<2012-03-25 00:12:23.578 -0500>,<Administrator>,<TOPSPIN>,<proc1d>,<TOPSPIN 2.1>,
      <pk PHC0 = 216.0846 PHC1 = 0 
       data hash MD5: 32K
       69 A9 27 8A 07 EC EB CD F1 86 43 FB 78 47 C7 B5>)
(   4,<2012-03-25 00:12:23.953 -0500>,<Administrator>,<TOPSPIN>,<proc1d>,<TOPSPIN 2.1>,
      <abs ABSG = 1 
       data hash MD5: 32K
       A3 54 EE ED 97 6C F7 F6 0D 1D 9A 6A ED B9 D8 82>)
(   5,<2012-03-25 00:12:24.312 -0500>,<Administrator>,<TOPSPIN>,<proc1d>,<TOPSPIN 2.1>,
      <abs ABSG = 2 
       data hash MD5: 32K
       A6 76 C3 3B 92 8F F3 D1 71 93 69 69 76 C0 5E 97>)
(   6,<2012-03-25 00:12:24.593 -0500>,<Administrator>,<TOPSPIN>,<proc1d>,<TOPSPIN 2.1>,
      <abs ABSG = 3 
       data hash MD5: 32K
       44 05 F3 8E C2 B7 0E B8 C9 72 37 83 19 00 64 B0>)
(   7,<2012-03-25 00:12:24.875 -0500>,<Administrator>,<TOPSPIN>,<proc1d>,<TOPSPIN 2.1>,
      <abs ABSG = 4 
       data hash MD5: 32K
       48 8F BC DC A5 91 CA B4 DA 53 D8 01 A6 F3 3F C8>)
(   8,<2012-03-25 00:12:25.156 -0500>,<Administrator>,<TOPSPIN>,<proc1d>,<TOPSPIN 2.1>,
      <abs ABSG = 5 
       data hash MD5: 32K
       10 C8 50 D4 29 99 60 A4 4D B5 F6 4D CB F8 5B DA>)
$$ ##END=
$$ 
$$ $$ hash MD5
$$ $$ 06 27 9F 6A AD 2A 81 43 05 EC C7 B5 07 33 86 1B
##$RELAX= 
##$RELAX= 
##$RELAX= 
##$RELAX= 
##$RELAX= 
##$RELAX= 
##$RELAX= 
$$ Bruker specific parameters
$$ --------------------------
$$ [...]
150 150 150 150 150 150 150 150
##$TP07= 0
##$TPNAME0= <>
##$TPNAME1= <>
##$TPNAME2= <>
##$TPNAME3= <>
##$TPNAME4= <>
##$TPNAME5= <>
##$TPNAME6= <>
##$TPNAME7= <>
##$TPOAL= (0..7)
0.5 0.5 0.5 0.5 0.5 0.5 0.5 0.5
##$TPOFFS= (0..7)
0 0 0 0 0 0 0 0
##$TUNHIN= 0
##$TUNHOUT= 0
##$TUNXOUT= 0
##$USERA1= <user>
##$USERA2= <user>
##$USERA3= <user>
##$USERA4= <user>
##$USERA5= <user>
##$V9= 5
##$VALIST= <valist>
##$VCLIST= <CCCCCCCCCCCCCCC>
##$VD= 0
##$VDLIST= <DDDDDDDDDDDDDDD>
##$VPLIST= <PPPPPPPPPPPPPPP>
##$VTLIST= <TTTTTTTTTTTTTTT>
##$WBST= 2048
##$WBSW= 25
##$XGAIN= (0..3)
0 0 0 0
##$XL= 0
##$YL= 0
##$YMAX_a= 501615
##$YMIN_a= -596927
##$ZGOPTNS= <>
##$ZL1= 120
##$ZL2= 120
##$ZL3= 120
##$ZL4= 120
##$ABSF1= 14.98061
##$ABSF2= -5.57192
##$ABSG= 5
##$ABSL= 3
##$ALPHA= 0
##$AQORDER= 0
##$ASSFAC= 0
##$ASSFACI= 0
##$ASSFACX= 0
##$ASSWID= 0
##$AUNMP= <proc_prof1d_extract_pilot.lims>
##$AXLEFT= 0
##$AXNAME= <>
##$AXNUC= <1H>
##$AXRIGHT= 0
##$AXTYPE= 0
##$AXUNIT= <>
##$AZFE= 0.1
##$AZFW= 0.1
##$BCFW= 0
##$BC_mod= 0
##$BYTORDP= 0
##$COROFFS= 0
##$CY= 15
##$DATMOD= 1
##$DC= 0
##$DFILT= <>
##$DTYPP= 0
##$F1P= 0
##$F2P= 0
##$FCOR= 0.5
##$FTSIZE= 32768
##$FT_mod= 6
##$GAMMA= 0
##$GB= 0
##$INTBC= 1
##$INTSCL= 1
##$ISEN= 128
##$LB= 0
##$LEV0= 0
##$LPBIN= 0
##$MAXI= 10000
##$MC2= 0
##$MEAN= 0
##$ME_mod= 0
##$MI= 0
##$NCOEF= 0
##$NC_proc= -8
##$NLEV= 6
##$NOISF1= 0
##$NOISF2= 0
##$NSP= 0
##$NTH_PI= 0
##$NZP= 0
##$OFFSET= 14.98061
##$PC= 1
##$PHC0= 216.0846
##$PHC1= 0
##$PH_mod= 1
##$PKNL= yes
##$PPARMOD= 0
##$PPDIAG= 0
##$PPIPTYP= 0
##$PPMPNUM= 2147483647
##$PPRESOL= 1
##$PSCAL= 4
##$PSIGN= 0
##$PYNMP= <proc.py>
##$REVERSE= no
##$SF= 400.13
##$SI= 32768
##$SIGF1= 0
##$SIGF2= 0
##$SINO= 400
##$SIOLD= 32768
##$SPECTYP= <>
##$SREGLST= <1H.CDCl3>
##$SSB= 0
##$STSI= 32768
##$STSR= 0
##$SW_p= 8223.68421052632
##$SYMM= 0
##$S_DEV= 0
##$TDeff= 65536
##$TDoff= 0
##$TI= <>
##$TILT= no
##$TM1= 0
##$TM2= 0
##$TOPLEV= 0
##$USERP1= <user>
##$USERP2= <user>
##$USERP3= <user>
##$USERP4= <user>
##$USERP5= <user>
##$WDW= 1
##$XDIM= 32768
##$YMAX_p= 433547592
##$YMIN_p= -652791
##$CURPLOT= <Network HP LaserJet P1505>
##$CURPRIN= <$Network HP LaserJet P1505>
##$DFORMAT= <normdp>
##$LAYOUT= <+/1D_H.xwp>
##$LFORMAT= <normlp>
##$PFORMAT= <normpl>
##$SURQMSG= 1
$$ End of Bruker specific parameters
$$ ---------------------------------
##NTUPLES= NMR SPECTRUM
##VAR_NAME=  FREQUENCY,     SPECTRUM/REAL,   SPECTRUM/IMAG
##SYMBOL=    X,             R,               I
##VAR_TYPE=  INDEPENDENT,   DEPENDENT,       DEPENDENT
##VAR_FORM=  AFFN,          ASDF,            ASDF
##VAR_DIM=   32768,         32768,           32768
##UNITS=     HZ,            ARBITRARY UNITS, ARBITRARY UNITS
##FACTOR=    0.250966925370066, 1,           1
##FIRST=     8223.43324360095, 113228,       -127079
##LAST=      0,             -159148,         -56083
##MIN=       0,             -652791,         0
##MAX=       8223.43324360095, 433547592,    0
$$ Real data points
##PAGE= N=1
##DATA TABLE= (X++(R..R)), XYDATA
$$ [...]
19480a46994o2573I9540k5873a56378c2005A00653d73032L0437J41024A51559
19469i1719C456J1865c67184G5326K9740b6648A59914i0410j51073J06700D5130
19457h3351p6006A88004o0042a40207q6360R9575F8978g974C1948L8485e885j25542
19445a31427C550Q7994A1254J58019a10166C81981c13267J40733A96933I7401
19434a33414C30905E4891a49773f2149l27099h8578j33013p4076a18967K3525
19424i5442A9413a62840b3707j32245g6399k75308a39437A9242a31346c8723B38123
19412B0726L29571a4022C39167r8340h2326o682j8611j75825e7446A27340i5154
19400e5157A09792J29608g9924j6346p5012f5752D8250J39895a5677k6359j85861
$$ plain form
19480 -146994 -209567 99540 73667 -156378 -32005 100653 -473032 -442595 -301571 151559
19469 -91719 3456 15321 -367184 75326 105066 -26648 159914 -90410 -241483 -134783 45130
19457 -83351 -159357 188004 127962 -140207 -226567 -126992 68978 -7974 31948 70433 -5885 -131427
19445 -131427 3550 91544 11254 169273 -110166 381981 -313267 -172534 196933 97401
19434 -133414 330905 54891 -149773 -62149 -389248 -88578 -221591 -295667 -118967 -95442
19424 -95442 19413 -162840 -23707 -155952 -76399 -351707 -139437 19242 -131346 -38723 238123
19412 20726 350297 -14022 339167 240827 -82326 -89008 -107619 -283444 -57446 127340 -95154
19400 -55157 109792 239400 -79924 -96270 -171282 -65752 48250 188145 -15677 -42036 -227897
19389b27897J06330G0850h5322A48866e27661a8062p7196n5169J8441f2869m9188
19378a12057I2112K00475b05964A18410d1051L948A79009a14133I7022b86551
19367e36037a26752B01544A2688c4360P006j1588j27150b2847O365A371e5221
19355a34077A24057a98892a675A5586g6728K4066j61151a03700c7306j34144f1037
19343H1874d6570B90429h2858k45569J15780a26l45249a33096l21957a63826j11151
19332b74977C0892b16696B23101c21209R2419D24883a18924B28097h1403J2851
19322f8552M464l13032A11477J57782a3191C661f8547B60602b64377l11725b25081
19310b78066K7841B8647R693J57041c1046k25825Q3634a2916j62301B23746G7731
$$ plain form
19389 -227897 -121567 70850 -85322 148866 -527661 -18062 -95258 -150427 -131986 -62869 -112057
19378 -112057 92112 292587 -205964 118410 -41051 -37103 179009 -114133 97022 -286551
19367 -536037 -126752 201544 12688 -34360 -27354 -38942 -166092 -22847 -16482 1371 -55221
19355 -134077 124057 -198892 -1675 15586 -76728 -52662 -213813 -103700 -37306 -171450 -61037
19343 81874 -46570 290429 -82858 -328427 -212647 -126 -345375 -133096 -455053 -163826 -274977
19332 -274977 30892 -216696 223101 -321209 -228790 424883 -118924 228097 -81403 -68552
19322 -68552 -64088 -377120 111477 269259 -13191 3661 -68547 260602 -264377 -576102 -225081
19310 -278066 -250225 28647 38340 195381 -31046 -256871 -173237 -12916 -175217 223746 77731
19298i9484m5558A09242M92P9483G6255b8811A1846J7711a84286p1335B27807
19286I0582a04852C05820b72277l2674A21228d02007J62978J03623j39481A42093
19275g6190a7186j7613k16651a14477p5084a02A29286a57828A99497a54441n2349
19264b06790M2363l6331k61609D760b86797o0302L9131A44109a70187p505F6699
19252A93050f9073B30844a2166B09446b17914f9526E0008a74622A47030h5209
19241i7900B4101K27148a92341k3158d9473A0095b56008c6461j63417D102b60266
19229A9406b607I2435b42316i970j20336k1821l7772C1283J72a03423j55454J13612
19217a45265A12113i3352j84971B44716b54713A34584J24122a46616L1092j36422
$$ plain form
19298 -99484 -145042 109242 109734 189217 76255 -28811 11846 29557 -184286 -255621 227807
19286 90582 -104852 305820 -272277 -304951 121228 -402007 -239029 -135406 -274887 142093
19275 -76190 -17186 -34799 -251450 -114477 -189561 -102 129286 -157828 199497 -154441 -206790
19264 -206790 -164427 -200758 -462367 4760 -286797 -347099 -307968 144109 -170187 -177692 66699
19252 193050 -69073 230844 -12166 209446 -217914 -69526 50008 -174622 147030 -85209
19241 -97900 24101 251249 -192341 -215499 -49473 10095 -256008 -36461 -199878 4102 -260266
19229 19406 -2607 92435 -242316 -9970 -130306 -152127 -189899 31283 31455 -103423 -258877 -145265
19217 -145265 112113 -93352 -278323 244716 -254713 134584 258706 -146616 -115524 -251946
19207b51946b4191H2956a01246a039j46540j23203a20889A7109O8410i1409A07518
19195A52835K1140j4629a25933C61257A67552c98715I38b92949O5821M4881p839
19184a90086G1083a6917j21354C44236A11746C8700K85939e25141g6081G2842
19173A39104J65662j43686a27271R593l2043F5726A0819a12618D8202d6776B34774
19161B05268a42141j6659j1594g8228C6524M309i5634a4308k49604C00345E3699
19149h0167k89745g6384r2341j36175Q677A08582c37959c3112r3814D1047a71148
19137c336l47489A50671a48053A43846n4188K3706B4873f0211F6583j6183J41980
19126A92380d5714k9188l93870d1787o0011j7535A68573d13985b9201A4145a7350
$$ plain form
19207 -251946 -24191 82956 -101246 -1039 -147579 -270782 -120889 17109 85519 -91409 107518
19195 152835 173975 159346 -125933 361257 167552 -398715 938 -292949 -227128 -182247 -190086
19184 -190086 71083 -16917 -138271 344236 111746 38700 324639 -525141 -76081 72842
19173 139104 304766 161080 -127271 -117678 -149721 65726 10819 -112618 48202 -46776 234774
19161 205268 -142141 -158800 -170394 -78228 36524 40833 -95634 -14308 -263912 300345 53699
19149 -80167 -369912 -76384 -168725 -304900 -296223 108582 -337959 -33112 -126926 41047 -171148
19137 -3336 -350825 150671 -148053 143846 89658 113364 24873 -60211 66583 50400 192380
19126 192380 -45714 -74902 -468772 -41787 -101798 -119333 168573 -413985 -29201 14145 -17350
19114E4557b00794g6307q6809a0613j33578j98807A02741c02191F7117c45586
19103i7962M7705E9978c7476k65397b5059A50007a93141J3632M5871d6274p1943
19092a18217j97259n0566d3760k07091p6366h6193b8978A31027D1801b2219F0038
19080A94191b3492C04b43550J03908A24190R6578q1628c32961A9095b39267L733
19069b35534R1091L9294A40847O4975b15029B60359f5267f646j14372l6884A65847
19057e565j46587a0643m49243a17914K7092A60047a02258g748A85780n7446a41045
19045E0006K51977e4298E8046a29867B35891j14539a86852A5877a3592k9027q382
19034e1001C6115j0881c4095k62007D8625J29529b01967j16549a04814r452K0884
$$ plain form
19114 54557 -200794 -76307 -163116 -10613 -144191 -342998 102741 -302191 67117 -345586
19103 -97962 -50257 59978 -37476 -302873 -25059 150007 -193141 -179509 -133638 -46274 -118217
19092 -118217 -315476 -366042 -43760 -250851 -327217 -86193 -28978 131027 41801 -22219 60038
19080 194191 -23492 304 -243550 -139642 124190 220768 139140 -332961 19095 -239267 -235534
19069 -235534 -144443 -105149 140847 205822 -215029 260359 -65267 -6646 -121018 -157902 165847
19057 -5565 -152152 -10643 -459886 -117914 -90822 160047 -102258 -7748 185780 128334 -141045
19045 50006 301983 -54298 58046 -129867 235891 121352 -186852 15877 -13592 -42619 -51001
19034 -51001 36115 25234 -34095 -296102 48625 178154 -201967 -318516 -104814 -114266 -93382
19023i3382j30393i378B39597a20736j19222D0555h3803H9591a13235A23527e3170
19011A41797a41576j31806r422E273i9152l4102M3479A14632k3152g7835q7533
19000a65368j4300r4145B90163a96860A00029f186C0946c65675B52923c9606F8332
18988F9891a83202G8122j2519L42882A83164J45380E1417J82516b40356A43927
18977a12037A31716m2566a76402A87980b8769l34773J43178K7544G0014b07154
18966B06407p4236m5677g6962A03196b5356C8974a29867d2622E3177K51160Q777
18955C13114o4376H6992J07539e2485m116B28892m0749g3049C53467b25348Q8217
18944a37131j62437B06522j4617b27108G8437b58897a21976n0986C4525b67220
$$ plain form
19023 -93382 -223775 -9378 239597 -120736 -239958 40555 -83803 89591 -113235 123527 -53170
19011 141797 -141576 -273382 -282804 5273 -99152 -133254 -89775 114632 91480 -77835 -165368
19000 -165368 -179668 -273813 290163 -196860 100029 -6186 30946 -365675 252923 -39606 68332
18988 69891 -183202 78122 65603 408485 183164 328544 51417 233933 -240356 143927
18977 -112037 131716 89150 -176402 187980 -28769 -363542 -220364 -192820 70014 -207154
18966 206407 132171 86494 -76962 103196 -25356 38974 -129867 -42622 53177 304337 313114
18955 313114 248738 86992 194531 -52485 -56601 228892 188143 -73049 353467 -225348 -137131
18944 -137131 -299568 206522 191905 -227108 78437 -258897 -121976 -172962 34525 -267220
18933i3579r052G9836d23590J37528L7922h7445G5095R6789b07689k5137K8167
18922b04659G3930J36671D4602R9244E2697P0662e8472m2247G0377a00830k08951
18911c09781A4604N1100a02612n3520a6374B8941O2266k2304a47470E7091g4187
18899E525c7790F7912k1293a10992C8296J84751J20578A6383L02570n3391c42013
18887b5276A25423b02902H1229a38553A78263O0359a31887B18933b38414d7579
18876b6642j04515b3973G4880A7816a24978d3374j01071P0200C4870Q2620d20114
18864a17375k09097E6190J06797E713N480a22140a6304q754C40447I8645b80185
18852a29794a4265I6898J64335h67A30687a2979p4936A87991c6414l0852H0241
$$ plain form
18933 -93579 -102631 79836 -423590 -286062 -248140 -87445 75095 171884 -207689 -232826 -204659
18922 -204659 73930 210601 44602 143846 52697 123359 -58472 -100719 70377 -100830 -309781
18911 -309781 14604 65704 -102612 -156132 -16374 28941 91207 68903 -147470 57091 -74187
18899 5525 -37790 67912 46619 -110992 38296 223047 343625 16383 318953 265562 -342013
18887 -25276 125423 -202902 81229 -138553 178263 238622 -131887 218933 -238414 -47579
18876 -26642 -131157 -23973 74880 17816 -124978 -43374 -144445 -74245 34870 117490 -420114
18864 -117375 -326472 56190 162987 5713 11193 -122140 -16304 -25058 340447 98645 -280185
18852 -129794 -14265 96898 261233 -867 130687 -12979 -87915 187991 -36414 -67266 80241
18840A1395a64227j22565f4811p3847b3880p2298p7549l0725D5962b88929B98711
18828c45433m0366B3430a07216j18143B39696C180b233A5696a93673g7506j57817
18817b35323B78270a15077B30002b9885J0394A83520C2435a65314J4965j57981
18807c08330A21674Q1540b28569C6620a20453A04587J00771F9176A4740L81253
18797C95993c853C8089i2876K5972E1254J64604K8177a29963H8591d1693B330
18785A5251a22359o2552A32840B798P0339e3191j29672A13758e63959a5328A39501
18773A87977b43250D0187L1458a03466p4087c8054k4322n0504q0587A68992a9954
18761D3491c2628m00451A68620c2214A79534d37887N6154A66260F6406b53768
$$ plain form
18840 11395 -164227 -286792 -64811 -138658 -23880 -96178 -173727 -204452 45962 -288929 298711
18828 -345433 -385799 23430 -107216 -225359 239696 3180 -2233 15696 -193673 -77506 -235323
18817 -235323 278270 -115077 230002 -29885 -19491 183520 32435 -165314 -150349 -308330
18807 -308330 121674 203214 -228569 36620 -120453 104587 205358 69176 14740 395993
18797 395993 -3853 38089 -92876 -66904 51254 215858 244035 -129963 88591 -41693 2330
18785 15251 -122359 -184911 132840 2798 73137 -53191 -182863 113758 -563959 -15328 139501
18773 187977 -243250 40187 71645 -103466 -177553 -38054 -62376 -112880 -193467 168992 -19954
18761 43491 -32628 -433079 168620 -32214 179534 -437887 -381733 166260 66406 -253768
18750a77605M8882h440B01263c49639J07360M5287F7380M418i526j39820H9355
18738A74773m2485n7114k6215i372m5868j29938P4823B6128a72646P5162I7473
18726a03780j9018k86932a30808h339k90007l15357A95949a18018d5235l9217
18716h4452Q806r6916H940e14168K47044B14063b98402f3992j29528C9635d3148
18704c62924h8943o9359K6721F8150J26228J0b19926O753B4927a29000j69212
18693b98212A37012n2744a11658D7628m450F429b18653B23821h1473k19640f3237
18681c67138i9866B03094b08467D2894J54631c8641m7597k48244A71136b95426
18670c02775A7891R9201a27454f801k18110G8873a19858K8753A48326a40082k10783
$$ plain form
18750 -177605 -128723 -8440 201263 -349639 -242279 -196992 67380 71798 -9526 -149346 89355
18738 174773 132288 75174 48959 -9372 -55240 -185178 -110355 26128 -172646 -97484 97473
18726 -103780 -122798 -409730 -130808 -8339 -298346 -613703 195949 -118018 -45235 -84452
18716 -84452 -75646 -172562 8940 -514168 -267124 214063 -298402 -63992 -193520 39635 -43148
18704 -362924 -88943 -158302 -131581 68150 194378 194388 -219926 -213173 24927 -129000 -298212
18693 -298212 137012 84268 -111658 47628 43178 6429 -218653 223821 -81473 -301113 -63237
18681 -367138 -99866 203094 -208467 42894 197525 -38641 -86238 -334482 171136 -295426
18670 -302775 17891 117092 -127454 -6801 -224911 78873 -119858 -91105 148326 -140082 -350865
18659c50865A20988a26514P445h761k05436g1264b7071b529j99702A82732L39363
18648E22095A00491D8492K8901a53915l4842j72969J19062n3206Q901a0668j02847
18637a13515A2146M3510a9285A53526f241k35886A14533d01494C33919B3681i142
18625A62010J1626a5544k16851P4970a017m2797A26164M1426a42527N0853K3578
18614f8096l99413a77151A29540a41011j63942A86524E2267a29959O551p1914
18604a95322B0675b98198N1135H6665a30690L9225C9314K37585A01619g5533A63983
18592a90762F5865c09608J37673e0126O103q7265N2214o511k25213G9102e1914
18580a25112n6635F3440f5964c1807r2868p5654c7089j42886e9612A86446j0841
$$ plain form
18659 -350865 120988 -126514 -119069 -8761 -214197 -71264 -27071 -2529 -202231 182732 522095
18648 522095 100491 48492 77393 -153915 -188757 -361726 -242664 -295870 -286969 -10668 -113515
18637 -113515 12146 55656 -19285 153526 -6241 -242127 114533 -401494 333919 23681 -9142
18625 162010 173636 -15544 -232395 -157425 -1017 -43814 126164 167590 -142527 -91674 -68096
18614 -68096 -467509 -177151 129540 -141011 -304953 186524 52267 -129959 -123408 -195322
18604 -195322 20675 -298198 -247063 86665 -130690 -91465 39314 276899 101619 -75533 163983
18592 -190762 65865 -309608 -171935 -50126 -44023 -131288 -79074 -85585 -310798 79102 -51914
18580 -125112 -181747 63440 -65964 -31807 -124675 -200329 -37089 -179975 -59612 186446 175605
18569A75605i4980j45574C8423O1252J56J11186a68610C8743L5985b17806e1052
18557c70463B8192a79623Q6120j16209h1800j33298f9416n3392B61186I3434a42798
18545e1778j97283D9297L02j6058b45424L7057B11600H6033R5770C1995b44982
18533A96532n9260h4362J6324j12531A77272p4187L1937E7030R3334a96728A78782
18521A87418e9460m0780j87236A35122a33262B10685a7191C57904b11457G2701
18510b88640J06144l1131C9418p076a87531H1422b42946f4317F7965d08954B32105
18498i4728c5342e158m67555b10846b7036n8355B81858e34886A65761n5742b07723
18486g5126J1036b851j86551k7430l5506a06331E6900a0591l00619C01796b89627
$$ plain form
18569 175605 -94980 -240554 38423 99675 99831 211017 -168610 38743 74728 -217806 -51052
18557 -370463 28192 -179623 -93503 -209712 -81800 -215098 -69416 -122808 261186 93434 -142798
18545 -51778 -249061 49297 49599 33541 -245424 -208367 211600 86033 181803 31995 -244982
18533 196532 137272 -84362 -68038 -180569 177272 103085 135022 57030 150364 -196728 178782
18521 187418 -59460 -100240 -287476 135122 -133262 210685 -17191 357904 -211457 72701
18510 -288640 -182496 -213627 39418 32342 -187531 81422 -242946 -64317 67965 -408954 232105
18498 -94728 -35342 -5158 -472713 -210846 -27036 -85391 281858 -534886 165761 110019 -207723
18486 -75126 -64090 -2851 -189402 -216832 -252338 -106331 56900 -10591 -311210 301796 -289627
18474b36672i2320B58940j13956f9220k82129D8397b2759j59636A90757c9159
18463g0733n7633A59871g1938L1531j52880A2269a20856G3234i133k0201o8538
18452i7872D9652Q306a60157A60290a95046E4346E725K30103d0105q4530A3705
18440e940j32363A03542P0312b28402h0263l61441A29039i6805A93314b5279k16184
18429b41463B34066K4296j7100b16435J3450A85642a10836H9825b80817F3253
18418D1410d30771A62692d4521A51362D0054K36811j30859J1802c7906j09048
18408a46954A36012D7207b73894o7D3364c41311i9377j27254l0876a5905k15467
18397b31372a06634F5131d3481B38324i2459L1591A15241m7933a66772A17046
$$ plain form
18474 -236672 -92320 258940 144984 -69220 -351349 48397 -22759 -182395 190757 -39159
18463 -70733 -128366 159871 -71938 -40407 -193287 12269 -120856 73234 -9133 -29334 -97872
18452 -97872 49652 57958 -160157 160290 -195046 54346 5725 235828 -40105 -124635 13705
18440 -5940 -138303 103542 173854 -228402 -80263 -441704 129039 -96805 193314 -25279 -241463
18429 -241463 234066 258362 241262 -216435 -202985 185642 -110836 89825 -280817 63253
18418 41410 -430771 162692 -44521 151362 40054 276865 146006 157808 -37906 -146954
18408 -146954 136012 47207 -273894 -273961 43364 -341311 -99377 -226631 -257507 -15905 -231372
18397 -231372 -106634 65131 -43481 238324 -92459 -60868 115241 67308 -166772 117046
18386A6050a81143A92869b11323c7682q3967d6884m3894d2939A87263f4012j37529
18375b01541C73904C6376c16061h1121B36550A09691i4880q2573Q481G8118l0162
18364D7956i2422I610e6876B41808G4997c59l55941d6068B9955a13603A6883J37510
18352A54393L0862c29642A10628J53096a45264A43070K08793n487a28256F1131
18341B30262r8873B3489J39397c62905c0718H0356J2662b27729C02069a43348
18330A28741a07486a5793l10114G6363B0620J00849e6673K0789k42891B15148
18319B94962j30417b91292A84592d9841b2978j32149P5448j13813C66440E5901
18308B13919a8405D30605k08669d92632F3339B0803J20306B8259N7131a9488C8918
$$ plain form
18386 16050 -181143 192869 -211323 -37682 -121649 -46884 -90778 -42939 187263 -64012 -201541
18375 -201541 373904 36376 -316061 -81121 236550 109691 -94880 -177453 -168972 78118 47956
18364 47956 -92422 9610 -56876 241808 74997 -359 -356300 -46068 29955 -113603 16883 154393
18352 154393 185255 -329642 110628 263724 -145264 143070 351863 346376 -128256 61131
18341 230262 131389 23489 162886 -362905 -30718 80356 93018 -227729 302069 -143348
18330 128741 -107486 -15793 -325907 76363 20620 121469 -56673 -35884 -278775 215148
18319 294962 164545 -291292 184592 -49841 -22978 -155127 -79679 -193492 366440 55901
18308 213919 -18405 430605 221936 -492632 63339 20803 141109 28259 85390 -19488 38918
18296c30285J17531e5504G2010J7392l2266a2234B28916F7434a84930B2347J97260
18285B19607E0372c3552o5878p993j95428j1287e7507j50677A97135c2605j98434
18274b31039h5029m1002a3685j5735E344L9459c79996P6464A52165b95074C32051
18262d31789A42333a6071k73k87525A4657J86065P214a34977J4512C34894j51266
18251A83628c32394i3039D598i1049j28688P6595f2479M515k09400i9970o339
18240a06309b1383j4497E2030a96632j62236I0495b75783A49573O2974a47562
18229A16146c17344d2435A3051a08710k4856q5801B73992A14355a69943O7219
18219a02724B04860F7167f0842B77332h7874J4571B58609b3296j20198A92714
$$ plain form
18296 -330285 -212754 -55504 72010 89402 57136 -12234 228916 67434 -184930 22347 219607
18285 219607 50372 -33552 -99430 -107423 -302851 -314138 -57507 -208184 197135 -32605 -231039
18274 -231039 -85029 -126031 -13685 -29420 5344 44803 -379996 -303532 152165 -295074 332051
18262 -431789 142333 -16071 -16344 -303869 14657 200722 207936 -134977 -120465 334894 183628
18251 183628 -332394 -93039 4598 -91049 -219737 -143142 -62479 -57964 -267364 -99970 -106309
18240 -106309 -21383 -35880 52030 -196632 -358868 90495 -275783 149573 212547 -147562
18229 116146 -317344 -42435 13051 -108710 -133566 -219367 273992 114355 -169943 -102724
18219 -102724 204860 67167 -60842 277332 -87874 -73303 258609 -23296 -143494 192714
18208A90438q0703e8948j1964p5728d0862k37590c2623o8914A24744a93369A9293
18196e7933o0669o6761c5256q9513C4069O7637n0116M9179A6817d2753r7742O0790
18184g9705j87080h843j952k44828g7116A4421a98222A68240C2547g2322r4738
18173a67060M5036M7328A34969c18556Q8183g5836n4456p9109B71465A23230h1572
18161c9509A20874b44985C4214f3068A3780C524a37977A5425L8049A8635K08226
18150B26861b8534H1211A8671b02472Q8418j5629A00967D0076a85492f9928A34880
18138a76107e8605a4296A96893a19456j9634r7062A1538K33352c05569o9380R9700
18127b75249A15713a30106O232C879a8878m7063j2927A49388d4921A86683O1772
$$ plain form
18208 190438 109735 -58948 -70912 -146640 -40862 -278452 -32623 -101537 124744 -193369 19293
18196 -57933 -118602 -185363 -35256 -124769 34069 101706 51590 100769 16817 -42753 -140495 -79705
18184 -79705 -266785 -8843 -10795 -255623 -77116 14421 -198222 168240 32547 -72322 -167060
18173 -167060 -122024 -74696 134969 -318556 -230373 -75836 -130292 -209401 271465 123230 -81572
18161 -39509 120874 -244985 34214 -63068 13780 3524 -137977 15425 53474 18635 226861
18150 226861 -28534 81211 18671 -202472 -114054 -129683 100967 40076 -185492 -69928 134880
18138 -176107 -58605 -14296 196893 -119456 -139090 -236152 11538 244890 -305569 -374949 -275249
18127 -275249 115713 -130106 -123874 3879 -18878 -65941 -78868 149388 -44921 186683 248455
18116B48455h3399b4179C90199o4197C8170a01648p6668O9113q8568F1564B1667
18104a77111C47725a06632j69219B55525A03783e2165j45025B60105b25964a2248
18093c5871A47911C922M8695b1985j76395M076B66232I43N6328O5226D5910J1566
18081E7476c72084b9589A36939c1239H9562a70373b8489p6950q1101d6398E1984
18069a43936A02938b15700a4760A98991f2038j170E5240J72388a04024I8423J80148
18058B78571a97982C8193L55942F4385a27474f1313B13213a146j03098A03889
18047a38138p0753E2522J01298b44861J14338C4679e9677k39653m838a2672D2273
18035a88381f4270r152j27154K0594I4936a47292O750f7193B13163A00864f1206
$$ plain form
18116 248455 -83399 -24179 390199 326002 38170 -101648 -178316 -109203 -197771 61564 21667
18104 -177111 347725 -106632 -275851 255525 103783 -52165 -197190 260105 -225964 -12248
18093 -35871 147911 3922 52617 -21985 -198380 -194304 266232 943 57271 122497 45910 57476
18081 57476 -372084 -29589 136939 -31239 89562 -170373 -28489 -105439 -186540 -46398 51984
18069 -143936 102938 -215700 -14760 198991 -62038 -63208 55240 227628 -104024 98423 278571
18058 278571 -197982 38193 394135 64385 -127474 -61313 213213 -1146 -104244 103889
18047 -138138 -208891 52522 153820 -244861 -130523 34679 -59677 -299330 -304168 -12672 42273
18035 -188381 -64270 -73422 -200576 -179982 94936 -147292 -140542 -67193 213163 100864 -61206
18023H4768b06943o466c3775D7197K4657O0287k4516a20677k18903J22928g3243
18011G6804R1008a63093C7037M8308J10163a75755C1796K2576J03995J782c66894
17999C1331a96696m2734N4987d2392C93890b19615B86077d1293E007J09527M4931
17988A59465b0366A8582b08036B8213J07702A3976a3560p1261m953d1456l77570
17977d19026d0747A64484a60130A9530a18036N0085A47769o6501d4288j1969o1977
17966a18234A82136c29062f1281H7777n150J0058b15155B65373A17525j6972b20785
17954a14052e3904A40371a10442A80421D1304e6381k45106A83486q9604g8707
17943a33159D27386K0094j67759a09162A00353e2630j58094O1041P1339b1403
$$ plain form
18023 84768 -206943 -213409 -33775 47197 71854 132141 107625 -120677 -339580 -216652 -73243
18011 76804 167812 -163093 37037 85345 195508 -175755 31796 54372 158367 160149 -366894
17999 31331 -196696 -239430 -184443 -42392 393890 -219615 286077 -41293 5007 114534 159465
17988 159465 -20366 18582 -208036 28213 135915 13976 -13560 -84821 -89774 -41456 -419026
17977 -419026 -40747 164484 -160130 19530 -118036 -67951 147769 81268 -44288 -56257 -118234
17966 -118234 182136 -329062 -61281 87777 82627 92685 -215155 265373 117525 100553 -220785
17954 -114052 -53904 140371 -110442 180421 41304 -56381 -301487 183486 93882 -78707
17943 -133159 427386 447480 279721 -109162 100353 -52630 -210724 -149683 -78344 -21403
17932A00982f7117G2379b9521r0364G1809c334F6503R4566C6874a62370B24216
17920A19978a34440A8668J13104a46714f8475J3486h198r0124K863j54768E0035
17908A40874c27829r6206A7717J06710g6584n792M76A69606f6280A35219j2218
17897A23001O9559B4859J19147M016F6086a6062k09103c2618r7670c9721A02425
17885B51674C8804a11786J8164b8533A86263F4173J06086J105e7071j20932J1667
17874a66336B580J16979r480R2983a0784B19743h9753C4701e6198k74990a19503
17862A91994A954a71971H7567c04062A14623b7227g060A5593a15944a3643j28908
17851a42551e4059j7561F3496L2967C6302b2856j45502I1208d6034j05575K0777
$$ plain form
17932 100982 -67117 72379 -29521 -119885 71809 -3334 66503 161069 36874 -162370 224216
17920 119978 -134440 18668 131772 -146714 -68475 -54989 -8198 -98322 -95459 -250227 50035
17908 140874 -327829 -424035 17717 124427 -76584 -82376 -81900 169606 -66280 135219 123001
17897 123001 192560 24859 144006 148022 66086 -16062 -225165 -32618 -130288 -39721 102425
17885 251674 38804 -111786 -93622 -28533 186263 64173 170259 171364 -57071 -178003 -166336
17874 -166336 2580 119559 110079 203062 -10784 219743 -89753 34701 -56198 -331188 -119503
17862 191994 1954 -171971 87567 -304062 114623 -27227 -7060 15593 -115944 -13643 -142551
17851 -142551 -54059 -71620 63496 96463 36302 -22856 -168358 91208 -46034 -151609 -130832
17840a30832j57412B95228l7868d8982A71692a08942l5496c3357A27435M058E7676
17828A42401J047N0000K59185j30092h388A46096D2674O7296c032C6904a73031
17816b86499D0739O7254P0216r013J53926j60334J0131E9863K04595g6578p3786
17805a50364e7412A48315J1584a35166c2096F9582K66990a50914f9474A39824
17794e3347m4600G6795O0355d1194A388L3629b19040m83B57893H9223a22693A40777
17781B03659J03278C4958d22511a43217d4862o1547c8199G3033a50188L6629B5531
17769C5045a36359j02032B15822d4199B2676b06358B7130L75310A0231a61188
17758D05439A67870a80893C40405a22171B5235R7232f9899B66820e9845D8574
$$ plain form
17840 -130832 -288244 295228 257360 -48982 171692 -108942 -144438 -33357 127435 131493 57676
17828 142401 143448 193448 452633 322541 -8388 146096 42674 109970 -3032 36904 -173031
17816 -286499 40739 107993 178209 169196 323122 162788 172919 59863 264458 -76578 -150364
17805 -150364 -57412 148315 159899 -135166 -32096 69582 336572 -150914 -69474 139824
17794 -53347 -97947 76795 137150 -41194 1388 35017 -219040 -219523 257893 89223 -122693 140777
17781 203659 306937 34958 -422511 -143217 -44862 -106409 -38199 73033 -150188 -113559 25531
17769 35045 -136359 -238391 215822 -44199 22676 -206358 27130 402440 10231 -161188
17758 405439 167870 -180893 340405 -122171 25235 122467 -69899 266820 -59845 48574
17747F3364a56943P5749j85692A49930j6155A8071M8036L37158D6106P1547P0061
17736A87714m1061m6204O3746n5740b25126E5574K67933a27336o6880A19979b78544
17724b7877j00022C48855c00486B69078A0381e2321A6966J35536c4097j9884a7424
17712C81270h3555A71064g6872A72957E7988B5748J8303K53234p4087b7391m9247
17701g6638D9597L19934j56104n9673e666r3669A94268N3732J82603E1813J77111
17690B28924m5587K7910L8641b59385A35474J29477C6094K2885J4468d8012f227
17678a35976A76130b28733G3981N8139n5162J0989l3940P6645b37155e8350a0007
17666g2091A4431R6824J93300A01847Q4799a60663L6788j83609D9037a81210B14927
$$ plain form
17747 63364 -156943 -81194 -266886 149930 133775 18071 66107 403265 46106 117653 187714
17736 187714 146653 100449 164195 108455 -225126 55574 323507 -127336 -194216 119979 -278544
17724 -27877 -127899 348855 -300486 269078 10381 -52321 16966 152502 -34097 -53981 -17424
17712 381270 -83555 171064 -76872 172957 57988 25748 44051 297285 223198 -27391 -76638
17701 -76638 49597 369531 213427 153754 -5666 -99335 194268 248000 430603 51813 228924
17690 228924 183337 211247 249888 -259385 135474 264951 36094 58979 73447 -48012 -6227
17678 -135976 176130 -228733 73981 132120 76958 87947 54007 130652 -237155 -58350 -10007
17666 -72091 14431 111255 304555 101847 186646 -160663 -123875 -307484 49037 -181210 214927
17654c7537j32001A84157b16836B90499D83O0779J01608f7889D09402I3437J8699
17643A12136k0181B3225Q9501l5913A1671d332F2330R821c4048B27830h1220b1981
17630C7403K74005a06313A73675J62674A52982K52144A75326K8425B2720a2067
17619b06614i6296A79336k6109J34340b35609P3760D55978a59391A97315a8323
17608I6950C4280a88229B44145C1284K27251j28179e278D4652b48676O7316D5552
17596H2389b10149A3795a0799B26520H582K05848a45214B8356b5828n4244r8586
17585a78658C04422j23160b92729A78091J8495n1521P7324P6199F1325K41266
17575C02591b37527A89796e9814o6474A09379D510L48685g3359n3881M1134C33863
$$ plain form
17654 -37537 -169538 184157 -216836 290499 483 61262 162870 -67889 409402 93437 112136
17643 112136 91955 23225 112726 76813 11671 -4332 62330 72151 -34048 227830 -81220 -21981
17630 37403 311408 -106313 173675 336349 152982 405126 175326 203751 22720 -12067
17619 -206614 -96296 179336 153227 287567 -235609 -161849 455978 -159391 197315 -18323
17608 96950 34280 -188229 244145 31284 258535 130356 -5278 44652 -248676 -181360 45552
17596 82389 -210149 13795 -10799 226520 8582 214430 -145214 28356 -25828 -80072 -178658
17585 -178658 304422 181262 -292729 178091 196586 145065 222389 298588 61325 302591
17575 302591 -237527 189796 -59814 -126288 109379 4510 353195 -73359 -127240 -86106 333863
17563F2333J26528G0782J78707G4111Q9940n1898j5157J3479M04973A31947Q9122
17552B21069a64400C51426a1639A29567C1598K85716l2461e0596D4547B389M8609
17541E0998N3097J8030A9164L26549Q1620g6354B60611q0870e153k3091C37106
17529I2650L44588a43862B52603A07145J75436P9940p8909j40444o3266O8998
17519A48900K130N1449b40095A63255L26254j34497K3002J58745m2805p8337K8675
17508D44292j42285L28671j16313K36000B93562L66565A18329L25873j80726L8201
17498C01677N6494j3957J61073j15685r6156M85607l34433M23839k82742O7582
17488F53299B59939Q7015K19838A71024K4577l8535K5405D9971J64542R4047B8377
$$ plain form
17563 62333 188861 70782 249489 74111 164051 112153 96996 110475 515448 131947 221069
17552 221069 -164400 351426 -11639 129567 31598 317314 284853 -50596 44547 2389 50998
17541 50998 104095 122125 19164 345713 427333 -76354 260611 179741 -5153 -28244 337106
17529 92650 437238 -143862 252603 107145 282581 362521 283612 143168 79902 148900
17519 148900 151030 202479 -240095 163255 489509 355012 378014 536759 493954 415617 444292
17508 444292 302007 630678 514365 750365 293562 660127 118329 444202 263476 301677
17498 301677 358171 344214 505287 389602 293446 779053 444620 868459 585717 653299
17488 653299 259939 346954 566792 171024 195601 157066 182471 49971 214513 308560 28377
17476D36837M3778q7793j43511L9132a2728A09760K79251A08697J20468A08449
17465A41102n7664L7188i521B92137q7128l9288L12144O4572j04796A22934L01087
17454D24021j16244E7318a0561A05198l8126J38462G2615J96961r5772J60802
17444C34606j07963M5382j6055j6634P1733J2390M7956p9492J83665p9915r3996
17433C01677a3319B67328K28202A99550K04922A80246K44001j84694N2039J87316
17423D78908j54051J7578J48992j31239J48099e190D66346K67105H6763J60445
17413B47208p183N7120M3219A31386J7261p302K40820A54077P1004E7902K83433
17402C41335M6811j62948L34384c6912G69607C49219A7532L25029R7091b6010
$$ plain form
17476 436837 480615 392822 249311 288443 -12728 109760 389011 108697 229165 108449
17465 141102 83438 120626 -9521 292137 205009 165721 477865 542437 437641 122934 424021
17454 424021 307777 57318 -10561 105198 67072 205534 72615 269576 173804 334606
17444 334606 226643 272025 255970 239336 311069 323459 371415 291923 475588 395673 301677
17433 301677 -13319 267328 495530 199550 404472 180246 424247 239553 291592 478908
17423 478908 324857 342435 491427 360188 508287 -5190 466346 733451 86763 247208
17413 247208 240025 297145 340364 131386 148647 141345 382165 154077 225081 57902 341335
17402 341335 388146 225198 559582 -36912 769607 349219 17532 342561 439652 -26010
17391B60603J16007L311q1497j1960J35438h1654D19290f1468B26166H5698l650
17380H2048P5012M52414B53396m4918L25662k55307O9387H3132L76470b40957
17369E88215B58967G5056K72194o2875A17572K19969a20784b9827D08322e2881
17358h7656A36847K31769j84197N8670A19669M34611A03287Q395J88819a40851
17347D18771e270A34441f6399i567A59710M04850j42839B06744J71918B2619J11860
17336A34479N123K6485J73878j23721d7468A52056n5121L27161j32078O7108A55039
17324c9377C38359j35579k3937M6843F7675L42330n9028I8631L41685A98462K11854
17313D10316I7833O0066M25882C3440J7672K77217D5653K36185J08554C2174L09446
$$ plain form
17391 260603 376610 379921 298424 286464 421902 -81654 419290 -61468 226166 85698 82048
17380 82048 157060 609474 253396 208478 534140 278833 348220 83132 459602 -240957
17369 588215 258967 75056 347250 284375 117572 337541 -120784 -29827 408322 -52881
17358 -87656 136847 368616 184419 243089 119669 554280 103287 111682 300501 -140851
17347 418771 -5270 134441 -66399 -9567 159710 564560 421721 206744 378662 22619 134479
17336 134479 139602 166087 339965 216244 -47468 152056 96935 424096 292018 359126 155039
17324 -39377 338359 202780 178843 225686 67675 410005 350977 98631 440316 198462 410316
17313 410316 97833 157899 583781 33440 51112 328329 45653 281838 390392 32174 341620
17302C41620J15873j8424A9635J64854M38163j86662j15291J12423j49075J90253
17292D74300C2384K72018o5015a32105B27267K7401j15693M7795q2715K77411
17282C81466n5115p7763L13363A12188J00327a00412A0193M88377C4076L45171
17272C79247N821j6908A53782B8188L8822J52267J72426A94997J88504j08750
17262B74751o6480L03170A79333J17362D7687J95489M6450J08443A64008K21056
17252C85064p1891q3759E9748N62387k02871A97515K54911N2454A21708K40342
17242C62050j03569l1132h7020B12532M37401k39359n7536j52812L06417C2998
17231g1488E90711B42572c2889A71268J53771C9407J43251J39313Q4453j15234
$$ plain form
17302 341620 457493 439069 19635 184489 622652 435990 320699 433122 284047 474300
17292 474300 32384 304402 239387 -132105 227267 254668 138975 186770 104055 381466
17282 381466 326351 248588 561951 112188 212515 -100412 10193 498570 34076 379247
17272 379247 385068 368160 153782 28188 67010 219277 391703 194997 383501 274751
17262 274751 208271 511441 179333 296695 47687 243176 289626 398069 164008 385064
17252 385064 313173 229414 59748 622135 419264 197515 452426 504880 121708 362050
17242 362050 258481 227349 -87020 212532 649933 410574 353038 200226 506643 32998
17231 -71488 590711 242572 -32889 171268 325039 39407 182658 321971 406424 291190
17221B91190J38336J00831B35818o1903L27328j5757O5002F9495R5542D850K26211
17210B31061K92881A60488J58429A22983K75288C3748L33845j11715K90021j35636
17200D10263j71548J31882N1712p9642M1869G3349K78075q1931J02952K95936
17190F68381l5772l05137Q0885A21855M25523B01756L13324B52733o2757O118
17180A96094K49166n9489J03188q1659J10426B28655G5624J07727m4170K7250
17170A66431L48936o1108o728j90657L86672k48016C8864M30451B27676K57330
17160D85006j88560J12172L04682l7405B60186L9580q114M13588k74656Q0157
17150E10741m7623L8992A15935G014J60813K97234j20718K08259q9227H7864P454
$$ plain form
17221 291190 429526 530357 235818 173915 501243 485486 550488 69495 165037 4850 231061
17210 231061 523942 160488 318917 122983 398271 33748 367593 255878 545899 410263
17200 410263 238715 370597 422309 342667 384536 73349 351424 269493 372445 668381
17190 668381 632609 327472 408357 121855 547378 201756 515080 252733 189976 196094
17180 196094 445260 385771 488959 407300 517726 228655 75624 183351 139181 166431
17170 166431 515367 454259 447531 256874 643546 395530 38864 469315 227676 485006
17160 485006 296446 408618 713300 675895 260186 299766 291652 705240 430584 510741
17150 510741 463118 502110 115935 7014 167827 465061 344343 552602 463375 87864 95318
17139I5318M9218M49742O2807n755B84032N58131j46089k62079o7371p4012J74403
17128D67015r9638j48151k1040j95K38113A67567K85735N4289P2621k40098L1156
17117C71270J5305J69482J7825m6135K23142l00422j12708J73425n1640A70216
17106D36851j6013j15164L93124P971J6999j92701j38859J78226k58819L82707
17096F94322C42738M83979j70652k64885J64405A22810M28908k47721J21785L488
17086D29270j2817M43166l87867j28325J21839K97939K35327C77608Q2237j29909
17076C29936K13606E5619M19361N308K13385k00090j95232M62980j65989M822
17066F00164B71665J35021j61913L70456K8659p9239l1187J08654j87702L34935
$$ plain form
17139 95318 144536 594278 657085 651330 284032 842163 696074 433995 366624 292612 467015
17128 467015 367377 219226 198186 197991 436104 167567 453302 507591 580212 340114 371270
17117 371270 386575 556057 573882 527747 750889 450467 337759 511184 459544 170216
17106 436851 420838 305674 698798 706769 723768 531067 392208 570434 311615 694322
17096 694322 342738 826717 656065 391180 555585 122810 551718 303997 425782 429270
17086 429270 416453 859619 471752 343427 465266 763205 998532 377608 459845 329936
17076 329936 543542 55619 474980 480288 693673 493583 298351 761331 595342 600164
17066 600164 271665 406686 244773 615229 643888 564649 533462 642116 454414 789349
17056G89349j64859L2575j99327K9945n6287j22654O81604l83708P2369j79864
17046D99143o8618L40979q8488o0032k81789K63029R1204j01204J09108K57712
17036I61044k15544j80698J67627Q73j16492L2206q2857O5685L02506k02259M5554
17025G77645k00060J15800n4115k52581M94489q4887r8710J76853O5399l5270
17015I04563o4301j1676J3730l14096K52380m8036L212R8976j88765N42495E86519
17003A000691j97618k66945J20869K78314j72966K55672D69702K53073M72480
16994A195255P6281m19871J69829k96357J90827r993J12077M9694p1179j4043
16984I82520J88935k83114j3260j78023L83466N1856k26699K6485J24794n1742
$$ plain form
17056 789349 624490 657065 457738 487683 431396 308742 990346 606638 679007 499143
17046 499143 430525 771504 683016 622984 341195 604224 695428 594224 703332 961044
17036 961044 745500 564802 732429 733302 616810 649016 566159 631844 934350 732091 777645
17025 777645 577585 693385 639270 386689 881178 796291 697581 874434 939833 904563
17015 904563 840262 828586 842316 528220 780600 732564 735776 834752 645987 1188482 586519
17003 1000691 803073 536128 656997 935311 762345 1018017 469702 722775 1195255
16994 1195255 1271536 851665 1021494 725137 915964 905971 1018048 1067742 996563 982520
16984 982520 1171455 888341 875081 697058 1080524 1132380 905681 932166 1056960 1005218
16974A005218P5123j3077m2156k65773K05255j7235M50766k79696J8239M4537
16964A181201K1993k91603K65867j92167L53436l07938L88011r0999K03571m43852
16954A087520J4999L31963k12768j28675J56082j50464Q0075L39552l01302l07347
16944I09635L82149l1449J97407L6669J41623k97428O8740L08504k69356o270
16934A440224N876L37194m56736K69788k96214K34780j34600J5593J94461n08140
16924A102226K47185K35247r4909L43508k45205j59241K55999K70480m48169J76384
16914A683505Q6255J89056k15460L1998J2763j01922J89324N3880k56269j42238
16904A530892K75423K00131o0234o4503M27162k61368k4103k48430K57281R7265
$$ plain form
16974 1005218 1080341 1067264 1025108 759335 964590 947355 1398121 1118425 1136664 1181201
16964 1181201 1203194 911591 1177458 985291 1338727 1030789 1418800 1327801 1531372 1087520
16954 1087520 1102519 1434482 1221714 1093039 1249121 1098657 1178732 1518284 1216982 909635
16944 909635 1291784 1260335 1457742 1494411 1636034 1338606 1407346 1715850 1446494 1440224
16934 1440224 1446100 1783294 1326558 1596346 1300132 1534912 1400312 1415905 1610366 1102226
16924 1102226 1349411 1584658 1489749 1833257 1588052 1428811 1684810 1955290 1507121 1683505
16914 1683505 1769760 1958816 1743356 1775354 1788117 1686195 1875519 1929399 1673130 1530892
16904 1530892 1806315 2006446 1946212 1881709 2308871 2047503 2023400 1774970 2032251 2129516
16894B129516l60440L90922j49410R2091j07657L35794q7960j9893P7171p8847
16884B221287k41380J54467J59749j77343K35739p1352L71174j08247j54235k69572
16874B120287K24840K18210M6835j05976Q6132J43947k99023M52220J44302l82246
16864B649528K37360r4489L50414l38045L55524M294j31320K19469Q1283l02286
16854C031732K53003M931J2590J38652P7611L00332k28538J7658K83424J52477
16844D043872n64877K54480L8117N65197r3964l33922M82295m80144O2597O69024
16834D642675j61751n9319j40546N55908k18561J53124J62367j85275M08899Q3972
16824E241493k45440N66917r127O8755j02545K38220m09500L00310J76187m177
$$ plain form
16894 2129516 1769076 2159998 2010588 2102679 1995022 2330816 2242856 2222963 2300134 2221287
16884 2221287 1979907 2134374 2294123 2116780 2352519 2281167 2652341 2544094 2389859 2120287
16874 2120287 2345127 2563337 2610172 2504196 2590328 2734275 2435252 2887472 3031774 2649528
16864 2649528 2886888 2792399 3142813 2804768 3160292 3164586 3033266 3252735 3334018 3031732
16854 3031732 3284735 3289666 3302256 3440908 3518519 3818851 3590313 3607971 3891395 4043872
16844 4043872 3478995 3733475 3771592 4336789 4242825 3908903 4391198 3911054 3973651 4642675
16834 4642675 4480924 4421605 4281059 4836967 4618406 4771530 4933897 4748622 5157521 5241493
16824 5241493 4996053 5562970 5553843 5622598 5520053 5758273 5348773 5649083 5825270 5821093
16814E821093J72362L84975J6197J03941L92191r9041l16947J83588J61045P9084
16804F898488L28525Q7587M39223P9536k28735K75167K48520L58416O036l4879
16794H457884P90375k86391K59624K30296M83026j60066L83959J34004j1709M70940
16784A0751942k1296N29832M77424R7472Q4527O28530J77944L91760J44501O50510
16774A3913146N13991P3583M92200L31088N21283N62732K73288N75908M34466
16765A7691685J0988J260012J68837N90949P35384J061861L37415P92522P76056
16756B3425709N42325R93140R34578P61673J019120Q12638Q92814J386037N59151
16747C1327185J413285J374771J573631J198260J397380J701178J658965J445469
$$ plain form
16814 5821093 5993455 6378430 6394627 6498568 6890759 6791718 6474771 6658359 6819404 6898488
16804 6898488 7227013 7314600 7753823 7833359 7604624 7879791 8128311 8486727 8492763 8457884
16794 8457884 9248259 8961868 9221492 9451788 9934814 9774748 10158707 10292711 10281002 10751942
16784 10751942 10730646 11260478 11737902 11835374 11919901 12548431 12726375 13118135 13262636 13913146
16774 13913146 14427137 14500720 14992920 15324008 15845291 16408023 16681311 17257219 17691685
16765 17691685 17702673 18962685 19131522 19722471 20457855 21519716 21857131 22649653 23425709
16756 23425709 23968034 24961174 25895752 26657425 27676545 28489183 29381997 30768034 31327185
16747 31327185 32740470 34115241 35688872 36887132 38284512 39985690 41644655 43090124
16739D3090124J824041K606095J287747K217503K168136K344902K304845K830887
16731F0674280K608232K910017K536612L379515L063260L620722L341951L376830
16723H5511419M024168L605124L653526M039058M031235M249905L629444L991409
16715A16735288L495025L562117L424576L059057L117266K430389J848525J352544
16707A39024787J337090L86495K90047n10260q11871j716444j853188k675646
16699A33471010k417197l203995l426292l495162l337132m185580m088532m032255
16691A05284865m137846l877788l623477m305694l805280l677593l356333l687036
16683G4813818l228609l185243k919391l000505k827944k660127k342910k501391
$$ plain form
16739 43090124 44914165 47520260 48808007 51025510 53193646 55538548 57843393 60674280
16731 60674280 63282512 66192529 68729141 72108656 75171916 78792638 82134589 85511419
16723 85511419 89535587 93140711 96794237 100833295 104864530 109114435 112743879 116735288
16715 116735288 120230313 123792430 127217006 130276063 133393329 135823718 137672243 139024787
16707 139024787 140361877 140748372 141038419 140528159 139716288 137999844 136146656 133471010
16699 133471010 131053813 127849818 124423526 120928364 117591232 113405652 109317120 105284865
16691 105284865 101147019 97269231 93645754 89340060 85534780 81857187 78500854 74813818
16683 74813818 71585209 68399966 65480575 62480070 59652126 56991999 54649089 52147698
16675E2147698k209451k160408j860048j821822k091667k072338j617633j343346
16667C6970985j577139j411571j275877j167661r44595j342828q84092j267829
16659B7099393p43733j133690r40815q93183p55973l98666j143921n06783o98042
16650A9884587n53897q14004l87974p33995j23013r25829l64879n60913m83830
16641A4936253k25077n44880n62743k91986m12915l66104j51585l39583m9667
16632A1991713m06273l48904o2276n74813j74552l69376n78440k12086J12062
16623I377055k10330o2311j72525m18909j4210l28354n64058K69204j6915m2118
16613G816529o26736j53098j75091L4787l43941N5676J84737o86724M4490l3981
$$ plain form
16675 52147698 49938247 47777839 45917791 44095969 42004302 39931964 38314331 36970985
16667 36970985 35393846 33982275 32706398 31538737 30594142 29251314 28367222 27099393
16659 27099393 26355660 25221970 24281155 23387972 22631999 22233333 21089412 20582629 19884587
16650 19884587 19330690 18516686 18128712 17394717 17271704 16345875 15980996 15420083 14936253
16641 14936253 14711176 14166296 13603553 13311567 12898652 12532548 12380963 12041380 11991713
16632 11991713 11585440 11236536 11174260 10599447 10424895 10055519 9477079 9264993 9377055
16623 9377055 9166725 9104414 8931889 8512980 8498770 8170416 7606358 7875562 7858647 7816529
16613 7816529 7189793 7036695 6861604 6896391 6552450 6608126 6792863 6106139 6150629 6116648
16603F116648l39845r0826J8821O5131l06152J11394n14748m3653P2425j15527
16593D973668o7295L09363n05957Q2702Q6405m93376K36703l03943j42146r0786
16583D085338r7896J26314m7434K26492m99716j24094M15364j12081m47093N01150
16573D026344m05349m9706r9903L05700n766l05287K1427k6531j47957k18717
16563C094255J87718m83425k4421K11127j44012m5927R1674J13021j60685l45011
16553B494314L55600k21507K2681L14840n72423K35059j96466o4191k80951J64508
16543B251464K90563J93519n36178j93912J09355R6802q8207j67178o1121M73214
16533B368321l27464j47125p7099L72641l87748j59263O43001j77584l82839O0639
$$ plain form
16603 6116648 5776803 5685977 5704798 5769929 5463777 5575171 5060423 5016770 5089195 4973668
16593 4973668 4906373 5215736 4709779 4792481 4878886 4385510 4622213 4318270 4176124 4085338
16583 4085338 3987442 4113756 4066322 4292814 3793098 3669004 4084368 3972287 3525194 4026344
16573 4026344 3620995 3571289 3471386 3777086 3771320 3466033 3487460 3460929 3312972 3094255
16563 3094255 3281973 2798548 2774127 2985254 2841242 2795315 2886989 3000010 2839325 2494314
16553 2494314 2849914 2628407 2651088 2965928 2393505 2628564 2432098 2367907 2086956 2251464
16543 2251464 2542027 2735546 2199368 2005456 2114811 2211613 2123406 1956228 1895107 2368321
16533 2368321 2040857 1893732 1816633 2189274 1801526 1642263 2285264 2107680 1724841 1785480
16523A785480N24204k49177P4080k28123N6226k36938q3876K51459L0208j3686
16513A909857m22304Q5283O6255M9222O19k67976K77254j38557M8537L68077l67403
16502A608864q3050J72227m65762L03317J72293O6281n06441J0185J56345l35315
16492A098944K16630L27273j46857N162j30577P4317Q7881l0375k86255J03342
16482A319485K85294m34434j2804j5134L14132n31690K79545j31790J30008p2080
16472A130532Q957P659q9819m1281M2730J82339j80078j8874P8352O6211O0029
16461A246757p5149M4018J58726j20145k96646l65388M53934k39260L39850J61117
16451A307814O8277n14030m2900k22079M32210k61438J81416L0511k59940K89206
$$ plain form
16523 1785480 2309684 2060507 2134587 1906464 1962690 1725752 1641876 1893335 1923543 1909857
16513 1909857 1487553 1572836 1639091 1688313 1688932 1420956 1698210 1559653 1608190 1976267 1608864
16502 1608864 1525814 1698041 1232279 1535596 1707889 1774170 1267729 1277914 1434259 1098944
16492 1098944 1315574 1642847 1495990 1501152 1370575 1444892 1532773 1502398 1216143 1319485
16482 1319485 1604779 1170345 1157541 1142407 1456539 924849 1204394 1072604 1202612 1130532
16472 1130532 1139489 1147148 1057329 1016048 1058778 1241117 1061039 1042165 1120517 1186728 1246757
16461 1246757 1171608 1215626 1374352 1254207 957561 592173 1046107 806847 1146697 1307814
16451 1307814 1376091 862061 819161 597082 1029292 767854 949270 979781 719841 1009047
16441A009047m5445k2015j30301Q4866j32529J41767K15964l89158r3777K58722
16431H97141n5343O3310K3498p147j46232o7028J71459K5401n5089q1879M4494
16420H12585j361K58379k9557r4301j35221j18647j1180L66000j68011p2233j06499
16409F99954m0350o3129J81660k01605q3896J25263k24186j541K47031L01660
16399I40861m12338j00741M54300l36982J12772L87186l21456k6157B44241O8428
16389C12669M10837L0464l26717L99457j31900M5236l6192k35300J86963B83381
16378C73105K44420B80780J17879L80724C87893k2516J5000P3070q4920J29423
16368D97950J3925J24007Q5843j87428K05397j04192k39373A90745N67436l59593
$$ plain form
16441 1009047 963602 941587 811286 896152 763623 905390 1121354 732196 638419 897141
16431 897141 841798 905108 928606 921459 775227 708199 879658 905059 849970 768091 812585
16420 812585 811224 1069603 1040046 945745 810524 691877 680697 1046697 878686 806453 699954
16409 699954 659604 596475 778135 576530 492634 617897 393711 392170 639201 940861
16399 940861 528523 427782 882082 545100 657872 1045058 723602 697445 244241 312669
16389 312669 723506 753970 427253 826710 694810 740046 703854 468554 655517 283381
16378 373105 617525 280780 398659 779383 387893 365377 380377 453447 368527 497950
16368 497950 511875 635882 721725 534297 739694 635502 396129 190745 758181 398588
16358C98588N34358k43302r8009A81549P24500l69196n474j53821J16412L13329
16348H07299l48086J00044k52059j39097K05167M3818N6986J86588J5298k33627
16338D42331o2872J45868j00380A5547L84685r4250O5178M28380k27925R7780
16328F69395k31150K80708k05401A41079M29551j45444K03153j38015J21604B48658
16317A66951K43470j53287R5360a647B77085O1361J4246K92669k20966o8382A11652
16305A70561J07469j9863L19977j68605A78955K28947J65163k39790j14010J19218
16295C38483C3188L56122J11269K93132C14001L1477K91883I7545K47982R6563
16285D42090A59927P8545J27966p6113j23832d5348C76014Q9147A76348K89779
$$ plain form
16358 398588 932946 689644 591635 181549 906049 536853 531379 377558 493970 807299
16348 807299 459213 559257 307198 168101 373268 417086 474072 660660 675958 442331
16338 442331 379459 525327 424947 15547 400232 305982 371160 799540 571615 669395
16328 669395 438245 718953 513552 141079 570630 425186 628339 490324 611928 248658
16317 166951 410421 257134 352494 -1647 277085 338446 352692 645361 424395 356013 111652
16305 170561 278030 258167 578144 409539 178955 407902 573065 333275 219265 338483
16295 338483 33188 389310 500579 793711 314001 345478 637361 97545 345527 442090
16285 442090 159927 238472 366438 290325 166493 -45348 376014 465161 176348 466127
16275D66127j65849J18353L34978B62728n1077M72159A72580O0201L71118A61732
16264B97818j03797L01832q6139A93360J05643L6248j31120J42972e9367A06280
16253B19321G8530M6907n3695O34672B87258J0776L069o5442J01450o6729j14184
16242A56198J41935J3810m8696B6358J60085N8759J82257j54889j34066Q6124
16232B24628j08664m2086K80470N5019A93704d2076g532j13992D10913A3610a93244
16220D9319J79212L2695o0455P3296q2403i7920a1658C1157Q7217O5280L3424
16209B17078m0177M8163I3029K29750o6604k9044K4653a97954C87397j37965F6648
16197D10375j75397K54049h4540A216O9598M7167M7800a0253A80705K09202I7218
$$ plain form
16275 466127 300278 418631 753609 262728 211651 683810 172580 232781 603899 161732
16264 297818 194021 495853 409714 193360 299003 335251 204131 347103 -59367 106280
16253 219321 78530 125437 71742 706414 287258 298034 301103 235661 337111 270382 156198
16242 156198 298133 311943 263247 26358 186443 245202 427459 272570 138504 224628
16232 224628 115964 73878 354348 409367 193704 -42076 -7532 -121524 410913 13610 -193244
16220 49319 228531 261226 200771 274067 191664 -97920 -11658 31157 118374 183654 217078
16209 217078 176901 225064 93029 322779 256175 227131 251784 -197954 387397 249432 66648
16197 410375 234978 489027 -84540 1216 70814 117981 165781 -10253 180705 389907 97218
16185B11659m3134E9179M7799a25321B6091K65287a5079I4132J01496m1515Q3009
16174B37122J99068A8251M3114J21296J82142G1236Q4214K12904o6052G4319M1822
16163A16141m335k1999j8964J69088J3543r7380J72206j41931e3293E5540L908
16152E9448a19833B12240c4642D665K7568K79419J75015B9856a74592B9998a37781
16140I1698O8172M182o5052K50334J3574A74983p9695J29804b6161B66506a40201
16128A64440a02101a9572E8701J08794a84079j08451C79902a73199j02396N2045
16118b23550C09819O5759A55087J60035N4800d2953B44905n6398F1413b27037
16107a16909c7580p941C00432b19909C31811C8226L88891G2809k8028M1079A0204
$$ plain form
16185 211659 168525 59179 106978 -125321 26091 291378 -15079 94132 195628 154113 237122
16174 237122 436190 18251 61365 182661 364803 71236 155450 368354 302302 74319 116141
16163 116141 111806 89807 70843 239931 253474 156094 328300 186369 -53293 55540 59448
16152 59448 -119833 212240 -34642 4665 32233 311652 486667 29856 -174592 29998 -137781
16140 91698 159870 164052 99000 349334 362908 174983 95288 225092 -26161 266506 -140201
16128 164440 -102101 -19572 58701 167495 -184079 -292530 379902 -173199 -275595 -223550
16118 -223550 309819 375578 155087 315122 369922 -42953 244905 188507 61413 -227037
16107 -116909 -37580 -45521 300432 -219909 331811 38226 427117 72809 44781 85860 10204
16095B11590A02131a49347E6336a21022C1765b72033A01719I199a58614C90070
16084B40926C0574J16368j9713E3661A756J72831M0087A4124h5889C509b08924
16072G0020l580i478j07957A10160e1934A59766a37722D2175K22405A27894d58637
16060A07194a23135H7572h4949r7151h8856H2689a46776K349A45686E2460K37497
16049B89957A31228E1091b15180A33260a2842E3289K51513I7630D1676i4754G7998
16037a56414B89789M1215j1349a32774f887n8822A37300o1873L55998P3050a97088
16025a1290A43609b72404a17825B06176r5510c3360I4861i0421A5429m220J42544
16014A53753J38933A03107b11186c7225l22937P4275B1732L10308j27265l7861
$$ plain form
16095 211590 102131 -149347 56336 -121022 31765 -272033 101719 9199 -158614 390070
16084 240926 30574 146942 127229 53661 1756 174587 214674 14124 -85889 3509 -208924
16072 70020 66440 -9478 -117435 110160 -51934 159766 -137722 42175 264580 127894 -458637
16060 107194 -123135 87572 -84949 -182100 -88856 82689 -146776 -144427 145686 52460 289957
16049 289957 131228 51091 -215180 133260 -12842 53289 304802 97630 41676 -94754 77998
16037 -156414 289789 331004 319655 -132774 -6887 -65709 137300 75427 431425 504475 -197088
16025 -11290 143609 -272404 -117825 206176 110666 -33360 94861 -90421 15429 11209 153753
16014 153753 292686 103107 -211186 -37225 -360162 -285887 21732 332040 204775 166914
16004A66914K7423a09879C87928d220A5831a65774p7969F6947k1137A0749a20646
15992E13236a39682G2988J29430J8022d7226k96433c1260C16684b28269h6946
15981B80757c37224h0145c852E05853a10269C56505A06933m5578J25593K15913
15971D02861K1064K27532M57550k10710k21886k48640J0051j75947j06183J52081
15961C07773R0379A42957A0705K35099b6160A87854b54071D5417M73506A94030
15950A56095c01387a0851j05886L5576j9161H7643a37613A54226k4537J0589Q0369
15939B20647K52505f8803k32945a25358n0458D3475b80204k8369A45134a7254
15928b86485a30811L3378I1325K11164d07394a73613H0093b8869l27553g8282
$$ plain form
16004 166914 194337 -109879 387928 -4220 15831 -165774 -243743 66947 45810 10749 -120646
15992 513236 -139682 72988 202418 220440 -47226 -343659 -31260 316684 -228269 -86946
15981 280757 -337224 -80145 -3852 505853 -110269 356505 106933 61355 186948 402861
15971 402861 423925 651457 1109007 898297 676411 427771 437822 261875 155692 307773
15961 307773 398152 142957 10705 245804 -26160 187854 -254071 45417 518923 194030
15950 156095 -301387 -10851 -116737 -81161 -100322 87643 -137613 154226 129689 140278 220647
15939 220647 473152 -68803 -301748 -125358 -175816 43475 -280204 -308573 145134 -17254
15928 -286485 -130811 -97433 91325 302489 -407394 -173613 80093 -28869 -356422 -78282
15917H2979J77377B3650J83490l21a31910B8986L11640g0007B61953j26788f2677
15905A1167b750I9967a10418A6319c39442a53837a2937E4767P7324a05534B9576
15893a80959G4701J2250b537n5433l1303m7519B73106a73389f4695l89427a13208
15881B18884L058g959k7368j706l97219a80576M6979j53969G5922C7140a1793
15869b47664O1721h8337j04576B1407a71768A00054e7448k19701J26357A3439
15858a0814j45064N5684l0994p6304m45299D9297K02901K8869f9049C4205B435
15846b31962d2209A58001r313b1452j26498j1188A93927b56282C22118a44160
15835c6825a5061B44741a50137I0069a72187q3612B606g5546B44473b9465p8688
$$ plain form
15917 82979 260356 23650 207140 206819 -131910 28986 340626 -70007 261953 135165 -62677
15905 11167 -2750 99967 -110418 16319 -339442 -153837 -12937 54767 132091 -105534 29576
15893 -180959 74701 86951 -2537 -57970 -89273 -136792 273106 -173389 -64695 -454122 -113208
15881 218884 221942 -7959 -35327 -37033 -434252 -180576 -133597 -287566 75922 37140 -11793
15869 -247664 -185943 -88337 -192913 21407 -171768 100054 -57448 -277149 -150792 13439
15858 -10814 -155878 -100194 -131188 -207492 -652791 49297 252198 281067 -69049 34205 2435
15846 -231962 -42209 158001 148688 -21452 -147950 -159138 193927 -256282 322118 -144160
15835 -36825 -15061 244741 -150137 90069 -172187 -255799 2606 -75546 244473 -29465 -108153
15824a08153J4105l39202E3523a70416F7340J18867m9634J58c23204a31708j19803
15813b51511j5516C4478a70031r6200g8582L334n7888k7606j19537k16168b14344
15801a80310O2036c4176p2260k9997k22807F7091b00002C6704d3145A44576g7547
15789F7884K5296a26543A21123b12737E55549b78103J31053P0646c6697A97716
15778b94173C02681b35881G6778i3121C37664n3045j2330b13577L6457B37899
15767a71352A43152a70561B48611b78242a1038m16605a23461A28809d0065l13328
15757c53393f9383A4578g3472l04733p9666a64330B64296j9876g8084A11043e2029
15745b9641B41939j13211N4361a71911D4925b7047F4810O8233M6011l5004a31824
$$ plain form
15824 -108153 -94048 -433250 53523 -170416 67340 186207 136573 136731 -323204 -131708 -251511
15813 -251511 -267027 34478 -170031 -266231 -78582 -75248 -133136 -160742 -280279 -496447 -214344
15801 -180310 -118274 -34176 -106436 -136433 -359240 67091 -200002 36704 -43145 144576 -77547
15789 67884 93180 -126543 121123 -212737 555549 -278103 -147050 -76404 -36697 197716
15778 -294173 302681 -235881 76778 -93121 337664 284619 272289 -213577 -177120 237899
15767 -171352 143152 -170561 248611 -278242 -11038 -427643 -123461 128809 -40065 -353393
15757 -353393 -69383 14578 -73472 -378205 -457871 -164330 264296 244420 -78084 111043 -52029
15745 -29641 241939 128728 183089 -171911 44925 -27047 64810 133043 179054 144050 -131824
15733a22973e6137k57985A90058b337n213p8291B3214J61036D6196b49051b1320
15721b01482l7164A42031M784b47864B61570c01531B01999G9183a50059f6955
15710F2114a86461P7707F5316e3526C3248a6049E38b73537B6920M0882B0896a92625
15697c65196m6329a45215B45121b62286A77643b49817B66089k434J34531E3952
15686a52999B15394j05847g8174H4594g4308E7859a08588l74952A91928b58061
15675a70241A01563K25897H3245C9523K30264K2386R4726A19279K4951f2059A27381
15663a22569A4899a58094C00298f3083A14984d2466I8057L3568L198P6894p1760
15652A39957c29691c1815k94540A20124a58142A62379B7963P9506a22524D91262
$$ plain form
15733 -122973 -56137 -314122 190058 -2337 -7550 -85841 23214 184250 46196 -249051 -21320
15721 -201482 -238646 142031 146815 -247864 261570 -301531 201999 79183 -150059 -66955
15710 62114 -186461 -108754 65316 -53526 33248 -16049 538 -273537 26920 67802 20896 -192625
15697 -365196 -411525 -145215 245121 -262286 177643 -249817 266089 263655 398186 53952
15686 -152999 215394 109547 -78174 84594 -74308 57859 -108588 -483540 191928 -258061
15675 -170241 101563 327460 83245 39523 269787 292173 386899 119279 144230 -62059 127381
15663 -122569 14899 -158094 300298 -63083 114984 -42466 98057 131625 134823 211717 139957
15652 139957 -329691 -31815 -326355 120124 -158142 162379 27963 107469 -122524 491262
15641c55092a13684b6397A64526a50414O8951j23914g675D6764b45307I7378b90776
15629e2256j46825B6547Q5352a23239k61082a00710b8990B06302m5570i7771a4128
15617b9123B41200i3595o6384I3203A154M9335K25085a49209m2628H2430M1618
15606A24048c69977i5632a066H4279a1573F3542d2176A4457J55734i6428F2630
15594A48457m8043i0514n5954a6960j0234I1542C9943O6699E2841B2924a74143
15582h7618G5085b97390p9015B00454a1846j49628k5081f9117p571B23948e4409
15570a0598j20630K9010q0218B37653c55295A24251C9491b76843G8149K31523
15560C09672h7286H1434N1240b73131P7317k2467J3224f489A55707a84152h0541
$$ plain form
15641 -355092 -113684 -26397 164526 -150414 -81463 -205377 -7675 46764 -245307 97378 -290776
15629 -52256 -199081 26547 111899 -123239 -384321 -100710 -28990 206302 160732 -97771 -14128
15617 -29123 241200 -93595 -159979 93203 1154 50489 275574 -149209 -191837 82430 124048
15606 124048 -369977 -95632 -1066 84279 -11573 63542 -42176 14457 170191 -96428 62630
15594 148457 100414 -90514 -146468 -16960 -27194 91542 39943 106642 52841 22924 -174143
15582 -87618 75085 -297390 -376405 200454 -11846 -161474 -186555 -69117 -76688 223948 -54409
15570 -10598 -131228 -102218 -182436 237653 -355295 124251 39491 -276843 78149 309672
15560 309672 -87286 81434 132674 -273131 -195814 -218281 -205057 -6489 155707 -184152 -80541
15548f6295A15926a29801F3745N1590J09133F3481f3464g667r9935l8599h122
15536B02612b25762k9336A07501K19435b464l1244B5441b91279C7936J99470g6350
15524h2894o1327a0509F1709A4523e7981B35604a96351E4732L41734b3024E4758
15512b01976i9503A7599K3451d1214I6243j6051a67040I2768K46064E9168J1840
15501G1008h4751j6095J0565l7354A51400A2736Q8181J86207c6734A45664M873
15490A50537e5730D2996d2628C10034D1706L8111J14021a29276D37515b01314
15479F0867M3912J10087O7158H993b07993A04904J89264d6748C48798F8263a06178
15467D67812a02945j37135A16110O1002F5388b82046d8837c037p637D60012O2233
$$ plain form
15548 -66295 115926 -129801 63745 115335 224468 63481 -63464 -7667 -107602 -146201 -8122
15536 202612 -225762 -255098 107501 326936 -2464 -33708 25441 -291279 37936 237406 -76350
15524 -82894 -144221 -10509 61709 14523 -57981 235604 -196351 54732 396466 -23024 54758
15512 -201976 -99503 17599 41050 -41214 96243 80192 -167040 92768 338832 59168 71008
15501 71008 -84751 -100846 -90281 -127635 151400 12736 100917 287124 -36734 145664 150537
15490 150537 -55730 42996 -42628 310034 41706 79817 193838 -129276 437515 -201314
15479 60867 104779 214866 282024 8993 -207993 104904 294168 -46748 348798 68263 -106178
15467 467812 -102945 -240080 116110 177112 65388 -282046 -48837 -3037 -10674 460012 522245
15456E22245j62724A49293K46122j8813j16773L18866A85068G3974B6892d2408
15445B6228M0183J02236a26250G9636E570c63432b8482A76678g376A89193E2735
15433F7574j3844a49899d2917j82058H9932M40743D4707J14900K40949N06357
15423I06913l11053M41228A38208c3715H7987M1288i2j82590A44461E8484g607
15411h2172k06614c0890k09102A5825J20664j16J08566D9327A8414a59232B6830
15399A1133h8510o8883C04307F5421j2577b29260J04110A7115J15575a644I4689
15387B16988a42820p991j1100m8100B84847B8298c7787k6203B00699I119a0281
15375F5867L42869c4307A02904m3489e2397F8536J62865l2479a65975B82500c8205
$$ plain form
15456 522245 359521 149293 395415 376602 259829 578695 185068 73974 26892 -42408
15445 26228 66411 168647 -126250 79636 5570 -363432 -28482 176678 -7376 189193 52735
15433 67574 53730 -149899 -42917 -224975 89932 530675 44707 159607 400556 906913
15423 906913 595860 1037088 138208 -33715 87987 129275 -92 -182682 144461 58484 -7607
15411 -82172 -288786 -30890 -239992 15825 136489 136373 244939 49327 18414 -159232 26830
15399 11133 -88510 -157393 304307 65421 52844 -229260 -125150 17115 132690 -1644 94689
15387 216988 -142820 -150811 -161911 -210011 284847 28298 -37787 -63990 200699 9119 -10281
15375 65867 408736 -34307 102904 59415 -52397 68536 231401 198922 -165975 282500 -38205
15363b5178M571C08199C853M81496A88218b82118B18667J01925A18582a49776
15352A72756K0951q6883d18874B64952F0956b2255j06599A73094B4339g8006K9570
15341d8436E1812J19339J60919j7866c47719B7821a35028A63464F6236J18234
15331A84470J4954d4258D32916D9711a47447E87765A5095c5647C79428i5765j74793
15320b70558B37361b7023A56865b11506i840C26528b6378P767A447L25215C3952
15308A29640J34346c60647a75446a9452I8215M76095B78292L778j03136J54688
15298C33622A04900e5445p4479A79397C3312Q3442k9391b58681B7731a5403n4823
15287g0226b9111E7344B5829a20790G1290k7972j9809c909A45527b45530R5665
$$ plain form
15363 -25178 -20607 308199 3853 485349 188218 -282118 218667 320592 118582 -149776
15352 172756 193707 106824 -418874 264952 60956 -22255 -128854 173094 24339 -78006 -48436
15341 -48436 51812 171151 332070 314204 -347719 27821 -135028 163464 66236 184470
15331 184470 199424 -44258 432916 49711 -147447 587765 15095 -35647 379428 -95765 -270558
15320 -270558 237361 -27023 156865 -211506 -9840 326528 -26378 -18611 1447 326662 33952
15308 129640 263986 -360647 -175446 -19452 98215 574310 278292 282070 178934 333622
15298 333622 104900 -55445 -129924 179397 33312 116754 87363 -258681 27731 -15403 -70226
15287 -70226 -29111 57344 25829 -120790 71290 43318 23509 -3909 145527 -245530 -149865
15276a49865B65006a49190C21667H5478a04029A22981C2010a082n7247K7363j625
15265c2591k59749A79478i4373G3469a11260A8964J75162A1227b68802E3658a00201
15253b45713D2861a04472q3636C9577J01375J22084K5845p1193o8509K7844J30001
15242C07024e3387A27894J19318J90011j62936I6159A6606N25938B09119R5990
15232C05109Q8427p1164L82750M39677L73928l26099L03606F81006q2464k55575
15222C42967A61773F0695d4201D07316A71996k2558R4087m3923a28175C26764
15211D6298R7100J00751k0924a25562C52145h7299l2969A510f6236A84280C9184
15199a65086A83862a27891e0047j15113D2836K46897n3127h8292j79028A60676
$$ plain form
15276 -149865 265006 -149190 321667 85478 -104029 122981 32010 -1082 -58329 -30966 -32591
15265 -32591 -292340 179478 -94373 73469 -111260 18964 194126 11227 -268802 53658 -100201
15253 -245713 42861 -104472 -188108 39577 140952 263036 288881 217688 149179 177023 307024
15242 307024 -53387 127894 247212 437223 274287 96159 16606 542544 209119 305109
15232 305109 393536 322372 705122 1144799 1518727 1192628 1496234 681006 598542 342967
15222 342967 161773 60695 -44201 407316 171996 149438 243525 199602 -128175 326764
15211 46298 143398 244149 223225 -125562 352145 -87299 -120268 1510 -66236 184280 39184
15199 -165086 183862 -127891 -50047 -165160 42836 289733 236606 -88292 -267320 160676
15188A29727f5724L244I5998g4814B48938H3197J09279b07449A52674E1748M5533
15177I7281L12310Q2047a60572f1064B68075b10626g895A02502c32317B09643
15166A49792J81141D0706J20851N0362N3943L0080A04104K21779p7334K55843
15156E04392a1053H2689B1957b74827C13998A31563d8484r2102C96700A23500
15145A171K0139j057J79578o7949g5153n4908B5352R5679J36388m5606a32812
15133B76229c57128A36541A1401L7102J40102o5320l7981M6063J28794h9516G9304
15121F2502a77626h342E1832K99282j20649K98729B48059J75911A63356K93428
15111D56784k02517b51545A09430j4027m2609J33887J86988j22460G757K99533
$$ plain form
15188 129727 -65724 -62480 95998 -74814 248938 83197 192476 -207449 152674 51748 97281
15177 97281 409591 491638 -160572 -61064 268075 -210626 -7895 102502 -332317 209643
15166 149792 330933 40706 161557 211919 265862 295942 104104 325883 248549 504392
15156 504392 -11053 82689 21957 -274827 313998 131563 -48484 -140586 396700 123500
15145 1171 21310 20253 199831 131882 -75153 -130061 25352 121031 257419 211813 -132812
15133 276229 -357128 136541 11401 48503 188605 123285 85304 131367 260161 -89516 79304
15121 62502 -177626 -8342 51832 351114 230465 529194 248059 423970 163356 456784
15111 456784 254267 -251545 109430 95403 52794 186681 373669 251209 7757 307290
15101C07290j7183d3303H4485g1428j19248B81377A07441C4477d1970G6021K4144
15090A00165J07946D5005J1420J96A6055K19698Q0852j54730b5109E6546B2563
15078i9770B84943j1365m2978E5273M0854K32470C88a2830D70026k27819I602
15066a10556j81218J28211f7225C09059D1478I542J27261K49272A9734c05513
15055E4211R8616K30606R9313B34007n970n6644e1113H9793b6122A73710Q3895
15044B57605O6176r8531J04979C7797J23813J02090J1157I0039J79470J44687
15034D14196l0757j15485l619q8941N4142o0352J35546A46410m2748J65051K76183
15023E44896j63553j23705l7997L0299L25375k44482K90906k53592J75283k8325
$$ plain form
15101 307290 290107 -43303 84485 -71428 -190676 281377 107441 34477 -41970 76021 100165
15090 100165 208111 45005 56425 56621 16055 235753 316605 161875 -25109 56546 22563
15078 -99770 284943 273578 230600 55273 96127 328597 388 -12830 470026 242207 9602
15066 -110556 -291774 -163563 -67225 309059 41478 9542 136803 386075 19734 -305513
15055 54211 152827 383433 482746 234007 228037 171393 -51113 89793 -26122 173710 257605
15044 257605 323781 225250 330229 37797 161610 263700 274857 90039 269509 414196
15034 414196 383439 267954 264335 175394 229536 169184 304730 146410 103662 268713 544896
15023 544896 381343 257638 219641 249940 575315 330833 621739 368147 543430 515105
15013E15105j26761R6751J06195k38326L00497k73220F3776L70839J06598J05036
15003F46249C8517N28483j62586J2422F0106J52116J504K05120K57397j09808
14993E66435A96251J71563J12342J44960k68355J38037G9416M03490k32125k2404
14983B28377J44209b3860F27283j41048K88973k59075E2597M92502k06120p7620
14973B61359o2317K86293m5862K2282J635Q9849L11269B82912L73310P1516j13007
14962F14731k8634k08925K59628j67345j34887j4102p6924K99919A44793N16339
14952F61132B05009O5148N33788A87991M8810J7311p7468K8368J89182G7979a2682
14940B57688j130A12075M99340F7830J8927M23670o1438j82399J1695j19630J20729
$$ plain form
15013 515105 388344 485095 591290 352964 653461 380241 63776 434615 541213 646249
15003 646249 38517 567000 404414 416836 60106 212222 213726 418846 676243 566435
14993 566435 196251 367814 480156 625116 356761 494798 79416 482906 250781 228377
14983 228377 372586 -23860 627283 486235 775208 516133 52597 545099 338979 261359
14973 261359 199042 485335 439473 461755 463390 553239 864508 282912 656222 727738 614731
14962 614731 586097 377172 636800 469455 334568 320466 243542 543461 144793 661132
14952 661132 205009 270157 803945 187991 236801 254112 176644 205012 394194 77979 -12682
14940 257688 256558 112075 611415 67830 86757 510427 448989 266590 278285 158655 279384
14929B79384J5443K51573K7664j51287n0342J75695J82969C05550J35648j1702
14919D29496G4343O05288l15027j9838L13034J54580j00216P6870K23710j68512
14909H44232M82208j8295j07646L6799j44881K58423p407P5393j59509R7443J69726
14898A526486j02264K36750j64446l06474m45515j2807j7944k25370Q1887n0445
14888E19858j83841L30519j36091j56634K03512h9853C40890j18651J04017O0647
14878C86903l4760K26746k32030J2416l7960Q1243J57898k11993K45471j697L4752
14867F26989p5357K77227l40270J10506J9939K5353l2136j69188J37291q638J78864
14856G50580l57899j70593J40566D1229O81059j149j13622j25613J74654J90044
$$ plain form
14929 279384 294827 546400 574064 422777 372435 548130 731099 305550 441198 429496
14919 429496 74343 679631 364604 344766 657800 812380 712164 789034 1012744 844232
14909 844232 1326440 1308145 1200499 1237298 1092417 1350840 1343433 1418826 1259317 1356760 1526486
14898 1526486 1424222 1660972 1496526 1190052 744537 731730 713786 488416 570303 519858
14888 519858 336017 666536 530445 373811 577323 -89853 340890 222239 326256 386903
14878 386903 352143 578889 346859 359275 321315 402558 560456 348463 593934 592237 626989
14867 626989 551632 828859 488589 599095 619034 644387 612251 443063 580354 571716 750580
14856 750580 392681 222088 362654 41229 722288 721139 607517 481904 656558 846602
14846H46602l59613j61173K11186r3220A88758O66004C99627K03299M9701N6337
14836G08964k63577r1227e0078F75601j97972k28354M8515J23215j01135K32269
14826E52139M50641l34585J26247K11494j75423p7248K51283l42231M32353l34511
14816G60159N9229J1482j35591q4589N7979n2491k81872j4485M3695J7714j62453
14805B18777M44967L568k96481L15827j25829K81686D16741j44984L55102n4611
14795E72248N6737k21005J38054J11342J79331j37801B89077L91090k71686K03998
14785F12479P0057j82634J11393j49257J94404M1129C14564L13927l6107k07280
14775C85104J24077R2036J53335k55949N38775D75645K12423o6028M1349J63766
$$ plain form
14846 846602 486989 325816 537002 443782 188758 854762 399627 602926 652627 708964
14836 708964 445387 354160 -50078 675601 477629 249275 297790 421005 319870 552139
14826 552139 1002780 668195 794442 1005936 830513 753265 1004548 662317 1094670 760159
14816 760159 819388 830870 695279 610690 668669 616178 334306 319821 363516 381230 218777
14805 218777 663744 667312 370831 686658 560829 842515 416741 271757 626859 572248
14795 572248 628985 407980 546034 657376 836707 698906 289077 680167 408481 612479
14785 612479 682536 499902 611295 462038 656442 697571 314564 628491 592384 385104
14775 385104 509181 601217 754552 498603 1037378 475645 688068 622040 663389 827155
14765H27155j7569Q3787k4073p4061K79353j29077k99337n2861K38695J15525
14755I47537m58534K38681j29496M72029D95648K32323q0308k2167j06148L82928
14745I02276k56869J27766k14252M9824N9607K30705L2980j22014P3970k11834
14735F72159j73590L4237j38557K39239J15106R417N3970m2914J17917B64574
14724G05506L97176D51085m6190L21238p0700j7357K2283K59936k76418K06374
14714H50251j1670J56250J6032J89601K37802J7809j45921J01420m92312J45580
14704A064842r3946m5171J8776K03122k63717P5704k42557n049J1744C19623P31082
14693A050705J0805k78792O0852J97138l03058L64605r513M58025l00918L16709
$$ plain form
14765 827155 809586 893373 869300 795239 1074592 945515 646178 593317 832012 947537
14755 947537 489003 727684 598188 1070217 495648 727971 647663 625496 519348 902276
14745 902276 645407 773173 558921 608745 668352 899057 932037 810023 883993 672159
14735 672159 498569 532806 394249 633488 748594 758011 811981 769067 886984 264574
14724 705506 1102682 451085 404895 726133 655433 638076 660359 920295 643877 850251
14714 850251 838581 994831 1010863 1200464 1438266 1456075 1310154 1411574 919262 1064842
14704 1064842 970896 925725 944501 1147623 883906 959610 717053 712004 723748 319623 1050705
14693 1050705 1061510 782718 843570 1040708 737650 1102255 1092742 1550767 1249849 1566558
14683A566558L0398k27100p0487J74519j03592n46035M31006m21616L08007l27548
14673H14110L239p243p7029K64404j23300o2963j0507p6280K80516N2498k69410
14662G88035J8814j95063N95422l82633J38598q8730j78634R343M27544k34491
14652H98205k6748n6480Q1521R4176J65348j84293J32691l0286R8712j58800M0048
14641A054094k16770O23018m75649l1306J92608j74246J12444K05491j74135O01579
14631A717128o04566M65721n12915K31359p5770L30153p72793J29810K15164J13140
14621A236431m231j05154K41465l89456J09217K32693P015k01655N11226k16815
14611A420736q1732m0969L95833k70262J10968P425k43620L11211l23641K84849
$$ plain form
14683 1566558 1596956 1369856 1299369 1473888 1370296 824261 1255267 833651 1141658 814110
14673 814110 817349 810106 733077 997481 874181 811218 800711 724431 1004947 1057445 788035
14662 788035 806849 611786 1207208 824575 963173 874443 695809 705152 1132696 898205
14652 898205 871457 814977 896498 990674 1156022 971729 1104420 1074134 1172846 1014046 1054094
14641 1054094 837324 1460342 984693 953387 1145995 971749 1084193 1289684 1115549 1717128
14631 1717128 1112562 1578283 1065368 1296727 1220957 1551110 778317 908127 1123291 1236431
14621 1236431 1232200 1127046 1368511 979055 1088272 1320965 1327980 1126325 1637551 1420736
14611 1420736 1339004 1298035 1693868 1423606 1534574 1541999 1298379 1609590 1285949 1570798
14601A570798k26260J44791k45678K80036j83291m7059M60068k83401k07141K08589
14591A471452j08017J96725l00932l1873O9410M31533J63764k56132k44207J40625
14581A532348J41485l1038k3482P8412n04469M18886n1578R5695J67030k92280
14571A531009N0177J20856j00646R1443L90329j45177L32145m02263r7725L07746
14561B077894K11007k20812m0912j09929j73912K94243K73072o9102j17208j43341
14551A981000M4886M69603k09621J03314K72354J14234R5374q0136J08687N38229
14541C437924j65203N41859N60598K48278N05091O92767R57419J933548L987935
14532A2700216O504141J0001276j7610j1676949o736054m113434j306098n15538
$$ plain form
14601 1570798 1344538 1489329 1243651 1523687 1340396 1293337 1753405 1470004 1262863 1471452
14591 1471452 1363435 1560160 1259228 1227355 1296765 1728298 1892062 1635930 1391723 1532348
14581 1532348 1673833 1642795 1619313 1697725 1193256 1612142 1560564 1656259 1823289 1531009
14571 1531009 1581186 1702042 1601396 1692839 2083168 1937991 2270136 1867873 1770148 2077894
14561 2077894 2288901 2068089 2027177 1917248 1743336 2037579 2310651 2241549 2124341 1981000
14551 1981000 2025886 2495489 2285868 2389182 2661536 2775770 2871144 2791008 2899695 3437924
14541 3437924 3272721 3814580 4375178 4623456 5128547 5821314 6778733 8712281 12700216
14532 12700216 19204357 29205633 29188023 17511074 10775020 6661586 5355488 4839950
14524D839950N51189r67270j276181l06077l42144J05009l31946O8648J07742
14515B448920l91207Q2872J58906o1241k59276M17364n0319p9682R6797k56378
14505B106756j4836P39980j30511l93081L17292l46669o0949M11033K85540j93195
14495B721360m6953q564n011O1650J02266J61297P0954J40834m32932M22495k03704
14484B983692o8155k8458Q1370J36336j30892J92170J20542J12014j11430O774
14474C293963N4231J80303L8960Q3478p9602l9260K11952k21298M90110o6219
14464C946618j90726J09707k118J85770j15313L75048l67855J05906L12474j48288
14454D211223M9444J72676l10357K37064l98753M63988K2865L32930r4365N8661
$$ plain form
14524 4839950 5391139 4423869 3147688 2841611 2499467 2604476 2272530 2341178 2448920
14515 2448920 2057713 2140585 2299491 2238250 1978974 2396338 2346019 2266337 2363134 2106756
14505 2106756 2091920 2831900 2701389 2308308 2625600 2278931 2217982 2629015 2914555 2721360
14495 2721360 2674407 2665843 2660832 2722482 2824748 2986045 3056999 3197833 2764901 3187396 2983692
14484 2983692 2915537 2887079 2968449 3104785 2973893 3166063 3286605 3398619 3287189 3293963
14474 3293963 3348194 3528497 3567457 3650935 3571333 3532073 3744025 3522727 4012837 3946618
14464 3946618 3755892 3865599 3863481 4049251 3933938 4308986 3941131 4047037 4359511 4211223
14454 4211223 4260667 4433343 4122986 4360050 3961297 4425285 4448150 4781080 4686715 4745376
14444D745376j9399k449J92247k26420M64685m52107M33227K9054R2336L5937
14434E292487k2981M9148N5720m0180M74874k43071J17356M73804k57733n4738
14424E844686J41301J1563J69419R1147J11555m896L83871J51675j59038O119
14414F747402m2250L65512k1700q0164K58298O9089J5079K42849O11494n67069
14404G598540O06403N3033Q7202K03311K55513j120r3278K68309n1479K97805
14394I224239M641K76838J69996N94L11628m1740K01643J89669K07865P0083N04845
14383A1120301R9062k27638J55648J23064K58894L81656L01382j36562J74356
14374A2250163K08168M62095K32825M07267j49451L70126M05314n951K73673M89335
$$ plain form
14444 4745376 4725977 4723528 4915775 4689355 5154040 4701933 5135160 5164214 5256550 5292487
14434 5292487 5269506 5318654 5374374 5334194 5809068 5565997 5683353 6157157 5899424 5844686
14424 5844686 5985987 5997550 6166969 6258116 6369671 6364775 6748646 6900321 6741283 6747402
14414 6747402 6705152 7070664 7048964 6968800 7227098 7296187 7311266 7554115 8165609 7598540
14404 7598540 8204943 8257976 8345178 8548489 8804002 8802882 8709604 8977913 8926434 9224239
14394 9224239 9228880 9505718 9675714 9676308 9987936 9946196 10147839 10337508 10545373 10615456 11120301
14383 11120301 11219363 10991725 11147373 11270437 11529331 11910987 12212369 12075807 12250163
14374 12250163 12458331 12920426 13153251 13560518 13411067 13781193 14186507 14180556 14454229 14943564
14364A4943564J82003O37073k47946O31604M16088L48206M07645R8226J92992
14355A7609455J35777N36022L79085L04563M28103N78198N08949L25177K77994
14346B1083323O44903Q3627N66470P76780j11202R94711O33235K57302P90804
14337B5719953K29998J217533P02643M50575N12600Q44541Q90695P35543Q24434
14328C2128515M62881R94769J162992M39134J178729J446679J090064J058647
14320C9962410J258355R17413J317868J054326J588355J465860J419579J542903
14312E0527069J682901J968948J623061J897649K025142K219317J937520K657177
14304F6538784K257207K403093K892320K672187L107662L069029K961679L332745
$$ plain form
14364 14943564 15125567 15762640 15514694 16146298 16562386 16910592 17318237 17416463 17609455
14355 17609455 17745232 18281254 18660339 18964902 19393005 19971203 20480152 20805329 21083323
14346 21083323 21728226 21811853 22378323 23155103 23043901 24038612 24671847 24929149 25719953
14337 25719953 25949951 27167484 27870127 28320702 28833302 29677843 30568538 31304081 32128515
14328 32128515 32591396 33586165 34749157 35188291 36367020 37813699 38903763 39962410
14320 39962410 41220765 42138178 43456046 44510372 46098727 47564587 48984166 50527069
14312 50527069 52209970 54178918 55801979 57699628 59724770 61944087 63881607 66538784
14304 66538784 68795991 71199084 74091404 76763591 79871253 82940282 85901961 89234706
14296H9234706M027521L702745L876893M490588M563782M874803N586810M919132
14288A25276980N876086O225573O339495O535119P294936P891099P826263Q645440
14280A81910991R281037R136292J0126716J0382360J1097386J1715020J2158922
14273B55808724J2584431J2979463J3290146J2999055J3006815J2672516J2494072
14266C45835222J2000128J1285841J0828510R638256R396585Q448554P924516
14259D15357612P024079N410193K716979J320151J718578j549007o032091m778663
14251D21187831o602531q901245j0200435j0623229j1308562j2129148j2490782
14244C48931899j2244833j3028397j3440452j2243018j2233383j2497852j2383449
$$ plain form
14296 89234706 93262227 96964972 100841865 105332453 109896235 114771038 120357848 125276980
14288 125276980 131153066 137378639 143718134 150253253 157548189 165439288 173265551 181910991
14280 181910991 191192028 200328320 210455036 220837396 231934782 243649802 255808724
14273 255808724 268393155 281372618 294662764 307661819 320668634 333341150 345835222
14266 345835222 357835350 369121191 379949701 389587957 398984542 407433096 415357612
14259 415357612 422381691 427791884 430508863 431829014 433547592 431998585 425966494 421187831
14251 421187831 414585300 405684055 395483620 384860391 373551829 361422681 348931899
14244 348931899 336687066 323658669 310218217 297975199 285741816 273243964 260860515
14237B60860515j1738838j2037866j0743271r892957r973815r811946r867012
14230A86794810r441798r065572p891570p961118p256037o963521o279682n755234
14222A26180278n375195n661391m969609m820441m498900m120355l816103l577760
14214H9340524l576574l653898k991983k902663l000268k504942l004458j883066
14206F5822672k551951k335650k004204j739654k270914j622702j703635j516399
14198E0077563j434449j228618j725764j595324j147623r04411j178502j361834
14190C9501038p90481j366769r59561r07893j095903p42064j039860n54214j020474
14181C1023819q40596j080866m18036m38112j021013n29857n48082p71676o14894
$$ plain form
14237 260860515 249121677 237083811 226340540 216447583 206473768 196661822 186794810
14230 186794810 177353012 168287440 160395870 152434752 145178715 138215194 131935512 126180278
14222 126180278 120805083 115143692 110174083 105353642 100854742 96734387 92918284 89340524
14214 89340524 85763950 82110052 79118069 76215406 73215138 70710196 67705738 65822672
14206 65822672 63270721 60935071 58930867 57191213 54920299 53297597 51593962 50077563
14198 50077563 48643114 47414496 45688732 44093408 42945785 42041374 40862872 39501038
14190 39501038 38710557 37343788 36384227 35476334 34380431 33638367 32598507 32044293 31023819
14181 31023819 30183223 29102357 28684321 28246209 27225196 26695339 26147257 25375581 24760687
14172B4760687o75489l25283p55892l74519n12741n34668p04144m00870l80351
14163B0096730m67179l50182l05357l97051o8112q81721m51498J5664o70834j60882
14153A6359578q0239m55838L8559p79766j16848j45136l82678l60250j24029j57099
14143A3796254l71912k56084l42525K64437m42250j91990l9798n80608o2747j52157
14133A1620620k63985J26193k01915k49859r217m70699k45471p9252O3970j89112
14123A0101273j98009l73883R6806q7204j51401j94480j67352n6230j78730k08324
14113H582466o9860R7865j2989o26880k6084j14480o6186K40713m68633J96252
14103G732184K9966Q543o70391k54369O03690k37789k77365k9084m50492M77424
$$ plain form
14172 24760687 24085198 23759915 23004023 22629504 22116763 21582095 20877951 20477081 20096730
14163 20096730 19629551 19279369 18974012 18576961 18508849 17627128 17175630 17191294 16520460 16359578
14153 16359578 16279339 15823501 15862060 15082294 14965446 14820310 14437632 14077382 13953353 13796254
14143 13796254 13424342 13168258 12825733 13090170 12647920 12455930 12416132 11835524 11772777 11620620
14133 11620620 11356635 11482828 11280913 11031054 11021837 10551138 10305667 10226415 10290385 10101273
14123 10101273 9903264 9529381 9626187 9538983 9387582 9193102 9025750 8969520 8790790 8582466
14113 8582466 8512606 8610471 8597482 7970602 7944518 7830038 7763852 8004565 7535932 7732184
14103 7732184 7762150 7770693 7100302 6845933 7449623 7211834 6934469 6905385 6454893 6932317
14093F932317l19252m3346k04215k45080K23784K51774n29379l8757J74069j98059
14083F003856k82922L80636k99975k97920J88060k6896R3603l94012j21836J88387
14073E430981j93036j58913L09716k11069n25455M70427l44401Q6587o5112R9572
14063D899297k69535Q4525J2927k18403j70443M2680j00310L05667n06445o9975
14053D009985K80069N1483J5293k08674L4525p1594l52783J71480j33724J49545
14043C945605L96707j74342j15433l60021K5798j19872n079Q4083k62682J82036
14033C596800j21997q3201L33143k17943j35532N6796L2910k19070j73657K12018
14023C280267M33591r11222N3134J02073J25021j50356J18395j95102P9538L11418
$$ plain form
14093 6932317 6613065 6569719 6365504 6120424 6344208 6595982 6066603 6027846 6201915 6003856
14083 6003856 5720934 6101570 5801595 5503675 5691735 5664839 5758442 5364430 5242594 5430981
14073 5430981 5237945 5079032 5388748 5177679 4652224 5122651 4778250 4864837 4799725 4899297
14063 4899297 4629762 4714287 4727214 4508811 4338368 4381048 4280738 4586405 4079960 4009985
14053 4009985 4290054 4341537 4356830 4148156 4182681 4111087 3758304 3929784 3796060 3945605
14043 3945605 4342312 4167970 4052537 3692516 3718314 3598442 3593363 3677446 3414764 3596800
14033 3596800 3474803 3391602 3724745 3506802 3371270 3428066 3460976 3241906 3068249 3280267
14023 3280267 3713858 2802636 2855770 2957843 3082864 2932508 3050903 2855801 2935339 3246757
14013C246757j02833k01561J025K37113J91149n43949N4646l8375k52016K38468
14003B830424j54161k46402J07552P0210j70747O2448j52098M3899K14939j67184
13993B438880N2600J16570n0919l28588p0539M53593m45397Q2553N54658l95711
13983B407700l3596n2381L14018k84904O41802O1472P1100O09249M08774J700820
13973E844054L137470N852620R861134O602760r748281p028113m720826k446397
13965G354421j632829n97207p22791n17953j40386m82136o5454j84819r2889j21748
13955B796209K46636j81182j79209p0045j77044p0975j96738K4910J00430p6176
13945B216816l32128M73076k84239J46575j56542n3857j55633L03695j35520k14956
$$ plain form
14013 3246757 3143924 2942363 2943388 3180501 3371650 2827701 2882347 2843972 2591956 2830424
14003 2830424 2676263 2429861 2537413 2607623 2436876 2499324 2347226 2391125 2606064 2438880
13993 2438880 2491480 2608050 2557131 2228543 2158004 2611597 2166200 2248753 2803411 2407700
13983 2407700 2374104 2321723 2635741 2350837 2992639 3054111 3125211 3734460 4143234 5844054
13973 5844054 8981524 14834144 24695278 31298038 21549757 14521644 9800818 7354421
13965 7354421 5721592 5124385 4401594 3883641 3743255 3261119 3195665 3010846 2917957 2796209
13955 2796209 3042845 2861663 2682454 2612409 2435365 2364390 2167652 2192562 2292992 2216816
13945 2216816 1884688 2357764 2073525 2220100 2063558 2009701 1854068 2157763 2022243 1807287
13935A807287J17064p3854J70754K543j63056m2243K27233j86809K60637l59174
13925A760382n35193O35326j85288J60228k53713o7073J49528J85187k35559O5738
13915A679563j01260J71899n8527r4594J24153O8372O86k79399N1583o9190J9472
13904A512758q7979R3241j52334O15291q06092N12627j32162n25962L34118K70418
13894A633924k51250n9151Q1889m9642P533l93284K72653K31308k7234O7372Q5848
13883A599966k38925L4555j26234j94014L12179j54468j11619N936J02447J00012
13873A329835n1158J3161j30351M718J09030j70383j28594J93387K81663k00845
13863A250463j52635j08520K72676j45283K6793j74377N71473o19676K58045J60655
$$ plain form
13935 1807287 1924351 1850497 2021251 2023794 1860738 1818495 2045728 1858919 2119556 1760382
13925 1760382 1225189 1860515 1675227 1835455 1581742 1514669 1664197 1849384 1613825 1679563
13915 1679563 1578303 1750202 1691675 1597081 1721234 1789606 1790292 1510893 1562476 1493286 1512758
13904 1512758 1424779 1518020 1365686 1980977 1174885 1687512 1555350 1029388 1363506 1633924
13894 1633924 1382674 1323523 1405412 1355770 1363303 970019 1242672 1473980 1446746 1514118 1599966
13883 1599966 1361041 1395596 1269362 1075348 1387527 1233059 1121440 1127376 1229823 1329835
13873 1329835 1278677 1291838 1161487 1166205 1275235 1104852 976258 1169645 1451308 1250463
13863 1250463 1097828 989308 1261984 1116701 1143494 969117 1540590 920914 1178959 1339614
13853A339614l90117K1467J8694k37674J09622M09655l80760J71931J73059k13554
13843A021937K21051R2188j05613j78985J49653j11289k07383J52789J84858j07034
13833A112172l01339M07444j42586J24037l4853m41092L57565k83935K71987l77866
13823F91534L58367J25114J13298j95152k06534J11370j13603p0715k58918L61629
13813I16390O37098G70224R1907K95384j71732J72034n45432o191M51849j77340
13803H80703k36507M30146r4567j04816j89924m751k3320K59846k87830K33295
13793H62275j97376k47970N25415m43081M16411M3161j43543k24457L70460M1309
13783A002604Q9608j88034p4328j36476M03979n14660m2039J61407j79810J51040
$$ plain form
13853 1339614 949497 970964 989658 751984 861606 1271261 890501 1062432 1235491 1021937
13843 1021937 1242988 1335176 1229563 1050578 1200231 1088942 881559 1034348 1219206 1112172
13833 1112172 810833 1218277 1075691 1199728 1164875 723783 1081348 797413 1069400 691534
13823 691534 1049901 1175015 1288313 1093161 886627 997997 884394 813679 554761 916390
13813 916390 1553488 770224 862131 1157515 985783 1157817 612385 606194 1058043 880703
13803 880703 644196 1074342 979775 874959 685035 680284 656964 916810 628980 862275
13793 862275 664899 416929 942344 499263 915674 958835 815292 590835 961295 1002604
13783 1002604 1092212 904178 829850 693374 1097353 582693 540654 702061 522251 673291
13773F73291M2993K08670O8496l27128j2238J10679K19040l99014J71574k15368
13763E40995B41964M98499N7455K6106l15504L26480J70128q3557J07802l26030
13753G03343l26039L70618p3954J84145k62807R9119j65186K344J99751o6026
13743F65308n2324l941R9169q8227Q814J80333k41845J69982m6860m5689O9043
13732G13763j71722K09824j67301K14365k37780L27492j94173K16496j64873l51241
13722C94850J19082K43522k14950J59443k48082J08491L4571k82644M21021k28326
13712E06978K46043j7869j58728l9467J26638A88135L73050k41134J86510M49520
13702I56081m42214J22890k93693J71148j34109J91105l0707j87781K09483k29361
$$ plain form
13773 673291 716284 924954 993450 666322 654084 764763 983803 584789 756363 540995
13763 540995 241964 740463 797918 824024 508520 835000 1005128 921571 1029373 703343
13753 703343 377304 747922 673968 858113 595306 694425 529239 531583 731334 665308
13743 665308 612984 609043 708212 619985 628799 809132 567287 737269 690409 644720 713763
13732 713763 542041 751865 584564 798929 561149 888641 694468 910964 746091 394850
13722 394850 513932 757454 542504 701947 453865 562356 596927 314283 735304 506978
13712 506978 753021 735152 576424 536957 663595 188135 561185 320051 506561 956081
13702 956081 513867 636757 343064 514212 380103 571208 540501 352720 562203 332842
13692C32842J97912L07569C89058J80595j42379j24348L39086J11431k46320Q2137
13682E89260l8870P6518p8580j6182m9426j20002p8888q7955L04503j12839J33394
13671E20933j5737k0889n6899q6385L61360j2115j92110K7954J62641C14132K23457
13660E37589j59016m5134J81214q6277Q0497O712k4722J68905j77639K11356B21215
13648C48932K71949j69711k4420K38469j84983J18752k12636J71509k4783k20449
13638C12629J81465j1513B22135K41353j88333R2216r5011J31106L459J0322J83312
13627F00559j22260r00j82823J51915P0963L6300O0005A22234L67453K40516o7149
13616F63054k71414P0943j51924K12281K35812j43710B01023L07937B0343M30873
$$ plain form
13692 332842 530754 838323 389058 569653 427274 302926 642012 753443 507123 589260
13682 589260 550390 626908 548328 532146 482720 362718 283830 195875 500378 387539 520933
13671 520933 505196 484307 427408 341023 702383 690268 498158 526112 688753 314132 537589
13660 537589 378573 333439 514653 428376 508873 515585 490863 659768 482129 693485 221215
13648 348932 620881 451170 426750 665219 480236 598988 386352 557861 533078 312629
13638 312629 494094 482581 222135 463488 275155 367371 272360 403466 406925 417247 600559
13627 600559 478299 477399 294576 446491 517454 553754 613759 122234 489687 730203 663054
13616 663054 391640 462583 310659 522940 758752 615042 201023 508960 20343 451216
13606D51216L7738p1514l9345J17118k16840J04395j17815M09901k28891J27970
13596E73933q8237P5725m6193A55984K01402O0972N4962B11536G5352L87769e9267
13584E24807k26195M0942M3995j11621p9248a1637B93805L88923j18077j82919
13574C81732K49388A50199L45295j74725J0825j8685L34688j55440A29377K85284
13564D14661r3066l3682a6602B71036J28136j98054O0545k9082q1965K23147j76877
13553A96886K36386A56375K61342j40052a80222c4345D29116L5779k9638L097
13543D38354H0417L27948l3724j831A83613K86104j61147j33535Q9815J10970
13533C75820m2194q7605q4787l0909E1031K91662N2465H7530N83759k01197J03992
$$ plain form
13606 451216 488954 417440 378095 495213 278373 382768 264953 674854 445963 573933
13596 573933 485696 561421 515228 155984 357386 418358 473320 211536 75352 463121 -59267
13584 524807 298612 339554 383549 271928 192680 -11637 293805 682728 564651 381732
13574 381732 631120 150199 495494 320769 331594 312909 647597 492157 129377 414661
13564 414661 321595 287913 -16602 271036 399172 201118 261663 232581 150616 373763 196886
13553 196886 433272 156375 417717 277665 -180222 -34345 429116 464895 435257 438354
13543 438354 80417 408365 374641 372810 183613 469717 308570 175035 264850 375820
13533 375820 333626 246021 161234 130325 51031 342693 395158 87530 671289 470092 574084
13522E74084A1405J50999K8380q33p7176R1197E6789L3776O4094J67863A52676
13510A39352M877K4812K41666D7958K0284J21869m3146J58173O2687j82956J60644
13499C45513b14237E21836m3865A92601J77788j7005R7445j70855G4486J58283
13489B32769O5226j37614a04270C02337q8917n1445J43044N024b03178B97546
13478C74789j68756r5706B125K27682L0270I2819M3065J97518A65569L05020q419
13467D62170j01783A00173b31350B82212o7350J19902N6927A48132J22021k4655
13457B45498J40124A34942k9906J21787o3531B6590M88782A64177l198a02769
13446B36795K42888d931C93320j56513M0087J00240N4602G7310L53551j02887
$$ plain form
13522 574084 11405 162404 190784 189951 112775 203972 56789 90565 154659 322522 152676
13510 139352 144229 169041 410707 47958 68242 190111 146965 305138 367825 184869 345513
13499 345513 -214237 521836 477971 192601 370389 353384 450829 279974 74486 232769
13489 232769 297995 160381 -104270 302337 213420 161975 305019 310043 -203178 297546
13478 374789 206033 110327 2125 229807 260077 92819 135884 333402 165569 470589 462170
13467 462170 360387 100173 -231350 282212 214862 334764 391691 148132 270153 245498
13457 245498 385622 134942 105036 226823 163292 26590 515372 164177 160979 -102769
13446 236795 479683 -4931 393320 236807 276894 377134 431736 77310 430861 327974
13436C27974q7023J26456j38179q3638J39829a03799A46475p2372L49920Q405
13426D32428j41892a1441n4385B10377j371D7556J33195o0813L59084j8459I5345
13414C85021j18387J70674j86083J52784l6806C851K10723b7876B24529p6524
13404A48005h7491A19712j9322D974L03070j51694J02448o0540F4177L74590b1906
13392A17225J05369J86399C0246L01302j40843K9454N8444J13765e1254B64115
13381H7786J63091a91802B32846I2970J60228K4130M011q1749n505q8335K72775
13370C78525q0803B0242J70370F5461K97732p0570G897K47281J33959A59445D8497
13358D18043A43161M8400J47274j29993J62849A18683J76235b2873B70517K0877
$$ plain form
13436 327974 240951 367407 229228 145590 285419 -103799 146475 74103 424023 432428
13426 432428 290536 -11441 -65826 210377 209006 47556 180751 119938 479022 460563 95345
13414 385021 266634 437308 251225 404009 367203 3851 214574 -27876 224529 148005
13404 148005 -87491 119712 100390 4974 308044 156350 258798 198258 64177 438767 -21906
13392 117225 222594 408993 30246 331548 190705 220159 278603 392368 -51254 264115
13381 87786 250877 -191802 232846 92970 253198 277328 281339 199590 194085 105750 378525
13370 378525 297722 20242 190612 65461 363193 292623 7897 255178 389137 159445 48497
13358 418043 143161 191561 338835 208842 371691 118683 294918 -22873 270517 291394
13348B91394A31136m0893d9036C48583L45919B29012J07896o7550d500D80578
13337B44133a476F4274J28905O1282O3028m3595Q7181j03091q6621P7960n3868
13326A95455m9677G2388L31424k0368I7184j1893L51456P413j33666J90736f1357
13314B79214M61670B6082Q6469P9740c52787B52498l3918J47069i8923F66074
13303A75718J9599R2948M39419a05269D43431b7567F0219J29343D2329J6514K12963
13292B71806l153b20688A10865r799J7235M5877k9861a71654Q2104D11277j42889
13281B68388I5581L00550j22584R3952A64060b1231k41844A83587q1496O1873
13271A63964J02862J92333h1374G4637L00451E6477a10018A2071L26861A05322
$$ plain form
13348 291394 131136 90243 -49036 348583 694502 229012 336908 269358 -4500 480578
13337 244133 -1476 64274 193179 254461 317489 273894 361075 257984 171363 249323 195455
13326 195455 145778 72388 403812 383444 97184 85291 436747 444160 310494 501230 -61357
13314 279214 740884 26082 112551 192291 -352787 252498 218580 365649 -98923 666074
13303 175718 195317 288265 727684 -105269 443431 -27567 60219 189562 42329 58843 271806
13292 271806 268653 -220688 110865 101066 118301 164178 134317 -171654 -89550 411277 268388
13281 268388 95581 396131 273547 367499 164060 -21231 -263075 183587 102091 163964
13271 163964 266826 459159 -81374 74637 375088 56477 -110018 12071 338932 105322
13260f7937B7698a21886D94537A57736a04889A68198a29864B80293I4572e320
13249A18383M8218J4025k723k7774l2421K30682N320c856C22037J21076i6974
13237c5931B75451J34872A66781K25483A26674D5824l957j7465K11389F1911a17648
13225b9071C87977h3875D9904k4542L9150J6708K1212P366c56849I1058K73933
13214C64991F0983d538j43677I5398k8715M2243e1722A63841d187C25064I6757
13202B83785E0466K81331B7583a91349O6009E2714K73482a0310k26457C09806
13191A93159k0334J67077c17194A81631H0476K12875a3686D26047A02947b82334
13180E9957i3907P766A19296b57977B3688J66498a57661P2257D6044d74j53425
$$ plain form
13260 -67937 27698 -121886 494537 157736 -104889 168198 -129864 280293 94572 -5320
13249 118383 166601 180626 177903 150129 117708 348390 353710 -3856 322037 443113 -96974
13237 -35931 275451 410323 166781 392264 126674 45824 41867 24402 235791 61911 -117648
13225 -29071 387977 -83875 49904 25362 64512 81220 102432 109798 -356849 91058 364991
13214 364991 60983 -4538 -148215 95398 66683 108926 -51722 163841 -4187 325064 96757
13202 283785 50466 331797 27583 -191349 -125340 52714 326196 -10310 -236767 309806
13191 193159 172825 339902 -317194 181631 80476 293351 -13686 426047 102947 -282334
13180 59957 -93907 -86141 119296 -257977 23688 190186 -157661 -85404 46044 -474 -153899
13169a53899n9747P4897O5949b0131B12027f7371B60344I6529P9827h0928g85
13157g7205C37291j10673a61748A86250D6777J90543b38667A36966K94641H468
13146C79936G3994M8850J38899R7999A26031b03554F0694a12780B53343C334K40068
13135B43402J4891A28101a25272D18763A98773a928D6906d05683D0542a58233
13124d4292E5079L7005B2772M99586B49844f4995j19006J87C9918L607J14923
13113A58448D9820L19252b3052B51053N0688d226A23720a2560B04571H8384A2478
13101a59798A94266a4060p8440A86632G4827i9665r1946O8999e1977k05760a435
13089B79183j35271N1019m9338c94749b2826j71716d1230J8730H5038l8280k3233
$$ plain form
13169 -153899 -213646 -138749 -72800 -20131 212027 -67371 260344 96529 176356 -80928 -785
13157 -77205 337291 226618 -161748 186250 46777 237320 -238667 136966 431607 8468
13146 379936 73994 122844 261743 359742 126031 -203554 60694 -112780 253343 3334 243402
13135 243402 258293 128101 -125272 418763 198773 -1928 46906 -405683 40542 -158233
13124 -44292 55079 92084 22772 522358 249844 -64995 -184001 -183814 39918 43525 158448
13113 158448 49820 369072 -23052 251053 301741 -4226 123720 -12560 204571 88384 12478
13101 -159798 194266 -14060 -92500 186632 74827 -99665 -191611 -122612 -51977 -257737 -1435
13089 279183 143912 194931 145593 -394749 -22826 -194542 -41230 -22500 85038 46758 23525
13078B3525O3237a19780B0973K08302E2061f0368C7708R8300r039J70422P7334
13067C74725G1918n558e1006n3312k23946a17967A89168H5877C1346R5239J64349
13056B90934a03681C4001j4112L38178E1499b38508b6408o5959E3642A0003J87117
13045A97120J31209A57795J50483a92180F6157k0390f5230A96105J8379J43939
13035C58423j44965b9246o8081B35505H9613Q8590a84124C21161c1700D9928b28670
13023I9131b96033a8644g111A91447J01651L09866k41845h7545A02312J4982K09013
13012C26307I8230R4650l5131Q2933J4496g223r4071B67069d03487c3348j06611
13001a39959B68292G7297Q6449K6609K71300a77251F9219i5069B872O9062l1674
$$ plain form
13078 23525 86762 -119780 20973 229275 52061 -60368 37708 136008 126969 297391 374725
13067 374725 71918 66360 -51006 -104318 -328264 -117967 189168 85877 31346 126585 290934
13056 290934 -103681 34001 19889 358067 51499 -238508 -26408 -92367 53642 10003 197120
13045 197120 328329 157795 308278 -192180 66157 45767 -65230 196105 214484 358423
13035 358423 213458 -29246 -97327 235505 89613 178203 -184124 321161 -31700 49928 -228670
13023 99131 -296033 -18644 -7111 191447 293098 602964 361119 -87545 102312 117294 326307
13012 326307 98230 192880 157749 240682 255178 -7223 -101294 267069 -403487 -33348 -139959
13001 -139959 268292 77297 163746 190355 461655 -177251 69219 -95069 2872 71934 40260
12990D0260N28144G6981O7590L22170b6333D61103F3219L84599b18779A0619K89725
12979C00344A40803a71617A62833c3198A79129h5224j95749A30388a27954C27379
12968B10849a77543C60003i8338j57488C82191d9618B41201M4929b1883o9324
12958i1207j50163L0988H777a68756D7176a5280O610A81220f40I8388J09244i0515
12945E6690J0852J90762A11140i7736L2356A21541J00130F821b26054q2026F5751
12933a56213B68192E7967J22951m072b93488B88830c0081m4327j23640B10950
12922A42591A1501J64285I959P1663c02674D8342j3744d2255C08389C1207J02382
12911A33589b79684B67438H6888e8611j83161b6158j36271A37540N7391a16051
$$ plain form
12990 40260 568404 76981 144571 466741 -26333 461103 63219 447818 -218779 10619 300344
12979 300344 140803 -171617 162833 -33198 179129 -85224 -280973 130388 -127954 327379
12968 210849 -177543 360003 -98338 -255826 382191 -49618 241201 286130 -21883 -91207
12958 -91207 -241370 -210382 8777 -168756 47176 -15280 -8670 181220 -640 98388 207632 -90515
12945 56690 67542 258304 111140 -97736 -65380 121541 221671 6821 -226054 -308080 65751
12933 -156213 268192 57967 180918 176846 -293488 288830 -30081 -74408 -198048 210950
12922 142591 11501 175786 9959 81622 -302674 48342 34598 -42255 308389 31207 133589
12911 133589 -279684 267438 86888 -58611 -241772 -26158 -162429 137540 194931 -116051
12900B28784e8730I0625l8982K77889F6955K23518c79875g3055A05229a5733G8357
12888a31241I3809a7640l23303B57768p1998I100b26593Q9752f6860l7554b3618
12876a36178e2429H5739b17632A00817c7891j94028A90700i6733C7954J28039
12866A65993p1009a53301B24344m2766L2079R0737A22027c28053b7340k9102C3266
12854B75920h1386B4794M7499a4927j71796I4618J1739c989I9632a51585c9751
12842A05766a46673A46037n6785b68137A34356m3290b74238c5318A6420J10418
12832A26838E8421a86908A14952J26839p547m8255E4397L28785B0834J89694I9094
12820G5427j3080N5655H754a76997j006b0464k79896A39964D2415a01194I493
$$ plain form
12900 228784 -58730 90625 51643 329532 66955 290473 -379875 -73055 105229 -15733 78357
12888 -131241 93809 -17640 -340943 257768 185770 9100 -226593 -136841 -66860 -104414 -23618
12876 -136178 -52429 85739 -217632 100817 -37891 -231919 190700 -96733 37954 165993
12866 165993 94984 -153301 224344 181578 213657 304394 122027 -328053 -27340 -56442 33266
12854 275920 -81386 24794 72293 -14927 -186723 94618 106357 -3989 99632 -151585 -39751
12842 105766 -146673 146037 89252 -268137 134356 91066 -274238 -35318 16420 126838
12832 126838 58421 -186908 114952 241791 234244 185989 54397 383182 20834 210528 99094
12820 75427 62347 118002 8754 -176997 -178003 -20464 -300360 139964 42415 -101194 9493
12808C24189b59156g4915G5045c07824A97476f8747A57811B1154f396k84802b878
12796A64528c13149A89488F2173i0479A33659a73458B67K2458a65262b9834H4096
12784G1742a5506q4923j49546F7182c704j22481G4258d4334o6816A34855M5193
12773A80048c35037G4690P3691c15605C9322J11759g1818B79880B8488J46565
12763A75053n4009d55895a94933B23626J0834a3233A05072i0149F3518k9602O5880
12752I9796a52343k1409N8053A59682C4795J4264F339K7126b41331C0791R0919
12741A21710g1140j84784C4063a21216M1585b9592r9114B3659f3291B80814b15866
12729A76282J10880b00803R214A92565a05410B89075A27596n7212J88983A04885
$$ plain form
12808 324189 -259156 -74915 75045 -307824 197476 -68747 157811 21154 -6396 -291198 -2878
12796 164528 -313149 189488 62173 -90479 133659 -173458 267 22725 -165262 -29834 84096
12784 71742 -15506 -100429 -249975 67182 -3704 -126185 74258 -44334 -111150 134855 180048
12773 180048 -335037 74690 148381 -315605 39322 151081 -71818 279880 28488 175053
12763 175053 121044 -455895 -194933 223626 234460 -13233 105072 -90149 63518 33916 99796
12752 99796 -152343 -173752 -115699 159682 34795 49059 6339 33465 -241331 30791 121710
12741 121710 -71140 -255924 34063 -121216 -79631 -29592 -128706 23659 -63291 280814 -215866
12729 176282 287162 -200803 -191589 192565 -105410 289075 127596 70384 259367 104885
12718f2477A15024m565e715H6742k3419K38827a3095j36948o7491A86011P2412
12707B58423G1236P2509b03776A00813h1542B56216a62453c4982k1323j6087F9744
12695a64889A79773J91018j18067A10906K00400P4149j80358A160K1215p020M93181
12684E08536C5851i9959C20081c01969f0360F7534f2475b3690j4142k31559Q6019
12673a83372E5230g6880B99649A03931A6378b9558A71724a08832A93274a26349
12662d3475A99855a83589e5465j44923c6163j52447J146F4709J10010l1289h8502
12650b510j02619G4257h8017a9418B148O5919c7630B72713r7841q2025a13118
12638A77466K02411E7151a06132D41681c43005c2284A43937L7056b36741A92434
$$ plain form
12718 -62477 115024 110459 -5715 86742 63323 302150 -13095 -150043 -217534 186011 258423
12707 258423 71236 143745 -203776 100813 -81542 256216 -162453 -34982 -56305 -72392 69744
12695 -164889 179773 370791 252724 110906 311306 385455 205097 1160 22375 15355 508536
12684 508536 35851 -99959 320081 -301969 -60360 67534 -62475 -23690 -37832 -269391 -183372
12673 -183372 55230 -76880 299649 103931 16378 -29558 171724 -108832 193274 -126349
12662 -43475 199855 -183589 -55465 -200388 -36163 -188610 -187464 64709 174719 143430 -88502
12650 -2510 -105129 74257 -88017 -19418 2148 68067 -37630 272713 174872 92847 -113118
12638 177466 379877 57151 -106132 441681 -343005 -32284 143937 180993 -236741 192434
12627c04198d5863j78620m9634D3372J10128J03411r8971k5531Q354o9676i3371
12615A96587N2144m7173J21555j09330p5409a5662B82381G6781J14805c7901j63791
12604b01692r9821h6051k76955A01512L6514E7942d2118C72423a97179C53317
12593A24691b9781q0842B92140j27153C0032K29442f1157L931A71075H3057j1461
12582G1596J35932P0694K1685b5401A65329c28182A26298D4268e7323D3404b55167
12570A62235e4922B78477f5624B20464H4804d08289F9464B6890G937b3732j63730
12559a87462I9320h9104A53837P290b13293B12576a45138A465J70486d2768I3169
12547I711K1103f092m2986G1894a35490e7222A6856J00204a24931j78036J42243
$$ plain form
12627 -304198 -45863 -224483 -274117 43372 153500 256911 157940 132409 140763 71087 -93371
12615 196587 248731 201558 323113 213783 138374 -15662 282381 76781 191586 -37901 -201692
12604 -201692 -301513 -86051 -363006 101512 138026 57942 -42118 372423 -197179 353317
12593 124691 -29781 -110623 292140 164987 30032 259474 -61157 -57226 171075 83057 71596
12582 71596 207528 278222 299907 -25401 165329 -328182 126298 44268 -57323 43404 -255167
12570 162235 -54922 278477 -65624 220464 84804 -408289 69464 26890 7937 -23732 -187462
12559 -187462 99320 -89104 153837 161127 -213293 212576 -145138 1465 171951 -42768 93169
12547 9711 30814 -6092 -49078 71894 -135490 -57222 16856 117060 -124931 -302967 -160724
12536a60724C30666b86314g6667g431l6158A13458J40187B5721a866A87763C607
12524A2870Q7260b57369B22396i3960h809j46371J766J5975k5161A22924P359
12513A30283g1662A09745a86408f1740C38041a23171m2508H8230K6252j2432h752
12501B19536r8637a627A05835c62925E3227J09380g4282B22792I4744c18168a2081
12489b40577g6047B22369D6781L60615A50170a22540m9115B83627B5280b047j90189
12478a92236A36261b01756f8633l8487C47898a23213J5992C3834b34374a00525
12467a35432L6153B54819E614c3626j69172B0913g5449D426K3505L16896j64115
12456A80712k2888J37699a1115B44126C0285J2615J34045a06568A7836a26382
$$ plain form
12536 -160724 330666 -286314 -76667 -7431 -43589 113458 253645 25721 -1866 187763 3607
12524 12870 100130 -257369 222396 -93960 -8809 -155180 -153414 -137439 -162600 122924 130283
12513 130283 -71662 109745 -186408 -61740 338041 -123171 -165679 88230 114482 102050 -8752
12501 219536 120899 -1627 105835 -362925 53227 162607 -74282 222792 94744 -318168 -12081
12489 -240577 -76047 222369 46781 407396 150170 -122540 -171655 283627 25280 -2047 -192236
12478 -192236 136261 -201756 -68633 -107120 347898 -123213 -107221 33834 -234374 -100525
12467 -135432 -99279 254819 5614 -33626 -202798 20913 -75449 4426 27931 344827 180712
12456 180712 157824 295523 -11115 244126 30285 42900 176945 -106568 17836 -126382
12445a09037A54450A8597a3845l21809c0272O392q2841k08704i9115A55866J01036
12434B56902b76573A68694c67856q6080C08735E8603f4905A12574l4093b60475
12423g3225J0215A29266j5551K26970R4735D0406h1208k6528A65531a65381B74323
12411A748a78804A33189J43857a36557O8094n245G3156L01102c56585J61508B7900
12399h1836E25750a99365d8782j25917B15088b76225I2956N2436i9118k60786
12389c59904A1079a27600A11282d906j63286k19799A22805a11977b8675o2496
12379i1171q2171G164L26771a13946L0547b2631C77461D2280J96559r9557i3549
12367d9777C56097A35328K64395b02560h8434B29352j12882J699B193M5296c34087
$$ plain form
12445 -109037 154450 18597 -13845 -335654 -30272 -23880 -106721 -315425 -99115 155866 256902
12434 256902 -276573 168694 -367856 -453936 308735 58603 -64905 112574 78481 -260475
12423 -73225 -63010 129266 113715 340685 435420 40406 -81208 -107736 165531 -165381 274323
12411 1748 -178804 133189 277046 -136557 -68463 -73708 73156 374258 -356585 -195077 27900
12399 -81836 525750 -199365 -48782 -174699 215088 -276225 92956 145392 -99118 -359904
12389 -359904 11079 -127600 111282 -4906 -168192 -387991 122805 -111977 -28675 -91171
12379 -91171 -173342 7164 333935 -113946 -83399 -22631 377461 42280 238839 139282 -93549
12367 -49777 356097 135328 399723 -202560 -88434 229352 116470 118169 2193 47489 -334087
12355b66602a01591A34102a20282G627a16411e4521a9303o2557c2333q8292A72855
12343b7763C664M0213d6844j75569C0332J13521b70066J14992k4969A68661q2972
12332H5689a63333B8972e6941A91249H5283a48031N0562A04690C9740A9128K03631
12321B22759F0860f8844n2474j4277A04174a151D98031B04060O562P5723g3850
12309D75654a39023D24712H6015K25887A47243k8070M7708q1291c9226C82273
12298B77821A32580O6085f3738o360G0419J14806b9752m0046C00752g7667k42248
12287c19915I7984a03799B7537R696e4969l8975B34547c951n6909A68845i8638
12275D9808J24577a43611k09846B21456N6624O7836a04819A78528p1413d4327
$$ plain form
12355 -266602 -101591 134102 -120282 7627 -116411 -54521 -19303 -81860 -32333 -120625 172855
12343 -27763 3664 43877 -46844 -222413 30332 143853 -270066 -155074 -180043 168661 85689
12332 85689 -163333 28972 -56941 191249 85283 -148031 -97469 104690 39740 19128 222759
12321 222759 60860 -68844 -121318 -135595 104174 -1151 498031 204060 210622 286345 -73850
12309 475654 -139023 424712 86015 311902 147243 119173 166881 85590 -39226 382273
12298 277821 132580 198665 -63738 -70098 70419 185225 -29752 -69798 300752 -77667 -319915
12287 -319915 97984 -103799 27537 37233 -54969 -93944 234547 -3951 -60860 168845 -98638
12275 49808 174385 -143611 -353457 221456 278080 345916 -104819 178528 107115 -44327
12264G7409l079j9080J63764n0000b6026B33553a09123A47548O352K88431A06446
12252a58254D65946b34562C21963c01257B27467a12805C28220j19046J00411b81955
12241A27024D1489a2582c609E33594B3711l695K12949B3513K91374b32824A64704
12229D76433B03888L50800h3022D1718m913L5972j9661a03168A21501c9676a8347
12217B22791b38631A82335e9314B1372f1709B92774j6666r4191J65409J4039A2308
12205a18980C02829A04923K00608L0423r2663p153l259I8499J32966C5662K42965
12194B78627l4137G7210f1797A57030C1304J51694o0666D2043N4550k7106a31425
12182B51997M5596A46732i7364D12504K0238j84444c25690C04839j22002J82191
$$ plain form
12264 77409 74330 55250 219014 169014 -26026 233553 -109123 147548 153900 442331 106446
12252 -158254 465946 -234562 321963 -301257 227467 -112805 328220 209174 309585 -281955
12241 127024 41489 -12582 -3609 533594 23711 20016 232965 23513 314887 -232824 164704
12229 476433 203888 554688 -83022 41718 36805 72777 53116 -103168 121501 -39676 -18347
12217 222791 -238631 182335 -59314 21372 -61709 292774 276108 181917 347326 361365 12308
12205 -118980 302829 104923 305531 335954 243291 236138 232879 98499 231465 35662 278627
12194 278627 244490 77210 -61797 157030 31304 182998 122332 42043 96593 69487 -131425
12182 251997 297593 146732 -97364 412504 432742 248298 -325690 304839 182837 365028
12172C65028A50460R6604P7023A60789D9953J79793p264R3534I6359K13972n7717
12161B52614J39467A10538K17705M273B0285J14191N8471f8932L2962o7646F6498
12149H2332M51008D2174g4518E7917J7084O0678M3968J08869o3097l2684a04045
12137I3364m3302h2764B75067c1442C41571j49698a93272e2948F6862k7378b4571
12125a85372e6996k67722a27930E0885J70254A5332a97657A07554c3900j3624
12115d7524A20894k2253d6623G9225K51487h2327j02909D46534B6889b9044B73490
12103B62033c59408B14089p7638o2860a8062h044B67236J10897A44814F6392f1732
12091a2930j97749A1612J43851E7223L3700c746F1502d1364j32371I0509m0688
$$ plain form
12172 365028 150460 247064 324087 160789 49953 229746 222482 316016 96359 310331 252614
12161 252614 392081 110538 328243 332516 20285 134476 192947 -68932 -35970 -103616 66498
12149 82332 533340 42174 -74518 57917 75001 135679 179647 288516 225419 192735 -104045
12137 93364 50062 -82764 275067 -31442 341571 191873 -193272 -52948 66862 39484 -24571
12125 -185372 -56996 -324718 -127930 50885 221139 15332 -197657 107554 -33900 -47524
12115 -47524 120894 98641 -46623 79225 330712 -82327 -185236 446534 26889 -29044 273490
12103 262033 -359408 214089 136451 73591 -18062 -8044 267236 378133 144814 66392 -61732
12091 -12930 -210679 11612 155463 57223 90923 -3746 61502 -41364 -173735 90509 49821
12080D9821P6663J16252a8097A74559a80091B21734N5472J3458f1711a843A12374
12068E3571b11777R6450B21303J15958G4665R2707K9120J80502A17338E8048j5540
12057D2508a81496D5975Q2940D0229K75894d4646a904D34513D8418M18752k02958
12046B64212q5159k4982g6984k6124H5856D1721e28118a08493E4137j4063J69782
12035B09856D4934c02928e1405G9128b78740B21920e6799o3551e8914G0659J72323
12024B42982D8315B2918H891c00830I6638c75499o644A64545D8002a44218B89122
12012A89425C095b66720J30248H6719M4693H759a87760a135o077j8721D3896K23142
12000B67038K98799B48736e9099j97848D660a32180L9613a1368B21718i2703n3187
$$ plain form
12080 49821 126484 242736 -18097 174559 -180091 221734 277206 290664 -61711 -1843 112374
12068 53571 -211777 -115327 221303 337261 74665 167372 196492 376994 117338 58048 42508
12057 42508 -181496 45975 128915 40229 316123 -44646 -1904 434513 48418 467170 264212
12046 264212 179053 154071 -76984 -103108 85856 41721 -528118 -108493 54137 40074 209856
12035 209856 44934 -302928 -51405 79128 -278740 221920 -56799 -120350 -58914 70659 242982
12024 242982 48315 22918 8891 -300830 96638 -375499 -382143 164545 48002 -144218 289122
12012 189425 3095 -266720 -136472 86719 131412 8759 -187760 -1135 -7212 -25933 43896 267038
12000 267038 565837 248736 -59099 -256947 4660 -132180 -92567 -11368 221718 -92703 -145890
11989a45890B2498K78129A1709a80775E6565J93895a98791D334b87197J17493
11979a69704h0153B94091j10132a74584n8027O2088c0244A45740F7813J2328c75487
11967B25910n8643e4664j80152j7666L5110B75604b68939F0609i522m5394k68185
11956c23101A11683b01218A65510J39848j48698a41243j585a1826o4978C18760
11945F0527A9606a47273D15530i4570A16021n0009h7755m5435M4695A6124a23407
11933B07815b28629d3723C4068C882P5571R0341M3563a98569E6250K28255A25264
11921a8720A28307a1369k6346m9358k29516g8306A63268K90648c12913d7679k4968
11910g2647C75504b15630A02534e9942m1130B11a06038J6347l9708A6354N5051
$$ plain form
11989 -145890 22498 300627 11709 -180775 56565 250460 -198791 4334 -287197 -169704
11979 -169704 -80153 294091 183959 -174584 -232611 -170523 -30244 145740 67813 80141 -375487
11967 225910 167267 -54664 -234816 -252482 -217372 275604 -268939 60609 -9522 -54916 -323101
11956 -323101 111683 -201218 165510 305358 156660 -141243 -142828 -11826 -76804 318760
11945 60527 19606 -147273 415530 -94570 116021 66012 -87755 -133190 -88495 16124 -123407
11933 207815 -228629 -43723 34068 3882 79453 169794 213357 -198569 56250 284505 125264
11921 -18720 128307 -11369 -37715 -87073 -316589 -78306 163268 453916 -312913 -47679 -72647
11910 -72647 375504 -215630 102534 -59942 -101072 211 -106038 -89691 -129399 16354 71405
11899G1405h7938n6562c048k43013O1750C08966H9918J16174h6449A55970c14529
11887a85147C39511b66110g4955j02107I9975b77111E086b81270G9487J56741
11877B36228b63096e6189E6134O9775b05964Q8711C0024Q5907j9424L5462k7866
11866A04103a94289I5877a3047k90069L1462B0556a93451c1503a2357j30774K8880
11855a14251c5319E827h6023A12147h6980b3223l38119J40479l1996c7888B11549
11843A42614L00703a77023j4647I9949a4108F8285a28795k0081A43686a15040
11832B1566J2254b78246b6426B07142f9730j20114L6836D9228b56359C83474b25174
11820H7119j7590a42212L3352j1332b9768j08890E4341M9905c6143o6799l47764
$$ plain form
11899 71405 -87938 -144500 -3048 -246061 -184311 308966 89918 206092 -86449 155970 -314529
11887 -185147 339511 -266110 -74955 -177062 99975 -277111 5086 -281270 79487 236228
11877 236228 -263096 -56189 56134 125909 -205964 -117253 30024 115931 96507 131969 104103
11866 104103 -194289 95877 -13047 -303116 -271654 20556 -193451 -31503 -12357 -143131 -114251
11855 -114251 -35319 5827 -86023 112147 -86980 -23223 -361342 -220863 -252859 -37888 211549
11843 142614 443317 -177023 -191670 99949 -14108 68285 -128795 -148876 143686 -115040
11832 21566 33820 -278246 -26426 207142 -69730 -189844 -153008 49228 -256359 383474 -225174
11820 87119 69529 -142212 -108860 -120192 -29768 -138658 54341 104246 -36143 -102942 -450706
11809d50706a42375B3905M5143a25373l2346n2077C70468b64108q2292A03793
11798g0556j60272D18888h0150A72174b93515E3723j0154c5634j65169c4091k9261
11787f3352k8017A21689J97665A57411a30975A35594a91012d8040o3981D4568
11776a01389H6048n840h5280a0276C5669a36568A72920b6224m6463j52565j020
11765b26272F9983C0067K71919e74126a16356l342a6716B27840n5455J10028A17657
11753c01554J38460A16436n3926K38g7865j53193F5177a15110m9948m3938p6017
11742b85013I7824a98601A90401a60090j74226a33463I5976m1986J43396a44288
11731A54975J52803A51518b32123o9600A46118p0928h216k68354G4854b18951
$$ plain form
11809 -450706 -142375 23905 69048 -125373 -157719 -209796 370468 -264108 -346400 103793
11798 -70556 -230828 418888 -80150 172174 -293515 53723 43569 -35634 -200803 -34091 -63352
11787 -63352 -91369 121689 319354 157411 -130975 135594 -191012 -48040 -112021 44568
11776 -101389 86048 80208 -85280 -10276 35669 -136568 172920 -26224 -72687 -225252 -226272
11765 -226272 69983 30067 301986 -574126 -116356 -119698 -16716 227840 172385 282413 117657
11753 -301554 -163094 116436 62510 62748 -77865 -231058 65177 -115110 -165058 -208996 -285013
11742 -285013 97824 -198601 190401 -160090 -334316 -133463 95976 53990 197386 -144288
11731 154975 307778 151518 -232123 -301723 146118 75190 -8216 -276570 74854 -218951
11720b57535H5113j2950P5403a30323E6723b28949a04699j31148A66413a04564
11709A2864a62569G5702J3953a5639B61641j4095r0578b0234j54496A46135D3455
11697a2161j79265a2687j63974m7990m4578A72856J8117a29071D7412f9323A42509
11685D61687F2763J10743K17907b38542F4878k1461J14589l1704c73125C1014
11674b26998A45296b92443A69514J28561a31277m6243g1864B66980j18768b32626
11663B8676f2904B64667A30842a01278F5421a39416b7160B2177J68149f929m6085
11652e3014A04370i9479I2577a78133d0758k6758l5467C30319J26749e4131F723
11640B07124a07801c1482J299G4035J6341e5132B45365j05446c0814A9626R918
$$ plain form
11720 -257535 85113 72163 147566 -130323 56723 -228949 -104699 -235847 166413 -104564
11709 12864 -162569 75702 89655 -15639 261641 247546 156968 -20234 -174730 146135 43455
11697 -12161 -191426 -12687 -176661 -224651 -269229 172856 190973 -129071 47412 -69323 142509
11685 461687 62763 173506 391413 -238542 64878 43417 158006 126302 -373125 31014
11674 -226998 145296 -292443 169514 298075 -131277 -177520 -71864 266980 148212 -232626
11663 28676 -62904 264667 130842 -101278 65421 -139416 -27160 22177 190326 -6929 -53014
11652 -53014 104370 -99479 92577 -178133 -40758 -67516 -102983 330319 457068 -54131 6723
11640 207124 -107801 -31482 -30183 74035 90376 -55132 245365 139919 -30814 19626 29544
11629B9544Q6683e3992B62695A13081J3804a31421e9008C5732e5006q8771I9836
11617D357O4916M5065b50698g62A7833K70433a53226F556b20031B52182a78566
11605F5389f6890G3014J86087a14151j02447a03045A68270b14472B2778J06890
11595A29668J01791E2171M8796K4776d20A70924k9944a09111D9475L8689b32439
11583A31905F2252R9349b7833k11607d18k38239B29891e1329j34803h0050G0588
11571a51171A43539c17099M5265c3077m4325B60733r3263e0363C37784o6834a73349
11559g8054B12757a6930B54762g866m3107A00528L12083e3436o5411N5365j03134
11548a66616I1076R6825I3744g9469d514E8871j9259a07794I4901j9501b59093
$$ plain form
11629 29544 116227 -53992 262695 113081 126885 -131421 -59008 35732 -55006 -143777 99836
11617 4357 69273 114338 -250698 -762 17833 288266 -153226 6556 -220031 252182 -178566
11605 65389 -66890 73014 259101 -114151 -216598 -103045 168270 -214472 22778 129668
11595 129668 231459 52171 100967 125743 -420 170924 140980 -109111 49475 88164 -232439
11583 131905 62252 161601 -27833 -239440 -418 -238657 229891 -51329 -186132 -80050 70588
11571 -151171 143539 -317099 -271834 -33077 -77402 260733 167470 -50363 337784 270950 -173349
11559 -78054 212757 -16930 254762 -7866 -50973 100528 412611 -53436 -118847 -63482 -166616
11548 -166616 91076 187901 93744 -79469 -4514 58871 39612 -107794 94901 75400 -259093
11536C43050A07857K80072b0571o5287k73556a17772N3105D3397M7172a71987
11525B7612c919A23714h0115B44002a93070A50492b35614g1381l1634D10955a14112
11513B84131J27330d4190j5975r3630A20667D5135L8540a84354K1763C4626a73234
11501C63219a31483D19463b23107G8597b6656G0161J90682I3370K17638G1952
11490C10386j45515J81817b4314B83138L5108i3984d4956p3342B33845C8333e6139
11478G2663a83670D74431b8501B75788d8019A62046a78333e9571b2476k8767m8708
11467i9951C47253A29462R615a89329B54590E1428J07148b61106A4088h3904E9544
11455C5065K70872O8762F0178a38396B84164A981K73499j26345g2826B9741d2463
$$ plain form
11536 343050 107857 387929 -20571 -85858 -359414 -117772 -64667 43397 90569 -171987
11525 27612 -3919 123714 -80115 244002 -193070 150492 -235614 -71381 -103015 410955 -114112
11513 284131 411461 -44190 -60165 -153795 120667 45135 83675 -184354 -162591 34626 -173234
11501 363219 -131483 419463 -223107 78597 -26656 70161 260843 93370 311008 71952
11490 310386 164871 346688 -24314 283138 318246 -93984 -44956 -118298 233845 38333 -56139
11478 72663 -183670 474431 -28501 275788 -48019 162046 -178333 -59571 -22476 -51243 -99951
11467 -99951 347253 129462 139077 -189329 254590 51428 158576 -261106 14088 -83904 59544
11455 35065 305937 374699 60178 -138396 284164 1981 275480 149135 -72826 29741 -42463
11443B43792a55051P3138j12390N9332L4772L2115A94150B7424J42906c0141D92583
11431a18951c3168l9656j03577A0936b3707A62990l4663O587J6826c17942g4898
11419A8027a3771D02104j11505a14605f926A0490J83031g2151A95267e1362R547
11408d1815d183B3055b03891d8815A36562g6346o6282A75964a51951r559j8969
11397a80479f9836A23422a84080c5184l3201r587I829J251i3635n4743B10625
11385a02594k0648N3452A25315K92697G1260a72761B05650N5829b25326h1850
11374a4776k5105a8293k42261h6099m5213J2543A06519f1262H2714f48886G0020
11362B46013c5613j69471M0982A54131A7307M18783e4878C64533G1247g221k23604
$$ plain form
11443 243792 -155051 -81913 -194303 -134971 -100199 -68084 194150 27424 170330 -30141 492583
11431 -118951 -33168 -72824 -176401 10936 -23707 162990 128327 134914 151740 -317942 -74898
11419 18027 -13771 402104 290599 -114605 -6926 10490 193521 -72151 195267 -51362 -41815
11408 -41815 -4183 23055 -203891 -48815 136562 -76346 -142628 175964 -151951 -161510 -180479
11397 -180479 -69836 123422 -184080 -35184 -68385 -77972 9829 11080 -93635 -148378 210625
11385 -102594 -123242 -69790 125315 418012 71260 -172761 205650 261479 -225326 -81850
11374 -14776 -39881 -18293 -260554 -86099 -131312 -118769 106519 -61262 82714 -648886 70020
11362 246013 -35613 -205084 -164102 154131 17307 436090 -54878 364533 71247 -7221 -230825
11351b30825e1838q8809h527C07086l4508a32717c0611A7740f4578j75058G2012
11339a18212F1179i4769d996A90402f1179B22382f6147J1955k540n8006l22720
11328d37458b5953D0363A8735Q4463N7489b27799C63016A35379B5810g4517C1114
11316a06698C6275a68618N6264c8874j27966B5286a93370j15686A68367c2219
11305C0476A2813b8457D5908R2827c5970l2659a5867j21414j0574E2751A7244
11293b0253j33502F4919a94228L5361L6852A34K76968h502j03171I7384B1853
11281b67604I6486a95173A10102i2113B0069b04968f9545m0028a0647B12472c07911
11269c1755k77360C9604e5552D1963j5491c0935C0812a18679a4889A85335q452
$$ plain form
11351 -230825 -51838 -140647 -8527 307086 272578 -132717 -30611 17740 -64578 -239636 72012
11339 -118212 61179 -94769 -4996 190402 -61179 222382 -66147 -54192 -56732 -114738 -437458
11328 -437458 -25953 40363 18735 103198 160687 -227799 363016 135379 25810 -74517 31114
11316 -106698 36275 -168618 -112354 -38874 -166840 25286 -193370 -309056 168367 -32219
11305 30476 12813 -28457 45908 138735 -35970 -68629 -15867 -137281 -147855 52751 17244
11293 -20253 -153755 64919 -194228 -158867 -122015 134 277102 -8502 -111673 97384 21853
11281 -267604 96486 -195173 110102 -92113 20069 -204968 -69545 -109573 -10647 212472 -307911
11269 -31755 -309115 39604 -55552 41963 26472 -30935 30812 -118679 -14889 185335 176883
11258A76883p9390i6934m8521k50188g8497a0576H8002f4771E0411K23535b06716
11246h5135j52288j5853B30310d243j28984d8260G6282K3868b71293P9466q252
11235b00079B6644a72522h4288M424B25818a11877K2827g500j38324A88462c34058
11223A52526b6828j7832C0678J19471P271h47m6893j141I3646a02262l7708A29560
11210b13634N7055M4412b8358j09246E8020H010K13729C8136P4248c53687a03334
11198E4511a24783b3600G5293a87307A06000g5551A24408b81846B8778b39401
11187b93488M9275R2131I5246N9549D436a5627A18863J89798b010j85941d1581
11175a81246e0451o7315j09569A19800a46850p407f6561D9843a64260j56239b2406
$$ plain form
11258 176883 97493 -96934 -145455 -395643 -78497 -10576 88002 -64771 50411 273946 -206716
11246 -85135 -237423 -253276 230310 -4243 -133227 -48260 76282 100150 -271293 -191827 -200079
11235 -200079 26644 -172522 -84288 -79864 225818 -111877 -89050 -7500 -145824 188462 -334058
11223 152526 -26828 -44660 30678 150149 157420 -847 -47740 -48881 93646 -102262 -139970 129560
11210 -213634 -156579 -112167 -28358 -137604 58020 8010 221739 38136 112384 -353687 -103334
11198 54511 -124783 -23600 75293 -187307 106000 -75551 124408 -281846 28778 -239401
11187 -293488 -244213 -152082 95246 154795 4436 -15627 118863 308661 -2010 -187951 -41581
11175 -181246 -50451 -117766 -227335 119800 -146850 -154257 -66561 49843 -164260 -320499 -22406
11163E5377N1901h6662A51148a12140G8128a44687B45126A10438c61732A62650
11152H8193m2923b46501A88657i0775L4212E7795b03I9438b76355l2438B20559
11140b1463E3459b83694K4431F8254a06557I8177J22005J1926a06210k72149d614
11128A28996a28988F1790K64992A43584h0936A6967g5122H7852l6626a78162D04915
11116c34394M7382A91608b07849e0180B79977A3425h8807A88326n8450E0003P6804
11105A26807B1070N6133P0270a20057A7563J56616g8072j06846O8752B00056p9099
11094A20957D2891a93128B07395g5433C60736l3891F6057K23160c7128k9706j01270
11083a68104O7026A02693d2450a6245A16080a8503F2967L42813R1084D1293A7590
$$ plain form
11163 55377 107278 -86662 151148 -112140 78128 -144687 245126 110438 -361732 162650
11152 88193 45270 -246501 188657 -90775 -56563 57795 -203 99438 -276355 -308793 220559
11140 -21463 53459 -283694 -259263 68254 -106557 98177 220182 232108 -106210 -378359 -4614
11128 128996 -128988 61790 326782 143584 -80936 16967 -75122 87852 51226 -178162 404915
11116 -334394 -287012 191608 -207849 -50180 279977 13425 -88807 188326 129876 50003 126807
11105 126807 21070 77203 147473 -120057 17563 174179 -78072 -184918 -116166 200056 120957
11094 120957 42891 -193128 207395 -75433 360736 326845 66057 289217 -37128 -66834 -168104
11083 -168104 -101078 102693 -42450 -16245 116080 -18503 62967 405780 496864 41293 17590
11071C80273j27956A15791m7746K14028A37376J93568j11166A08373J22085j05552
11061A24906K46255m8287a2036C85473Q1757A97165K17236I2884J92504j580I2601
11049D41474B15928n8116J53735P5497p3631j14001L43954j64914J35757B03071
11038H00370k83110K6095n633J57583j86044K9031m6461j40276M25329p9596k1000
11027F76288N9715j30971q9777K81795j40315J11790l4000j49164q1054R0346
11017E94653k07471K55420l21157M50516O7318j97426Q8124l8620K22407j29316
11007G84448N8218k25427j6373M7118j78379L25155r6343C28193L60240k64266
10997D24167J49503j91081j75503j8163P13227B95696J59984J62102J2072j14976
$$ plain form
11071 380273 252317 115791 68045 282073 137376 330944 219778 108373 230458 124906
11061 124906 371161 322874 -12036 385473 467230 197165 414401 92884 285388 283808 92601
11049 441474 215928 157812 311547 387044 313413 199412 543366 378452 514209 203071
11038 800370 517260 543355 537722 695305 509261 538292 491831 351555 776884 697288 676288
11027 676288 736003 605032 515255 797050 656735 768525 734525 585361 504307 594653
11017 594653 387182 642602 321445 771961 839279 641853 729977 691357 913764 784448
11007 784448 842666 617239 600866 647984 469605 794760 698417 328193 688433 424167
10997 424167 573670 382589 207086 188923 902150 295696 455680 617782 629854 514878
10987E14878p6515n3508n2905K84284j09553K12410q2669J41267j36652Q3209
10977G24246J32997n7661O9413l16033L99307l16711J28883K8640J97022m23864
10967E66239L04081K23039k8061J58371N1023k20353K53881R969J92613J10813
10957A621615M73530l12805J92463O78035k19485m5533r0536J34815m10563R5139
10947B116675N4061o44056k55448l5539K91967j66023j98177K10783k45619M02832
10937A531456m32327L3672l5789j49705K43639n43213k96787K60030A61229j7938
10927A43291K63644A19802L33698j32550O5945A47623K19440A54679m0531K57828
10917C71976D2597b37590B10613M2660h1265A64053b51377h0321e353j19504j384
$$ plain form
10987 514878 438363 384855 331950 616234 506681 719091 636422 777689 641037 724246
10977 724246 857243 799582 868995 552962 952269 635558 764441 793081 990103 566239
10967 566239 870320 1093359 1065298 1223669 1274692 1054339 1308220 1318189 1510802 1621615
10957 1621615 2095145 1782340 1974803 2652838 2433353 2387820 2297284 2432099 2021536 2116675
10947 2116675 2170736 1526680 1271232 1235693 1527660 1361637 1163460 1374243 1128624 1531456
10937 1531456 1099129 1132801 1097012 947307 1190946 647733 350946 610976 161229 143291
10927 143291 406935 119802 453500 320950 386895 147623 367063 154679 114148 371976
10917 371976 42597 -237590 210613 253273 -81265 164053 -251377 -80321 -5353 -124857 -126241
10906a26241A96877a45758L677a8658l6165j70038o8369A70627a64969A82769
10895a58528G4463B9922a64426A66347F9003b37747J01803c0299l7992l8782j44879
10884b51952e5664H8489J52090I1380K15867h9749l20162a6537G7424a14719B75946
10872a52646m7865B23039e93634E5535d02234A53511P3219a67955f5736A77214
10861b35086K1348D797a78612j12490a29949N6360j22895B25175a83708B05444
10850b5435A22527E1878a03536A57824d2174O521B21414F428B200c21874A82681
10838B70266e1269m9832A8190a03403l09571a79030h4139j8652L7861k62195N2456
10827b74669a29581I2917J55070a68154D1318Q1391h4687I2772O0407a29563D26341
$$ plain form
10906 -126241 196877 -145758 -142081 -18658 -54823 -224861 -293230 170627 -164969 182769
10895 -158528 74463 29922 -164426 166347 69003 -237747 -135944 -30299 -68291 -107073 -251952
10884 -251952 -55664 88489 240579 91380 307247 -89749 -409911 -16537 77424 -114719 275946
10872 -152646 -200511 223039 -593634 55535 -402234 153511 226730 -167955 -65736 177214
10861 -235086 -213738 4797 -178612 -291102 -129949 -73589 -196484 225175 -183708 205444
10850 -25435 122527 51878 -103536 157824 -42174 -35653 221414 6428 2200 -321874 182681
10838 270266 -51269 -101101 18190 -103403 -412974 -179030 -84139 -102791 -64930 -327125 -274669
10827 -274669 -129581 92917 247987 -168154 41318 122709 -84687 92772 153179 -129563 426341
10815A58142e8747A8802f2535A89085F2045i32k05108G5689b5800H7109R728g227
10802F375a30831a6820B94972A5484b0659A12344k9787K9179K1813Q582J32277
10791B74408A24521l0511b49552m0771A05137b88178J20500A57682b97689h0521
10780G9879J95192A8989c82254A68343i6761j00421A24315e0432G5244a43932
10769A07318h3173q4903b5078I6068h5592k16050l5348b8087k84175I2570m3126
10758D9444a96037O4529k50613B04507f283E3582f2996k56845J45958d007j5326
10747a9333j29816H9243m4043i7741C6498c63873F3016g1157b1464j36859A83830
10735c093G9339b50076A38724Q4798i8023c3669H8228J6069b47456A07227a97111
$$ plain form
10815 158142 -58747 18802 -62535 189085 62045 -932 -206040 75689 -25800 87109 96837 -7227
10802 6375 -130831 -16820 294972 15484 -20659 112344 82557 111736 133549 142131 274408
10791 274408 124521 94010 -249552 -290323 105137 -288178 -167678 157682 -297689 -80521
10780 79879 275071 18989 -382254 168343 -96761 -197182 124315 -50432 75244 -143932
10769 107318 -83173 -168076 -25078 96068 -85592 -301642 -336990 -28087 -312262 92570 49444
10758 49444 -196037 -131508 -382121 204507 -6283 53582 -62996 -319841 -173883 -4007 -19333
10747 -19333 -149149 89243 45200 -97741 36498 -363873 63016 -71157 -21464 -158323 183830
10735 -3093 79339 -250076 138724 223522 -98023 -33669 88228 104297 -247456 107227 -197111
10723a8299j86113K5095j10086G4468j1670B8581J99108c33021i6210j68691i6428
10711f3854A08221O3955m7738a3302H1754a23855l43723a26899e7772A3525K01510
10700B15035A547J84147a62070N0462E46694a85709K9247p6449A47318k3542a87747
10688A15094b05497A23116b29382h536m39197A8973h2928l2732C5094g7953a2428
10676a11782k7376n2635M0834B4652r777a54416f4013j64157L4988c5782n2911
10665h8693A06079g6289k3989j92429g2468j16598j08116F8512a951D1255b3341
10653g0328n5158e6481o9148d5035n245B267M195b05754d6802C5365a8873A23511
10640b45423B8484J31325a92471C8386b9995A21980a58965A32996i4700k4210
$$ plain form
10723 -18299 -204412 -179317 -289403 74468 62798 28581 227689 -333021 -96210 -264901 -96428
10711 -63854 108221 172176 124438 -13302 81754 -123855 -467578 -126899 -57772 13525 215035
10700 215035 1547 185694 -162070 -111608 546694 -185709 -156462 -232911 147318 123776 -187747
10688 115094 -205497 123116 -229382 -8536 -447733 18973 -82928 -115660 35094 -77953 -12428
10676 -111782 -139158 -191793 -150959 24652 14875 -154416 -64013 -228170 -193182 -35782 -88693
10665 -88693 106079 -76289 -100278 -292707 -72468 -189066 -297182 68512 -1951 41255 -23341
10653 -70328 -125486 -56481 -125629 -45035 -50280 2267 6462 -205754 -46802 35365 -18873 123511
10640 -245423 28484 159809 -192471 38386 -29995 121980 -158965 132996 -94700 -118910
10630a18910d9076A69568b86042A11594c36345j5637I3642a04062d2353j51469
10620a93822L9198H2584a77404Q211A27239c99234e350k39936H7483a54839l871
10609a58710A17738k7238M7392a08770O091A33478F983a89106R0082B50727a14364
10597G6430J77446e8360K5137B3570a02377E0686e02782c3983l9114j25712a8123
10585A39357K46101j52883G0208a40207A57335H9f54k5384k66741A78783b97088
10573F4481K5640i1632A20163c2578C31424a57120j92910J51249I3352a52652
10562A04475J05944a09740K0383E8208a96504i4839q4743l8408D1482b8358k33533
10551b61891f4570k8919o8356e229D9410b1714j29955b6563C2131h4796j70057
$$ plain form
10630 -118910 -49076 169568 -286042 111594 -336345 -351982 93642 -104062 -42353 -193822
10620 -193822 -154624 82584 -177404 -169193 127239 -399234 -5350 -245286 87483 -154839 -158710
10609 -158710 117738 90500 137892 -108770 -102679 133478 6983 -189106 -99024 250727 -114364
10597 76430 253876 -58360 -33223 23570 -102377 50686 -502782 -33983 -73097 -198809 -18123
10585 139357 385458 232575 70208 -140207 157335 89 -654 -26038 -292779 178783 -297088
10573 64481 90121 -91632 120163 -32578 331424 -157120 -350030 -198781 93352 -152652
10562 104475 210419 -109740 -89357 58208 -196504 -94839 -179582 -217990 41482 -28358 -261891
10551 -261891 -64570 -93489 -161845 -5229 49410 -21714 -151669 -26563 32131 -84796 -254853
10540b54853D7927J0410g7792j70295j79788e7478j3417K3507B55288J81343a01505
10528e7379m24125a65048M9599l5938b4305A724K39775E7579a74707J3067j87380
10517c49020a08603j4753j8670G4942E037b29994c8216C63345a52085E9005a63787
10505A49827a25475A12479a84954A35967b02216M3361B4742L1498b1430m37746
10495d59176h4279B04592e0275n1671l70332K07082J08012H759a01134h613N10
10484h103D0191a14929L0823K704K2323b9358f028A69151b23878A9740b23779
10472F1024J85561f1982k33059B6956N8332a26539B02886b53994C984j208J28424
10461A31200c2540A57238J63015j47445O3113h0736A8782a10974A53218i9487
$$ plain form
10540 -254853 47927 58337 -77792 -248087 -427875 -57478 -70895 -47388 255288 436631 -101505
10528 -57379 -481504 -165048 -115449 -151387 -24305 1724 241499 57579 -174707 -161640 -349020
10517 -349020 -108603 -123356 -142026 74942 5037 -229994 -38216 363345 -152085 59005 -163787
10505 149827 -125475 112479 -184954 135967 -202216 -158855 24742 56240 -21430 -459176
10495 -459176 -84279 204592 -50275 -101946 -472278 -265196 -157184 8759 -101134 -8613 -8103
10484 -8103 40191 -114929 -84106 -81402 -59079 -29358 -6028 169151 -223878 19740 -223779
10472 61024 246585 -61982 -295041 26956 85288 -126539 202886 -253994 3984 2776 131200
10461 131200 -32540 157238 320253 172808 235921 -80736 18782 -110974 153218 -99487
10450b21963e0386F9654J78293c407A17222a25164A81506g7756A89381a66435
10439i7286A0179K55419c3040j89049C31479C589a94716B5499J8746a66043K8623
10428a37420d557O44A47137M3647L2942a0316k9711k61699b7957F6706N6041M3733
10416A66480a45185N9845b6405j35419B70187A327L6512J96850q2041a63499B62090
10404b30904J10468p1092j31485A08504c72015H3578c8838m6219m1569a3317o4227
10393g7544m1472L9977f044C78993e6478j63478B7661d6237E7884L29271f2823
10381c9454A82504C4415L9263K49089K0792g147p4813H329J54072G4744K3326
10370I8070J20906r6512a07923F1911R5643D0902a24137B96013g0607C6115L405
$$ plain form
10450 -221963 -50386 69654 247947 -3407 117222 -125164 181506 -77756 189381 -166435
10439 -97286 10179 265598 -33040 -222089 331479 3589 -194716 25499 44245 -166043 -137420
10428 -137420 -4557 -3913 147137 190784 223726 -10316 -40027 -301726 -27957 66706 122747 166480
10416 166480 -145185 -85340 -26405 -161824 270187 1327 37839 234689 152648 -163499 262090
10404 -230904 -120436 -191528 -323013 108504 -372015 83578 -38838 -85057 -126626 -13317 -77544
10393 -77544 -119016 -79039 -6044 378993 -56478 -219956 27661 -46237 57884 387155 -62823
10381 -39454 182504 34415 73678 322767 343559 -7147 -81960 8329 162401 74744 98070
10370 98070 218976 122464 -107923 61911 157554 40902 -124137 296013 -70607 36115 39520
10359C9520K22549J78855l4304A97696P3313p5527g3236C29855j22028K83971
10349D91798k07342A13829M13098r5965o2049J7806A01523K53647A49953q327
10339A41626f1655P668B09864J33150M0586R2612A50471L93267d3169D23670A27279
10327B42435i3224A80551J01267J42593A86987H893b16283G0837M2257J57867
10317B70961b33906A22411K40734b548o7771B37959a18683A54962J5567a25108
10306a01817b7797I137P6394K36469o9769f0312B49319i7256B28724j08790C7344
10294e5254p5518B00772a76104E1807a85608A36180d11112a04725A79297D9560
10283G6524J97333g0085D96638k43234A3515N4445a50100j031A2169e19261b12101
$$ plain form
10359 39520 262069 440924 406620 197696 271009 195482 -73236 329855 207827 491798
10349 491798 284456 113829 526927 430962 368913 386719 101523 355170 149953 141626
10339 141626 -61655 -53987 209864 343014 383600 476212 150471 543738 -43169 423670 127279
10327 242435 -93224 180551 281818 424411 186987 8893 -216283 70837 113094 270961
10317 270961 -233906 122411 363145 -2548 -70319 237959 -118683 154962 170529 -125108
10306 -101817 -27797 9137 85531 322000 252231 -60312 249319 -97256 228724 119934 37344
10294 -55254 -130772 200772 -176104 51807 -185608 136180 -411112 -104725 179297 49560
10283 76524 273857 -70085 496638 253404 13515 67960 -150100 -151131 12169 -519261 -212101
10271G883g7881o4942H4425b25484c3963A50310a70653q4562E8120a1137j51606
10260a62743n536a0125k06627k1955G1264g9716A8831b25044C31779a69674B11979
10248A87528a32161a0592o1190j009C38461J02083A94071J19453A50030O2760
10238B12790K01813r6259A02545Q87J02722a24754I0320M9209c0558B30236h3926
10226d4266q1065l09357a47726f1480k9364n8056b3307r6014C2140f3339A89589
10214d12984a86655A32646a17800o2973a2485k70500I5987f6279B4539a29112
10203c48295a27755b120l38170J60308H3890a6524j22683K2241C04222b14178
10192d9638A96514Q6944d21382J17627j2978f9215q7572K3086A03807i7452m1682
$$ plain form
10271 7883 -77881 -142823 84425 -225484 -33963 150310 -170653 -255215 58120 -11137 -162743
10260 -162743 -168279 -10125 -216752 -238707 71264 -79716 18831 -225044 331779 -169674 211979
10248 187528 -132161 -10592 -71782 -72791 338461 440544 194071 313524 150030 212790
10238 212790 414603 318344 102545 103432 206154 -124754 90320 139529 -30558 230236 -83926
10226 -44266 -125331 -434688 -147726 -61480 -90844 -148900 -23307 -119321 32140 -63339 189589
10214 -412984 -186655 132646 -117800 -180773 -12485 -282985 95987 -66279 24539 -129112
10203 -348295 -127755 -2120 -340290 -179982 83890 -16524 -139207 -116966 304222 -214178
10192 -49638 196514 283458 -421382 -303755 -316733 -69215 -156787 -133701 103807 -97452 -139134
10181a39134B98696a13042B28864B5765a19485A12203J84224q6539b78380a23588
10170A77438b74101Q8291k70681B58188A0664a11992k57597A93640k2615D0382
10159a44964b0558B82961b06791B1490L595b54138A0387h0674j11076N07Q0711
10148a10532b9014G0857M1592b37603B49085E9851K1634a4583B18380e3936J8153
10137c5783B09509b68379l14815a85534F7775B9801g8155J5537E7173c12437d1855
10125c10767A63128d095p871A38303e2959j67872G5811a54015A7512a93977A49287
10113A54844b73760a04489A29601b10261A30007a33068B135L5631a79955k9370
10103b09325A13185J70426B2210c05609a19799L1554j57319K3801B79717a11421
$$ plain form
10181 -139134 298696 -113042 228864 25765 -119485 112203 296427 209888 -278380 -123588
10170 177438 -274101 -185810 -456491 258188 10664 -111992 -369589 193640 171025 40382
10159 -144964 -20558 282961 -206791 21490 25085 -254138 10387 -80674 -191750 -191243 -110532
10148 -110532 -29014 70857 112449 -237603 249085 59851 81485 -14583 218380 -53936 -35783
10137 -35783 209509 -268379 -583194 -185534 67775 29801 -78155 -62618 57173 -312437 -41855
10125 -310767 163128 -4095 -11966 138303 -52959 -220831 75811 -154015 17512 -193977 149287
10113 154844 -273760 -104489 129601 -210261 130007 -133068 2135 37766 -179955 -209325
10103 -209325 113185 283611 22210 -305609 -119799 -88245 -245564 -221763 279717 -111421
10092a37157L9465M3293F9070f3648D1060c4612l4969C97640g9303j14599l0026
10081b23928A45075n4692J29539d6793G3559J80510i6938A7547i7489h783k27678
10070b36461k7946B72147H207b48163b4936M208H4038a47479a2979j78635c8275
10058e1872A42044b46494k8834B3313Q5975J28222A264a42468n5004N3949C8562
10046a38833N1198k13449a19692k3783G2498b3521n8436A33282a93229e7556m5707
10035a03263D2315b7677l0988m32040a45381q2312F8894j108a85713l421K9050
10024a60084o8823J11118k04783a32920A99877c74991A30383C1597b89027A15049
10013b6046j39774M2165D8739K4156J70094a59315M6099j25347J16994A1581a99654
$$ plain form
10092 -137157 -97692 -54399 69070 -63648 41060 -34612 -69581 397640 -79303 -193902 -223928
10081 -223928 145075 90383 219922 -46793 73559 254069 -96938 17547 -97489 -8783 -236461
10070 -236461 -264407 272147 8207 -248163 -24936 -20728 84038 -147479 -12979 -191614 -38275
10058 -51872 142044 -246494 -275328 23313 109288 237510 1264 -142468 -197472 -143523 38562
10046 -138833 -87635 -301084 -119692 -143475 72498 -23521 -81957 133282 -193229 -57556 -103263
10035 -103263 42315 -27677 -58665 -490705 -145381 -227693 68894 67786 -185713 -189134 -160084
10024 -160084 -228907 -117789 -322572 -132920 199877 -374991 130383 31597 -289027 115049
10013 -26046 -165820 -123655 48739 72895 242989 -159315 -113216 -238563 -121569 11581 -199654
10001d1258i85j32065j95484Q3864b045j06156I9639l2727i1544M3435A30481
9989A64499A4944d07576a14530N0517H071c12005A9367c01792B40434a72472j11065
9978b83537e9261k63897M9221E4159g258j91231L5752B8679A2544a13249j37386
9967b50635j55696A20189b29502f3150k04280P0233a1307A29847d0328j80373
9957b20701F3174a994l95203J71523A48171j6982j4098a35711j65666j4120a334
9945E4741b46285O2282q7241A7753d7135A57772e0658j01424A10549O6964B6310
9933c37535J58193k92421a00685H0339M9241a40117M4130j41016g5599j34445
9923b10044L7263B54966b76630E3120J11082Q148c74535C4098e324C9320a20274
$$ plain form
10001 -41258 -985 -133050 -328534 -244670 -2045 -108201 99639 66912 -91544 -48109 130481
9989 164499 14944 -407576 -114530 -64013 8071 -312005 19367 -301792 240434 -172472 -283537
9978 -283537 -59261 -323158 -273937 54159 -7258 -198489 -162737 28679 12544 -113249 -250635
9967 -250635 -406331 120189 -229502 -63150 -267430 -197197 -11307 129847 -40328 -220701
9957 -220701 63174 -1994 -397197 -225674 148171 131189 117091 -135711 -301377 -315497 -1334
9945 54741 -246285 -184003 -271244 17753 -47135 157772 -50658 -152082 110549 177513 26310
9933 -337535 -179342 -471763 -100685 80339 129580 -140117 -95987 -237003 -75599 -210044
9923 -210044 -172781 254966 -276630 53120 164202 172350 -374535 34098 -5324 39320 -120274
9911d7596A10783f0825A1829J44231O8415g4157F8528b31369H2354e33561B51689
9899B9968P666J1447A9860a56509j68667h1075a5696p8648A83R9114a59525C6500
9886A98448b11779M0493J5824a5087G5806c06482B6330c75786J06425a03167L2838
9875g0329j25223O8893N8837j29227F0806h6914G0928O1404a06487l6753I3454
9863a33690B09622B9493a1727k74652K7848a0219r245l97774A81819L2431D1413
9851a44794A11495a90418A63629B0937a61853F6857j3740B5741c11974d4865j930
9840d6795k41620A1811R4282f3645A70592a35764E6325b9840n3912A53909c20140
9828H0490c9357E6929h1098K2600A07394C7404c5991B47027d1167j17260P4561
$$ plain form
9911 -47596 110783 -60825 11829 156060 224475 -74157 68528 -231369 82354 -533561 251689
9899 29968 37634 49081 19860 -156509 -325176 -81075 -15696 -94344 183 99297 -159525 36500
9886 198448 -211779 -171286 -155462 -15087 75806 -306482 26330 -375786 -269361 -103167 -70329
9875 -70329 -195552 -126659 -67822 -197049 60806 -86914 70928 132332 -106487 -143240 93454
9863 -133690 209622 29493 -11727 -286379 -258531 -10219 -19464 -417238 181819 214250 41413
9851 -144794 111495 -190418 163629 20937 -161853 66857 53117 25741 -311974 -44865 -46795
9840 -46795 -288415 11811 106093 -63645 170592 -135764 56325 -29840 -83752 153909 -320140
9828 80490 -39357 56929 -81098 -58498 107394 37404 -35991 247027 -41167 -158427 -83866
9817h3866c157E2098a56379J372k19070a17948A68105a05732a9063k1685j24577
9806a65325A15517a0329j33881A22311j5617a60554A29994j4396h3249j78384
9796b61633j887J12215P272m4077C1777a33476l3126e3685j63313C9515J41806
9785A81321A907b06929A5725J63728b01670A8891J78907e0496p4847b3804k9251
9774e3055A15232b88006A44200b68925B87831b37048g2519p0715M7072c6650H806
9762a5653l50365B66778c25392B55067H8584c71906H9225a25070f462j53754p8313
9751b38529f4659B78607c80561O1403J39657N8257A12033D6612a39819j96469
9741c36288e9797P031H4190b21724A27322c63946a39293j13998C29343a66059
$$ plain form
9817 -83866 -3157 52098 -156379 -155007 -374077 -117948 168105 -105732 -19063 -40748 -165325
9806 -165325 115517 -10329 -144210 122311 106694 -160554 129994 115598 -83249 -261633
9796 -261633 -263520 -151305 -144033 -188110 31777 -133476 -166602 -53685 -216998 39515 181321
9785 181321 1907 -206929 15725 179453 -201670 18891 197798 -50496 -125343 -23804 -53055
9774 -53055 115232 -288006 144200 -268925 287831 -237048 -72519 -143234 -96162 -36650 8806
9762 -15653 -366018 266778 -325392 255067 88584 -371906 89225 -125070 -6462 -160216 -238529
9751 -238529 -64659 278607 -380561 -319158 -179501 -121244 112033 46612 -139819 -336288
9741 -336288 -59797 -52766 84190 -221724 127322 -363946 -139293 -253291 329343 -166059
9730i4822g656k3086j58244b3929j39023k20798I382K0440b06970l2129K0285
9719b18814J05279j57249J35318a5078j11458C5569K25840a99489A08331A9379
9708C71615d7400A14557J5748d8912l0569D7691a39224E8847O7306b49051g6086
9696B85801d1980A56756d8310R99q0956B31485c44779b1391p3950A84821a46835
9684h9755D0864b72389B84919a04301C12950a62698j8868o5219M9249q108i6235
9672i8154l04952C12526c5255j06211N6955j27643E8423D613d00143A0647d51436
9660a12486a6446j67360D1406J16211A8581i3839l14948a10804A93887F3754a35347
9648h9066l21681g4250I0945I763b8760m8174A40174a13335a3858I5691J27350
$$ plain form
9730 -94822 -7656 -30742 -188986 -23929 -162952 -383750 9382 29822 -206970 -239099 -218814
9719 -218814 -113535 -270784 -135466 -15078 -126536 35569 261409 -199489 108331 19379
9708 371615 -47400 114557 130305 -48912 -79481 47691 -139224 58847 126153 -249051 -76086
9696 285801 -41980 156756 -48310 -47311 -128267 231485 -344779 -21391 -95341 184821 -146835
9684 -89755 40864 -272389 284919 -104301 312950 -162698 -181566 -246785 -197536 -205644 -96235
9672 -98154 -403106 312526 -35255 -141466 -84511 -212154 58423 4613 -400143 10647 -451436
9660 -112486 -16446 -183806 41406 157617 18581 -93839 -408787 -110804 193887 63754 -135347
9648 -89066 -410747 -74250 90945 9763 -28760 -76934 140174 -113335 -13858 95691 223041
9637B23041f6059K4593H1393a9070A10735B0803a06430A73933b64150O0870a0681
9625a39031J1761j53421O7894A47203d2924j50401j38050f114k17408j18044J56867
9614a84699A5469L7570b62847e1371A98392a35840c8137A6142a54043B0338J18624
9603A38962a01042K7481A34231b91354K7788a28166e8545A1518K72768a88051
9592c9858l41947J28985h6643J6092B4672J09274c93404J71774a5558j37306A78570
9580g8385j87125D74356c5331a4456H5066O4657P5092e8188m24846i4342A64124
9568b34665Q7895H3702J24521g9976k8262k04939P5902C9949i2592d0384H0352
9556b25721A9688J72749a44779p5722J6751Q6757j64327d6077l09095b5450D012
$$ plain form
9637 223041 -66059 -41466 81393 -19070 110735 20803 -106430 173933 -264150 -203280 -10681
9625 -139031 -127270 -280691 -212797 147203 -42924 -193325 -331375 -6114 -223522 -341566 -184699
9614 -184699 15469 53039 -262847 -51371 198392 -135840 -38137 16142 -154043 20338 138962
9603 138962 -101042 -73561 134231 -291354 -263566 -128166 -58545 11518 284286 -188051
9592 -39858 -381805 -252820 -86643 -70551 24672 133946 -393404 -221630 -15558 -152864 178570
9580 -78385 -265510 474356 -35331 -14456 85066 149723 224815 -58188 -483034 -94342 164124
9568 -234665 -146770 83702 208223 -79976 -108238 -313177 -237275 39949 -92592 -40384 80352
9556 -225721 19688 192437 -144779 -220501 -203750 -116993 -281320 -46077 -355172 -25450 4012
9544a58347a0420A04354c0121F856b62428J24063I6372c64552a04613k35650a59005
9532a08664q5838k0935J05744e913l28092D89270a88071L7230G8508b89178A48461
9520b41865F5468c33443a19878E8529J93365b42319A88109j0020h6068K4156m1950
9509a03862M0175j31705A63783b73254a0713B54977h6974H639J50396h9796J3219
9498g6577J0405A72405b89850A16496b20568R4138C02865D3766d093j55645O2899
9487i6839I615a78242g7283k20308D1327J9105a24512G2291L2466a27030M5964
9476h1066A47300O4704p1759a91665A34005e1151r4492A6427J98832d28416a1800
9464C6959K7866a15916E8457c4004j90848c7051A25581a29004q7831j05069O5013
$$ plain form
9544 -158347 -10420 104354 -30121 6856 -262428 -138365 96372 -364552 -104613 -340263 -159005
9532 -108664 -194502 -215437 -109693 -5913 -334005 489270 -188071 -150841 78508 -289178 148461
9520 -241865 65468 -333443 -119878 58529 251894 -242319 188109 178089 -86068 -61912 -103862
9509 -103862 -63687 -195392 163783 -273254 -10713 254977 -86974 8639 159035 -89796 -76577
9498 -76577 -66172 172405 -289850 116496 -220568 -126430 302865 43766 -4093 -159738 -96839
9487 -96839 9615 -178242 -77283 -297591 41327 60432 -124512 72291 104757 -127030 -81066
9476 -81066 147300 212004 140245 -191665 134005 -51151 -145643 16427 215259 -428416 -11800
9464 36959 64825 -115916 58457 -34004 -224852 -37051 125581 -129004 -216835 -321904 -256891
9453b56891a2568A94839b50862D7973b04325R3901A05076b2039d332A38105o8963
9442F9142h161j14441j11311E6074c26775A25545M0108B2163b13410g4652L4672
9431c9980B2021a03998m2972o6314M7476a115j32206a7681l6454L784j3251A12147
9418B02654b73056a0605j95037R4711A2966J21644b91375f8555j25728n5041a16298
9406b25538R6309E120g884j75125l3437D8650G391K92298a5678m8826B84088l5911
9394B48177B6069a47187r6860m1995a11129r4612E2819J13570a36501k3388d8211
9382B19097A5116K21491a31526j61338A6461f3183q4970l7665A924M0182d55577
9370A5032a7299j81492l6452j08793a70865j08478P3415R0246M6270C23890b59393
$$ plain form
9453 -256891 -12568 194839 -250862 47973 -204325 -110424 105076 -22039 -4332 138105 69142
9442 69142 -8161 -122602 -233913 56074 -326775 125545 165653 22163 -213410 -74652 -39980
9431 -39980 22021 -103998 -146970 -213284 -165808 -1115 -133321 -17681 -54135 -50351 -63602 112147
9418 202654 -273056 -10605 -205642 -110931 12966 134610 -291375 -68555 -194283 -249324 -116298
9406 -225538 -129229 5120 -7884 -183009 -216446 48650 7391 299689 -15678 -64504 284088 248177
9394 248177 26069 -147187 -244047 -286042 -111129 -205741 52819 166389 -136501 -159889 -48211
9382 219097 15116 236607 -131526 -292864 16461 -63183 -148153 -185818 1924 42106 -455577
9370 15032 -17299 -198791 -235243 -344036 -170865 -279343 -205928 -115682 -69412 323890 -259393
9358A21722N7916b98041a02527c386o815A8342h3685n2646B31012a49723N4077
9347i5646a5615j70030D2530O6822K01579a53875l24625g3997A36315K06602a82141
9335b67079a6995j68377R646n1906O7697c8704m7043C29255b36064M4135Q493
9324a83436D0512L5284j0197a365j94765D4037b11926m6108j59329b1515C8521
9312G8904b14205q6839P2657B6356b24226J00b5986a2484F7738Q4228i1623D1698
9299A76139a88216K9836I2124b87635f8928j05370B35559a47109b1179A25426
9288a01573j41497R2417q68M8923J3536b6206l22695a03834q7769O9167N0270
9277g2166K0826G6883b70271I4722i2664p1377C04877A08295b2513j3830k9725
$$ plain form
9358 121722 179638 -298041 -102527 -3386 -10201 18342 -83685 -136331 231012 -149723 -95646
9347 -95646 -15615 -185645 42530 109352 310931 -153875 -478500 -73997 136315 342917 -182141
9335 -267079 -16995 -185372 -175726 -227632 -159935 -38704 -85747 329255 -236064 -191929 -183436
9324 -183436 40512 75796 65599 -1365 -196130 44037 -211926 -258034 -417363 -21515 38521
9312 78904 -214205 -301044 -228387 26356 -224226 -224126 -25986 -12484 67738 151966 -91623 41698
9299 176139 -188216 -158380 92124 -287635 -68928 -174298 235559 -147109 -21179 125426
9288 -101573 -243070 -150653 -151521 -102598 -89062 -26206 -348901 -103834 -191603 -122436 -72166
9277 -72166 -51340 76883 -270271 94722 -92664 -164041 304877 108295 -22513 -36343 -66068
9266f6068G5170c60957a39946F5132c0877r1033M6246B2985a47832c5429A76940
9254a94040b5861A21753A9744O1200d90616E4189a11811A23580a46374k69117
9244d15491B75050b45242C3222c24357A40215K2143D5578K14183M837b00382D5212
9232h9939A50778a12758A22431c2034I2540A4612M85189c5335k10734J18616j18793
9221b46246h5845c3100k37586J08935r7133o7417b5763k43444E9252d7231A15347
9209c02183a22502B48591p5127b48125j11481C8854a43906F1729d68j39119m4918
9198a84505p3471d4780o0877n2176H6142g9703A8577b14914L4615C9684b73018
9186h2876k21828j98373A37931a7009A35017d86619E3748e2927k87090B6370M12224
$$ plain form
9266 -66068 75170 -360957 -139946 65132 -30877 -121910 -75664 22985 -147832 -35429 176940
9254 -194040 -25861 121753 19744 80944 -490616 54189 -111811 123580 -146374 -415491
9244 -415491 275050 -245242 33222 -324357 140215 162358 45578 259761 264598 -200382 45212
9232 -89939 150778 -112758 122431 -32034 92540 14612 499801 -35335 -246069 -127453 -246246
9221 -246246 -85845 -33100 -270686 -161751 -258884 -326301 -25763 -269207 59252 -47231 115347
9209 -302183 -122502 248591 173464 -248125 -359606 38854 -143906 61729 -468 -139587 -184505
9198 -184505 -257976 -44780 -105657 -157833 86142 -79703 18577 -214914 -180299 39684 -273018
9186 -82876 -304704 -503077 137931 -17009 135017 -486619 53748 -52927 -340017 26370 438594
9175D38594a65249P1061p8225j85443a59179A56196O1656l9990b62729m8987B56505
9163b69499J05846J8I457j713R3945d6921A5299a93373D6802j0946a83070D6680
9150a78327Q4473j9080p6867G0287L6780K24443G7111a51001d8814P210A09149
9138i5127H2464J27035L569a13254o0865D1149c1530A80233M4366c2560D05016
9126D5687d5939j35403F1509a02110L3102E116h1533i914m3855O962r2967f9079
9113i914F6172O5784a46771B10361i1330a3569A11168J2192d4551k71889e2709
9101c70861B47916b42928l5398C146b99156d1749k31137A23785n8340J03084f4491
9089E6841H412J10434a72675O1873I9243a38169l4367f3380A16674g4760l3424
$$ plain form
9175 438594 -165249 -94188 -172413 -357856 -159179 156196 217852 177862 -262729 -311716 256505
9163 -269499 -163653 -163635 9457 7744 101689 -46921 15299 -193373 46802 35856 -183070 46680
9150 -178327 -93854 -112934 -189801 70287 107067 331510 77111 -151001 -48814 -41604 109149
9138 -95127 82464 209499 213068 -113254 -174119 41149 -31530 180233 224599 -32560 405016
9126 45687 -45939 -181342 61509 -102110 -69008 5116 -81533 -9914 -53769 -46807 -139774 -69079
9113 -9914 66172 131956 -146771 210361 -91330 -13569 111168 123360 -44551 -316440 -52709
9101 -370861 247916 -242928 -278326 3146 -299156 -41749 -272886 123785 65445 168529 -64491
9089 56841 8412 118846 -172675 -110802 99243 -138169 -172536 -63380 116674 -74760 -108184
9078a08184A72912a63598A19065b52721a9215A97598e9406B3945J82096J16601
9068C22642d0910B89871a17604e5112j47230i777D9770g6461k395j24045E5503
9056d32251a39164m0949B90908r9728i2018B0471J39583a99208P5586b4868B1345
9044h1236d0579H5700c72712A26473a76636b4428A39426a45722j56529c1467J5109
9033a6358G4159a63258G4323J581c3065B04555c4961A63289a39119B26361d77468
9021B27789b6065C4773e7051q0785j438k22289G1373N5986a48661N1246l16845
9010d14260a49322J4086k8705a325j35867k2057A76779A6175c70415F4013h720
8998B07085a20184B30827n4882G4150i0756A2496b58452A62715b58736f797j21969
$$ plain form
9078 -108184 172912 -163598 119065 -252721 -19215 197598 -59406 23945 206041 322642
9068 322642 -40910 289871 -117604 -55112 -202342 -9777 49770 -76461 -78856 -202901 55503
9056 -432251 -139164 -180113 290908 191180 -92018 20471 160054 -199208 -123622 -24868 21345
9044 -81236 -40579 85700 -372712 126473 -176636 -24428 139426 -145722 -302251 -31467 -16358
9033 -16358 74159 -163258 74323 75904 -33065 204555 -34961 163289 -139119 226361 -477468
9021 227789 -26065 34773 -57051 -137836 -139274 -361563 71373 127359 -148661 -97415 -414260
9010 -414260 -149322 -135236 -163941 -1325 -137192 -159249 176779 16175 -370415 64013 -8720
8998 207085 -120184 230827 175945 74150 -90756 12496 -258452 162715 -258736 -6797 -128766
8987a28766C1689c6341A25972I125b4578B33787a7756k16581a10707j8420o2872
8976a91999g5009C05813b69057h9132o0589a319j78507A19023N873l6722G182
8964A13910Q8631e1635n2016m396M9505l8936l3950j55810h8814A48416B4388
8952A23755A9046b78846L5433B65561m7788a8545l8707D3032R5769d8579E8466
8940B52119K55830f6339k30947B32726q8553a90178P0102B58797i9772I7039b54553
8928a35514j61892R9498j32751a26270E3061e5893D7015b13369E1613b26351C5021
8916C60981p3743C2489g1264i528B9729J53009k0746J42535j47551N83371M49218
8905A189565J630631K429311L922403m452895B054785n96037o40221q5695n0336
$$ plain form
8987 -128766 31689 -36341 125972 9125 -24578 233787 -17756 -234337 -110707 -129127 -191999
8976 -191999 -75009 305813 -269057 -89132 -149721 -1319 -179826 119023 124896 88174 7182
8964 113910 202541 -51635 -103651 -108047 -58542 -97478 -131428 -287238 -88814 148416 24388
8952 123755 19046 -278846 -243413 265561 217773 -18545 -57252 43032 138801 -48579 58466
8940 252119 507949 -66339 -297286 232726 144173 -190178 -120076 258797 -99772 97039 -254553
8928 -135514 -297406 -197908 -330659 -126270 53061 -55893 47015 -213369 51613 -226351 35021
8916 360981 287238 32489 -71264 -9528 29729 182738 161992 304527 156976 740347 1189565
8905 1189565 2820196 5249507 9171910 4719015 2054785 1458748 818527 732832 682496
8896F82496A83271F8359J25315O7521J54251c3381C81727a35572A76770a13287
8885D0361K73202i7811E4566J56895B1877f5892B7707b43998C13327A17118N3460
8874A70578i6046A11941b3229D1639L4448b8296a2597k41202n0394I5961g3766
8862B52650c48145a31545C10059i8969B60281M0815b34903H1805J75149G6291
8851B0527c00971J46027o4435A14660L7253B8065b37737d2562D4153a22949c9361
$$ plain form
8896 682496 183271 68359 193674 261195 415446 -33381 381727 -135572 176770 -113287
8885 40361 313563 -97811 54566 211461 21877 -65892 27707 -243998 313327 117118 170578
8874 170578 -96046 111941 -23229 41639 76087 -28296 -12597 -253799 -304193 95961 -73766
8862 252650 -348145 -131545 310059 -98969 260281 301096 -234903 81805 256954 76291
8851 20527 -300971 -154944 -219379 114660 151913 28065 -237737 -42562 44153 -122949 -39361
$$ [...]
##END NTUPLES=NMR SPECTRUM
##END=
