
##TITLE=AC1087_CCIN02_5818874_mKTjIqYRFi
##JCAMPDX= 6.0         $$ Bruker NMR JCAMP-DX V2.0
##DATA TYPE= NMR SPECTRUM
##DATA CLASS= NTUPLES
##ORIGIN= BRUKER
##OWNER= Administrator
$$ 1.72 TOPSPIN		Version 2.1
$$ 2012-03-25 00:26:09.046 -0500  Administrator@TOPSPIN
$$ Compression mode = diff/dup
##.OBSERVE FREQUENCY= 400.13188235
##.OBSERVE NUCLEUS= ^1H
##.ACQUISITION MODE= SIMULTANEOUS (DQD)
##.ACQUISITION SCHEME= undefined
##.AVERAGES= 64
##.DIGITISER RES= 22
##SPECTROMETER/DATA SYSTEM= spect
##.PULSE SEQUENCE= noesygpps1d.comp
##.SOLVENT NAME= COFFEE_meoh
##.SHIFT REFERENCE= INTERNAL, COFFEE_meoh, 1, 14.96822
##AUDIT TRAIL= $$ (NUMBER, WHEN, WHO, WHERE, PROCESS, VERSION, WHAT)
$$ ##TITLE= Audit trail, TOPSPIN		Version 2.1
$$ ##JCAMPDX= 5.01
$$ ##ORIGIN= Bruker BioSpin GmbH
$$ ##OWNER= Administrator
$$ $$ C:\Bruker\TOPSPIN/data/COFFEE/nmr/AC1087_CCIN02_5818874_mKTjIqYRFi/12/pdata/1/auditp.txt
$$ ##AUDIT TRAIL=  $$ (NUMBER, WHEN, WHO, WHERE, PROCESS, VERSION, WHAT)
(   1,<2012-03-25 00:26:04.078 -0500>,<Administrator>,<TOPSPIN>,<go>,<TOPSPIN 2.1>,
      <created by zg
	started at 2012-03-25 00:14:32.437 -0500,
	POWCHK enabled, PULCHK disabled,
       configuration hash MD5:
       1A 1E CE 29 27 FD 77 03 67 4E F0 E3 C4 B2 CB 90
       data hash MD5: 64K
       57 C1 90 13 46 D1 06 DE 48 F4 01 57 8D 5A 9C 3D>)
(   2,<2012-03-25 00:26:06.968 -0500>,<Administrator>,<TOPSPIN>,<proc1d>,<TOPSPIN 2.1>,
      <Start of raw data processing
       efp LB = 0.3 FT_mod = 6 PKNL = 1 PHC0 = 0 PHC1 = 0 SI = 128K 
       data hash MD5: 128K
       F1 0C 72 42 B3 96 08 FD A0 03 3D E4 3F B6 60 DC>)
(   3,<2012-03-25 00:26:08.218 -0500>,<Administrator>,<TOPSPIN>,<proc1d>,<TOPSPIN 2.1>,
      <pk PHC0 = 37.42493 PHC1 = 0 
       data hash MD5: 128K
       1A 46 AB BB 93 B3 61 4E 90 99 A3 A9 E4 AC E1 67>)
(   4,<2012-03-25 00:26:08.718 -0500>,<Administrator>,<TOPSPIN>,<proc1d>,<TOPSPIN 2.1>,
      <abs ABSG = 1 
       data hash MD5: 128K
       D5 C4 95 8B 89 32 31 B0 B8 83 BD 81 E8 63 ED 30>)
(   5,<2012-03-25 00:26:08.796 -0500>,<Administrator>,<TOPSPIN>,<proc1d>,<TOPSPIN 2.1>,
      <abs ABSG = 2 
       data hash MD5: 128K
       9F 70 8B 98 BB A9 12 F3 A0 80 01 6E 0A 24 82 23>)
(   6,<2012-03-25 00:26:08.859 -0500>,<Administrator>,<TOPSPIN>,<proc1d>,<TOPSPIN 2.1>,
      <abs ABSG = 3 
       data hash MD5: 128K
       6E CB 9A 95 11 B6 F1 42 4C 7F B2 C8 C7 99 4C C6>)
(   7,<2012-03-25 00:26:08.906 -0500>,<Administrator>,<TOPSPIN>,<proc1d>,<TOPSPIN 2.1>,
      <abs ABSG = 4 
       data hash MD5: 128K
       80 21 6D 7A ED FD F4 CD 7D A5 CF 5D 9F B2 17 A2>)
(   8,<2012-03-25 00:26:08.968 -0500>,<Administrator>,<TOPSPIN>,<proc1d>,<TOPSPIN 2.1>,
      <abs ABSG = 5 
       data hash MD5: 128K
       27 5D 1B 96 65 D9 2B 14 57 FB EA 69 48 C9 D9 B3>)
$$ ##END=
$$ 
$$ $$ hash MD5
$$ $$ AF 4C B7 B5 07 5B B4 3F 27 D7 37 DD 36 49 A2 AA
##$RELAX= 
##$RELAX= 
##$RELAX= 
##$RELAX= 
##$RELAX= 
##$RELAX= 
##$RELAX= 
##$RELAX= 
$$ Bruker specific parameters
$$ [...]
##$TP07= 0
##$TPNAME0= <>
##$TPNAME1= <>
##$TPNAME2= <>
##$TPNAME3= <>
##$TPNAME4= <>
##$TPNAME5= <>
##$TPNAME6= <>
##$TPNAME7= <>
##$TPOAL= (0..7)
0.5 0.5 0.5 0.5 0.5 0.5 0.5 0.5
##$TPOFFS= (0..7)
0 0 0 0 0 0 0 0
##$TUNHIN= 0
##$TUNHOUT= 0
##$TUNXOUT= 0
##$USERA1= <user>
##$USERA2= <user>
##$USERA3= <user>
##$USERA4= <user>
##$USERA5= <user>
##$V9= 5
##$VALIST= <valist>
##$VCLIST= <CCCCCCCCCCCCCCC>
##$VD= 0
##$VDLIST= <DDDDDDDDDDDDDDD>
##$VPLIST= <PPPPPPPPPPPPPPP>
##$VTLIST= <TTTTTTTTTTTTTTT>
##$WBST= 2048
##$WBSW= 25
##$XGAIN= (0..3)
0 0 0 0
##$XL= 0
##$YL= 0
##$YMAX_a= 14397509
##$YMIN_a= -6225588
##$ZGOPTNS= <>
##$ZL1= 120
##$ZL2= 120
##$ZL3= 120
##$ZL4= 120
##$ABSF1= 14.96822
##$ABSF2= -5.584311
##$ABSG= 5
##$ABSL= 3
##$ALPHA= 0
##$AQORDER= 0
##$ASSFAC= 0
##$ASSFACI= 0
##$ASSFACX= 0
##$ASSWID= 0
##$AUNMP= <proc_prof1d_extract.lims>
##$AXLEFT= 0
##$AXNAME= <>
##$AXNUC= <1H>
##$AXRIGHT= 0
##$AXTYPE= 0
##$AXUNIT= <>
##$AZFE= 0.1
##$AZFW= 0.1
##$BCFW= 0
##$BC_mod= 0
##$BYTORDP= 0
##$COROFFS= 0
##$CY= 15
##$DATMOD= 1
##$DC= 0
##$DFILT= <>
##$DTYPP= 0
##$F1P= 0
##$F2P= 0
##$FCOR= 0.5
##$FTSIZE= 131072
##$FT_mod= 6
##$GAMMA= 0
##$GB= 0
##$INTBC= 1
##$INTSCL= 1
##$ISEN= 128
##$LB= 0.3
##$LEV0= 0
##$LPBIN= 0
##$MAXI= 10000
##$MC2= 0
##$MEAN= 0
##$ME_mod= 0
##$MI= 0
##$NCOEF= 0
##$NC_proc= -3
##$NLEV= 6
##$NOISF1= 0
##$NOISF2= 0
##$NSP= 0
##$NTH_PI= 0
##$NZP= 0
##$OFFSET= 14.96822
##$PC= 1
##$PHC0= 37.42493
##$PHC1= 0
##$PH_mod= 1
##$PKNL= yes
##$PPARMOD= 0
##$PPDIAG= 0
##$PPIPTYP= 0
##$PPMPNUM= 2147483647
##$PPRESOL= 1
##$PSCAL= 4
##$PSIGN= 0
##$PYNMP= <proc.py>
##$REVERSE= no
##$SF= 400.130004957698
##$SI= 131072
##$SIGF1= 0
##$SIGF2= 0
##$SINO= 400
##$SIOLD= 131072
##$SPECTYP= <>
##$SREGLST= <1H.CDCl3>
##$SSB= 0
##$STSI= 131072
##$STSR= 0
##$SW_p= 8223.68421052632
##$SYMM= 0
##$S_DEV= 0
##$TDeff= 65536
##$TDoff= 0
##$TI= <>
##$TILT= no
##$TM1= 0
##$TM2= 0
##$TOPLEV= 0
##$USERP1= <user>
##$USERP2= <user>
##$USERP3= <user>
##$USERP4= <user>
##$USERP5= <user>
##$WDW= 1
##$XDIM= 131072
##$YMAX_p= 517837449
##$YMIN_p= -185356717
##$CURPLOT= <Network HP LaserJet P1505>
##$CURPRIN= <$Network HP LaserJet P1505>
##$DFORMAT= <normdp>
##$LAYOUT= <+/1D_H.xwp>
##$LFORMAT= <normlp>
##$PFORMAT= <normpl>
##$SURQMSG= 1
$$ End of Bruker specific parameters
$$ ---------------------------------
##NTUPLES= NMR SPECTRUM
##VAR_NAME=  FREQUENCY,     SPECTRUM/REAL,   SPECTRUM/IMAG
##SYMBOL=    X,             R,               I
##VAR_TYPE=  INDEPENDENT,   DEPENDENT,       DEPENDENT
##VAR_FORM=  AFFN,          ASDF,            ASDF
##VAR_DIM=   131072,        131072,          131072
##UNITS=     HZ,            ARBITRARY UNITS, ARBITRARY UNITS
##FACTOR=    0.0627417313425165, 1,          1
##FIRST=     8223.62146879498, -1090,        -110740
##LAST=      0,             4030,            -112350
##MIN=       0,             -185356717,      0
##MAX=       8223.62146879498, 517837449,    0
$$ Real data points
##PAGE= N=1
##DATA TABLE= (X++(R..R)), XYDATA
$$ [...]
66836 4386767 4418323 4448444 4476815 4503533 4528405 4551286 4572655 4593060 4612218 4629362 4644320
66825 4644320 4657570 4669260 4678904 4686265 4691915 4696439 4699433 4699844 4697332 4692778 4687205 4680527 4671805 4660590
66811 4660590 4647400 4632781 4616547 4598443 4579023 4559112 4538599 4516507 4492244 4466020 4438014
66800 4438014 4408027 4376283 4343639 4310344 4275302 4237516 4197792 4158046 4119051 4079854 4039434
66789 4039434 3997913 3955795 3913085 3869983 3827752 3787709 3749344 3710334 3668793 3625068 3581045
66778 3581045 3538066 3495875 3453306 3409479 3364258 3317951 3271001 3224083 3178257 3134624 3093590
66767 3093590 3054539 3016335 2978026 2938953 2898600 2856996 2815249 2775033 2737080 2700562 2664332
66756 2664332 2628374 2593421 2559411 2525155 2489722 2453426 2416997 2380384 2343176 2306062 2270892
66745 2270892 2238818 2208891 2179183 2149121 2119945 2092659 2066275 2038720 2009093 1978327 1947803
66734 1947803 1918197 1889760 1862813 1837414 1812995 1788892 1764871 1740906 1716912 1693160 1670389
66723 1670389 1648861 1627671 1605783 1583445 1561778 1541049 1520255 1498560 1476417 1454947 1434662
66712 1434662 1415067 1395252 1374849 1354657 1336127 1319741 1304153 1287568 1269840 1252416 1236259
66701 1236259 1220799 1205099 1189102 1173263 1157671 1142190 1126962 1112386 1098899 1086930 1076449
66690 1076449 1066362 1055134 1042457 1029706 1018336 1008466 999421 990789 982272 973261 963488 953593 944185
66677 944185 934720 924183 912547 900737 889372 878417 867801 857494 847112 836359 825849 816555
66665 816555 808382 800130 791067 781702 772691 763851 754761 745735 737552 730508 724207 718090 711733 704778
66651 704778 697005 688687 680675 673922 668670 664019 658469 651070 642017 632079 621868 612015 603611 597668
66637 597668 594013 591329 588553 585754 583365 581075 578024 573866 569021 563866 558291 552327 546683 542045
66623 542045 538002 533429 528023 522693 518022 513137 507010 500395 495354 492852 491793 490519 488177 484358
66609 484358 478607 471159 463384 456673 451310 447038 444102 442934 443222 443984 444240 443118 439921 434990 429999
66594 429999 426461 424153 421779 418811 415770 413014 410336 407701 405324 402955 399957 396193 392120 387980
66580 387980 383728 379781 376952 375478 374819 374503 374424 374289 373654 372640 371744 370832 369206 366833 364463 362202
66564 362202 359056 354482 349537 345767 343601 342387 341305 339685 337118 334027 331555 330185 328965 326851
66550 326851 324283 322533 321840 321231 320132 319155 319010 319301 318787 316529 312711 308666 306137 305940 306988 306991 304521
66533 304521 300378 296707 294735 293638 291688 288282 284583 282204 281610 281964 282221 282046 281760 281737 281891 281587
66517 281587 280068 277137 273395 269742 266720 264343 262281 260069 257465 254908 253280 252914 253133 253122 252811
66502 252811 252458 251782 250223 247741 244717 241384 238096 235833 235477 236637 238077 239249 240523 241914 242618
66487 242618 242043 240454 238300 235677 232728 229897 227582 226127 226063 227426 228830 228386 225880 222963 220907
66472 220907 219413 218129 217812 218846 219725 218514 215374 212437 211379 212010 212978 212953 211321 208669 206657 206710
66456 206710 208622 210719 211352 210082 207808 206058 205731 206101 205516 203417 201143 200220 200496 200622 199761 197926
66440 197926 195141 191514 188102 186579 187589 189904 191482 191053 188758 185751 183434 182789 184077 186808 189665
66425 189665 190757 188841 184763 181057 179532 179606 179420 178145 176662 176353 177731 179916 181071 179882 177109
66410 177109 175175 175575 177216 177936 177027 175415 173927 172552 171238 170283 169785 169508 169416 169662 170029 170055 169845
66393 169845 170170 171563 173653 175437 176021 175321 174278 174039 174645 174974 174341 173373 172715 171636 168943 164770
66377 164770 160496 157330 155931 156767 159451 162054 162675 161726 161220 161688 161367 158948 155620 153440 152769 152402
66361 152402 151581 150797 150771 151460 152231 152681 153081 153859 154664 154430 152768 150735 149522 148906 147986 146959 146802 147396
66343 147396 147483 146673 145911 145476 144093 140980 137525 135821 136364 138148 140304 142571 144739 146551 147832 148077
66327 148077 146545 143523 140804 139825 139855 139158 137615 136954 138376 141066 143334 144355 144470 144445 144867 145780 146587
66310 146587 146538 145491 144025 142749 141761 140825 139812 138932 138682 139463 140987 142235 142426 142010 142228 143554 145023
66293 145023 145430 144825 144258 144148 143615 141816 139390 137820 137491 137255 136166 134790 134176 134286 134300 134049 134025 134088
66275 134088 133302 131266 128699 126366 124286 122456 121516 121993 123401 124781 125849 127060 128720 130501 131823
66260 131823 132446 132679 133019 133470 133450 132703 131933 131835 131756 130471 128349 127386 128468 129860 129505 127861 127047 127678
66242 127678 128093 126837 124595 123109 123006 123444 123449 122936 122366 121912 121306 120396 119378 118187 116110 112725 109223
66225 109223 107854 109603 112971 115593 116658 117235 118655 121245 124437 127439 129642 130805 131007 130372 128913
66210 128913 126709 124047 121290 118794 116997 116273 116601 117582 118771 119695 119749 118646 116867 115014 112819 109724
66194 109724 106423 104724 105507 107820 110323 112579 114368 114986 114125 112558 111125 109922 109214 109919 112032
66179 112032 113705 113399 112144 112067 113265 113814 112575 110342 108302 106939 106579 107606 109762 112201 114318
66164 114318 115751 115954 114932 113953 114082 114400 113406 111931 112580 115961 119564 120995 120390 118779 116081 112154
66148 112154 108327 106302 106301 107368 108622 109369 109156 108781 110077 113383 116378 116877 115794 115653 116906 117638
66132 117638 116607 114786 113821 114452 116618 119811 123104 125803 128191 130767 132925 133490 132407 130662 128617
66117 128617 125772 122331 119585 118292 117924 117989 118952 121089 123436 124563 123728 120814 116113 110830 106829
66102 106829 105010 104548 104446 104948 106497 108140 108253 106470 103787 101164 99188 98706 100216 102540 103620
66087 103620 103058 102558 103215 103751 102527 100268 99268 100324 101860 102084 100845 99164 98027 98045 99331 100998
66071 100998 101398 99580 96278 93067 91018 90566 91988 95016 98264 100098 100298 100202 100972 102328 103174 102834
66055 102834 101333 98993 96312 94003 92666 92445 93107 94296 95584 96626 97520 98810 100852 103329 105481
66040 105481 106640 106515 105375 104195 104080 105100 105932 105132 102671 99895 98027 97024 95892 93989 92013
66025 92013 91441 92664 94002 93488 91660 91356 94087 97733 99011 97430 95487 95443 97345 100000 102233 103018
66009 103018 101937 100076 99308 100067 100972 101150 101559 103185 105228 106311 106424 106318 105847 104591 103541 104264
65993 104264 106365 107567 106687 104987 103918 103030 101253 99187 98754 100867 104459 107664 109230 108990 107755
65978 107755 106767 106544 106119 104023 100269 96898 96253 98938 103633 108497 112268 114302 114389 113077 111779 111788
65962 111788 113010 114164 114418 114278 114516 114867 114624 114186 114920 117247 119664 120216 118538 116157 115096 116289
65946 116289 118776 120247 119044 116070 114108 114716 116405 116562 114533 111804 109560 107506 105343 104135 105283
65931 105283 108625 112334 114622 115149 114771 114303 113722 112525 110606 108472 106607 105096 104138 104392 106149 108494
65915 108494 110115 110880 111781 113171 113962 113098 111188 110035 110761 112747 114184 113432 110238 106005 102690 101172
65899 101172 100856 100843 100930 101328 102114 103424 105604 108550 111307 112877 113005 111677 108555 103849 99263 96779
65883 96779 96492 96702 96292 95916 96516 97779 98736 99125 99309 99378 99123 98678 98505 98844 99631 100758 101994 102951
65865 102951 103622 104668 106527 108466 109325 109119 108988 109397 109371 108134 106657 106569 107904 108989 108651 107607 107317
65848 107317 108168 109332 110058 110476 111290 113075 115693 118035 118646 117271 115665 116077 118804 121994 124104 125578
65832 125578 127393 128892 128386 125719 122830 121298 120441 118652 115962 114217 114788 116959 118781 118990 117844
65817 117844 116487 115859 116086 116575 116651 116146 115354 114427 113050 110928 108488 106822 106796 108304 110445 112277 113291
65800 113291 113286 112199 110278 108318 107461 108444 110898 113415 114528 113892 112558 112039 113081 115231 117357 118432
65784 118432 118074 116760 115452 114662 113909 112505 110830 110206 111270 113116 114513 115402 116484 117771 118441 118064
65768 118064 117126 116157 115137 114100 113727 114829 117565 121422 125529 128705 129753 128446 126030 124181 123394
65753 123394 122837 121756 120551 120325 121725 124405 127369 129559 130291 129497 127707 125766 124350 123629 123344 123252
65737 123252 123435 124071 124967 125588 125642 125480 125757 126737 128007 128784 128541 127471 126326 125594 124877 123457 121505
65720 121505 120165 120147 120749 120824 120364 120430 121629 123309 124379 124317 123245 121521 119509 117373 114917 112006 109275
65703 109275 107940 108563 110372 112034 112763 112476 111459 110317 109753 109680 108911 106463 103081 100757 100745 102577
65687 102577 104939 106741 107281 106249 104062 101744 100025 98799 97673 96613 95782 95135 94515 93938 93582 93681
65671 93681 94449 95718 96686 96669 96181 96465 97703 98544 97849 96074 94395 93436 93631 95671 99249 102145 102221
65654 102221 99962 97536 95612 92914 88968 85408 83887 84239 85427 86897 88114 88193 87172 86620 87711
65639 87711 89489 90204 89715 89377 90064 91485 93118 94719 96161 97694 100065 103489 106929 109276 110759
65624 110759 112130 113021 112527 111049 110014 109774 109361 108445 107879 107864 107195 105281 103662 104316 107173 110283 111939
65607 111939 111799 110354 108224 105909 103619 101331 99222 97785 97224 97120 97055 97268 98284 100020 101599 101961
65591 101961 100594 97898 94962 92826 91853 91909 92799 94173 95341 95887 96310 97275 98337 98381 97429 96917 97816
65574 97816 99375 100232 99985 99134 98226 97677 97805 98380 98513 97560 95898 94623 94877 97302 101235 104281 103989
65557 103989 100613 97234 96371 97382 98015 97552 97317 98802 102318 106872 110393 110764 107852 104008 101476
65542 101476 99903 97567 94289 91458 89580 87708 85485 84074 84551 86662 89607 92888 95954 98210
65528 98210 99924 102086 104748 106470 106052 103951 101395 98998 97058 96344 97417 99419 100570 99940 98239
65513 98239 96864 96605 97265 98172 98947 99826 101198 102867 103977 103690 101861 99283 97449 97597 99444 101198
65497 101198 101518 101164 101796 103463 104530 104110 103127 102460 101446 99158 96164 93866 92824 92836 94115 96982
65481 96982 100461 102479 101932 99781 97646 95909 93801 91122 89147 89507 92349 96078 98974 100711 102050
65466 102050 103517 104939 105971 106357 105881 104823 104360 105433 107051 106797 103605 99204 96227 95614 96517 98003
65450 98003 99880 102206 104825 107348 109178 109777 109354 108976 109561 111014 112561 113430 112960 110846 107903 105888
65434 105888 105737 106505 106827 106812 107486 108898 109985 110188 110029 110009 109927 109572 109289 109543 110303 110915 110352 108083 105297
65415 105297 104626 107465 111834 114226 113591 112156 112108 112969 112945 111502 109506 107673 106127 105113 104992 105505
65399 105505 105783 105215 103888 102164 100158 97663 94443 90661 87093 84580 83220 82425 81884 81971 83002 84692
65383 84692 86736 89360 92699 95945 97823 97880 96870 95882 95442 95360 95121 94387 93365 92687 92849 93863 95448
65366 95448 97214 98560 98881 98241 97466 97180 97080 96662 96301 96917 98647 100550 101703 102077 102156 102262 102564 103413
65348 103413 105212 107947 110938 113047 113250 111434 108843 107514 108914 112956 118256 123207 126790 128678
65334 128678 129027 128384 127621 127572 128423 129497 129866 129283 128362 127747 127389 126935 126645 127413 129628 132413 134475 135666
65316 135666 137139 139716 142630 144566 145767 148101 152662 158135 162461 165669 169888 176527 184579 192179
65302 192179 198923 205800 213552 222082 231216 240892 250401 258272 263448 266132 267042 266137 262586 256006 247313
65287 247313 238100 229227 220271 210492 200200 190778 183224 177107 171346 165749 161121 157797 154756 150727
65273 150727 145853 141561 138710 136423 133111 128383 123469 119854 117936 116989 115928 113904 110762 107380
65259 107380 105186 104811 105494 106243 107145 108780 110737 111788 111507 110650 109790 108681 107243 105997 104982 103475
65243 103475 101530 100568 101293 102190 101606 100465 101093 103755 106220 106787 105835 104115 101336 97318 93106 89955
65227 89955 88202 87754 88516 89545 89141 87059 85636 87297 91570 95819 98337 99257 98885 96988 94053 91756
65211 91756 91362 92366 93240 93006 91835 90621 90312 91305 93277 95716 98391 100997 102770 103192 102812 102571
65195 102571 102479 101852 100736 100015 100104 100648 101621 103382 105271 105622 103991 102084 101356 100806 98618 95169 92710
65178 92710 92338 92962 93339 93598 94295 95263 96055 96603 96849 96557 96052 96330 97647 98654 97725 94767 91031 87555
65160 87555 84582 82184 80537 79560 78922 78476 78271 78232 78362 79083 80795 83200 85648 87871 89718 90467 89527
65143 89527 87769 86893 87153 86976 85437 83836 83833 85078 85953 85865 85425 84938 84322 84243 85615 87835 89145 89195
65125 89195 89662 91619 93715 94007 92470 90520 89054 88276 88704 90741 93472 95354 96235 97480 99888 102597
65109 102597 104429 105279 105543 105013 103225 100569 98125 96313 94311 91288 87914 86013 86421 87790 88189
65094 88189 87579 87688 89529 92336 95269 98487 101488 102079 99063 95020 94019 96630 99484 100027 99377 99605
65078 99605 100521 100868 101027 102354 104585 105918 105563 104636 104386 104749 104975 104827 104866 105953 108394 111139 112212
65061 112212 110625 107664 105601 105375 106190 106958 107249 107123 107078 108040 110389 113063 114750 115934 118470 122835
65045 122835 127151 129634 130919 132915 136065 138882 139977 139643 139321 140127 142108 144702 147646 151298 156016
65030 156016 161507 167234 173247 179902 186765 192667 197209 201411 206297 211542 216273 220601 225288 230068
65016 230068 233498 234742 234544 233866 232261 228550 222860 217003 212437 208550 203674 197505 191603 187291 183861
65001 183861 179394 172834 164600 155678 147055 139839 134839 131677 129092 126368 123740 121188 117898 113620
64987 113620 109677 107527 106799 105801 103835 101993 101524 102269 103038 102932 101968 100831 100270 100409 100446 99420 97480
64970 97480 96061 96493 98652 101216 102991 103678 103547 102877 101817 100495 98913 96751 93571 89494 85536
64955 85536 82932 82055 82329 83306 85258 88286 91360 93204 94028 95407 98036 100442 100586 98247 95090 92751
64939 92751 91650 91547 92210 93174 93590 92965 91762 90904 90959 92021 93914 95979 97117 96804 95914 95780 96410
64922 96410 96464 95152 93287 92026 91438 91106 91425 93071 95308 96103 94392 91474 89595 89715 91195 93152
64906 93152 95248 97257 98647 98983 98410 97506 96825 96669 97064 97742 98222 98151 97509 96402 94751 92482 89936
64889 89936 87828 86643 86248 86246 86427 86697 86794 86440 85594 84275 82440 80633 80382 82939 87403 91098 92366
64872 92366 92223 92615 93900 95050 95659 96341 97295 97830 97593 97165 97012 96816 96313 95881 95735 95279 94004 92341
64854 92341 90956 89759 88440 87469 87574 88502 89267 89531 89793 90174 90070 89316 88755 88996 89367 88891 87848 87366
64836 87366 87621 87546 86622 85945 86757 88601 90012 90743 92043 94516 96990 98241 98742 99657 100906 101564 101708
64819 101708 102318 103421 103898 103359 102631 101880 99968 96771 94595 95671 99085 101954 103185 104362 106929
64804 106929 110216 112711 113903 114078 113227 111093 107954 104786 102717 102405 103544 104842 104911 103386 100981
64789 100981 98628 97053 96910 98290 99943 100043 98295 96504 96354 97324 97662 96899 96299 96899 98209 99205
64773 99205 99761 100384 100975 100740 99509 98461 98949 100700 101887 101279 99824 99506 100854 102442 102965 103031 104295
64756 104295 107191 110202 111308 109744 106371 102802 100222 98645 97156 95077 92980 92251 93510 95835
64742 95835 97885 99445 101267 103421 104665 103914 101820 100170 99902 100429 100883 101146 101335 101083 100109 99075
64726 99075 99040 100131 101382 101914 101722 101223 100629 100005 99507 99207 98927 98543 98309 98671 99804 101394 102810 103464
64708 103464 103197 102338 101306 100207 99072 98402 99023 101151 103872 105855 106551 106491 106476 106696 106685 105950 104526
64691 104526 103002 102182 102673 104456 106629 107785 107053 104804 102184 100161 99363 100375 103152 106019 106479
64676 106479 103880 100521 99209 100221 101680 102409 103034 104227 105273 105084 103785 102595 102559 103873 106023
64661 106023 108079 109097 108757 107599 106529 106120 106303 106322 105108 102273 98915 96857 96827 97868 98765 99453
64645 99453 100604 102388 104251 105644 106449 106873 107365 108432 110070 111473 111735 110841 109742 109529 110671 112783
64629 112783 114832 115751 115279 114175 113438 113462 114150 115453 117219 118645 118578 116641 113758 111264 109731 108855
64613 108855 108285 108187 108893 110341 112125 113971 115788 117279 117927 117604 116791 115849 114498 112534 110687 109950
64597 109950 110175 110192 109433 108585 108312 108185 107428 106093 104806 103830 103112 102968 103890 105610 106991 107092 106098 105124
64579 105124 105217 106523 108298 109770 110915 112185 113548 114357 114322 113945 113563 112579 110433 108034 107277 108965
64563 108965 111767 113548 113516 112818 113173 115041 117197 118194 118051 118020 118614 118597 116561 113116 110656 110880 113164
64546 113164 115583 117072 118141 119656 121370 122021 120925 119129 118546 119904 122000 123105 122654 121307 119835
64531 119835 118510 117405 116772 116983 118155 119752 120657 120129 118775 118089 118845 120509 122420 124643 127168 129151
64515 129151 129861 129708 129363 128427 126209 123474 122014 122456 123802 125312 127422 130195 132139 131721 129469 127495
64499 127495 127054 127332 126648 124247 120781 117448 115068 113957 114229 115642 117104 117152 115613 114312 115245 118184
64483 118184 120949 121951 121540 120816 120243 119818 119492 118803 117011 114432 112902 113933 116890 119864 121912 123434
64467 123434 124612 124757 123401 121040 118314 115254 111900 109109 108006 108787 110619 112671 114816 117178 119387
64452 119387 120609 120362 119124 118097 118268 119600 121015 121259 119967 118012 116763 116971 118374 120250 122040
64437 122040 123352 123685 122597 120147 116946 113809 111470 110485 110984 112403 113737 114321 114360 114602 115495 116704
64421 116704 117495 117541 117136 116461 114991 112173 108622 105906 104909 105118 105891 107586 110609 114046 116429 117606
64405 117606 118699 120228 121478 121957 122298 123111 123906 124023 123986 125007 127302 129597 130293 128740 125548 122075
64389 122075 119571 118424 118075 117696 116859 115627 114315 113291 112758 112589 112554 112714 113343 114545 116240 118356
64373 118356 120519 121786 121498 120495 120573 122431 124888 126459 126849 126431 125198 123060 120523 118191 115980
64358 115980 113645 111737 111267 112666 115635 119517 123049 124413 122824 119947 118448 118957 119538 118445 116297
64343 116297 115025 115582 117403 119338 120190 118867 115165 110566 107482 107308 109436 112286 114902 117317 119700
64328 119700 121727 122966 123485 123705 123752 123401 122784 122783 124333 127348 130478 132022 131268 129224 128012 129167 132322
64311 132322 135724 138016 139184 139880 140540 141415 142731 144207 144887 144155 142643 141574 141334 141322 141014 140605 140587
64294 140587 141225 142478 144017 145336 146210 147014 148259 149845 151097 151414 150726 149546 148863 149475 150942 151609
64278 151609 150366 148086 146603 146472 146557 145779 144483 144007 145481 148977 153278 156556 157963 158326 158681 158653
64262 158653 157461 156146 157106 161038 165834 169158 170928 172438 174151 175450 175824 175347 174484 174292 176289
64247 176289 181166 187779 194013 198545 201510 203959 207009 210890 214351 215644 214561 212725 211468 210470
64233 210470 209206 208360 208515 208589 207342 205743 205911 208030 210200 211390 212579 214707 217378 220245 223868
64218 223868 228231 231937 234055 235542 237605 239741 240719 240574 240179 239536 238191 236957 237383 239282 240315
64203 240315 238613 234753 230558 226957 223684 220286 216515 212277 208122 205536 205719 207874 209484 208778 206472
64188 206472 204670 204411 204957 205315 205590 206473 208154 210437 213543 217869 222945 227492 230821 233617 236954
64173 236954 240983 244871 247631 248811 249006 250004 253667 259972 266679 271742 275575 279994 285262 289397 290507
64158 290507 288741 285550 282110 279054 276868 275538 274153 271714 268360 265260 263326 262522 262283 262080 261541
64143 261541 260590 259783 260104 262039 264929 267489 268954 269568 269997 270581 271314 272356 274152 276911 280259 283652
64127 283652 286983 290525 294385 298407 302516 306716 310591 313281 314271 313976 313279 312689 312179 311575 310698 309240
64111 309240 306965 304208 301892 300833 301040 301759 302230 302402 302943 304442 306653 308651 309754 310137 310534 311756
64095 311756 314679 320233 328750 339303 350094 359691 367866 375434 383599 393327 404906 418019 432386
64082 432386 448162 465352 482980 499537 514389 528306 542376 556888 571375 585127 597177
64071 597177 606379 612180 615112 615935 614476 609919 602057 591587 579241 565418 550790 536471 523172
64058 523172 510782 499161 488745 479828 471853 464183 457166 451486 446607 441018 434427 428818 426685
64045 426685 428600 432999 437939 442439 446406 450112 454029 458753 464719 472008 480414 489599 499208 509015
64031 509015 518973 529128 539696 551308 564629 579172 592746 602891 609120 613217 617125 620979
64019 620979 623413 623213 620202 614957 608364 601381 594653 588112 581192 573479 565067 556452 548345 541505
64005 541505 536401 532943 530664 529158 528216 527733 527768 528542 530045 531702 532899 533900 535855 539655 545053
63990 545053 551087 557172 563571 570943 579683 589696 600747 613007 627161 643720 662127 680826
63978 680826 698511 715287 732425 750933 770500 789831 807852 824382 839753 854133 867454
63967 867454 879731 890871 900203 906998 911931 917418 925603 936184 947143 957702 969567 984821
63955 984821 1003474 1023958 1045494 1068822 1094595 1122019 1149573 1176551 1203413 1230790 1258509
63944 1258509 1285553 1310857 1334148 1356054 1377371 1398490 1419876 1442822 1468905 1498420 1530103
63933 1530103 1562989 1598020 1636999 1680433 1727554 1778449 1834735 1897557 1966096 2039161 2117411
63922 2117411 2202662 2295326 2394048 2498047 2608491 2727047 2854206 2989822 3134416 3288937
63912 3288937 3453734 3628720 3814393 4012032 4223192 4449750 4694333 4960089 5250152
63903 5250152 5567939 5917709 6304144 6731497 7203894 7726432 8305311 8947076 9658538
63894 9658538 10446999 11318678 12275668 13314763 14429587 15613000 16856755 18149718 19477805
63885 19477805 20825640 22176971 23512472 24807172 26030812 27151725 28141628 28978003
63877 28978003 29643490 30124780 30412970 30504050 30397313 30093083 29593390 28905769 28045844
63868 28045844 27035842 25901433 24670103 23370420 22029865 20672081 19316354 17979459
63860 17979459 16677099 15423490 14230402 13106978 12059906 11093304 10208529 9404292
63852 9404292 8676955 8021063 7430203 6897996 6418651 5986978 5598012 5246537 4927129
63843 4927129 4635256 4368508 4126133 3906936 3707980 3525620 3357090 3200593 3054540
63834 3054540 2917563 2788872 2667766 2553141 2444220 2341174 2243922 2150655 2058922 1968214
63824 1968214 1880231 1796486 1716919 1641168 1569714 1502905 1439979 1380138 1323860 1272113 1224853
63813 1224853 1181303 1141193 1104543 1070354 1036770 1002893 969643 938506 910010 883770 859476
63802 859476 837274 817318 799252 782210 765300 748286 731876 717226 705039 695194 687162 680534
63790 680534 675019 670167 665409 660472 655623 651388 647991 645102 642056 638217 633120 626543 618611 609692
63776 609692 599984 589253 577196 563960 550112 536132 522215 508474 494957 481456 467663 453626
63764 453626 439712 426121 412814 400119 388954 380109 373459 368029 362584 356129 348338 339979 332561
63751 332561 327085 323210 319847 316218 311928 306546 299979 293199 287688 283874 280841 277912 275747 275121
63737 275121 275157 273755 269843 264484 259566 255997 253414 251141 248887 246749 244952 243554 242257 240753 239512
63722 239512 239824 242464 246358 249111 249066 246549 243131 240134 238062 237065 237409 239241 241852 243365 241792
63707 241792 237025 231463 227865 226601 225782 224084 222319 221785 222214 222349 221799 221142 220549 219524 218068 217123
63691 217123 217503 219021 220896 222582 224080 225806 228228 231316 234411 236974 239300 242115 245739 250111
63677 250111 255265 260968 266157 269683 271705 273662 276880 281907 288979 298035 308176 318231 328208 339195
63663 339195 351520 364073 375931 387476 399137 410016 418713 424723 428069 428324 425200 419690 413465
63650 413465 407218 400555 393410 386684 381442 378080 376187 374560 371620 366681 360880 356157 353273 351357
63636 351357 349213 346242 342170 336890 331003 325820 322324 320408 319282 318209 316722 314732 312753 311682
63622 311682 312043 313709 316533 320844 326957 334257 341133 346120 349375 353040 359668 369821 381468 392238
63608 392238 401930 412122 423580 435037 444605 451295 454715 454369 450269 443688 436209 428114 418591 407599
63594 407599 396568 386840 378145 369437 360895 354168 350297 348199 345932 343160 341455 341985 343833 345174
63580 345174 345552 346083 347738 350384 353652 357874 363663 371094 379733 389097 398710 408039 416893 425836 435919
63565 435919 448086 462924 480600 500692 522312 544847 568534 593975 621235 649878 679810
63554 679810 711536 745427 781237 818599 857454 897505 937619 976479 1013726 1049527 1082803
63543 1082803 1110853 1131580 1145594 1155179 1161370 1163226 1160221 1154086 1147338 1140663 1132855 1123046 1111768
63530 1111768 1099525 1085345 1067512 1045433 1020231 993639 966718 939737 912987 887342 863812
63519 863812 842578 822821 803826 786142 771305 760445 753383 748879 745329 741358 736545 731896 729129
63506 729129 729064 730981 733856 737831 743974 752797 763605 775447 788376 803645 822805 846621 874583
63493 874583 905350 937680 971032 1005386 1040832 1077527 1115741 1155391 1195396 1233764 1268519
63482 1268519 1298439 1322892 1341401 1353796 1360902 1364726 1367567 1370742 1374173 1377205 1379572 1381142 1380695
63469 1380695 1375624 1363511 1343976 1318491 1288465 1254162 1215642 1173809 1129805 1084003 1036527
63458 1036527 988545 941973 897830 855870 816016 779104 745627 714863 686185 660550 639476
63447 639476 622910 609145 596575 584444 572143 559213 546369 535266 526655 519745 513774 509159
63435 509159 506398 504984 504342 504893 506956 509336 510526 511032 513047 517664 523693 529633 535751 543533 553753
63420 553753 565676 577735 588441 597008 603609 609085 614087 618402 621089 621239 618762 614649 610248 605933
63406 605933 600594 592762 582160 569878 557335 545615 535513 527373 520758 514916 509809 506219 504747
63393 504747 505181 506903 509400 512266 515252 518468 522112 526073 530411 536069 544013 553448 562068 568849
63379 568849 575784 585939 600369 617715 636330 655767 676478 699125 724420 752888 784567 819215
63367 819215 856739 897002 939363 983062 1028014 1074709 1123371 1173764 1225764 1279352 1333805
63356 1333805 1387512 1438920 1487187 1531565 1570569 1602213 1624973 1638428 1643421 1641947 1636481 1628607
63344 1628607 1618184 1604194 1586533 1566601 1545903 1524279 1499756 1470155 1434714 1394337 1350708
63333 1350708 1305377 1259435 1213619 1168703 1125959 1087117 1053375 1024308 998217 973795 951100
63322 951100 930651 912270 895634 881605 871939 867417 867146 870034 876070 885455 897230 909985 923767
63309 923767 940094 959830 982099 1005980 1032422 1063340 1099055 1137741 1177686 1219124 1263123
63298 1263123 1309237 1355189 1398903 1439983 1478890 1515248 1547543 1574187 1594218 1607043 1612320
63287 1612320 1610564 1603496 1593223 1581088 1567570 1552979 1537547 1520715 1501014 1477139 1448948 1417143
63275 1417143 1382325 1344752 1304813 1263212 1220786 1178450 1137182 1097582 1059524 1022781 987906
63264 987906 955849 926523 898487 870510 843076 817888 796121 777528 760999 745577 731027
63253 731027 717776 706380 696926 689020 682266 676451 671218 666015 660701 655861 652193 649790 648156 646576
63239 646576 644208 640255 634526 627584 620118 612515 605297 599325 594889 591031 586519 581296 576375 572590
63225 572590 570187 569303 569820 570694 570482 568935 567438 567467 569035 570992 572502 573969 576586 581005 586248 590226
63209 590226 591802 592126 593333 596133 599485 602531 605765 609957 614850 619598 623958 628475 633804 640241
63195 640241 647634 655427 663094 670789 679291 689066 699790 711040 723066 736387 750794 765142 778347
63182 778347 790641 803851 820038 839536 860486 880804 900369 920868 943804 969365 996879
63171 996879 1025285 1053170 1079551 1105058 1131507 1159932 1189761 1220074 1250589 1281034 1310689
63160 1310689 1339335 1367810 1396964 1426689 1456447 1485745 1513496 1538047 1558856 1577124 1593555
63149 1593555 1606404 1613150 1613446 1608912 1600436 1587354 1569201 1546675 1520685 1491903 1461617 1431700
63137 1431700 1403165 1375914 1350473 1328797 1312358 1300276 1290394 1281863 1275729 1273268 1274755 1280050
63125 1280050 1289565 1303905 1322645 1344050 1366444 1389760 1415256 1443566 1473595 1503739 1533681
63114 1533681 1564103 1594805 1624190 1651093 1676425 1702230 1729196 1755588 1778716 1797101 1811012
63103 1811012 1821106 1826975 1827198 1820607 1807176 1787834 1763783 1735844 1703908 1667041 1624907 1579378
63091 1579378 1533954 1491089 1450635 1411392 1373347 1337483 1303988 1271983 1241066 1212118 1186315
63080 1186315 1163985 1144567 1127064 1110460 1094363 1079547 1067352 1058200 1051003 1044141 1036741 1028910
63068 1028910 1021119 1013693 1006792 1000706 995995 993109 991862 991603 992056 993555 996178 999110 1001273 1002310
63054 1002310 1002641 1003034 1004427 1007552 1012107 1016844 1021030 1025225 1029977 1034679 1038813 1043530 1050405 1059002
63040 1059002 1067229 1074086 1080585 1087842 1095822 1104316 1113622 1123520 1132836 1140833 1148079 1155238 1162037 1168237
63026 1168237 1174659 1182186 1190326 1197705 1203593 1208302 1212588 1217485 1224269 1233670 1245123 1257305 1269335
63013 1269335 1281198 1293476 1307182 1323435 1342604 1363732 1385239 1406217 1427102 1449400 1474830
63002 1474830 1504172 1536711 1571170 1607199 1645287 1685243 1725930 1767031 1810083 1856905 1907683
62991 1907683 1961414 2017541 2076129 2136973 2199626 2264080 2330331 2397204 2462606 2525263 2585756
62980 2585756 2645683 2706156 2767022 2827064 2884968 2940449 2994433 3047957 3101124 3153233 3203299
62969 3203299 3249916 3291080 3324955 3350681 3367882 3375799 3373587 3361159 3338865 3306559 3264075 3212828
62957 3212828 3155961 3096510 3036025 2975327 2915901 2859893 2809018 2764044 2725249 2692965 2667551
62946 2667551 2649056 2637121 2631374 2631911 2639271 2653905 2675849 2704925 2740815 2782632 2828680 2877149
62934 2877149 2927048 2978252 3030592 3083071 3133936 3181623 3225892 3267965 3309020 3348324 3383332
62923 3383332 3411776 3433048 3447174 3453236 3449591 3435158 3409605 3372518 3323298 3261905 3189182 3106547
62911 3106547 3015930 2919734 2820109 2718337 2615513 2513607 2414950 2320715 2230719 2144749 2063202
62900 2063202 1986333 1913813 1845423 1781461 1722100 1667035 1616151 1569876 1528417 1491233 1457643
62889 1457643 1427423 1400265 1375262 1351581 1329284 1308878 1290296 1272852 1255951 1239314 1222784
62878 1222784 1206515 1191145 1177062 1163561 1149471 1134773 1120900 1109038 1098598 1087869 1075916
62867 1075916 1063338 1051232 1039916 1028890 1017784 1007032 997507 989633 982928 976510 969927 963317
62855 963317 956644 949208 940380 930841 922451 916461 912144 907767 902780 898425 896060 895419 894937 893454 891173
62840 891173 888997 887286 885502 883075 880476 879100 879831 882019 884246 885936 887595 889602 891512 892719
62826 892719 893015 892166 889646 885366 880257 875649 872361 870565 869811 868767 865688 860048 853338 847573 843328
62811 843328 839747 835965 831731 827064 822111 817039 811492 804681 796883 790113 786127 784226 782263 779320
62797 779320 775854 771632 765680 758571 752759 749665 747970 745656 742364 738798 735273 732250 731045 732310
62783 732310 734433 735033 733704 731927 730651 729471 728195 727674 728610 730568 732642 734416 735919 737277 738679
62768 738679 740266 741980 743978 747103 752110 758260 763420 766016 766478 766567 767744 770333 773649 776473 777886
62753 777886 778243 779163 782120 786959 792060 796015 799042 802720 808339 815603 823101 830032 837050 845226 854719
62738 854719 865101 876710 890659 907312 925482 943772 962321 982768 1006673 1034387 1065362
62727 1065362 1099108 1135667 1175359 1218282 1264209 1312959 1364695 1419733 1478322 1540934 1608573
62716 1608573 1682191 1761568 1845140 1931270 2019540 2110656 2205215 2302553 2400528 2496227 2587092
62705 2587092 2671403 2747507 2812764 2863906 2898680 2916676 2918289 2903592 2872904 2827923 2771229
62694 2771229 2704666 2629019 2545409 2456014 2362945 2267182 2169481 2071905 1977516 1888403 1804536
62683 1804536 1724683 1647968 1574427 1504661 1439351 1378942 1323440 1272604 1226435 1185211 1148893
62672 1148893 1116844 1088397 1063267 1040874 1019762 998745 978745 962465 951648 945240 940832 937262
62660 937262 934998 934469 935238 936903 939773 944216 950178 957956 968680 983225 1000947 1020318 1040744
62647 1040744 1063109 1088558 1117466 1149775 1185707 1225704 1270038 1318825 1372170 1429993 1491999
62636 1491999 1558220 1629456 1706751 1790463 1880143 1975189 2075058 2178595 2283502 2386912 2486391
62625 2486391 2580235 2666989 2744971 2812127 2865933 2903534 2922708 2923156 2906510 2874555 2827688 2765791
62613 2765791 2690463 2605440 2514283 2418282 2317328 2212401 2106273 2001836 1900680 1803625
62603 1803625 1711698 1625782 1545633 1470118 1398601 1331635 1270076 1213789 1161524 1112155 1065836
62592 1065836 1023739 986548 953477 923015 894371 867635 842679 818746 795474 773567 753872
62581 753872 736312 720394 706244 694257 683975 674273 664662 655522 646990 638510 629815 621464 614041
62568 614041 607541 601988 597880 595331 593439 591271 589019 587401 586333 585133 583763 582846 582469 582048 581607
62553 581607 582299 585191 590267 597061 605492 615382 625764 635687 645586 657041 671091 687442 705303
62540 705303 724131 743334 762299 781576 803403 829881 860678 893540 927208 962833 1002160
62529 1002160 1045372 1091605 1140701 1193058 1247898 1302894 1355689 1404851 1449147 1487105 1517975
62518 1517975 1542241 1560280 1571000 1572618 1564479 1547433 1522730 1491466 1455040 1415180 1373097 1329105
62506 1329105 1283396 1236860 1190927 1146865 1105352 1066477 1029921 995262 962292 931120 902021
62495 902021 875319 851360 830510 813110 799284 788507 779315 769932 759533 748675 738229 728186
62483 728186 717842 706837 695483 684259 673561 663969 656276 651147 648893 649382 651798 654805 657636
62470 657636 660939 665878 672386 679094 685231 691773 700185 710597 721971 733845 747188 763434 783122
62457 783122 805671 830201 856346 884418 915017 948606 985365 1025303 1068456 1115018 1165270
62446 1165270 1219155 1275851 1333881 1391672 1447752 1500278 1546884 1585550 1615562 1637310 1651296
62435 1651296 1657607 1656057 1646294 1627933 1601225 1567684 1529486 1488167 1444382 1398938 1353233 1308227
62423 1308227 1263620 1218820 1174597 1133162 1096408 1064333 1035328 1007878 981895 958412 938148
62412 938148 920486 903963 887635 871938 858287 847821 840317 834240 828069 821671 816062 811801 808195
62399 808195 804435 800881 798614 798171 799422 802263 806452 810983 814745 818007 822349 828827 836983 845870
62385 845870 855195 864938 874648 883848 892714 901623 910104 916680 919842 919107 915276 909612 902532 893297
62371 893297 881358 867660 853771 839898 824860 808319 791923 777577 765316 753648 741451
62360 741451 728880 716827 706159 697287 690104 684480 680853 679710 680417 681561 682893 685832 691197 697487
62346 697487 702616 706563 710849 715922 720902 726084 733858 746123 761747 777633 791865 805003 818572
62333 818572 833213 848431 863448 877605 890166 900537 909125 917484 926898 936853 945556 951867 955964
62320 955964 958174 958371 957076 956056 956875 959568 963634 969684 979044 992173 1008607 1028204 1051348 1078084
62306 1078084 1108195 1142223 1181417 1226419 1276860 1332423 1393526 1460697 1533841 1612243 1694728
62295 1694728 1779848 1866528 1954530 2043484 2131463 2215193 2291612 2358470 2413730 2455828 2484835
62284 2484835 2502163 2508534 2503122 2485124 2455119 2414302 2363512 2303886 2237606 2166964 2093327 2017844
62272 2017844 1942419 1868823 1797357 1727659 1660618 1598189 1541228 1488632 1439016 1392339 1349362
62261 1349362 1310087 1273378 1237987 1203625 1170992 1140779 1112713 1085943 1060512 1037931 1019709
62250 1019709 1005674 994440 985269 978566 974538 972348 970917 969792 968915 968327 968509 970111 972548 973558
62236 973558 971180 965845 959603 953638 947714 942025 938081 937053 938268 940324 943024 947173 952791 958698
62222 958698 964052 969452 976127 984535 994118 1004237 1015114 1027973 1044171 1063834 1085433 1107098
62210 1107098 1128278 1149783 1172530 1197158 1224845 1257279 1295144 1337403 1382777 1431321 1483842
62199 1483842 1540442 1600759 1665330 1735499 1811761 1892974 1977287 2063068 2148598 2231448 2308551
62188 2308551 2376643 2432734 2474833 2502664 2517393 2520477 2512794 2494522 2465118 2423555 2369581 2305281
62176 2305281 2234722 2161490 2086877 2010697 1933178 1855423 1778725 1704509 1634850 1571904 1516274
62165 1516274 1466462 1420418 1377423 1338238 1303825 1274466 1249941 1229801 1213205 1198929 1186052
62154 1186052 1174577 1165041 1157653 1152157 1148417 1146579 1146558 1147812 1149806 1152308 1155155 1158245 1162023 1167337
62140 1167337 1174408 1182476 1190953 1200382 1211613 1224507 1238238 1252540 1267966 1285247 1305199 1328754
62128 1328754 1355970 1385231 1414706 1444614 1476711 1511327 1546345 1579722 1611615 1642946 1673014
62117 1673014 1699929 1723019 1743594 1763500 1783912 1805546 1829208 1855856 1886470 1921754 1961525
62106 1961525 2004694 2050517 2099797 2154165 2214058 2277741 2342161 2404126 2460754 2509726 2549755
62095 2549755 2580626 2602541 2615697 2620622 2618435 2610267 2596454 2576681 2550890 2519685 2483718 2443214
62083 2443214 2398717 2352288 2307157 2265694 2228022 2193097 2160733 2131779 2106472 2083577 2061543
62072 2061543 2039856 2019071 2000206 1984437 1972471 1963451 1955094 1945854 1936661 1929726 1925858 1923962 1923154
62059 1923154 1924264 1928706 1936628 1946951 1958936 1972973 1989668 2008683 2028870 2049493 2070967 2094313
62047 2094313 2120216 2148930 2180827 2216339 2255209 2296396 2339184 2383985 2431484 2481147 2531070
62036 2531070 2579349 2625316 2669501 2712775 2755807 2799319 2844705 2893930 2948164 3006303 3065305
62025 3065305 3122367 3176655 3228981 3280532 3332425 3385873 3441871 3500695 3562262 3626804 3694684
62014 3694684 3765632 3838725 3913016 3987711 4062028 4135715 4209615 4284821 4361159 4437475 4513658
62003 4513658 4591236 4671150 4751726 4829922 4904171 4974862 5042136 5104530 5160327 5209213 5251662
61992 5251662 5287294 5315064 5335141 5349418 5359570 5365404 5365937 5361562 5354179 5345502 5336389 5327887 5321538
61979 5321538 5318044 5316696 5317002 5320019 5326985 5337260 5348902 5361077 5374697 5390633 5408422 5426929
61967 5426929 5445205 5462367 5477611 5490974 5503417 5515705 5527743 5539261 5550273 5560372 5568418
61956 5568418 5573794 5577357 5580336 5582796 5584105 5584529 5585260 5586938 5589117 5591393 5594235 5598341 5603834 5610530
61942 5610530 5618557 5628333 5640171 5654083 5669744 5686427 5703127 5718911 5733056 5744972 5754366 5761416
61930 5761416 5766285 5768261 5765888 5758280 5745995 5730300 5711966 5691336 5669359 5647723 5627541 5608251
61918 5608251 5588327 5567088 5545504 5525093 5506352 5488579 5471002 5453469 5435943 5417933 5398879
61907 5398879 5378753 5357790 5335993 5313467 5290925 5268961 5246893 5223247 5197621 5171257 5145417
61896 5145417 5120058 5094628 5069357 5044997 5021921 5000268 4980494 4962792 4946338 4930163 4914639
61885 4914639 4901210 4890788 4883432 4879511 4879907 4884666 4892526 4902328 4914048 4927975 4943819 4961398 4981428
61872 4981428 5004707 5031000 5059592 5090605 5124850 5162506 5202678 5244297 5287012 5331301 5378264
61861 5378264 5429238 5485224 5546743 5614532 5690047 5774813 5869609 5974866 6091680 6221859 6367131
61850 6367131 6528922 6708843 6908863 7130973 7377084 7649112 7948749 8277381 8636826
61841 8636826 9030019 9460432 9930872 10443100 10997982 11594978 12231268 12901519 13597574
61832 13597574 14306783 15010266 15683461 16298460 16825650 17234840 17498710 17598536 17528125 17293381
61822 17293381 16909507 16398583 15787266 15103556 14373678 13620608 12863797 12119058 11398624
61813 11398624 10711565 10063763 9457631 8893104 8369943 7888768 7449479 7049452 6684281
61804 6684281 6350119 6044701 5766517 5513808 5284494 5076542 4888393 4719210 4568425
61795 4568425 4434724 4315767 4209344 4114620 4031856 3961066 3901165 3850257 3806489 3768760 3736578
61784 3736578 3708942 3683597 3658153 3631977 3605996 3580311 3553162 3522983 3490674 3458873 3429603
61773 3429603 3403480 3380573 3360902 3344348 3331096 3322124 3318470 3320067 3325803 3334406 3344604 3354774
61761 3354774 3363383 3369758 3373880 3375672 3375162 3372964 3369771 3365620 3360477 3355256 3351366 3349583 3350371 3355126
61747 3355126 3365912 3383909 3409126 3441591 3481625 3528809 3582060 3641266 3707842 3783125 3867171
61736 3867171 3959753 4061605 4173851 4296815 4430276 4574521 4730397 4898561 5079326 5273157
61726 5273157 5480835 5703235 5941446 6197198 6472836 6770726 7092883 7441433 7819620
61717 7819620 8232188 8684279 9179811 9721513 10313044 10960490 11670955 12449938 13300844
61708 13300844 14226509 15229528 16310418 17466135 18690223 19972463 21296341 22636213
61700 22636213 23956662 25213799 26357035 27331760 28084371 28569364 28756453 28635622 28218630
61691 28218630 27536090 26631113 25552469 24349659 23069668 21754136 20437011 19143968
61683 19143968 17893806 16700425 15573874 14520274 13541601 12636488 11801905 11034454 10330484
61674 10330484 9685864 9096450 8558705 8069302 7624125 7218201 6846724 6505918 6193078
61665 6193078 5906293 5644007 5404348 5184956 4983814 4799781 4631414 4475512 4328027
61656 4328027 4186734 4052174 3925775 3807825 3697501 3593795 3495766 3402660 3314408 3231538
61646 3231538 3154094 3081208 3012164 2947261 2887027 2831077 2778301 2727767 2678899 2631161 2584184
61635 2584184 2538041 2493050 2449437 2407354 2366824 2327556 2289286 2252430 2217774 2185251 2153772
61624 2153772 2122578 2092024 2062651 2034294 2006758 1980632 1956746 1935392 1916636 1900630 1886865
61613 1886865 1873809 1860313 1846914 1834862 1824295 1814198 1803704 1792437 1779912 1765740 1750443
61602 1750443 1735225 1720936 1707895 1696418 1686650 1678003 1669688 1661780 1654987 1649413 1644311 1639014 1633430
61589 1633430 1627780 1622678 1619316 1618543 1619689 1621171 1622331 1623772 1625840 1627852 1629243 1630596 1632937 1636518
61575 1636518 1640576 1643964 1645977 1647171 1649246 1653390 1658754 1663520 1667427 1672063 1678516 1686138 1694087 1702570
61561 1702570 1711537 1719528 1725274 1729504 1733550 1736598 1735993 1730224 1720217 1707589 1693095 1677234 1661062
61548 1661062 1645545 1630760 1616326 1602050 1587709 1572948 1558100 1544584 1533729 1525487 1518847 1513027
61536 1513027 1507493 1501264 1493366 1484079 1474867 1466825 1459984 1454416 1451039 1450630 1452639 1455783 1459534 1464313
61522 1464313 1470514 1478189 1487739 1500035 1515454 1533265 1552386 1572515 1594258 1618349 1645007 1674021
61510 1674021 1705278 1739097 1775911 1815593 1857469 1901214 1947322 1996090 2046295 2095608 2142419
61499 2142419 2186753 2229355 2270520 2310010 2347552 2383040 2416608 2448637 2479257 2507794 2533322
61488 2533322 2555927 2576680 2595991 2612772 2625749 2634937 2641099 2644314 2643955 2639840 2632628 2623160 2612061
61475 2612061 2599923 2587336 2574702 2562367 2550797 2540344 2531122 2523561 2518772 2517834 2520941 2527744 2538305
61462 2538305 2553290 2573512 2599834 2633116 2673527 2720239 2772624 2831588 2898870 2975176 3059944
61451 3059944 3153049 3255804 3370091 3497321 3638501 3794389 3965045 4149897 4348941 4563458
61441 4563458 4794945 5043460 5307205 5583231 5867866 6156479 6443149 6720603 6980345
61432 6980345 7213043 7409346 7561125 7662953 7713358 7714898 7672573 7591703 7477033 7333445
61422 7333445 7166844 6983956 6791263 6594160 6397029 6203946 6019087 5846034 5686751
61413 5686751 5541787 5411773 5298095 5201618 5121320 5055020 5001337 4960290 4932272 4917207 4914612
61402 4914612 4923725 4943607 4973789 5014689 5066567 5128014 5196219 5268804 5344629 5422856 5502327
61391 5502327 5582278 5662851 5744452 5827084 5910338 5993216 6073765 6150009 6221801 6290835 6358095
61380 6358095 6421995 6479801 6530296 6574245 6612737 6646066 6674158 6697300 6716259 6732012 6745253
61369 6745253 6755948 6763516 6767685 6768886 6767573 6763500 6756014 6744878 6730591 6714056 6695943 6675998
61357 6675998 6653040 6626282 6596793 6566945 6538288 6510802 6484404 6459916 6437733 6416592 6394837
61346 6394837 6372312 6349881 6327498 6303915 6278151 6250253 6220662 6189825 6158577 6128203 6100023
61335 6100023 6075459 6056514 6045542 6044472 6054651 6077287 6113570 6164655 6232158 6318353 6425124
61324 6425124 6552863 6701234 6870770 7062766 7277569 7513893 7769784 8043157 8331064
61315 8331064 8629323 8933258 9237892 9536890 9821915 10083529 10312356 10499616 10638114
61306 10638114 10724153 10758271 10743414 10682468 10577851 10432753 10251693 10039785 9801943 9542844
61296 9542844 9267206 8979987 8686422 8391562 8099318 7812040 7531397 7259561 6999144
61287 6999144 6751995 6518587 6298842 6093321 5903321 5729918 5573243 5432850 5308571
61278 5308571 5200495 5107986 5029267 4962615 4907920 4866476 4839030 4824388 4820159 4824610 4837590
61267 4837590 4859887 4891813 4932268 4979081 5030275 5084924 5142647 5202561 5263133 5322856 5380526
61256 5380526 5435057 5485831 5533185 5577595 5618050 5652213 5678787 5698963 5714765 5726635 5733559
61245 5733559 5734966 5731118 5721569 5704563 5678720 5644710 5604648 5560068 5511081 5457507 5400244 5341134
61233 5341134 5281553 5221717 5161612 5102039 5043930 4986821 4929247 4871122 4814726 4762463 4714353
61222 4714353 4668780 4625195 4584798 4548708 4516683 4487821 4461379 4436487 4412067 4387617 4363339
61211 4363339 4339013 4313655 4287047 4260932 4237737 4218435 4202513 4189785 4181246 4177974 4180000 4186715
61199 4186715 4197955 4214343 4236830 4266258 4303176 4347663 4399230 4457304 4522234 4595827 4680341
61188 4680341 4776552 4882917 4996771 5115877 5238260 5360937 5479648 5589803 5686745 5765055
61178 5765055 5818801 5843302 5836139 5796247 5723258 5618768 5487542 5336126 5170383 4995114
61168 4995114 4815358 4636307 4461549 4292505 4129996 3975488 3830339 3694799 3568481
61159 3568481 3451332 3343554 3244954 3154905 3072773 2998091 2930700 2870972 2819417 2775607 2737780
61148 2737780 2704034 2673739 2647547 2626256 2610022 2598415 2590935 2587584 2589120 2596380 2609122 2625898
61136 2625898 2645316 2666894 2690181 2713463 2734097 2750026 2760569 2766025 2767111 2764653 2759084 2750221
61124 2750221 2737930 2722883 2706039 2687579 2667138 2645028 2622221 2598871 2573888 2546630 2518226
61113 2518226 2490321 2462977 2434713 2404401 2372203 2338675 2303948 2268218 2232353 2197328 2163226
61102 2163226 2129142 2093964 2057025 2018269 1978262 1938132 1899282 1862899 1829615 1799385 1771632
61091 1771632 1745628 1720856 1696919 1673105 1648290 1621470 1592279 1561010 1528468 1495912 1464579
61080 1464579 1434806 1405993 1378013 1352258 1330447 1312556 1296852 1282001 1268104 1255537 1244054
61069 1244054 1233808 1226143 1222269 1221796 1223610 1227614 1234288 1242923 1251861 1260624 1270500 1282557 1296160
61056 1296160 1309909 1323097 1335681 1347770 1359930 1373305 1388581 1405169 1421959 1438364 1454019
61045 1454019 1468068 1479666 1488919 1496453 1502132 1505006 1504660 1501945 1498197 1494191 1490007 1485414 1480103 1473882
61031 1473882 1467058 1460492 1454911 1449991 1444400 1437067 1428372 1419714 1411854 1404254 1396418 1389130 1383459 1378951
61017 1378951 1374151 1368945 1364921 1362808 1360908 1357157 1351896 1347299 1344556 1342951 1341599 1340752 1340942 1341732 1342025
61002 1342025 1341290 1340142 1339805 1341127 1343989 1347568 1351069 1354028 1356051 1356996 1357794 1360424 1366376 1375339 1385875
60987 1385875 1396953 1408246 1419471 1430605 1442686 1457321 1475000 1494652 1515253 1537217 1561751
60976 1561751 1589364 1619629 1652103 1686845 1724031 1763651 1805809 1850984 1899718 1952218 2008480
60965 2008480 2068680 2133046 2201475 2273720 2349991 2430817 2516274 2606155 2701338 2804088 2916248
60954 2916248 3037825 3168155 3307620 3457050 3616217 3784387 3961746 4148627 4344206
60945 4344206 4548250 4763788 4995331 5244411 5509920 5793427 6100739 6436775 6802279
60936 6802279 7197879 7628656 8102544 8627527 9213918 9877075 10634519 11502575 12498943
60927 12498943 13645020 14960733 16460476 18160757 20088998 22276607 24746616 27518248
60919 27518248 30611199 34000005 37523082 40845509 43567150 45425397 46424229 46785475
60911 46785475 46796754 46706356 46707088 46920213 47317537 47657334 47553641 46671436 44898662 42366287
60901 42366287 39336777 36078891 32806000 29666243 26746805 24083475 21680382 19530054
60893 19530054 17620601 15934311 14449517 13145577 12003783 11005207 10131311 9366028
60885 9366028 8694659 8101739 7572803 7097778 6670391 6284913 5935465 5617467 5327220
60876 5327220 5060439 4813350 4584781 4374946 4182206 4002723 3833014 3671201 3516127
60867 3516127 3367102 3224363 3088267 2958316 2834282 2717606 2609805 2509984 2415787 2326410
60857 2326410 2242697 2164547 2090489 2020070 1954475 1894160 1837583 1783039 1730403 1680382 1633066
60846 1633066 1587984 1544910 1504151 1466279 1431455 1398725 1366681 1335498 1307382 1283775 1263037
60835 1263037 1242389 1221442 1202030 1185172 1170199 1156552 1144307 1132939 1121663 1111263 1103549
60824 1103549 1098581 1094280 1089317 1084599 1081432 1080066 1080698 1083898 1089009 1093802 1097030 1100033 1104573 1110147
60810 1110147 1114726 1117310 1118543 1119281 1119546 1118762 1116537 1113453 1111058 1110418 1110712 1110091 1107950 1105241 1102599
60795 1102599 1099645 1096461 1094284 1094064 1095507 1098055 1101629 1105965 1110667 1116487 1125056 1136469 1148610 1159761
60781 1159761 1170331 1180903 1190313 1197414 1203554 1211294 1221283 1232008 1242003 1250634 1257240 1261446 1264391
60768 1264391 1268042 1273037 1278459 1283866 1290063 1297349 1304341 1309546 1313616 1319169 1328423 1341182 1354991
60755 1354991 1366961 1375624 1381400 1385725 1390065 1395434 1401889 1408014 1411501 1410975 1407118 1401668 1395646 1389012
60741 1389012 1381577 1373492 1364907 1355785 1346070 1335616 1323995 1310942 1297145 1284248 1273722 1265803
60729 1265803 1259595 1254139 1249179 1244872 1241118 1237660 1234828 1233512 1234074 1235822 1238057 1241123 1245843 1252452
60715 1252452 1260811 1271080 1283228 1296348 1309669 1323825 1339787 1356854 1373386 1389539 1407389
60704 1407389 1427868 1449338 1469969 1489812 1509400 1527791 1543489 1556395 1567570 1577749 1587155
60693 1587155 1596042 1604408 1611850 1618712 1626435 1635607 1644524 1651105 1655608 1659956 1664818 1668912 1671015 1671012 1668896
60678 1668896 1664344 1657915 1651482 1646739 1643733 1641176 1637575 1631991 1624458 1616033 1607913 1600227 1592097 1582982
60664 1582982 1573428 1564257 1555538 1546646 1537131 1527291 1518043 1510271 1504135 1499024 1494360 1490340 1487687 1486753
60650 1486753 1486967 1487058 1485698 1482338 1477763 1473680 1471323 1470344 1469080 1465836 1460033 1452464 1444492 1436740 1428625
60635 1428625 1419500 1409917 1401073 1393257 1385872 1378944 1373372 1369338 1365772 1361937 1358250 1354742 1350059 1343233
60621 1343233 1335347 1327986 1320817 1312270 1302051 1291296 1280493 1268966 1256484 1243721 1230614 1215739
60609 1215739 1198177 1179080 1160612 1143985 1129241 1116441 1106219 1099137 1095043 1093272 1093270 1094713 1096891
60596 1096891 1098409 1098320 1097658 1098879 1103209 1109254 1115067 1120757 1127754 1135964 1143283 1148247 1151724 1155265 1158786
60581 1158786 1160961 1161408 1161441 1162615 1165317 1169121 1173836 1179459 1185314 1190264 1194327 1199282 1206748 1216103 1225581
60566 1225581 1235305 1247629 1263888 1282229 1299793 1316159 1333487 1353903 1377837 1404421 1432243
60555 1432243 1459788 1486212 1511909 1537945 1565088 1593650 1623447 1653079 1680059 1702877 1722511
60544 1722511 1740600 1756317 1766367 1768155 1761852 1749289 1732121 1711465 1688240 1663023 1635987 1607505
60532 1607505 1578625 1550836 1525428 1502930 1482924 1464708 1448556 1435793 1427172 1421596 1417088 1412495
60520 1412495 1407619 1402541 1397874 1394957 1394338 1394497 1393561 1392022 1392090 1394358 1396890 1397984 1398263 1399392 1402153
60505 1402153 1406577 1412644 1419786 1426614 1432278 1437729 1445013 1455618 1469717 1486183 1502892 1517928 1531294
60492 1531294 1544920 1560444 1577603 1595307 1613394 1632371 1652026 1671568 1691218 1712783 1738357
60481 1738357 1768770 1803403 1841112 1881161 1923372 1967446 2012120 2055002 2093174 2123976 2145545
60470 2145545 2157040 2158414 2150018 2132755 2108770 2081222 2052689 2024196 1996596 1972354 1954684 1944810
60458 1944810 1941206 1941787 1945987 1954335 1967017 1983550 2003362 2026097 2051593 2079858 2110948 2144881
60446 2144881 2182027 2223464 2270467 2323870 2384704 2455241 2538329 2635379 2745999 2870132 3009932
60435 3009932 3168973 3349994 3553610 3778812 4024538 4291198 4580760 4894938 5233372
60426 5233372 5593953 5974063 6369475 6770841 7161537 7519280 7819882 8040803 8164204
60417 8164204 8179497 8084576 7885668 7596786 7238386 6833886 6405127 5970010 5542876 5134848
60407 5134848 4752932 4400039 4076910 3783563 3518903 3280548 3066150 2874183 2702928
60398 2702928 2549832 2412652 2290089 2180416 2080703 1988666 1904312 1828365 1759928 1697134
60388 1697134 1639374 1587120 1539922 1496325 1455736 1418616 1384477 1351314 1317833 1285142 1255471
60377 1255471 1229918 1208071 1189098 1172458 1157882 1145219 1134116 1123623 1112593 1100959 1090207
60366 1090207 1081887 1075777 1070049 1063199 1055262 1047114 1039343 1032276 1026445 1022164 1018795 1015274 1011502 1008528
60352 1008528 1007202 1007401 1008782 1011377 1014857 1018270 1021379 1025433 1031548 1039011 1046462 1054021 1062669 1071918
60338 1071918 1079932 1086056 1091575 1097753 1104728 1112611 1121783 1131422 1139518 1145477 1151260 1158791 1167413 1175075
60324 1175075 1180876 1185230 1188555 1191269 1194276 1198013 1201462 1203354 1203879 1204116 1204282 1203814 1202753 1201781 1201072
60309 1201072 1200204 1199055 1197779 1196198 1194248 1192876 1193395 1195919 1199320 1202618 1205568 1208078 1210201 1212819
60295 1212819 1217360 1224426 1233262 1242709 1252229 1261986 1272367 1283522 1295050 1306278 1317097 1328179
60283 1328179 1340052 1352277 1363898 1374142 1382257 1387384 1389435 1389644 1389478 1389368 1389036 1388485 1387900 1387217 1386759
60268 1386759 1387796 1391452 1397383 1404357 1411655 1418883 1424903 1428175 1427958 1424354 1417586 1408279 1397904 1387718
60254 1387718 1377618 1367240 1357610 1350247 1345001 1340395 1335873 1331979 1328464 1324275 1319732 1316642 1315438
60241 1315438 1313956 1310127 1304587 1299696 1297200 1297738 1301301 1306734 1311585 1313739 1313022 1310515 1306999 1302846
60227 1302846 1298753 1295518 1293311 1291881 1291238 1291586 1292845 1294725 1296969 1299410 1302387 1307241 1315397 1326510
60213 1326510 1338537 1350297 1362915 1377850 1394640 1411899 1429561 1448392 1467766 1485912 1502532
60202 1502532 1519427 1538024 1557789 1577996 1599684 1624561 1652696 1682735 1714218 1748389 1786505
60191 1786505 1828331 1872892 1920048 1970657 2025453 2084482 2147776 2216158 2291114 2373907 2464830
60180 2464830 2563213 2668192 2779580 2897943 3023726 3156635 3296160 3442322 3595097 3753029
60170 3753029 3913192 4072810 4230218 4383897 4531382 4669919 4797543 4912634 5012891
60161 5012891 5095972 5161238 5209950 5243581 5262673 5267577 5259485 5240395 5212634 5178887 5142203 5105454
60149 5105454 5070861 5040240 5015584 4999399 4994536 5003422 5026939 5064154 5113776 5175986 5252408 5344197
60137 5344197 5450764 5570481 5701877 5843579 5993393 6148021 6303627 6456463 6602990
60128 6602990 6739602 6862500 6968231 7054703 7121475 7168605 7195168 7199224 7179283 7135722 7071100
60117 7071100 6989518 6895476 6792815 6684700 6574771 6467751 6368175 6278738 6200603 6135139
60107 6135139 6084470 6050418 6033850 6035125 6054237 6090268 6141589 6206868 6284941 6373343 6467989
60096 6467989 6564985 6661995 6757146 6847339 6928681 6998424 7055897 7101809 7137149 7162601 7178602
60085 7178602 7186130 7187650 7186892 7187507 7192449 7204926 7229088 7268973 7327155 7405019 7503928 7625457
60073 7625457 7770907 7941439 8138502 8363379 8616495 8897928 9208412 9548896 9919029
60064 9919029 10317009 10741130 11190440 11663009 12153931 12655740 13160597 13661473 14151154
60055 14151154 14620867 15060523 15460386 15812365 16109906 16347232 16519157 16621493 16651360
60046 16651360 16607338 16490006 16302688 16051323 15743322 15386817 14991356 14568892 14133113
60037 14133113 13697047 13270880 12861737 12475148 12116553 11791452 11504248 11257134 11050344
60028 11050344 10883496 10756362 10668066 10615843 10595307 10602154 10633152 10684845 10751441 10824798 10896905
60017 10896905 10962112 11016711 11057260 11080479 11084690 11069953 11036128 10981621 10904825 10806077 10687249
60006 10687249 10549930 10395218 10225161 10043075 9852008 9653771 9449909 9242907 9035895
59997 9035895 8831783 8633194 8442860 8263428 8096992 7945186 7809665 7692287 7594990 7519702
59987 7519702 7468065 7440783 7437248 7456025 7495918 7556569 7637967 7739219 7857696 7989585 8131450
59976 8131450 8280843 8434932 8588766 8735630 8869288 8985522 9081511 9154409 9201019 9218655
59966 9218655 9206083 9163734 9093085 8995798 8873603 8729227 8567158 8392980 8211928 8028404
59956 8028404 7846674 7671397 7507218 7357934 7225805 7111314 7014055 6934743 6876291 6842111
59946 6842111 6833295 6848210 6884875 6942940 7023373 7127410 7256259 7410597 7589185 7788215
59936 7788215 8002575 8227497 8458679 8691531 8920949 9141338 9346159 9527947 9679940
59927 9679940 9798167 9881701 9930921 9945768 9925551 9869992 9780408 9660179 9514450 9349508
59917 9349508 9172265 8989585 8807312 8629800 8460726 8304263 8165033 8047011 7952872 7884079
59907 7884079 7840790 7821794 7825682 7852434 7903153 7978007 8075200 8192045 8325923 8473696 8631384
59896 8631384 8795395 8963386 9133054 9300687 9461915 9613648 9754698 9884936 10004602
59887 10004602 10114154 10214017 10304632 10387267 10464594 10540036 10616963 10699019 10790813 10897540 11024083
59876 11024083 11174875 11354184 11565882 11813018 12097844 12421581 12783507 13180589 13608464
59867 13608464 14062041 14534467 15016127 15495475 15960003 16395345 16784367 17109280 17355274
59858 17355274 17511661 17570660 17527840 17384937 17150876 16838856 16462958 16037561 15577908 15098818
59848 15098818 14612729 14129942 13660461 13214033 12797913 12415662 12069090 11760939 11494858
59839 11494858 11273012 11094800 10958541 10863753 10810928 10799234 10825353 10884887 10974225 11090540
59829 11090540 11230317 11388359 11557733 11730056 11895956 12045856 12170467 12260503 12306635 12300792
59819 12300792 12238024 12117242 11940679 11713173 11441521 11133324 10795825 10435931 10061147
59810 10061147 9679689 9299208 8925593 8563118 8215282 7885081 7574550 7284445 7014706
59801 7014706 6765430 6537345 6331146 6146462 5981982 5836809 5711085 5604812 5516457 5443423
59791 5443423 5383554 5335407 5297195 5266484 5241150 5219773 5200713 5181662 5160897 5138508 5115627
59780 5115627 5092705 5069343 5045726 5023125 5002355 4982240 4960228 4934345 4904002 4869122 4829449
59769 4829449 4785119 4737152 4686618 4633720 4578593 4522751 4468654 4417625 4369297 4323741 4283151
59758 4283151 4250312 4225700 4207131 4192250 4180469 4172413 4168551 4169121 4174951 4187475 4207758 4235877
59746 4235877 4271527 4315089 4367760 4430310 4501651 4578938 4659357 4741744 4826133 4911829 4996292
59735 4996292 5076047 5148383 5212042 5266900 5313804 5354748 5392266 5428045 5462559 5496754 5533700
59724 5533700 5577631 5631282 5695205 5769866 5857290 5959984 6079386 6216487 6373281 6552370
59714 6552370 6755567 6984167 7240248 7526221 7843084 8190455 8568360 8977188 9414792
59705 9414792 9874209 10344103 10809524 11250832 11643129 11959380 12176494 12280854 12271166 12158077
59695 12158077 11960752 11701903 11404054 11087981 10771579 10468191 10186160 9930659 9705735
59686 9705735 9514403 9357790 9235310 9145754 9088131 9062136 9068126 9106040 9174136 9269773 9391838
59675 9391838 9541361 9719286 9924972 10157748 10418631 10709320 11030711 11383959 11772054
59666 11772054 12198519 12664995 13171707 13720014 14312899 14953160 15642686 16383418 17177187
59657 17177187 18023944 18921120 19864819 20850360 21871279 22918882 23983220 25053707 26118801
59648 26118801 27166501 28186287 29170759 30116154 31022827 31895639 32742381 33570301 34383615
59639 34383615 35183566 35969180 36736833 37479379 38186181 38843891 39437460 39951764 40373833
59630 40373833 40694625 40909745 41019711 41029996 40950525 40794879 40579922 40325288 40051551 39777823
59620 39777823 39520925 39296459 39119679 39004874 38964244 39007585 39142641 39375515 39711046 40152879
59610 40152879 40702787 41359597 42118483 42970678 43903048 44897548 45930789 46973424 47989541
59601 47989541 48937383 49772019 50448532 50924537 51163241 51138034 50836542 50261672 49430557
59592 49430557 48373497 47131871 45752695 44281645 42759236 41221271 39699859 38222255
59584 38222255 36808934 35472949 34220251 33049948 31954638 30920951 29930028 28958684
59576 28958684 27982607 26981257 25942275 24863876 23754943 22632534 21517022 20427126
59568 20427126 19377482 18378593 17437146 16556192 15736133 14976131 14274673 13629561 13038342
59559 13038342 12498523 12006713 11558274 11148992 10776656 10439767 10135179 9858609 9607136
59550 9607136 9379395 9173130 8984419 8809819 8647646 8496321 8352756 8213229 8074966
59541 8074966 7936238 7795939 7653756 7510060 7365089 7218837 7071906 6925662 6781495
59532 6781495 6640841 6505818 6378435 6258961 6146521 6041665 5946814 5863521 5790734 5726622
59522 5726622 5670941 5624760 5588964 5563807 5548902 5542826 5543599 5550240 5563109 5582450 5607871 5639490
59510 5639490 5677897 5722185 5769799 5819589 5873520 5934004 6000898 6072609 6148894 6230867 6319205
59499 6319205 6414261 6517425 6630673 6755028 6890719 7038493 7199528 7374563 7564360 7770549
59489 7770549 7994686 8236820 8496217 8773057 9068104 9380985 9710022 10053465 10409665
59480 10409665 10776125 11149266 11524718 11896926 12259357 12606620 12935716 13243608 13524277
59471 13524277 13770447 13978332 14148768 14283746 14384282 14452363 14492374 14508696 14503295 14477613
59461 14477613 14436087 14386102 14334733 14287054 14247775 14223143 14220458 14246120 14304427 14397536 14525556
59450 14525556 14686247 14874817 15084253 15305660 15528115 15738619 15923075 16067892 16160749
59441 16160749 16190512 16147864 16027150 15827582 15552568 15208498 14804594 14353096 13868331 13364989
59431 13364989 12856741 12355188 11869020 11404209 10965449 10557024 10181955 9841107 9534063
59422 9534063 9260647 9021061 8815102 8642017 8500721 8389537 8306346 8250005 8221208 8221029
59412 8221029 8249064 8303926 8385069 8492766 8626549 8784964 8966842 9171463 9397128 9640458
59402 9640458 9897152 10162280 10429611 10691766 10941482 11171853 11375010 11541650 11662822
59393 11662822 11732070 11745869 11702943 11603776 11450372 11246154 10996354 10708481 10391464 10053685
59383 10053685 9701877 9341794 8979184 8619756 8268574 7929535 7604898 7295259 7000786
59374 7000786 6722765 6463408 6223979 6003901 5801984 5617655 5450385 5298749 5161056
59365 5161056 5036620 4925677 4828162 4743238 4669892 4607311 4554622 4510893 4475794 4449924 4434096
59354 4434096 4428223 4431054 4441120 4457991 4482488 4515347 4555347 4598661 4640174 4675748 4703792 4725513
59342 4725513 4744342 4765001 4792103 4828604 4875315 4932211 4999959 5079067 5167115 5258099 5346306
59331 5346306 5431202 5517712 5611734 5716462 5833073 5963068 6108520 6270824 6450722 6649495
59321 6649495 6869224 7111936 7379339 7673379 7996320 8350112 8736223 9156184 9611963
59312 9611963 10105832 10640141 11216913 11836960 12499149 13200569 13936968 14702416 15488583
59303 15488583 16284805 17078942 17858164 18609698 19322151 19987083 20599779 21158892 21665374
59294 21665374 22121003 22527054 22884067 23192468 23452449 23662524 23818592 23915016 23946272 23907119
59284 23907119 23791878 23594829 23311828 22941606 22486197 21950970 21344264 20676475 19959324
59275 19959324 19205612 18428408 17639349 16847944 16062934 15293499 14548107 13832656 13150818
59266 13150818 12505765 11900360 11335844 10811595 10326269 9878408 9466307 9088636 8745162
59257 8745162 8435455 8156749 7904625 7676410 7472465 7293242 7136339 6997810 6875655
59248 6875655 6770430 6682561 6610501 6552081 6506629 6474783 6456529 6450503 6455547 6472113 6501187
59237 6501187 6542121 6592623 6651289 6719219 6798400 6889025 6989091 7096360 7210073 7330953
59227 7330953 7459969 7596868 7739549 7885379 8033517 8185241 8341331 8499851 8657528
59218 8657528 8812737 8965853 9116890 9264031 9404560 9536217 9657692 9768992 9871567
59209 9871567 9967005 10055090 10133649 10200254 10253132 10290228 10308485 10304760 10277020 10224359 10146531
59198 10146531 10044192 9919628 9777053 9622013 9459900 9294405 9127604 8961957 8801724
59189 8801724 8651671 8514820 8392300 8284856 8193204 8117250 8056667 8012620 7987401 7981634 7992872
59178 7992872 8017558 8053378 8099064 8153109 8213924 8280836 8353800 8432179 8514543 8599750 8687839
59167 8687839 8779899 8877301 8981058 9091821 9210631 9339687 9482290 9642140 9822912 10028187
59157 10028187 10261068 10523639 10816895 11140904 11494436 11874372 12275573 12690798 13110105
59148 13110105 13520764 13908659 14259820 14560276 14795447 14951692 15019194 14992972 14871514 14656005
59138 14656005 14351460 13967499 13516977 13013949 12472760 11907975 11333978 10764085 10209253
59129 10209253 9676757 9170213 8691609 8243209 7826837 7441924 7085891 6756691 6453749
59120 6453749 6176327 5922466 5690168 5478263 5285363 5109114 4947432 4799587 4665291
59111 4665291 4543617 4433642 4335157 4247529 4168615 4096166 4030044 3971900 3922786 3882139 3849052
59100 3849052 3823279 3804512 3791626 3783509 3780350 3783248 3792422 3806485 3824159 3846332 3875464 3912662
59088 3912662 3956211 4003682 4054750 4110999 4173506 4241905 4315720 4395184 4480346 4570488 4665169
59077 4665169 4765154 4871562 4984340 5101982 5222583 5344991 5469158 5595403 5723165 5850522
59067 5850522 5975125 6095355 6210431 6320049 6424412 6523851 6617601 6703755 6781620 6853481
59057 6853481 6922603 6989950 7054435 7116022 7176668 7238342 7302295 7370726 7446960 7532865 7627742
59046 7627742 7730878 7843774 7968734 8106603 8257128 8420286 8595629 8781086 8973984
59037 8973984 9172919 9377320 9585129 9791553 9989706 10171691 10329559 10456402 10547006 10597517
59027 10597517 10605178 10568961 10490234 10372544 10221233 10043272 9846386 9637326 9421026 9201294
59017 9201294 8981346 8763268 8547973 8336332 8129500 7927502 7728437 7530079 7331689
59008 7331689 7133457 6934930 6735172 6534327 6333979 6135763 5940168 5746878 5556062
58999 5556062 5369165 5188167 5013837 4845111 4680832 4521788 4370102 4226820 4091243
58990 4091243 3962561 3840792 3725908 3617598 3516430 3423775 3339640 3261660 3187116 3115072
58980 3115072 3045921 2980087 2918105 2860982 2809346 2762908 2721457 2685350 2654165 2626049 2599734
58969 2599734 2576459 2558576 2546704 2539341 2534790 2532353 2531963 2533756 2537820 2543560 2549469 2554212 2557656
58956 2557656 2560294 2562105 2562648 2561944 2560636 2559561 2559537 2561058 2563744 2566533 2568819 2570911 2573211 2575727 2578630
58941 2578630 2582198 2585708 2587432 2586484 2583733 2580163 2575263 2567953 2558315 2547496 2536409 2525224 2513703
58928 2513703 2501693 2490057 2481217 2477473 2478210 2480189 2481455 2483688 2489762 2500307 2513890 2529257 2545876
58915 2545876 2563105 2580382 2597868 2615925 2634533 2654023 2675546 2699870 2726554 2755144 2786116
58904 2786116 2819684 2854866 2890946 2928698 2968810 3010115 3050912 3091245 3132510 3175590 3220718
58893 3220718 3268216 3317906 3368590 3419771 3473342 3532134 3597296 3668229 3744291 3825190 3910548
58882 3910548 4000596 4096663 4199628 4308621 4422668 4542739 4670725 4807254 4952137 5106082
58872 5106082 5270162 5444318 5628149 5822643 6029478 6249343 6482632 6731039 6996578
58863 6996578 7279652 7580059 7899352 8240324 8604703 8993245 9407551 9849838 10321466
58854 10321466 10823736 11359548 11932131 12542620 13191041 13878932 14608259 15377949 16184031
58845 16184031 17023003 17892031 18785219 19691957 20599079 21491942 22352695 23160089 23892355
58836 23892355 24529061 25050554 25438759 25680286 25767877 25699158 25476715 25110184 24615664 24011390
58826 24011390 23315063 22545319 21722739 20867303 19995952 19123230 18262262 17423626 16614627
58817 16614627 15840626 15105580 14410565 13753909 13134426 12553170 12010798 11504879 11031512
58808 11031512 10588432 10174965 9789893 9431042 9096381 8784225 8492777 8220518 7966747
58799 7966747 7731039 7512603 7310593 7124184 6951832 6791460 6642176 6504973 6381027
58790 6381027 6270100 6171193 6083753 6007422 5941570 5886061 5841815 5809641 5788974 5778478 5777434
58779 5777434 5785928 5804178 5832364 5870847 5920022 5980113 6051250 6133441 6226462 6330230 6445238
58768 6445238 6572114 6710985 6861955 7025889 7203891 7396377 7603670 7827117 8068397
58759 8068397 8328055 8606132 8903947 9223723 9566669 9933272 10325565 10747180 11200819
58750 11200819 11687490 12208621 12766965 13364628 14001963 14679217 15397465 16156399 16952104
58741 16952104 17777682 18624835 19483890 20343138 21188674 22003766 22767959 23458327 24052797
58732 24052797 24532048 24879021 25079465 25124894 25014347 24752828 24349566 23818571 23178880
58723 23178880 22452000 21658807 20818686 19949560 19067036 18183998 17311810 16460926 15639341
58714 15639341 14851305 14098566 13382252 12702992 12060387 11453674 10882560 10346698 9844790
58705 9844790 9374744 8934327 8521542 8135111 7774727 7439942 7128584 6837305 6563868
58696 6563868 6307839 6068985 5846340 5639044 5446512 5267274 5099070 4940749 4792812
58687 4792812 4655620 4528443 4410732 4302763 4204168 4113131 4027758 3947132 3870570 3797205
58677 3797205 3726861 3659993 3596265 3534601 3475021 3418721 3365709 3314043 3262246 3210891 3161030
58666 3161030 3112600 3065173 3018700 2972738 2926518 2880485 2836074 2793219 2749853 2704630 2658219
58655 2658219 2611131 2562529 2512404 2462676 2414561 2366795 2318155 2269874 2223799 2179808 2136981
58644 2136981 2095945 2058185 2024043 1992814 1963735 1935720 1907571 1879785 1854626 1833083 1813298
58633 1813298 1793230 1772932 1752655 1730890 1706511 1681258 1657742 1636228 1615399 1595039 1575818
58622 1575818 1557508 1539547 1522570 1507603 1494550 1482952 1473060 1464719 1456756 1449237 1444700 1445090 1449026
58609 1449026 1454271 1461252 1471566 1484416 1497324 1509365 1520894 1530923 1537716 1541554 1544197 1545753
58597 1545753 1544472 1539537 1531848 1522188 1510716 1498192 1485844 1474304 1464242 1457326 1454628 1454858 1456260
58584 1456260 1459457 1466097 1475538 1485615 1496319 1509941 1527604 1548274 1571307 1597366 1626420 1657232
58572 1657232 1689436 1724177 1762227 1803249 1847242 1894966 1946742 2002645 2064084 2133431 2211737
58561 2211737 2298375 2392895 2495367 2604765 2719062 2837557 2961656 3092973 3232103 3379534
58551 3379534 3536268 3703179 3880957 4070786 4273750 4489482 4716574 4954022 5200595
58542 5200595 5452699 5704368 5949340 6181595 6393918 6577828 6725544 6830944 6888901 6895810
58532 6895810 6851709 6760801 6629300 6463476 6269884 6056151 5830512 5600336 5370661 5143824
58522 5143824 4921262 4706128 4502989 4314230 4138356 3973348 3820283 3681664 3557436
58513 3557436 3445095 3343079 3251546 3169933 3096044 3027754 2963939 2903786 2846887 2793788 2744802
58502 2744802 2698522 2653184 2609090 2567837 2529444 2492124 2454576 2416626 2378010 2338633 2299808
58491 2299808 2263071 2227852 2192329 2156445 2121821 2088658 2055088 2019916 1983856 1947633 1911057
58480 1911057 1874640 1840220 1809032 1780497 1753545 1727922 1703731 1680774 1658751 1637424 1616691
58469 1616691 1597099 1579706 1564513 1549972 1535238 1521736 1510840 1501270 1490923 1480165 1470782 1462471
58457 1462471 1453183 1442631 1432743 1424562 1417145 1409654 1402271 1394874 1386917 1378696 1370826 1362629 1353041 1342828
58443 1342828 1333803 1326196 1318983 1312241 1306632 1301064 1293731 1285439 1279077 1275703 1273704 1271740 1269743 1267064
58429 1267064 1262731 1257908 1255224 1255150 1255670 1255792 1256513 1257945 1258512 1257677 1256567 1255120 1251492 1245190 1238068 1231282
58413 1231282 1223902 1215476 1207276 1199938 1192443 1184601 1178087 1173746 1170175 1166212 1162650 1160253 1158099 1155218
58399 1155218 1152160 1149827 1148284 1147550 1148146 1150238 1153504 1157995 1163690 1169550 1174833 1180773 1188637 1196734
58385 1196734 1202215 1205444 1209369 1214662 1218957 1221162 1222946 1225275 1226988 1227805 1229456 1232689 1236218 1239686
58371 1239686 1244575 1251084 1257095 1261398 1265056 1268490 1270204 1269580 1267980 1265865 1261724 1255143 1248144 1242362
58357 1242362 1237654 1234472 1234520 1237742 1241572 1244391 1247079 1250284 1253251 1256287 1261133 1267913 1274899 1282240
58343 1282240 1292317 1305406 1318833 1331693 1346337 1363497 1380061 1393775 1406236 1418937 1430172
58332 1430172 1438492 1445764 1454036 1462306 1468808 1473492 1476042 1474688 1469385 1463061 1457367 1450436 1441355 1433553
58318 1433553 1430754 1432255 1434887 1437087 1438647 1439122 1439115 1440778 1444831 1449263 1452574 1455647 1459052 1461850 1464649
58303 1464649 1470226 1479140 1488394 1496379 1505300 1516543 1527886 1537871 1548865 1562828 1578031 1592930
58291 1592930 1609348 1628619 1648466 1666962 1685795 1706195 1725318 1740272 1752265 1763523 1773769
58280 1773769 1782940 1793372 1805654 1816218 1822724 1827880 1834288 1839998 1843510 1848702 1859569 1873820 1886962
58267 1886962 1899451 1914536 1931969 1949223 1966544 1985728 2005812 2024558 2042463 2061522 2082148
58256 2082148 2104656 2130926 2161145 2192061 2221904 2253413 2288318 2323050 2354256 2384350 2416761
58245 2416761 2449838 2480601 2510549 2542137 2573245 2600839 2626798 2654474 2682815 2709613 2737313
58234 2737313 2769811 2806590 2845683 2889171 2939708 2994572 3049025 3102826 3157915 3213005 3266335
58223 3266335 3320555 3378902 3439660 3500165 3562751 3630722 3702120 3773824 3848194 3929202 4015629
58212 4015629 4104638 4198233 4299406 4405739 4513825 4626013 4745645 4869754 4994046 5120871
58202 5120871 5254466 5392669 5531810 5675696 5831019 5997696 6172510 6358470 6561569
58193 6561569 6781977 7017321 7270800 7546855 7842836 8154332 8484496 8838497 9213407
58184 9213407 9604010 10014115 10451348 10915120 11400814 11911304 12452724 13023317 13618505
58175 13618505 14242584 14903214 15599024 16325252 17086710 17892151 18741455 19632725 20576840
58166 20576840 21590204 22678295 23841001 25087379 26427941 27858433 29369383 30966630
58158 30966630 32665101 34469783 36383045 38423714 40616950 42971625 45490023 48192150
58150 48192150 51105645 54240343 57602255 61227708 65176027 69497251 74240853 79491273
58142 79491273 85362444 91966870 99429450 107924604 117659525 128832734 141655854 156396932
58134 156396932 173334209 192668796 214538504 239094404 266498824 296920635 330650746
58127 330650746 367990607 408360116 448966063 484492206 508823116 517837449 511097845
58120 511097845 491344877 462706647 429168891 393898947 359097478 326057614 295400492
58113 295400492 267393722 242141108 219611877 199668019 182145940 166894830 153748804
58106 153748804 142529405 133098877 125367256 119222925 114481676 110910199 108255221 106212290
58098 106212290 104379304 102281803 99487651 95748257 91077131 85709583 79970769 74151919
58090 74151919 68467940 63070940 58057301 53463962 49286020 45506639 42103818 39040905
58082 39040905 36274912 33776648 31529540 29512057 27696583 26062375 24593282 23264239
58074 23264239 22045644 20920616 19883618 18923053 18019951 17163930 16356110 15595197 14873866
58065 14873866 14190036 13548883 12951310 12391193 11865388 11375843 10920438 10491701 10085678
58056 10085678 9702518 9337743 8982829 8635736 8301945 7984351 7680755 7391401 7119609
58047 7119609 6864177 6619941 6386446 6167406 5961262 5761271 5565572 5378169 5199224
58038 5199224 5023654 4850780 4686182 4531922 4383371 4237946 4098919 3968072 3842307
58029 3842307 3720219 3604936 3497729 3395341 3296168 3202793 3116003 3032287 2949675 2870618
58019 2870618 2796988 2727444 2661480 2600751 2544646 2489554 2434088 2380358 2329195 2279178 2231008
58008 2231008 2187338 2147373 2107303 2067099 2031112 2000672 1971982 1942883 1915835 1892174 1869044
57997 1869044 1844480 1820509 1798749 1777576 1755987 1735940 1718506 1701518 1683154 1664451 1646791
57986 1646791 1630396 1616326 1606127 1598378 1589420 1578607 1569052 1562363 1556610 1550326 1544426 1539271 1533964
57973 1533964 1529396 1527794 1528351 1527502 1524238 1520823 1517592 1511920 1503416 1495250 1488925 1482418 1474977 1469012
57959 1469012 1465398 1461603 1456551 1452841 1451885 1451083 1448212 1444631 1441612 1437211 1429471 1419666 1410028 1401038
57945 1401038 1392836 1386416 1381632 1376737 1371292 1366753 1363193 1358753 1353475 1350312 1351077 1354605 1359714 1366357
57931 1366357 1372934 1376706 1378100 1380374 1383593 1383454 1377907 1370229 1363125 1354518 1342313 1329228 1319184
57918 1319184 1312186 1306328 1302025 1300779 1301845 1303235 1304252 1304699 1303561 1300756 1298344 1297939 1298700 1299237 1299275
57903 1299275 1298054 1293825 1286630 1279103 1272968 1267337 1261813 1258084 1256646 1255028 1251293 1246429 1241374 1234842
57889 1234842 1226371 1218504 1213547 1210776 1208919 1208448 1209237 1209197 1207828 1208044 1211619 1215837 1217770 1218956 1222341
57874 1222341 1227041 1229856 1230069 1229082 1226678 1221156 1212460 1202346 1192153 1182433 1173595 1164883 1154077 1140326
57860 1140326 1125932 1113476 1102803 1092778 1084077 1077827 1073076 1068146 1063340 1060155 1059037 1059804 1062936
57847 1062936 1068503 1074956 1080643 1085359 1089250 1091992 1094316 1098263 1104373 1110717 1116136 1121965 1128949 1135211
57833 1135211 1139352 1142754 1146521 1148958 1148750 1147793 1147839 1146923 1142455 1135530 1128690 1121597 1112693 1103291 1095969
57818 1095969 1090110 1082879 1073873 1065319 1058366 1052435 1047623 1044624 1042823 1041340 1041433 1045009 1051338 1057897
57804 1057897 1063831 1069908 1075827 1080438 1084108 1088285 1093234 1098608 1105313 1114016 1122630 1128238 1130950 1133095
57790 1133095 1135268 1136110 1135424 1134326 1132477 1128211 1121528 1114203 1106872 1098555 1089141 1079788 1070734 1061173
57776 1061173 1051482 1043242 1036812 1031081 1025751 1021747 1019127 1016472 1012562 1007034 999672 990803 982057 974806
57762 974806 968083 959801 949636 938923 928370 917777 907278 896789 885077 871756 859344 850606
57750 850606 844441 837296 828316 820164 814768 811309 808773 807713 808742 811588 816287 823266 831730 839753
57736 839753 846289 851531 855377 857392 858097 858471 858419 857702 857812 860597 865457 870381 875403 882265 890826 898807
57720 898807 905341 911769 918388 923208 924747 923537 920102 913924 905276 895768 886250 876233 866023 857053
57706 857053 849355 841133 831852 823407 817128 811773 805903 800233 796198 793874 792797 793457 796509 801469
57692 801469 807379 814139 822551 833677 848362 866414 886191 906034 925915 946415 966532 984266
57680 984266 999048 1011536 1021306 1027194 1030075 1032718 1036377 1039892 1042678 1045951 1050127 1053656 1055841 1058561
57666 1058561 1063719 1070944 1079260 1089134 1101238 1114726 1128377 1142132 1156017 1168717 1178904 1187294
57654 1187294 1196132 1207032 1220057 1234205 1248182 1261372 1274611 1289398 1306245 1324671 1344680
57643 1344680 1366949 1391521 1417701 1445361 1474903 1505955 1537781 1571081 1607462 1646872 1687508
57632 1687508 1728743 1772248 1819676 1871009 1925758 1984019 2045825 2111290 2181837 2259494 2344688
57621 2344688 2436838 2537432 2650032 2776700 2917015 3071412 3242541 3431937 3638178 3860241
57611 3860241 4100298 4360880 4641028 4936971 5244367 5556787 5862329 6143517 6380678
57602 6380678 6556052 6657933 6683955 6640406 6537488 6385776 6196533 5981923 5752296 5514388
57592 5514388 5273393 5035072 4804449 4584265 4376400 4183140 4005481 3842157 3692342
57583 3692342 3557544 3438781 3333604 3238366 3152136 3075992 3009616 2951295 2900689 2859207 2827634
57572 2827634 2804925 2789076 2778044 2770623 2767620 2771229 2782214 2799136 2821532 2851727 2891452 2938678
57560 2938678 2990540 3047973 3114486 3191350 3277129 3371448 3476062 3592086 3718936 3856315
57550 3856315 4004574 4162451 4326545 4493627 4661397 4826157 4981400 5119662 5234687
57541 5234687 5321381 5375190 5392711 5372704 5316407 5227267 5110062 4969492 4809781 4635902
57531 4635902 4453978 4269151 4083836 3899609 3720020 3549690 3390930 3243113 3105258
57522 3105258 2977381 2859163 2749215 2646384 2550539 2461513 2378339 2300152 2227135 2160103
57512 2160103 2099583 2045314 1996207 1950875 1908570 1869358 1833204 1799791 1769753 1744759 1725115
57501 1725115 1708282 1691411 1674675 1660464 1649757 1641140 1633324 1626760 1622425 1620435 1620364 1621849 1624441
57488 1624441 1627564 1630999 1634963 1639851 1646371 1655529 1667761 1682431 1698865 1717260 1737770 1759390
57476 1759390 1780979 1803006 1827163 1854590 1885433 1919569 1956555 1995306 2035142 2077011 2122671
57465 2122671 2173093 2228730 2290688 2360074 2436429 2518369 2605891 2700867 2805185 2919404 3042991
57454 3042991 3174489 3311244 3449973 3587720 3721496 3847042 3958897 4051855 4121867 4165933
57444 4165933 4182171 4170218 4131267 4067911 3984099 3884492 3773176 3653314 3528099 3400999
57434 3400999 3274774 3151567 3034322 2926267 2828030 2737187 2652078 2574318 2505976 2446282
57424 2446282 2393344 2347374 2309441 2278233 2250994 2227063 2207802 2193470 2182871 2175837 2173441 2175709
57412 2175709 2181607 2191422 2206813 2228283 2254803 2286117 2323143 2365783 2412606 2463331 2519787 2583853
57400 2583853 2656037 2736263 2824289 2919110 3019607 3125893 3238424 3355953 3476141 3597698
57390 3597698 3719336 3836532 3941905 4029314 4095447 4137356 4151434 4135988 4092540 4023639 3931475
57379 3931475 3819567 3693470 3558368 3417498 3273693 3130479 2990551 2855011 2725120
57370 2725120 2602929 2489109 2382131 2281116 2187885 2104700 2031292 1965430 1905215 1849622
57360 1849622 1797940 1749946 1705731 1664602 1625233 1587603 1553413 1523665 1497118 1472105 1448601
57349 1448601 1427333 1407901 1388909 1369317 1349099 1329376 1312251 1299326 1289902 1281698 1273511 1265815
57337 1265815 1258724 1251336 1243644 1237191 1233010 1230676 1230125 1232382 1237389 1242956 1247148 1250197 1253025 1255686
57323 1255686 1258531 1263247 1271181 1281927 1294752 1309849 1326777 1343359 1357900 1371227 1384786 1397758
57311 1397758 1407931 1414704 1419607 1424300 1429366 1434638 1439728 1444593 1450133 1457455 1466150 1474547 1482226 1490780
57297 1490780 1501243 1512410 1522867 1533165 1544500 1556582 1568367 1579909 1591939 1604400 1616590
57286 1616590 1628039 1638291 1646878 1654460 1662900 1673141 1684108 1694740 1705845 1718832 1733745 1749593
57274 1749593 1765353 1779719 1791415 1801107 1811494 1824196 1837969 1851270 1864768 1879606 1894933
57263 1894933 1909373 1923584 1939096 1955621 1971749 1987515 2004145 2021905 2040248 2059563 2080681
57252 2080681 2102970 2124900 2146372 2168822 2193007 2218075 2242733 2266264 2288696 2311083 2335161
57241 2335161 2361670 2389504 2417391 2445610 2475073 2505765 2537394 2570570 2605959 2643088 2681371
57230 2681371 2721351 2763492 2806698 2849598 2892500 2936593 2982087 3028680 3076951 3127596 3180030
57219 3180030 3233334 3287824 3344050 3400980 3456858 3511201 3564337 3615680 3664002 3708657 3748968
57208 3748968 3783348 3810942 3833336 3852725 3868852 3879643 3884363 3884326 3880916 3874788 3866915 3858785 3851504
57195 3851504 3845762 3842252 3841108 3841635 3843657 3848131 3855225 3863087 3870185 3877699 3887844 3900958 3916080
57182 3916080 3933266 3953175 3975330 3999085 4025628 4056855 4092746 4131808 4173567 4218739 4267456
57171 4267456 4319123 4373380 4429481 4485589 4540422 4594582 4648406 4699748 4746189 4788438 4829280
57160 4829280 4870237 4911638 4954862 5001728 5052402 5106562 5165882 5232601 5306159 5383879 5464488
57149 5464488 5548493 5635755 5725354 5817152 5910772 6003751 6093670 6181613 6270605 6361152 6451295
57138 6451295 6540437 6629794 6719415 6808202 6896947 6988115 7082400 7178368 7275465 7374322 7474131
57127 7474131 7573003 7671211 7771084 7873320 7976050 8077479 8176580 8271514 8360666 8445352 8528254
57116 8528254 8609092 8685031 8755305 8821851 8885196 8943500 8996435 9046696 9096946 9148275 9201917
57105 9201917 9259125 9318730 9377931 9435919 9493679 9550305 9603119 9651805 9698985 9746641 9795638
57094 9795638 9848783 9910100 9980557 10058356 10143679 10238848 10343544 10454624 10571534 10697221
57084 10697221 10832661 10975046 11122339 11274734 11430264 11583846 11732338 11875863 12012435
57075 12012435 12136081 12242340 12331196 12402672 12453946 12482857 12490114 12476234 12440377 12383442 12307722
57064 12307722 12212176 12092676 11947815 11778984 11583459 11353127 11081489 10766049 10402632
57055 10402632 9984074 9506458 8969904 8371220 7702771 6960609 6146446 5259834 4296655
57046 4296655 3257320 2147390 967506 -287868 -1619872 -3025826 -4516076 -6120803
57038 -6120803 -7877805 -9826422 -12016683 -14507929 -17350671 -20583644 -24253732 -28422429
57030 -28422429 -33151380 -38507087 -44579972 -51455878 -59164871 -67748651 -77459306 -88815464
57022 -88815464 -102258477 -117599986 -133793407 -149295648 -162703677 -173156599 -180341523
57015 -180341523 -184315054 -185356717 -183878726 -180345257 -175204397 -168847646 -161582121 -153614331
57007 -153614331 -145071415 -136055081 -126680867 -117079361 -107387195 -97751261 -88330762 -79281683
56999 -79281683 -70737599 -62801105 -55538333 -48971430 -43081494 -37826227 -33155572 -29014832
56991 -29014832 -25346171 -22096757 -19223619 -16688207 -14450831 -12473262 -10722272 -9167761
56983 -9167761 -7781676 -6541747 -5432749 -4441646 -3554790 -2761297 -2054422 -1426532 -865956
56974 -865956 -361182 95159 508788 886622 1234317 1553600 1844907 2110715 2354126 2576148
56964 2576148 2776400 2954657 3109990 3240463 3345852 3429574 3496712 3551625 3598288 3640560
56954 3640560 3680188 3715967 3746586 3773520 3800251 3829963 3865320 3910171 3971031 4056327 4170889
56943 4170889 4306477 4437153 4528627 4556452 4516329 4418599 4276737 4102111 3904751 3693284
56933 3693284 3472946 3245263 3009928 2766693 2516737 2263782 2013601 1771763 1541983
56924 1541983 1326276 1125070 936732 758614 589416 429448 278286 134065 -4063 -134800
56914 -134800 -257432 -374089 -487502 -597526 -701544 -797539 -885164 -964316 -1034399 -1095135
56904 -1095135 -1147038 -1190913 -1227550 -1257810 -1282372 -1301422 -1314969 -1323408 -1327738 -1329731 -1332081 -1337635
56892 -1337635 -1347770 -1361620 -1377125 -1392597 -1407390 -1421831 -1436876 -1453197 -1470126 -1485677 -1497700
56881 -1497700 -1504750 -1506046 -1501484 -1491913 -1478791 -1463246 -1445696 -1426102 -1403818 -1377414 -1345719 -1309439
56869 -1309439 -1271319 -1234932 -1204103 -1182773 -1173424 -1174756 -1182064 -1190809 -1199314 -1207877 -1216558 -1224787 -1232294
56856 -1232294 -1239309 -1245890 -1251501 -1255155 -1256000 -1254359 -1252091 -1251020 -1250877 -1249817 -1247189 -1244489 -1242947 -1241525
56842 -1241525 -1238506 -1234077 -1229917 -1226628 -1222980 -1217744 -1211109 -1203986 -1196583 -1188100 -1177448 -1164067 -1148202
56829 -1148202 -1130381 -1110520 -1087700 -1061130 -1031226 -999598 -968269 -939194 -914148 -894298 -879482
56818 -879482 -868053 -857691 -846626 -834417 -821781 -809578 -797681 -784774 -769400 -751217 -731172
56807 -731172 -710265 -688214 -663411 -634347 -600914 -564131 -524785 -482875 -438583 -393581 -351284
56796 -351284 -316012 -291605 -279815 -279388 -286979 -299494 -315333 -333346 -351403 -366862 -378219 -385496
56784 -385496 -389027 -388339 -382297 -370024 -351674 -328314 -300688 -268000 -228545 -182026 -130758 -78391
56772 -78391 -28241 16574 52425 75933 85348 80443 61832 31588 -5946 -45666 -84370 -121116
56760 -121116 -155126 -184701 -208578 -227088 -241142 -250623 -254258 -250686 -239386 -221044 -197304 -169864
56748 -169864 -139676 -107153 -72989 -38685 -7028 17369 29043 25001 7336 -18513 -48192 -80229
56736 -80229 -113980 -147700 -179321 -207793 -232703 -253497 -269950 -282709 -292514 -299201 -301924 -299993
56724 -299993 -293254 -282319 -268724 -254148 -239021 -222586 -204931 -188493 -177124 -174043 -180602 -195927
56712 -195927 -217022 -240006 -262218 -283069 -302815 -321281 -338258 -354157 -369373 -383513 -396036
56701 -396036 -407129 -417157 -425759 -432317 -436944 -440139 -441804 -441646 -440361 -439405 -439395 -439561 -439011 -437952 -437406
56686 -437406 -438160 -440177 -442632 -444359 -444542 -443143 -440591 -437297 -433775 -430879 -429194 -428086 -426015 -422146 -417416
56671 -417416 -413725 -412225 -412518 -413384 -414090 -415036 -417200 -421053 -426087 -431311 -435904 -439324 -441199 -441505 -440674 -439212
56655 -439212 -437386 -435518 -434220 -433767 -433366 -431734 -428544 -424822 -421766 -419568 -417534 -414940 -411630 -408250 -406055
56640 -406055 -405922 -407212 -408099 -407498 -406240 -405790 -406326 -406803 -406542 -405724 -404383 -402105 -399147 -396887 -396436 -397343 -398207
56623 -398207 -398011 -396354 -392996 -388013 -382006 -375431 -368025 -359592 -350849 -342595 -334414 -325375 -315820 -307264
56609 -307264 -300414 -294601 -289322 -284862 -280747 -274961 -266028 -255119 -244926 -236680 -229115 -220105 -208553
56596 -208553 -194890 -180434 -166235 -152259 -137916 -123533 -110577 -100001 -91242 -83645 -77970 -75313
56584 -75313 -75191 -76306 -79024 -85577 -97476 -114042 -133893 -156573 -181892 -208681 -235323 -260912 -284938
56571 -284938 -306378 -324402 -339863 -354643 -368924 -380233 -386226 -387794 -388080 -388571 -387671 -383738 -378067
56558 -378067 -373520 -370994 -368909 -365999 -362889 -360499 -358451 -355920 -352970 -349980 -346506 -341748 -335661 -328792
56544 -328792 -321443 -313823 -306581 -300353 -295156 -290952 -288291 -287453 -287283 -286091 -283590 -280973 -279083 -277542 -275833
56529 -275833 -274153 -272742 -271162 -268892 -266192 -263907 -262619 -262241 -262269 -262163 -261612 -260671 -259646 -258842 -258270 -257480
56513 -257480 -255773 -252850 -249276 -245945 -243094 -240200 -236775 -232724 -227986 -222584 -217100 -212181 -207362 -201426
56499 -201426 -194357 -187809 -183028 -179391 -175693 -171618 -166935 -160685 -152869 -145895 -142324 -141460 -140043 -136247
56485 -136247 -131308 -127188 -124436 -122804 -122391 -123322 -125382 -128521 -132800 -137372 -140587 -141764 -141967 -142298 -142166
56470 -142166 -140180 -136375 -132629 -130780 -130896 -131695 -132441 -133804 -136427 -139171 -139985 -138724 -137728 -138677 -140091 -139325
56454 -139325 -136241 -133231 -132066 -132461 -133654 -135449 -137302 -138093 -137642 -137208 -137754 -138661 -138828 -138150 -137305 -136939 -137708
56437 -137708 -140150 -143664 -146282 -146439 -144647 -142812 -142175 -142502 -142918 -142818 -142013 -140558 -138675 -136692 -134981 -133852
56421 -133852 -133331 -133053 -132515 -131432 -129719 -127371 -124600 -121897 -119632 -117681 -115686 -113430 -110801 -107704 -104201
56406 -104201 -100241 -95130 -88076 -79717 -72159 -66711 -62247 -56653 -49241 -40971 -33105 -26585 -21878 -18272
56392 -18272 -14115 -8949 -4561 -2476 -1433 770 3771 5180 4229 2420 634 -1806 -4683 -6025 -4821
56377 -4821 -2635 -1381 -1233 -1952 -4660 -10633 -19226 -28413 -36715 -43624 -48804 -52060 -53874 -55273 -57270
56362 -57270 -60576 -65205 -70129 -74030 -76641 -78651 -80254 -80796 -80055 -78783 -77638 -76603 -75744 -75398 -75310 -74882
56346 -74882 -74625 -75932 -78701 -80636 -79969 -77790 -76656 -77806 -80761 -84744 -89210 -93346 -96102 -96779 -95339
56331 -95339 -92480 -89551 -87622 -86287 -84079 -80267 -75326 -69371 -61295 -50156 -36461 -21324 -5233 11499
56316 27696 41551 51775 58330 62633 67090 73397 80741 86374 88398 87328 84800 81807 78700 75928
56302 75928 74013 73352 74407 77387 81377 84544 85689 85155 84226 84406 86986 92061 97759 101679 103410
56287 103410 104585 106420 108639 110942 113756 116904 119146 120035 120954 123441 127589 132678 138106 142966 146137
56272 146137 147755 149436 152173 155164 157638 160561 165359 171982 179367 186998 194943 203004 210729 217790
56258 217790 223883 228942 233768 239560 246511 253978 262145 271942 282858 292597 299875 306118 313489 322612
56244 322612 333195 345288 358692 372326 385420 398403 411768 425301 439174 454231 470045
56233 470045 484205 494962 503407 511771 520882 530635 541603 554419 568453 582709 597414 613478
56221 613478 631106 650048 670469 692475 715641 740009 766643 796193 827941 861350 897539
56210 897539 938049 982970 1031303 1082348 1136035 1193043 1255405 1325591 1403985 1488645 1578448
56199 1578448 1674948 1780139 1894318 2017625 2151775 2298183 2455728 2622295 2797281 2980639
56189 2980639 3170504 3363773 3558258 3752483 3944073 4129863 4306690 4470681 4616910
56180 4616910 4741551 4843491 4922325 4976080 5002827 5003507 4981101 4937845 4875228 4795943 4703702
56169 4703702 4601492 4491640 4376861 4259362 4139418 4016654 3892284 3768374 3645273
56160 3645273 3521423 3395586 3267966 3139509 3011274 2884004 2757454 2630959 2505565
56151 2505565 2384337 2269251 2159089 2051877 1948102 1849778 1757578 1670776 1589112 1512894
56141 1512894 1442068 1376825 1318185 1266300 1219159 1174548 1132278 1093014 1056434 1022433 992632
56130 992632 968214 947376 927271 907640 890240 875593 862781 851766 843336 837012 831370 826365
56118 826365 823397 823070 824504 826678 829137 831879 835840 842787 853371 866080 879299 893257 908733
56105 908733 925365 942866 962351 984537 1008086 1031596 1055761 1081521 1107843 1133717 1160866
56094 1160866 1191871 1226705 1263349 1300542 1337694 1373641 1408156 1443554 1482451 1525199 1571582
56083 1571582 1623062 1680749 1743321 1810397 1886329 1976987 2083911 2204950 2339353 2488418
56073 2488418 2651779 2826510 3009256 3195803 3379166 3551692 3709355 3851774 3979235
56064 3979235 4092769 4195859 4291864 4379336 4452479 4505879 4536615 4543326 4526938 4491926 4443660
56053 4443660 4384526 4314516 4233849 4141926 4035343 3910701 3768744 3613027 3446424 3272614
56043 3272614 3099080 2933924 2780274 2637372 2505862 2387977 2283884 2192272 2113591 2048412
56033 2048412 1993652 1944987 1902133 1867426 1840216 1817436 1798732 1786047 1778680 1773578 1769894 1768469
56021 1768469 1767647 1764757 1761154 1760401 1761799 1761168 1757896 1755822 1757061 1760153 1764322 1770253 1776669 1781355 1785654
56006 1785654 1792791 1802112 1810538 1819333 1833255 1852953 1874359 1895871 1919880 1946794 1974095 2002237
55994 2002237 2035033 2072952 2112040 2150672 2191488 2235588 2280760 2326521 2374931 2425432 2474905
55983 2474905 2523698 2575408 2629889 2683037 2734533 2789125 2849060 2912019 2977731 3049499 3127424
55972 3127424 3207030 3286655 3369742 3458131 3549634 3643812 3743482 3848994 3957591 4069661 4188748
55961 4188748 4314499 4443064 4575492 4717917 4872383 5035640 5208188 5395803 5600467
55952 5600467 5818647 6050296 6300558 6570622 6856052 7156130 7475403 7814026 8166646
55943 8166646 8533369 8921869 9336002 9772240 10229472 10711688 11218726 11745730 12294564
55934 12294564 12874354 13488096 14130518 14801390 15508062 16252570 17030725 17847668 18719877
55925 18719877 19657815 20661128 21734123 22889085 24129449 25446967 26841404 28326187
55917 28326187 29909786 31590928 33378607 35296715 37361399 39574261 41944985 44498229
55909 44498229 47250610 50206624 53388737 56847655 60634346 64791605 69386658 74523728
55901 74523728 80313629 86865659 94323743 102872954 112695876 123967823 136914604 151825632
55893 151825632 168992356 188698800 211292841 237166652 266598002 299660868 336209086
55886 336209086 375492688 415254313 451169086 477766385 490667898 488488492 472979012
55879 472979012 447667113 416334388 382185980 347606071 314149769 282688568 253672929
55872 253672929 227332876 203722661 182730165 164153509 147776621 133374549 120707114
55865 120707114 109554375 99741192 91109634 83494395 76744233 70742918 65391094 60589406
55857 60589406 56255180 52334822 48783708 45550897 42595211 39896714 37437680 35187335
55849 35187335 33116471 31210683 29456889 27831234 26311950 24891287 23564403 22319004
55841 22319004 21145796 20047144 19025414 18073146 17182754 16354775 15588145 14872805 14200041
55832 14200041 13570212 12982762 12428432 11898850 11394414 10915756 10456969 10014498 9593478
55823 9593478 9197822 8822577 8463115 8123351 7807414 7510800 7226937 6955650 6698706
55814 6698706 6453843 6219457 5998638 5792717 5597081 5408555 5230360 5064795 4907950
55805 4907950 4756774 4614325 4482573 4356864 4232946 4112600 3996566 3878597 3752757
55796 3752757 3620820 3486931 3350995 3213058 3078093 2950199 2827250 2706927 2592698
55787 2592698 2488054 2390163 2295299 2205609 2124493 2049882 1978227 1911012 1851352 1797874 1747680
55776 1747680 1701925 1662963 1629144 1597551 1568760 1544060 1521212 1497877 1476214 1459276 1445608
55765 1445608 1431890 1418104 1405680 1393300 1378902 1363343 1347996 1331207 1310905 1288308 1265479
55754 1265479 1241759 1215941 1189247 1162893 1135650 1107011 1079734 1055899 1033476 1010081 987033
55743 987033 966504 947917 930435 915660 904383 894061 882987 873493 867438 862200 855149 848514
55731 848514 845389 844135 841289 837211 834348 832478 830027 827700 826500 824415 819305 812952 808224 804457
55717 804457 799616 794661 791393 788057 781472 771706 760449 746684 728514 707835 688810 672642 657715
55704 657715 643653 631278 619679 607210 594655 583806 573802 562327 549634 538081 528498 520130
55692 520130 513217 508431 504455 499050 491785 483171 472315 458229 442342 427017 412577 398147 384025
55679 384025 370746 357533 344400 333953 328060 324390 319307 312628 306499 301373 296519 292769 291025
55666 291025 289238 284461 276938 268999 261180 252872 245345 240290 236418 231308 225798 222673 221721 220116
55652 220116 217285 215288 214428 212668 210030 209666 213318 218715 222695 224549 225313 225822 226387 226821 226302 224404
55636 224404 222167 220834 220000 218506 216458 214707 213140 211376 210350 211191 213156 214560 215088 215509 216121
55621 216121 217343 220621 226580 233397 239220 245021 252733 261754 269887 276609 282672 287447 289557 289533 289136
55606 289136 288597 287106 285312 284753 285368 286093 287193 289418 291622 292007 291106 290758 290782 289570 287477 286759 288446
55589 288446 291905 296806 302605 306821 307268 305683 305765 307659 307878 304894 301208 299041 297276 293944 289030
55574 289030 283472 277492 271109 264681 258173 251218 244064 236963 228902 218935 208517 200272 194443 188635
55560 188635 181038 171713 160998 149164 137657 128189 120429 112965 106439 102971 102295 101405 98586 94964
55546 94964 91390 86702 80385 74475 71212 70563 71165 72116 72787 72413 70856 68717 66265 63500 61323 60887
55530 60887 61685 62112 62085 62987 64671 64794 61961 57630 54041 51919 50829 50034 48331 44836 40725 38472
55514 38472 38559 38659 36952 34603 33867 35205 37421 39529 41328 42995 45015 47927 51556 55072 58054
55499 58054 60804 63382 65107 65155 63047 58686 52673 46226 39928 33050 25157 17663 12399 9138 6008
55484 6008 1882 -2967 -7867 -11744 -12950 -11139 -8811 -8963 -11653 -14782 -17503 -20363 -22758 -23341 -22960
55469 -22960 -24164 -27275 -29716 -30000 -29685 -30433 -31629 -32142 -32188 -32099 -31146 -29068 -27222 -26776 -26817 -25310 -21073
55452 -21073 -14137 -5168 4926 15768 28208 43431 61292 80424 99629 117840 133190 143872
55440 143872 149771 151783 150102 145056 138820 133692 128881 121715 111986 102349 94347 87116 80364 75348
55426 75348 71907 67688 61721 56010 52119 48880 45086 41807 39943 37750 33132 26744 20749 15899
55412 15899 11783 8609 6725 5214 2731 -824 -4709 -8718 -13008 -17261 -20904 -23609 -25037 -24863 -23381
55397 -23381 -21217 -18409 -15022 -12379 -11842 -12400 -11789 -10243 -10534 -13600 -16881 -18137 -18215 -18574 -18750 -18314 -18839
55380 -18839 -21452 -24271 -24736 -23083 -21263 -19851 -18418 -17777 -19150 -21691 -23247 -23392 -23690 -25029 -26523
55365 -26523 -27160 -27047 -26725 -26304 -25547 -24247 -22511 -20949 -20168 -19905 -19314 -18322 -17723 -17733 -17606 -17028 -16542 -16181
55347 -16181 -15129 -13301 -11674 -10443 -8642 -6430 -5777 -7562 -9803 -10326 -9670 -9704 -10777 -12047 -13522 -15852
55331 -15852 -18773 -21355 -23432 -25548 -27988 -30697 -33467 -35479 -35669 -34300 -33072 -32920 -33007 -32637 -32474 -32820
55315 -32820 -32446 -30647 -28971 -29296 -31406 -33828 -35712 -36507 -35446 -33152 -32255 -34376 -37654 -39206 -38874 -38496
55299 -38496 -38589 -38087 -36703 -35323 -34482 -34276 -35322 -37919 -40678 -41774 -41189 -40272 -39682 -39444 -40244 -42668 -45522
55282 -45522 -46808 -46208 -45049 -44169 -43471 -43156 -43669 -44677 -45666 -47130 -49551 -51718 -51969 -50716 -49796 -49560 -48723
55265 -48723 -47096 -46293 -47202 -48602 -49043 -48682 -48554 -49078 -49858 -50165 -49371 -47558 -45723 -44692 -44084 -43212 -42564
55248 -42564 -43267 -45394 -47953 -50319 -52516 -54364 -55563 -56390 -57065 -56626 -53838 -49177 -44692 -41841 -40532
55233 -40532 -40189 -40501 -41124 -41782 -42748 -44305 -45853 -46575 -46775 -47424 -48567 -49300 -49250 -48929 -48710 -48577 -48804 -49765
55215 -49765 -51097 -52148 -53205 -55136 -57795 -59822 -60115 -58690 -56255 -53864 -52763 -53420 -54724 -55098 -54379
55200 -54379 -53740 -54074 -55393 -57421 -59545 -60408 -58827 -55217 -51151 -47722 -45338 -44650 -46219 -49238 -51959
55185 -51959 -53593 -54758 -56084 -57511 -58988 -60652 -62126 -62657 -62094 -60933 -59463 -57727 -56101 -54864 -53435
55170 -53435 -51175 -48737 -47429 -47382 -47668 -48048 -49104 -50506 -50696 -48782 -45636 -42711 -40713 -39642 -39116 -38422
55154 -38422 -37233 -36420 -37226 -39497 -41787 -43259 -44284 -44995 -44612 -42786 -40589 -39421 -39511 -39976 -39840 -38831
55138 -38831 -37703 -37818 -39775 -42419 -43983 -44096 -43808 -43727 -43270 -41994 -40575 -39897 -39991 -40441 -41327 -43113 -45686
55121 -45686 -47856 -48094 -46085 -43504 -42523 -43276 -43711 -42519 -41182 -42025 -45133 -48468 -50415 -50725 -49538 -47236
55105 -47236 -45181 -44831 -45814 -46188 -44981 -43344 -42868 -43804 -45337 -46685 -47505 -47802 -47727 -47133 -45573 -43233 -41376
55088 -41376 -41146 -42386 -44321 -46630 -48846 -49707 -48684 -47440 -47953 -49638 -50270 -49506 -49278 -50563 -52018 -52497
55072 -52497 -52818 -53869 -54581 -53171 -49526 -45266 -42061 -40549 -40305 -40239 -39432 -37918 -36271 -34522 -32280 -29876
55056 -29876 -28362 -28080 -28101 -27453 -26268 -25409 -25387 -25722 -25129 -22688 -19150 -16369 -14902 -13264 -10611 -8776 -9852
55039 -9852 -12649 -13793 -12005 -9199 -7515 -7406 -8683 -11161 -13761 -14893 -14330 -13136 -11551 -8778 -5075
55024 -5075 -2006 -67 1870 4194 5647 5580 5033 4685 3793 2252 1563 2284 2397 162 -2845 -3473 -862 3062
55005 6147 7522 7144 5446 3315 1372 -651 -3144 -5600 -6960 -6680 -5133 -3381 -2651 -3362 -4508 -4772
54989 -4772 -4135 -3421 -2523 -683 1462 2001 510 -1108 -1231 -328 522 1208 1812 1958 1931 2705 3841 3303 805
54969 -599 1681 5929 8271 7707 6769 7645 9701 10765 9369 5734 1674 -554 -178 1546 3275 5147
54953 5147 7672 10132 11479 12041 12853 13805 13865 12862 11771 11431 12015 13519 15713 17736 18663 18510 18150
54936 18150 18332 19131 19960 19889 18548 16942 16475 16880 16293 13870 11049 9476 9007 8659 8097 7058 4749
54919 4749 1394 -710 602 4685 8849 11155 11408 10372 9395 9981 12390 15317 17959 21213 25536 29089
54903 29089 30004 29411 30084 32779 36053 39114 42477 46016 48656 50245 51838 53907 55995 58220 61323
54888 61323 64988 67997 70468 74286 80685 88876 97580 106607 116209 126177 136336 147082 158678 170542
54874 170542 181601 191023 198708 205667 213522 222579 230578 234477 233322 228270 220161 208716 194305
54861 194305 178873 164392 151457 139816 129265 119542 110298 101672 94200 87889 82253 77347 73841
54848 73841 71783 70347 69160 68891 70010 71824 73226 73830 74048 74832 77632 83707 92864 103482 114260
54833 114260 125446 137870 151297 164318 175706 185436 194291 202548 209033 211745 209565 203126 193865
54820 193865 182757 170346 157369 144555 132123 120094 108765 98342 88682 79969 72866 67167
54808 67167 61224 54007 46922 42096 39419 37009 34289 32649 32970 34306 35427 36073 36170 35208 33086 30475
54792 30475 27952 25767 24544 24816 25577 24836 22171 19348 17802 16867 15214 12705 9952 7366 5576
54777 5576 5517 6959 7942 6850 4237 1644 -416 -2122 -3004 -2529 -1493 -1267 -1811 -1709 -199 1933 3491
54760 3491 3883 2956 830 -1654 -2996 -2017 1271 5740 9808 12310 13230 13589 14339 15526 16839 18605
54744 18605 21524 25532 29582 32713 34923 36841 38905 41042 42958 44591 46367 49005 52966 58052
54730 58052 63665 69412 75365 81852 89211 97860 108399 121262 136090 151648 166840 181791 197389
54717 197389 213509 228380 240173 248685 254628 257777 257078 252686 246553 240283 233265 223940 212492
54704 212492 201307 192645 186599 181653 176716 172013 168112 164877 161818 159080 157331 156752 156916 157762 159843
54689 159843 163221 167055 170993 176170 183840 193735 205020 218373 235472 256340 278663 300124 320120
54676 320120 338646 354842 367665 377023 383089 385085 381933 373934 362686 349301 333558 315029
54664 315029 294233 272307 250213 228916 209885 194463 182487 172204 161961 151648 142130 133835
54652 133835 126606 120491 115567 110973 105360 98813 93312 90548 89946 89502 87840 84812 80924 77210 75046
54637 75046 74915 75654 75776 75199 74812 74908 75151 75575 76329 76777 76207 75296 75445 76694 77712 78064 78991 81484
54619 81484 84792 87396 88493 88097 86717 85440 85461 86951 89002 90944 92942 95175 97355 99464 102080
54604 102080 105611 109978 115214 121432 127983 133688 138195 142112 145594 148078 149779 151970 155018 157582
54590 157582 158803 160064 163209 167933 172417 175996 179728 184452 189623 194371 198804 203861 210287 218122
54576 218122 227136 237611 250352 265608 282266 298766 314703 330782 347303 363516 378277 390223
54564 390223 397383 398195 393381 385469 375946 364190 349728 333843 317947 301985 285847 270945 258581
54551 258581 247713 236064 222895 209188 195950 184107 175431 171315 170410 169325 166086 161449 156619
54538 156619 151331 144970 138257 132804 129525 128059 127165 125399 122072 118000 114739 112760 110934 107968
54524 107968 103666 98468 92614 86394 80675 76352 73386 70874 68074 65022 62132 59526 56934 54212
54510 54212 51758 50186 49627 49624 49820 50358 51313 52180 52455 52469 53069 54451 55750 55899 54609 52537 50705 49729
54492 49729 49406 49123 48748 48817 49720 51122 52671 54826 58306 62789 66794 68982 69163 68049 66545 65449
54476 65449 65418 66754 69214 72214 75381 78920 83297 88551 94233 100354 107937 117754 128670 138305 145710
54461 145710 152386 160058 168379 175730 181412 185773 188657 189165 187084 183371 178901 173651 167517 161054
54447 161054 154826 148571 141703 134425 127838 122796 118837 114344 107938 99868 91880 85588 81118 77572
54433 77572 74444 72031 70651 70076 69833 69557 68981 67992 66873 66132 65930 66008 66224 66906 68499 71090 74347
54416 74347 77667 80374 82148 83401 84886 86694 87874 87379 85343 83183 82346 83085 84453 85451 86017 86870
54400 86870 88467 90380 91836 92675 93485 94772 96293 97373 97726 97637 97468 97393 97665 98526 99444 99008 96428
54383 96428 92832 90058 88181 85495 81349 77521 75845 75615 74714 72494 70000 67946 66203 65094 65351
54368 65351 66504 66969 66183 65263 65106 65322 65559 66323 67706 68782 69299 70485 72899 74721 73841 70870 68526
54351 68526 68483 70222 72505 74528 75786 76270 77027 79415 83555 88287 92804 97620 103769 111517 119929
54336 119929 127439 133007 136986 140513 143891 146296 147449 148554 150691 153029 153776 152375 149735 146760
54322 146760 143848 141455 139855 138310 135524 131051 125599 120121 115486 112763 112672 114553 116604 117263 116021
54307 116021 113331 110453 108882 108947 109197 108070 105890 104358 104525 106173 108506 110165 109195 104779 98918
54292 98918 94801 93466 93560 94155 95800 98483 100719 101673 102565 104834 108176 111449 114321 116902 118859 120157
54276 120157 121870 124937 128578 131037 131493 130294 127959 125146 123208 123274 124565 124716 122222 117927 113825
54261 113825 111072 109638 109271 109898 110908 110791 108151 103065 96939 90996 85485 80491 76552 73716 70770
54246 70770 66608 62025 58856 57326 55590 52244 48124 45049 43754 43718 44166 44449 43966 42558 40701 38864
54230 38864 37000 35021 33340 32540 32868 34406 37204 40792 44047 46100 47061 47404 47025 45551 43326 41432
54214 41432 40615 40501 40028 38620 36964 36512 38019 40654 42873 43980 44376 44509 44303 43654 42841 42288 42505
54197 42505 44196 47618 51737 54945 56788 58125 59391 59865 59107 57903 56975 55874 54215 53066 53757
54182 53757 55759 57040 56372 54228 51529 48673 45961 44042 43441 44097 45501 46987 47957 48274 48364 48526
54166 48526 48388 47575 46591 46287 46563 46537 46091 46298 47892 50091 51582 52076 52246 52454 52406 52053 52119 53335 55481
54147 55481 57508 58472 58153 56959 55559 54580 54249 54201 53879 53248 52822 52808 52611 51576 49943 48446 47054
54130 47054 44836 41368 37741 35654 35637 36684 37679 38737 40732 43672 46146 46709 45403 43364 41234
54115 41234 38871 36617 35656 36441 37599 37352 35544 33522 32507 32962 35039 38423 41789 43492 42979 40850
54099 40850 37698 33843 30028 27239 25601 24416 23450 23239 23960 24949 25605 25875 25712 25076 24630 25219 26326
54082 26326 26274 24493 22384 21285 20858 20341 20136 20852 21620 20783 17941 14391 11807 11297 13154 16524 19599
54065 19599 21057 21213 21159 21142 20498 18784 16204 13226 10522 8994 9047 9975 10759 11326 12441 14534 17172
54048 17172 19535 20932 21114 20569 20210 20413 20650 20396 19761 18874 17433 15615 14695 15791 18489 21485 24024
54031 24024 25858 26568 26199 26078 27606 30394 32823 34257 35419 36720 37730 38544 40210 43116 46055
54016 46055 47616 47696 47088 46364 45885 46310 48173 50966 53141 53264 51300 48955 48474 50593 53684 55415
54000 55415 55188 54400 54429 55251 56190 57163 58564 60393 62214 63919 65971 68635 71274 72948 74022 76532
53984 76532 82007 89122 94813 98140 101621 107792 115794 122936 128552 134271 140919 147461 153333 159725
53970 159725 167686 176486 184850 192536 199810 206508 212699 219355 227238 235818 244184 252315 260443 267829
53956 267829 273296 276638 278498 279205 278683 277172 275075 272246 268378 263916 259718 255974 252431 249470 247688
53941 247688 246264 243054 236891 228899 220908 213432 205956 198486 191891 187058 184457 184047 184643 183792 179650
53926 179650 173162 167286 163783 161879 160464 159959 160794 161305 159240 155008 151502 150498 151046 151856 153211
53911 153211 155289 156438 155111 152530 151324 151929 152290 151142 149551 148793 148524 147955 147307 146894 145870 143231
53895 143231 139558 136583 135214 134890 134730 134578 134928 136402 139311 143420 148182 153363 159043 164880 170084
53880 170084 174601 179564 185733 192034 196764 200006 203708 209406 216972 225798 235947 247319 258566
53867 258566 267810 274129 277657 278660 277477 275340 274292 275812 279892 285624 292187 298980 305329 310719
53853 310719 315323 319967 325617 333078 342834 354541 366644 377170 385322 392124 399284 407522 416060
53840 416060 423364 428167 430121 429925 428836 427744 426613 424733 421420 416575 410943 405919 402551 400311
53826 400311 397072 390738 380828 368521 355631 343842 334167 326230 318286 308771 297933 287396 278238
53813 278238 270200 262739 255824 249317 242386 234275 225297 216476 208417 201004 194062 187821 182628 178542
53799 178542 175328 172816 171018 169796 168345 165400 160419 154505 149549 146191 143028 138271 132022 126441
53785 126441 123572 123271 123493 122583 121004 120546 121955 123895 124532 123637 122570 122470 123237 124257 125239 125950 125806
53768 125806 124332 121809 119035 116692 115231 115066 116337 118560 120917 122945 124720 126474 128390 130669
53754 130669 133391 136161 138276 139477 140336 141661 143724 146330 149373 152846 156387 159591 163115 168723
53740 168723 177367 187486 196112 201766 205506 209191 213744 219437 226578 234932 243275 250566 257042 263110
53726 263110 267827 269994 270588 272424 276850 282058 285437 286643 287504 289530 292328 294206 293709 290809 287039
53711 287039 284238 282780 281306 278437 274323 270159 266661 263606 260546 257414 254467 251933 249610 246686
53697 246686 242467 237520 233497 231184 229198 225522 220074 214873 211493 209251 206271 201737 196522 192009
53683 192009 188889 187048 186006 185195 184115 182624 181002 179472 177728 175333 172657 170897 170718 171289 171337
53668 171337 170939 171493 173770 176797 179062 180192 180910 181741 182467 182752 182769 183096 184183 185933 187776 189261
53652 189261 190644 192612 195439 198846 202797 207771 213762 219583 223982 227254 230885 235507 240066 243452
53638 243452 246383 250829 257530 264751 270024 272889 275308 279255 284575 289771 294268 298789 303535 307338
53624 307338 309339 310623 313202 317769 323241 328219 331979 334248 334990 334649 333969 333337 332805 332706 333498 334905
53608 334905 336024 336663 337764 339909 342018 342278 340118 336589 333102 330465 328925 328322 328065 327626 327211 327407
53592 327407 328102 328454 328067 327401 326671 325350 323479 322524 323705 325925 326781 325600 324164 324164 325286 326360 327125
53575 327125 327938 328672 329062 329523 330617 332254 334479 338464 345312 353958 361644 366633 369471 371590 374021
53560 374021 377710 383537 391128 398622 404536 409184 413673 418352 423171 428681 435453 442891 449874 456460
53546 456460 463886 472721 481968 490382 497971 505798 514690 524485 534346 543548 552072 560504 569322 578303
53532 578303 586753 594196 600653 606398 611708 616778 621683 626424 631089 635795 640305 644032 646727 648975
53518 648975 651623 654773 657707 659716 660697 660939 660735 660324 660038 660251 661169 662591 663927 664699 665040 665500 666221
53501 666221 666682 666445 665759 665089 664412 663580 663048 663575 665115 666684 667512 667849 668365 669212 670095 670988 672278 674209
53483 674209 676662 679654 683758 689634 697131 705071 712173 718197 724121 731226 740049 750143 760704 771402
53469 771402 782633 795031 808780 823545 838984 855021 871520 888144 904914 922579 941990
53458 941990 963301 986275 1011137 1038397 1067829 1098280 1128724 1159127 1190266 1223141 1258483
53447 1258483 1296192 1335184 1374361 1413758 1454128 1495595 1537698 1580733 1625764 1672990 1721402
53436 1721402 1770593 1821506 1874362 1927241 1978177 2027655 2077377 2127280 2175768 2222646 2269677
53425 2269677 2317750 2365274 2410318 2453204 2496109 2540917 2588118 2636859 2685141 2730528 2771652
53414 2771652 2809020 2844063 2877831 2910937 2943977 2977045 3008984 3037834 3062149 3081686 3097141
53403 3097141 3109687 3120463 3129799 3136799 3140106 3139255 3135043 3128471 3119486 3106876 3089432 3067312 3042243
53390 3042243 3016276 2990244 2963457 2934775 2903627 2870027 2834032 2795594 2754866 2712504 2669620
53379 2669620 2627212 2585307 2542843 2499036 2454933 2412906 2374217 2337735 2301683 2266122 2232930
53368 2232930 2203635 2178209 2155969 2136610 2119982 2105604 2093092 2082792 2075522 2071836 2071726 2074682
53356 2074682 2079701 2085714 2092670 2102129 2116217 2135854 2160222 2187785 2217387 2248632 2281965 2318481
53344 2318481 2359021 2403148 2449558 2497787 2548911 2604187 2663633 2726480 2792447 2861713 2934045
53333 2934045 3008917 3086469 3167504 3252396 3340690 3431828 3525462 3620896 3717182 3814333 3913796
53322 3913796 4016892 4123075 4230320 4337000 4442689 4547138 4649219 4747498 4841773 4933560
53312 4933560 5024570 5114559 5200829 5279981 5350002 5410778 5463297 5508896 5548737 5582983 5610466
53301 5610466 5629834 5641041 5645008 5641858 5630371 5609409 5579088 5540313 5494009 5441180 5382834 5319166
53289 5319166 5249330 5172514 5088856 4999201 4904724 4807121 4708271 4609142 4509747 4410550 4312839
53278 4312839 4217046 4121930 4026481 3931685 3839020 3748045 3657111 3566152 3477118 3391600 3309359
53267 3309359 3229414 3151505 3076248 3004730 2938011 2876137 2817659 2761168 2707290 2658047 2614155
53256 2614155 2574216 2536804 2501990 2470151 2440501 2411886 2384389 2359297 2337832 2320437 2306805
53245 2306805 2296019 2287001 2279459 2274100 2271611 2271869 2274665 2280680 2290894 2305024 2321193 2337439 2353419
53232 2353419 2370527 2390489 2413949 2440500 2469940 2502891 2539733 2579268 2619299 2658725 2698550
53221 2698550 2740576 2785514 2832468 2879786 2926092 2970797 3013973 3055641 3095174 3131593 3164419
53210 3164419 3193927 3220518 3244134 3264320 3280678 3293227 3302401 3308542 3311338 3310168 3305173 3297358
53198 3297358 3287204 3273932 3256854 3236565 3213630 3186695 3153589 3114286 3071265 3026749 2981047
53187 2981047 2933984 2886243 2838246 2788905 2736705 2681559 2624827 2568082 2512455 2458510 2405908
53176 2405908 2353606 2300978 2248426 2196668 2146203 2097783 2052341 2009605 1967580 1924412 1880241
53165 1880241 1836559 1794521 1754784 1718188 1685177 1654829 1625500 1596376 1567652 1539633 1512578
53154 1512578 1486940 1462539 1437829 1411327 1383729 1357298 1333073 1309940 1286728 1263787 1241864
53143 1241864 1220585 1199016 1176949 1154744 1132436 1109899 1087624 1066423 1046367 1026676 1006797
53132 1006797 987112 968298 950212 931765 912041 891413 871229 852201 833532 814081 794147
53121 794147 775337 758632 743363 728461 713943 700466 687904 675280 662057 648718 635920
53110 635920 623770 612324 602004 592831 583598 572810 560522 548434 537770 527813 517135 505774
53098 505774 495310 486913 480133 473689 466752 459247 451570 444322 437924 432297 427334 423610 421708 420594
53084 420594 417843 412360 406019 401380 398296 394137 387289 379013 371576 365869 361603 358679 357159 356395
53070 356395 355444 354336 354037 354912 355870 355317 352576 348198 343324 339008 335770 333342 330936 328013 324713
53055 324713 321506 318699 316514 315222 314698 314031 312050 308291 303090 296974 290548 284835 280811 278389 276590
53040 276590 275031 274390 274924 275447 274614 272549 270201 267716 264668 261556 259570 258647 257069 253613 249261
53025 249261 246213 245800 247771 251024 254482 257640 260574 263171 264504 263789 261999 261429 263090 265574 267244
53010 267244 268483 270655 273633 275995 277457 279474 282875 286186 287277 286007 284197 283160 282239 280013
52996 280013 276202 271736 267296 262585 257107 250948 244427 237657 231088 226044 223696 223468 223096 220548 215526
52981 215526 209282 203603 199881 198324 197672 196217 193391 189990 186955 184574 182916 182127 181906 181362 179802
52966 179802 177202 173871 170340 167680 166882 167474 167645 166302 164167 162305 160522 158035 154904 151849 149245
52951 149245 147292 146584 147399 148679 148783 147280 145298 144208 144576 146177 148240 149722 150081 149914 150414 152172
52935 152172 154743 157121 158376 158190 157234 156637 156672 156356 154856 152791 151560 151785 153009 154588 156148 157462
52919 157462 158510 159485 160290 160329 159274 157716 156587 156303 156800 157818 158738 158932 158863 160095 163408 167625 171048
52902 171048 173164 174073 173292 170644 167621 166358 167464 169980 172935 175682 177364 177729 178129 180084 183069
52887 183069 185396 187021 189542 193328 196775 198956 201160 204871 209625 213866 216864 219013 221085 223755
52873 223755 226998 229719 230986 231844 234526 239558 245090 249703 254186 259591 265125 269424 272776 276544
52859 276544 281005 285169 288274 290268 291120 290821 289933 289099 288021 285762 282236 278816 277153 277454 277970 276473
52843 276473 272615 268622 266981 267578 268013 266578 263692 260298 256460 252288 248881 247188 246753 246567 246476 246939
52827 246939 248060 249645 251540 253150 253395 251961 249888 248131 246454 244560 243339 243691 244872 245334 244707
52812 244707 243844 243448 243825 245308 247488 248530 246929 243785 241774 241844 242403 241934 240890 240524 241172 242385
52796 242385 243790 245052 245613 245084 243593 241457 238883 236058 233171 230338 227983 227084 228377 231390 234876
52781 234876 238059 240799 242886 244214 245583 248075 251359 253587 253338 250901 247428 243828 240879 239407
52767 239407 239639 240918 242576 244488 246340 247149 246235 244190 242164 240566 239148 237981 237496 237595 237514 236971
52751 236971 236918 238555 241473 243406 242515 239954 239239 242457 247725 251320 251882 251377 252090 254096 256042 256991
52735 256991 256667 254977 252435 250369 249484 248464 245155 239124 232183 226213 221316 216404 210969 205686 201529
52720 201529 198722 196571 194140 191011 187492 184153 181289 178730 176046 172886 169251 165511 161998 158662
52706 158662 155327 152163 149537 147355 145049 142336 139574 137139 134900 132575 130162 127556 124198 119730
52692 119730 114846 110951 108922 108520 108822 108818 107713 105358 102564 100626 100183 100707 101110 100623 99061 96572
52676 96572 93423 89963 86646 83966 82191 81006 79618 77442 74644 71850 69572 68159 67947 68898 70269
52661 70269 71422 72928 75964 80299 83820 84732 83608 82431 82108 81917 81123 79977 78908 77787 76547
52646 76547 75782 76017 76794 77055 76270 74843 73609 73246 73840 74593 74297 72594 70583 69673 69991 70458 70302 69849
52628 69849 69806 70362 71214 71954 72202 71789 71189 71429 73109 75532 77094 76656 74572 72467 71966 73557 76615
52611 76615 80459 85024 90343 95763 100231 103186 104668 104799 103909 103069 103622 105798 108485 110707 112684
52596 112684 115001 117448 119391 120777 122027 123224 124148 124963 126199 128156 130829 134200 137853 140440 140498
52581 140498 138042 134554 131087 127201 122348 117499 114376 113293 112736 111224 108836 106679 105612 105922 107514
52566 107514 109616 110645 109305 105835 101531 97167 92845 89482 89062 92462 97795 101978 103516 102886 100856
52551 100856 97953 95457 95286 98082 102288 105641 106947 106152 103745 100734 98392 97131 96132 94688 93397
52536 93397 93315 94534 96437 98853 101971 105362 107990 109318 109684 109626 109381 109066 108787 108530 108296 108264 108563 109213
52518 109213 110575 113321 117255 120678 121925 121421 121384 123510 127620 132322 136128 138023 138092 137783 138580 140202
52502 140202 141056 140656 140436 141574 143228 143950 144045 145238 148270 151944 154676 156135 157112 158304 159585 160209
52486 160209 159622 158212 157190 157547 159162 161225 163341 165788 168631 171245 173146 175004 178168 182920 187603
52471 187603 189959 189423 187799 187544 189481 192276 193890 193349 191305 189282 188441 188877 189908 190925 191789 192543
52455 192543 193084 193300 193158 192414 190668 188175 186288 186466 188769 191696 193571 193830 193078 192297 192032 192097 192070
52438 192070 192048 192408 192583 190931 186828 182377 180636 182056 183985 184041 182679 181673 181442 181218 181052 181938 183974
52421 183974 185853 186643 187022 188167 190178 192277 193991 195340 196069 195594 193941 192316 192283 194432 197910 201186
52405 201186 203250 204241 205018 206104 207098 207283 206704 206166 206015 205446 203647 201355 200458 201914 204752 207425
52389 207425 209526 211608 213838 215563 216091 215361 213887 212526 212160 213067 214572 215725 216227 216302 215855 214502
52373 214502 212554 211250 211611 213450 215683 217247 217489 216191 213655 210488 207025 203272 199672 197420 197379
52358 197379 198919 200448 201086 201201 201284 200983 199765 198166 197743 199685 203740 208497 212468 214854 215677 215505
52342 215505 214920 214006 212387 209937 207356 205758 205768 207258 209856 213248 216894 219865 221352 221282 220458 220139
52326 220139 221307 223983 227270 230300 232941 235216 236549 236517 236131 237147 239890 242926 245304 247792 251109
52311 251109 254294 256163 257444 259904 263859 268029 271555 274621 277157 278498 278679 278850 279944 281829 284060
52296 284060 286551 289327 292584 297169 303914 312130 319811 325808 330830 335907 340992 345778 350812 356750
52282 356750 363074 368533 372594 375867 379257 383132 387048 390071 391725 392758 394519 397599 401761 407046
52268 407046 413779 421311 428153 433960 440129 447734 456162 464703 473939 484156 493742 501192 507959 517186
52254 517186 529871 544259 559001 574767 592202 610270 627799 645377 664546 685918 709003
52243 709003 733131 757564 781315 803953 826317 849585 873766 897830 921172 944217 967611
52232 967611 991498 1015699 1040017 1064152 1087692 1110464 1132540 1153746 1173442 1191122 1206996
52221 1206996 1221756 1235967 1249952 1264041 1278382 1292463 1305271 1316112 1324880 1331439 1335345 1336667
52209 1336667 1336569 1336335 1336011 1334785 1332710 1331301 1332104 1335120 1338794 1341235 1341489 1340245 1339520 1341181 1345570 1351893
52193 1351893 1359860 1370177 1383205 1397902 1412576 1426293 1439250 1452388 1466994 1484071 1503472
52182 1503472 1523895 1544027 1563436 1582297 1600876 1619366 1637446 1653835 1667327 1678606 1689794
52171 1689794 1701516 1711877 1719462 1725861 1733294 1740708 1744639 1743900 1741117 1739021 1737124 1733113 1726082 1717137
52157 1717137 1707722 1698651 1690296 1682545 1674509 1665052 1653824 1641436 1628727 1616137 1603867 1592433
52145 1592433 1582839 1575869 1571009 1566466 1560847 1554608 1549271 1545436 1542428 1539787 1537926 1536980 1536198 1535216 1535024
52130 1535024 1536663 1539547 1542122 1543796 1545047 1545761 1544756 1541565 1537814 1535903 1536487 1537862 1537884 1536101 1533892
52115 1533892 1532779 1532790 1532378 1529811 1524694 1518262 1512189 1507132 1502402 1496923 1490291 1482886 1475360 1468281 1461847
52100 1461847 1455544 1448366 1440018 1431696 1424931 1419718 1414692 1409081 1403342 1397564 1390767 1382814 1375772 1371800
52086 1371800 1370232 1368277 1364371 1359386 1354600 1350020 1345120 1339910 1334757 1330027 1326227 1323439 1320303 1314932
52072 1314932 1307657 1301607 1299329 1299590 1298821 1295302 1290737 1287894 1287825 1289449 1290821 1290545 1288698 1286867 1286879 1289301
52056 1289301 1293337 1298088 1303470 1309940 1317964 1327877 1339806 1353454 1368287 1384088 1400989 1418788
52044 1418788 1436709 1454292 1472391 1492850 1517085 1544938 1574802 1604664 1633335 1661079 1689125
52033 1689125 1718258 1747798 1776225 1802905 1828805 1855133 1881510 1906089 1927423 1945639 1961526
52022 1961526 1975134 1985870 1993663 1999275 2003355 2005815 2006414 2005532 2003802 2001093 1996370 1988882 1979295 1969269
52008 1969269 1959790 1950397 1940351 1930166 1921156 1913544 1905984 1897568 1889523 1884139 1882376 1883330 1885786 1889352
51994 1889352 1893961 1899181 1904385 1909205 1913592 1917910 1923080 1930038 1938778 1948375 1958156 1968192 1978264
51981 1978264 1987025 1993066 1996656 1999668 2003615 2008283 2012379 2014854 2015062 2012109 2005080 1994385 1982250 1971060
51967 1971060 1961191 1951034 1939158 1925671 1911144 1895099 1876553 1855717 1834130 1812872 1791328
51956 1791328 1768120 1742879 1716849 1691813 1668515 1645979 1622456 1597190 1571051 1545250 1519742
51945 1519742 1493465 1465933 1437969 1410837 1385090 1360243 1335017 1307904 1278142 1246462 1214519
51934 1214519 1183478 1153328 1123420 1093180 1062407 1031544 1001706 973779 947327 920955 893928
51923 893928 866873 840759 815805 791728 768485 746312 725330 705427 686317 667586 648997
51912 648997 630844 613604 597207 581133 565371 550761 538158 527597 518338 509337 499701 489340
51900 489340 479292 470806 463941 457638 451212 445073 439781 435209 430966 426981 423265 419625 415903 412036
51886 412036 407832 403413 399788 397819 396378 392889 386361 378749 372438 367537 362690 357522 352799 348792
51872 348792 344917 340835 336712 332494 327953 323441 319726 317061 315106 313632 312575 311484 309667 306941
51858 306941 303878 301496 300874 302331 304416 304598 301985 298653 297101 297000 295783 292054 286830 281572 276624
51843 276624 271870 267554 263975 261406 260570 262063 265000 267330 267874 267108 265683 263428 260342 257386 255472
51828 255472 254400 253433 252193 250542 248457 246518 245651 245771 245578 244466 243676 244695 247257 249899 251839
51813 251839 253305 254509 255434 256333 257361 257869 257082 255453 254351 254273 254293 253660 253242 254741 258739 263946 268430
51796 268430 271303 273092 274583 275787 276364 276656 277510 279087 280642 281697 282663 283969 285400 286815 288670
51781 288670 291103 293187 293943 293604 293051 292590 292209 292484 294031 296282 298066 299400 301492 304775 308073 310168
51765 310168 311365 313030 316191 320911 326350 331009 333523 333727 332669 331386 330125 328824 327627 326555
51751 326555 325311 323855 322600 321612 320189 317928 315753 315159 316672 319680 323570 328187 332996 336570 337493
51736 337493 335775 333077 331446 331760 333389 335149 336369 336977 337126 337277 338442 341510 346103 350754 354513
51721 354513 357793 361273 364608 366854 367791 368124 368572 369376 370603 372329 374427 376642 378950 381541 384403
51706 384403 387171 389486 391404 393460 396322 400072 403813 406436 408068 410252 414328 420065 426333 432549
51692 432549 438790 445047 451367 458497 467221 476939 485823 492688 497917 502327 505843 507769 507781 506247 503883
51677 503883 501294 498556 495308 491722 489070 488447 488947 488268 485378 481477 478030 475110 472315 469860 467575
51662 467575 464070 458536 452701 449285 448720 448947 448412 447658 447597 447609 446240 442996 438789 435078 432857 431965
51646 431965 431159 429444 427500 427090 428802 431082 431864 430512 427801 424796 422415 421491 422422 424825 428039
51631 428039 431679 435278 437721 437826 435682 433085 432424 435041 440432 446907 453238 459772 467724 477235 486516
51616 486516 493236 496599 497722 498066 497789 495778 491201 484828 478545 473517 469239 464696 459946 455822 452284
51601 452284 447979 441607 433058 423167 413103 404172 397242 391845 386498 380403 374242 368942 364489 360528
51587 360528 357357 355400 354219 352921 351185 349140 346673 343801 341368 340291 340193 339772 338543 337268 336582
51572 336582 336184 335687 335346 335430 335537 335061 333872 332151 330034 327751 325617 323482 320760 317554 315283 315355
51556 315355 317348 319259 319710 319325 319655 321252 323200 324309 324264 323600 323063 323238 324479 326726 329424 332020
51540 332020 334663 338154 343136 349565 356956 364680 371884 377684 381992 385804 390081 394464 397683 399234
51526 399234 400112 401721 404555 408164 411975 415635 418723 420685 421212 420506 418911 416376 412594 407782 403070
51511 403070 399699 397851 396582 394969 393087 391836 392149 394422 398269 402598 406332 409267 411923 414473
51497 414473 416463 417909 419828 422944 426473 429252 431705 435477 440951 446325 449656 451022 451964 453426
51483 453426 455048 456194 456748 456642 455342 452493 449040 447077 448049 451167 454120 455519 456221 457968 461159
51468 461159 464540 466846 468129 469434 471671 474923 478447 481199 482598 482943 482949 482936 482568 481173 478134 473331
51452 473331 467718 463133 460819 460141 459338 457498 455083 452570 449475 445154 439894 434739 430662 428155 427161
51437 427161 426980 426780 426561 427161 428849 430550 431162 431216 432240 434607 436987 438149 438488 439317 441264 444006
51421 444006 447232 451138 455901 461204 466481 471322 475456 478686 481209 483809 487278 491584 495945 499860
51407 499860 503747 508331 513633 518854 523307 527154 531093 535263 538551 539224 536548 531757 527114 523988
51393 523988 522175 520955 520134 519805 519770 519746 519669 519321 518145 516133 514422 514103 514598 514235 512432 510313 508898
51376 508898 507645 505423 502198 498987 496386 493793 490016 484167 476115 466596 457014 448755 442406 437641
51362 437641 433873 430904 428851 427560 426441 425103 423936 423667 424387 425505 426726 428369 430302 431238 429958
51347 429958 426962 424171 423052 423670 425460 427986 430718 432842 433801 433642 432560 430457 427237 423181 418701
51332 418701 413877 408422 401993 394476 386134 377495 368902 360266 351523 343063 335217 327541 319309 310847
51318 310847 303625 298642 295213 291750 287439 282818 278863 275943 273621 271334 269020 266862 264457 260797
51304 260797 255579 250101 246252 244730 244728 245111 245181 244555 243180 241501 239874 237806 234551 230401 226583 223881
51288 223881 222216 221485 221579 221536 220132 217798 216596 217593 219547 221125 223066 226784 231830 236402 239892 243363
51272 243363 247558 251861 255348 257744 258960 258666 256852 254372 252598 252649 254799 258294 262002 265631 269987
51257 269987 275468 280808 284262 285815 287110 288960 289990 288320 283865 278284 272983 267887 262138 255485
51243 255485 248589 242135 236089 230112 224432 219708 215964 212408 208682 205618 204102 203606 202708 200791 198376
51228 198376 195885 193062 189839 186927 185009 183897 182955 181946 181033 180238 179359 178261 176852 174947 172643
51213 172643 170799 170536 171950 173712 174452 174400 175126 177550 180687 182670 182659 181346 179925 179154 179273 180111 181003
51196 181003 181028 179704 177336 174734 172714 171718 171507 171301 170629 169959 170086 170995 171866 172074 171628 170821 170268 171098
51178 171098 173983 177692 179704 178850 176528 174881 174559 174887 175308 175750 176146 176525 177402 179352 182216 185115
51162 185115 187116 187854 187918 188663 190964 194042 196323 197588 199099 201242 202453 201404 199058 197304 196467
51147 196467 195552 194261 193278 192850 192486 192071 192226 193501 195844 198698 200989 201523 200226 198567 197940 198185
51131 198185 198541 199216 200758 202457 202953 202222 201611 201990 202994 203933 204297 203642 202187 201217 201629 202375 201695
51114 201695 199468 196846 194110 190925 188360 188198 189925 190851 189983 189441 190979 193180 193639 192017 189271
51099 189271 185430 180284 175241 172367 171849 171949 171274 169751 167661 165154 162770 161334 161075 161500 162135 162814
51083 162814 163428 163917 164240 164010 162732 161065 161186 164793 170970 176895 180551 181999 182248 181877 180993 179815
51067 179815 178823 178444 178675 179016 179013 178897 179250 179913 179844 178437 176397 174884 174353 174674 175690 176969 177576 176906
51049 176906 175266 172986 169591 164947 160729 159298 160919 163252 164013 163327 162973 163923 165379 166059 165849 165901
51033 165901 167272 169831 172666 175265 177721 179989 181810 183658 186855 192023 197900 202331 204182 203853
51019 203853 202455 201145 200816 201599 202799 203881 205255 207493 210235 212710 214990 217701 220575 222491 223211
51004 223211 224037 226190 229265 231979 233879 235625 237772 239974 241412 241536 240187 237433 233780 230477 229040
50989 229040 230008 232340 234399 235465 235923 236231 236374 236351 236352 236137 235000 232946 231346 231668 233729 235803 236302
50972 236302 234962 232509 229764 227173 224994 223744 224196 226629 230257 234033 237902 242427 247209 250890
50958 250890 253218 255786 259755 263959 266506 267463 268457 270186 271967 273576 275805 278912 282030 284654 287459
50943 287459 290997 294708 298186 302552 309472 319055 329532 338893 346351 352478 358582 365967 375197 385727
50929 385727 396333 406097 415168 424724 436186 450179 466143 482994 500143 517866 536801 557283
50917 557283 579088 601699 624931 649331 675726 704328 734807 767518 803983 845498 891640
50906 891640 940921 992728 1047800 1106870 1169694 1235627 1304383 1375897 1449947 1526263 1604675
50895 1604675 1684916 1766567 1849232 1932267 2014038 2091818 2162899 2225914 2281117 2329573 2372099
50884 2372099 2408794 2439471 2464456 2484700 2501076 2514005 2524078 2532465 2540042 2546384 2550479 2552400
50872 2552400 2553518 2554818 2555574 2553864 2547923 2536726 2519706 2496326 2465930 2427966 2382382 2329643
50860 2329643 2270260 2204713 2134056 2059964 1983513 1904459 1822647 1739842 1659087 1582278 1509379
50849 1509379 1439971 1374302 1312492 1254093 1199300 1149679 1106682 1069986 1038118 1010253 986486
50838 986486 966499 948903 932006 914891 897852 882290 870018 861934 857112 853584 850237 847740
50826 847740 847402 849345 852113 854137 855312 856956 860391 865934 873161 881501 890284 898927 907763 918315
50812 918315 931921 948143 965282 982367 999916 1018764 1039214 1061668 1087208 1116701 1149726
50801 1149726 1184989 1221692 1260248 1301922 1348149 1399906 1457275 1519565 1586149 1657407 1734920
50790 1734920 1820569 1915087 2017472 2126338 2242104 2367166 2503315 2649616 2803657 2964227
50780 2964227 3131511 3304971 3482565 3662158 3842312 4021191 4195866 4363093 4519707
50771 4519707 4662051 4786617 4892157 4980077 5052011 5108261 5149454 5178241 5197821 5209779 5215011
50760 5215011 5216130 5217137 5220753 5227384 5236556 5247974 5260886 5273326 5282159 5283306 5272211 5245188 5200410
50747 5200410 5137150 5054680 4952835 4833025 4697227 4546327 4381059 4204530 4022076 3838161
50737 3838161 3654892 3474032 3298801 3132670 2977570 2834308 2703750 2586538 2482381
50728 2482381 2390781 2311858 2245428 2189762 2142386 2101996 2068701 2042581 2022909 2008726 1999208
50717 1999208 1993197 1988978 1984867 1979761 1973071 1964473 1953918 1941638 1928023 1913378 1897624 1880245
50705 1880245 1860832 1839756 1817816 1795129 1771008 1745342 1719433 1694794 1671598 1649078 1627083
50694 1627083 1606467 1588235 1573119 1561804 1554630 1551162 1550938 1554605 1563334 1577088 1594509 1614668
50682 1614668 1637780 1663916 1692363 1723043 1757325 1796319 1839334 1885347 1935360 1991763 2055622
50671 2055622 2125991 2201793 2282932 2369458 2461108 2558136 2661147 2769285 2879653 2989413
50661 2989413 3097450 3202992 3303560 3395856 3478356 3551615 3615866 3669455 3710001 3736276 3748620
50650 3748620 3748234 3736570 3715116 3685562 3650463 3613633 3579142 3549421 3524538 3503444 3485615 3471522
50638 3471522 3462008 3457445 3456920 3457825 3456454 3449348 3434082 3408983 3372752 3324653 3264648 3193144 3111078
50625 3111078 3020586 2925003 2827637 2730803 2636439 2547059 2465135 2391555 2325504 2266258 2214652
50614 2214652 2172480 2140873 2119727 2108564 2107404 2116492 2135456 2163212 2198777 2241700 2291426 2346578
50602 2346578 2405395 2466618 2529295 2591828 2652102 2708826 2761951 2811404 2856265 2895937 2931520
50591 2931520 2965107 2998041 3030499 3062431 3093968 3125187 3156496 3189249 3224979 3263877 3304920
50580 3304920 3347729 3393360 3442926 3496388 3553129 3612746 3674596 3737535 3801060 3865851 3931922
50569 3931922 3996823 4057071 4111170 4159714 4202536 4237546 4263122 4280183 4290587 4294424 4290340 4278112
50557 4278112 4259586 4237127 4212433 4187126 4163419 4143574 4129220 4121438 4120756 4126469 4136480 4148536
50545 4148536 4161496 4175087 4188586 4200081 4206782 4205712 4194360 4171143 4135424 4087115 4026458 3954001
50533 3954001 3870244 3775221 3669283 3554737 3435911 3316697 3198360 3080365 2962859 2847494
50523 2847494 2736331 2631070 2533098 2442963 2359647 2281608 2208897 2143172 2085356 2034480 1989426
50512 1989426 1950448 1917992 1891088 1868287 1849571 1835918 1827365 1822852 1822029 1825901 1835355 1850086
50500 1850086 1869345 1892928 1920867 1952844 1988528 2028071 2071766 2119454 2170740 2225688 2284991
50489 2284991 2349449 2419254 2493656 2571370 2651645 2734887 2821861 2912231 3004282 3096142 3186749
50478 3186749 3275586 3362305 3447321 3532350 3619556 3710106 3803876 3900558 4000634 4105301 4215809
50467 4215809 4332886 4456601 4586755 4723527 4867506 5018738 5175945 5337165 5501193
50458 5501193 5667898 5836971 6006829 6174877 6338271 6494002 6638638 6768714 6881356
50449 6881356 6974162 7044519 7089684 7107940 7099529 7066218 7009912 6931757 6832631 6714427 6580766
50438 6580766 6436376 6286102 6134872 5988305 5852114 5730129 5623457 5532541 5459629 5407959
50428 5407959 5378275 5367168 5369284 5380294 5397135 5416171 5432115 5438640 5429582 5399980 5346741 5268536
50416 5268536 5165150 5037495 4888472 4722975 4546266 4362633 4175820 3989709 3807498
50407 3807498 3630795 3460469 3297813 3143842 2998256 2860751 2732995 2617570 2514825
50398 2514825 2422475 2338556 2263144 2196695 2138463 2087530 2043874 2007300 1976570 1950842 1930921
50387 1930921 1917791 1910779 1908489 1910663 1917674 1928901 1943239 1960778 1982232 2006861 2032640 2058698
50375 2058698 2086099 2115938 2148152 2182737 2220646 2262465 2307005 2352107 2396336 2439359 2481424
50364 2481424 2523335 2566517 2612135 2659953 2708376 2755644 2801011 2845273 2890581 2939304 2992359
50353 2992359 3048537 3105887 3163982 3224723 3290852 3363752 3442697 3525916 3611913 3699569 3787498
50342 3787498 3874178 3958938 4042078 4123427 4201113 4272212 4334295 4385905 4425959 4453538 4468167
50331 4468167 4469540 4456792 4428535 4383774 4322447 4245176 4153138 4048381 3933947 3813421 3690320
50320 3690320 3567617 3447504 3331892 3223449 3125662 3041149 2970205 2911674 2864957 2830305
50310 2830305 2807429 2794945 2791163 2794120 2800550 2806034 2806973 2801712 2789355 2768519 2737984 2697817 2648941
50297 2648941 2592188 2528485 2459454 2386952 2312390 2237219 2163467 2092799 2025284 1960133 1897441
50286 1897441 1838112 1782238 1728918 1678096 1631323 1589877 1553018 1519095 1487675 1459531 1434861
50275 1434861 1412795 1392696 1374792 1359214 1345512 1333951 1326359 1324488 1327788 1333803 1340737 1348714
50263 1348714 1358532 1370255 1383418 1397763 1413170 1429481 1446814 1465503 1485345 1505594 1526173
50252 1526173 1548100 1572088 1597478 1623340 1649900 1677835 1706781 1735669 1764001 1791535 1817205
50241 1817205 1839971 1860668 1881389 1902761 1923233 1941384 1957416 1971688 1983247 1990904 1994832 1996042
50229 1996042 1994930 1991274 1985121 1976777 1966130 1952575 1935361 1913766 1887658 1858334 1828122 1798415
50217 1798415 1768637 1737732 1706059 1675126 1645941 1618410 1591985 1566218 1540962 1516613 1493925
50206 1493925 1473246 1454376 1437434 1422996 1410833 1399504 1388117 1377597 1369005 1361428 1353114 1344309
50194 1344309 1337199 1332793 1329321 1324297 1317140 1309121 1301510 1294382 1286854 1277994 1267710 1256889 1246485
50181 1246485 1236557 1226569 1216383 1206362 1196620 1186884 1177190 1168100 1160119 1153310 1147454 1142142 1136885
50168 1136885 1131640 1127088 1123755 1121126 1118414 1115953 1114760 1114742 1114616 1113994 1114468 1117876 1124210 1131785 1138871
50153 1138871 1144597 1148760 1151450 1152603 1151454 1146755 1138138 1127176 1116591 1108213 1101679 1095030 1086516
50140 1086516 1075917 1064102 1051461 1037429 1021917 1006313 992056 978771 965230 951863 940558
50129 940558 931601 922674 911852 900047 889167 879188 868883 858640 850472 845225 841526 837866 834229
50116 834229 831058 827897 824027 819724 815974 813231 811059 808708 805506 800974 795209 789139 783911 779890
50102 779890 776506 773021 769137 764770 759721 754017 748348 743574 739523 734752 728010 719726 711586 704755
50088 704755 699061 693731 688132 681704 674205 666587 660776 657761 656486 655491 655086 656750 660642 665043 668398
50073 668398 670760 672856 674961 677410 681180 686840 693463 699749 705999 713939 724451 736456 748325
50060 748325 759513 770282 780636 790517 800690 812260 825022 837269 848027 858872 872502 889554
50048 889554 907814 924757 939980 954570 968997 982656 995030 1006164 1015978 1024330 1032037 1040699
50036 1040699 1050693 1060061 1066434 1069783 1072452 1076561 1082184 1088111 1093483 1098232 1102538 1106639 1111042 1116312
50022 1116312 1122498 1129117 1135910 1143357 1152128 1162133 1172494 1182580 1192777 1203985 1216686 1230985
50010 1230985 1247393 1266783 1289248 1313562 1338339 1363487 1390040 1418677 1448895 1479659 1510461
49999 1510461 1541621 1573695 1606484 1638534 1668006 1694575 1720040 1746237 1772385 1795453 1813391
49988 1813391 1827098 1838817 1849525 1858720 1866042 1871932 1876881 1880994 1884390 1887384 1890336 1894023 1899962
49975 1899962 1909470 1922373 1937634 1955482 1977935 2006885 2042728 2085418 2135478 2192533 2253576
49964 2253576 2314275 2371988 2426292 2476742 2521772 2560372 2593413 2622248 2646920 2666899 2683082
49953 2683082 2697688 2712033 2725242 2735206 2740076 2738656 2730009 2713139 2686835 2649845 2601618 2542911
49941 2542911 2475209 2399622 2317103 2229890 2141671 2055538 1972393 1892155 1815835 1745149 1680248
49930 1680248 1619249 1560571 1504751 1453325 1406607 1363422 1322677 1284425 1249478 1218519 1191570
49919 1191570 1167801 1145939 1125200 1105833 1088428 1072804 1057976 1043108 1028189 1014033 1002033
49908 1002033 993499 988263 983953 977625 968445 958088 948298 939117 930030 921720 915450 911259 908022 905075
49894 905075 902532 900091 896890 893075 890209 889260 889107 888201 887037 887646 890747 894796 898215 901430 905944
49879 905944 912186 919303 926764 935117 945036 956454 969100 983356 999916 1018704 1038711 1059163
49867 1059163 1080601 1104430 1131460 1161186 1192721 1226185 1262687 1303035 1347068 1394688 1446979
49856 1446979 1505547 1570841 1641900 1717909 1799381 1887465 1982439 2083056 2186872 2290952 2392858
49845 2392858 2491451 2586412 2676701 2760093 2834878 2901514 2961849 3017189 3068030 3115183 3159566
49834 3159566 3200643 3236270 3264678 3285394 3297383 3297352 3281464 3248641 3201024 3141151 3069841 2987352
49822 2987352 2895698 2798630 2699352 2598945 2497304 2394970 2293420 2193924 2097092 2003763
49812 2003763 1915393 1832754 1754788 1679729 1607299 1539001 1476361 1419713 1368680 1322750 1281091
49801 1281091 1242832 1208002 1177328 1150527 1125666 1100952 1076355 1052654 1029709 1006873 984619
49790 984619 964445 947240 932684 920081 908711 897403 885027 871858 859528 849151 840099 830972
49778 830972 821131 810842 800533 790507 781147 772926 766182 761026 757326 754748 752906 751374 749494
49765 749494 746704 743529 741684 742325 744450 746073 746938 748898 753406 759751 766297 772339 778062 783650 789453
49750 789453 796278 804422 812864 820543 828296 838548 852934 870902 890668 910890 931343 952706
49738 952706 976011 1002036 1031048 1063222 1099062 1139056 1183215 1231545 1284775 1343876 1408729
49727 1408729 1477745 1548879 1620491 1691187 1759480 1823858 1882780 1934490 1977528 2011862 2039111
49716 2039111 2061294 2079661 2094930 2108046 2120034 2131203 2140817 2147281 2148233 2140889 2123083 2094134
49704 2094134 2054373 2003947 1942685 1871378 1792746 1710845 1629504 1551038 1475918 1403579 1334088
49693 1334088 1269213 1211349 1161103 1116622 1075836 1038777 1006703 979278 954045 929184 905684
49682 905684 885813 870021 856558 843986 832832 824268 818069 812779 807539 802856 799489 797280 795443
49669 795443 793553 791727 789965 787881 785297 782859 781706 782417 784320 785950 786256 785399 784321 783545 782654
49654 782654 781121 779407 778770 779882 782063 784057 785167 785400 784969 784244 783931 784590 785868 786657 786122 784261
49638 784261 781654 779218 778227 779725 783444 787797 791365 794158 797055 800419 803688 806166 807852 809577
49624 809577 812466 816936 822074 826382 829355 831833 834564 837050 838460 839034 839791 841131 842608 843931 845369
49609 845369 847151 849279 852113 856300 861663 866558 868842 867591 864010 860808 860303 862612 865722 867692
49595 867692 868456 869050 869632 869292 867605 865237 862766 859948 856585 853245 850591 848704 847678 848255 851060
49580 851060 855414 859487 861575 861147 858966 856494 854780 853681 852477 851347 851615 854085 857688 860370 861070
49565 861070 860432 859862 860344 861949 864103 866440 869539 874422 881044 887761 892827 896223 899558 904380 910979
49550 910979 918606 926399 934088 942044 950683 959915 969451 979535 990805 1003386 1016812 1031017 1046519
49537 1046519 1063218 1079906 1095745 1111588 1129049 1148773 1170262 1192774 1215535 1237739 1259392
49526 1259392 1281716 1305587 1330090 1353928 1377989 1404922 1436056 1470280 1506312 1544431 1585107
49515 1585107 1627303 1669442 1711396 1754360 1799197 1845889 1894294 1944348 1995506 2046959 2098683
49504 2098683 2151652 2206671 2263508 2321548 2380855 2441955 2504532 2566914 2627319 2685382 2741983
49493 2741983 2797685 2852030 2904523 2955373 3004529 3050673 3092194 3128896 3161626 3190393 3214176
49482 3214176 3232822 3247734 3259933 3268612 3272471 3271499 3266320 3256794 3242902 3226679 3211428 3198614
49470 3198614 3186829 3174301 3161232 3149015 3138384 3129563 3123534 3121648 3123890 3128628 3134491 3141877 3152299
49457 3152299 3166764 3185209 3207093 3231994 3259627 3289478 3320548 3351598 3382031 3412564 3444518
49446 3444518 3478081 3511495 3542232 3568632 3590133 3606437 3617268 3622796 3623540 3619618 3610588 3596112
49434 3596112 3576191 3550578 3518556 3479645 3434144 3382801 3326483 3266471 3204403 3141288 3076870
49423 3076870 3010418 2941889 2871972 2801490 2731345 2662643 2596057 2531201 2467289 2404382 2343309
49412 2343309 2284506 2227670 2172638 2119891 2069948 2022750 1977730 1933974 1890349 1846278 1802755
49401 1802755 1761912 1725004 1691232 1658979 1627786 1598523 1571842 1547104 1523024 1499063 1475995
49390 1475995 1455077 1436708 1420076 1404210 1389125 1375572 1363840 1353383 1343638 1334586 1326361 1318933
49378 1318933 1312487 1307529 1304198 1301902 1300038 1298659 1297945 1297472 1296587 1295269 1294145 1293941 1295362 1299033 1304833
49363 1304833 1311635 1318600 1326474 1336579 1348665 1361132 1373752 1388689 1407753 1429597 1450904 1469743
49351 1469743 1486375 1501133 1513396 1523244 1532630 1543668 1556443 1569570 1582581 1596672 1613116 1631873
49339 1631873 1652099 1673332 1695675 1719017 1742469 1764764 1785378 1805228 1825796 1847213 1867691
49328 1867691 1885495 1901100 1916514 1932720 1948903 1964325 1979675 1995955 2012980 2029820 2046044
49317 2046044 2061728 2076930 2092012 2107927 2125201 2143044 2160548 2178391 2198152 2220067 2242766
49306 2242766 2265432 2288940 2314371 2341483 2369445 2398235 2428460 2460342 2493832 2529431 2567963
49295 2567963 2609432 2652852 2697458 2743638 2792291 2843669 2897201 2952318 3008891 3066801 3125755
49284 3125755 3186062 3249115 3316172 3386604 3458299 3530162 3603380 3679725 3759497 3841916 3926749
49273 3926749 4014380 4104568 4196317 4288920 4382240 4476068 4570053 4664232 4758849 4853858 4949307
49262 4949307 5045631 5142367 5237057 5327057 5412293 5494523 5573795 5647699 5714634 5775682 5832168
49251 5832168 5883269 5927507 5965008 5996436 6020979 6037419 6046584 6050816 6051346 6047827 6040154 6029150
49239 6029150 6015613 6000126 5983641 5966797 5948913 5929325 5909644 5892873 5880088 5869911 5861729
49228 5861729 5857349 5858244 5862851 5868291 5873890 5881511 5892991 5908678 5928286 5951795 5979124 6009625 6042194
49215 6042194 6075632 6108984 6141899 6174474 6206407 6236557 6263724 6287458 6307485 6322485 6330216
49204 6330216 6329119 6319316 6301872 6277410 6245712 6206364 6159303 6104704 6042762 5974014 5899807 5822038
49192 5822038 5742125 5660428 5576866 5491885 5406611 5322294 5239928 5160119 5082813 5007299 4932937
49181 4932937 4859872 4788627 4719324 4652066 4587982 4528850 4475256 4425824 4378654 4332970 4288927
49170 4288927 4246554 4205683 4166623 4130149 4096805 4066571 4039069 4013655 3989478 3966007 3943555
49159 3943555 3922886 3904308 3887522 3872318 3858810 3846681 3834714 3821780 3808250 3795774 3785344
49148 3785344 3776044 3766274 3755849 3746019 3737410 3729051 3719979 3710846 3702939 3696322 3690159 3684537 3680516 3678227
49134 3678227 3676377 3674174 3672530 3672570 3673946 3675643 3677722 3681090 3685877 3691099 3695988 3700885 3706757 3714401
49120 3714401 3724185 3736043 3749509 3763968 3778922 3794093 3809637 3826432 3845615 3867374 3890654
49109 3890654 3914504 3939322 3966287 3996026 4028493 4063598 4101052 4139891 4179227 4219435 4261595
49098 4261595 4305697 4350381 4394782 4439682 4486256 4534369 4582884 4631348 4680688 4732101 4785488
49087 4785488 4838999 4890223 4938112 4983813 5029420 5075981 5122868 5168827 5213030 5255197 5295393
49076 5295393 5334000 5371546 5408271 5444166 5479394 5514344 5549213 5583959 5618579 5652970 5686661
49065 5686661 5719378 5751796 5784757 5817523 5847910 5874844 5900061 5926496 5955524 5986354 6017445
49054 6017445 6047554 6075872 6102318 6127866 6153717 6179924 6205403 6229526 6253199 6278005 6304533
49043 6304533 6331706 6357699 6381526 6403828 6426069 6448966 6471974 6494287 6515779 6536601 6556423
49032 6556423 6574718 6591540 6607370 6622369 6636335 6649213 6661003 6671330 6679884 6687367 6695296 6704640
49020 6704640 6715100 6725848 6736539 6747547 6759769 6774252 6791354 6810067 6828719 6846476 6863572
49009 6863572 6879950 6894648 6907060 6917993 6928577 6938545 6946538 6951884 6955148 6956779 6956179 6952671 6946838
48996 6946838 6940100 6932972 6924353 6912877 6898558 6882584 6865546 6846513 6824202 6798726 6771768 6745305
48984 6745305 6720595 6698005 6676933 6655767 6632765 6607687 6582366 6559332 6539969 6523998 6510353
48973 6510353 6498084 6486689 6476096 6466619 6458900 6453724 6451609 6452427 6455549 6460477 6467062 6475015 6483722
48960 6483722 6493070 6503947 6517133 6532094 6547903 6565068 6585101 6608064 6631905 6654768 6676770
48949 6676770 6698843 6720870 6741939 6761561 6779640 6795989 6810954 6825877 6841849 6858328 6873804
48938 6873804 6887141 6897331 6902838 6902855 6898897 6893480 6887208 6878531 6866331 6851117 6833454 6812928 6789336
48925 6789336 6763474 6735837 6705674 6672290 6636353 6598911 6559827 6518103 6473231 6425436 6375132
48914 6375132 6322923 6269706 6216050 6161887 6107392 6053582 6001247 5949868 5898589 5847878 5799196
48903 5799196 5753203 5709293 5666888 5626263 5588083 5553033 5522076 5496137 5475048 5457369 5441714
$$ [...]
##END NTUPLES=NMR SPECTRUM
##END=
