
##TITLE=AC1088_CCPA01_5835881_zcJPuP1aM0
##JCAMPDX= 6.0         $$ Bruker NMR JCAMP-DX V2.0
##DATA TYPE= NMR SPECTRUM
##DATA CLASS= NTUPLES
##ORIGIN= BRUKER
##OWNER= Administrator
$$ 1.72 TOPSPIN		Version 2.1
$$ 2012-04-10 10:33:55.859 -0500  Administrator@TOPSPIN
$$ Compression mode = diff/dup
##.OBSERVE FREQUENCY= 400.13188235
##.OBSERVE NUCLEUS= ^1H
##.ACQUISITION MODE= SIMULTANEOUS (DQD)
##.ACQUISITION SCHEME= undefined
##.AVERAGES= 8
##.DIGITISER RES= 22
##SPECTROMETER/DATA SYSTEM= spect
##.PULSE SEQUENCE= zg30
##.SOLVENT NAME= COFFEE_meoh
##.SHIFT REFERENCE= INTERNAL, COFFEE_meoh, 1, 14.98061
##AUDIT TRAIL= $$ (NUMBER, WHEN, WHO, WHERE, PROCESS, VERSION, WHAT)
$$ ##TITLE= Audit trail, TOPSPIN		Version 2.1
$$ ##JCAMPDX= 5.01
$$ ##ORIGIN= Bruker BioSpin GmbH
$$ ##OWNER= Administrator
$$ $$ C:\Bruker\TOPSPIN/data/COFFEE/nmr/AC1088_CCPA01_5835881_zcJPuP1aM0/10/pdata/1/auditp.txt
$$ ##AUDIT TRAIL=  $$ (NUMBER, WHEN, WHO, WHERE, PROCESS, VERSION, WHAT)
(   1,<2012-03-28 00:44:22.828 -0500>,<Administrator>,<TOPSPIN>,<go>,<TOPSPIN 2.1>,
      <created by zg
	started at 2012-03-28 00:43:15.984 -0500,
	POWCHK enabled, PULCHK disabled,
       configuration hash MD5:
       1A 1E CE 29 27 FD 77 03 67 4E F0 E3 C4 B2 CB 90
       data hash MD5: 64K
       0E 80 15 49 04 06 D5 60 AD 6A CB 26 EC 9B 0C 3E>)
(   2,<2012-03-28 00:44:26.921 -0500>,<Administrator>,<TOPSPIN>,<proc1d>,<TOPSPIN 2.1>,
      <Start of raw data processing
       efp LB = 0 FT_mod = 6 PKNL = 1 PHC0 = 0 PHC1 = 0 SI = 32K 
       data hash MD5: 32K
       EA 53 AA 76 B3 97 A0 67 19 52 A9 A2 6C B4 1A 4A>)
(   3,<2012-03-28 00:44:27.296 -0500>,<Administrator>,<TOPSPIN>,<proc1d>,<TOPSPIN 2.1>,
      <pk PHC0 = 214.0137 PHC1 = 0 
       data hash MD5: 32K
       89 F3 13 80 54 ED A5 91 D5 3D 9D 30 3F 95 13 CD>)
(   4,<2012-03-28 00:44:27.359 -0500>,<Administrator>,<TOPSPIN>,<proc1d>,<TOPSPIN 2.1>,
      <abs ABSG = 1 
       data hash MD5: 32K
       B2 E6 72 AD AA 64 5D 88 B3 E9 C9 8E CB 16 C9 6C>)
(   5,<2012-03-28 00:44:27.390 -0500>,<Administrator>,<TOPSPIN>,<proc1d>,<TOPSPIN 2.1>,
      <abs ABSG = 2 
       data hash MD5: 32K
       3F BB 53 07 FF 83 10 3A AE AD 41 81 D3 E3 B3 A0>)
(   6,<2012-03-28 00:44:27.421 -0500>,<Administrator>,<TOPSPIN>,<proc1d>,<TOPSPIN 2.1>,
      <abs ABSG = 3 
       data hash MD5: 32K
       F5 DB E9 43 4F EB 76 52 58 1B F4 C8 ED 88 24 69>)
(   7,<2012-03-28 00:44:27.453 -0500>,<Administrator>,<TOPSPIN>,<proc1d>,<TOPSPIN 2.1>,
      <abs ABSG = 4 
       data hash MD5: 32K
       C7 24 BC 2B 4B 2B C8 10 7A 0A 9C AB 20 F3 88 64>)
(   8,<2012-03-28 00:44:27.500 -0500>,<Administrator>,<TOPSPIN>,<proc1d>,<TOPSPIN 2.1>,
      <abs ABSG = 5 
       data hash MD5: 32K
       F4 8A A4 66 41 A2 C7 C6 D2 96 02 06 32 C3 AB 7F>)
(   9,<2012-03-28 00:44:32.500 -0500>,<Administrator>,<TOPSPIN>,<audit>,<TOPSPIN 2.1>,
      <user comment:
       ICON-NMR User ID: COFFEE
       data hash MD5: 32K
       F4 8A A4 66 41 A2 C7 C6 D2 96 02 06 32 C3 AB 7F>)
$$ [...]
150 150 150 150 150 150 150 150
##$TP07= 0
##$TPNAME0= <>
##$TPNAME1= <>
##$TPNAME2= <>
##$TPNAME3= <>
##$TPNAME4= <>
##$TPNAME5= <>
##$TPNAME6= <>
##$TPNAME7= <>
##$TPOAL= (0..7)
0.5 0.5 0.5 0.5 0.5 0.5 0.5 0.5
##$TPOFFS= (0..7)
0 0 0 0 0 0 0 0
##$TUNHIN= 0
##$TUNHOUT= 0
##$TUNXOUT= 0
##$USERA1= <user>
##$USERA2= <user>
##$USERA3= <user>
##$USERA4= <user>
##$USERA5= <user>
##$V9= 5
##$VALIST= <valist>
##$VCLIST= <CCCCCCCCCCCCCCC>
##$VD= 0
##$VDLIST= <DDDDDDDDDDDDDDD>
##$VPLIST= <PPPPPPPPPPPPPPP>
##$VTLIST= <TTTTTTTTTTTTTTT>
##$WBST= 2048
##$WBSW= 25
##$XGAIN= (0..3)
0 0 0 0
##$XL= 0
##$YL= 0
##$YMAX_a= 519168
##$YMIN_a= -626690
##$ZGOPTNS= <>
##$ZL1= 120
##$ZL2= 120
##$ZL3= 120
##$ZL4= 120
##$ABSF1= 14.98061
##$ABSF2= -5.57192
##$ABSG= 5
##$ABSL= 3
##$ALPHA= 0
##$AQORDER= 0
##$ASSFAC= 0
##$ASSFACI= 0
##$ASSFACX= 0
##$ASSWID= 0
##$AUNMP= <proc_prof1d_extract_pilot.lims>
##$AXLEFT= 0
##$AXNAME= <>
##$AXNUC= <1H>
##$AXRIGHT= 0
##$AXTYPE= 0
##$AXUNIT= <>
##$AZFE= 0.1
##$AZFW= 0.1
##$BCFW= 0
##$BC_mod= 0
##$BYTORDP= 0
##$COROFFS= 0
##$CY= 15
##$DATMOD= 1
##$DC= 0
##$DFILT= <>
##$DTYPP= 0
##$F1P= 0
##$F2P= 0
##$FCOR= 0.5
##$FTSIZE= 32768
##$FT_mod= 6
##$GAMMA= 0
##$GB= 0
##$INTBC= 1
##$INTSCL= 1
##$ISEN= 128
##$LB= 0
##$LEV0= 0
##$LPBIN= 0
##$MAXI= 10000
##$MC2= 0
##$MEAN= 0
##$ME_mod= 0
##$MI= 0
##$NCOEF= 0
##$NC_proc= -8
##$NLEV= 6
##$NOISF1= 0
##$NOISF2= 0
##$NSP= 0
##$NTH_PI= 0
##$NZP= 0
##$OFFSET= 14.98061
##$PC= 1
##$PHC0= 214.0137
##$PHC1= 0
##$PH_mod= 1
##$PKNL= yes
##$PPARMOD= 0
##$PPDIAG= 0
##$PPIPTYP= 0
##$PPMPNUM= 2147483647
##$PPRESOL= 1
##$PSCAL= 4
##$PSIGN= 0
##$PYNMP= <proc.py>
##$REVERSE= no
##$SF= 400.13
##$SI= 32768
##$SIGF1= 0
##$SIGF2= 0
##$SINO= 400
##$SIOLD= 32768
##$SPECTYP= <>
##$SREGLST= <1H.CDCl3>
##$SSB= 0
##$STSI= 32768
##$STSR= 0
##$SW_p= 8223.68421052632
##$SYMM= 0
##$S_DEV= 0
##$TDeff= 65536
##$TDoff= 0
##$TI= <>
##$TILT= no
##$TM1= 0
##$TM2= 0
##$TOPLEV= 0
##$USERP1= <user>
##$USERP2= <user>
##$USERP3= <user>
##$USERP4= <user>
##$USERP5= <user>
##$WDW= 1
##$XDIM= 32768
##$YMAX_p= 455437125
##$YMIN_p= -647583
##$CURPLOT= <Network HP LaserJet P1505>
##$CURPRIN= <$Network HP LaserJet P1505>
##$DFORMAT= <normdp>
##$LAYOUT= <+/1D_H.xwp>
##$LFORMAT= <normlp>
##$PFORMAT= <normpl>
##$SURQMSG= 1
$$ End of Bruker specific parameters
$$ ---------------------------------
##NTUPLES= NMR SPECTRUM
##VAR_NAME=  FREQUENCY,     SPECTRUM/REAL,   SPECTRUM/IMAG
##SYMBOL=    X,             R,               I
##VAR_TYPE=  INDEPENDENT,   DEPENDENT,       DEPENDENT
##VAR_FORM=  AFFN,          ASDF,            ASDF
##VAR_DIM=   32768,         32768,           32768
##UNITS=     HZ,            ARBITRARY UNITS, ARBITRARY UNITS
##FACTOR=    0.250966925370066, 1,           1
##FIRST=     8223.43324360095, -67991,       -265991
##LAST=      0,             -23482,          -216773
##MIN=       0,             -647583,         0
##MAX=       8223.43324360095, 455437125,    0
$$ Real data points
##PAGE= N=1
##DATA TABLE= (X++(R..R)), XYDATA
$$ [...]
19491b33891J4908K7271C5099l294O2121b97861A40669c59250l7393i4188k08361
$$ -233891 -218983 -191712 35099 31805 93926 -297861 140669 -359250 -396643 -94188 -302549
19480c02549d7655Q03n7345C01616a00887j09978R8386k63643h7553B31400c395
$$ -302549 -47655 -46852 -104197 301616 -100887 -210865 -112479 -376122 -87553 231400 -3395
19468a09978F3850J36186a40576j49067E4491a83896A93224c31265B37569a84237
$$ -109978 63850 200036 -140576 -289643 54491 -183896 193224 -331265 237569 -184237
19457G2445K6343i8194j40829K2363A98985M5076a1618r2003J9173K6437k15805
$$ 72445 98788 -98194 -239023 -216660 198985 244061 -11618 -103621 -84448 -58011 -273816
19446b73816I7144D5989J19435A6415g493l65363J19249h3843D5036b5061k47367
$$ -273816 97144 45989 165424 16415 -7493 -372856 -253607 -83843 45036 -25061 -272428
19435b72428A27400g9654r6082D5476f8206J8459m0936G3616b86120a19072B05759
$$ -272428 127400 -79654 -175736 45476 -68206 -49747 -90683 73616 -286120 -119072 205759
19423b55330H4770a19024p7016q7018E9813P8557D9956a46535H973e6081I5628
$$ -255330 84770 -119024 -196040 -283058 59813 138370 49956 -146535 8973 -56081 95628
19411c2392A7712b15347f9238J6385k18364j02013d3917F5162a71643f614l20485
$$ -32392 17712 -215347 -69238 -52853 -271217 -373230 -43917 65162 -171643 -6614 -327099
19400c27099A14545j0478b58730G850J95287f0164A57570I473c97688b0902A22978
$$ -327099 114545 104067 -258730 7850 203137 -60164 157570 9473 -397688 -20902 122978
19388b44586R290J10297j1993A53891a9800B38381b88393E8977k1705b0340A2487
$$ -244586 -235296 -124999 -136992 153891 -19800 238381 -288393 58977 37272 -20340 12487
19376C56323H5769l4092a67008C0883J10819c77469a45194N4642J6134j49168
$$ 356323 85769 51677 -167008 30883 141702 -377469 -145194 -90552 -74418 -223586
19366b23586j7605c4012j24846C2821c5519A34010a03597k1671G0004i4484E5808
$$ -223586 -241191 -34012 -158858 32821 -35519 134010 -103597 -125268 70004 -94484 55808
19354A00250P6932b74635c5630k3883j37245A31182k7711b2994j52806Q212I1099
$$ 100250 177182 -274635 -35630 -59513 -196758 131182 103471 -22994 -175800 -167588 91099
19342a83496L5707C8430a67562B8137b49300h8613p3609j6706N3538e9369l7470
$$ -183496 -147789 38430 -167562 28137 -249300 -88613 -162222 -178928 -125390 -59369 -96839
19331i6839B3157b28061k23948b20453H9405b5007j05363B57023H5231B1294K07851
$$ -96839 23157 -228061 -452009 -220453 89405 -25007 -130370 257023 85231 21294 229145
19320B29145f9211A42946c84471B00228c11589a18952k02675H8073a07452A72446
$$ 229145 -69211 142946 -384471 200228 -311589 -118952 -321627 88073 -107452 172446
19309c08202H8552b5937B31768c43487a59249j16878c5852C14193f8808o8043
$$ -308202 88552 -25937 231768 -343487 -159249 -276127 -35852 314193 -68808 -136851
19299a36851K5981p161k23669F3851Q0344a0908j54052N2664A64839C2121c17510
$$ -136851 -110870 -118031 -341700 63851 144195 -10908 -164960 -112296 164839 32121 -317510
19287a61262k7481f0823D8283b04998n5244A50229J62212H1548K29843I9989J25423
$$ -161262 -188743 -60823 48283 -204998 -260242 150229 312441 81548 311391 99989 225412
19276B25412i0900l5934C9025J33613o069b08404j64992e6813H7278b59500A4312
$$ 225412 -90900 -126834 39025 172638 166569 -208404 -373396 -56813 87278 -259500 14312
19264g5616G0349a88564A85261n4360R4038b50693J06342A13226L6370b13350
$$ -75616 70349 -188564 185261 130901 224939 -250693 -144351 113226 149596 -213350
19253E1714K0110k1250b98545c3002J1629p0683b6288r7603j692A26426c22523
$$ 51714 71824 50574 -298545 -33002 -21373 -92056 -26288 -123891 -125583 126426 -322523
19241a41254A11687h340q0754F2832b65717J30020j15001Q9703o3170o9955j4520
$$ -141254 111687 -8340 -89094 62832 -265717 -135697 -250698 -160995 -224165 -294120 -308640
19230c08640N0190P5213D6864K33191b58584F764a31090d9490f658j09777B48528
$$ -308640 -258450 -183237 46864 280055 -258584 6764 -131090 -49490 -6658 -116435 248528
19218i6379j4421D7967J09977b0146N809k36306A2633c15648J26085c7928A2574
$$ -96379 -110800 47967 157944 -20146 -14337 -250643 12633 -315648 -189563 -37928 12574
19206d6623f466l41481E2625c1208C15881B344b93510C9679a06402r6870P3B8547
$$ -46623 -6466 -347947 52625 -31208 315881 2344 -293510 39679 -106402 -203272 -203199 28547
19193C27578b39892B29327J79133H9559o000P689i0108k03277H9196b75071B90476
$$ 327578 -239892 229327 408460 89559 83559 91248 -90108 -293385 89196 -275071 290476
19181d43197K01917f4137k34246f8997r652j3424j56331a16841A8698b13302d275
$$ -443197 -241280 -64137 -298383 -68997 -78649 -92073 -248404 -116841 18698 -213302 -4275
19169A02343g7383A6454M6941l993b75386f372o3367A03764b84408E5984i661
$$ 102343 -77383 16454 63395 59402 -275386 -6372 -69739 103764 -284408 55984 -9661
19157c037j78111B9535c15519a04350E5977J59613a86824k16619a38805P989e7162
$$ -3037 -181148 29535 -315519 -104350 55977 215590 -186824 -403443 -138805 -130816 -57162
19145B07033a12448r5531C44427a16999I3611c03228i4659j06684B10160c31703
$$ 207033 -112448 -207979 344427 -116999 93611 -303228 -94659 -201343 210160 -331703
19134b42526A99970a17805H3566H781J58690f5095j01989B8430b87506B97775
$$ -242526 199970 -117805 83566 8781 167471 -65095 -167084 28430 -287506 297775
19123a14302E19a22587r8746N7966A04521a83207G0518K301a41037k78972K01671
$$ -114302 519 -122587 -221333 -163367 104521 -183207 70518 72819 -141037 -420009 -218338
19112b18338C6543d23677E7434a69147Q2447A09261c15448j09305B2572i0535
$$ -218338 36543 -423677 57434 -169147 -86700 109261 -315448 -424753 22572 -90535
19101b87096D79982a04602K7800k31879C1341d37982K5232A19649c31108a00761
$$ -287096 479982 -104602 -76802 -308681 31341 -437982 -412750 119649 -331108 -100761
19090C47839a35805q3336G4582e2627C43360b4214A09070a76834E4058b3898k84408
$$ 347839 -135805 -219141 74582 -52627 343360 -24214 109070 -176834 54058 -23898 -308306
19079c08306i3162A10109k360b5696j97536A41329c84640e419l16333A7823b87696
$$ -308306 -93162 110109 107749 -25696 -223232 141329 -384640 -5419 -321752 17823 -287696
19067A72286c7473C2143J39365k2178a00829D590K06397d2317k04838A63772a34614
$$ 172286 -37473 32143 171508 149330 -100829 4590 210987 -42317 -247155 163772 -134614
19055A89712E6955n797L5589i4847j34078d7089G5924J01329N0718b567m35344
$$ 189712 56955 51158 86747 -94847 -228925 -47089 75924 177253 227971 -2567 -437911
19044d37911A60297n5693a80255B15762n7742b54886j10936C4526l254c7976B71924
$$ -437911 160297 104604 -180255 215762 158020 -254886 -365822 34526 31272 -37976 271924
19032d55645a72890O3219k02509a41199j01087k63182a04333q0239C1110J57990
$$ -455645 -172890 -109671 -312180 -141199 -242286 -505468 -104333 -184572 31110 189100
19022A89100E7420b83021J18219m5849M1653A17707A8564L7880J69235r2662g2530
$$ 189100 57420 -283021 -164802 -210651 -168998 117707 18564 56444 225679 133017 -72530
19010a48930N0775m33A10655a85065D56K68061A23643f6122L1504j57577m0079
$$ -148930 -98155 -98588 110655 -185065 456 268517 123643 -66122 -34618 -192195 -232274
18999b32274H4788b2459k70729j8780e201k3729F7271M03469B4624a60358n4675
$$ -232274 84788 -22459 -293188 -311968 -5201 -28930 67271 470740 24624 -160358 -215033
18988b15033C86549d4774i455A94715b29550D8740O7066e1377r8019e0478J4505
$$ -215033 386549 -44774 -9455 194715 -229550 48740 115806 -51377 -149396 -50478 -35973
18977c5973C5238K0530J43925b83259A34981e105n0521j23216A15242g5947A47340
$$ -35973 35238 55768 199693 -283259 134981 -5105 -55626 -178842 115242 -75947 147340
18965C4130h2260l964a5742A1790a97323A79205F6099b07412D22021A98264K61169
$$ 34130 -82260 -86224 -15742 11790 -197323 179205 66099 -207412 422021 198264 459433
18954D59433j40156p6362C2313a09849a3135k22831g6885G0679K61434A43971
$$ 459433 319277 242915 32313 -109849 -13135 -235966 -76885 70679 332113 143971
18943D7799a12876C20558a75899a6282B42706h5768k86983i8852r3401r6869r4907
$$ 47799 -112876 320558 -175899 -16282 242706 -85768 -372751 -98852 -192253 -289122 -384029
18932c84029a33238G1961J00068B5679a95078R3724H7062M5832r853l8861K55490
$$ -384029 -133238 71961 172029 25679 -195078 -101354 87062 132894 123041 84180 339670
18921C39670b65396B30027a53287E0867b8826n4877b2799j06848B35067a12384
$$ 339670 -265396 230027 -153287 50867 -28826 -83703 -22799 -129647 235067 -112384
18910b79563b8657F8855a67734C5595a55890q0618R0629f0759A15501b3198I6437
$$ -279563 -28657 68855 -167734 35595 -155890 -236508 -145879 -60759 115501 -23198 96437
18898c15882G8857H551c5334E3275J11793M07375k04962c6073k7063C51518A65575
$$ -315882 78857 8551 -35334 53275 165068 572443 367481 -36073 -63136 351518 165575
18886F0915J53413b01550i8672n6552O6219A3958K9017d7617j83651l4180N7964
$$ 60915 214328 -201550 -98672 -155224 -89005 13958 42975 -47617 -231268 -265448 -207484
18875b07484L5244A25416a11707L2317D5060h8035m7806A21878k0546O842I556
$$ -207484 -172240 125416 -111707 -79390 45060 -88035 -135841 121878 101332 108174 9556
18863a64112k38816H743a40202f3712j84741i8753j8022M4898m7132B6444J44793
$$ -164112 -402928 8743 -140202 -63712 -248453 -98753 -116775 -71877 -119009 26444 171237
18852A71237b55816A09570k1092b95523A5779L5388B3586a42095n899f6821I3248
$$ 171237 -255816 109570 88478 -295523 15779 51167 23586 -142095 -147994 -66821 93248
18840a25026A03933b0173k2930q713A38862E7670b15036A16235a65081A87402
$$ -125026 103933 -20173 -43103 -51816 138862 57670 -215036 116235 -165081 187402
18829a21415B75251E1003e1416A61260D0017N1910B2325c00872g5270J9463m1752
$$ -121415 275251 51003 -51416 161260 40017 91927 22325 -300872 -75270 -55807 -97559
18818i7559j14354O9501c1728k32665j26077A88110b13866R8891A06276a4380
$$ -97559 -211913 -142412 -31728 -264393 -390470 188110 -213866 -114975 106276 -14380
18807d16111Q0240K9330B43701a37848b202B1361M3691K53607D8004a73713d5994
$$ -416111 -335871 -306541 243701 -137848 -2202 21361 65052 318659 48004 -173713 -45994
18795B29230a30910A45209a04588E1747a95902c7331a2235l0613A70644d0379
$$ 229230 -130910 145209 -104588 51747 -195902 -37331 -12235 -42848 170644 -40379
18784d9572A69681c31458J08029l8145a9750p8247E1471c26231C93035f139A08779
$$ -49572 169681 -331458 -223429 -261574 -19750 -97997 51471 -326231 393035 -6139 108779
18772c31399c9812a8631j87469P7234J112C1909c3959j30606I5411b47494F9124
$$ -331399 -39812 -18631 -206100 -128866 -127754 31909 -33959 -164565 95411 -247494 69124
18760d0504l32627c9968j81679H8331K11826A36459M7574c59508C580L1781a0910
$$ -40504 -373131 -39968 -221647 88331 300157 136459 184033 -359508 3580 35361 -10910
18748b85534a26988e5873A04129l1691b01472r3535C7565c0860j13254j21044
$$ -285534 -126988 -55873 104129 72438 -201472 -295007 37565 -30860 -144114 -265158
18738b65158d8806k0165j52644o6087D1039c5118k32570d4991D2517o015a63715
$$ -265158 -48806 -68971 -221615 -287702 41039 -35118 -267688 -44991 42517 36502 -163715
18726b96870A8251a54226G9997c95946c1652l3930r0451B9025K6421a63768d9045
$$ -296870 18251 -154226 79997 -395946 -31652 -65582 -156033 29025 55446 -163768 -49045
18714B37838e1928l83783A5303f9252B9065b97593B7799a22308L5331j20767G6631
$$ 237838 -51928 -435711 15303 -69252 29065 -297593 27799 -122308 -86977 -207744 76631
18702e16542b13475A74077a50864I9713a19421B23074a63310g3085B80728d13511
$$ -516542 -213475 174077 -150864 99713 -119421 223074 -163310 -73085 280728 -413511
18691b0592E3574b02796R4933A16470b11099g2833A50964e834A6832m192b33998
$$ -20592 53574 -202796 -107863 116470 -211099 -72833 150964 -5834 16832 12640 -233998
18679a31334j80908C6830c4260n6993A16807c2995l69430a9628D2258N0232d6723
$$ -131334 -312242 36830 -34260 -91253 116807 -32995 -402425 -19628 42258 92490 -46723
18667A10748a01843L3487o6779A43816E6576J09590f5363A83914P3657a04164
$$ 110748 -101843 -68356 -135135 143816 56576 166166 -65363 183914 257571 -104164
18656H5205b63353b9917A05189A8113g8126B92602a88073O7553m17251K27906
$$ 85205 -263353 -29917 105189 18113 -78126 292602 -188073 -120520 -537771 -309865
18646c09865a31220A14606b49080a7380r5079j8882B3604b33997H585a94230g7437
$$ -309865 -131220 114606 -249080 -17380 -112459 -131341 23604 -233997 8585 -194230 -77437
18634A30206D1239d50302B02395a66205l9427f2479j21416g7145j84604g9874
$$ 130206 41239 -450302 202395 -166205 -205632 -62479 -183895 -77145 -261749 -79874
18623a14435e5287K3277k40468a09373q8353j04435E9505J30619c48840f9816
$$ -114435 -55287 -32010 -272478 -109373 -197726 -302161 59505 190124 -348840 -69816
18612a13310M873j14263i0163r158I5577C670a02022n7130A03540k0151O5961
$$ -113310 -108437 -222700 -90163 -99321 95577 3670 -102022 -159152 103540 83389 149350
18601A49350d42591a13345C64213b02439h4008A52426c41899B80752H6896N1970
$$ 149350 -442591 -113345 364213 -202439 -84008 152426 -341899 280752 86896 138866
18591A38866A3871a80938A19388a12468J501A4278N965a93626G580c1975l76253
$$ 138866 13871 -180938 119388 -112468 -110967 14278 20243 -193626 7580 -31975 -408228
18580d08228a06647A35487J18789a59966d8802l8638j2313b0999r3203j64633
$$ -408228 -106647 135487 254276 -159966 -48802 -87440 -99753 -20999 -114202 -278835
18570b78835a1439p1762k55743d0834G1852b21896k5153D4462d8117k98049E8568
$$ -278835 -11439 -83201 -338944 -40834 71852 -221896 -247049 44462 -48117 -346166 58568
18558e0399A67382n6252d8954k88307A5032c1066A45110m1945J7893b43775H0462
$$ -50399 167382 111130 -48954 -337261 15032 -31066 145110 103165 121058 -243775 80462
18546b25314G4213a05492j62826J17085J3466G1295c97729b4001A78102a61606
$$ -225314 74213 -105492 -268318 -151233 -137767 71295 -397729 -24001 178102 -161606
18535A69212F1141J39016g7879k42585d8472l9040m2933n8748j15253A88446a55540
$$ 169212 61141 200157 -77879 -320464 -48472 -87512 -130445 -189193 -304446 188446 -155540
18523b93064a5361j50537j71965O9327c0837A59074b50475J21191l5434O9178
$$ -293064 -15361 -165898 -337863 -268536 -30837 159074 -250475 -129284 -164718 -95540
18513i5540A08675l6597e7350B34182p6020E248N7250g8446j45149b3813k30772
$$ -95540 108675 72078 -57350 234182 158162 5248 62498 -78446 -223595 -23813 -254585
18502b54585b3306A50776b47568a2381j23230C8737K45828A4737D596c9529C964
$$ -254585 -23306 150776 -247568 -12381 -135611 38737 284565 14737 4596 -39529 3964
18490B1825d70554A761Q5949f2704k20799L0158J20609q8608j54753A63387B6161
$$ 21825 -470554 1761 87710 -62704 -283503 -253345 -132736 -221344 -376097 163387 26161
18478D100a80950j79326Q399B8312g2688A89065a08577p8958K6995e467j61868
$$ 4100 -180950 -360276 -351877 28312 -72688 189065 -108577 -187535 -160540 -5467 -167335
18467a67335K1228b1690j04517D29614j78363b13559a04139H5497l4946L3927
$$ -167335 -146107 -21690 -126207 429614 251251 -213559 -104139 85497 50551 84478
18457H4478f526l46949a48608n2103g5282K7850k6149j46149N0789C04883e4786
$$ 84478 -6526 -353475 -148608 -200711 -75282 -47432 -73581 -219730 -168941 304883 -54786
18445b07490I6928b2447A35499b39660e1904A01710m5040Q4371a27625D231K2348
$$ -207490 96928 -22447 135499 -239660 -51904 101710 56670 141041 -127625 4231 26579
18434B6579a92354d5820l964E7592J23274g6649j43752J08577l26981A20649d3359
$$ 26579 -192354 -45820 -49784 57592 180866 -76649 -220401 -111824 -438805 120649 -43359
18422A48425R4156a91051d7460A49353h3110o4094G2508J94280B6324M216b75764
$$ 148425 242581 -191051 -47460 149353 -83110 -147204 72508 266788 26324 30540 -275764
18410a53784L3077p4302k20g3943c0432A81204c13259A88411l8483j9010m8203
$$ -153784 -120707 -195009 -195229 -73943 -30432 181204 -313259 188411 149928 130918 82715
18399H2715k1234d3715k12291A99874H0359O2037a08188q2602A0191J1834f5889
$$ 82715 61481 -43715 -256006 199874 80359 142396 -108188 -190790 10191 22025 -65889
18387d1362I5230a73587A1437h6257B9462J64254b88042j88746i0606n9393b1436
$$ -41362 95230 -173587 11437 -86257 29462 193716 -288042 -476788 -90606 -149999 -21436
18375b96302A24483e2591q6987b932r250C22830a94940E3199K7823A871b2246
$$ -296302 124483 -52591 -139578 -2932 -12182 322830 -194940 53199 81022 1871 -22246
18363C00664c3934b67C5654a49849k6464A42475b91067J14151d9976p4544H3131
$$ 300664 -33934 -267 35654 -149849 -176313 142475 -291067 -176916 -49976 -124520 83131
18351a55793A2956g5136F5100k9813J64606d67372b4700j51731K4975k0241c0863
$$ -155793 12956 -75136 65100 35287 199893 -467372 -24700 -176431 -151456 -171697 -30863
18339A02092h9123b1214k2702l8699k99978c4520k15650A52999m2302K8204b6899
$$ 102092 -89123 -21214 -43916 -82615 -382593 -34520 -250170 152999 110697 138901 -26899
18327b30535c3287n6865j86936P9664g6676K0795A2646g6958k08063c0800A78269
$$ -230535 -33287 -90152 -277088 -197424 -76676 -55881 12646 -76958 -285021 -30800 178269
18315e8442j62561A05980C309g8429B49475a32638j68950a05486l0002B52306
$$ -58442 -221003 105980 3309 -78429 249475 -132638 -301588 -105486 -135488 252306
18304b72112A79776a29349n6599h8528j70665J22689l3131M6715A5723a40395
$$ -272112 179776 -129349 -185948 -88528 -259193 -136504 -169635 -122920 15723 -140395
18293a37149j39730f3705K7498O476B15348D0634c7569n0243G7783K6159b30387
$$ -137149 -276879 -63705 -36207 -29731 215348 40634 -37569 -87812 77783 103942 -230387
18281a08623M5784A68229F6897c6689j93851A34314E8035K11445d9282k09973
$$ -108623 -62839 168229 66897 -36689 -230540 134314 58035 269480 -49282 -259255
18271b59255k7671a29618K5491j24865m82K4234R913G1741h4592n0314k0419A14876
$$ -259255 -286926 -129618 -104127 -228992 -229474 -205240 -195327 71741 -84592 -134906 -155325 114876
18258a15436j9423l5160g1668o2671C65080E8331c3944k56779B11320j4238a07282
$$ -115436 -134859 -170019 -71668 -134339 365080 58331 -33944 -290723 211320 197082 -107282
18246A59959p4473m0980b12394h5930J2751I2729a04928j86435C8435e8262K3347
$$ 159959 85486 44506 -212394 -85930 -73179 92729 -104928 -291363 38435 -58262 -34915
18235c4915H2226k7892N2154N7295b67153B09577a65235r0448D01742H6322a13195
$$ -34915 82226 54334 106488 163783 -267153 209577 -165235 -255683 401742 86322 -113195
18223C6854R0498B3728c43521I0252a03806o2214C171i7522L4320G7293a30092
$$ 36854 127352 23728 -343521 90252 -103806 -166020 3171 -97522 -63202 77293 -130092
18211b8051p8798M8620I1159a74962B3519O0050a50647C8108b4133m0812B28729
$$ -28051 -106849 -58229 91159 -174962 23519 83569 -150647 38108 -24133 -64945 228729
18199c7823H8006a04290l1923N3468j54995j89570h5487j34738G8586c10244b4243
$$ -37823 88006 -104290 -136213 -82745 -237740 -427310 -85487 -220225 78586 -310244 -24243
18187d2149p2201b0463j08423f1252m5772B63998A01537c2985p9406b102j1116
$$ -42149 -114350 -20463 -128886 -61252 -107024 263998 101537 -32985 -112391 -2102 -13218
18176a3218I7636Q105J88946a04285J8758I6135b10908A13338b63933R747A03340
$$ -13218 97636 105741 294687 -104285 -85527 96135 -210908 113338 -263933 -254186 103340
18164c34494B90846j43374J70214a72912J3360A55186J75347e9941J7437j50421
$$ -334494 290846 147472 317686 -172912 -159552 155186 330533 -59941 -42504 -192925
18154a92925A27799F0721a69806c3387j61298j02587a32813J4538k61999B25887
$$ -192925 127799 60721 -169806 -33387 -194685 -297272 -132813 -118275 -380274 225887
18143H6044c4074p8363K3857m3062E1000b43345C17784a071o5515j26764e3345
$$ 86044 -34074 -112437 -88580 -131642 51000 -243345 317784 -1071 -66586 -193350 -53345
18131A81353a74641b1074B21693c45349D8680a89757D6244M503d0911J7399l6781
$$ 181353 -174641 -21074 221693 -345349 48680 -189757 46244 50747 -40911 -23512 -60293
18120f0293j79676A9432J95606C8232g2088o8430O7918A0896L69406j25166a75855
$$ -60293 -239969 19432 215038 38232 -72088 -140518 -72600 10896 380302 255136 -175855
18108a39616j67059d8244A69740d22516i3163d84A10112e98846a19435C6030E251
$$ -139616 -306675 -48244 169740 -422516 -93163 -484 110112 -598846 -119435 36030 5251
18096A15639b08956I3109B3982K07400J0028a86588k66671J93068A17281k0422
$$ 115639 -208956 93109 23982 231382 241410 -186588 -453259 -260191 117281 96859
18086I6859j7717K8178K8736k8388b48678h0373C80541a55335L7810C52765a15077
$$ 96859 79142 107320 136056 107668 -248678 -80373 380541 -155335 -117525 352765 -115077
18074C4814J25898a38625G2537a26658j97886A1454J4065d7981j01483M3521k4016
$$ 34814 160712 -138625 72537 -126658 -324544 11454 25519 -47981 -149464 -105943 -129959
18063a29959G0581K59405d9914A84545n5503B7265O2379a2398G1851b08990m3439
$$ -129959 70581 329986 -49914 184545 129042 27265 89644 -12398 71851 -208990 -252429
18052b52429A07171Q0158a24619A06390a44580J0745A7737J23254k0940D3892
$$ -252429 107171 187329 -124619 106390 -144580 -133835 17737 140991 120051 43892
18041B74349j10952a8217g92j95590c6727j05411e3901C8884i4783l4697B99483
$$ 274349 163397 -18217 -792 -196382 -36727 -142138 -53901 38884 -94783 -129480 299483
18029A4386J35346D8831M9806d1287E4248a2209m5203j46942e6317p8576F7533
$$ 14386 149732 48831 98637 -41287 54248 -12209 -57412 -204354 -56317 -134893 67533
18017I1066A0241b50835j10501G3780a51003C16144a47365e2650j47128c7921
$$ 91066 10241 -250835 -361336 73780 -151003 316144 -147365 -52650 -199778 -37921
18006a29589E0546a48636B54402b02221m0907B52332d0970F0818B0657g1855d800
$$ -129589 50546 -148636 254402 -202221 -243128 252332 -40970 60818 20657 -71855 -4800
17994a96846A09588P0775b4396A24111c34250d5281A72205n4005b28378K8559
$$ -196846 109588 180363 -24396 124111 -334250 -45281 172205 118200 -228378 -199819
17984a99819e0696n0697A845D2O4101O9397b52154A6239a9654k82991I232e035
$$ -199819 -50696 -101393 1845 42 64143 133540 -252154 16239 -19654 -302645 9232 -5035
17971a46047M7361B0901O9879j1909l5353L52502j44873K6928N7282f2023C8465
$$ -146047 -98686 20901 90780 78871 43518 396020 251147 278075 335357 -62023 38465
17959a6054j7008H6828J83901c5507j04693e5913A33460C5963L6192b35477g3724
$$ -16054 -33062 86828 270729 -35507 -140200 -55913 133460 35963 72155 -235477 -73724
17947a364A71619H0165e310k40558A51435a38736D1709L50923j31529g2649k29053
$$ -1364 171619 80165 -5310 -245868 151435 -138736 41709 392632 261103 -72649 -301702
17936c01702H9334k2153c767A20409K30148A09928d5180H8765a53377O2992A0195
$$ -301702 89334 67181 -3767 120409 350557 109928 -45180 88765 -153377 -90385 10195
17924B72853a38541I6053b28454B29022C0596J048K5907A4881a59224L4109A91459
$$ 272853 -138541 96053 -228454 229022 30596 31644 57551 14881 -159224 -125115 191459
17912a56602k19720D6344J0317b08788A24906c00109A54786h9763I6948R0093
$$ -156602 -376322 46344 56661 -208788 124906 -300109 154786 -89763 96948 187041
17902A87041G1477a32186A6530L21613D5374d10739J24473J03101C5542R7653
$$ 187041 71477 -132186 16530 338143 45374 -410739 -286266 -183165 35542 133195
17892A33195b6108q6220A59648J897a09742j9088I3934g3232o4997c1098k23947
$$ 133195 -26108 -112328 159648 161545 -109742 -128830 93934 -73232 -138229 -31098 -255045
17881b55045P2964Q5547m7690A62690f3752A82210c74617a27624d4612E1171a59139
$$ -255045 -182081 -96534 -144224 162690 -63752 182210 -374617 -127624 -44612 51171 -159139
17869a77334A9856J86955C8983f7178K6261D52976a50850A06733C9310h7656N688
$$ -177334 19856 206811 38983 -67178 -40917 452976 -150850 106733 39310 -87656 -81968
17858h1968E9743J92003P8393A38599E7899N6899a25657A58711c16030B74280
$$ -81968 59743 251746 330139 138599 57899 114798 -125657 158711 -316030 274280
17847B46013b31945j8468B4091h3331j44031i912j97G170N8078K9118O870j5784
$$ 246013 -231945 -250413 24091 -83331 -227362 -9912 -10109 7170 65248 94366 101236 85452
17835H5452L27731E5215J13411G6332b73771R3606A35460Q2894J69545A17836
$$ 85452 413183 55215 168626 76332 -273771 -180165 135460 218354 387899 117836
17824b69407C61496b017q4773A78560a4884D1387a12955q2463H7254c03393a36991
$$ -269407 361496 -2017 -86790 178560 -14884 41387 -112955 -195418 87254 -303393 -136991
17812A15146a31155B01976D7237m212J69195O8889a6777n51171B17943a88849
$$ 115146 -131155 201976 47237 43025 212220 281109 -16777 -567948 217943 -188849
17801b29885A18666a3670r4519A5661L0420K14094n1591L0972C4447L6626a86279
$$ -229885 118666 -13670 -108189 15661 46081 260175 208584 239556 34447 71073 -186279
17789A07077A8039J28985N8802E6688K68189h5970D4476N1573A4728K10923R1694
$$ 107077 18039 147024 205826 56688 324877 -85970 44476 96049 14728 225651 317345
17778C17345j40558j9289a27709j932J9180c0223j34962G5493J3906a13346k4933
$$ 317345 176787 157498 -127709 -129641 -110461 -30223 -165185 75493 89399 -113346 -138279
17767a38279A57941a95770o786D2364c4727q6264N1722p9402j52330A81614a39989
$$ -138279 157941 -195770 -202556 42364 -34727 -120991 -69269 -148671 -301001 181614 -139989
17755f2635k7993A4994J43204J61658A58990e0169B01617h0383k0375A63908J47384
$$ -62635 -90628 14994 158198 319856 158990 -50169 201617 -80383 -100758 163908 311292
17744C11292a48100A45160E1620b03792g0214A89772a63307a9570A74073F5985
$$ 311292 -148100 145160 51620 -203792 -70214 189772 -163307 -19570 174073 65985
17733B27133A01188N8239J58949a67087f7777A73291b2418D6594J72995A08207
$$ 227133 101188 159427 318376 -167087 -67777 173291 -22418 46594 219589 108207
17722A77743b58675k52648A85461j3928R0149k1119a13329B61979j02198m9743
$$ 177743 -258675 -511323 185461 171533 261682 240563 -113329 261979 159781 110038
17712A10038l7762a29037K112b1698p7511I7549D1316f323l4314A957c8054B94388
$$ 110038 72276 -129037 -126925 -21698 -99209 97549 41316 -6323 -40637 1957 -38054 294388
17699B91528d9040B1696L68241b3423H3919e0891B52223J44555j87450C2974N457
$$ 291528 -49040 21696 389937 -23423 83919 -50891 252223 396778 209328 32974 38431
17688C8431A5815a45325F8409k6718J97617p9518K5549q7971A853P4269l7355
$$ 38431 15815 -145325 68409 41691 239308 159790 185339 97368 1853 76122 38767
17677C8767J39334b28820C1593J58745a04157d2056A97062H6058a09357A36888
$$ 38767 178101 -228820 31593 190338 -104157 -42056 197062 86058 -109357 136888
17666B90497b1286A36081J31813A7268J70446c15507a51826H3989e5010G2468
$$ 290497 -21286 136081 267894 17268 187714 -315507 -151826 83989 -55010 72468
17655D447b4364G7881i881F7745c4315A81312O5118A7715b31876B63862K1886
$$ 4447 -24364 77881 -9881 67745 -34315 181312 246430 17715 -231876 263862 285748
17644B85748j06106K22394A85045r1960b599F8773L07409j73979f818k12267A41044
$$ 285748 179642 402036 185045 93085 -2599 68773 376182 202203 -6818 -219085 141044
17632B30552i3985b059G4979l3539a09921A96782H2877K44702f9405B72641l8766
$$ 230552 -93985 -2059 74979 41440 -109921 196782 82877 327579 -69405 272641 233875
17621B33875Q1627e5220B84270A09897R7712i1036A51279i2823G6952J99295b2141
$$ 233875 315502 -55220 284270 109897 207609 -91036 151279 -92823 76952 276247 -22141
17609F4781J44270G8514a52095g3850B81432F6471k9356g6528k54690c6155B5633
$$ 64781 209051 78514 -152095 -73850 281432 66471 37115 -76528 -331218 -36155 25633
17597B60166B2401q330J4676a00337C05056a49523g30k0691j13580C04517A28868
$$ 260166 22401 14071 28747 -100337 305056 -149523 -730 -21421 -135001 304517 128868
17585b39801A64637L5596a38208C91176A91092J09571A16130a84842A42293a17701
$$ -239801 164637 200233 -138208 391176 191092 300663 116130 -184842 142293 -117701
17574B64852m6248K42848o7234b02476B01201j9112J03309D8369J86029d0787
$$ 264852 218604 461452 394218 -202476 201201 182089 285398 48369 234398 -40787
17563B25269A06947l382Q0010Q591H8284a01874k06425b9324I8091N5996k4889
$$ 225269 106947 103565 183575 192166 88284 -101874 -308299 -29324 98091 154087 129198
17552A29198c7942k97816a06761H4950J62072A18533C9622b42126B50876b53745
$$ 129198 -37942 -335758 -106761 84950 247022 118533 39622 -242126 250876 -253745
17541a81696D26454e3676o6939B73480d5655C7290K04118J69520K28251b02065
$$ -181696 426454 -53676 -120615 273480 -45655 37290 241408 410928 639179 -202065
17530B16486N7474a82373A70452J25746E4354P9305N6035p0650J4176L08126a59054
$$ 216486 273960 -182373 170452 296198 54354 133659 189694 119044 133220 441346 -159054
17518B41322A5876K06364n8139K14503K8853p725K922Q6300Q2746j0996J94787
$$ 241322 15876 222240 164101 378604 407457 399732 402654 488954 571700 560704 755491
17507G55491K45052k05244C59556K26571B73082P6566J17224j74590J22757o8914
$$ 755491 1000543 795299 359556 586127 273082 349648 466872 292282 415039 346125
17497C46125J39922n207J8548J63887J09775Q6539j60674o9116A08761J18202
$$ 346125 486047 480840 499388 663275 773050 859589 698915 629799 108761 226963
17487B26963K10932r714E4241j9955L04999m2808H4080R0732A118L39717a71858
$$ 226963 437895 428181 54241 34286 339285 296477 84080 174812 1118 340835 -171858
17475A63889a13889D57601A93530I4548L53024k0556J68776B13468J02073j19415
$$ 163889 -113889 457601 193530 94548 447572 427016 595792 213468 315541 196126
17465A96126L254J30641J21656B17365M1186q6991J47442A8087L66319M6714p0088
$$ 196126 199380 330021 451677 217365 258551 171560 319002 18087 384406 431120 361032
17454C61032o3197N5868q1322K63397k23019A06226o655Q2979n2366M97276A17293
$$ 361032 297835 353703 272381 535778 312759 106226 99571 182550 130184 627460 117293
17442D06096Q8381A83934q4441K62124A29554E3787J1458M02202A57095L11161
$$ 406096 494477 183934 99493 361617 129554 53787 65245 467447 157095 468256
17432D68256j91598l1226o2051F4253K78852A27854M2426M1927K95593M3579p0266
$$ 468256 276658 245432 183381 64253 343105 127854 170280 212207 507800 551379 481113
17421D81113N4763j25868M2B00737E589J34539R3535N5837K19721p9529k4816
$$ 481113 535876 410008 410050 200737 5589 140128 233663 289500 509221 429692 404876
17410D04876n7024k7870A09041L24749B13286I3536K00582o8696l2730K96538
$$ 404876 347852 319982 109041 433790 213286 93536 294118 225422 192692 489230
17400D89230k18653L080L5792J74501o2318k7619j32832m7725K55791A60810k0221
$$ 489230 270577 273657 309449 483950 421632 394013 261181 213456 469247 160810 140589
17389A40589D0013L95924A50455L08662a27665b5345j29347F8560R7064G5607
$$ 140589 40013 435937 150455 459117 -127665 -25345 -154692 68560 165624 75607
17378c62044C34127e9042B16050p1364J85865L3274A81833J74080A27850J10309
$$ -362044 334127 -59042 216050 144686 330551 363825 181833 355913 127850 238159
17368B38159L2877j25766D683K86703J5070M6694n4135N2732h556B35212l6861
$$ 238159 271036 145270 4683 291386 306456 353150 299015 351747 -8556 235212 198351
17357A98351J17019d2840A61104A2678J91890J50943j28338K23253A60570a69359
$$ 198351 315370 -42840 161104 12678 204568 355511 227173 450426 160570 -169359
17346C13013j13701J88593F057P0874K25997q7587L72650j06208C3195M60749
$$ 313013 199312 387905 6057 76931 302928 215341 587991 481783 33195 493944
17336D93944H2345K73085K4465A03137M11303A38310J2981J48915p4359b28996
$$ 493944 82345 355430 379895 103137 514440 138310 151291 300206 225847 -228996
17325B78724K10232B31237Q2186j21311J25713P7634J05698D3165J57417J58867
$$ 278724 488956 231237 313423 192112 317825 395459 501157 43165 200582 359449
17315C59449K7555k6206D8224J22122n4004O7589d104k2783I9629L13523A41451
$$ 359449 387004 360798 48224 170346 116342 183931 -4104 -26887 99629 413152 141451
17303B22607r9261i9653C73845I2238f589q5933H5590J74053J90467J26703q3676
$$ 222607 123346 -99653 373845 92238 -6589 -92522 85590 259643 450110 576813 493137
17292D93137B07792K24386K11845k76423L8054A01236J12147D7987J45286J18722
$$ 493137 207792 432178 644023 367600 405654 101236 213383 47987 193273 311995
17282C11995H339J74232J41897A48652J9403O6232J03423j49653O2211K40640
$$ 311995 8339 182571 324468 148652 168055 234287 337710 188057 250268 490908
17272D90908B32336n0783J73917K8348l7584Q8707A67402N2149c2581G89625A94531
$$ 490908 232336 181553 355470 383818 346234 434941 167402 219551 -32581 789625 194531
17260F7766K68332C4927K70886j18663B9252L02677j26218J37858q2460F6450
$$ 67766 336098 34927 305813 187150 29252 331929 205711 343569 261109 66450
17249B43463F4319K31071J27051A92773J21749p14O7679j9159j59740J78783p5072
$$ 243463 64319 295390 422441 192773 314522 313808 381487 362328 202588 381371 306299
17238C06299D5469K53804o8456K26484B06819K77783j95732C7194O93658A50131
$$ 306299 45469 299273 230817 457301 206819 484602 288870 37194 730852 150131
17227A72316J42333J50101j33557H2452K4432K14128J31151A7507J15517J31891
$$ 172316 314649 464750 331193 82452 106884 321012 452163 17507 133024 264915
17217B64915R3267a2849B85133m6113M7568J87938j15449K45825B46848j4772
$$ 264915 358182 -12849 285133 239020 286588 474526 359077 604902 246848 232076
17207B32076J10259J99160B54186J80127j55523K06465j66054J1847A22485J08697
$$ 232076 342335 541495 254186 434313 278790 485255 319201 331048 122485 231182
17197B31182K51432O9505q1485k25979G4873R8000C0830L32707M4832K17216B96737
$$ 231182 482614 552119 470634 244655 74873 172873 30830 363537 408369 625585 296737
17185B47925K86517P0695B79708A07225J51025K75194k29074K7746A53457L4342
$$ 247925 534442 605137 279708 107225 258250 533444 304370 332116 153457 187799
17175A87799K27472A59799O37936B54007l8449Q5586M13435A18650M08076j57920
$$ 187799 415271 159799 797735 254007 215558 301144 714579 118650 526726 368806
17165C68806j82850J56312p3589J87787l6271A93649L23161K24164l38090K4524
$$ 368806 185956 342268 268679 456466 420195 193649 516810 740974 402884 427408
17155D27408J91355A33353K82958p9276J24717B06749K46118K994j26231R4957
$$ 427408 618763 133353 416311 337035 461752 206749 452867 455861 329630 424587
17145D24587K86874A46577L61397P301k06684j24077K34805J02271j27410J6460
$$ 424587 711461 146577 507974 515275 308591 184514 419319 521590 394180 410640
17135D10640A62482K22380J54744k07590M09452j76414A75629N11357k49444j77375
$$ 410640 162482 384862 539606 332016 741468 565054 175629 686986 437542 260167
17125B60167a61452D61909A79929J04112L03022B32168M08945k10557Q9029J06600
$$ 260167 -161452 461909 179929 284041 587063 232168 641113 430556 519585 626185
17115F26185A93115K13674J54295r9241n4368J45629k39464L08207r8907j04610
$$ 626185 193115 406789 561084 461843 407475 553104 313640 621847 522940 418330
17105D18330O0190j11694K79597p2011B44832K86265M4663j0284j30284J71238
$$ 418330 478520 366826 646423 574412 244832 531097 575760 565476 435192 606430
17095F06430k43273M67330j20877j82347j17807l8974M33410k30389r1059n9298
$$ 606430 363157 830487 709610 527263 409456 370482 803892 573503 482444 423146
17085D23146j69612N67195C89023L4951R1420j50381L24173C23033J97155j8520
$$ 423146 253534 820729 389023 423974 515394 365013 689186 323033 520188 501668
17075E01668J16427j48309L21842l08317R6157P4929R7250k9719J4732j86137
$$ 501668 618095 469786 791628 483311 579468 654397 751647 721928 736660 550523
17065E50523j42693Q3074J05197J58405l8979J04112J256k06323N6796J8473j22350
$$ 550523 407830 490904 596101 754506 715527 819639 820895 614572 671368 689841 567491
17054E67491L38417k76559p7158J31963P5317M483j30342K3248n472r2538J66850
$$ 567491 905908 629349 552191 684154 759471 763954 633612 656860 651388 558850 725700
17043G25700O0343k5092M31295n46602J39782K0386p814L0463L3495J22246j66052
$$ 725700 786043 760951 1192246 645644 785426 805812 797998 828461 861956 984202 818150
17032H18150m642Q149j89502L40429j79513R9928l34439M30437D22059K78333
$$ 818150 813508 821657 632155 972584 793071 892999 558560 988997 422059 700392
17022G00392L96147m53163Q2728P0924K80866k46616K24265m7812r4447l95963
$$ 700392 1096539 643376 726104 797028 1077894 831278 1055543 1007731 913284 517321
17012E17321O75698l48993J47657n9129m7915J29905k49574K13495k45471J37416
$$ 517321 1193019 844026 991683 932554 884639 1014544 764970 978465 732994 870410
17002H70410q5698L14716j57239l8000q6325J90311j15242j31783p4549L29456
$$ 870410 784712 1099428 942189 904189 817864 1008175 892933 761150 686601 1016057
16992A016057M1527P595k92510K89745J52776l57241K8313L49997j76606L2764
$$ 1016057 1057584 1065179 772669 1062414 1215190 857949 886262 1236259 1059653 1092417
16982A092417k81298J16315K14432J8696n9902L25389l04257k6j40367J93286
$$ 1092417 811119 927434 1141866 1160562 1100660 1426049 1121792 1121766 981399 1174685
16972A174685q8514M85224k68649m2866k07569r4312K82648j09752J03396l69824
$$ 1174685 1086171 1571395 1302746 1259880 1052311 957999 1240647 1130895 1234291 864467
16962H64467L90646k36452L13908k31201j00206L86740q7821l35520O55349n52034
$$ 864467 1255113 1018661 1332569 1101368 1001162 1387902 1300081 964561 1619910 1067876
16952A067876J53665k16565J04498J69120j07215L3602j27229O93000m71791m9515
$$ 1067876 1221541 1004976 1109474 1278594 1171379 1204981 1077752 1770752 1298961 1249446
16942A249446j17639L35617J66979l60048n2915R7566m9302K69889j00346R2622
$$ 1249446 1131807 1467424 1634403 1274355 1221440 1319006 1269704 1539593 1439247 1531869
16932A531869J4952j58002L80969k81009J37337K44174m55260J52724L4370L18954
$$ 1531869 1546821 1388819 1769788 1488779 1626116 1870290 1415030 1567754 1602124 1921078
16922A921078Q5029n59962L06861Q2900n545P8090j79710k59247M93332K78486
$$ 1921078 2006107 1446145 1753006 1835906 1830361 1908451 1728741 1469494 1962826 2241312
16912B241312m98030L12781l58044L77233l1235k23196J36730k77941L78405J59984
$$ 2241312 1743282 2056063 1698019 2075252 2044017 1820821 1957551 1679610 2058015 2217999
16902B217999k25068j30501J71732J3898K09397n072q2875K81493j71002k75436
$$ 2217999 1992931 1862430 2034162 2048060 2257457 2252385 2169510 2451003 2280001 2004565
16892B004565J49564K46589j7972L2734O9169l17990J59387K01954r9428n6873
$$ 2004565 2154129 2400718 2382746 2415480 2484649 2166659 2326046 2528000 2428572 2371699
16882B371699N0564K27022j58224J01954k3817K73432j83356L00906m46463K54865
$$ 2371699 2422263 2649285 2491061 2593015 2569198 2842630 2659274 2960180 2513717 2768582
16872B768582P8486K07309q6421L478j27035J84989O8128p3497j11400L90402
$$ 2768582 2847068 3054377 2967956 2971434 2844399 3029388 3097516 3024019 2912619 3303021
16862C303021q7219J01864j70551L79292J45496j79561O6106J498j60377J16894
$$ 3303021 3215802 3317666 3147115 3526407 3671903 3492342 3558448 3559946 3399569 3516463
16852C516463J69285j31568K54241R0124j32126K97270r8866J75467p8160L96753
$$ 3516463 3685748 3554180 3808421 3898545 3766419 4063689 3964823 4140290 4062130 4458883
16842D458883n24882L53126j55516K88665K95979k01237J09023j67755M61919
$$ 4458883 3934001 4287127 4131611 4420276 4716255 4515018 4624041 4456286 4918205
16833D918205N823p9642K24782o1867K23352N0805M9845L06688r5950M3020K53376
$$ 4918205 4924028 4844386 5069168 5007301 5230653 5281458 5331303 5637991 5542041 5585061 5838437
16822E838437m7898r4048L31545Q863J70393K69243k27160L40217K95727k95270
$$ 5838437 5790539 5696491 6028036 6036899 6207292 6476535 6249375 6589592 6885319 6590049
16812F590049K96682l60620N45015L65507j04501J7708M69922O5502j07162K79395
$$ 6590049 6886731 6526111 7071126 7436633 7332132 7349840 7819762 7885264 7778102 8057497
16802H057497n3690M24590J59548J76499J59575K16955M2673L23415J9875N42787
$$ 8057497 8003807 8428397 8587945 8764444 8924019 9140974 9183647 9507062 9526937 10069724
16792A0069724J69994k54194Q87813K73068M8371o0577M23302M92307Q5915K75368
$$ 10069724 10239718 9985524 10873337 11146405 11194776 11134199 11557501 12049808 12135723 12411091
16782A2411091L27769J82645M80512K88474M22198L69598J04232M27018L91567
$$ 12411091 12738860 12921505 13402017 13690491 14112689 14482287 14586519 15013537 15405104
16773A5405104Q89708K4225N42539K67583N27889M25527O74506M80845R29778
$$ 15405104 16294812 16319037 16861576 17129159 17657048 18082575 18757081 19237926 20167704
16764B0167704L75268L97423Q81959K18925J036860Q10778N46838R33932J062498
$$ 20167704 20542972 20940395 21822354 22041279 23078139 23888917 24435755 25369687 26432185
16755B6432185Q93011O14536J022893R47609J144566R93279J351012Q86344J315568
$$ 26432185 27325196 27939732 28962625 29910234 31054800 32048079 33399091 34285435 35601003
16746C5601003J420364J411217J762262J395479J858611J637953J448757K084538
$$ 35601003 37021367 38432584 40194846 41590325 43448936 45086889 46535646 48620184
16738D8620184J672490K533737K081933K250130K319781K524450K391553K941066
$$ 48620184 50292674 52826411 54908344 57158474 59478255 62002705 64394258 67335324
16730F7335324K840761L041843K956447K963129L179536L163294L843433L409526
$$ 67335324 70176085 73217928 76174375 79137504 82317040 85480334 89323767 92733293
16722I2733293L151115L987410L528705L788004L133072L584411L458377L282745
$$ 92733293 95884408 99871818 103400523 107188527 110321599 113906010 117364387 120647132
16714A20647132K900475K712104K623854K789958J042429J815488J320148K15423
$$ 120647132 123547607 126259711 128883565 131673523 132715952 134531440 135851588 136067011
16706A36067011O03777m24726l31451j200229j534010j632716k487259j921378
$$ 136067011 136670788 136246062 135914611 134714382 133180372 131547656 129060397 127139019
16698A27139019l133999k817917l273251l175780l232848m106980l328983l853956
$$ 127139019 124005020 121187103 117913852 114738072 111505224 107398244 104069261 100215305
16690A00215305l547177l632466l335828l567126l088121l581685l192825l171943
$$ 100215305 96668128 93035662 89699834 86132708 83044587 79462902 76270077 73098134
16682G3098134k926491l001731k387678k791734k516928k565066k026861k303318
$$ 73098134 70171643 67169912 64782234 61990500 59473572 56908506 54881645 52578327
16674E2578327j995430k137478j738959j920341j514524j995174j709058j431650
$$ 52578327 50582897 48445419 46706460 44786119 43271595 41276421 39567363 38135713
16666C8135713j084045j535688j396953q25271j372520j279265j081593p53842
$$ 38135713 37051668 35515980 34119027 33293756 31921236 30641971 29560378 28806536
16658B8806536r90150j055347o09959j170835p41174p77778r01579n6519r03197
$$ 28806536 27816386 26761039 26151080 24980245 24239071 23461293 22559714 22503195 21599998
16649B1599998r82355m34249p37887l99343m65348n92541m75870q58084L4703
$$ 21599998 20617643 20183394 19445507 19046164 18580816 17988275 17512405 16654321 16689024
16640A6689024n94891l18606m94511k76645o18884o24041K20474n34949k20684
$$ 16689024 16094133 15775527 15281016 15004371 14385487 13761446 13981920 13446971 13226287
16631A3226287m52721o44025J25511m28270o4297m56405k91854j29819m47826
$$ 13226287 12773566 12129541 12255052 11826782 11762485 11306080 11014226 10884407 10436581
16622A0436581l18017K9369o74994L66760o05770K60957n28503N0002l44956P1199
$$ 10436581 10118564 10147933 9472939 9839699 9233929 9494886 8966383 9016385 8671429 8742628
16612H742628n00195k38423J53675j38931j16010k73307k57834J34096m6500o31038
$$ 8742628 8242433 8004010 8157685 8018754 7902744 7629437 7371603 7505699 7459199 6828161
16602F828161Q1157J07982m47663J23777l38518J1002k61622j30824J34719j53534
$$ 6828161 6909318 7017300 6569637 6693414 6354896 6365898 6104276 5973452 6108171 5954637
16592E954637m16322L84418l72769j03803R1887j20394l50722L4389j85544j6170
$$ 5954637 5538315 5922733 5549964 5446161 5538048 5417654 5066932 5101321 4915777 4899607
16582D899607J54943o6960n80902q0651K37659k28487J5016K35945n98104K42476
$$ 4899607 5054550 4987590 4406688 4326037 4563696 4335209 4350225 4586170 3988066 4230542
16572D230542K7859k18578K56474K45345m26602j18196j97545J30921j78492j29834
$$ 4230542 4258401 4039823 4296297 4541642 4115040 3996844 3799299 3930220 3751728 3621894
16562C621894p8469k2243q2587K41910l71895J46026k62030J8267J34846k8790
$$ 3621894 3543425 3521182 3438595 3680505 3308610 3454636 3192606 3210873 3345719 3316929
16552C316929l7215j14548K34347j01113j40890l6440j60485k13626N15156m29533
$$ 3316929 3279714 3165166 3399513 3298400 3157510 3121070 2960585 2746959 3262115 2832582
16542B832582M8271r2023J03670r1470r0823l15970Q1492O1209k8998J52324j03959
$$ 2832582 2880853 2788830 2892500 2801030 2710207 2394237 2475729 2536938 2507940 2660264 2556305
16531B556305k76563L67133j72833K069k90401L11198k49484P4192p2289J5721
$$ 2556305 2279742 2646875 2474042 2476111 2185710 2496908 2247424 2321616 2249327 2265048
16521B265048k47989k38104M55987Q2271l76099J29200m0386k172p064Q8849r1892
$$ 2265048 2017059 1778955 2234942 2317213 1941114 2070314 2029928 2027756 2020692 2109541 2017649
16510B017649j87627M06532l36766Q3847j30678L93696k79021L658j92847j05370
$$ 2017649 1830022 2236554 1899788 1983635 1852957 2246653 1967632 1971290 1778443 1673073
16500A673073J07677K11745l5111l40740L68445l05808n7238K78058j58658j09098
$$ 1673073 1780750 1992495 1957384 1616644 1985089 1679281 1622043 1900101 1741443 1632345
16490A632345J61773k75617l3692L64359m93954M49051j05345k86650r5455K63098
$$ 1632345 1794118 1518501 1484809 1849168 1355214 1804265 1698920 1412270 1316815 1579913
16480A579913m6197j13111K9418q7421J65682J27672k53833j26236K26225K14494
$$ 1579913 1533716 1420605 1450023 1362602 1528284 1655956 1402123 1275887 1502112 1716606
16470A716606l89114J08611q1333j01525M2987j92597J38726j52105M6761j8186
$$ 1716606 1327492 1436103 1354770 1253245 1296232 1103635 1242361 1090256 1137017 1118831
16460A118831L74061l19746n817r9188N9160R5112k6877J23973J51158k02602
$$ 1118831 1492892 1173146 1167329 1068141 1127301 1222413 1195536 1319509 1470667 1268065
16450A268065k17974K74403k18939k8680l4437J39772Q4296K9865k33659K1231
$$ 1268065 1050091 1324494 1105555 1076875 1042438 1182210 1266506 1296371 1062712 1083943
16440A083943L52875m22646J24347J7082L87585m65629L32587l40956k32235J09672
$$ 1083943 1436818 1014172 1138519 1155601 1543186 1077557 1410144 1069188 836953 946625
16430I46625M9152J77866l97357M03657J82601p8998k37700l28623M01980m8277
$$ 946625 995777 1173643 776286 1179943 1362544 1283546 1045846 717223 1119203 1070926
16420A070926j47246o4651J750L69647q2911k90387K06132k60758K16910K92641
$$ 1070926 923680 859029 860779 1230426 1147515 857128 1063260 802502 1019412 1312053
16410A312053m22906K09226k91252N17J01847l0673j59635N5316L4636p2042K35292
$$ 1312053 889147 1098373 807121 807638 909485 878812 719177 774493 809129 737087 972379
16399I72379j63885m2828K367j10955J24892k9055k33117M07339l07329J25544
$$ 972379 808494 765666 768033 657078 781970 752915 519798 927137 619808 745352
16389G45352K6381P2222P3873r7433j77289L6963J51083M8824j82623N3549k09041
$$ 745352 771733 843955 917828 820395 643106 680069 831152 879976 697353 750902 541861
16378E41861M52720D92323M15162j57320k50248J11704K05620j77384J91931R2883
$$ 541861 994581 492323 907485 750165 499917 611621 817241 639857 831788 924671
16368I24671k64334K21920R1143k13144j16199K70552l22421q1032J31250j0051
$$ 924671 660337 882257 973400 760256 644057 914609 592188 511156 642406 632355
16358F32355J96439l98941K22761j44868O0600K65913k35704K0606q568k7629
$$ 632355 828794 429853 652614 507746 568346 834259 598555 619161 610593 582964
16348E82964K35507k2592j75472O1115P3051n5914B86135L03101J33282m4822
$$ 582964 818471 795879 620407 681522 754573 698659 286135 589236 722518 677696
16338F77696Q9345B55421L21705k01375O7004J22163P3136p1704m4662l5205K78939
$$ 677696 767041 255421 577126 375751 442755 564918 638054 566350 521688 486483 765422
16327G65422J14246k22695j78577J88607J02975A10445O26298j65562l775j68090
$$ 765422 879668 656973 478396 667003 769978 110445 736743 571181 567406 399316
16317C99316K49101k97750R5808N445L47197C83312J34523k5650J98008k01114
$$ 399316 648417 350667 446475 451920 799117 383312 517835 492185 690193 489079
16307D89079q783K3597k33441M58032j86594B51132J7559L8858j9274R8786A33423
$$ 489079 480296 503893 270452 728484 541890 251132 268691 307549 288275 387061 133423
16295C93636M1216K3975j72151J06582J42291q5186N4422l1853o8929n5528H5729
$$ 393636 434852 458827 286676 393258 535549 450363 504785 472932 404003 348475 85729
16283B84231P4406P226F1350K41477J96075J93492B84131L80484C04369o3120
$$ 284231 358637 365863 61350 302827 498902 692394 284131 664615 304369 241249
16273B41249j5470J92318A30767L01972j7590J93143K18353h6276B07877J68140
$$ 241249 225779 418097 130767 432739 415149 608292 826645 -86276 207877 376017
16263C76017A83687M22987k46055K18066k70263K52q651p2132J10630r9348M13230
$$ 376017 183687 606674 360619 578685 308422 308674 300023 227891 338521 239173 652403
16252F52403D4535K53112f1059A66197R1749J42015J59874j89960q5446J40959
$$ 652403 44535 297647 -61059 166197 257946 399961 559835 369875 284429 425388
16242D25388l7829D0445L72127K97533i9798A16172L36762c9689E12528B25122
$$ 425388 387559 40445 412572 710105 -99798 116172 452934 -39689 512528 225122
16231B44266K28620j98519Q9735A23549M53827j17090B16038J27023A20363J19719
$$ 244266 472886 274367 364102 123549 577376 460286 216038 343061 120363 240082
16221B40082H0424K60463q8991j08579J89228J70705A84020J87619a02497C56591
$$ 240082 80424 340887 251896 143317 332545 503250 184020 371639 -102497 356591
16210D51030j78294j04547C7500K44442A06865k4462K15270A47392K83452j08571
$$ 451030 272736 168189 37500 281942 106865 82403 297673 147392 430844 322273
16200C22273j41476M20343k93378I0972L39817k10899K811O3184j26544o8781
$$ 322273 180797 601140 307762 90972 430789 219890 222701 285885 159341 90560
16190I0560J01048J67489M9647j86849J24349M1519J08025g0000B51493p5367
$$ 90560 191608 359097 408744 221895 346244 387763 495788 -70000 251493 176126
16180A76126l3227O8625a33181D12159A53278K28000j14216N7001F8623A6544
$$ 176126 142899 211524 -133181 412159 153278 381278 267062 324063 68623 16544
16169a02079C53288J56506A92940m7412R5588J13116L046G655P1633J59071J46906
$$ -102079 353288 509794 192940 145528 241116 354232 357278 7655 79288 238359 385265
16158C85265J03394C7802Q0922L0624a39146A35759B5576L9522L81734f2055A87814
$$ 385265 488659 37802 118724 149348 -139146 135759 25576 65098 446832 -62055 187814
16146B83234k2388N1100f843B47965B1092a33521H3727L92569n8097j37461j06175
$$ 283234 260846 311946 -6843 247965 21092 -133521 83727 476296 418199 280738 174563
16135A74563K0832K7844A7998J66174n3000n1168e0762A29710J44721j13562Q7002
$$ 174563 195395 223239 17998 184172 131172 80004 -50762 129710 274431 160869 247871
16124B47871j08403J2286J67413p0598a15682A20011b5798n9222A81678L32879
$$ 247871 139468 151754 319167 248569 -115682 120011 -25798 -85020 181678 514557
16114E14557a97420F6748a73643c4112A03703j0679N3861K8797d0366B28305A11251
$$ 514557 -197420 66748 -173643 -34112 103703 93024 146885 175682 -40366 228305 111251
16102F1959j0316R8578N0507M2674a51862B5348J98512A3291a77581A77466J35676
$$ 61959 51643 150221 200728 243402 -151862 25348 223860 13291 -177581 177466 313142
16091C13142o7780H9818d4856B27906d6665B97912e5823A56634a50895G4318M7633
$$ 313142 245362 89818 -44856 227906 -46665 297912 -55823 156634 -150895 74318 121951
16080A21951K35739H6855b14065D5039K09628a50163A67697c0736G0084a62741
$$ 121951 357690 86855 -214065 45039 254667 -150163 167697 -30736 70084 -162741
16069A12455K6957J1964J7593m3079K1659J2240B6813J8916b83018R5757M3600
$$ 112455 139412 151376 168969 125890 147549 159789 26813 45729 -283018 -187261 -143661
16058a43661A32473o5339B0522J29986f9924A18307a34606d5393a0975G2360b4554
$$ -143661 132473 67134 20522 150508 -69924 118307 -134606 -45393 -10975 72360 -24554
16046b7449B17942a18627d4617c274A5541K61966a07720n9480A24807j8853A6749
$$ -27449 217942 -118627 -44617 -3274 15541 277507 -107720 -167200 124807 105954 16749
16034B100a44278C80952C9239a727I7963j8012b36562J01950I7292Q216J87105
$$ 2100 -144278 380952 39239 -1727 97963 79951 -236562 -134612 97292 105508 292613
16023B92613e7494F4589K85306A09755a76139E003J31764J77401f5077A73551
$$ 292613 -57494 64589 349895 109755 -176139 5003 136767 314168 -65077 173551
16012H4570d2317A55907g4329F4296b51942d0133C83335j78517a07987B0892a46303
$$ 84570 -42317 155907 -74329 64296 -251942 -40133 383335 204818 -107987 20892 -146303
16000C6665J41706g8005C28504B2375J6988M9856C1558Q3097c42200f7396A77643
$$ 36665 178371 -78005 328504 22375 39363 89219 31558 114655 -342200 -67396 177643
15988A85519a84526H1176a9434o1360b8797B8706P6513K83950j9298b16123a8015
$$ 185519 -184526 81176 -19434 -80794 -28797 28706 105219 389169 369871 -216123 -18015
15976a4449F2115J64266C1215J36182m5405O31473l05052K41568O0399M4349j82665
$$ -14449 62115 226381 31215 167397 121992 753465 448413 689981 750380 794729 612064
15965F12064k39602A31123J19017j3091m3973a30731d3461A80886A8g6293B45576
$$ 612064 372462 131123 250140 237049 193076 -130731 -43461 180886 18 -76293 245576
15953a28428B71147b22231c9600m02596A43316J27618b7547j52825O0888n8235
$$ -128428 271147 -222231 -39600 -442196 143316 270934 -27547 -180372 -119484 -177719
15943a77719A78695J01315F3709J46972a47974D7545c8427H9823n348L48502A19640
$$ -177719 178695 280010 63709 210681 -147974 47545 -38427 89823 84475 432977 119640
15931a21644r7547P5719d3118B66428a27497q2370N5512A84149L6250B3288J04639
$$ -121644 -219191 -143472 -43118 266428 -127497 -209867 -154355 184149 220399 23288 127927
15920A27927B6464a02979C5549e9524p3488r9426h1051b5016l01551c2812k20123
$$ 127927 26464 -102979 35549 -59524 -133012 -232438 -81051 -25016 -326567 -32812 -252935
15909b52935h2818C1720c3310F2288b79282H3022d1053l91382a84493C7514L71592
$$ -252935 -82818 31720 -33310 62288 -279282 83022 -41053 -432435 -184493 37514 409106
15898D09106I4496c32133A47121c10738C1621g7439E0487A6098b22975R9521O556
$$ 409106 94496 -332133 147121 -310738 31621 -77439 50487 16098 -222975 -123454 -116898
15887a16898B96338G8890d9664E461b43782H1292a16756M959p0399o5245g6876
$$ -116898 296338 78890 -49664 5461 -243782 81292 -116756 -111797 -182196 -247441 -76876
15875A9546a24438j56910f091A0131N9810a213l6016A11869c03718a07841e229
$$ 19546 -124438 -281348 -6091 10131 69941 -1213 -37229 111869 -303718 -107841 -5229
15863I7674N1046e4534H1381b12379B4589b10935c7054I3419i3557c8858j94696
$$ 97674 148720 -54534 81381 -212379 24589 -210935 -37054 93419 -93557 -38858 -233554
15852b33554f0865l2089j81700l9290d2005d998A34118F3579a98342R4536a1885
$$ -233554 -60865 -92954 -274654 -313944 -42005 -4998 134118 63579 -198342 -103806 -11885
15840C23894d60326B3057a33867q5680C53463A31541M8439a96567i3031L0616
$$ 323894 -460326 23057 -133867 -219547 353463 131541 179980 -196567 -93031 -62415
15830f2415j19179g7714j60049k4546i7920B10033E370L888a19550B5086h9099
$$ -62415 -181594 -77714 -237763 -262309 -97920 210033 5370 9258 -119550 25086 -89099
15818A97524J31813c68707I4511e5934A29991b05634A69844B3205d3389n1570
$$ 197524 329337 -368707 94511 -55934 129991 -205634 169844 23205 -43389 -94959
15808i4959c7680j0668o5899A00707a50109A57307f946j2096A42821M4224o6935
$$ -94959 -37680 -48348 -114247 100707 -150109 157307 -6946 -19042 142821 187045 120110
15797A20110b11439F2736M6594N3428J59895a70517O9158r8718L8955A00167C9407
$$ 120110 -211439 62736 109330 162758 322653 -170517 -101359 -200077 -161122 100167 39407
15785D3808J16315a62083J7044A01630a92693p8872E9340J60524J61163d9222
$$ 43808 160123 -162083 -145039 101630 -192693 -271565 59340 219864 381027 -49222
15774a0573B14439c48837h9430A25674j3855g0393C55232q0832a14020B83510
$$ -10573 214439 -348837 -89430 125674 111819 -70393 355232 274400 -114020 283510
15763A92436n2619E2672b5935k39598D01947b29539p180A03799a68399D0862b24892
$$ 192436 139817 52672 -25935 -265533 401947 -229539 -236719 103799 -168399 40862 -224892
15751a93626B22050c20972J31671o787b4791j25106a7796A4998g3308B07414B9009
$$ -193626 222050 -320972 -189301 -196088 -24791 -149897 -17796 14998 -73308 207414 29009
15739A61121M8813K5196I3767b2021j9690J1871m0154o6238k8072A37332L867
$$ 161121 209934 235130 93767 -22021 -41711 -29840 -69994 -136232 -164304 137332 141199
15728A41199g5813q2436d9729j7248A76953c14423a37829p0370b289k23658N5805
$$ 141199 -75813 -158249 -49729 -66977 176953 -314423 -137829 -208199 -2289 -225947 -170142
15717a70142b2475C31960b6288O650j24070I2484J28536K9912A10376g8450A81441
$$ -170142 -22475 331960 -26288 -19638 -143708 92484 221020 250932 110376 -78450 181441
15705d1791j08693l20648a01282q8640d3258n2700d5560F3646a4734l34156E8548
$$ -41791 -150484 -471132 -101282 -189922 -43258 -95958 -45560 63646 -14734 -348890 58548
15693A83695a11570c0980j67866B48530b49487E8169H018c10674C6570J0402c51436
$$ 183695 -111570 -30980 -198846 248530 -249487 58169 8018 -310674 36570 46972 -351436
15681a12633A54929f995D68867a57270A47979i5883B3739O9941e9285j843k13758
$$ -112633 154929 -6995 468867 -157270 147979 -95883 23739 93680 -59285 -61128 -274886
15670b74886A97651p1302h2383l6662j33168C62482I9897a01295R422k08900b0739
$$ -274886 197651 126349 -82383 -119045 -252213 362482 99897 -101295 -91873 -300773 -20739
15658C2308a4185k06327c76D5983a0876B6964b05688A555J61388c33123O8114
$$ 32308 -14185 -220512 -376 45983 -10876 26964 -205688 1555 162943 -333123 -265009
15647b65009C28590A09037a20156j46905P0287B51070A10753J00926c36732B7670
$$ -265009 328590 109037 -120156 -267061 -196774 251070 110753 211679 -336732 27670
15636A7669g5296j58411a2595L868j24112p2200B9466R8254b37035A20429d5853
$$ 17669 -75296 -233707 -12595 -8727 -132839 -205039 29466 127720 -237035 120429 -45853
15624C4660n203a71449c1240m5657m06674a21643A04002b31980A14260a08957
$$ 34660 29457 -171449 -31240 -76897 -483571 -121643 104002 -231980 114260 -108957
15613D8438b17768j97412P9319a9076k5577j87968N1496L3427D1257c3571D7338
$$ 48438 -217768 -415180 -335861 -19076 -44653 -232621 -181125 -147698 41257 -33571 47338
15601a56896A84673r0079B2060d6078q2188G7824F943J11254b9265q8127j35596
$$ -156896 184673 94594 22060 -46078 -128266 77824 6943 118197 -29265 -117392 -252988
15590b52988H1389R0766A9430J30158b58284A44930E4698J00099e3668o2032M9308
$$ -252988 81389 172155 19430 149588 -258284 144930 54698 154797 -53668 -115700 -66392
15579f6392j41336k06666C1078c5594o9871C9791a06011N684B66261b15239B49704
$$ -66392 -207728 -414394 31078 -35594 -105465 39791 -106011 -100327 266261 -215239 249704
15567a89616F0388c2137E3564A4388i5533D9253a18547D5227g7674E8500O1756
$$ -189616 60388 -32137 53564 14388 -95533 49253 -118547 45227 -77674 58500 120256
15556A20256a13605k34828a44353A80470e2042D56103A27553a09961n6903j1878
$$ 120256 -113605 -348433 -144353 180470 -52042 456103 127553 -109961 -166864 -178742
15546a78742G3808J17550f8842F9699I567b51181A41490C1047J7901j5689A2368
$$ -178742 73808 191358 -68842 69699 9567 -251181 141490 31047 48948 33259 12368
15534b51044e4814F5820B0042J61707a02662B75300n5969a26287r3389f6172a1536
$$ -251044 -54814 65820 20042 181749 -102662 275300 219331 -126287 -219676 -66172 -11536
15522C4204a14021B9560J7912a07530a8823F5280a11447C3798K03044o3628O8109
$$ 34204 -114021 29560 47472 -107530 -18823 65280 -111447 33798 236842 173214 241323
15511B41323A9096c92750A42281c0759A81345a67284c2181E5688a19D5611R3822
$$ 241323 19096 -392750 142281 -30759 181345 -167284 -32181 55688 -119 45611 139433
15500A39433F8300J58364A09797b70183B49673K55594d3175B29701a41988A03012
$$ 139433 68300 226664 109797 -270183 249673 505267 -43175 229701 -141988 103012
15489B56563L4695e4628j94652C50336b60625A56544l7066L38372G0436O0226
$$ 256563 291258 -54628 -249280 350336 -260625 156544 119478 457850 70436 130662
15479A30662d0827D23035F3633K88757A37539a94925D3289a28420A39489c2207
$$ 130662 -40827 423035 63633 352390 137539 -194925 43289 -128420 139489 -32207
15468a32546j82909J7703E21746j97487A06056P8263g6195C47655j00436a9980
$$ -132546 -315455 -297752 521746 324259 106056 184319 -76195 347655 247219 -19980
15457A99046L33620j32582A66768D1608N6809j3064C1708g1884J5529A72727J5279
$$ 199046 532666 400084 166768 41608 98417 85353 31708 -71884 -56355 172727 188006
15446A88006a24487I7475J73k6262K00802e3993B7997J72146M9410H0278B9644
$$ 188006 -124487 97475 97648 71386 272188 -53993 27997 200143 249553 80278 29644
15434a43513A57445B8214K87073A24794A299K03616c6762C45483M13646j11520
$$ -143513 157445 28214 315287 124794 1299 204915 -36762 345483 759129 647609
15424F47609J63545P2479D14714A44076L46150J52654E5104J10373o7458M571
$$ 647609 811154 883633 414714 144076 490226 642880 55104 165477 98019 102590
15414A02590b66286B54259B0248O7214J63945c04369A00987b58744k23770A58467
$$ 102590 -266286 254259 20248 87462 251407 -304369 100987 -258744 -482514 158467
15403A35189a29163j41674J13860B13050e1266B9597a41712M6466C49900i9464
$$ 135189 -129163 -270837 -156977 213050 -51266 29597 -141712 -95246 349900 -99464
15392a59660a9282F3128g6288b9208q8997G9006M7478E1395h9100A28834C7966
$$ -159660 -19282 63128 -76288 -29208 -118205 79006 126484 51395 -89100 128834 37966
15380A50223a29573j67509F1746a31491m9298q2884P2321A10053C8055A0235a87461
$$ 150223 -129573 -297082 61746 -131491 -180789 -263673 -191352 110053 38055 10235 -187461
15368A75576D0544J70537I4464J43536d33078a68051A61166A9255J79701J9880
$$ 175576 40544 211081 94464 238000 -433078 -168051 161166 19255 198956 218836
15358B18836I8598l1800a12572A39582B4387c5466A96016F984K29665I0024O6632
$$ 218836 98598 66798 -112572 139582 24387 -35466 196016 6984 236649 90024 156656
15347A56656Q4576A18448a64009D4205M90342k35812K04293B40721a023H4910
$$ 156656 241232 118448 -164009 44205 534547 298735 503028 240721 -1023 84910
15336A7472b9284A37918N0859n0079J55964j13888f0608A47853K40791d6567B35775
$$ 17472 -29284 137918 188777 138698 294662 180774 -60608 147853 388644 -46567 235775
15324C89567j37785B4103m024M59844g9383b6556F8008b0457A80949i341A78426
$$ 389567 251782 24103 20079 479923 -79383 -26556 68008 -20457 180949 -9341 178426
15312A03116Q5189a20388g930B14127a14643A15900P5718d3745B1458d7800k1691
$$ 103116 188305 -120388 -7930 214127 -114643 115900 191618 -43745 21458 -47800 -69491
15301f9491l28739g3294A02991M05763E8660g9726B21594J04982q5686l4732J04804
$$ -69491 -398230 -73294 102991 508754 58660 -79726 221594 326576 240890 206158 310962
15290C10962J9304A15281c05776A43410C6536a36840r5368O618A53457a31167
$$ 310962 330266 115281 -305776 143410 36536 -136840 -232208 -225590 153457 -131167
15279H4360a92265B52484A00448a92212A14615E5777Q7616D542i0768B45720C0084
$$ 84360 -192265 252484 100448 -192212 114615 55777 143393 4542 -90768 245720 30084
15267A36141P8177i0792B92515j04311a07868C15477l2493A25965h0931B43801
$$ 136141 214318 -90792 292515 188204 -107868 315477 282984 125965 -80931 243801
15256E7243b45655A14152a0961A35087A972K73693A17260O6684b2214E8647b09313
$$ 57243 -245655 114152 -10961 135087 1972 275665 117260 183944 -22214 58647 -209313
15244d3295j17795c1286A25730i2119A95039l1081O7815n6645f0372o3863E1518
$$ -43295 -161090 -31286 125730 -92119 195039 163958 231773 175128 -60372 -124235 51518
15232B19199J16982j7228L50457N79441M51672j40946l80831K64930F01325G9678
$$ 219199 336181 318953 669410 1248851 1700523 1559577 1178746 1443676 601325 79678
15221C58665G1321J96732a30979A94159c8500C5795R6273c17658a10983C7151
$$ 358665 71321 268053 -130979 194159 -38500 35795 132068 -317658 -110983 37151
15210C5330a01880b6110I6236L2992J64486a27349d8997p5506C3967e7131G9299
$$ 35330 -101880 -26110 96236 129228 293714 -127349 -48997 -124503 33967 -57131 79299
15198g5170G0027N24034B32171j01514c8627n5383A88164J15077a27967B68512
$$ -75170 70027 594061 232171 130657 -38627 -94010 188164 303241 -127967 268512
15187B94857j39236c39512a0549A0503Q329M1231j3415b20424A39789a38289A92575
$$ 294857 155621 -339512 -10549 10503 18832 60063 46648 -220424 139789 -138289 192575
15175B69749j3384j4232J56349n9035a53634A39309g4486C09284q3147h3567A27237
$$ 269749 256365 242133 398482 339447 -153634 139309 -74486 309284 226137 -83567 127237
15163C94657l7910b6912A43717R299N962b33458a1226C04266h1023b0080I1927
$$ 394657 356747 -26912 143717 153016 158978 -233458 -11226 304266 -81023 -20080 91927
15151F5851M16d8761B10509e3733A55298F4287A9851L07608a45355A90045A9368
$$ 65851 66267 -48761 210509 -53733 155298 64287 19851 327459 -145355 190045 19368
15139A07204J20448a20275A24484D8423f2376G2527N4463f3021A31028J0070b48697
$$ 107204 227652 -120275 124484 48423 -62376 72527 126990 -63021 131028 141098 -248697
15127A11103M139Q2475I8724P4261f6538A67417k185E6371a1959A21864B8724
$$ 111103 115242 197717 98724 172985 -66538 167417 165232 56371 -11959 121864 28724
15115I8074k0231h8383i736B38J13448M81194a638j8141A70279J90890A40759
$$ 98074 77843 -88383 -9736 238 113686 594880 -1638 -19779 170279 361169 140759
15103E2981M03539A51925b7642C02122C9379M23255n0615q5060H9151J44066a67148
$$ 52981 456520 151925 -27642 302122 39379 462634 412019 326959 89151 233217 -167148
15091B6948K40541r3597B0514K94227I0463J37341l0462a17024b6408C9359e3242
$$ 26948 267489 173892 20514 314741 90463 227804 197342 -117024 -26408 39359 -53242
15079F1181a31209A45309n6443a45114C36061C1932J89668E6941O0049K6801J57515
$$ 61181 -131209 145309 88866 -145114 336061 31932 221600 56941 116990 143791 301306
15068C01306e1465A17235l2324j5928J28147o9435J23055J46242I1361R5257l8810
$$ 301306 -51465 117235 84911 68983 197130 127695 250750 396992 91361 186618 147808
15057A47808j2334j8682J12614E9983a08665A76687A3671L89986B1091f098B17117
$$ 147808 135474 116792 229406 59983 -108665 176687 13671 403657 21091 -6098 217117
15045B13410A04962G386J94042n8475J61932j7292j00255k3452b4566A59750M5089
$$ 213410 104962 7386 201428 142953 304885 287593 187338 163886 -24566 159750 204839
15034B04839J77145A84990J1580K708K68634A90605J82100j38858J7163K7150
$$ 204839 381984 184990 196570 199278 467912 190605 372705 233847 251010 278160
15024B78160r5242K62759B09471n0562K61580B07981l8237J41337J13501Q8114
$$ 278160 182918 445677 209471 158909 420489 207981 169744 311081 424582 512696
15014E12696N719J14442j64093J67978j53189r1231P4609M0366j41585A77869
$$ 512696 518415 632857 468764 636742 483553 392322 466931 507297 365712 177869
15003D76022B01380O0625K21592h2758D32010M5316A10521J60612l2816A12295
$$ 476022 201380 262005 483597 -82758 432010 477326 110521 271133 238317 112295
14992C17279I3948K55101K28157r8549A56255O5677K53894r3637K34671A73714
$$ 317279 93948 349049 577206 478657 156255 221932 475826 382189 616860 173714
14981E57553j83004K82707m9307j38444J59077B86695Q2268J19898m2293j14213
$$ 557553 374549 657256 607949 469505 628582 286695 368963 488861 446568 332355
14971C32355J26307L7696Q0031j42785J98931k64884R2602J43877k2822j225o9061
$$ 332355 458662 496358 576389 433604 632535 367651 460253 604130 581308 580083 511022
14960E11022A75802j6175J92991m7075P9008A14040K42283L61298C02622q28C8266
$$ 511022 175802 159627 352618 305543 384551 114040 356323 717621 302622 301794 38266
14948C14491K4103R2308o4345R095j16673L7947A35651M75431k14230A58707K68443
$$ 314491 338594 430902 366557 375652 258979 296926 135651 611082 396852 158707 427150
14937D27150J2090j37107m0749C9293K87636j36820L73456k08407K43820k5652
$$ 427150 439240 302133 261384 39293 326929 190109 563565 355158 598978 573326
14927E73326J3804N2775J9092k12744L3007A89142J65283J75220o2807q9181P9048
$$ 573326 587130 639905 658997 446253 479260 189142 354425 529645 466838 377657 456705
14916D56705J98561P4372j50313L26325K47654r4093K04611j24366L10495k42084
$$ 456705 655266 729638 579325 905650 1153304 1059211 1263822 1139456 1449951 1207867
14906A207867J78510m84547J45535Q8911L87938Q4985L52447k64103m57742K88022
$$ 1207867 1386377 901830 1047365 1136276 1524214 1609199 1961646 1697543 1239801 1527823
14896A527823m70991j03774j55502k38049q9084j30132m3468K84447B24914K88721
$$ 1527823 1056832 953058 797556 559507 470423 340291 296823 581270 224914 513635
14886E13635B41804K15728q3498D547P96328A73419J78635m9333j5807L47773
$$ 513635 241804 457532 374034 4547 800875 173419 352054 302721 286914 634687
14876F34687k89496M6598p1866J36919j54940K0392J29578Q5628K3897K41943
$$ 634687 345191 391789 319923 456842 301902 322294 451872 537500 561397 803340
14866H03340C50148L41487J87496q5274l61951L35199k51494O2954L895A65611
$$ 803340 350148 691635 879131 793857 431906 767105 515611 578565 582460 165611
14855D86557j89927J35985o8710j31376L68459k9231J15248m4199L39260l01825
$$ 486557 296630 432615 363905 232529 600988 571757 687005 642806 982066 680241
14845F80241r5418j46346J9522A95046P13710C07795N7252R7691A10563N48469
$$ 680241 584823 438477 457999 195046 908756 307795 365047 462738 110563 659032
14835F59032C13663L53082q6430k19559L3144r5502K34462J26390J77775m054
$$ 659032 313663 666745 580315 360756 393900 298398 532860 659250 837025 832971
14825H32971P2693J17029j34931L17028n81480O9998J4570P4847k11033K83211
$$ 832971 905664 1022693 887762 1204790 623310 693308 707878 782725 571692 854903
14815H54903k50991k74875R8865n5053M61763k46606K82129l06366j31620L72638
$$ 854903 603912 329037 427902 372849 834612 588006 870135 563769 432149 804787
14805H04787L8653M0200j22640l9150J19976q3405J56020k89507r1368k9406L43329
$$ 804787 843440 883640 761000 721850 841826 758421 914441 624934 533566 504160 847489
14794H47489k57476Q1847j51141J102k3082L53181j08616L59631E11317K48083
$$ 847489 590013 671860 520719 521821 498739 851920 743304 1102935 511317 759400
14784G59400K3791Q092p4127j75713L57980B91560L11754K7078k36580M6867K25820
$$ 759400 783191 791283 717156 541443 899423 291560 603314 630392 393812 440679 666499
14773F66499j98281J36110k52549N14616C85867J39056j14758L73858j02797j16824
$$ 666499 468218 604328 351779 866395 385867 524923 410165 784023 681226 564402
14763E64402K26697j53362J70121j61468N1060P661K33024j46946j5570k05903
$$ 564402 791099 637737 807858 646390 697450 705111 938135 791189 775619 569716
14753E69716J30586r9371K50299B62270L08562m1306R8263k59711K15791J36604
$$ 569716 700302 600931 851230 262270 570832 529526 627789 368078 583869 720473
14743G20473l38946K09898n2709J29193J7262m7761P9290K1599J00297j54814
$$ 720473 381527 591425 538716 667909 685171 637410 716700 738299 838596 683782
14733F83782J52021m6389j12064p2255l6221K12482j60337j35813M20720l41548
$$ 683782 835803 789414 677350 605095 568874 781356 621019 485206 905926 564378
14723E64378K94757O4926k33821N1477L45596E06670K17718n9944K45700p623
$$ 564378 859135 924061 690240 741717 1087313 506670 724388 664444 910144 902521
14713I02521K14075k1857K2368J29528J17294k02001M32747k53880l44794P0536
$$ 902521 1116596 1094739 1117107 1246635 1363929 1161928 1594675 1340795 996001 1066537
14703A066537j50906J23010m1798k33453O1171J72582Q4723k47614j84415K83586
$$ 1066537 915631 1038641 996843 763390 824561 997143 1081866 834252 649837 933423
14693I33423n5439J16499k26022l66187Q18019m12471M04181L161j14690K90300
$$ 933423 877984 994483 768461 402274 1220293 807822 1212003 1215164 1100474 1390774
14683A390774L69986M2740l76581m72195K35736N1991K9381k51752k3947j81959
$$ 1390774 1760760 1803500 1426919 954724 1190460 1242451 1271832 1020080 996133 814174
14673H14174K78136j10258k18593J81200l22491Q9091L8049J25007K58964m22585
$$ 814174 1092310 982052 763459 944659 622168 711259 749308 874315 1133279 710694
14663G10694J11561k05059K00600N3691L8284M9742k73823O9023Q4386M08914
$$ 710694 822255 617196 817796 871487 909771 959513 685690 754713 839099 1248013
14653A248013k74077k04341K14649Q1016K622R8828j87557J4768R2032m45369
$$ 1248013 973936 769595 984244 1065260 1067882 1166710 979153 993921 1085953 640584
14643F40584M25926K58330k68369J16903k4045M20258l45022K50717l86700J23913
$$ 640584 1066510 1324840 1056471 1173374 1149329 1569587 1224565 1475282 1088582 1212495
14633A212495K47982n2745k90754j28284P6838J98951k28103L15976k93896K95411
$$ 1212495 1460477 1407732 1116978 988694 1065532 1264483 1036380 1352356 1058460 1353871
14623A353871m3692j87625j22043J17659K75248j50429j04683r349K30613k47019
$$ 1353871 1310179 1122554 1000511 1118170 1393418 1242989 1138306 1128957 1359570 1112551
14613A112551J9596J52466j72405M20523j26597J73189k24994R6466l74050K71165
$$ 1112551 1132147 1284613 1112208 1532731 1406134 1579323 1354329 1450795 1076745 1347910
14603A347910P3058Q6155J81890k93325R0129l69687P14282m11846m9848P4775
$$ 1347910 1420968 1507123 1689013 1395688 1485817 1116130 1830412 1418566 1368718 1443493
14593A443493N3050r1946J05528m8981R6111M8468n1062J61774m9071J46417j18142
$$ 1443493 1496543 1404597 1510125 1461144 1557255 1605723 1554661 1716435 1667364 1813781 1695639
14582A695639q6632J8575j8109J51658k9766L9478Q903K14863j80448K9077m9133
$$ 1695639 1609007 1627582 1609473 1761131 1731365 1770843 1779746 1994609 1814161 1843238 1794105
14571A794105J7879R8244l81370J86212K04535j40219r5726J0504L81943j09875
$$ 1794105 1811984 1910228 1528858 1715070 1919605 1779386 1683660 1694164 2076107 1966232
14561A966232J11513J15292k40934O774N9791K64660j15909K14039k46312J29835
$$ 1966232 2077745 2193037 1952103 1958877 2018668 2283328 2167419 2381458 2135146 2264981
14551B264981m8681K86113j64045m9056K06862M30258k87755M18362k83560J98487
$$ 2264981 2216300 2502413 2338368 2289312 2496174 2926432 2638677 3057039 2773479 2971966
14541B971966M07245L99707J44578O56380J9893Q77005J597392J980495L504606
$$ 2971966 3379211 3778918 3923496 4579876 4599769 5476774 7074166 9054661 12559267
14532A2559267N303589Q809520P296370j2485973q912607m631846k037891q35639
$$ 12559267 17862856 26672376 33968746 21482773 12570166 7938320 5900429 5064790
14524E064790M94889q15386j060066m98966l56526k22971j74488J66306k77588
$$ 5064790 5559679 4744293 3684227 3185261 2828735 2605764 2431276 2597582 2319994
14515B319994m4676j52299K67976k80082Q4824L51390k77760P6295p719j14586
$$ 2319994 2275318 2123019 2390995 2110913 2195737 2547127 2269367 2345662 2337943 2223357
14505B223357J46304K47335m11773L86008k0289K3598j7533n2648K72804n6190
$$ 2223357 2369661 2616996 2205223 2591231 2570942 2594540 2577007 2524359 2797163 2740973
14495B740973Q8328R8219j70214R5225m9731J35674k58371L32687L787k0488L075
$$ 2740973 2829301 2927520 2757306 2852531 2802800 2938474 2680103 3012790 3016577 2996089 2999164
14484B999164K82238j31025K6114M3451r88j19877j3541m905L13846J24507k7372
$$ 2999164 3281402 3150377 3176491 3219942 3218954 3099077 3085536 3080631 3394477 3518984 3491612
14473C491612M0555N9516K7926M5627j00069J90493j90434L34821m40888O26973
$$ 3491612 3532167 3591683 3619609 3665236 3565167 3755660 3565226 3900047 3459159 4086132
14463D086132j89802j93072K71936j48566R1309O18402m72470M91144j97381l35019
$$ 4086132 3896330 3703258 3975194 3826628 3917937 4536339 4063869 4555013 4357632 4022613
14453D022613K36961j00366L16912J4027K00938j96846P9926j70531L99656L5513
$$ 4022613 4259574 4159208 4476120 4490147 4691085 4494239 4574165 4403634 4803290 4838803
14443D838803j1094N8377L25050j32679k18960J04750M26025m76409L22623k8619
$$ 4838803 4827709 4886086 5211136 5078457 4859497 4964247 5390272 4913863 5236486 5207867
14433E207867M18732l15443L89748M9248K97598M4729n7170j2760k31126K58916
$$ 5207867 5626599 5311156 5700904 5750152 6047750 6092479 6035309 6022549 5791423 6050339
14423F050339J48459j17047j77631J90653M65230J27625q8434M00973k13644K10512
$$ 6050339 6198798 6081751 5904120 6094773 6560003 6687628 6599194 7000167 6786523 6997035
14413F997035J26426J69724m56365P26905j02145J28298N1384m1108L03088K74277
$$ 6997035 7123461 7293185 6836820 7563725 7461580 7589878 7641262 7600154 7903242 8177519
14403H177519P2602j67778N71186L11366n8588O1418r150k97645N88382l04222
$$ 8177519 8250121 8082343 8653529 8964895 8906307 8967725 8958575 8660930 9249312 8945090
14393H945090L51406L23639m0716Q9009K14672J98471j372M13907L8268L59100
$$ 8945090 9296496 9620135 9579419 9668428 9883100 10081571 10080199 10494106 10532374 10891474
14383A0891474J28181J12467J50691k4451L02502K43314L37371k35291O31092
$$ 10891474 11019655 11132122 11282813 11258362 11560864 11804178 12141549 11906258 12537350
14374A2537350J06148j73940M32121J54087J89276L60943N1610N18912J61954
$$ 12537350 12643498 12469558 12901679 13055766 13245042 13605985 13657595 14176507 14338461
14365A4338461N24203j07641N04386O40329P150J22782M85421K52151K14980P24250
$$ 14338461 14862664 14755023 15259409 15899738 15906888 16029670 16515091 16767242 16982222 17706472
14355A7706472j60203R08402J71161K62686K83506M51085M55624O00486L99013
$$ 17706472 17546269 18454671 18625832 18888518 19172024 19623109 20078733 20679219 21078232
14346B1078232J45441P02788M21450M65789N21476P22546N04570L42704Q23655
$$ 21078232 21223673 21926461 22347911 22813700 23335176 24057722 24562292 24904996 25728651
14337B5728651M24546O67510P11536P39134M83199R52284O97764J259806J01611
$$ 25728651 26153197 26820707 27532243 28271377 28754576 29706860 30404624 31664430 31766041
14328C1766041J033193Q02349R97174P46610J478371N48111J143674J437040R53971
$$ 31766041 32799234 33601583 34598757 35345367 36823738 37371849 38515523 39952563 40906534
14319D0906534J317509J229936J112104J367723J471870J708980J793444J834106
$$ 40906534 42224043 43453979 44566083 45933806 47405676 49114656 50908100 52742206
14311E2742206J161464J700838K109694J911022K158425K511818K517575K137589
$$ 52742206 53903670 55604508 57714202 59625224 61783649 64295467 66813042 68950631
14303F8950631K701633K479643L232138K923805K748893L661019L331780L735039
$$ 68950631 71652264 74131907 77364045 80287850 83036743 86697762 90029542 93764581
14295I3764581M249685L922427M652311M714667M862194N499829N647516N538704
$$ 93764581 98014266 101936693 106589004 111303671 116165865 121665694 127313210 132851914
14287A32851914O516515P191447O606376P740542P936663Q466172Q658260R533704
$$ 132851914 139368429 146559876 153166252 160906794 168843457 177309629 185967889 195501593
14279A95501593J0082359J0791389J1196982J1389525J2411471J2520918J3633588
$$ 195501593 205583952 216375341 227572323 238961848 251373319 263894237 277527825
14272B77527825J3282243J4204617J3901665J4074377J3952728J4329387J3330719
$$ 277527825 290810068 305014685 318916350 332990727 346943455 361272842 374603561
14265C74603561J3316428J2376136J1088712R741133Q788009P989603P250641
$$ 374603561 387919989 400296125 411384837 421125970 429913979 437903582 445154223
14258D45154223M167213J809705J856841J827845O21298o832136m921256o831550
$$ 445154223 449321436 451131141 452987982 454815827 455437125 448604989 443683733 436852183
14250D36852183j0482588j0046117j1571998j2399512j2373621j3799715j3340234
$$ 436852183 426369595 416323478 404751480 392351968 379978347 366178632 352838398
14243C52838398j3745420j3978303j3964836j3388603j2654457j2992347j2171532
$$ 352838398 339092978 325114675 311149839 297761236 285106779 272114432 259942900
14236B59942900j1436187j1579859j1569068j1400810j1024652j0412529r297392
$$ 259942900 248506713 236926854 225357786 213956976 202932324 192519795 183222403
14229A83222403q976984q717464q265140p607361o875122o865006n867129n625288
$$ 183222403 174245419 165527955 157262815 149655454 142780332 135915326 130048197 124422909
14221A24422909n578752n001519n129428m534692m367793l869002l815786l512973
$$ 124422909 118844157 113842638 108713210 104178518 99810725 95941723 92125937 88612964
14213H8612964l335298l553255l088352k820579k866669k510710k691593k020063
$$ 88612964 85277666 81724411 78636059 75815480 72948811 70438101 67746508 65726445
14205F5726445k605685k286613j648403k067212k076402j504688j465099j358506
$$ 65726445 63120760 60834147 59185744 57118532 55042130 53537442 52072343 50713837
14197E0713837j918751j445952j348725j294606j311577q25777j104670j316472
$$ 50713837 48795086 47349134 46000409 44705803 43394226 42568449 41463779 40147307
14189D0147307j270734j185104p75809j016531o00071j541736p00830n30006j152863
$$ 40147307 38876573 37691469 36915660 35899129 35299058 33757322 33056492 32526486 31373623
14180C1373623r35627n38346p53219n81868p49248p31427n23794r26907o79361
$$ 31373623 30437996 29899650 29146431 28564563 27815315 27083888 26560094 25633187 24953826
14171B4953826m42353l07569p28853n53768j81372o02372m27683r01007p1936
$$ 24953826 24511473 24203904 23475051 22921283 22739911 22137539 21709856 20808849 20736913
14162B0736913m84353l18818m01391n80205K1319o13982n37212j12029l24921
$$ 20736913 20252560 19933742 19532351 18952146 18973465 18359483 17822271 17710242 17385321
14153A7385321l43492l77219j55663l71495l78511n7638m98366n59630l66868
$$ 17385321 17041829 16664610 16508947 16137452 15758941 15701303 15202937 14643307 14276439
14144A4276439M4298p812k78191k37872m49264k32783J30173o31234l9474k94384
$$ 14276439 14320737 14312925 14034734 13796862 13347598 13114815 13244988 12613754 12574280 12279896
14134A2279896J09283n27084K2176j01572j58402n02784j86354k4446j90612k47859
$$ 12279896 12389179 11862095 11884271 11782699 11624297 11121513 10935159 10910713 10720101 10472242
14124A0472242J63014m25399j59094L2569k50174l36326P1246m14361r8799M3534
$$ 10472242 10635256 10209857 10050763 10083332 9833158 9496832 9568078 9153717 9054918 9098452
14114I098452M3547K4264m07526j68157k79583o2747L80703m84374j4577j55182
$$ 9098452 9141999 9166263 8758737 8590580 8310997 8248250 8628953 8144579 8130002 7974820
14104G974820j92742k27040N8876j50006J43944l32562J96970m18368J25282k12374
$$ 7974820 7782078 7555038 7613914 7463908 7607852 7275290 7472260 7053892 7179174 6966800
14094F966800l30140L98718l56190l41629K28310P4379n0711k27207l9916k46357
$$ 6966800 6636660 7035378 6679188 6337559 6565869 6640248 6589537 6362330 6322414 6076057
14084F076057O0190k35204M2699Q9095p917l90655J93185j77852J1781k95466
$$ 6076057 6136247 5901043 5943742 6032837 6024920 5634265 5827450 5649598 5661379 5365913
14074E365913J44152k01639J11974q7364l54582n3413N10576l46602o8823K6313
$$ 5365913 5510065 5308426 5420400 5333036 4978454 4925041 5435617 5089015 5020192 5046505
14064E046505p5319k95050r1990k6222N9371p6380M6748q7783j25443K88730k90534
$$ 5046505 4971186 4676136 4584146 4557924 4617295 4540915 4587663 4499880 4374437 4663167 4372633
14053D372633J33778k07638K25183l31777L76987n19869j77009O41255J27712
$$ 4372633 4506411 4298773 4523956 4192179 4569166 4049297 3872288 4513543 4641255
14044D641255m86018k5308J08634l15463K30858m54528M3964j39562n9870l7339
$$ 4641255 4155237 4129929 4238563 3923100 4153958 3699430 3743394 3603832 3543962 3506623
14034C506623M0200k80848M42648k99143M06756m19143N643j02292j91703J09621
$$ 3506623 3546823 3265975 3708623 3409480 3816236 3397093 3402736 3300444 3108741 3218362
14024C218362n48k2001R0310K24721k10490j43889r3023N8573J30218j05984K92897
$$ 3218362 3217814 3195813 3286123 3510844 3300354 3156465 3063442 3122015 3252233 3146249 3439146
14013C439146j03272k94917l58973L15272l21425O4900K26279j9223m70219M7473
$$ 3439146 3335874 3040957 2681984 2997256 2675831 2740731 2967010 2947787 2477568 2525041
14003B525041K86713k46219R7403M0527l54054J37326j8114j18496M11045m32721
$$ 2525041 2811754 2565535 2662938 2703465 2349411 2486737 2468623 2350127 2761172 2328451
13993B328451L23049k24587l17474J52896O5252J82974q5967l54163O82779o30223
$$ 2328451 2651500 2426913 2109439 2262335 2327587 2510561 2424594 2070431 2753210 2122987
13983B122987J64350R1415J15370j46752K36391K27993M75867J83644O20616J693211
$$ 2122987 2287337 2378752 2494122 2347370 2583761 2811754 3287621 3471265 4091881 5785092
13973E785092K354993N426105Q443746J2101909r094323q653703n502686k344496
$$ 5785092 8140085 13566190 22009936 34111845 25017522 16363819 10861133 8516637
13965H516637k154082j038174q42236k13826p61214q8104j52996l63778k59438
$$ 8516637 6362555 5324381 4482145 4268319 3507105 3419001 3266005 2902227 2642789
13956B642789M31362k30160Q872k08363k57830o8007K19979k85973Q6762K0810
$$ 2642789 3074151 2843991 2852863 2644500 2386670 2318663 2538642 2252669 2339431 2360241
13946B360241l41618R5688l3200J56690k8636l64997J99912J53912k80619J23580
$$ 2360241 2018623 2114311 2081111 2237801 2209165 1844168 2044080 2197992 1917373 2040953
13936B040953J86303k74603Q8142k93032k13842K05805l3174K85011n59788L03439
$$ 2040953 2227256 1952653 2040795 1747763 1533921 1739726 1706552 1991563 1431775 1735214
13926A735214L02328l73102k07044N36701l64233o7269R3130K03491r4870j33308
$$ 1735214 2037542 1664440 1457396 1994097 1629864 1562595 1655725 1859216 1764346 1631038
13916A631038j2357J27164J6454j40868K4713L22907l30455l7209N98J05997j72623
$$ 1631038 1618681 1745845 1762299 1621431 1646144 1969051 1638596 1601387 1601985 1707982 1535359
13905A535359J29162J32241j85243J15555j96838j45046L9675k6253k1203L12865
$$ 1535359 1664521 1796762 1611519 1727074 1530236 1385190 1424865 1398612 1377409 1690274
13895A690274n70530r2604N36092o0566j84400k31255L43816L72477k36798j69490
$$ 1690274 1119744 1027140 1563232 1502666 1318266 1087011 1430827 1803304 1566506 1397016
13885A397016l9824p2258J12026j72883q9688K75208J72413n74092K56839p5537
$$ 1397016 1357192 1284934 1396960 1224077 1134389 1409597 1582010 1007918 1264757 1189220
13875A189220L55866j62040J8108n4143k72289Q0474n258R5845J02251m59244
$$ 1189220 1545086 1383046 1401154 1347011 1074722 1155196 1149938 1245783 1348034 888790
13865H88790L72265m7910P3889k86795O1849M47931k62462p0375K06421o6152
$$ 888790 1261055 1213145 1287034 1000239 1062088 1510019 1247557 1177182 1383603 1317451
13855A317451k84792K14684k9089j18736M67497n40128n461N13344j33529k85970
$$ 1317451 1032659 1247343 1218254 1099518 1567015 1026887 1021426 1534770 1401241 1115271
13845A115271J46624k06088O8254j91304l8099J39772O4190J18193q6749M55781
$$ 1115271 1261895 1055807 1124061 932757 894658 1034430 1098620 1216813 1130064 1585845
13835A585845l19712k58811j01293N8044j66885K5431O5170K28021j13807M20042
$$ 1585845 1266133 1007322 906029 964073 797188 822619 887789 1115810 1002003 1422045
13825A422045o10872K18261K28368m89997K18518j47535J33166j64655N5740K81013
$$ 1422045 811173 1029434 1257802 767805 986323 838788 971954 807299 863039 1144052
13815A144052l99577L89557n58136K54544L46627m38278J1206O24449l57570k22224
$$ 1144052 744475 1134032 575896 830440 1177067 738789 749995 1374444 1016874 794650
13805G94650j11739M21238j24027l688K3528l4771q8398K9576J23363j92594l4469
$$ 794650 682911 1104149 980122 976434 999962 965191 876793 906369 1029732 837138 802669
13794H02669J48779j17733P0028l12864K70250k55391K46115j62825K60012J05268
$$ 802669 951448 833715 903743 590879 861129 605738 851853 689028 949040 1054308
13784A054308l71238k11981m083o2437L33935Q3895j66098K28848j93999J83923
$$ 1054308 683070 471089 467006 404569 738504 822399 656301 885149 691150 875073
13774H75073j27430l2964L87093m21488j94828k8027M25349l6521j35089J30155
$$ 875073 747643 714679 1101772 680284 485456 457429 882778 846257 711168 841323
13764H41323K03796k27327N3261L3199k49588K86491j8284p9998k84576R6815
$$ 841323 1045119 817792 871053 904252 654664 941155 922871 842873 558297 655112
13754F55112P5959n2169j4661q5699j13638J47865J98885j53669L5390k7172l2970
$$ 655112 731071 678902 664241 578542 464904 612769 811654 657985 693375 666203 633233
13743F33233m4540N6526K06464k08308R7147q5644O6321m3240k87387K70594j57922
$$ 633233 588693 645219 851683 643375 740522 654878 721199 677959 390572 661166 503244
13732E03244J11220K90659r7561l30817J94955O2314B07134K15909j11445O35505
$$ 503244 614464 905123 807562 476745 671700 734014 207134 423043 311598 947103
13722I47103C63227O7243k6370J27766J97237k51419K39194j48122J79000l63205
$$ 947103 363227 430470 404100 531866 729103 477684 716878 568756 747756 384551
13712C84551K40492j1418J25407j08886B66659M38975j15214J13455B33132L36140
$$ 384551 625043 613625 739032 630146 266659 705634 590420 703875 233132 569272
13702E69272F5514O68151k09215Q746k0343J77293r5753j2984k16910L74571l50666
$$ 569272 65514 733665 524450 533196 512853 690146 594393 581409 364499 739070 388404
13691C88404M05260l63442K72173C11468K93989j58077P2668o7711J07180A97815
$$ 388404 793664 430222 702395 311468 605457 447380 520048 452337 559517 197815
13680C95854L20661B85629L54388R4173l51053J11791R4942n8168j91037M72640
$$ 395854 716515 285629 640017 734190 383137 494928 589870 531702 340665 813305
13670H13305l56404J48486N8038k05488J7728j28596j58087L25697J67876j72913
$$ 813305 456901 605387 663425 457937 475665 347069 188982 514679 682555 509642
13660E09642B33923L85727j29745j01566K97557Q9682J21007C41465K28435m9022
$$ 509642 233923 619650 489905 388339 685896 775578 896585 341465 569900 520878
13650E20878J7136n6122j19618N6891K44579B93562M48686k79696J654J43865
$$ 520878 538014 481892 362274 419165 663744 293562 742248 462552 464206 608071
13640F08071J5491B80618L86460C28895R1694R4817O0064q4887L9177p2710O3828
$$ 608071 623562 280618 667078 328895 420589 515406 575470 490583 529760 457050 520878
13629E20878J55218J7962j18565k80249M38248P1994l29743l4177j45486J20274
$$ 520878 676096 694058 575493 295244 733492 805486 475743 441566 296080 416354
13619D16354o7945A55933K55513J97152p0499j13909K77621B95576k9945O2393
$$ 416354 348409 155933 411446 608598 538099 424190 701811 295576 265631 328024
13609C28024J10039J54496B01697a0395D95040J21323B48738M52909k87253I4209
$$ 328024 438063 592559 201697 -10395 495040 616363 248738 701647 414394 94209
13598C09646J61491A52348K69354N428P8981A29076J58913J47966D2758J32264
$$ 309646 471137 152348 421702 427130 506111 129076 287989 435955 42758 175022
13588A75022M70112j48613Q870r6510J27945j58751L38757l38491q2346K46309
$$ 175022 645134 496521 505391 408881 536826 378075 716832 378341 295995 542304
13578E42304B39894K16105r9158j8449j377j11930M31104k30075J48943k61799
$$ 542304 239894 455999 356841 338392 337015 225085 656189 426114 575057 313258
13568C13258j52236L18683B18047M40908q6041k48535k122j34722J61987j09103
$$ 313258 161022 479705 218047 658955 572914 324379 322257 187535 349522 240419
13558B40419O2708J89815k09685K38754B54320q4556J77703J80964k24964A12874
$$ 240419 303127 492942 283257 522011 254320 169764 347467 528431 303467 112874
13547a80210h3566C14787j06251L06988k48149r6892K88665K57077L1016l60424
$$ -180210 -83566 314787 208536 515524 267375 170483 459148 716225 747241 386817
13537C86817j71111K48847A88917E0032J96825H5433J53089j13550E4182K04960
$$ 386817 215706 464553 188917 50032 246857 85433 238522 124972 54182 259142
13527B59142P5772j4280J88725A51173N01545k81740K5029n5655G8769N65134
$$ 259142 334914 320634 509359 151173 652718 370978 396007 340352 78769 643903
13517F43903k51825A58092E987J48256K4033a2467A65893N73E8677M88412B69946
$$ 643903 392078 158092 5987 154243 178276 -12467 165893 166466 58677 547089 269946
13505C69994j26482m1827l5788J741L14229H9830L06252m2412M428J40432B26866
$$ 369994 243512 201685 165897 167638 481867 89830 396082 353670 358098 498530 226866
13493B94368A05799K17386p4427J3107l4972G8286M85602B62910E7751N9060K08333
$$ 294368 105799 323185 248758 261865 226893 78286 563888 262910 57751 116811 325144
13482C25144K3555e7980C44201m3971q2703J29194A70778R7400P8953A37936E9230
$$ 325144 348699 -57980 344201 300230 217527 346721 170778 268178 347131 137936 59230
13470c195B80884A38219J36925K7403o3200J01360A31377K57310j20449A18030
$$ -3195 280884 138219 275144 302547 239347 340707 131377 388687 268238 118030
13459A06146L18915m5335A30131N1287d416D98594j81453K445q8416a42145H710
$$ 106146 425061 379726 130131 181418 -4416 498594 317141 319586 231170 -142145 8710
13447E65155A26678L4042f281D7986J46705q0993O83923A70246a22322d070C93092
$$ 565155 126678 160720 -6281 47986 194691 113698 797621 170246 -122322 -4070 393092
13435a93897C48824G6664a93340B74555H0239B6683K90797l8983o0360L8745J71412
$$ -193897 348824 76664 -193340 274555 80239 26683 317480 278497 218137 256882 428294
13424D28294d5656B29179J68541A66977l629K3331J12078A40804d0527B93628
$$ 428294 -45656 229179 397720 166977 163348 186679 298757 140804 -40527 293628
13413D17631J3763E3558L21420r4100c3837C9795Q0830Q597m8589c5352A95287
$$ 417631 431394 53558 374978 280878 -33837 39795 120625 129222 80633 -35352 195287
13401A62543J64902J43709I1121J73692M1749i9312D07437D0945R4388K26865
$$ 162543 327445 471154 91121 264813 306562 -99312 407437 40945 135333 362198
13391C62198Q0027k09866J9965A14344J6333K38519b1162D22998K3003a11052
$$ 362198 442225 232359 252324 114344 130677 369196 -21162 422998 446001 -111052
13380A74694K931J6331q6939C4973J92249n4425J94303r4760j4956A09091j4371
$$ 174694 177625 193956 107017 34973 227222 172797 367100 272340 257384 109091 94720
13369I4720K37850A27434J29046A09907A1336R3150K4491L6594J18789k7705J73432
$$ 94720 332570 127434 256480 109907 11336 104486 128977 165571 284360 256655 430087
13358D30087j22865C5473K83055B1926a07808B77459J32280k02455p7169J23552
$$ 430087 307222 35473 318528 21926 -107808 277459 409739 207284 130115 253667
13348B53667J20077m7162A45889p0707K20449B1924L64692j03204j2407a49104
$$ 253667 373744 326582 145889 75182 295631 21924 386616 283412 271005 -149104
13337B23657O6158j0524O9711j32989L72528r4795B00978P1246i7941B64322J72926
$$ 223657 289815 279291 349002 216013 588541 493746 200978 272224 -97941 264322 437248
13326D37248j58468o3154J70678p6926A48883O9986K15153B10761O6220o4618
$$ 437248 278780 215626 386304 309378 148883 218869 434022 210761 276981 212363
13316B12363n9706m9274Q6990D3905L82922Q6560B33336K0168j11931Q4598h6670
$$ 212363 152657 103383 190373 43905 426827 513387 233336 253504 141573 226171 -86670
13304I0935K04322J38810O7757I7484b28341A38298K68085j45830a18651D24520
$$ 90935 295257 434067 501824 97484 -228341 138298 406383 260553 -118651 424520
13293B19734P7322n5361I2564M22977A31722E5861J30076i5990A55500R4217b73035
$$ 219734 297056 241695 92564 515541 131722 55861 185937 -95990 155500 249717 -273035
13281C06570O9972G7732M7339f4523C2333N6102l7029o843g1460A63927R7758
$$ 306570 376542 77732 125071 -64523 32333 88435 51406 44563 -71460 163927 261685
13270B61685f853A83113G776L57533j81242q5012a49298d4528p9678J6319A1280
$$ 261685 -6853 183113 7776 365309 184067 99055 -149298 -44528 -124206 -107887 11280
13258D16635e4059A56682m0761C1086J85127A08024F411K59759a03834a7546A91454
$$ 416635 -54059 156682 115921 31086 216213 108024 6411 266170 -103834 -17546 191454
13246B13135J8456f1540I1113D0206O01520C19901l1629C6940L62939A07698J79086
$$ 213135 231591 -61540 91113 40206 641726 319901 288272 36940 399879 107698 286784
13235B86784a24361j6697B80776r6565F1348b79924G9138L18370d1320A94443
$$ 286784 -124361 -141058 280776 184211 61348 -279924 79138 397508 -41320 194443
13224A64702J63404f4147j16309C4164L34289j12133a32530A66546o5522b2082
$$ 164702 328106 -64147 -180456 34164 368453 256320 -132530 166546 101024 -22082
13213E9375J61911L9123a65960j52316B6406Q503K74709m0698j02504J08763N0077
$$ 59375 221286 260409 -165960 -318276 26406 34909 309618 268920 166416 275179 325256
13202C25256b46083C235J42087D2087J28341J50529H7315P3978J63158a19124
$$ 325256 -246083 3235 145322 42087 170428 320957 87315 161293 324451 -119124
13191A06479m2244c8098A87404B8407L17488E2052i5097A69016F846Q7539k1036
$$ 106479 64235 -38098 187404 28407 345895 52052 -95097 169016 6846 94385 73349
13180G3349i9298q3726g9908H3009J65162l536F0924h2246A61700F0076a77321
$$ 73349 -99298 -183024 -79908 83009 248171 244635 60924 -82246 161700 60076 -177321
13168B48897B1156j724a4245D5019L67062C9771P157R0048J69733A11099J06815
$$ 248897 21156 19432 -14245 45019 412081 39771 46928 136976 306709 111099 217914
13157B17914l3813c2232B03342P189H456K23204P2971c1679A7894J53114F2496
$$ 217914 184101 -32232 203342 210531 8456 231660 304631 -31679 17894 171008 62496
13145a14407r5817b1541j51103B2317Q8870D9594O37L03191F3793a02358D2889
$$ -114407 -210224 -21541 -172644 22317 111187 49594 50231 353422 63793 -102358 42889
13133b10641f0710A77567b8865L685B16507A458K38816F6317M7962K89743A34733
$$ -210641 -60710 177567 -28865 -25180 216507 1458 240274 66317 114279 404022 134733
13121B45872L2598K15842a57791r369P1214C94373j24740c4057m4154I1422L5297
$$ 245872 278470 494312 -157791 -167160 -95946 394373 269633 -34057 -78211 91422 126719
13110A26719a43069b8833n9256j2859H6528Q5699E1329a42145C40754G6512J52007
$$ 126719 -143069 -28833 -88089 -100948 86528 172227 51329 -142145 340754 76512 228519
13099B28519j09782D0802O8194O0145l121a17459H7379J2971N6856J89953A07691
$$ 228519 118737 40802 108996 169141 166020 -117459 87379 100350 157206 347159 107691
13087A53493d9122A70200E124J99092B6487J99302A2304O890b5914o1674A43902
$$ 153493 -49122 170200 5124 204216 26487 225789 12304 19194 -25914 -87588 143902
13075a76373k19514A28444a37447A55261l14d0101a5295A70658A993M76263C8210
$$ -176373 -395887 128444 -137447 155261 154947 -40101 -15295 170658 1993 478256 38210
13063a28508j6577m0837B78712a407A25892b11545A52966m1407C7883O8491j5148
$$ -128508 -145085 -185922 278712 -1407 125892 -211545 152966 111559 37883 106374 91226
13052I1226R9759G4579Q7498j1684K5958J35725d3524A23928o676J2801k1477
$$ 91226 190985 74579 162077 150393 176351 312076 -43524 123928 117252 130053 108576
13041A08576l4402J12597C4420M9534a30690F5803a26927K4472r1050O6255E8732
$$ 108576 74174 186771 34420 83954 -130690 65803 -126927 -102455 -193505 -127250 58732
13029B16040J19047D6843e5292o2814A66119k3445b07258F9135O1755R5475D370
$$ 216040 335087 46843 -55292 -118106 166119 142674 -207258 69135 130890 226365 4370
13017C80828F1280b95988K9409B3513f1788J5406l2505A67955J03433G698e8834
$$ 380828 61280 -295988 -266579 23513 -61788 -46382 -78887 167955 271388 7698 -58834
13005G0424K25139A12463b96055D998a57638A46369a09590B08686b05583I8578
$$ 70424 295563 112463 -296055 4998 -157638 146369 -109590 208686 -205583 98578
12994a82253G0251K43865d774E2789n4e1357A78554E6763K26258p9370I1694h3293
$$ -182253 70251 314116 -4774 52789 52735 -51357 178554 56763 283021 203651 91694 -83293
12981A38030n6076J89682a28246B51287G3562a56722A19530k3304b56320E1293
$$ 138030 81954 271636 -128246 251287 73562 -156722 119530 96226 -256320 51293
12970H2235k8044a27433o7140c798A8881a60776H1227J27000l4559a61477C53865
$$ 82235 54191 -127433 -194573 -3798 18881 -160776 81227 208227 173668 -161477 353865
12958A09249c12991E6966J76717J3864L1476L33113A08103J74241A19554h1571
$$ 109249 -312991 56966 233683 247547 279023 612136 108103 282344 119554 -81571
12947B5773M34006b7800p5443A67152H2366a96950R4775F4577j4567a3670G1081
$$ 25773 459779 -27800 -103243 167152 82366 -196950 -102175 64577 50010 -13670 71081
12935C41471A34663j6430l5671g814j02569H3943f1117A56754b1331N317l54925
$$ 341471 134663 118233 82562 -7814 -110383 83943 -61117 156754 -21331 -16014 -370939
12924c70939F3501L0732C1599e7628j16943f7893A04145b02912G8381A1018a59808
$$ -370939 63501 94233 31599 -57628 -174571 -67893 104145 -202912 78381 11018 -159808
12912i0388m097L3341F6248O5142a58359G8128R3113C8689K27771b43036g6005
$$ -90388 -94485 -61144 66248 131390 -158359 78128 171241 38689 266460 -243036 -76005
12900i7406E3412M74803f4790D0575K02856a89467C41035c3807B29951H3440a17192
$$ -97406 53412 528215 -64790 40575 243431 -189467 341035 -33807 229951 83440 -117192
12888B92114A17469i8355j00461B97837g5196o6164k25097B60461a19917B06460
$$ 292114 117469 -98355 -198816 297837 -75196 -141360 -366457 260461 -119917 206460
12877a10653C6041J70788p1296R2093a6689F2843k2956J30940J79830C2069R9977
$$ -110653 36041 206829 135533 227626 -16689 62843 39887 170827 350657 32069 132046
12866A32046a33639C92681A61119a11331p1H5247c19004N8903J27211B07858J6314
$$ 132046 -133639 392681 161119 -111331 -111402 85247 -319004 -260101 -132890 207858 224172
12855B24172G1398M1126h86o738n9217J5420K2042F65b0353k24554J13023l1036
$$ 224172 71398 112524 -886 -7624 -66841 -51421 -29379 665 -20353 -244907 -131884 -162920
12843a62920j4892B63401c2175A14868N8623i8229H4903M03684a5535A98345o9801
$$ -162920 -177812 263401 -32175 114868 173491 -98229 84903 488587 -15535 198345 128544
12832A28544b8229B2608a12171j04508g4493m0093o0497A26489P6084i5390b5482
$$ 128544 -28229 22608 -112171 -216679 -74493 -114586 -175083 126489 202573 -95390 -25482
12820I3881a47679C1516M7740J29869a3786A22278L7751B2758L49615H9077a17477
$$ 93881 -147679 31516 79256 209125 -13786 122278 160029 22758 372373 89077 -117477
12808F4562k9716a96949k8183h6716C25583f9811j2098C5861e3230j32889L2915
$$ 64562 34846 -196949 -225132 -86716 325583 -69811 -81909 35861 -53230 -186119 -153204
12797a53204j36668n1438a01653e14j05146M8891J8951C5069c02766B03428c249
$$ -153204 -289872 -341310 -101653 -514 -105660 -56769 -37818 35069 -302766 203428 -3249
12785H9518d1071B80080H4659J69976b0452A01492J4625a36868B8314M11221c66422
$$ 89518 -41071 280080 84659 254635 -20452 101492 116117 -136868 28314 439535 -366422
12773b40683f5482K862m6819b6068a0775I9151b33789A47800n7422D0026e9856
$$ -240683 -65482 -62620 -109439 -26068 -10775 99151 -233789 147800 90378 40026 -59856
12761A27473a36320C5871c03304o5829e4330C00450D9922c4357A51039p3717J53336
$$ 127473 -136320 35871 -303304 -369133 -54330 300450 49922 -34357 151039 77322 230658
12750B30658i2994J0704q6958I5339P6108a84427G4377P8811a51552A82450B8532
$$ 230658 -92994 -82290 -169248 95339 171447 -184427 74377 153188 -151552 182450 28532
12738a9559A99495a56987L3875l6021f0254H0843c74384a72869j93453A22091
$$ -19559 199495 -156987 -123112 -159133 -60254 80843 -374384 -172869 -366322 122091
12727G2169c90555C50109l9043A39618c3664j1205r93j34607B36253A5575a47568
$$ 72169 -390555 350109 311066 139618 -33664 -44869 -45862 -180469 236253 15575 -147568
12715b79096A0228J46858b85413A1523a57790D0483J67687D8844f5711A8780f9916
$$ -279096 10228 157086 -285413 11523 -157790 40483 208170 48844 -65711 18780 -69916
12703b7091A55444R3336h8125o275j7750B55930r3331o5687b18644C55084e4471
$$ -27091 155444 248780 -88125 -94400 -112150 255930 162599 96912 -218644 355084 -54471
12691C6469M6517J6745J87376e213k1206E7898L46680D0241b18737C50561D0885
$$ 36469 82986 99731 287107 -5213 -26419 57898 404578 40241 -218737 350561 40885
12679A02599M6883m1181e2847o2858H1557a83977E4243J5507K47626a0607A64847
$$ 102599 149482 108301 -52847 -115705 81557 -183977 54243 69750 317376 -10607 164847
12667f0834K064J5087A53192a46676b780A65159d0500B8920Q075a92F2585b73161
$$ -60834 -58770 -43683 153192 -146676 -2780 165159 -40500 28920 36995 -192 62585 -273161
12654B47732o1121E5441n383K13904l3976m6719J73129a07082A72249A2066J13914
$$ 247732 186611 55441 50058 263962 229986 183267 356396 -107082 172249 12066 125980
12643A25980K26454i5469m7877l8279o6563C16638A0285J25413a75333B15723
$$ 125980 352434 -95469 -143346 -181625 -248188 316638 10285 135698 -175333 215723
12632C89906j49962b05798A33847a11747k2286j95031B28894k6664c4541D22860
$$ 389906 239944 -205798 133847 -111747 -134033 -329064 228894 202230 -34541 422860
12621a47562D3071J84943a65587B66796Q8683f3318j89521D36212c12326F5280
$$ -147562 43071 228014 -165587 266796 355479 -63318 -252839 436212 -312326 65280
12610B15298I2987J66988P7621F3300b10077G361b51288a12786B47708L9462K21937
$$ 215298 92987 259975 337596 63300 -210077 7361 -251288 -112786 247708 287170 509107
12599E09107a72562A59930b76559E7250J4766h8809A96032a14900N734A15215
$$ 509107 -172562 159930 -276559 57250 72016 -88809 196032 -114900 -109166 115215
12588A90138A9014a78817E8685d35621A11151R6239o9616o4854a3996A41562a77007
$$ 190138 19014 -178817 58685 -435621 111151 207390 137774 72920 -13996 141562 -177007
12576C50341E0207e2187l222J1027A12312J9986D383b0507A78843a57405A38164
$$ 350341 50207 -52187 -55409 -44382 112312 132298 4383 -20507 178843 -157405 138164
12564A55524K27491G4404c9788l1879n1431c0858B16825A7378e788l1240B47373
$$ 155524 383015 74404 -39788 -71667 -123098 -30858 216825 17378 -5788 -37028 247373
12552B9281N8969R9020D0262g4365Q474A47519L3526k8208C851c02015i4581l2464
$$ 29281 88250 187270 40262 -74365 -65891 147519 181045 152837 3851 -302015 -94581 -127045
12540a27045B0236J07698a01113B35582h8546o4535e1766H9057J13529b6502p4209
$$ -127045 20236 127934 -101113 235582 -88546 -153081 -51766 89057 202586 -26502 -100711
12529a00711j86368G064a28716f4283C45023a36152m4786E5156i5940L7973B41457
$$ -100711 -287079 7064 -128716 -64283 345023 -136152 -180938 55156 -95940 -57967 241457
12517a9023C54765j77208D4106a72774A14211A8660c5474F7857c7093D6020a19746
$$ -19023 354765 177557 44106 -172774 114211 18660 -35474 67857 -37093 46020 -119746
12505b15657i7611m5342c6519k3745i487A4611P724c31756B03822K39773A00704
$$ -215657 -97611 -142953 -36519 -60264 -9487 14611 22335 -331756 203822 443595 100704
12493A52786K36177b18053B19518j00223d69771C5054Q7795h795B28908b33774
$$ 152786 388963 -218053 219518 119295 -469771 35054 122849 -8795 228908 -233774
12482E960O7918a27497e1821J9512D2336b20278B6699e53890A44869A5723F057
$$ 5960 73878 -127497 -51821 -32309 42336 -220278 26699 -553890 144869 15723 6057
12470B10941c54571g095B46288q5825a72029n3031k2407a10820A49846Q9053p947
$$ 210941 -354571 -7095 246288 160463 -172029 -225060 -247467 -110820 149846 238899 230952
12459B30952d7730l7403Q117J9964A76123a4451A01641A9197g7754k78289G3555
$$ 230952 -47730 -85133 -77016 -57052 176123 -14451 101641 19197 -77754 -356043 73555
12447E348a65743I6394m2510d3512A02162K52932a9618k03238H7913b77540d4414
$$ 5348 -165743 96394 53884 -43512 102162 355094 -19618 -222856 87913 -277540 -44414
12435b46496a2360B40223h3098I9584g8549A80389J1096b1251A31697Q4436L3466
$$ -246496 -12360 240223 -83098 99584 -78549 180389 191485 -21251 131697 216133 249599
12424B49599P468a5611m40141b11389G6718b46383J17556A0703c1548l02502H7118
$$ 249599 257067 -15611 -455752 -211389 76718 -246383 -128827 10703 -31548 -334050 87118
12412A94889b47956G7738b71491k00122I7934a84005P7105M4019H7131b63193
$$ 194889 -247956 77738 -271491 -471613 97934 -184005 -106900 -62881 87131 -263193
12401b34218G1743A746i5626b9954A46185j0599a06192j15984C12946c8845m9217
$$ -234218 71743 1746 -95626 -29954 146185 135586 -106192 -222176 312946 -38845 -88062
12390h8062K143l9907B16505I4644J71507B714f0884A22015d464r787j52323B90049
$$ -88062 -85919 -125826 216505 94644 266151 2714 -60884 122015 -4464 -14251 -166574 290049
12377b25922E2651K20541a3760B46400a4249j71968F9660L02696j26027B4646
$$ -225922 52651 273192 -13760 246400 -14249 -186217 69660 372356 246329 24646
12366A37954b451B07911g7246i829E7715J10250E5118j3358b0219l5071a3608
$$ 137954 -2451 207911 -77246 -9829 57715 167965 55118 41760 -20219 -55290 -13608
12354a41564B75428i0292k2941C99022a58903a1194j22798A66995h7915k10380
$$ -141564 275428 -90292 -113233 399022 -158903 -11194 -133992 166995 -87915 -298295
12344b98295I5375L0818J72907a29250B4210K00821b43992P9594q7651A21365
$$ -298295 95375 126193 299100 -129250 24210 225031 -243992 -164398 -252049 121365
12333f9420A35331m8787a21309k88133B57235e5223c726j39377C71431E2838J1227
$$ -69420 135331 86544 -121309 -409442 257235 -55223 -3726 -143103 371431 52838 64065
12322F4065b10122B4251K13875L2852r48E9859J3299F670a44014B29446E9165
$$ 64065 -210122 24251 238126 270978 270030 59859 73158 6670 -144014 229446 59165
12310G9452N80465a4217G0321j1734f3475A99039P0784d6836C52654m7754p1140
$$ 79452 659917 -14217 70321 58587 -63475 199039 269823 -46836 352654 304900 233760
12299B33760A09789J74607Q0640A22213c50705E7132b9007l31E9445K3425N9451
$$ 233760 109789 284396 365036 122213 -350705 57132 -29007 -29338 59445 82870 142321
12288A42321O0871a4368B35278b6410b950A69791l3060B8200J25251J48538A40429
$$ 142321 203192 -14368 235278 -26410 -2950 169791 136731 28200 153451 301989 140429
12276a02616j38906A15503J84359A15765b34439a08379I7164M45423E0400K2119
$$ -102616 -241522 115503 299862 115765 -234439 -108379 97164 542587 50400 72519
12266G2519a06658c2286A58361J62260j53484E1429M7527J86228p0934D5706J11723
$$ 72519 -106658 -32286 158361 320621 167137 51429 98956 285184 214250 45706 157429
12255A57429a37341B09944R7092r6526f0168B69393J51366j93819A279J26781
$$ 157429 -137341 209944 307036 210510 -60168 269393 420759 226940 1279 128060
12245A28060b9287G9644a20536N21B8131J39937F0981d9204l5941I8296K47785
$$ 128060 -29287 79644 -120536 -120015 28131 168068 60981 -49204 -85145 98296 346081
12234C46081m1790H3999d58019f599E2518K39383r1694i7125A70314i2110B30019
$$ 346081 304291 83999 -458019 -6599 52518 291901 200207 -97125 170314 -92110 230019
12222B37230f3694r4725P8311A56861b6345F540e0074A0221P4442J11289M0309
$$ 237230 -63694 -158419 -80108 156861 -26345 6540 -50074 10221 84663 195952 236261
12211B36261i505A42945e3442D55371A81562o4252R4222J11327L1751a03351C78998
$$ 236261 -9505 142945 -53442 455371 181562 117310 211532 322859 354610 -103351 378998
12199C08587n7839j06550j4002d6579C11528j47683A5169a02128B72151K1029
$$ 308587 250748 144198 130196 -46579 311528 163845 15169 -102128 272151 293180
12189B93180A10520a56410I5638J65760m2512J25330a39461B49903m6527k6208
$$ 293180 110520 -156410 95638 261398 218886 344216 -139461 249903 203376 177168
12179A77168A6954K98685A31280R7976I7111N02242k28484C8568a35540e7732
$$ 177168 16954 315639 131280 229256 97111 599353 370869 38568 -135540 -57732
12168A71454N2515I1176J4309P0221D7392J73785D7782N8175J36762H9890N6185
$$ 171454 223969 91176 105485 175706 47392 221177 47782 105957 242719 89890 146075
12157A46075c29507D6298A7025K89778g4256C90532K6825j46879J2857n9851N3166
$$ 146075 -329507 46298 17025 306803 -74256 390532 417357 270478 283335 223484 276650
12146B76650A04545R5545E0932L60258A12801Q0124F6519J75359j5608k4464e5189
$$ 276650 104545 200090 50932 411190 112801 192925 66519 241878 226270 201806 -55189
12134g9986J0235a2877E0388k565a03982o9407D4086b66363A08529k9503b25428
$$ -79986 -69751 -12877 50388 47823 -103982 -173389 44086 -266363 108529 79026 -225428
12122h4946C51320B7240R0057j2558a5869j51711D3914J61486J84498A63487G6728
$$ -84946 351320 27240 117297 104739 -15869 -167580 43914 205400 389898 163487 76728
12110B48619H0188R056b34031j50193A62217E2290J42499l5929a21918c1985C52823
$$ 248619 80188 89244 -234031 -384224 162217 52290 194789 158860 -121918 -31985 352823
12098A84302G9582a56597A84078p300J87447A64782K27006A91393n7732M0573
$$ 184302 79582 -156597 184078 176778 364225 164782 391788 191393 133661 174234
12088A74234G2638J82292h0262I4879J3777N2919K62039d4417k07961A04599K30264
$$ 174234 72638 254930 -80262 94879 108656 161575 423614 -44417 -252378 104599 334863
12077C34863A16168A5818P5116f0114A68289c6898A43035b25489Q8715B46577
$$ 334863 116168 15818 90934 -60114 168289 -36898 143035 -225489 -136774 246577
12066E8805i9094E6889J51318f7264A31369K56a1108B87965c4754j35545B32388
$$ 58805 -99094 56889 208207 -67264 131369 131625 -11108 287965 -34754 -170299 232388
12054b11571B85277Q3073e1885l8842F7029K18925b20449A29238a17545A73731
$$ -211571 285277 368350 -51885 -90727 67029 285954 -220449 129238 -117545 173731
12043a0723A9497d640C6729a23261J9882B44813c9083a9364l34409O6248R94B60167
$$ -10723 19497 -4640 36729 -123261 -103379 244813 -39083 -19364 -353773 -287525 -286531 260167
12030A92549b50726h9410K2047j06094A1270P1326K5144a3607E9482c35231B31658
$$ 192549 -250726 -89410 -67363 -173457 11270 82596 107740 -13607 59482 -335231 231658
12018A41633C2383M9403e4009k0298A22726J27227b51274D6753K015a65144d8891
$$ 141633 32383 81786 -54009 -74307 122726 249953 -251274 46753 48768 -165144 -48891
12006A91867p8436O535a05195B02033i7753L8822j71668g3410A7410c5790f599
$$ 191867 113431 119966 -105195 202033 -97753 -58931 -230599 -73410 17410 -35790 -6599
11994c65865d5620A39394M3226b31788c0831B43388I3979K14503I306P4520J83859
$$ -365865 -45620 139394 182620 -231788 -30831 243388 93979 308482 9306 83826 267685
11983B67685f5507A6555c9388a44j427r6916A9043K42029A3108K47744e1156A04390
$$ 267685 -65507 16555 -39388 -144 -1571 -98487 19043 261072 13108 260852 -51156 104390
11970C19620f8619B2109e7358A06332a2556k58734J28916n2346K1286E9966a63316
$$ 319620 -68619 22109 -57358 106332 -12556 -271290 -142374 -194720 -173434 59966 -163316
11958A27516N3558a42059O2208n8127p8328g7018D038a56544B13267e5510A00236
$$ 127516 181074 -142059 -79851 -137978 -216306 -77018 4038 -156544 213267 -55510 100236
11946B36768b08530A25993g4814L6846c756I1539P8072H1068L38360D532a86539
$$ 236768 -208530 125993 -74814 -37968 -3756 91539 169611 81068 419428 4532 -186539
11934F5031e1493C9141A7168d41246C6600d9482k63919J53311d9535F7810A5111
$$ 65031 -51493 39141 17168 -441246 36600 -49482 -313401 -160090 -49535 67810 15111
11922A06818M0928E6426c1305D4134a32248H8526k3204Q354K0169B6522c29867
$$ 106818 147746 56426 -31305 44134 -132248 88526 65322 73676 93845 26522 -329867
11910C53862b75061a31177B07878e843k41901J6088h4626J9194a9341j25725r7473
$$ 353862 -275061 -131177 207878 -5843 -247744 -231656 -84626 -65432 -19341 -145066 -242539
11899b42539j27030H0063L1477n2408a51532C8378J4878b57598a10876C83851
$$ -242539 -369569 80063 111540 59132 -151532 38378 53256 -257598 -110876 383851
11888G2849J64133b52687o2455d6197j07346I4140a38732C0048Q089c03962n4974
$$ 72849 236982 -252687 -315142 -46197 -153543 94140 -138732 30048 38137 -303962 -358936
11877c58936A04728q815K9654L1343J08485b40011A50357d6858A31288i2322A41595
$$ -358936 104728 95913 125567 156910 265395 -240011 150357 -46858 131288 -92322 141595
11865b11104D5222b11653Q3142b4790A57305p8203b7567j72675P0664j55261N2479
$$ -211104 45222 -211653 -128511 -24790 157305 79102 -27567 -200242 -129578 -284839 -232360
11854b32360R7192K7661D7814b65325J03045A85773I62a74774j35436A43826b49666
$$ -232360 -135168 -107507 47814 -265325 -162280 185773 962 -174774 -310210 143826 -249666
11842b64474i6065k12010m557H1324C2776i1157J2340j4436m777A20284B3071
$$ -264474 -96065 -308075 -312632 81324 32776 -91157 -78817 -93253 -98030 120284 23071
11830f1265B05789D4055L8143h4685G3861d9782C9580h9234c8106A19904M3211
$$ -61265 205789 44055 82198 -84685 73861 -49782 39580 -89234 -38106 119904 163115
11819A63115a61685M0927c8814A62638b21706G2760h7098A38459b85552A31975
$$ 163115 -161685 -120758 -38814 162638 -221706 72760 -87098 138459 -285552 131975
11808A22304g5246j11844a246B24945a81946j53006G3951J84341g9254k02484
$$ 122304 -75246 -187090 -1246 224945 -181946 -334952 73951 258292 -79254 -281738
11798b81738I1695D1602b53229P2829G9874J58356b72520J20116g1322B6941a60766
$$ -281738 91695 41602 -253229 -180400 79874 238230 -272520 -152404 -71322 26941 -160766
11786d69131A24180b34537B9541b90203c4397A62350A3532F657a51415B93902
$$ -469131 124180 -234537 29541 -290203 -34397 162350 13532 6657 -151415 293902
11775A48575h5179a4088C85476j39558b67263A89825D5507g859l39582a45567
$$ 148575 -85179 -14088 385476 245918 -267263 189825 45507 -7859 -347441 -145567
11764G383a58755F7408i1788j34527h7087B02025G8736B0886h7808A00786C4184
$$ 7383 -158755 67408 -91788 -226315 -87087 202025 78736 20886 -87808 100786 34184
11752a54027j39263C81766a8194j4628m879k57974A03996Q3062a69550a4630A4555
$$ -154027 -293290 381766 -18194 -32822 -37701 -295675 103996 187058 -169550 -14630 14555
11740a75898e3085B97355N6540e2857H1000c93349e8166n0009L1462k21165C9726
$$ -175898 -53085 297355 353895 -52857 81000 -393349 -58166 -108175 -76713 -297878 39726
11728C59243a25951L2534A46266a27411A83516a11558n544k1119A63429F1016
$$ 359243 -125951 -93417 146266 -127411 183516 -111558 -117102 -138221 163429 61016
11717A26942a47807A20363h5523A90147M5507D9889J18660L826a15013F8419N2113
$$ 126942 -147807 120363 -85523 190147 235654 49889 168549 172375 -115013 68419 120532
11706A20532a41926A04351b30122k1870G2547i8421C4269b58580m691D2498q305
$$ 120532 -141926 104351 -230122 -251992 72547 -98421 34269 -258580 -263271 42498 34193
11695C4193J55807I3858b7269i919C7497R9415b14189G9220K58755a13446N4431
$$ 34193 190000 93858 -27269 -9919 37497 136912 -214189 79220 337975 -113446 -59015
11684e9015i29A51082a78046A31492B2264g3148A10695b81215H0523a94883J958
$$ -59015 -929 151082 -178046 131492 22264 -73148 110695 -281215 80523 -194883 -192925
11673a92925B73260g6986K1839A24540a15938A33844D4230J73031F892b35744
$$ -192925 273260 -76986 -55147 124540 -115938 133844 44230 217261 6892 -235744
11662B47948a11110n911C50877a08309A6050N1672b3900j57645A0679a40240M7648
$$ 247948 -111110 -117021 350877 -108309 16050 67722 -23900 -181545 10679 -140240 -92592
11651i2592B57649b78333A7936a32285B60244d7827B49094B3707J81792a18411
$$ -92592 257649 -278333 17936 -132285 260244 -47827 249094 23707 205499 -118411
11640a47017N5246o1626A14757a52760A19999K79511f7202B0539K14079c79044
$$ -147017 -91771 -153397 114757 -152760 119999 399510 -67202 20539 234618 -379044
11629A1677e9025A28104b02725n091h0891A53383a73070a2564k08880O9250e2124
$$ 11677 -59025 128104 -202725 -207816 -80891 153383 -173070 -12564 -221444 -152194 -52124
11617A28488a04192m3871A16289h5733A75502l6850g9140l17683N4938F5487J05378
$$ 128488 -104192 -148063 116289 -85733 175502 138652 -79140 -396823 -341885 65487 170865
11606A70865c13379A10024E4371a43373A00775b13179b7523F6213i2605K2793
$$ 170865 -313379 110024 54371 -143373 100775 -213179 -27523 66213 -92605 -69812
11596f9812l7688M1803r3118D2140J21315i0194K8848A28199h6617L8644m0273
$$ -69812 -107500 -65697 -158815 42140 163455 -90194 -61346 128199 -86617 -47973 -88246
11585h8246c8889q9531H969J62886b79857D0337a41321A81384I219J18199b82424
$$ -88246 -38889 -128420 8969 171855 -279857 40337 -141321 181384 9219 127418 -282424
11573B81464b82411h0996d402H2102a09154A80315P2757I2435C3282M3347J3917
$$ 281464 -282411 -80996 -4402 82102 -109154 180315 253072 92435 33282 76629 90546
11562I0546a31729B07887F3802J73753a3556E1646c25515a20907I5573J0788a85546
$$ 90546 -131729 207887 63802 237555 -13556 51646 -325515 -120907 95573 106361 -185546
11550B68936c1475A39142m931b82640F6710B7507K3878b15112D6158d396H9521
$$ 268936 -31475 139142 134211 -282640 66710 27507 51385 -215112 46158 -4396 89521
11538a47599A39690f1143b2426o7551C22240c19002A40660K78717a53372A25966
$$ -147599 139690 -61143 -22426 -89977 322240 -319002 140660 419377 -153372 125966
11527i9780f84E5814e4079A4235L1516a54738f9386A85141J50148a17862B07026
$$ -99780 -684 55814 -54079 14235 45751 -154738 -69386 185141 335289 -117862 207026
11515B47529A192J47097J64020f8688l1835A32402h0824K5462a7321k05917A66605
$$ 247529 1192 148289 312309 -68688 -100523 132402 -80824 -55362 -17321 -223238 166605
11503F5273B4394a63573G2500a16196l1838B54437j10302J68950j9338G2118h042
$$ 65273 24394 -163573 72500 -116196 -148034 254437 144135 313085 293747 72118 -8042
11491A15257N2982H2992a56995j56793C39493i6159B65567d9140G3671j1008Q113
$$ 115257 168239 82992 -156995 -313788 339493 -96159 265567 -49140 73671 62663 70776
11480G0776a42977l2138C2330N0006J12251q8520E0420J89064i1976C6570e7496
$$ 70776 -142977 -175115 32330 82336 194587 106067 50420 239484 -91976 36570 -57496
11468D82511a9971Q335A76017K1683O8652R1932r6354H7878R3629P2699b4947
$$ 482511 -19971 -11636 176017 197700 266352 358284 261930 87878 181507 254206 -24947
11456E5365k306i7326q294C27845j15049a9009j24390K5478B8035d8559C71207
$$ 55365 53059 -97326 -105620 327845 212796 -19009 -143399 -117921 28035 -48559 371207
11444B0261c0155m6363n6574C33402A65725l8064l9145M7639l8187f7709A20203
$$ 20261 -30155 -76518 -133092 333402 165725 127661 88516 136155 97968 -67709 120203
11432b3767m6069G5555J82064n7946L0901r4105J3701J3755b23520f6932l6606
$$ -23767 -69836 75555 257619 199673 230574 136469 150170 163925 -223520 -66932 -103538
11421a03538K0157a5951k7664A52797p1083h761q0016e350A33344b54853F2833
$$ -103538 -83381 -15951 -43615 152797 81714 -8761 -88777 -5350 133344 -254853 62833
11409B55779F2397B808a28632C9864f7137A09612a94843n1907h8005c8169n1261
$$ 255779 62397 2808 -128632 39864 -67137 109612 -194843 -246750 -88005 -38169 -89430
11398h9430m3252k51116A08256d7931j02085k1469L4072j63855D55779a37826
$$ -89430 -132682 -383798 108256 -47931 -150016 -171485 -137413 -301268 455779 -137826
11387A4676M430L02683C4780f2657A60236J11572D6955a18114A57202a26301H4250
$$ 14676 19106 321789 34780 -62657 160236 271808 46955 -118114 157202 -126301 84250
11375E7500P8894a95895l470k3671B4643f1798A63619O4661A05167C2191R1673
$$ 57500 136394 -195895 -199365 -223036 24643 -61798 163619 228280 105167 32191 123864
11364A23864d8822B47046d5135D1873b6477j06642M9480l4376B26395a66410A83207
$$ 123864 -48822 247046 -45135 41873 -26477 -133119 -83639 -118015 226395 -166410 183207
11352H9558g7918E7315n892a73460n0193O6137j55037D41108B04248E333R5017
$$ 89558 -77918 57315 51423 -173460 -223653 -157516 -312553 441108 204248 5333 100350
11341A00350K9638N2097h414F3177b5741B2550J28928l0267L6342J39356j37707
$$ 100350 129988 182085 -8414 63177 -25741 22550 151478 121211 157553 296909 159202
11330A59202L7210H4378C9187c8352n0237j4357c8896d19n8810j41607B50680
$$ 159202 196412 84378 39187 -38352 -88589 -102946 -38896 -419 -59229 -200836 250680
11318B7091d912k50016N5656A811b83828a24982A78079M1886b56320R3234D14929
$$ 27091 -4912 -254928 -199272 1811 -283828 -124982 178079 219965 -256320 -163086 414929
11306e039I8922d6811j2779B46705b6068j03910N0391K6147E4448A244c5602p3540
$$ -5039 98922 -46811 -59590 246705 -26068 -129978 -79587 -53440 54448 1244 -35602 -109142
11294a09142B74332g4099j09515h8873j48341A9302c532k74227f4917p8376q7989
$$ -109142 274332 -74099 -183614 -88873 -237214 19302 -3532 -277759 -64917 -143293 -231282
11283b31282O4962G7271O0656a43831h721m03065a8590k1867k8774k09354J1657
$$ -231282 -166320 77271 137927 -143831 -8721 -411786 -18590 -40457 -69231 -278585 -266928
11272b66928D7482L5146a1449j34920g815j62993a4282A34228b2634q9986D730
$$ -266928 47482 82628 -11449 -146369 -7815 -170808 -14282 134228 -22634 -112620 4730
11260c91442a07184M2150D6753N5070b1507A50296a33460k25565j79593g9693
$$ -391442 -107184 -65034 46753 101823 -21507 150296 -133460 -359025 -538618 -79693
11249b27519J10227p9394D750J26593e5208E6249M0889c9938B44535J48a76688
$$ -227519 -117292 -196686 4750 131343 -55208 56249 97138 -39938 244535 244683 -176688
11237B1190J1939J24928e30754b38885C9683a080k51334g646A0671b2313A2946
$$ 21190 33129 158057 -530754 -238885 39683 -1080 -252414 -7646 10671 -22313 12946
11225A30550A0051b30171R9048j4747k8566P3154j87443B72270a63489A99028
$$ 130550 10051 -230171 -131123 -145870 -174436 -101282 -288725 272270 -163489 199028
11214I9707N4681m2187A1221c0490k04321O8209B01091a18120j0485D7163E437
$$ 99707 154388 112201 11221 -30490 -234811 -166602 201091 -118120 -128605 47163 5437
11202B93162b24026b5414N013k23682a2135K53A30250A7519N9885M0696D3631
$$ 293162 -224026 -25414 -20401 -244083 -12135 -11882 130250 17519 77404 118100 43631
11190A09787C6972b23360D28354A21981f1662o4846A00042J56944C7462a78120
$$ 109787 36972 -223360 428354 121981 -61662 -126508 100042 256986 37462 -178120
11179h1725j09539l87374a44908B27745o7984O8411C28a21757G2887k0481J58262
$$ -81725 -191264 -578638 -144908 227745 159761 228172 328 -121757 72887 52406 210668
11168B10668b10897k55758a93597A31339e9617l11666b2718k61235A27320b65541
$$ 210668 -210897 -466655 -193597 131339 -59617 -371283 -22718 -283953 127320 -265541
11157b84485a35341l17187B67827b27580m0737k58810b07627k21R6323c7681k12560
$$ -284485 -135341 -452528 267827 -227580 -268317 -527127 -207627 -207848 -111525 -37681 -250241
11146b50241J04201f5762E361h3536m9070e825C70372c7591j07155B61178b98037
$$ -250241 -146040 -65762 5361 -83536 -132606 -5825 370372 -37591 -144746 261178 -298037
11134a35616B8100j1395a50502A7907a33823G7827c71300e8656m7557P800j74408
$$ -135616 28100 16705 -150502 17907 -133823 77827 -371300 -58656 -106213 -98413 -272821
11123b72821d8473C60888d3354C55670a42947C06055a56760B63782a59646B293
$$ -272821 -48473 360888 -43354 355670 -142947 306055 -156760 263782 -159646 2293
11112C10581a57984E5485J1204J92995n4779D6936P1100D1920J33256a26976b80
$$ 310581 -157984 55485 66689 259684 204905 46936 118036 41920 175176 -126976 -280
11100a32747j47259d7405E82651k89296a35307B87688H5812b20697E0195J52620
$$ -132747 -280006 -47405 582651 293355 -135307 287688 85812 -220697 50195 202815
11090B02815b63833B32773l3099k1089A9958Q5146A8517Q7395l3511J44796B7857
$$ 202815 -263833 232773 199674 178585 19958 105104 18517 105912 72401 217197 27857
11078A19239D4092f4786l85549A68811K372L1124c476D66863k15745c3751r481
$$ 119239 44092 -64786 -450335 168811 171183 202307 -3476 466863 251118 -33751 -43232
11067d3232B31299H0971K60038K2756j49287K21878e0561D25869A4077J75065
$$ -43232 231299 80971 341009 363765 214478 436356 -50561 425869 14077 189142
11057A89142J27859b12342B65027I9791K18333j08012I3030J68807K21446B29429
$$ 189142 317001 -212342 265027 99791 318124 210112 93030 261837 483283 229429
11046B11445L12360j25826I7127M71494n7763j49268K26792J47388B38897K91217
$$ 211445 523805 397979 97127 568621 510858 361590 588382 735770 238897 530114
11036E30114o01J83735Q5687j42183j5873k87800M04209j96562A69639L35946
$$ 530114 529513 713248 798935 656752 640879 353079 757288 560726 169639 505585
11026E05585L0687J59352P2830J91310k76878J1827L22421l24102j54589k01321
$$ 505585 536272 695624 768454 959764 682886 694713 1017134 693032 538443 337122
11016C37122K75879q6784K30479j06567N5029J21288n8139k0366j54767K8501
$$ 337122 613001 526217 756696 650129 705158 826446 768307 747941 593174 621675
11006F21675L03881l87556L20797j58498k35681m0634j35309K73097k29561L65018
$$ 621675 925556 538000 858797 700299 464618 423984 288675 561772 332211 697229
10996F97229j70973A37146N41478k45033R6142J22098k36827j50139K52708A29786
$$ 697229 526256 137146 678624 433591 529733 651831 415004 264865 517573 129786
10985E20290o8300A90899J31419K86633j65027M24066k72592J01807k81536M20751
$$ 520290 451990 190899 322318 608951 443924 867990 595398 697205 415669 836420
10975H36420k07313J45024l01468J71612J37421r6928Q4267K33089j09265j97857
$$ 836420 629107 774131 472663 644275 781696 684768 769035 1002124 892859 695002
10965F95002Q9844p504M13444j95614J3398N8571K80499j16312K4744M73036M83589
$$ 695002 784846 777342 1190786 995172 1008570 1067141 1347640 1231328 1256072 1729108 2212697
10954B212697j08734N8702J80862R4007M2806l47700j58434p925j02998r5018
$$ 2212697 2103963 2162665 2343527 2437534 2480340 2132640 1974206 1966281 1863283 1768265
10944A768265j53797k90876k27220L48718L07117n14351l5295j35791K10325R2597
$$ 1768265 1614468 1323592 1096372 1445090 1752207 1237856 1202561 1066770 1277095 1369692
10934A369692j91430j44466k22090k61943K29994k87371M2285j44285j74663J59084
$$ 1369692 1178262 1033796 811706 549763 779757 492386 534671 390386 215723 374807
10924C74807A02382D3239R8953J2540f7922B55759Q6895n2085j36517d5119j6986
$$ 374807 102382 43239 142192 154732 -67922 255759 342654 290569 154052 -45119 -62105
10913f2105j50137A54568b21195B82924E4025h4717B6459f7929B11465b90394
$$ -62105 -212242 154568 -221195 282924 54025 -84717 26459 -67929 211465 -290394
10902a03979G9592j55a43982k4383E9120b11290B36552a41151b1424B16293E4940
$$ -103979 79592 79437 -143982 -168365 59120 -211290 236552 -141151 -21424 216293 54940
10890A60369b52513C8582a45423I0133b61259B67740j2565a83293D4626a6636
$$ 160369 -252513 38582 -145423 90133 -261259 267740 255175 -183293 44626 -16636
10879d44193H6574K62571j47628a2324l2518p426J8753O488j38011P0436C19708
$$ -444193 86574 349145 201517 -12324 -44842 -52268 -33515 -27027 -165038 -94602 319708
10867A49407F7895J08173b61975e8991k11579P5574j12488B91271A02904b30574
$$ 149407 67895 176068 -261975 -58991 -270570 -194996 -307484 291271 102904 -230574
10856b1067B16200d405j10548A26898b05421A5135c8443B1651f3533L0771A13556
$$ -21067 216200 -4405 -114953 126898 -205421 15135 -38443 21651 -63533 -32762 113556
10844c9390r7858B1837K88808A6027a72424h1428A71153p2920c55042N0705a35661
$$ -39390 -137248 21837 310645 16027 -172424 -81428 171153 98233 -355042 -304337 -135661
10832c2860D5351a72481C43253a76692A06407a29995j16909e3092j29240B50156
$$ -32860 45351 -172481 343253 -176692 106407 -129995 -246904 -53092 -182332 250156
10821d2045k6453n9555j15791A00250a40477C33699d1151j81301A7058a61022
$$ -42045 -68498 -128053 -243844 100250 -140477 333699 -41151 -222452 17058 -161022
10810a62749A27680a9687j09096B53073h5448D0650l607J0838b64309K221A43973
$$ -162749 127680 -19687 -128783 253073 -85448 40650 37043 47881 -264309 -262088 143973
10798i2650f194j48001j85474P1709C8808b59461b1891A98043A8945O1390k8245
$$ -92650 -6194 -154195 -339669 -267960 38808 -259461 -21891 198043 18945 80335 52090
10787E2090a86137B43612b87782A15511D8004a25020a4080k7728k57207e6925
$$ 52090 -186137 243612 -287782 115511 48004 -125020 -14080 -41808 -299015 -56925
10776A12097C9311a23313B3594r455a19210F5534a01740j3508A02221b69592f2258
$$ 112097 39311 -123313 23594 14139 -119210 65534 -101740 -115248 102221 -269592 -62258
10764a89148A5616D333b10503A89417f265j71960F7838b63203i259j843H846J4308
$$ -189148 15616 4333 -210503 189417 -6265 -178225 67838 -263203 -9259 -11102 8846 23154
10752B3154g443B5725a40804q5276R6737K2577l3044A76281c30595H5902h519
$$ 23154 -7443 25725 -140804 -226080 -129343 -106766 -139810 176281 -330595 85902 -8519
10740C18665i0361l4199E245c5330A45824b19161G1453d94881f3049n2888I1716
$$ 318665 -90361 -124560 5245 -35330 145824 -219161 71453 -494881 -63049 -115937 91716
10728a8512A06058B2073a30059G6820a43511A69079b05453G6831a18238k00893
$$ -18512 106058 22073 -130059 76820 -143511 169079 -205453 76831 -118238 -319131
10718c19131b5460k30366Q6572A57320A2374b6585q6234B61633a68170J4122B92023
$$ -319131 -25460 -255826 -169254 157320 12374 -26585 -112819 261633 -168170 -154048 292023
10706C40877b06193B7325K2165A5754b09900b4890k65396A43022a60413e5633
$$ 340877 -206193 27325 49490 15754 -209900 -24890 -290286 143022 -160413 -55633
10695a77936C61882A68098d32849b01675B13089a11464b0489j61897e282F9301
$$ -177936 361882 168098 -432849 -201675 213089 -111464 -20489 -182386 -5282 69301
10684G0171c8172j70423A6968i4266I9521a60041I3885b71091f6541B34803c4275
$$ 70171 -38172 -208595 16968 -94266 99521 -160041 93885 -271091 -66541 234803 -34275
10672b8182n8825A50326e3139l278o2308L2521C50700b95715B33856b47431C0521
$$ -28182 -87007 150326 -53139 -56417 -118725 -86204 350700 -295715 233856 -247431 30521
10660i2300A35600C2509j3503c45013A13361M7176L4427a1729A15698D0754N1014
$$ -92300 135600 32509 19006 -345013 113361 160537 194964 -11729 115698 40754 91768
10649I1768c2925k46506j3597j81664h7223L2093G7029C5042a75817m0011L0912
$$ 91768 -32925 -279431 -293028 -474692 -87223 -55130 77029 35042 -175817 -215828 -184916
10638a84916E6272d37566G8100a19085q397a2952k14769C9222O0110m1612R8964
$$ -184916 56272 -437566 78100 -119085 -127482 -12952 -227721 39222 99332 57720 156684
10627A56684b97773F6529f8507C16456a99481E5479h6522j38232A67639b486j04907
$$ 156684 -297773 66529 -68507 316456 -199481 55479 -86522 -224754 167639 -2486 -107393
10616a07393J0986q7775C19866b17170j6515O0747c306j56928q6610J16939L4124
$$ -107393 -96407 -184182 319866 -217170 -233685 -172938 -3306 -160234 -246844 -129905 -95781
10605i5781N65A10400m3208K560c99985a05208d3933j51557N7739G4532a80484
$$ -95781 -95216 110400 67192 69752 -399985 -105208 -43933 -195490 -137751 74532 -180484
10593C3094a27064A86847I361a55688j77522b2554A11164m2987a15555A19001
$$ 33094 -127064 186847 9361 -155688 -333210 -22554 111164 68177 -115555 119001
10582a4435l26396f6309H9357h3841A24417b07209E1882e1387A32045b33679h8000
$$ -14435 -340831 -66309 89357 -83841 124417 -207209 51882 -51387 132045 -233679 -88000
10570d31540C5522a42174c9556A75205c63548A96178E8965M7931a39200A35000
$$ -431540 35522 -142174 -39556 175205 -363548 196178 58965 106896 -139200 135000
10559c50255B15786J09450j51800Q8203b78725J7477J08013A06370d09123A05699
$$ -350255 215786 325236 173436 261639 -278725 -261248 -153235 106370 -409123 105699
10548e6846A0598b74752B0899a46875P0777C32104b88450A50711a97414b8105
$$ -56846 10598 -274752 20899 -146875 -76098 332104 -288450 150711 -197414 -28105
10537A04414i9965D10958b11044Q6933j10591C76124A45586a95124A64727H206
$$ 104414 -99965 410958 -211044 -124111 -234702 376124 145586 -195124 164727 8206
10526e0203B86374F635J37003g7051k0667k48546a206k66819e9285k44691J11837
$$ -50203 286374 6635 143638 -77051 -97718 -346264 -1206 -268025 -59285 -303976 -192139
10515a92139e8268j43207j81270a36967l6177o4284A07968a9806j86669f0801
$$ -192139 -58268 -201475 -382745 -136967 -173144 -237428 107968 -19806 -206475 -60801
10504D7108K19631c11398A18905b44251J08316q3204j12434B23183i466G0376
$$ 47108 266739 -311398 118905 -244251 -135935 -219139 -331573 223183 -9466 70376
10493c4710j50664c1251g950k93647A39313J1729a12203B57Q3642k951Q4708K24057
$$ -34710 -185374 -31251 -7950 -301597 139313 151042 -112203 257 83899 80948 165656 389713
10481C89713A35799f5604J2021C3739J30945f4534B35986a61990F0542a51644
$$ 389713 135799 -65604 -53583 33739 164684 -64534 235986 -161990 60542 -151644
10470a18480A058b45026D5517J18164J29540J8695A23668a5322C76507A2085J92541
$$ -118480 1058 -245026 45517 163681 293221 311916 123668 -15322 376507 12085 204626
10459B04626I7696J51372L6679r8541P5882a7609C2353K7330R8263b42948Q7306
$$ 204626 97696 249068 285747 187206 263088 -17609 32353 59683 157946 -242948 -155642
10448a55642A62043c2303A74252b68981c431j42694A39046F4134a52283A74626
$$ -155642 162043 -32303 174252 -268981 -3431 -146125 139046 64134 -152283 174626
10437i3685D9558a57483l06831a82914Q5801H9740c43710a48361b1228F808R4245
$$ -93685 49558 -157483 -464314 -182914 -97113 89740 -343710 -148361 -21228 6808 101053
10426A01053k7488a10138j48916A11783l8459Q1086h444H7262a03296a1137j15521
$$ 101053 73565 -110138 -259054 111783 73324 154410 -8444 87262 -103296 -11137 -126658
10415a26658e4705j20987a3883j88119C77502A28733d63695q9032A46010J09907
$$ -126658 -54705 -175692 -13883 -202002 377502 128733 -463695 -552727 146010 255917
10405B55917a07813O118b1577F4068c7247A91587a65370O2224o2222a6765m6745
$$ 255917 -107813 -101695 -21577 64068 -37247 191587 -165370 -103146 -165368 -16765 -63510
10394f3510k2312A32674B250b84407f6962I2817A8466J237N7321b3120j74895
$$ -63510 -85822 132674 2250 -284407 -66962 92817 18466 19703 77024 -23120 -198015
10383a98015B19289a21171A17342a33451G3335d8240p5274A69741c3129B7839
$$ -198015 219289 -121171 117342 -133451 73335 -48240 -123514 169741 -33129 27839
10372a27181b9091C77252A63800h868p6621A43113d15j31307m9529o3785A76037
$$ -127181 -29091 377252 163800 -8868 -85489 143113 -415 -131722 -181251 -245036 176037
10360a52889A84171l575h8198A90215i9351c1430B09242o3172m2639N4312K76796
$$ -152889 184171 180596 -88198 190215 -99351 -31430 209242 146070 103431 157743 434539
10349D34539H2231K6372L68458A85908K99240G3312j8307P7942n594J51969c5724
$$ 434539 82231 108603 477061 185908 485148 73312 55005 132947 127353 279322 -35724
10337a02022C69543E8561L63737A40424M18345l4395B53096q6577F7426k5554
$$ -102022 369543 58561 422298 140424 558769 524374 253096 166519 67426 41872
10327D1872K48343j41222M52300k80660j6752M4304n5917A02271J09396r8206
$$ 41872 290215 148993 601293 320633 303881 348185 292268 102271 211667 113461
10317A13461b00178A07966d2691B15115h4738m0437A7511R6114K7982Q9761G0414
$$ 113461 -200178 107966 -42691 215115 -84738 -125175 17511 113625 141607 231368 70414
10305i416n1705B82526h8547B33850Q872i8211j45895C02203n2681K0777n3191
$$ -9416 -61121 282526 -88547 233850 242722 -98211 -244106 302203 249522 270299 217108
10294B17108m7348d2864h665H4820R6845d1326B38233a76552B5452L01745b68712
$$ 217108 169760 -42864 -8665 84820 181665 -41326 238233 -176552 25452 327197 -268712
10282A76823O1209c9738C8999K59875a1834j13619A36313J08589a1558l1747Q904
$$ 176823 238032 -39738 38999 298874 -11834 -125453 136313 244902 -11558 -43305 -34401
10271c4401A80312c26035i0172E5235b95000a25740E0206a50707A05220b50396
$$ -34401 180312 -326035 -90172 55235 -295000 -125740 50206 -150707 105220 -250396
10260a34901B9446q684b56594J16234B41330A8713b12785a8396H7835a39603C0646
$$ -134901 29446 20762 -256594 -140360 241330 18713 -212785 -18396 87835 -139603 30646
10248A11892A2689a71752C25919f4493J0813A29560O9911E0152D406J09863M37126
$$ 111892 12689 -171752 325919 -64493 -53680 129560 199471 50152 4406 114269 551395
10237E51395F6225R5408C0834P956K556L3523j409R4546C67b61084j21577J51586
$$ 551395 66225 161633 30834 38790 41346 74869 73460 168006 367 -261084 -382661 -231075
10225b31075g8294C71106b01841I132J21001a03268A07490a76952H3154a17112
$$ -231075 -78294 371106 -201841 9132 130133 -103268 107490 -176952 83154 -117112
10214A29956D4608g9895j53533J13440m423J9421A13975B3578P3851B964c60485
$$ 129956 44608 -79895 -233428 -119988 -124411 -104990 113975 23578 97429 2964 -360485
10202b50017J01700e1024E6714a75183P8202E4907b98820A31184a00840j84294
$$ -250017 -148317 -51024 56714 -175183 -96981 54907 -298820 131184 -100840 -285134
10192b85134G3073a61336e2730o638C06322I3099k6068O2267c49435b3067l96533
$$ -285134 73073 -161336 -52730 -59368 306322 93099 67031 129298 -349435 -23067 -419600
10181d19600b2272j54390P5579b2451l11276N8274D6417b14213j42346P5149Q9669
$$ -419600 -22272 -176662 -101083 -22451 -333727 -275453 46417 -214213 -356559 -281410 -191741
10170a91741g2015A81353K4188G8459N5776a33373B42772c66178a44593L9698
$$ -191741 -72015 181353 205541 78459 134235 -133373 242772 -366178 -144593 -104895
10160a04895E9526J00903J47313b75160A71916c779j26291l44965B59618h6445
$$ -104895 59526 160429 307742 -275160 171916 -3779 -130070 -475035 259618 -86445
10149h5406k22818a35357j25067i9682l28044a98722b3341B69173g5683k4759
$$ -85406 -308224 -135357 -260424 -99682 -427726 -198722 -23341 269173 -75683 -100442
10139a00442B92636a0911j56962N1045j6252O2894j44529a0059j61691e5518k00576
$$ -100442 292636 -10911 -167873 -116828 -133080 -70186 -214715 -10059 -171750 -55518 -256094
10128b56094d0528D7422l273a64506j00521A4334b12665C8515O879M847c6689
$$ -256094 -40528 47422 44149 -164506 -265027 14334 -212665 38515 45394 50241 -36689
10116A14936m9145K20114a58949f7437j46251G2951Q2314B1151L3401M2638a93583
$$ 114936 65791 285905 -158949 -67437 -213688 72951 155265 21151 54552 97190 -193583
10104a05840A3314d04178a70699D5052a9631A07723d1439j43490A54200f7600
$$ -105840 13314 -404178 -170699 45052 -19631 107723 -41439 -184929 154200 -67600
10093b481q525B26634a72592A68193o7942a54306O1149K5548A00731a98552o1186
$$ -2481 -11006 226634 -172592 168193 100251 -154306 -93157 -67609 100731 -198552 -259738
10082b59738J8787f1103A69333m574E9176b10178p1244R1872I7243D4814b70732
$$ -259738 -240951 -61103 169333 164759 59176 -210178 -281422 -189550 97243 44814 -270732
10070A08789a06326A27610R2815b51841J16938j6523B74439c8732C94581h8631
$$ 108789 -106326 127610 220425 -251841 -134903 -151426 274439 -38732 394581 -88631
10059H3609a51191l8766g5579G5169c6774A7044b67991g1701B2613I956J40974
$$ 83609 -151191 -189957 -75579 75169 -36774 17044 -267991 -71701 22613 9956 150930
10048A50930b75709H562C515K05502a60752B89980F1409R1968a18299A43648a15326
$$ 150930 -275709 8562 3515 209017 -160752 289980 61409 153377 -118299 143648 -115326
10036A06718a28268B16350o8579h6162q6477b5981A0618g6894p8543C25656a00795
$$ 106718 -128268 216350 147771 -86162 -172639 -25981 10618 -76894 -155437 325656 -100795
10024d6910m82550K36410F50b44525g7644A70634a55294k0702j84342L5515R0146
$$ -46910 -529460 -293050 650 -244525 -77644 170634 -155294 -175996 -360338 -324823 -234677
10013b34677A58154a36139j08788g4496m5746p9439P3333j10495a16172o5801
$$ -234677 158154 -136139 -244927 -74496 -120242 -199681 -126348 -236843 -116172 -181973
10003a81973A57637J06185E8822e6748b6982j98720B05474a01779k86399D42968
$$ -181973 157637 263822 58822 -56748 -26982 -225702 205474 -101779 -388178 442968
9992C5523M8403b54257R4519N4163i064j26760n6536e5826m61931A19188a92916
$$ 35523 83926 -254257 -159738 -105575 -9064 -135824 -192360 -55826 -517757 119188 -192916
9980b92671F451J15469b4444o8276l64077C3782b56190e1736I3791a98373i3957
$$ -292671 6451 121920 -24444 -92720 -456797 33782 -256190 -51736 93791 -198373 -93957
9968h8737j98942a27205K2490H5525J24053I4919l7388f0737k36465n6193Q5887
$$ -88737 -287679 -127205 -104715 85525 209578 94919 57531 -60737 -297202 -353395 -267508
9957b67508E4828j3859e8572h367j20750K418j83510J09880A1148a22528j24158
$$ -267508 54828 40969 -58572 -8367 -129117 -126699 -310209 -200329 11148 -122528 -246686
9946b46686K5821O4333l7687I5953m0729c51728A13844a17304j19259l25554A9378
$$ -246686 -220865 -156532 -194219 95953 55224 -351728 113844 -117304 -236563 -562117 19378
9934I4388i1072A70058d8559j40162i4018j62667A16083m2335j3501k8167K17025
$$ 94388 -91072 170058 -48559 -188721 -94018 -256685 116083 73748 60247 32080 249105
9923B49105C0096b43638E5354k7323d3013J1156A27116g0777D38125c69292m4234
$$ 249105 30096 -243638 55354 28031 -43013 -31857 127116 -70777 438125 -369292 -413526
9912d13526D4768a88539j55678A92867A0765a94573p6462A41112a6667B45675
$$ -413526 44768 -188539 -344217 192867 10765 -194573 -271035 141112 -16667 245675
9901a65173k6182L2973H8022l6324a81983o2746h0726k78217B800N1719i2301
$$ -165173 -191355 -158382 88022 51698 -181983 -244729 -80726 -358943 2800 54519 -92301
9889C23616b51877i5841a6735j24700D4b1540A4826a44154l198r2872f9991j03950
$$ 323616 -251877 -95841 -16735 -141435 44 -21540 14826 -144154 -147352 -240224 -69991 -173941
9877a73941d869A40312a67985L4613p5690G9492a62269B24470d81518B7463d29318
$$ -173941 -4869 140312 -167985 -133372 -209062 79492 -162269 224470 -481518 27463 -429318
9865A36060m0397c08608J28480B3221Q8862K82173A15303c4734k48766m5113A61090
$$ 136060 95663 -308608 -180128 23221 112083 394256 115303 -34734 -283500 -328613 161090
9853C873R1057C9409a43833c4047A98852a71726j29691A1406A479K023f6082A56138
$$ 3873 94930 39409 -143833 -34047 198852 -171726 -301417 11406 1479 3502 -66082 156138
9840A60247a15883K6112B89248a96632J6854H8574a73853b8290l15A46052a67387
$$ 160247 -115883 -89771 289248 -196632 -179778 88574 -173853 -28290 -28605 146052 -167387
9828a9698k0286j30277r3327k9304J14819B83604b46183b1343k11181D0632J60760
$$ -19698 -39984 -170261 -263588 -292892 -178073 283604 -246183 -21343 -232524 40632 201392
9817B01392H6699a45211c838k36742O5253A7899K99499A7138b24465P7833A31066
$$ 201392 86699 -145211 -3838 -240580 -175327 17899 317398 17138 -224465 -146632 131066
9805c3629j86028L4772H0150d7115A39309E8718d31042a37672j74764H287b51498
$$ -33629 -219657 -184885 80150 -47115 139309 58718 -431042 -137672 -312436 8287 -251498
9793b02071j53679J50584I9915D7041a58461e2245G3604a16762r8063P9791k37140
$$ -202071 -355750 -205166 99915 47041 -158461 -52245 73604 -116762 -214825 -135034 -372174
9782c72174D2607c059B3325G107i1728D0956h3308I9092f8917J4685A66623b6847
$$ -372174 42607 -3059 23325 7107 -91728 40956 -83308 99092 -68917 -54232 166623 -26847
9769A73038B6891J59402b69291A45164M5758b59978k16457A99300A8589i0917
$$ 173038 26891 186293 -269291 145164 190922 -259978 -476435 199300 18589 -90917
9758B56325q4489b77145B89316a56059L5330j56570a22071j3994E0740b77615
$$ 256325 171836 -277145 289316 -156059 -120729 -277299 -122071 -136065 50740 -277615
9747b74126j05451C0976A1586J21093g8422r2695n4575h8558k9778r0665H409
$$ -274126 -379577 30976 11586 132679 -78422 -171117 -225692 -88558 -118336 -209001 8409
9735D6917c09401O6286M1675q9616A2506a98664p9451J73A79006b29942r355k23853
$$ 46917 -309401 -243115 -201440 -291056 12506 -198664 -278115 -277942 179006 -229942 -239297 -463150
9723d63150a03422J7710k61840F8898g7271C5605a49177j12425I4377P640c32636
$$ -463150 -103422 -85712 -347552 68898 -77271 35605 -149177 -261602 94377 102017 -332636
9711A98009q041a69826G465a92676b5951j50152A1028a18116B38048b80664a3862
$$ 198009 189968 -169826 7465 -192676 -25951 -176103 11028 -118116 238048 -280664 -13862
9699a12405C12729E0335L6577a12129j88748Q8088h8154j94009g2286p6650j01445
$$ -112405 312729 50335 86912 -112129 -300877 -212789 -88154 -282163 -72286 -148936 -250381
9688b50381R2765j18226e0197A33742l4379D498J71365A7922a63757A18281j1743
$$ -250381 -157616 -275842 -50197 133742 99363 4498 175863 17922 -163757 118281 106538
9677A06538K324c75725J71963C6769d5853q6055l48996I176N734c16899d0103
$$ 106538 108862 -375725 -203762 36769 -45853 -131908 -480904 9176 14910 -316899 -40103
9665a54921c1450j28698d7804p0933b5286l91466f7445J838j03028a4916j63166
$$ -154921 -31450 -160148 -47804 -118737 -25286 -416752 -67445 -65607 -168635 -14916 -178082
9654a78082B24812E9266i1250c5086r2587n9623e3677D8107f4108j04783j51038
$$ -178082 224812 59266 -91250 -35086 -127673 -187296 -53677 48107 -64108 -168891 -319929
9643c19929d8822o5899I4335a32200d5254k45690k2474E5378d1331j48633h1749
$$ -319929 -48822 -114721 94335 -132200 -45254 -290944 -313418 55378 -41331 -189964 -81749
9631a76921K3749A46590i8366H9086h3434I2362e8108A3191b8529a1101k37938
$$ -176921 -153172 146590 -98366 89086 -83434 92362 -58108 13191 -28529 -11101 -249039
9620b49039a0085B78300b11123h9196a2684m02734A89838i1036j7335D2583a70620
$$ -249039 -10085 278300 -211123 -89196 -12684 -415418 189838 -91036 -108371 42583 -170620
9608D4328J4823a64863C9243c34261f4455A55881b40035K1096g0853A20053a99320
$$ 44328 59151 -164863 39243 -334261 -64455 155881 -240035 -218939 -70853 120053 -199320
9596A39631k2266C0907d7123J4773p7052C19410a88582M5088g233A05362h4422
$$ 139631 117365 30907 -47123 -32350 -109402 319410 -188582 -143494 -7233 105362 -84422
9584A03914i9332L1376j63107A6584d97320I7261m5726J95790b92479A05353a0729
$$ 103914 -99332 -67956 -231063 16584 -497320 97261 51535 247325 -292479 105353 -10729
9572C04730a20067L6152b8540j89776Q5873k94954c1226O915n3366A33769Q7970
$$ 304730 -120067 -83915 -28540 -218316 -132443 -427397 -31226 -24311 -77677 133769 221739
9561B21739a82562k37932a6122r453k97536J51522f0345k30758b8659G7214c22524
$$ 221739 -182562 -420494 -16122 -25575 -323111 -171589 -60345 -291103 -28659 77214 -322524
9549b31042Q1235L7425I557i4272A70601b24115E7265a5722k50179C55699a29525
$$ -231042 -149807 -112382 9557 -94272 170601 -224115 57265 -15722 -265901 355699 -129525
9537d685m37863a52148B39147c21064b4058C37957d8706n322A71530H076b47910
$$ -4685 -442548 -152148 239147 -321064 -24058 337957 -48706 -54028 171530 8076 -247910
9525c3282a0793B245b0605k48397B93873b64384J6037k13623A4119Q5856k4873
$$ -33282 -10793 2245 -20605 -269002 293873 -264384 -248347 -461970 14119 99975 75102
9514G5102a94392G7452a39402K1307j6082k1206k55895C542K1443a664k21678
$$ 75102 -194392 77452 -139402 -118095 -134177 -155383 -411278 3542 24985 -1664 -223342
9503b23342F9559d09320h4776A24747a84239D8714K03057n5521C6277a98429B5012
$$ -223342 69559 -409320 -84776 124747 -184239 48714 251771 196250 36277 -198429 25012
9491d3866C43389a50539O8634l58883a38831j78471f9960j92140i4857k3393N4255
$$ -43866 343389 -150539 -81905 -440788 -138831 -317302 -69960 -262100 -94857 -118250 -63995
9480f3995q1649A45041L0881c73407a15431A25732B2280J81353D4364a62208j80689
$$ -63995 -145644 145041 175922 -373407 -115431 125732 22280 203633 44364 -162208 -342897
9469c42897A3785e10404a15483A08812c2651l29224H2628b59350a18487o4851
$$ -342897 13785 -510404 -115483 108812 -32651 -361875 82628 -259350 -118487 -183338
9459a83338e7996b0427i419p1134m2806a0794j12005m9474k59314a42124l7821
$$ -183338 -57996 -20427 -9419 -80553 -123359 -10794 -122799 -172273 -431587 -142124 -179945
9448a79945b8582E4834b2701A24269a9174A8722M1423A4914c68062A48018f6907
$$ -179945 -28582 54834 -22701 124269 -19174 18722 60145 14914 -368062 148018 -66907
9436A64683i5973A72152O2890B6159K6013J06413e2428j75877g7157H8287i9720
$$ 164683 -95973 172152 235042 26159 52172 158585 -52428 -228305 -77157 88287 -99720
9424a90343B53708a4487A32044a10171B12387E3186b67202b7773F0710d709j94080
$$ -190343 253708 -14487 132044 -110171 212387 53186 -267202 -27773 60710 -4709 -198789
9413a98789A09775b72429A57340a92216J6121j24542P9090O0001F1911j212I449
$$ -198789 109775 -272429 157340 -192216 -176095 -300637 -221547 -161546 61911 60699 9449
9401i7314m3367A20496C4475a12533k9288C5162R2482o2960g7541o9905A8439
$$ -97314 -140681 120496 34475 -112533 -141821 35162 127644 64684 -77541 -147446 18439
9389A1186b53462K5367R5878M0533A7575b37971F695M4037N2776a23097B3554
$$ 11186 -253462 -228095 -132217 -91684 17575 -237971 6695 50732 103508 -123097 23554
9377h2041D3299j9287b69526a0923m01233D4188f0376B8463a6065k10531b544
$$ -82041 43299 24012 -269526 -10923 -412156 44188 -60376 28463 -16065 -226596 -2544
9365a10239j965a9944F2491b15044a5667j7636k5346B09017k2554n4547c43839
$$ -110239 -112204 -19944 62491 -215044 -15667 -33303 -58649 209017 186463 131916 -343839
9353h1309p2352A50853J3413b16297O7768B8440d0408j3562B35254a01361j06204
$$ -81309 -153661 150853 164266 -216297 -148529 28440 -40408 -53970 235254 -101361 -207565
9342b07565C4841d4685A23281a87279A26365D1625a53607E3569h120H6074a41764
$$ -207565 34841 -44685 123281 -187279 126365 41625 -153607 53569 -8120 86074 -141764
9330a93589e0829j14938j02545D44727a33206A34082c05029B17090b94030K3255
$$ -193589 -50829 -165767 -268312 444727 -133206 134082 -305029 217090 -294030 -270775
9320b70775P3027o335A980K3096i0303d1329j21793B2367J64821a86834A30455
$$ -270775 -197748 -204083 1980 25076 -90303 -41329 -163122 22367 187188 -186834 130455
9308b30271C03952c53055B36056H0530J92772c24495b7640B6682h4860C0155J22251
$$ -230271 303952 -353055 236056 80530 273302 -324495 -27640 26682 -84860 30155 152406
9297A52406a9767r0920l47271d8692j41787C47649a80081D3948g1694K1964r186
$$ 152406 -19767 -110687 -457958 -48692 -190479 347649 -180081 43948 -71694 -49730 -58916
9286e8916A82425d56776B0583a49370k62873a53309l9097A1841a25492m7262q5979
$$ -58916 182425 -456776 20583 -149370 -412243 -153309 -192406 11841 -125492 -172754 -258733
9275b58733g7101A4658a46471C10901g5665b4920o6071k33950h736I8684a53119
$$ -258733 -77101 14658 -146471 310901 -75665 -24920 -90991 -324941 -8736 98684 -153119
9263c1883C33049a00530D46151b2320n7570r1801d6093q9141B11285h1968J0242
$$ -31883 333049 -100530 446151 -22320 -79890 -171691 -46093 -135234 211285 -81968 -71726
9252g1726A95057c14444B49232b92270i5369E2561k6151a4028j80760A64728a72436
$$ -71726 195057 -314444 249232 -292270 -95369 52561 26410 -14028 -194788 164728 -172436
9240b73917J16870n5307A53792c73302B17336h0817q4165c3227q6270j03733b0050
$$ -273917 -157047 -212354 153792 -373302 217336 -80817 -164982 -33227 -119497 -223230 -20050
9228c38540D5597M8349k5076b5373J592k67976A79552m0543A1682a93009B2082
$$ -338540 45597 93946 68870 -25373 -23781 -291757 179552 139009 11682 -193009 22082
9216a19447j70056P4701h5416K3601B5082c00355a0566j26172i334F6351L1090
$$ -119447 -289503 -214802 -85416 -61815 25082 -300355 -10566 -136738 -9334 66351 97441
9205I7441a53007N7745d1142m5723B89978a44050B66732c13239C280a49854j93515
$$ 97441 -153007 -95262 -41142 -86865 289978 -144050 266732 -313239 3280 -149854 -343369
9194c43369f0139m669A35891E2023d09909a08844b5990p7690A20806b0426k7082
$$ -343369 -60139 -64808 135891 52023 -409909 -108844 -25990 -103680 120806 -20426 -47508
9183d7508H6424a35073O2828H5763L22723A34421h1799m9018m44a683o6263A60230
$$ -47508 86424 -135073 -72245 85763 408486 134421 -81799 -130817 -131261 -1683 -67946 160230
9170G6575c9462F151c53116j0126A23453C5179a769A07234b98473A32439b23479
$$ 76575 -39462 6151 -353116 -363242 123453 35179 -1769 107234 -298473 132439 -223479
9158E0734P884g6031j21937P4785J3312A5744b2619l2072A1343P7190c53639H7565
$$ 50734 58618 -76031 -197968 -123183 -109871 15744 -22619 -54691 11343 88533 -353639 87565
9145d19478F6295i5452m0939A54829i5500o7709n8316c240m6983A16892b63731
$$ -419478 66295 -95452 -136391 154829 -95500 -163209 -221525 -3240 -50223 116892 -263731
9133e1196a19A2200d46418C8130c45325B7564d0141B15126a29233a6332j38880
$$ -51196 -119 12200 -446418 38130 -345325 27564 -40141 215126 -129233 -16332 -155212
9122a55212A93871J00641q1956a56363O0289A5195b28484i9519l6992H817c12757
$$ -155212 193871 294512 212556 -156363 -96074 15195 -228484 -99519 -136511 8817 -312757
9110d48278A3669K5524D255c45604a43828H6872g5803B3136J96157a79952C2112
$$ -448278 13669 39193 4255 -345604 -143828 86872 -75803 23136 219293 -179952 32112
9098e6942k27086N1987D259L5208J86505G0067J11345H6463h3427A6778a7171
$$ -56942 -284028 -232041 4259 39467 225972 70067 181412 86463 -83427 16778 -17171
9086b3510k00338a11193D4291K55612I8450a11230j43840k5628j24838E40a97457
$$ -23510 -223848 -111193 44291 299903 98450 -111230 -255070 -280698 -405536 540 -197457
9074B7446b9422k35506E4879R0012a56007k6545A08164h8254D4403l737b62868
$$ 27446 -29422 -264928 54879 144891 -156007 -182552 108164 -88254 44403 40666 -262868
9062d16152E2848a17882j00861A41513a9817j70652B5801b52005B65030a80877
$$ -416152 52848 -117882 -218743 141513 -19817 -190469 25801 -252005 265030 -180877
9051A3107L0274J53398c17117L8573a1653j471j73279A21076A6238e6994A89416
$$ 13107 43381 196779 -317117 -278544 -11653 -13124 -186403 121076 16238 -56994 189416
9039a02640B80672a02489j1409a1165j80754A72125F3243l1012c1025l1433o7274
$$ -102640 280672 -102489 -113898 -11165 -191919 172125 63243 32231 -31025 -62458 -129732
9028a29732A22872a63296d9106r2529E5288d4009l9625C05891a81612d0377B30637
$$ -129732 122872 -163296 -49106 -141635 55288 -44009 -83634 305891 -181612 -40377 230637
9016C51472a48393A31368e6184G4972b5572k33695a304C9193e9745a595l24381
$$ 351472 -148393 131368 -56184 74972 -25572 -259267 -1304 39193 -59745 -1595 -325976
9005c25976a30044k25920K875B6643A515J53000b29504D1878b5369G1761c89382
$$ -325976 -130044 -355964 -353089 26643 1515 154515 -229504 41878 -25369 71761 -389382
8993B7242K67822h045j75845n2079F7399a26500E8320K62210B0076c32213A16265
$$ 27242 295064 -8045 -183890 -235969 67399 -126500 58320 320530 20076 -332213 116265
8981b94898B93158d8454A55471b2110j48930N0018N4077j67607k77236d5219k15663
$$ -294898 293158 -48454 155471 -22110 -171040 -121022 -66945 -234552 -511788 -45219 -260882
8970b60882K891C7362L2386J37341c20687j73350A00244N3640M5249R2714a30551
$$ -260882 -257991 37362 69748 207089 -320687 -494037 100244 153884 199133 291847 -130551
8958b50946j14151d005q9966E1353b8115B85940q2422a34375A00217c11682h4196
$$ -250946 -365097 -4005 -93971 51353 -28115 285940 203518 -134375 100217 -311682 -84196
8946A84724P4918a72865O8453q5671R3293j37635k02833A36649b21651B37739
$$ 184724 259642 -172865 -104412 -190083 -96790 -234425 -437258 136649 -221651 237739
8935c54816h3319j7736P351B59529a90883P2181K5986B75503k4224M7676a84871
$$ -354816 -83319 -101055 -93704 259529 -190883 -118702 -92716 275503 251279 298955 -184871
8923H3937a04472n3188k34415A08618Q4060f0575G1066L27831j47204q3559N8261
$$ 83937 -104472 -157660 -392075 108618 192678 -60575 71066 398897 251693 168134 226395
8912B26395j6979M967I9383J62984K95592J69286M78735J163198J459826M955252
$$ 226395 209416 214383 99383 262367 557959 727245 1205980 2369178 3829004 8784256
8902H784256m204599B086270I08587D43499j49811R5166j28001L7033H4441D1789
$$ 8784256 4579657 2086270 908587 443499 293688 388854 260853 297886 84441 41789
8891a35424f5946B03500r1649a81542B21051b45607a409A8585M2814a88701b1871
$$ -135424 -65946 203500 111851 -181542 221051 -245607 -1409 18585 61399 -188701 -21871
8879b76614B4436b6667j98043p1205k13133F2854A7428A565M0568j2792a57764
$$ -276614 24436 -26667 -224710 -295915 -509048 62854 17428 1565 42133 29341 -157764
8867A8480c04904c0309j223j7567E359J54413e9863k21003j42796a55322A16226
$$ 18480 -304904 -30309 -31532 -49099 5359 159772 -59863 -280866 -423662 -155322 116226
8855a58940J314F8915k5064P8647J54812F2482b13352B33640A12081d5315E9918
$$ -158940 -157626 68915 43851 122498 277310 62482 -213352 233640 112081 -45315 59918
8843A19721e0597A06519e5520l1852F9270d5568k26412a18889C39517A58242a82743
$$ 119721 -50597 106519 -55520 -87372 69270 -45568 -271980 -118889 339517 158242 -182743
$$ [...]
##END NTUPLES=NMR SPECTRUM
##END=
