
##TITLE=AC1088_CCPA01_5835881_zcJPuP1aM0
##JCAMPDX= 6.0         $$ Bruker NMR JCAMP-DX V2.0
##DATA TYPE= NMR SPECTRUM
##DATA CLASS= NTUPLES
##ORIGIN= BRUKER
##OWNER= Administrator
$$ 1.72 TOPSPIN		Version 2.1
$$ 2012-04-10 10:34:03.546 -0500  Administrator@TOPSPIN
$$ Compression mode = diff/dup
##.OBSERVE FREQUENCY= 400.13188235
##.OBSERVE NUCLEUS= ^1H
##.ACQUISITION MODE= SIMULTANEOUS (DQD)
##.ACQUISITION SCHEME= undefined
##.AVERAGES= 64
##.DIGITISER RES= 22
##SPECTROMETER/DATA SYSTEM= spect
##.PULSE SEQUENCE= noesygpps1d.comp
##.SOLVENT NAME= COFFEE_meoh
##.SHIFT REFERENCE= INTERNAL, COFFEE_meoh, 1, 14.9684
##AUDIT TRAIL= $$ (NUMBER, WHEN, WHO, WHERE, PROCESS, VERSION, WHAT)
$$ ##TITLE= Audit trail, TOPSPIN		Version 2.1
$$ ##JCAMPDX= 5.01
$$ ##ORIGIN= Bruker BioSpin GmbH
$$ ##OWNER= Administrator
$$ $$ C:\Bruker\TOPSPIN/data/COFFEE/nmr/AC1088_CCPA01_5835881_zcJPuP1aM0/12/pdata/1/auditp.txt
$$ ##AUDIT TRAIL=  $$ (NUMBER, WHEN, WHO, WHERE, PROCESS, VERSION, WHAT)
(   1,<2012-03-28 00:58:02.359 -0500>,<Administrator>,<TOPSPIN>,<go>,<TOPSPIN 2.1>,
      <created by zg
	started at 2012-03-28 00:46:30.125 -0500,
	POWCHK enabled, PULCHK disabled,
       configuration hash MD5:
       1A 1E CE 29 27 FD 77 03 67 4E F0 E3 C4 B2 CB 90
       data hash MD5: 64K
       6B 1B BD BB 14 23 DD 62 D4 C5 1A 98 22 1B 64 15>)
(   2,<2012-03-28 00:58:07.375 -0500>,<Administrator>,<TOPSPIN>,<proc1d>,<TOPSPIN 2.1>,
      <Start of raw data processing
       efp LB = 0.3 FT_mod = 6 PKNL = 1 PHC0 = 0 PHC1 = 0 SI = 128K 
       data hash MD5: 128K
       D5 BE C9 59 F1 26 A9 8F C4 F1 26 AE D8 4F 41 0A>)
(   3,<2012-03-28 00:58:09.203 -0500>,<Administrator>,<TOPSPIN>,<proc1d>,<TOPSPIN 2.1>,
      <pk PHC0 = 35.7605 PHC1 = 0 
       data hash MD5: 128K
       D8 97 F8 23 23 10 76 2A DA 4F 30 B5 97 CA F5 A6>)
(   4,<2012-03-28 00:58:10.031 -0500>,<Administrator>,<TOPSPIN>,<proc1d>,<TOPSPIN 2.1>,
      <abs ABSG = 1 
       data hash MD5: 128K
       89 0E AC 38 3D AD 2D 41 4C B4 CC C6 E3 62 8F 21>)
(   5,<2012-03-28 00:58:10.125 -0500>,<Administrator>,<TOPSPIN>,<proc1d>,<TOPSPIN 2.1>,
      <abs ABSG = 2 
       data hash MD5: 128K
       BA 2A A8 67 D1 08 13 EA A1 C4 0B 86 C5 38 F3 2E>)
(   6,<2012-03-28 00:58:10.187 -0500>,<Administrator>,<TOPSPIN>,<proc1d>,<TOPSPIN 2.1>,
      <abs ABSG = 3 
       data hash MD5: 128K
       B5 E7 87 42 60 27 22 B2 DA 32 64 BF 34 B6 03 E5>)
(   7,<2012-03-28 00:58:10.265 -0500>,<Administrator>,<TOPSPIN>,<proc1d>,<TOPSPIN 2.1>,
      <abs ABSG = 4 
       data hash MD5: 128K
       4E C5 84 B5 AF EF 6A 4D 09 48 17 0E D1 3B 29 BD>)
(   8,<2012-03-28 00:58:10.328 -0500>,<Administrator>,<TOPSPIN>,<proc1d>,<TOPSPIN 2.1>,
      <abs ABSG = 5 
       data hash MD5: 128K
       89 D3 82 C5 9D EE 2E 6C C1 68 05 E5 86 8A 06 46>)
(   9,<2012-03-28 00:58:11.203 -0500>,<Administrator>,<TOPSPIN>,<audit>,<TOPSPIN 2.1>,
      <user comment:
       ICON-NMR User ID: COFFEE
       data hash MD5: 128K
$$ [...]
##$TP07= 0
##$TPNAME0= <>
##$TPNAME1= <>
##$TPNAME2= <>
##$TPNAME3= <>
##$TPNAME4= <>
##$TPNAME5= <>
##$TPNAME6= <>
##$TPNAME7= <>
##$TPOAL= (0..7)
0.5 0.5 0.5 0.5 0.5 0.5 0.5 0.5
##$TPOFFS= (0..7)
0 0 0 0 0 0 0 0
##$TUNHIN= 0
##$TUNHOUT= 0
##$TUNXOUT= 0
##$USERA1= <user>
##$USERA2= <user>
##$USERA3= <user>
##$USERA4= <user>
##$USERA5= <user>
##$V9= 5
##$VALIST= <valist>
##$VCLIST= <CCCCCCCCCCCCCCC>
##$VD= 0
##$VDLIST= <DDDDDDDDDDDDDDD>
##$VPLIST= <PPPPPPPPPPPPPPP>
##$VTLIST= <TTTTTTTTTTTTTTT>
##$WBST= 2048
##$WBSW= 25
##$XGAIN= (0..3)
0 0 0 0
##$XL= 0
##$YL= 0
##$YMAX_a= 12986601
##$YMIN_a= -5926059
##$ZGOPTNS= <>
##$ZL1= 120
##$ZL2= 120
##$ZL3= 120
##$ZL4= 120
##$ABSF1= 14.9684
##$ABSF2= -5.58413
##$ABSG= 5
##$ABSL= 3
##$ALPHA= 0
##$AQORDER= 0
##$ASSFAC= 0
##$ASSFACI= 0
##$ASSFACX= 0
##$ASSWID= 0
##$AUNMP= <proc_prof1d_extract.lims>
##$AXLEFT= 0
##$AXNAME= <>
##$AXNUC= <1H>
##$AXRIGHT= 0
##$AXTYPE= 0
##$AXUNIT= <>
##$AZFE= 0.1
##$AZFW= 0.1
##$BCFW= 0
##$BC_mod= 0
##$BYTORDP= 0
##$COROFFS= 0
##$CY= 15
##$DATMOD= 1
##$DC= 0
##$DFILT= <>
##$DTYPP= 0
##$F1P= 0
##$F2P= 0
##$FCOR= 0.5
##$FTSIZE= 131072
##$FT_mod= 6
##$GAMMA= 0
##$GB= 0
##$INTBC= 1
##$INTSCL= 1
##$ISEN= 128
##$LB= 0.3
##$LEV0= 0
##$LPBIN= 0
##$MAXI= 10000
##$MC2= 0
##$MEAN= 0
##$ME_mod= 0
##$MI= 0
##$NCOEF= 0
##$NC_proc= -3
##$NLEV= 6
##$NOISF1= 0
##$NOISF2= 0
##$NSP= 0
##$NTH_PI= 0
##$NZP= 0
##$OFFSET= 14.9684
##$PC= 1
##$PHC0= 35.7605
##$PHC1= 0
##$PH_mod= 1
##$PKNL= yes
##$PPARMOD= 0
##$PPDIAG= 0
##$PPIPTYP= 0
##$PPMPNUM= 2147483647
##$PPRESOL= 1
##$PSCAL= 4
##$PSIGN= 0
##$PYNMP= <proc.py>
##$REVERSE= no
##$SF= 400.130004885152
##$SI= 131072
##$SIGF1= 0
##$SIGF2= 0
##$SINO= 400
##$SIOLD= 131072
##$SPECTYP= <>
##$SREGLST= <1H.CDCl3>
##$SSB= 0
##$STSI= 131072
##$STSR= 0
##$SW_p= 8223.68421052632
##$SYMM= 0
##$S_DEV= 0
##$TDeff= 65536
##$TDoff= 0
##$TI= <>
##$TILT= no
##$TM1= 0
##$TM2= 0
##$TOPLEV= 0
##$USERP1= <user>
##$USERP2= <user>
##$USERP3= <user>
##$USERP4= <user>
##$USERP5= <user>
##$WDW= 1
##$XDIM= 131072
##$YMAX_p= 500865675
##$YMIN_p= -388017119
##$CURPLOT= <Network HP LaserJet P1505>
##$CURPRIN= <$Network HP LaserJet P1505>
##$DFORMAT= <normdp>
##$LAYOUT= <+/1D_H.xwp>
##$LFORMAT= <normlp>
##$PFORMAT= <normpl>
##$SURQMSG= 1
$$ End of Bruker specific parameters
$$ ---------------------------------
##NTUPLES= NMR SPECTRUM
##VAR_NAME=  FREQUENCY,     SPECTRUM/REAL,   SPECTRUM/IMAG
##SYMBOL=    X,             R,               I
##VAR_TYPE=  INDEPENDENT,   DEPENDENT,       DEPENDENT
##VAR_FORM=  AFFN,          ASDF,            ASDF
##VAR_DIM=   131072,        131072,          131072
##UNITS=     HZ,            ARBITRARY UNITS, ARBITRARY UNITS
##FACTOR=    0.0627417313425165, 1,          1
##FIRST=     8223.62146879498, 3104,         -90119
##LAST=      0,             2467,            -91671
##MIN=       0,             -388017119,      0
##MAX=       8223.62146879498, 500865675,    0
$$ Real data points
##PAGE= N=1
##DATA TABLE= (X++(R..R)), XYDATA
$$ [...]
$$ plain form
62967 3313256 3342606 3363421 3374707 3376176 3368072 3350218 3321649 3281745 3231661 3173985 3110970 3043817
62955 3043817 2973875 2903633 2835833 2772195 2713709 2661633 2617186 2580371 2550072 2525553 2507356
62944 2507356 2496758 2494818 2501877 2517340 2539823 2567924 2600837 2637910 2677999 2719986 2763638 2809072
62932 2809072 2855515 2901557 2946661 2991284 3035207 3076726 3113912 3145832 3172166 3192633 3207401
62921 3207401 3217036 3221059 3217146 3202597 3176174 3137921 3087968 3026666 2955452 2876304 2790377 2698275
62909 2698275 2601821 2504393 2408907 2316086 2225215 2136102 2049800 1967867 1891520 1821306 1756935
62898 1756935 1697328 1641382 1588915 1540587 1496767 1456918 1420422 1387459 1358255 1331746 1306069
62887 1306069 1280640 1256802 1235981 1218186 1202960 1190548 1180731 1171306 1159534 1145072 1129990 1115874
$$ packed form
62967C313256K9350K0815J1286J469q104j7854k8569l9904n0084n7676o3015o7153
62955C043817o9942p0242o7800o3638n8486n2076m4447l6815l0299k4519j8197
62944B507356j0598j940P059J5463K2483K8101L2913L7073M0089M1987M3652M5434
62932B809072M6443M6042M5104M4623M3923M1519L7186L1920K6334K0467J4768
62921C207401R635M023l913j4549k6423l8253m9953o1302p1214p9148q5927r2102
62909B698275r6454r7428r5486r2821r0871q9113q6302q1933p6347p0214o4371
62898A756935n9607n5946n2467m8328m3820l9849l6496l2963k9204k6509k5677
62887A306069k5429k3838k0821j7795j5226j2412r817r425j1772j4462j5082j4116
$$ plain form
62875 1115874 1102485 1089486 1077644 1067404 1057629 1046842 1034806 1022046 1008822 995593 983515
62864 983515 973233 963700 953298 941760 930144 919392 909857 901707 894787 888426 882351 877403 874323
62851 874323 872133 868853 863736 857797 852081 846401 840066 833200 827040 823087 821790 821857 821427 820354 820651
62836 820651 823938 829050 833038 833971 831971 828277 824599 822682 822913 823470 822234 819415 816963 815676 814497
62821 814497 812656 810648 808751 806371 803544 801457 800547 799459 796977 793857 791648 790645 790145 789883 789943
62806 789943 789708 788091 784708 780128 775223 770823 767460 764705 761165 755962 749892 744451 740116 736419
62792 736419 733287 731207 730012 728552 726042 723175 721473 721732 723329 724932 725713 725850 725912 726026 725950 725858 726442
62775 726442 728034 729961 731093 730837 729562 728411 728730 731221 735338 739744 743414 746071 747835 749179 751145
$$ packed form
62875A115874j3389j2999j1842j0240r775j0787j2036j2760j3224j3229j2078
62864I83515j0282r533j0402j1538j1616j0752r535q150o920o361o075m948l080
62851H74323k190l280n117n939n716n680o335o866o160l953j297O7m30j073K97
62836H20651L287N112L988R33k000l694l678j917K31N57j236k819k452j287j179
62821H14497j841k008j897k380k827k087r10j088k482l120k209j003n00k62O0
62806G89943k35j617l383m580m905m400l363k755l540n203o070n441m335l697
62792G36419l132k080j195j460k510k867j702K59J597J603P81J37O2J14p6r2N84
62775G26442J592J927J132k56j275j151L19K491M117M406L670K657J764J344J966
$$ plain form
62760 751145 754630 759206 763519 767129 770923 775204 778555 779642 779359 779973 782486 785926 789039 791727 794837
62745 794837 799284 805442 812811 820330 827582 835539 845684 858568 873712 890521 908625 927721 947997
62732 947997 970628 997041 1027599 1061599 1098351 1137489 1178529 1221260 1266662 1316277 1370397
62721 1370397 1427971 1488804 1554612 1626878 1704535 1785127 1867986 1954935 2047636 2145287 2245359
62710 2245359 2345710 2445170 2542519 2635813 2722694 2800633 2866775 2918408 2954155 2974232 2979011
62699 2979011 2967798 2939725 2895458 2837064 2766306 2684282 2593073 2496502 2398238 2299660 2200470
62688 2200470 2101051 2003287 1909129 1819183 1732993 1650333 1572034 1499667 1434259 1375179 1320572
62677 1320572 1269179 1221393 1178242 1139818 1105222 1073554 1044176 1016510 990611 967847 949843
$$ packed form
62760G51145L485M576M313L610L794M281L351J087k83O14K513L440L113K688L110
62745G94837M447O158P369P519P252P957J0145J2884J5144J6809J8104J9096K0276
62732I47997K2631K6413L0558L4000L6752L9138M1040M2731M5402M9615N4120
62721A370397N7574O0833O5808P2266P7657Q0592Q2859Q6949R2701R7651J00072
62710B245359J00351R9460R7349R3294Q6881P7939O6142N1633L5747K0077M779
62699B979011j1213k8073m4267n8394p0758q2024r1209r6571r8264r8578r9190
62688B200470r9419r7764r4158q9946q6190q2660p8299p2367o5408n9080n4607
62677A320572n1393m7786m3151l8424l4596l1668k9378k7666k5899k2764j8004
$$ plain form
62666 949843 936456 925678 915877 907321 900995 896758 893482 890669 889140 890147 894307 901404 910738 921512
62652 921512 933238 946099 960950 978781 1000018 1024347 1051377 1081417 1115279 1153238 1194695
62641 1194695 1239246 1287611 1340797 1398639 1460141 1525415 1596251 1674100 1758050 1845425 1934063
62630 1934063 2023354 2113261 2203080 2291211 2375475 2453405 2522812 2582521 2632169 2670697 2695292
62619 2695292 2702624 2691423 2663288 2620692 2564893 2496489 2417335 2330608 2238891 2143431 2045725
62608 2045725 1948557 1854346 1763258 1674292 1587902 1506172 1430334 1359483 1292320 1229019 1170514
62597 1170514 1116704 1066471 1019259 975685 936514 901775 871035 843887 819701 797315 775642
62586 775642 754652 735338 718512 703868 690343 677063 663583 649605 635232 621536 609999
$$ packed form
62666I49843j3387j0778r801q556o326m237l276k813j529J007M160P097R334J0774
62652I21512J1726J2861J4851J7831K1237K4329K7030L0040L3862L7959M1457
62641A194695M4551M8365N3186N7842O1502O5274P0836P7849Q3950Q7375Q8638
62630A934063Q9291Q9907Q9819Q8131Q4264P7930O9407N9709M9648L8528K4595
62619B695292P332j1201k8135m2596n5799o8404p9154q6727r1717r5460r7706
62608B045725r7168r4211r1088q8966q6390q1730p5838p0851o7163o3301n8505
62597A170514n3810n0233m7212m3574l9171l4739l0740k7148k4186k2386k1673
62586G75642k0990j9314j6826j4644j3525j3280j3480j3978j4373j3696j1537
$$ plain form
62575 609999 600859 592662 584086 575712 569013 563912 558499 551515 544177 538913 536770 536625 536544 535404 533448
62560 533448 531905 532065 534224 537398 540373 543073 546617 551966 558837 566154 573296 580595 588787 598460
62546 598460 610034 623699 638980 654860 670963 688379 708531 731240 754875 778746 804444
62535 804444 834105 868040 904902 943693 984603 1028165 1074663 1124363 1177226 1232098 1286963
62524 1286963 1340338 1391770 1440647 1485153 1522768 1551352 1569607 1577276 1575380 1565656 1549155 1525638
62512 1525638 1494642 1456742 1413523 1366911 1318910 1271295 1224805 1178937 1133102 1087830 1044408
62501 1044408 1003751 966169 931883 901065 873445 848450 825716 805123 786499 769580 753942
62490 753942 738667 722687 706100 690615 677807 667265 657341 647351 637945 629565 621941 615262 610381
$$ packed form
62575F09999r140q197q576q374o699n101n413o984p338n264k143j45q1j140j956
62560E33448j543J60K159L174K975K700L544N349O871P317P142P299Q192R673
62546E98460J1574J3665J5281J5880J6103J7416K0152K2709K3635K3871K5698
62535H04444K9661L3935L6862L8791M0910M3562M6498M9700N2863N4872N4865
62524A286963N3375N1432M8877M4506L7615K8584J8255P669j896r724j6501k3517
62512A525638l0996l7900m3219m6612m8001m7615m6490m5868m5835m5272m3422
62501A044408m0657l7582l4286l0818k7620k4995k2734k0593j8624j6919j5638
62490G53942j5275j5980j6587j5485j2808j0542r924r990r406q380p624o679m881
$$ plain form
62477 610381 607306 604704 601633 598785 597266 597143 598162 600912 605988 612669 619818 627779 637971 650724
62463 650724 664902 679770 695810 713354 731933 751723 774364 801113 831024 862192 894330
62452 894330 928857 966687 1007238 1049756 1094425 1141548 1190444 1239823 1288817 1336980 1383384
62441 1383384 1426240 1463555 1493997 1517164 1533092 1541573 1541975 1533790 1517251 1493268 1462922 1427303
62429 1427303 1387679 1345427 1301711 1257498 1213787 1171351 1130203 1089829 1050211 1012338 977553
62418 977553 946766 920222 897375 876717 856521 836489 818252 803531 792047 781935 771957 762453
62406 762453 754102 746757 739970 733922 729150 725720 723302 721883 721753 722716 723933 724913 726367 729631 735270
62391 735270 742598 750569 758775 767352 776306 785391 794496 803589 812157 819190 824083 827183 829123 829769
$$ packed form
62477F10381l075k602l071k848j519j23J019K750N076O681P149P961J0192J2753
62463F50724J4178J4868J6040J7544J8579J9790K2641K6749K9911L1168L2138
62452H94330L4527L7830M0551M2518M4669M7123M8896M9379M8994M8163M6404
62441A383384M2856L7315L0442K3167J5928Q481M02q185j6539k3983l0346l5619
62429A427303l9624m2252m3716m4213m3711m2436m1148m0374l9618l7873l4785
62418I77553l0787k6544k2847k0658k0196k0032j8237j4721j1484j0112r978r504
62406G62453q351p345o787o048m772l430k418j419j30R63J217R80J454L264N639
62391G35270P328P971Q206Q577Q954R085R105R093Q568P033M893L100J940O46
$$ plain form
62377 829769 828160 823472 815856 806373 796122 785304 773182 759290 744598 730934 719069 708018
62365 708018 696606 685000 674128 664246 655058 646798 640042 634548 629452 624810 621822 621090 621647 622393
62351 622393 623652 626550 631445 637843 645393 653916 662696 670834 678654 687900 700017 714610 729966
62338 729966 744802 759077 773345 787781 801967 815335 827612 838892 849353 858900 867085 873431
62326 873431 877906 881006 883246 884665 885094 884905 885149 886647 889265 892486 896562 902543 911140 922124 935216
62311 935216 951147 971301 996368 1025761 1058506 1094457 1134519 1179736 1230308 1285603 1345098
62300 1345098 1409130 1478425 1552923 1631309 1711815 1793136 1874161 1952902 2026207 2090917 2145377
62289 2145377 2189703 2224568 2249877 2264652 2268124 2260636 2243365 2217219 2182192 2137950 2085046 2025463
$$ packed form
62377H29769j609m688p616r483j0251j0818j2122j3892j4692j3664j1865j1051
62365G08018j1412j1606j0872r882r188q260o756n494n096m642k988p32N57P46
62351F22393J259K898M895O398P550Q523Q780Q138P820R246J2117J4593J5356
62338G29966J4836J4275J4268J4436J4186J3368J2277J1280J0461R547Q185O346
62326H73431M475L100K240J419M29j89K44J498K618L221M076N981Q597J0984J3092
62311I35216J5931K0154K5067K9393L2745L5951M0062M5217N0572N5295N9495
62300A345098O4032O9295P4498P8386Q0506Q1321Q1025P8741P3305O4710N4460
62289B145377M4326L4865K5309J4775L472p488j7271k6146l5027m4242n2904n9583
$$ plain form
62277 2025463 1961802 1895964 1828785 1760931 1693713 1628634 1566418 1507099 1450984 1398808 1350722
62266 1350722 1305779 1262928 1222084 1183870 1148733 1116722 1087564 1060419 1034170 1008849 986435
62255 986435 969137 956926 947650 939644 933212 929256 927453 926451 925303 924109 923573 924289 926072 927753
62241 927753 928108 927304 926842 927606 928507 927680 924633 920594 917058 914728 913732 914049 915446 917489 919973 923184
62225 923184 927534 933018 939103 945238 951533 958852 968074 979313 992113 1006230 1021733 1038431 1055916
62212 1055916 1074370 1094561 1116688 1140030 1164402 1191191 1222004 1256786 1294438 1335014 1380037
62201 1380037 1430539 1486029 1545826 1610211 1679373 1752020 1826049 1900143 1973677 2045139 2111618
62190 2111618 2170110 2218735 2256531 2282794 2297100 2299539 2290435 2270055 2238994 2198607 2150549 2095976
$$ packed form
62277B025463o3661o5838o7179o7854o7218o5079o2216n9319n6115n2176m8086
62266A350722m4943m2851m0844l8214l5137l2011k9158k7145k6249k5321k2414
62255I86435j7298j2211r276q006o432l956j803j002j148j194n36P16J783J681
62241I27753L55q04m62P64R01q27l047m039l536k330r96L17J397K043K484L211
62225I23184M350N484O085O135O295P319R222J1239J2800J4117J5503J6698J7485
62212A055916J8454K0191K2127K3342K4372K6789L0813L4782L7652M0576M5023
62201A380037N0502N5490N9797O4385O9162P2647P4029P4094P3534P1462O6479
62190B111618N8492M8625L7796K6263J4306K439r104k0380l1061m0387m8058n4573
$$ plain form
62178 2095976 2035647 1970795 1903299 1834923 1766924 1700588 1637506 1578778 1524397 1473990 1427889
62167 1427889 1386819 1350750 1318808 1290238 1264769 1242020 1221465 1203293 1188467 1177382 1169019
62156 1169019 1162067 1156373 1152595 1150755 1150054 1150122 1151656 1155449 1161236 1167811 1174007 1179354 1184118 1188987 1194566
62141 1194566 1200909 1207667 1214951 1223880 1235832 1251135 1268954 1288537 1309959 1333296 1357740 1382534
62129 1382534 1408454 1437122 1468570 1500654 1531577 1562023 1593864 1627465 1661387 1694090 1724591
62118 1724591 1751775 1774792 1794541 1813513 1833644 1855342 1878972 1906003 1937783 1974036 2013585
62107 2013585 2056081 2102258 2152767 2207244 2264054 2320442 2373417 2420987 2462224 2496021 2520829
62096 2520829 2536298 2544237 2546873 2544698 2536861 2523002 2503613 2479143 2450106 2417883 2384168 2349587
$$ packed form
62178B095976o0329o4852o7496o8376o7999o6336o3082n8728n4381n0407m6101
62167A427889m1070l6069l1942k8570k5469k2749k0555j8172j4826j1085q363
62156A169019o952n694l778j840p01O8J534L793N787O575O196N347M764M869N579
62141A194566O343O758P284Q929J1952J5303J7819J9583K1422K3337K4444K4794
62129A382534K5920K8668L1448L2084L0923L0446L1841L3601L3922L2703L0501
62118A724591K7184K3017J9749J8972K0131K1698K3630K7031L1780L6253L9549
62107B013585M2496M6177N0509N4477N6810N6388N2975M7570M1237L3797K4808
62096B520829J5469P939K636k175p837j3859j9389k4470k9037l2223l3715l4581
$$ plain form
62084 2349587 2313950 2277947 2243481 2212095 2184046 2159261 2138148 2120823 2106213 2092695 2079466
62073 2079466 2067007 2056407 2048466 2043202 2040072 2038677 2039068 2041181 2044446 2048478 2053844 2061433 2071399 2083565
62059 2083565 2098580 2117434 2139686 2163404 2187435 2212774 2240997 2272111 2304836 2338452 2373375
62048 2373375 2410035 2448139 2487379 2528339 2572266 2619947 2671034 2724520 2779789 2836970 2896302
62037 2896302 2957491 3019798 3082324 3143934 3203517 3261021 3317929 3376018 3435892 3497398 3560947
62026 3560947 3627059 3694533 3760532 3823256 3883705 3944220 4006167 4069822 4135595 4204106 4275149
62015 4275149 4347551 4420193 4492652 4564958 4637344 4710301 4784332 4859459 4935315 5011853 5089527
62004 5089527 5168386 5247078 5323075 5394107 5459358 5519187 5573877 5623086 5666514 5704552 5737894
$$ packed form
62084B349587l5637l6003l4466l1386k8049k4785k1113j7325j4610j3518j3229
62073B079466j2459j0600p941n264l130j395L91K113L265M032N366P589R966J2166
62059B083565J5015J8854K2252K3718K4031K5339K8223L1114L2725L3616L4923
62048B373375L6660L8104L9240M0960M3927M7681N1087N3486N5269N7181N9332
62037B896302O1189O2307O2526O1610N9583N7504N6908N8089N9874O1506O3549
62026C560947O6112O7474O5999O2724O0449O0515O1947O3655O5773O8511P1043
62015D275149P2402P2642P2459P2306P2386P2957P4031P5127P5856P6538P7674
62004E089527P8859P8692P5997P1032O5251N9829N4690M9209M3428L8038L3342
$$ plain form
61993 5737894 5766967 5792271 5814814 5835347 5853262 5867054 5875987 5880743 5882564 5882644 5882366 5883125 5885417
61980 5885417 5888757 5892790 5897813 5903948 5910683 5917744 5925674 5934926 5944989 5954902 5964097 5972284 5979313 5985725
61966 5985725 5992530 5999449 6004071 6004035 5999779 5994028 5988733 5983540 5977182 5969116 5959469 5948504 5936854 5925744
61952 5925744 5916383 5909315 5904588 5902160 5901817 5903116 5905927 5910980 5919385 5931330 5945362 5959353 5972515
61939 5972515 5986281 6002633 6021468 6040162 6055936 6067911 6076336 6080634 6079416 6072221 6060071 6044033
61927 6044033 6024131 6000146 5972746 5943168 5912112 5879583 5845676 5811030 5776420 5742198 5708322
61916 5708322 5674781 5641824 5609666 5578014 5546014 5512740 5477705 5440996 5403076 5364499 5325620
61905 5325620 5286494 5247204 5208169 5169793 5131867 5093941 5056487 5020962 4988212 4957299 4926561
$$ packed form
61993E737894K9073K5304K2543K0533J7915J3792Q933M756J821Q0k78P59K292
61980E885417L340M033N023O135O735P061P930R252J0063R913R195Q187P029O412
61966E985725O805O919M622l6m256n751n295n193o358q066r647j0965j1650j1110
61952E925744r361p068m727k428l43J299K811N053Q405J1945J4032J3991J3162
61939E972515J3766J6352J8835J8694J5774J1975Q425M298j218p195j2150j6038
61927F044033j9902k3985k7400k9578l1056l2529l3907l4646l4610l4222l3876
61916E708322l3541l2957l2158l1652l2000l3274l5035l6709l7920l8577l8879
61905E325620l9126l9290l9035l8376l7926l7926l7454l5525l2750l0913l0738
$$ plain form
61894 4926561 4895527 4865229 4836919 4811183 4788105 4767589 4749527 4734241 4722697 4715612 4712387 4711582
61882 4711582 4712534 4715895 4722536 4732607 4745886 4762253 4781388 4802535 4825162 4849626 4876828 4907333
61870 4907333 4941031 4977426 5016071 5056928 5100447 5147071 5196615 5248533 5303084 5362066 5428212
61859 5428212 5503956 5590741 5689120 5799338 5922036 6058656 6211195 6381765 6572575 6785977
61849 6785977 7023814 7286797 7575376 7891569 8239240 8622038 9041510 9497711 9991119
61840 9991119 10523169 11094952 11705839 12353015 13031198 13731780 14441547 15141434 15805923
61831 15805923 16403999 16902208 17268997 17478962 17516267 17377152 17070779 16617418 16044186
61822 16044186 15380289 14653759 13890148 13112143 12338968 11585556 10862382 10176469 9532674
$$ packed form
61894D926561l1034l0298k8310k5736k3078k0516j8062j5286j1544p085l225q05
61882D711582R52L361O641J0071J3279J6367J9135K1147K2627K4464K7202L0505
61870D907333L3698L6395L8645M0857M3519M6624M9544N1918N4551N8982O6146
61859E428212P5744Q6785R8379J10218J22698J36620J52539J70570J90810K13402
61849F785977K37837K62983K88579L16193L47671L82798M19472M56201M93408
61840I991119N32050N71783O10887O47176O78183P00582P09767O99887O64489
61831A5805923N98076M98209L66789K09965L7305j39115l06373m53361n73232
61822A6044186o63897p26530p63611p78005p73175p53412p23174o85913o43795
$$ plain form
61813 9532674 8933976 8380979 7872088 7404898 6977400 6587726 6233207 5910537 5617134
61804 5617134 5351944 5114448 4902857 4713607 4542867 4388480 4250168 4127880 4020371
61795 4020371 3925717 3842783 3771360 3710766 3658997 3613819 3574390 3541305 3514999 3494421 3477298
61784 3477298 3461474 3445842 3430028 3413427 3395026 3374358 3352238 3329965 3307972 3286000 3264637
61773 3264637 3245812 3231347 3221621 3216138 3214778 3217743 3224567 3233890 3244151 3254080 3262695 3269369 3273852
61760 3273852 3275860 3274819 3270351 3262782 3252815 3241135 3228920 3218285 3211304 3208726 3210407 3216828 3229258
61747 3229258 3248463 3274266 3306602 3346071 3393262 3448533 3512822 3587542 3673033 3767968 3871042
61736 3871042 3982546 4103675 4235238 4377954 4533157 4701957 4884309 5080318 5292175
$$ packed form
61813I532674n98698n52997n08891m67190m27498l89674l54519l22670k93403
61804E617134k65190k37496k11591j89250j70740j54387j38312j22288j07509
61795D020371r4654q2934p1423o0594n1769m5178l9429l3085k6306k0578j7123
61784C477298j5824j5632j5814j6601j8401k0668k2120k2273k1993k1972k1363
61773C264637j8825j4465r726n483j360K965O824R323J0261R929Q615O674M483
61760C273852K008j041m468p569r967j1680j2215j0635o981k578J681O421J2430
61747C229258J9205K5803L2336L9469M7191N5271O4289P4720Q5491R4935J03074
61736C871042J11504J21129J31563J42716J55203J68800J82352J96009K11857
$$ plain form
61727 5292175 5523341 5775690 6048773 6342222 6657817 6998925 7369186 7772426 8212843
61718 8212843 8694361 9220348 9794672 10422530 11109425 11859555 12675652 13559928 14514472
61709 14514472 15540848 16639623 17809464 19045148 20335342 21661474 22997242 24307441
61701 24307441 25546652 26660116 27588294 28274435 28673311 28758726 28527268 27997226 27204119
61692 27204119 26195264 25024133 23744226 22403626 21042315 19692476 18379590 17122678
61684 17122678 15934149 14820408 13783308 12822009 11934783 11119880 10374883 9695501 9075811
61675 9075811 8510089 7994115 7524517 7097486 6708732 6354412 6031501 5737340 5469361
61666 5469361 5225241 5002840 4799851 4613878 4442915 4285315 4139039 4001454 3870483
$$ packed form
61727E292175K31166K52349K73083K93449L15595L41108L70261M03240M40417
61718H212843M81518N25987N74324O27858O86895P50130Q16097Q84276R54544
61709A4514472J026376J098775J169841J235684J290194J326132J335768J310199
61701B4307441J239211J113464R28178O86141L98876Q5415k31458n30042p93107
61692B7204119j008855j171131j279907j340600j361311j349839j312886j256912
61684A7122678j188529j113741j037100r61299q87226q14903p44997o79382o19690
61675I075811n65722n15974m69598m27031l88754l54320l22911k94161k67979
61666E469361k44120k22401k02989j85973j70963j57600j46276j37585j30971
$$ plain form
61657 3870483 3745895 3628796 3519510 3416353 3316966 3220662 3128818 3042900 2962716 2887017
61647 2887017 2815245 2748040 2686157 2629530 2577320 2528259 2480808 2433646 2386456 2340004 2295240
61636 2295240 2252564 2212023 2173631 2137035 2101226 2065295 2029547 1995480 1964499 1936780 1911362
61625 1911362 1887098 1863450 1840541 1818646 1797772 1777761 1758732 1741247 1725975 1713257 1702952
61614 1702952 1694532 1687439 1681624 1677824 1676864 1678304 1679858 1678506 1672458 1662157 1649463 1635824 1621237
61601 1621237 1605059 1587681 1570868 1556095 1543020 1530267 1517489 1505807 1496294 1488968 1483534 1480072
61589 1480072 1478445 1477867 1477870 1479024 1481781 1485067 1487109 1487601 1488138 1490340 1494107 1497840 1499917 1500025 1499528 1500440
61573 1500440 1503503 1507402 1510448 1512811 1516380 1522567 1531186 1541521 1553259 1565822 1577748 1587651 1595451
$$ packed form
61657C870483j24588j17099j09286j03157r9387r6304r1844q5918q0184p5699
61647B887017p1772o7205o1883n6627n2210m9061m7451m7162m7190m6452m4764
61636B295240m2676m0541l8392l6596l5809l5931l5748l4067l0981k7719k5418
61625A911362k4264k3648k2909k1895k0874k0011j9029j7485j5272j2718j0305
61614A702952q420p093n815l800r60J440J554j352o048j0301j2694j3639j4587
61601A621237j6178j7378j6813j4773j3075j2753j2778j1682r513p326n434l462
61589A480072j627n78LJ154K757L286K042M92N37K202L767L733K077J08m97R12
61573A500440L063L899L046K363L569O187Q619J0335J1738J2563J1926R903P800
$$ plain form
61560 1595451 1601899 1607082 1609922 1609053 1603895 1595042 1583894 1571657 1558422 1543504 1526933 1510098 1494397
61547 1494397 1479607 1464351 1448077 1431858 1417080 1403975 1391774 1379803 1367925 1356254 1345006
61536 1345006 1334663 1325736 1318151 1311286 1305029 1300503 1299073 1300594 1303375 1306270 1310167 1316723 1325911 1335718
61522 1335718 1344321 1351922 1360288 1371172 1385498 1403416 1424560 1448545 1475622 1506608 1541717 1579759
61510 1579759 1619060 1659177 1701243 1746546 1795094 1845609 1896490 1946423 1994294 2039100 2080393
61499 2080393 2118683 2154938 2189472 2221670 2251132 2278664 2305575 2332227 2357951 2382203 2404866
61488 2404866 2425356 2442641 2456724 2469103 2480773 2490494 2496165 2497587 2496619 2494664 2491153 2484744 2474935
61475 2474935 2462051 2446617 2429596 2412636 2397198 2383645 2371800 2362212 2356155 2354388 2356604 2362310
$$ packed form
61560A595451O448N183K840q69n158q853j1148j2237j3235j4918j6571j6835j5701
61547A494397j4790j5256j6274j6219j4778j3105j2201j1971j1878j1671j1248
61536A345006j0343q927p585o865o257m526j430J521K781K895L897O556R188R807
61522A335718Q603P601Q366J0884J4326J7918K1144K3985K7077L0986L5109L8042
61510A579759L9301M0117M2066M5303M8548N0515N0881M9933M7871M4806M1293
61499B080393L8290L6255L4534L2198K9462K7532K6911K6652K5724K4252K2663
61488B404866K0490J7285J4083J2379J1670R721N671J422r68j955l511o409r809
61475B474935j2884j5434j7021j6960j5438j3553j1845r588o057j767K216N706
$$ plain form
61463 2362310 2371756 2385717 2404849 2429757 2461413 2500862 2548340 2603140 2664654 2733334 2810368
61452 2810368 2896625 2992300 3097452 3212548 3338541 3476901 3629544 3798186 3983450 4184875
61442 4184875 4401997 4634967 4883795 5147299 5423118 5708220 5998709 6289067 6571976
61433 6571976 6838809 7080193 7286710 7450064 7564274 7626126 7635209 7594134 7508440 7385500
61423 7385500 7232980 7058024 6867063 6665715 6459174 6253149 6053732 5865338 5689154
61414 5689154 5524830 5373441 5237577 5118719 5016267 4929477 4858603 4803361 4762012 4733315
61404 4733315 4718105 4717402 4729872 4752858 4785215 4827461 4879462 4939667 5006424 5078338 5153361 5229386
61392 5229386 5306215 5385333 5467073 5549399 5630056 5708417 5784420 5857316 5926906 5994768 6062562
$$ packed form
61463B362310R446J3961J9132K4908L1656L9449M7478N4800O1514O8680P7034
61452B810368Q6257R5675J05152J15096J25993J38360J52643J68642J85264K01425
61442D184875K17122K32970K48828K63504K75819K85102K90489K90358K82909
61433F571976K66833K41384K06517J63354J14210O1852R083m1075q5694j22940
61423G385500j52520j74956j90961k01348k06541k06025j99417j88394j76184
61414E689154j64324j51389j35864j18858j02452q6790p0874n5242m1349k8697
61404D733315j5210p03J2470K2986L2357M2246N2001O0205O6757P1914P5023P6025
61392E229386P6829P9118Q1740Q2326Q0657P8361P6003P2896O9590O7862O7794
$$ plain form
61381 6062562 6129768 6194495 6255904 6314190 6368589 6417409 6460407 6499479 6536138 6569337 6596546
61370 6596546 6616272 6628879 6635604 6637581 6635467 6629273 6618433 6602373 6581019 6554737 6524137 6490125
61358 6490125 6453837 6416178 6377631 6338716 6300468 6264234 6231172 6202082 6177400 6156936 6139694
61347 6139694 6124250 6109381 6094281 6078302 6060749 6041124 6019598 5997217 5975455 5955343 5937013
61336 5937013 5920215 5905270 5893521 5887204 5889185 5902523 5929490 5970737 6025814 6094837 6179469 6282281
61324 6282281 6405557 6550789 6718663 6908955 7120685 7352859 7604937 7876198 8164664
61315 8164664 8466858 8778203 9092956 9403674 9701259 9975954 10218309 10419506 10571727
61306 10571727 10669325 10710215 10696256 10632163 10523670 10376073 10193647 9979884 9738247 9473013
$$ packed form
61381F062562O7206O4727O1409N8286N4399M8820M2998L9072L6659L3199K7209
61370F596546J9726J2607O725J977k114o194j0840j6060k1354k6282l0600l4012
61358F490125l6288l7659l8547l8915l8248l6234l3062k9090k4682k0464j7242
61347F139694j5444j4869j5100j5979j7553j9625k1526k2381k1762k0112j8330
61336E937013j6798j4945j1749o317J981J3338K6967M1247N5077O9023Q4632J02812
61324F282281J23276J45232J67874J90292K11730K32174K52078K71261K88466
61315H164664L02194L11345L14753L10718K97585K74695K42355K01197J52221
61306A0571727R7598M0890j3959o4093j08493j47597j82426k13763k41637k65234
$$ plain form
61296 9473013 9189670 8894393 8592881 8289579 7987922 7691039 7401896 7122837 6855412
61287 6855412 6600824 6360420 6135560 5927072 5734949 5558689 5398051 5253438 5125241
61278 5125241 5012718 4914060 4828079 4755482 4697731 4654826 4625054 4607021 4600983 4607705 4626605
61267 4626605 4655508 4691810 4733565 4780009 4831439 4887966 4947871 5007820 5065435 5121104 5176439
61256 5176439 5231407 5283943 5331993 5374783 5412146 5443915 5470430 5492636 5511008 5524901 5533329
61245 5533329 5535808 5532052 5521460 5503575 5478736 5447820 5411579 5370533 5325182 5275811 5222348 5164890
61233 5164890 5104313 5042059 4979304 4916455 4853279 4789407 4725178 4662340 4603482 4550097 4501285
61222 4501285 4454993 4410630 4370068 4335922 4309240 4288909 4272685 4258290 4243838 4228089 4210812
$$ packed form
61296I473013k83343k95277l01512l03302l01657k96883k89143k79059k67425
61287F855412k54588k40404k24860k08488j92123j76260j60638j44613j28197
61278E125241j12523r8658q5981p2597n7751m2905k9772j8033o038O722J8900
61267D626605K8903L6302M1755M6444N1430N6527N9905N9949N7615N5669N5335
61256E176439N4968N2536M8050M2790L7363L1769K6515K2206J8372J3893Q428
61245E533329K479l756j0592j7885k4839l0916l6241m1046m5351m9371n3463n7458
61233E164890o0577o2254o2755o2849o3176o3872o4229o2838n8858n3385m8812
61222D501285m6292m4363m0562l4146k6682k0331j6224j4395j4452j5749j7277
$$ plain form
61211 4210812 4192744 4174883 4157643 4140795 4124181 4108346 4094434 4083710 4077282 4075923 4079701 4087799
61199 4087799 4099187 4113722 4132324 4155936 4184732 4218730 4258945 4307395 4365893 4435160 4515088
61188 4515088 4605283 4704994 4812964 4927849 5048569 5173485 5298984 5419290 5527816 5618340
61178 5618340 5684853 5721432 5723585 5689864 5621636 5521598 5393479 5242980 5077283 4902524
61168 4902524 4722411 4539928 4359237 4184467 4017208 3856918 3703863 3560155 3427543
61159 3427543 3305738 3193800 3091976 3000925 2919823 2846599 2779970 2720203 2667787 2622223 2582320
61148 2582320 2547119 2516406 2490808 2471565 2459672 2455050 2456744 2463882 2475913 2491975 2510829 2531689
61136 2531689 2554368 2577999 2600197 2618345 2631589 2640847 2646927 2649478 2648047 2643353 2636814 2629153 2620090
$$ packed form
61211D210812j8068j7861j7240j6848j6614j5835j3912j0724o428j359L778Q098
61199D087799J1388J4535J8602K3612K8796L3998M0215M8450N8498O9267P9928
61188D515088R0195R9711J07970J14885J20720J24916J25499J20306J08526R0524
61178E618340O6513L6579K153l3721o8228j00038j28119j50499j65697j74759
61168D902524j80113j82483j80691j74770j67259j60290j53055j43708j32612
61159C427543j21805j11938j01824r1051q1102p3224o6629n9767n2416m5564l9903
61148B582320l5201l0713k5598j9243j1893m622J694P138J2031J6062J8854K0860
61136B531689K2679K3631K2198J8148J3244R258O080K551j431m694o539p661r063
$$ plain form
61123 2620090 2609242 2596619 2582085 2564941 2544443 2520578 2494094 2465951 2436989 2407930 2379229
61112 2379229 2350697 2321377 2290063 2256163 2220109 2182874 2145115 2107081 2069363 2033014 1998136
61101 1998136 1962725 1924191 1882466 1840703 1802254 1767732 1735799 1705881 1678633 1654022 1630624
61090 1630624 1607177 1583523 1559355 1533234 1503860 1471696 1438425 1405271 1372709 1341405 1312375
61079 1312375 1286241 1263109 1243016 1225664 1209844 1194280 1179378 1167203 1159184 1154597 1151889 1150729
61067 1150729 1151875 1155538 1161019 1167924 1176693 1187570 1199786 1212287 1224845 1238026 1252354 1267890
61055 1267890 1284321 1301046 1317377 1333179 1349288 1366809 1385846 1405228 1423539 1440153 1455101
61044 1455101 1468212 1478631 1485201 1487307 1485415 1480722 1474146 1465754 1455400 1443700 1431851 1420475
$$ packed form
61123B620090j0848j2623j4534j7144k0498k3865k6484k8143k8962k9059k8701
61112B379229k8532k9320l1314l3900l6054l7235l7759l8034l7718l6349l4878
61101A998136l5411l8534m1725m1763l8449l4522l1933k9918k7248k4611k3398
61090A630624k3447k3654k4168k6121k9374l2164l3271l3154l2562l1304k9030
61079A312375k6134k3132k0093j7352j5820j5564j4902j2175q019m587k708j160
61067A150729J146L663N481O905Q769J0877J2216J2501J2558J3181J4328J5536
61055A267890J6431J6725J6331J5802J6109J7521J9037J9382J8311J6614J4948
61044A455101J3111J0419O570K106j892m693o576q392j0354j1700j1849j1376
$$ plain form
61032 1420475 1409280 1398104 1387615 1378353 1369452 1359215 1347187 1335119 1325498 1319253 1315040 1310647
61020 1310647 1304937 1298541 1292819 1288282 1284113 1279225 1273590 1268288 1264255 1261252 1258231 1254669 1251234 1248942
61006 1248942 1247809 1246784 1245270 1244250 1245346 1248790 1252982 1256239 1258522 1261136 1265077 1270025 1274715 1278057
60992 1278057 1280171 1282667 1287686 1296223 1307408 1319614 1332125 1345513 1360685 1377970 1397047 1417335
60980 1417335 1438438 1460509 1484254 1510302 1538482 1567883 1597837 1628766 1661902 1698064 1736825
60969 1736825 1777177 1819010 1863622 1912501 1965960 2023248 2083608 2146771 2212780 2282009 2355234
60958 2355234 2433159 2516176 2605158 2701905 2807809 2922456 3044724 3174841 3313945 3461962
60948 3461962 3617772 3781611 3955405 4140477 4337101 4547004 4774099 5021656 5290853
$$ packed form
61032A420475j1195j1176j0489r262q901j0237j2028j2068r621o245m213m393
61020A310647n710o396n722m537m169m888n635n302m033l003l021l562l435k292
61006A248942j133j025j514j020J096L444M192L257K283K614L941M948M690L342
60992A278057K114K496N019Q537J1185J2206J2511J3388J5172J7285J9077K0288
60980A417335K1103K2071K3745K6048K8180K9401K9954L0929L3136L6162L8761
60969A736825M0352M1833M4612M8879N3459N7288O0360O3163O6009O9229P3225
60958B355234P7925Q3017Q8982R6747J05904J14647J22268J30117J39104J48017
60948C461962J55810J63839J73794J85072J96624K09903K27095K47557K69197
$$ plain form
60939 5290853 5583225 5902313 6251429 6632281 7047986 7505630 8014327 8583401 9224640
60930 9224640 9952842 10780558 11715363 12766502 13951073 15288753 16795143 18489233 20405205
60921 20405205 22587008 25073701 27901802 31108690 34679793 38440200 42005145 44903863
60913 44903863 46823694 47770877 48013065 47890067 47684064 47609850 47811644 48274582 48735541
60904 48735541 48750257 47923611 46122512 43501683 40361058 36988967 33597386 30329702
60896 30329702 27277077 24484499 21962830 19707810 17710214 15954838 14420481 13084372
60888 13084372 11923535 10912523 10025130 9240494 8545194 7929044 7381498 6892571 6454248
60879 6454248 6059552 5701847 5375871 5078154 4806031 4557258 4330313 4123429 3933259
$$ packed form
60939E290853K92372L19088L49116L80852M15705M57644N08697N69074O41239
60930I224640P28202Q27716R34805J051139J184571J337680J506390J694090J915972
60921B0405205K181803K486693K828101L206888L571103L760407L564945K898718
60913D4903863J919831R47183K42188j22998k06003p4214K01794M62938M60959
60904D8735541J4716q26646j801099k620829l140625l372091l391581l267684
60896C0329702l052625k792578k521669k255020j997596j755376j534357j336109
60888A3084372j160837j011012q87393p84636o95300o16150n47546m88927m38323
60879F454248l94696l57705l25976k97717k72123k48773k26945k06884j90170
$$ plain form
60870 3933259 3755768 3588156 3428543 3274563 3124466 2979400 2842351 2714568 2594840
60861 2594840 2482176 2376900 2278753 2186264 2098777 2017193 1941778 1871063 1803786 1740309 1681115
60850 1681115 1625434 1572425 1522376 1475653 1431701 1390148 1351788 1317239 1285518 1255097 1225778
60839 1225778 1198481 1173750 1151325 1130746 1111612 1093633 1077039 1062503 1050181 1039348 1029480
60828 1029480 1021030 1014509 1009394 1004717 1000317 996863 994905 994652 996546 1001279 1008863 1017841 1025820 1031186
60814 1031186 1034391 1037193 1040451 1043178 1044094 1043271 1041457 1038595 1034319 1029448 1025378 1021991 1017673 1011722
60800 1011722 1005288 999531 994307 989466 986124 985455 986996 989352 992198 996574 1003258 1011687 1020744 1030180
60786 1030180 1040824 1053270 1066712 1079675 1091900 1104559 1118174 1131412 1142992 1153755 1165401
$$ packed form
60870C933259j77491j67612j59613j53980j50097j45066j37049j27783j19728
60861B594840j12664j05276r8147r2489q7487q1584p5415p0715o7277o3477n9194
60850A681115n5681n3009n0049m6723m3952m1553l8360l4549l1721l0421k9319
60839A225778k7297k4731k2425k0579j9134j7979j6594j4536j2322j0833r868
60828A029480q450o521n115m677m400l454j958k53J894M733P584Q978P979N366
60814A031186L205K802L258K727R16q23j814k862m276m871m070l387m318n951
60800A011722o434n757n224m841l342o69J541K356K846M376O684Q429R057R436
60786A030180J0644J2446J3442J2963J2225J2659J3615J3238J1580J0763J1646
$$ plain form
60775 1165401 1177838 1189524 1199995 1210142 1219986 1228310 1234849 1240960 1247415 1253261 1257711 1261541 1265658
60762 1265658 1269704 1273138 1276430 1280110 1283820 1287380 1291548 1296441 1300298 1301398 1300593 1300516 1302507 1305341 1306603
60747 1306603 1304400 1298168 1288902 1278534 1268338 1258053 1246832 1234475 1221194 1206914 1191627 1175976
60735 1175976 1160757 1146237 1132600 1120582 1110932 1103598 1098075 1094220 1092182 1091888 1093122 1095822 1099944
60722 1099944 1105410 1112376 1121034 1130958 1141354 1152108 1163699 1175862 1187547 1198732 1211048 1225705
60710 1225705 1241804 1257696 1273104 1288741 1304508 1319307 1332487 1344563 1356627 1369489 1382985
60699 1382985 1395684 1405847 1413140 1418951 1424781 1431142 1438263 1446612 1455941 1464889 1472489 1479282 1486146
60686 1486146 1492919 1499027 1504546 1509578 1513338 1514799 1513768 1510696 1506197 1501233 1496630 1491751 1484917 1475871
$$ packed form
60775A165401J2437J1686J0471J0147R844Q324O539O111O455N846M450L830M117
60762A265658M046L434L292L680L710L560M168M893L857J100q05p7J991K834J262
60747A306603k203o232r266j0368j0196j0285j1221j2357j3281j4280j5287j5651
60735A175976j5219j4520j3637j2018r650p334n523l855k038k94J234K700M122
60722A099944N466O966Q658R924J0396J0754J1591J2163J1685J1185J2316J4657
60710A225705J6099J5892J5408J5637J5767J4799J3180J2076J2064J2862J3496
60699A382985J2699J0163P293N811N830O361P121Q349R329Q948P600O793O864
60686A486146O773O108N519N032L760J461j031l072m499m964m603m879o834r046
$$ plain form
60672 1475871 1466221 1456599 1445496 1432509 1420683 1413028 1408060 1401610 1392332 1382613 1374314 1366459 1357631
60659 1357631 1348288 1339775 1332641 1326651 1321341 1316172 1311095 1306886 1303884 1300741 1295828 1289556 1283686 1278589
60645 1278589 1273025 1266648 1260739 1256074 1251868 1247379 1242984 1239062 1235254 1231477 1228354 1226026 1223693 1220858
60631 1220858 1217931 1215247 1212612 1210127 1208154 1206053 1202242 1196093 1188567 1180497 1171424 1160644 1148216
60618 1148216 1134411 1119340 1103678 1088506 1073868 1058725 1043006 1028408 1016356 1006385 997392 989242
60606 989242 982111 975365 968465 962256 958115 956218 955611 955666 956616 959000 963188 969111 975883 982242 987928
60591 987928 994113 1001873 1010757 1019436 1027154 1033966 1040131 1046145 1052909 1060985 1069709 1077569 1083405 1087037
60577 1087037 1089170 1091104 1094191 1098988 1104983 1111346 1117772 1124651 1132826 1143303 1156681 1172589 1189998
$$ packed form
60672A475871r650r622j1103j2987j1826p655m968o450r278r719q299p855q828
60659A357631r343q513p134n990n310n169n077m209l002l143m913o272n870n097
60645A278589n564o377n909m665m206m489m395l922l808l777l123k328k333k835
60631A220858k927k684k635k485j973k101l811o149p526q070r073j0780j2428
60618A148216j3805j5071j5662j5172j4638j5143j5719j4598j2052r971q993q150
60606I89242p131o746o900o209m141j897o07N5R50K384M188N923O772O359N686
60591I87928O185P760Q884Q679P718O812O165O014O764Q076Q724P860N836L632
60577A087037K133J934L087M797N995O363O426O879Q175J0477J3378J5908J7409
$$ plain form
60564 1189998 1208053 1226327 1244594 1263103 1282854 1304588 1327477 1349805 1371006 1392045 1413638
60553 1413638 1435198 1455711 1474421 1490365 1502663 1511884 1519890 1527498 1533336 1535674 1534241 1529420 1520855
60540 1520855 1508015 1491293 1471528 1449224 1425219 1401204 1378429 1356568 1334982 1314370 1295955
60529 1295955 1279739 1265054 1252489 1243721 1239242 1237350 1235678 1233078 1230095 1228265 1228922 1232118 1236800
60516 1236800 1242228 1248523 1255332 1260990 1264173 1265753 1267717 1270651 1273576 1275989 1278661 1282411 1287368 1293559
60502 1293559 1300988 1308966 1316517 1323781 1331908 1341207 1350538 1358998 1367036 1375204 1382952 1389717 1396486 1405056
60488 1405056 1416024 1428578 1442169 1457345 1474769 1494402 1516184 1540824 1569221 1601514 1637515
60477 1637515 1677836 1723397 1773238 1823478 1869177 1906950 1935293 1953070 1959156 1953879 1939752 1920060
$$ packed form
60564A189998J8055J8274J8267J8509J9751K1734K2889K2328K1201K1039K1593
60553A413638K1560K0513J8710J5944J2298R221Q006P608N838K338j433m821q565
60540A520855j2840j6722j9765k2304k4005k4015k2775k1861k1586k0612j8415
60529A295955j6216j4685j2565q768m479j892j672k600k983j830O57L196M682
60516A236800N428O295O809N658L183J580J964K934K925K413K672L750M957O191
60502A293559P429P978P551P264Q127R299R331Q460Q038Q168P748O765O769Q570
60488A405056J0968J2554J3591J5176J7424J9633K1782K4640K8397L2293L6001
60477A637515M0321M5561M9841N0240M5699L7773K8343J7777O086n277j4127j9692
$$ plain form
60465 1920060 1897227 1872914 1848862 1826663 1806886 1789259 1773852 1761741 1754476 1753208 1758268 1769281
60453 1769281 1785487 1805910 1829245 1854041 1879679 1907181 1938372 1974068 2013746 2057333 2106570
60442 2106570 2164000 2231097 2308096 2395420 2494633 2607977 2737292 2883260 3045474 3223503
60432 3223503 3418008 3630416 3861269 4109514 4373926 4654886 4954375 5274667 5617201
60423 5617201 5981512 6363220 6751789 7129746 7473973 7758531 7958686 8055467 8039078 7909921
60413 7909921 7677758 7359976 6978909 6558250 6119796 5681564 5256983 4854739 4479757
60404 4479757 4134878 3821521 3538998 3284583 3055268 2849045 2664045 2497552 2346948
60395 2346948 2211030 2089324 1980575 1882930 1795114 1716242 1644856 1579462 1519873 1466747 1419781
$$ packed form
60465A920060k2833k4313k4052k2199j9777j7627j5407j2111p265j268N060J1013
60453A769281J6206K0423K3335K4796K5638K7502L1191L5696L9678M3587M9237
60442B106570N7430O7097P6999Q7324R9213J13344J29315J45968J62214J78029
60432C223503J94505K12408K30853K48245K64412K80960K99489L20292L42534
60423E617201L64311L81708L88569L77957L44227K84558K00155R6781j6389j29157
60413G909921k32163l17782l81067m20659m38454m38232m24581m02244l74982
60404D479757l44879l13357k82523k54415k29315k06223j85000j66493j50604
60395B346948j35918j21706j08749r7645q7816p8872p1386o5394n9589n3126m6966
$$ plain form
60384 1419781 1377496 1338779 1303416 1270949 1240373 1211380 1184700 1160680 1138571 1117910 1099543
60373 1099543 1084258 1071054 1057813 1043504 1028938 1015469 1003634 993133 983555 974739 966535 958562
60361 958562 950417 942181 934486 927939 922772 919216 917774 918570 920743 923125 925399 928008 931137 934525
60347 934525 938156 942220 946333 949800 952959 957297 963610 970771 977064 982261 987595 993948 1000911 1007722
60333 1007722 1014554 1022424 1031873 1041820 1049987 1054789 1056959 1059048 1063148 1069231 1075643 1080789 1084113 1085827
60319 1085827 1086216 1085363 1083539 1081778 1081660 1083940 1087334 1089277 1088243 1085053 1081697 1079379 1078122 1077801 1078673
60304 1078673 1080751 1083239 1085041 1085807 1086347 1087987 1091515 1096665 1102613 1108885 1115620 1122984 1130713 1138531
60290 1138531 1146789 1156273 1167283 1179247 1191292 1202930 1214028 1224517 1234475 1244264 1253914 1262351
$$ packed form
60384A419781m2285l8717l5363l2467l0576k8993k6680k4020k2109k0661j8367
60373A099543j5285j3204j3241j4309j4566j3469j1835j0501r578q816q204p973
60361I58562q145q236p695o547n167l556j442P96K173K382K274K609L129L388
60347I34525L631M064M113L467L159M338O313P161O293N197N334O353O963O811
60333A007722O832P870R449R947Q167M802K170K089M100O083O412N146L324J714
60319A085827L89q53j824j761j18K280L394J943j034l190l356k318j257l21Q72
60304A078673K078K488J802P66N40J640L528N150N948O272O735P364P729P818
60290A138531Q258R484J1010J1964J2045J1638J1098J0489R958R789R650Q437
$$ plain form
60278 1262351 1267850 1269639 1268662 1266326 1263000 1258422 1253231 1249005 1246569 1245231 1244194 1243916 1245216 1247702
60264 1247702 1250097 1251882 1253388 1254210 1252881 1248889 1244106 1241010 1239763 1238048 1233914 1227876 1221937 1217402
60250 1217402 1214256 1212070 1210518 1209068 1207073 1204473 1202005 1200558 1200642 1202387 1205344 1208117 1209038 1207843 1206192
60235 1206192 1205993 1207515 1209568 1210915 1210862 1209049 1205704 1201923 1198810 1196369 1193988 1191858 1191077 1192367 1195445
60220 1195445 1199625 1204271 1208835 1213488 1219737 1229342 1242354 1257116 1272253 1287598 1303122 1318344
60208 1318344 1333282 1348609 1364181 1378718 1391905 1405658 1422100 1441186 1461517 1482803 1506201
60197 1506201 1532713 1562538 1595724 1632161 1670885 1710595 1751316 1794912 1843704 1898885 1960202
60186 1960202 2026711 2097833 2173975 2256109 2344756 2439786 2541349 2650271 2767054 2891090
$$ packed form
60278A262351N499J789r77k336l326m578n191m226k436j338j037k78J300K486
60264A247702K395J785J506Q22j329l992m783l096j247j715m134o038n939m535
60250A217402l146k186j552j450j995k600k468j447Q4J745K957K773R21j195j651
60235A206192j99J522K053J347n3j813l345l781l113k441k381k130p81J290L078
60220A195445M180M646M564M653O249R605J3012J4762J5137J5345J5524J5222
60208A318344J4938J5327J5572J4537J3187J3753J6442J9086K0331K1286K3398
60197A506201K6512K9825L3186L6437L8724L9710M0721M3596M8792N5181O1317
60186A960202O6509P1122P6142Q2134Q8647R5030J01563J08922J16783J24036
$$ plain form
60176 2891090 3021430 3157895 3300868 3450533 3606691 3768492 3933392 4096986 4254891
60167 4254891 4404721 4545560 4675956 4793305 4895068 4979923 5047886 5099778 5136322 5157361
60157 5157361 5162414 5152392 5130180 5099092 5061562 5019964 4977610 4937833 4902704 4873733 4853219
60146 4853219 4843788 4847077 4863849 4894778 4939994 4998547 5069663 5154129 5253206 5366631 5492881
60135 5492881 5630714 5778740 5933755 6091168 6246969 6397785 6539348 6666912 6777574
60126 6777574 6870607 6945074 6998579 7028782 7034882 7017318 6977420 6917837 6842017 6752764 6652391
60115 6652391 6544525 6434324 6326380 6223687 6129069 6045984 5976868 5921952 5881014 5855587
60105 5855587 5848363 5860835 5892291 5940772 6004314 6081348 6170173 6267893 6370090 6472116 6570616
$$ packed form
60176B891090J30340J36465J42973J49665J56158J61801J64900J63594J57905
60167D254891J49830J40839J30396J17349J01763Q4855O7963N1892L6544K1039
60157E157361N053j0022k2212l1088l7530m1598m2354l9777l5129k8971k0514
60146D853219r431L289J6772L0929M5216N8553P1116Q4466R9077J13425J26250
60135E492881J37833J48026J55015J57413J55801J50816J41563J27564J10662
60126F777574R3033P4467N3505L0203O100j7564l9898n9583p5820q9253j00373
60115F652391j07866j10201j07944j02693r4618q3085o9116n4916m0938k5427
60105E855587p224J2472L1456M8481O3542P7034Q8825R7720J02197J02026R8500
$$ plain form
60094 6570616 6663260 6747535 6821055 6882862 6933021 6970898 6995397 7007205 7009266 7004553 6994912 6982765
60082 6982765 6972368 6968402 6974460 6993821 7030295 7087023 7165332 7265978 7390780 7541943 7720474
60071 7720474 7926379 8160012 8422305 8714002 9035299 9385800 9764270 10168911 10598173
60062 10598173 11050455 11522399 12008214 12501106 12994412 13480870 13952114 14399902 14816917
60053 14816917 15195581 15527350 15804529 16021988 16176060 16262888 16279489 16225786 16104106 15917239
60043 15917239 15668655 15364401 15013350 14625607 14211856 13783767 13353135 12929998 12522479
60034 12522479 12138360 11785338 11469200 11192626 10956096 10759220 10601195 10481217 10399044
60025 10399044 10354313 10344703 10365387 10410736 10475963 10556548 10646660 10739015 10826347 10902599 10962936
$$ packed form
60094F570616R2644Q4275P3520O1807N0159L7877K4499J1808K061m713r641j2147
60082F982765j0397l966O058J9361L6474N6728P8309J00646J24802J51163J78531
60071G720474K05905K33633K62293K91697L21297L50501L78470M04641M29262
60062A0598173M52282M71944M85815M92892M93306M86458M71244M47788M17015
60053A4816917L78664L31769K77179K17459J54072Q6828J6601n3703j21680j86867
60043A5917239k48584l04254l51051l87743m13751m28089m30632m23137m07519
60034A2522479l84119l53022l16138k76574k36530j96876j58025j19978q2173
60025A0399044m4731r610K0684M5349O5227Q0585R0112R2355Q7332P6252O0337
$$ plain form
60014 10962936 11003490 11021757 11017067 10989947 10940556 10868066 10771974 10653604 10515611 10360216 10188895
60003 10188895 10003671 9807430 9602515 9390329 9173200 8955642 8742611 8537163 8340961
59994 8340961 8156446 7987079 7835559 7703146 7590919 7500490 7433032 7388557 7366742 7367847
59984 7367847 7392231 7439374 7507941 7596537 7703793 7827586 7964512 8110407 8261157 8412662
59974 8412662 8559973 8697082 8818189 8919086 8996909 9048808 9071732 9063717 9024764 8956321 8860516
59963 8860516 8740142 8598673 8439867 8267756 8087139 7903265 7720672 7542922 7373788
59954 7373788 7217848 7079306 6960682 6862968 6786405 6730829 6696233 6683644 6694716 6729979 6788385
59943 6788385 6869168 6972968 7100123 7248972 7417261 7604354 7810227 8032369 8265077 8501713
$$ packed form
60014A0962936M0554J8267m690k7120m9391p2490r6092j18370j37993j55395j71321
60003A0188895j85224j96241k04915k12186k17129k17558k13031k05448j96202
59994H340961j84515j69367j51520j32413j12227r0429o7458m4475k1815J105
59984G367847K4384M7143O8567Q8596J07256J23793J36926J45895J50750J51505
59974H412662J47311J37109J21107J00897P7823N1899K2924q015l8953o8443r5805
59963H860516j20374j41469j58806j72111j80617j83874j82593j77750j69134
59954G373788j55940j38542j18624r7714p6563n5576l4596j2589J1072L5263N8406
59943F788385Q0783J03800J27155J48849J68289J87093K05873K22142K32708K36636
$$ plain form
59933 8501713 8736260 8962530 9173424 9362018 9522989 9652713 9748619 9808904 9832631 9819735
59923 9819735 9770900 9687450 9571534 9426840 9259115 9075299 8881867 8684626 8490079 8305557
59913 8305557 8137038 7987661 7859153 7753617 7672764 7616599 7584668 7578047 7598199 7644052 7712037
59902 7712037 7799168 7904496 8027205 8164767 8313520 8469797 8630021 8790833 8949717 9104622
59892 9104622 9252727 9390843 9517398 9632600 9736057 9825941 9901906 9967590 10028489 10087983
59882 10087983 10147116 10207962 10275371 10355074 10451640 10569057 10711989 10885129 11091613 11333017
59872 11333017 11610729 11926401 12280882 12673286 13101024 13559748 14042613 14540020 15040533
59863 15040533 15531619 15999029 16426186 16795449 17090547 17298008 17407622 17413562 17315992 17121008
$$ packed form
59933H501713K34547K26270K10894J88594J60971J29724R5906O0285K3727j2896
59923I819735m8835q3450j15916j44694j67725j83816j93432j97241j94547j84522
59913H305557j68519j49377j28508j05536q0853n6165l1931o621K0152M5853O7985
59902G712037Q7131J05328J22709J37562J48753J56277J60224J60812J58884J54905
59892I104622J48105J38116J26555J15202J03457Q9884P5965O5684O0899N9494
59882A0087983N9133O0846O7409P9703R6566J17417J42932J73140K06484K41404
59872A1333017K77712L15672L54481L92404M27738M58724M82865M97407N00513
59863A5040533M91086M67410M27157L69263K95098K07461J09614N940r7570j94984
$$ plain form
59853 17121008 16838838 16482514 16067642 15611279 15129448 14635825 14142788 13662186 13203826
59844 13203826 12773940 12376337 12014786 11693438 11415349 11181628 10991960 10845298 10740354
59835 10740354 10676158 10652066 10666720 10717336 10800470 10912871 11050730 11208480 11379208 11555828
59825 11555828 11730776 11894633 12036249 12144763 12211281 12228992 12192901 12100246 11951077 11748142
59815 11748142 11496123 11200871 10869325 10510047 10133082 9748179 9362787 8982280 8611810
59806 8611810 8256598 7920199 7604003 7309141 7037543 6790372 6566946 6366529 6189721
59797 6189721 6036501 5904160 5789059 5689515 5604928 5532813 5469107 5411299 5359016 5311279 5265276
59786 5265276 5218523 5170652 5122550 5075221 5030062 4988830 4952474 4920679 4892736 4867691 4843421
$$ packed form
59853A7121008k82170l56324m14872m56363m81831m93623m93037m80602m58360
59844A3203826m29886l97603l61551l21348k78089k33721j89668j46662j04944
59835A0740354o4196k4092J4654N0616Q3134J12401J37859J57750J70728J76620
59825A1555828J74948J63857J41616J08514O6518J7711l6091r2655j49169k02935
59815A1748142k52019k95252l31546l59278l76965l84903l85392l80507l70470
59806H611810l55212l36399l16196k94862k71598k47171k23426k00417j76808
59797F189721j53220j32341j15101r9544q4587p2115o3706n7808n2283m7737m6003
59786E265276m6753m7871m8102m7329m5159m1232l6356l1795k7943k5045k4270
$$ plain form
59775 4843421 4816861 4785742 4749222 4706839 4658401 4605473 4551550 4499758 4451104 4405377 4362560
59764 4362560 4322548 4284508 4247713 4212779 4181468 4155605 4136499 4124852 4120656 4123328 4132070 4145869
59752 4145869 4163466 4184230 4209203 4240532 4279644 4326545 4380815 4442447 4511420 4587065 4667935
59741 4667935 4751809 4835996 4918370 4997960 5073875 5144094 5206330 5259801 5305122 5343158 5375634
59730 5375634 5406446 5440277 5479550 5524379 5575621 5635941 5707427 5790507 5886532 5999570 6133964
59719 6133964 6291340 6471419 6674642 6902473 7156118 7436704 7746339 8087420 8460794
59710 8460794 8865291 9298323 9755030 10225744 10693957 11136341 11524872 11831099 12031885
59701 12031885 12114462 12078659 11936160 11707556 11417856 11091690 10750163 10409935 10083492 9779893
$$ packed form
59775D843421k6560l1119l6520m2383m8438n2928n3923n1792m8654m5727m2817
59764D362560m0012l8040l6795l4934l1311k5863j9106j1647m196K672Q742J3799
59752D145869J7597K0764K4973L1329L9112M6901N4270O1632O8973P5645Q0870
59741D667935Q3874Q4187Q2374P9590P5915P0219O2236N3471M5321L8036L2476
59730E375634L0812L3831L9273M4829N1242O0320P1486Q3080R6025J13038J34394
59719F133964J57376J80079K03223K27831K53645K80586L09635L41081L73374
59710H460794M04497M33032M56707M70714M68213M42384L88531L06227K00786
59701A2031885Q2577l5803j42499k28604k89700l26166l41527l40228l26443l03599
$$ plain form
59691 9779893 9506009 9267028 9065171 8898737 8764492 8661586 8591800 8555780 8551041 8574664
59681 8574664 8626127 8706010 8813430 8946696 9105767 9292222 9506992 9749544 10019405 10317647
59671 10317647 10646957 11010813 11412113 11851842 12329461 12845242 13401725 14002274 14648882
59662 14648882 15342176 16082875 16872010 17709762 18594525 19522496 20487423 21481063 22494216
59653 22494216 23516608 24535553 25536407 26506166 27436796 28325108 29171260 29979020 30756319
59644 30756319 31513125 32258190 32998242 33738605 34481720 35224269 35957044 36667831 37343360
59635 37343360 37968877 38528332 39006760 39392540 39678000 39859948 39941020 39929909 39839399 39684420
59625 39684420 39481965 39251501 39013805 38788887 38594856 38447858 38361977 38348916 38418081 38577038
$$ packed form
59691I779893k73884k38981k01857j66434j34245j02906o9786l6020m739K3623
59681H574664N1463P9883J07420J33266J59071J86455K14770K42552K69861K98242
59671A0317647L29310L63856M01300M39729M77619N15781N56483O00549O46608
59662A4648882O93294P40699P89135Q37752Q84763R27971R64927R93640J013153
59653B2494216J022392J018945J000854R69759R30630Q88312Q46152Q07760P77299
59644C0756319P56806P45065P40052P40363P43115P42549P32775P10787O75529
59635C7343360O25517N59455M78428L85780K85460J81948Q1072j1111r0510j54979
59625C9684420k02455k30464k37696k24918j94031j46998q5881j3061O9165J58957
$$ plain form
59615 38577038 38831749 39186503 39643952 40205188 40869354 41632639 42487181 43420636 44416419
59606 44416419 45453631 46505836 47539430 48513515 49382189 50098251 50616836 50898726 50913981
59597 50913981 50646016 50095087 49279174 48230906 46991726 45606715 44122108 42583740
59589 42583740 41033839 39507169 38029641 36619614 35288986 34042465 32876446 31778579
59581 31778579 30727909 29696717 28656152 27584133 26470557 25317303 24135560 22942998
59573 22942998 21760097 20605489 19493243 18433696 17434873 16501722 15635082 14833205 14094368
59564 14094368 13417273 12799497 12236894 11724704 11258701 10835415 10451814 10104645 9789907
59555 9789907 9503526 9242847 9006761 8793973 8601940 8427906 8269809 8125245 7990523
$$ packed form
59615C8577038K54711L54754M57449N61236O64166P63285Q54542R33455R95783
59606D4416419J037212J052205J033594R74085Q68674P16062N18585K81890J5255
59597E0913981k67965n50929q15913j048268j239180j385011j484607j538368
59589D2583740j549901j526670j477528j410027j330628j246521j166019j097867
59581C1778579j050670j031192j040565j072019j113576j153254j181743j192562
59573B2942998j182901j154608j112246j059547r98823r33151q66640q01877p38837
59564A4094368o77095o17776n62603n12190m66003m23286l83601l47169l14738
59555I789907k86381k60679k36086k12788j92033j74034j58097j44564j34722
$$ plain form
59546 7990523 7861795 7736473 7612734 7488571 7362503 7234383 7104251 6970979 6833374
59537 6833374 6692143 6549593 6407826 6268457 6133569 6005386 5884972 5772399 5668067
59528 5668067 5572808 5486913 5410292 5343517 5287548 5242381 5206959 5180419 5162511 5152897 5151085 5157039
59516 5157039 5170878 5191947 5219078 5251704 5289793 5332785 5379548 5429401 5482227 5537714 5595562
59505 5595562 5656559 5722464 5794671 5873880 5961053 6057612 6164438 6281594 6409351 6548733
59495 6548733 6700914 6866953 7048277 7246510 7462479 7696208 7948158 8219495 8510551
59486 8510551 8819781 9144912 9484573 9838006 10203385 10577102 10954726 11332116 11705472
59477 11705472 12070784 12423621 12759205 13071886 13354446 13599210 13801458 13962065 14085939
$$ packed form
59546G990523j28728j25322j23739j24163j26068j28120j30132j33272j37605
59537F833374j41231j42550j41767j39369j34888j28183j20414j12573j04332
59528E668067r5259q5895p6621o6775n5969m5167l5422k6540j7908r614j812N954
59516E157039J3839K1069K7131L2626L8089M2992M6763M9853N2826N5487N7848
59505E595562O0997O5905P2207P9209Q7173R6559J06826J17156J27757J39382
59495F548733J52181J66039J81324J98233K15969K33729K51950K71337K91056
59486H510551L09230L25131L39661L53433L65379L73717L77624L77390L73356
59477A1705472L65312L52837L35584L12681K82560K44764K02248J60607J23874
$$ plain form
59468 14085939 14177803 14240224 14275450 14287300 14280338 14258393 14225039 14184829 14143243 14106122 14079807
59457 14079807 14070951 14085275 14127141 14200700 14309875 14455703 14634444 14839323 15062861 15295863
59447 15295863 15525057 15733944 15906252 16028017 16087661 16076359 15988603 15821467 15574085 15249455
59437 15249455 14856320 14407663 13917510 13400069 12870254 12341868 11824798 11325657 10850925
59428 10850925 10407288 9998970 9627185 9292849 8997722 8742187 8523797 8339088 8185575
59419 8185575 8061589 7966002 7899089 7862249 7855963 7878928 7929493 8006542 8108737 8234636 8384241
59408 8384241 8558636 8757024 8975627 9210442 9459528 9721260 9991467 10263451 10529709
59399 10529709 10782345 11012675 11211784 11371259 11483150 11540643 11540020 11481267 11366021 11195952
$$ packed form
59468A4085939R1864O2421L5226J1850o962k1945l3354m0210m1586l7121k6315
59457A4079807q856J4324M1866P3559J09175J45828J78741K04879K23538K33002
59447A5295863K29194K08887J72308J21765N9644j1302q7756j67136k47382l24630
59437A5249455l93135m48657m90153n17441n29815n28386n17070m99141m74732
59428A0850925m43637m08318l71785l34336k95127k55535k18390j84709j53513
59419H185575j23986r5587o6913l6840o286K2965N0565P7049J02195J25899J49605
59408H384241J74395J98388K18603K34815K49086K61732K70207K71984K66258
59399A0529709K52636K30330J99109J59475J11891N7493o23n8753j15246j70069
$$ plain form
59389 11195952 10974179 10707144 10403630 10072305 9721023 9357528 8989164 8621814 8260017
59380 8260017 7907975 7569694 7248166 6944751 6659189 6390242 6137234 5901376 5684800
59371 5684800 5487980 5309147 5146620 5000311 4870083 4754140 4650472 4558809 4479539 4411597
59361 4411597 4353291 4304675 4267079 4240178 4221489 4209232 4204003 4206789 4216995 4233856 4258638 4293111
59349 4293111 4335390 4378781 4415873 4443499 4463462 4479628 4495823 4515956 4543821 4581491 4629117
59338 4629117 4687321 4758338 4842737 4935665 5028870 5117311 5202787 5291134 5387617 5495515 5617120
59327 5617120 5754263 5908326 6080810 6273729 6488936 6727461 6989947 7277414 7591470
59318 7591470 7934414 8309301 8719200 9166147 9651468 10177134 10745759 11358958 12016492
$$ packed form
59389A1195952k21773k67035l03514l31325l51282l63495l68364l67350l61797
59380H260017l52042l38281l21528l03415k85562k68947k53008k35858k16576
59371E684800j96820j78833j62527j46309j30228j15943j03668r1663p9270o7942
59361D411597n8306m8616l7596k6901j8689j2257n229K786J0206J6861K4782L4473
59349D293111M2279M3391L7092K7626J9963J6166J6195K0133K7865L7670M7626
59338D629117N8204P1017Q4399R2928R3205Q8441Q5476Q8347R6483J07898J21605
59327E617120J37143J54063J72484J92919K15207K38525K62486K87467L14056
59318G591470L42944L74887M09899M46947M85321N25666N68625O13199O57534
$$ plain form
59309 12016492 12716968 13457831 14233857 15036482 15854964 16677285 17489831 18278165 19029755
59300 19029755 19735749 20390009 20987941 21527291 22008881 22435096 22807927 23128819 23398965
59291 23398965 23618271 23784419 23893809 23942650 23926158 23837631 23669854 23417502 23077940 22651145
59281 22651145 22140674 21554525 20903698 20199768 19454233 18679212 17887058 17089074 16295338
59272 16295338 15515351 14757571 14028265 13331773 12671926 12052280 11474970 10940310 10447779
59263 10447779 9996640 9585389 9211359 8871472 8563289 8285371 8036965 7817471 7625915
59254 7625915 7460637 7319319 7199160 7097372 7012118 6943126 6890861 6854989 6834163 6827236 6833876
59243 6833876 6853776 6886221 6930786 6987534 7055935 7134438 7221650 7317033 7419701 7527360 7637317
$$ packed form
59309A2016492P00476P40863P76026Q02625Q18482Q22321Q12546P88334P51590
59300A9029755P05994O54260N97932N39350M81590M26215L72831L20892K70146
59291B3398965K19306J66148J09390M8841j6492q8527j67777k52352l39562m26795
59281B2651145n10471n86149o50827p03930p45535p75021p92154p97984p93736
59272A6295338p79987p57780p29306o96492o59847o19646n77310n34660m92531
59263A0447779m51139m11251l74030l39887l08183k77918k48406k19494j91556
59254G625915j65278j41318j20159j01788q5254o8992n2265l5872k0826o927O640
59243F833876J9900L2445M4565N6748O8401P8503Q7212R5383J02668J07659J09957
$$ plain form
59232 7637317 7747884 7858021 7966298 8071168 8171712 8267217 8356509 8438749 8514683 8586350
59222 8586350 8655827 8724823 8794949 8867597 8943905 9025524 9114774 9212838 9317784 9425117 9530425
59211 9530425 9631372 9727704 9819907 9907449 9987606 10056170 10109510 10145367 10161608 10155542 10125445
59200 10125445 10071816 9996172 9899683 9784447 9655431 9519336 9381406 9244392 9110401 8982433
59190 8982433 8863883 8757527 8665205 8587755 8525123 8477016 8443207 8422665 8412883 8411008 8415495
59179 8415495 8425772 8440567 8457597 8474878 8491461 8506886 8520868 8533746 8546670 8561238 8579404
59168 8579404 8603663 8636866 8682016 8742610 8822471 8924374 9049288 9198179 9374422 9583256
59158 9583256 9828550 10110892 10428889 10781156 11166114 11580094 12015992 12463635 12911022
$$ packed form
59232G637317J10567J10137J08277J04870J00544R5505Q9292Q2240P5934P1667
59222H586350O9477O8996P0126P2648P6308Q1619Q9250R8064J04946J07333J05308
59211I530425J00947R6332R2203Q7542Q0157O8564N3340L5857J6241o066l0097
59200A0125445n3629p5644r6489j15236j29016j36095j37930j37014j33991j27968
59190H982433j18550j06356r2322p7450o2632m8107l3809k0542r782j875M487
59179H415495J0277J4795J7030J7281J6583J5425J3982J2878J2924J4568J8166
59168H579404K4259L3203M5150O0594P9861J01903J24914J48891J76243K08834
59158I583256K45294K82342L17997L52267L84958M13980M35898M47643M47387
$$ plain form
59149 12911022 13344956 13750596 14111242 14409990 14632397 14767528 14807010 14744927 14579970 14317029
59139 14317029 13965745 13537885 13046658 12507242 11935982 11348575 10759321 10181038 9623922
59130 9623922 9094174 8594703 8127310 7693660 7294542 6929360 6596503 6293647 6018062
59121 6018062 5767514 5540753 5336335 5151355 4982471 4828112 4688737 4564891 4455812
59112 4455812 4359737 4274636 4198795 4131724 4074482 4028166 3992030 3963915 3942280 3926756 3916880
59101 3916880 3911798 3911598 3917705 3931312 3952161 3979294 4012176 4050625 4094460 4143861 4199633 4262562
59089 4262562 4332781 4409930 4493414 4582219 4674995 4771021 4870945 4976115 5086967 5202153 5319421
59078 5319421 5437365 5556069 5675630 5794228 5908279 6014600 6111762 6199335 6276969 6344797
$$ packed form
59149A2911022M33934M05640L60646K98748K22407J35131L9482o2083j64957k62941
59139A4317029l51284m27860m91227n39416n71260n87407n89254n78283n57116
59130I623922n29748m99471m67393m33650l99118l65182l32857l02856k75585
59121F018062k50548k26761k04418j84980j68884j54359j39375j23846j09079
59112D455812r6075q5101p5841o7071n7242m6316l6136k8115k1635j5524r876
59101C916880n082k00O107J3607K0849K7133L2882L8449M3835M9401N5772O2929
59089D262562P0219P7149Q3484Q8805R2776R6026R9924J05170J10852J15186J17268
59078E319421J17944J18704J19561J18598J14051J06321R7162Q7573P7634O7828
$$ plain form
59068 6344797 6403646 6453787 6494146 6523852 6544143 6557841 6567486 6575104 6583308 6595132 6612518 6635826
59056 6635826 6664929 6700207 6742777 6794706 6858851 6937467 7030719 7137054 7254927 7383724 7523553
59045 7523553 7675043 7839053 8015652 8203559 8401397 8609157 8827511 9055945 9292456
59036 9292456 9534575 9779175 10021183 10253531 10468570 10658836 10816856 10935677 11010064 11036659
59026 11036659 11013479 10940545 10821059 10660675 10465276 10240194 9991235 9724756 9446055 9158673
59016 9158673 8865581 8569898 8273893 7978316 7683595 7391179 7103236 6821686 6548075
59007 6548075 6283794 6029692 5785598 5550738 5324770 5108407 4903041 4709618 4527777
58998 4527777 4356363 4194875 4043842 3903452 3772532 3649516 3533765 3425243 3323601
$$ packed form
59068F344797N8849N0141M0359K9706K0291J3698R645P618Q204J1824J7386K3308
59056F635826K9103L5278M2570N1929O4145P8616R3252J06335J17873J28797J39829
59045G523553J51490J64010J76599J87907J97838K07760K18354K28434K36511
59036I292456K42119K44600K42008K32348K15039J90266J58020J18821P4387K6595
59026A1036659k3180p2934j19486j60384j95399k25082k48959k66479k78701k87382
59016I158673k93092k95683k96005k95577k94721k92416k87943k81550k73611
59007F548075k64281k54102k44094k34860k25968k16363k05366j93423j81841
58998D527777j71414j61488j51033j40390j30920j23016j15751j08522j01642
$$ plain form
58989 3323601 3228533 3140409 3059334 2983976 2912593 2845022 2782446 2725236 2672138 2621641 2573120
58978 2573120 2526635 2482708 2442422 2406862 2376196 2349911 2327828 2310114 2296392 2285658 2277111
58967 2277111 2270519 2265992 2263953 2264905 2268515 2273421 2278642 2284494 2291247 2297713 2302262 2304445 2304461 2302113 2297969
58952 2297969 2294612 2294591 2297547 2301237 2304888 2309339 2314248 2317915 2320195 2323004 2327192 2331055 2332996 2333689 2334452
58937 2334452 2335090 2334579 2332592 2329141 2323764 2316210 2307356 2298659 2291199 2285440 2281130 2277277 2273193 2269724
58923 2269724 2268420 2269441 2271556 2274294 2278658 2285491 2294665 2306352 2321576 2340835 2363301 2387792 2413420
58910 2413420 2439143 2464318 2490204 2519336 2552604 2588142 2623619 2658376 2692933 2727967 2764461
58899 2764461 2803370 2844225 2885277 2925759 2966895 3010096 3055446 3102583 3151799 3203588 3258214
$$ packed form
58989C323601r5068q8124q1075p5358p1383o7571o2576n7210n3098n0497m8521
58978B573120m6485m3927m0286l5560l0666k6285k2083j7714j3722j0734q547
58967B277111o592m527k039R52L610M906N221N852O753O466M549K183J6k348m144
58952B297969l357k1K956L690L651M451M909L667K280K809M188L863J941O93P63
58937B334452O38n11j987l451n377p554q854q697p460n759m310l853m084l469
58923B269724j304J021K115K738M364O833R174J1687J5224J9259K2466K4491K5628
58910B413420K5723K5175K5886K9132L3268L5538L5477L4757L4557L5034L6494
58899B764461L8909M0855M1052M0482M1136M3201M5350M7137M9216N1789N4626
$$ plain form
58888 3258214 3316297 3378783 3446000 3517951 3595538 3679893 3770343 3865007 3963756 4068507 4180112
58877 4180112 4297465 4420630 4552259 4694271 4845400 5004040 5171674 5351354 5544238
58868 5544238 5749760 5968192 6201071 6449872 6715997 7001299 7307045 7633128 7979795
58859 7979795 8349435 8745400 9169932 9624536 10111215 10631605 11185783 11773766 12397651
58850 12397651 13060546 13763628 14505505 15283838 16095992 16938330 17806139 18693746 19593056
58841 19593056 20491746 21373674 22220678 23013088 23729333 24347034 24845602 25208148 25422161
58832 25422161 25480034 25379685 25124848 24725200 24196074 23556732 22827842 22030344 21185516
58823 21185516 20313633 19431432 18551991 17687259 16848528 16043388 15274335 14542161 13849271
$$ packed form
58888C258214N8083O2486O7217P1951P7587Q4355R0450R4664R8749J04751J11605
58877D180112J17353J23165J31629J42012J51129J58640J67634J79680J92884
58868E544238K05522K18432K32879K48801K66125K85302L05746L26083L46667
58859G979795L69640L95965M24532M54604M86679N20390N54178N87983O23885
58850A2397651O62895P03082P41877P78333Q12154Q42338Q67809Q87607Q99310
58841A9593056Q98690Q81928Q47004P92410P16245O17701M98568L62546K14013
58832B5422161N7873j00349k54837l99648n29126o39342p28890p97498q44828
58823B1185516q71883q82201q79441q64732q38731q05140p69053p32174o92890
$$ plain form
58814 13849271 13198130 12588144 12016358 11480465 10979354 10511539 10074884 9667348 9286546
58805 9286546 8929339 8593518 8279317 7987751 7718012 7467837 7235679 7020924 6822514
58796 6822514 6638952 6469441 6313847 6171946 6043595 5928880 5827035 5736066 5654586 5583053
58786 5583053 5522197 5471587 5431113 5402343 5386507 5382335 5387926 5403649 5431023 5469714 5518022 5575739
58774 5575739 5644184 5723819 5814102 5915398 6028819 6154268 6290730 6438469 6599056 6773390
58764 6773390 6961609 7164755 7384580 7621885 7877088 8152305 8450717 8773823 9121411
58755 9121411 9494296 9895016 10325628 10786960 11280342 11808016 12371473 12971446 13609764
58746 13609764 14288794 15008051 15763363 16550166 17365445 18204933 19059840 19917386 20762917
$$ packed form
58814A3849271o51141o09986n71786n35893n01111m67815m36655m07536l80802
58805I286546l57207l35821l14201k91566k69739k50175k32158k14755j98410
58796F822514j83562j69511j55594j41901j28351j14715j01845r0969q1480p1533
58786E583053o0856n0610m0474k8770j5836m172N591J5723K7374L8691M8308N7717
58774E575739O8445P9635R0283J01296J13421J25449J36462J47739J60587J74334
58764F773390J88219K03146K19825K37305K55203K75217K98412L23106L47588
58755I121411L72885M00720M30612M61332M93382N27674N63457N99973O38318
58746A3609764O79030P19257P55312P86803Q15279Q39488Q54907Q57546Q45531
$$ plain form
58737 20762917 21580000 22349656 23051231 23663961 24167406 24542067 24771819 24846704 24763707 24525919
58727 24525919 24141701 23624284 22991224 22263459 21463449 20612440 19728654 18828058 17926033
58718 17926033 17036832 16171283 15336020 14534979 13770675 13044270 12356045 11706425 11095738
58709 11095738 10522825 9985089 9480305 9007494 8565800 8153548 7768751 7409612 7074200
58700 7074200 6760609 6467855 6195752 5943411 5708590 5488986 5283618 5092500 4915310
58691 4915310 4750685 4596700 4452114 4317342 4193740 4081441 3978426 3882384 3792946 3711057
58681 3711057 3636547 3567454 3501734 3438736 3379033 3323469 3272118 3223488 3175027 3125066 3073879
58670 3073879 3022483 2971413 2921542 2874761 2832133 2792041 2751785 2710510 2668998 2627189 2583873
$$ packed form
58737B0762917Q17083P69656P01575O12730N03445L74661K29752P4885q2997k37788
58727B4525919l84218n17417o33060p27765q00010q51009q83786r00596r02025
58718A7926033q89201q65549q35263q01041p64304p26405o88225o49620o10687
58709A1095738n72913n37736n04784m72811m41694m12252l84797l59139l35412
58700G074200l13591k92754k72103k52341k34821k19604k05368j91118j77190
58691D915310j64625j53985j44586j34772j23602j12299j03015r6042q9438q1889
58681C711057p4510o9093o5720o2998n9703n5564n1351m8630m8461m9961n1187
58670C073879n1396n1070m9871m6781m2628m0092m0256m1275m1512m1809m3316
$$ plain form
58659 2583873 2538604 2492034 2444355 2395197 2345196 2295898 2247617 2198898 2148600 2097491 2047557
58648 2047557 2000690 1957984 1919135 1882575 1847227 1813825 1783318 1754568 1725409 1695809 1668002
58637 1668002 1643287 1620434 1597630 1574345 1550790 1526977 1503029 1479489 1456914 1435844 1416899
58626 1416899 1399871 1383136 1365428 1347890 1332861 1320952 1311107 1303221 1298468 1296774 1296241 1295787 1296564
58613 1296564 1299930 1305595 1312575 1320663 1330090 1340767 1352416 1364594 1376316 1386661 1395772 1404139 1411011
58600 1411011 1414853 1415257 1412927 1407985 1400090 1390229 1380388 1371154 1361578 1351788 1343789 1338943 1336521 1335533
58586 1335533 1336327 1339550 1344961 1352169 1361294 1372303 1384996 1400167 1419427 1443208 1470116 1498760
58574 1498760 1529078 1561611 1596827 1635422 1677906 1723605 1771383 1821469 1875108 1932523 1993120
$$ packed form
58659B583873m5269m6570m7679m9158n0001m9298m8281m8719n0298n1109m9934
58648B047557m6867m2706l8849l6560l5348l3402l0507k8750k9159k9600k7807
58637A668002k4715k2853k2804k3285k3555k3813k3948k3540k2575k1070j8945
58626A416899j7028j6735j7708j7538j5029j1909r845p886m753j694n33m54P77
58613A296564L366N665O980Q088R427J0677J1649J2178J1722J0345R111Q367O872
58600A411011L842M04k330m942p895r861r841r234r576r790p999m846k422r88
58586A335533P94L223N411P208R125J1009J2693J5171J9260K3781K6908K8644
58574A498760L0318L2533L5216L8595M2484M5699M7778N0086N3639N7415O0597
$$ plain form
58563 1993120 2057817 2129094 2208257 2294557 2387387 2487371 2594827 2709398 2831980 2964958
58553 2964958 3109674 3265582 3432679 3612674 3806714 4013845 4232710 4462845 4703182
58544 4703182 4950971 5202994 5455796 5703679 5938520 6152851 6341156 6497157 6612374
58535 6612374 6679590 6696305 6663381 6582410 6456631 6292978 6100730 5888398 5662922 5430544
58525 5430544 5196617 4965131 4739622 4523769 4320172 4129614 3952468 3789591 3640886
58516 3640886 3504508 3378787 3263662 3159104 3063641 2975914 2896238 2824897 2759946 2698338
58506 2698338 2638526 2580724 2525499 2473336 2424621 2378902 2335109 2293501 2256180 2224360 2196135
58495 2196135 2168158 2138566 2107205 2074244 2040046 2005521 1971286 1937072 1902678 1868382 1833589
$$ packed form
58563A993120O4697P1277P9163Q6300R2830R9984J07456J14571J22582J32978
58553B964958J44716J55908J67097J79995J94040K07131K18865K30135K40337
58544D703182K47789K52023K52802K47883K34841K14331J88305J56001J15217
58535F612374O7216J6715l2924q0971j25779j63653j92248k12332k25476k32378
58525E430544k33927k31486k25509k15853k03597j90558j77146j62877j48705
58516C640886j36378j25721j15125j04558r5463q7727p9676p1341o4951o1608
58506B698338n9812n7802n5225n2163m8715m5719m3793m1608l7321l1820k8225
58495B196135k7977k9592l1361l2961l4198l4525l4235l4214l4394l4296l4793
$$ plain form
58484 1833589 1796623 1757253 1718230 1682848 1651812 1623587 1596851 1571324 1547121 1524482 1503599
58473 1503599 1484075 1465387 1448066 1432888 1418629 1402845 1385823 1371337 1361884 1355364 1348295 1340213
58461 1340213 1332557 1325046 1316016 1305390 1294630 1284185 1273166 1261159 1248436 1234688 1219394 1203278
58449 1203278 1187805 1173397 1159455 1145819 1132908 1120807 1109537 1100043 1093656 1090535 1089276 1087942
58437 1087942 1085205 1081184 1077589 1076195 1076789 1077551 1077680 1078235 1080030 1082453 1085055 1088506 1092946 1097074 1099945
58422 1099945 1102138 1104149 1105423 1106014 1107243 1109289 1110009 1107752 1103654 1099508 1095112 1089493 1083204 1077559
58408 1077559 1072889 1069182 1066951 1065867 1064065 1060554 1056850 1054587 1053127 1051291 1049661 1049112 1048697 1047214
58394 1047214 1045506 1045032 1045390 1045279 1044649 1043833 1041876 1037929 1033195 1029506 1027148 1025977 1027171 1031503 1037168
$$ packed form
58484A833589l6966l9370l9023l5382l1036k8225k6736k5527k4203k2639k0883
58473A503599j9524j8688j7321j5178j4259j5784j7022j4486r453o520p069q082
58461A340213p656p511r030j0626j0760j0445j1019j2007j2723j3748j5294j6116
58449A203278j5473j4408j3942j3636j2911j2101j1270r494o387l121j259j334
58437A087942k737m021l595j394N94P62J29N55J795K423K602L451M440M128K871
58422A099945K193K011J274N91J229K046P20k257m098m146m396n619o289n645
58408A077559m670l707k231j084j802l511l704k263j460j836j630n49m15j483
58394A047214j708m74L58j11o30q16j957l947m734l689k358j171J194M332N665
$$ plain form
58379 1037168 1041783 1045605 1050560 1057056 1064059 1071376 1079474 1087709 1094949 1101508 1108514 1115817 1122140 1126679
58365 1126679 1129157 1129221 1127170 1124261 1121035 1116628 1111061 1106504 1104688 1104722 1105137 1106246 1108684 1111567 1114235
58350 1114235 1117995 1124079 1131657 1139993 1150469 1164173 1179565 1195084 1211959 1231600 1252125 1270405
58338 1270405 1285847 1299343 1310348 1318023 1323522 1328044 1330189 1328213 1323293 1317538 1310517 1300876 1289573
58325 1289573 1278264 1266361 1253278 1241779 1235252 1233088 1232427 1232906 1235835 1240246 1244012 1247794 1253876
58312 1253876 1262036 1270381 1278999 1288855 1298401 1305576 1312005 1320744 1330882 1339065 1345627 1354355 1366457
58299 1366457 1379408 1391726 1404398 1417601 1430455 1444293 1461860 1482856 1504072 1524085 1543943
58288 1543943 1563306 1580178 1594891 1610402 1628080 1646476 1664150 1680232 1692612 1699661 1703726 1708994
$$ packed form
58379A037168M615L822M955O496P003P317Q098Q235P240O559P006P303O323M539
58365A126679K478O4k051k909l226m407n567m557j816L4M15J109K438K883K668
58350A114235L760O084P578Q336J0476J3704J5392J5519J6875J9641K0525J8280
58338A270405J5442J3496J1005P675N499M522K145j976m920n755p021r641j1303
58325A289573j1309j1903j3083j1499o527k164o61M79K929M411L766L782O082
58312A253876Q160Q345Q618R856R546P175O429Q739J0138Q183O562Q728J2102
58299A366457J2951J2318J2672J3203J2854J3838J7567K0996K1216K0013J9858
58288A543943J9363J6872J4713J5511J7678J8396J7674J6082J2380P049M065N268
$$ plain form
58276 1708994 1715950 1721760 1725854 1730869 1738076 1746105 1754462 1764295 1775397 1786382 1798083 1813038 1831490
58263 1831490 1851501 1872726 1896305 1921365 1945653 1969412 1994809 2021974 2049464 2077721 2107809
58252 2107809 2137772 2165006 2191342 2220790 2253082 2284560 2314536 2345111 2375422 2402220 2426042
58241 2426042 2450789 2477042 2501843 2525497 2552479 2584850 2620388 2657767 2697974 2740112 2781596
58230 2781596 2823075 2867613 2914826 2961691 3009102 3061187 3117915 3175001 3231572 3291079 3354132
58219 3354132 3417627 3481899 3551395 3626960 3704616 3783448 3867543 3958584 4053688 4152126 4256869
58208 4256869 4367636 4479788 4592155 4708947 4832129 4959069 5089444 5226887 5371910
58199 5371910 5520827 5673782 5836250 6010636 6194040 6386130 6591070 6809627 7037631
$$ packed form
58276A708994O956N810M094N015P207Q029Q357R833J1102J0985J1701J4955J8452
58263A831490K0011K1225K3579K5060K4288K3759K5397K7165K7490K8257L0088
58252B107809K9963K7234K6336K9448L2292L1478K9976L0575L0311K6798K3822
58241B426042K4747K6253K4801K3654K6982L2371L5538L7379M0207M2138M1484
58230B781596M1479M4538M7213M6865M7411N2085N6728N7086N6571N9507O3053
58219C354132O3495O4272O9496P5565P7656P8832Q4095R1041R5104R8438J04743
58208D256869J10767J12152J12367J16792J23182J26940J30375J37443J45023
58199E371910J48917J52955J62468J74386J83404J92090K04940K18557K28004
$$ plain form
58190 7037631 7274358 7524100 7787405 8059406 8338797 8629668 8932728 9244392 9566664
58181 9566664 9908025 10272168 10655867 11059970 11491387 11951778 12435930 12944537 13486721
58172 13486721 14066594 14679735 15326915 16018761 16762486 17556473 18402272 19309235 20283556
58163 20283556 21326693 22448667 23667831 24992213 26415655 27936461 29563576 31300471
58155 31300471 33142521 35097791 37192642 39450473 41883954 44513623 47371441 50477721
58147 50477721 53838024 57473188 61431370 65765856 70531777 75816798 81745577 88440932
58139 88440932 96009466 104573710 114281398 125273940 137691414 151719506 167572388
58132 167572388 185408050 205329010 227505721 252252456 279991688 311234931 346449838
$$ packed form
58190G037631K36727K49742K63305K72001K79391K90871L03060L11664L22272
58181I566664L41361L64143L83699M04103M31417M60391M84152N08607N42184
58172A3486721N79873O13141O47180O91846P43725P93987Q45799R06963R74321
58163B0283556J043137J121974J219164J324382J423442J520806J627115J736895
58155C1300471J842050J955270K094851K257831K433481K629669K857818L106280
58147E0477721L360303L635164L958182M334486M765921N285021N928779O695355
58139H8440932P568534Q564244R707688J0992542J2417474J4028092J5852882
58132A67572388J7835662J9920960K2176711K4746735K7739232L1243243L5214907
$$ plain form
58125 346449838 385335799 425561058 462162507 488865919 500865675 496957907 479456406
58118 479456406 452424516 419923041 385213545 350637980 317673620 287084716 259195662
58111 259195662 234119274 211828093 192180905 174997303 160104084 147310926 136412770
58104 136412770 127254746 119748013 113795246 109247340 105942294 103689644 102132076 100668364
58096 100668364 98623986 95554706 91398496 86378919 80815045 75001565 69176525 63522492
58088 63522492 58172184 53212291 48683543 44586977 40903593 37610626 34678820 32066216
58080 32066216 29728007 27630532 25749587 24061201 22541900 21172532 19934252 18805287
58072 18805287 17767472 16810285 15922946 15089419 14297611 13547091 12841243 12177865 11553353
$$ packed form
58125C46449838L8885961M0225259L6601449K6703412J1999756l907768j7501501
58118D79456406k7031890l2501475l4709496l4575565l2964360l0588904k7889054
58111B59195662k5076388k2291181j9647188j7183602j4893219j2793158j0898156
58104A36412770r158024p506733n952767m547906l305046k252650j557568j463712
58096A00668364k044378l069280m156210n019577n563874n813480n825040n654033
58088F3522492n350308m959893m528748m096566l683384l292967k931806k612604
58080C2066216k338209k097475j880945j688386j519301j369368j238280j128965
58072A8805287j037815r57187q87339q33527p91808p50520p05848o63378o24512
$$ plain form
58063 11553353 10969133 10426562 9920998 9447576 9007586 8602606 8227088 7872609 7534659
58054 7534659 7209879 6892125 6577646 6269850 5973390 5687795 5411866 5149329 4904346
58045 4904346 4675464 4459229 4255731 4065755 3886699 3716510 3557822 3413322 3280625
58036 3280625 3156187 3040406 2934463 2836021 2742578 2655399 2575796 2501127 2428482 2358547 2291946
58025 2291946 2226017 2159475 2095987 2038375 1983132 1925421 1865945 1808223 1752668 1698271 1646906
58014 1646906 1600959 1559211 1519478 1482682 1450215 1420060 1389766 1360682 1335208 1312462 1290402
58003 1290402 1269428 1250099 1230383 1209224 1189774 1174737 1161377 1145553 1127948 1111655 1096091
57992 1096091 1078229 1058033 1037982 1018727 999466 981234 965707 951998 938353 925736 916282
$$ packed form
58063A1553353n84220n42571n05564m73422m39990m04980l75518l54479l37950
58054G534659l24780l17754l14479l07796k96460k85595k75929k62537k44983
58045D904346k28882k16235k03498j89976j79056j70189j58688j44500j32697
58036C280625j24438j15781j05943r8442r3443q7179p9603p4669p2645o9935o6601
58025B291946o5929o6542o3488n7612n5243n7711n9476n7722n5555n4397n1365
58014A646906m5947m1748l9733l6796l2467l0155l0294k9084k5474k2746k2060
58003A290402k0974j9329j9716k1159j9450j5037j3360j5824j7605j6293j5564
57992A096091j7862k0196k0051j9255j9261j8232j5527j3709j3645j2617r454
$$ plain form
57981 916282 909614 904001 899474 896414 892854 886894 880408 876870 876748 878084 880022 882519 884155 883521 881499
57966 881499 879394 876575 872710 870025 870035 870291 868059 865075 864656 865999 865639 863084 860699 858985 856211
57951 856211 852111 848054 843952 838469 831865 825440 818853 811158 803663 798395 794388 788832 781447 774575
57937 774575 769548 766035 764336 765123 767300 769062 770546 772616 773935 772479 769215 766826 765171 761427
57923 761427 754621 746791 739641 733064 727066 722200 717885 712896 707643 703544 700274 696131 690973 686339
57909 686339 682838 679842 677447 676248 675482 673902 672112 671415 670834 668136 663618 659959 658244 656923 654727
57894 654727 651927 648559 644223 639968 637733 637408 636780 634755 632394 630619 629268 628761 630324 634012 638435
57879 638435 642674 646640 649660 650898 651086 651481 651173 647919 641648 634446 626807 616785 603673 589834
$$ packed form
57981I16282o668n613m527l060l560n960o486l538j22J336J938K497J636o34k022
57966H81499k105k819l865k685J0K56k232k984m19J343l60k555k385j714k774
57951H56211m100m057m102n483o604o425o587p695p495n268m007n556p385o872
57937G74575n027l513j699P87K177J762J484K070J319j456l264k389j655l744
57923G61427o806p830p150o577n998m866m315m989n253m099l270m143n158m634
57909F86339l501k996k395j199p66j580j790o97n81k698m518l659j715j321k196
57894F54727k800l368m336m255k235l25o28k025k361j775j351n07J563L688M423
57879F38435M239L966L020J238J88L95l08l254o271p202p639j0022j3112j3839
$$ plain form
57865 589834 577631 566651 555155 542568 529548 517041 506167 497740 491213 485101 478719 472570
57853 472570 467305 463683 463093 466245 471458 476057 479327 482348 485466 488216 491434 496821 504219 511805
57839 511805 519202 527759 537289 545232 550008 552904 555756 558892 562229 566106 569840 571473 570241 567568
57825 567568 564491 559789 552033 542133 532552 524978 519569 515401 510933 505114 498621 493060 488715 484446
57811 484446 479973 476614 475370 475988 478432 483525 491428 500992 511124 521122 529343 533852 535464 538033
57797 538033 544162 552225 558994 563571 567039 569692 570763 570313 569411 568394 566190 561607 554681 546794 539766
57782 539766 534474 530066 524890 518280 510958 503804 497013 490528 484403 478601 473170 468512 464647 460551
57768 460551 455307 449524 444132 438136 429440 418005 406296 396212 387371 378812 370468 362155 352856
$$ packed form
57865E89834j2203j0980j1496j2587j3020j2507j0874q427o527o112o382o149
57853D72570n265l622n90L152N213M599L270L021L118K750L218N387P398P586
57839E11805P397Q557R530P943M776K896K852L136L337L877L734J633j232k673
57825E67568l077m702p756r900r581p574n409m168m468n819o493n561m345m269
57811D84446m473l359j244O18K444N093P903R564J0132R998Q221M509J612K569
57797E38033O129Q063O769M577L468K653J071m50r02j017k204m583o926p887p028
57782E39766n292m408n176o610p322p154o791o485o125n802n431m658l865m096
57768D60551n244n783n392n996q696j1435j1709j0084q841q559q344q313r299
$$ plain form
57755 352856 342113 330884 320333 311011 303677 299292 297401 296033 294038 292017 290289 287806 284261
57742 284261 281567 281751 284698 289456 296312 305711 315959 324025 328518 330563 331875 333134 334177 334788
57728 334788 335157 336055 338493 342842 348506 354660 360943 367170 372780 376797 378179 376433 372290 367329 362176
57713 362176 355613 346401 335299 323913 312395 300214 288618 279805 273545 267217 259714 252851 248095
57700 248095 244461 240934 238584 238558 239886 241071 242286 244269 246489 248112 249601 251849 254962 259303 266300
57685 266300 276552 288410 300117 312022 324916 337584 348109 356473 363663 369226 372251 374138
57673 374138 377768 383890 390536 396102 400972 405852 410513 414858 419718 425990 433934 443593 454880 467099
57659 467099 479430 491980 505429 519684 533960 548161 563007 578660 594358 609693 625368
$$ packed form
57755C52856j0743j1229j0551r322p334m385j891j368j995k021j728k483l545
57742B84261k694J84K947M758O856R399J0248Q066M493K045J312J259J043O11
57728C34788L69Q98K438M349N664O154O283O227N610M017J382j746m143m961n153
57713C62176o563r212j1102j1386j1518j2181j1596q813o260o328p503o863m756
57700B48095l634l527k350k6J328J185J215J983K220J623J489K248L113M341O997
57685B66300J0252J1858J1707J1905J2894J2668J0525Q364P190N563L025J887
57673C74138L630O122O646N566M870M880M661M345M860O272P944R659J1287J2219
57659D67099J2331J2550J3449J4255J4276J4201J4846J5653J5698J5335J5675
$$ plain form
57648 625368 642371 661106 681454 703101 725723 749364 774544 801521 829779 858914 889650
57637 889650 923176 959752 998792 1040106 1084234 1131746 1183050 1238716 1299206 1364470 1434575
57626 1434575 1510585 1594050 1685797 1785917 1894804 2013570 2143656 2286630 2444011 2616624
57616 2616624 2804497 3007995 3228451 3466756 3721669 3990380 4270349 4559694 4855797
57607 4855797 5153644 5444136 5712384 5938263 6100921 6184778 6183158 6099115 5944754 5738255
57597 5738255 5498097 5238228 4968252 4696454 4430238 4174028 3929400 3698255 3484229
57588 3484229 3290155 3115618 2958142 2815948 2688638 2575910 2476588 2388862 2311141 2242770
57578 2242770 2183892 2134379 2093176 2059143 2032104 2012357 1999630 1993490 1994355 2002745 2017820 2038111
$$ packed form
57648F25368J7003J8735K0348K1647K2622K3641K5180K6977K8258K9135L0736
57637H89650L3526L6576L9040M1314M4128M7512N1304N5666O0490O5264P0105
57626A434575P6010Q3465R1747J00120J08887J18766J30086J42974J57381J72613
57616B616624J87873K03498K20456K38305K54913K68711K79969K89345K96103
57607D855797K97847K90492K68248K25879J62658Q3857j620q4043j54361k06499
57597E738255k40158k59869k69976k71798k66216k56210k44628k31145k14026
57588C484229j94074j74537j57476j42194j27310j12728r9322q7726p7721o8371
57578B242770n8878m9513m1203l4033k7039j9747j2727o140Q65Q390J5075K0291
$$ plain form
57566 2038111 2063848 2097087 2139152 2189234 2246133 2310274 2383285 2466408 2559866 2663132 2775342
57555 2775342 2896036 3025831 3165760 3315656 3473717 3637482 3804241 3970156 4129884
57546 4129884 4277370 4406272 4509715 4581148 4616364 4614173 4574950 4499681 4390991 4253988
57536 4253988 4095120 3920718 3736920 3549672 3363477 3180591 3002329 2830633 2667481
57527 2667481 2513330 2367314 2228956 2098868 1977875 1866275 1764107 1671444 1588055 1512980
57517 1512980 1444605 1381181 1321503 1265387 1213415 1166069 1123106 1083594 1046291 1010199 975346
57506 975346 943144 915358 892482 873594 857839 845227 835627 827786 820082 811848 803427 795498 789016
57493 789016 785301 785128 787739 791577 796154 802505 811654 823240 836019 849325 863666 880132 899573
$$ packed form
57566B038111K5737L3239M2065N0082N6899O4141P3011Q3123R3458J03266J12210
57555B775342J20694J29795J39929J49896J58061J63765J66759J65915J59728
57546D129884J47486J28902J03443P1433L5216k191l9223p5269j08690j37003
57536D253988j58868j74402j83798j87248j86195j82886j78262j71696j63152
57527B667481j54151j46016j38358j30088j20993j11600j02168r2663q3389p5075
57517A512980o8375o3424n9678n6116n1972m7346m2963l9512l7303l6092l4853
57506I75346l2202k7786k2876j8888j5755j2612r600p841p704q234q421p929o482
57493G89016l715j73K611L838M577O351R149J1586J2779J3306J4341J6466J9441
$$ plain form
57480 899573 922214 947664 975239 1004523 1035818 1069968 1107624 1148783 1193137 1240759 1292195
57469 1292195 1347914 1408049 1472854 1543098 1619714 1703099 1792948 1888797 1990730 2099619 2216502
57458 2216502 2341195 2471473 2603973 2735953 2865546 2990113 3105252 3206100 3288957 3350955
57448 3350955 3388850 3399413 3381017 3334107 3260485 3163249 3047409 2919212 2784093 2645660
57438 2645660 2506684 2370104 2238552 2113604 1996133 1887004 1786843 1695385 1611744 1535527
57428 1535527 1467405 1408283 1357857 1314135 1274783 1238973 1207451 1180747 1158178 1139225 1124999
57417 1124999 1117062 1115033 1116760 1121142 1129654 1144490 1165957 1192371 1222133 1255332 1293577 1338743
57405 1338743 1391876 1452988 1521590 1597184 1679344 1767888 1863197 1965644 2074261 2186793 2301831
$$ packed form
57480H99573K2641K5450K7575K9284L1295L4150L7656M1159M4354M7622N1436
57469A292195N5719O0135O4805P0244P6616Q3385Q9849R5849J01933J08889J16883
57458B216502J24693J30278J32500J31980J29593J24567J15139J00848Q2857O1998
57448C350955L7895J0563j8396m6910p3622r7236j15840j28197j35119j38433
57438B645660j38976j36580j31552j24948j17471j09129j00161r1458q3641p6217
57428A535527o8122n9122n0426m3722l9352l5810l1522k6704k2569j8953j4226
57417A124999p937k029J727M382Q512J4836K1467K6414K9762L3199L8245M5166
57405A338743N3133O1112O8602P5594Q2160Q8544R5309J02447J08617J12532J15038
$$ plain form
57394 2301831 2419949 2541135 2661351 2773157 2869884 2947929 3004885 3037289 3041275 3014644 2957546
57383 2957546 2872114 2762426 2634348 2494308 2347742 2198468 2048995 1901237 1757277 1619417
57373 1619417 1489160 1366610 1251727 1145747 1050022 963603 883604 808350 738749 675979
57363 675979 619339 567270 519151 474953 434180 396321 361532 329706 299575 269851 240729
57352 240729 213291 187976 164538 142855 122750 103563 84904 67308 51206 35940 20950
57341 20950 7179 -4212 -14108 -24667 -36350 -47251 -55706 -62214 -68306 -74758 -81608 -89019 -97207 -105869
57327 -105869 -114308 -122047 -129126 -135960 -142951 -150058 -156873 -163312 -169883 -176741 -182883 -187080 -189620 -192357
57313 -192357 -196893 -203235 -210218 -216646 -221903 -226095 -229934 -234181 -239005 -244016 -248784 -253047 -256586 -259394
$$ packed form
57394B301831J18118J21186J20216J11806R6727P8045N6956L2404L986k6631n7098
57383B957546q5432j09688j28078j40040j46566j49274j49473j47758j43960j37860
57373A619417j30257j22550j14883j05980r5725q6419p9999p5254o9601o2770
57363F75979n6640n2069m8119m4198m0773l7859l4789l1826l0131k9724k9122
57352B40729k7438k5315k3438k1683k0105j9187j8659j7596j6102j5266j4990
57341B0950G179d212r896j0559j1683j0901q455o508o092o452o850p411q188q662
57327a05869q439p739p079o834o991p107o815o439o571o858o142m197k540k737
57313a92357m536o342o983o428n257m192l839m247m824n011m768m263l539k808
$$ plain form
57299 -259394 -261941 -264819 -268098 -271338 -274159 -276481 -278432 -280434 -283234 -287319 -292329 -297422 -302152 -306707
57285 -306707 -311455 -316607 -322026 -326928 -330066 -330806 -329860 -328470 -327092 -325444 -323547 -321939 -320870 -319936 -318681
57270 -318681 -317183 -315989 -315572 -315693 -315298 -313739 -312328 -313583 -318032 -322622 -323599 -320507 -316085 -312676 -310299
57255 -310299 -308079 -305774 -303435 -300957 -298569 -296688 -294786 -291460 -286205 -280072 -274061 -267899 -261065 -253929
57241 -253929 -246959 -239701 -231558 -222875 -214292 -205624 -196382 -186880 -177614 -167817 -155850 -141144 -124754
57228 -124754 -107739 -89787 -69733 -46647 -19918 11174 47162 87574 130918 175702 221459
57217 221459 268654 317560 367294 415842 460900 500702 534431 562124 583989 599504 607266 605922
57205 605922 595084 575230 547281 512943 475054 436480 398372 360090 321102 282503 246478
$$ packed form
57299b59394k547k878l279l240k821k322j951k002k800m085n010n093m730m555
57285c06707m748n152n419m902l138p40R46J390J378J648J897J608J069R34J255
57270c18681J498J194M17j21L95J559J411j255m449m590r77L092M422L409K377
57255c10299K220K305K339K478K388J881J902L326N255O133O011O162O834P136
57241b53929O970P258Q143Q683Q583Q668R242R502R266R797J1967J4706J6390
57228a24754J7015J7952K0054K3086a9918A1174L5988M0412M3344M4784M5757
57217B21459M7195M8906M9734M8548M5058L9802L3729K7693K1865J5515P762j344
57205F05922j0838j9854k7949l4338l7889l8574l8108l8282l8988l8599l6025
$$ plain form
57194 246478 214669 187136 162506 139113 116484 95704 77895 62568 48293 34874 23781
57183 23781 16121 11210 7703 5285 4518 5594 7939 10718 13176 14844 15916 17151 19107 21723 24870
57168 24870 28772 33563 39057 45476 53917 65588 80810 99081 119648 141734 164829 189380 216774
57155 216774 248064 282936 320168 358768 398423 439455 482656 528446 575716 622165 666433
57144 666433 709267 752105 795252 838172 880751 923242 965464 1007045 1048115 1088813 1128425
57133 1128425 1165872 1200744 1233062 1262570 1289393 1315091 1341780 1369999 1398312 1425006 1449318
57122 1449318 1471024 1489866 1505777 1519091 1530190 1539217 1546067 1550394 1551861 1550727 1547703 1542824 1535115
57109 1535115 1524019 1510455 1495617 1479571 1462153 1444503 1428236 1413625 1400027 1387634 1377149
$$ packed form
57194B46478l1809k7533k4630k3393k2629k0780j7809j5327j4275j3419j1093
57183B3781p660m911l507k418p67J076K345K779K458J668J072J235J956K616L147
57168B4870L902M791N494O419Q441J1671J5222J8271K0567K2086K3095K4551K7394
57155B16774L1290L4872L7232L8600L9655M1032M3201M5790M7270M6449M4268
57144F66433M2834M2838M3147M2920M2579M2491M2222M1581M1070M0698L9612
57133A128425L7447L4872L2318K9508K6823K5698K6689K8219K8313K6694K4312
57122A449318K1706J8842J5911J3314J1099R027O850M327J467j134l024m879p709
57109A535115j1096j3564j4838j6046j7418j7650j6267j4611j3598j2393j0485
$$ plain form
57098 1377149 1367942 1358195 1346709 1332952 1315647 1293536 1267766 1241345 1215509 1188400 1157919 1123823
57086 1123823 1086012 1042672 991523 931584 862630 784409 697620 604216 505079 398339 281210
57075 281210 152471 11851 -141873 -310495 -494595 -693689 -907801 -1137874 -1385014 -1650275
57065 -1650275 -1934881 -2240005 -2566733 -2916607 -3291449 -3692415 -4120168 -4576238 -5063216
57056 -5063216 -5584246 -6144968 -6756640 -7434560 -8191831 -9036692 -9976926 -11023939 -12190669
57047 -12190669 -13488705 -14930582 -16532907 -18314700 -20295303 -22497549 -24951454 -27692128
57039 -27692128 -30756961 -34189909 -38049488 -42413384 -47382267 -53086246 -59684461 -67348294
57031 -67348294 -76238441 -86494094 -98235101 -111563692 -126557558 -143251871 -161614195
$$ packed form
57098A377149r207r747j1486j3757j7305k2111k5770k6421k5836k7109l0481l4096
57086A123823l7811m3340n1149n9939o8954p8221q6789r3404r9137j06740j17129
57075B81210j28739A1851a41873j68622j84100j99094k14112k30073k47140k65261
57065a650275k84606l05124l26728l49874l74842m00966m27753m56070m86978
57056e063216n21030n60722o11672o77920p57271q44861r40234j047013j166730
57047a2190669j298036j441877j602325j781793j980603k202246k453905k740674
57039b7692128l064833l432948l859579m363896m968883n703979o598215p663833
57031f7348294q890147j0255653j1741007j3328591j4993866j6694313j8362324
$$ plain form
57024 -161614195 -181545667 -202955132 -225868395 -250402019 -276461371 -303299007 -329321536
57017 -329321536 -352411812 -370597963 -382609850 -388017119 -387025765 -380206248 -368324157
57010 -368324157 -352265483 -332986484 -311451570 -288559386 -265076078 -241604220 -218600259
57003 -218600259 -196416764 -175332850 -155563211 -137261280 -120525112 -105400451 -91880744
56996 -91880744 -79912439 -69406373 -60247354 -52300890 -45423498 -39476017 -34331345 -29874686
56988 -29874686 -26003287 -22628686 -19677108 -17086657 -14805414 -12791346 -11010357 -9432663
56980 -9432663 -8031696 -6785283 -5674759 -4682331 -3791335 -2988996 -2266409 -1615301 -1026756
56971 -1026756 -492969 -7491 436890 848171 1232183 1591561 1928240 2245033 2544046 2825405
$$ packed form
57024a61614195j9931472k1409465k2913263k4533624k6059352k6837636k6022529
57017c29321536k3090276j8186151j2011887n407269R91354O819517J1882091
57010c68324157J6058674J9278999K1534914K2892184K3483308K3471858K3003961
57003b18600259K2183495K1083914J9769639J8301931J6736168J5124661J3519707
56996i1880744J1968305J0506066R159019P946464O877392N947481N144672M456659
56988b9874686L871399L374601K951578K590451K281243K014068J780989J577694
56980i432663J400967J246413J110524R92428Q90996Q02339P22587O51108N88545
56971a026756d92969g491D36890M11281L84012L59378L36679L16793K99013K81359
$$ plain form
56961 2825405 3088466 3332899 3558412 3765453 3956711 4135780 4303504 4457603 4596524
56952 4596524 4721072 4831035 4923060 4994221 5045517 5079257 5095201 5093352 5079635 5062997 5042998
56941 5042998 5001939 4913125 4759077 4542619 4282219 3999158 3709417 3424101 3152259 2900415
56931 2900415 2670583 2461053 2269568 2095023 1936583 1792695 1661420 1540961 1429721
56922 1429721 1326535 1230768 1141490 1056824 975096 896438 822085 752161 685460 621473 561124
56911 561124 505121 453002 404561 360902 323123 290886 263335 240732 224111 213680 208555 208015
56899 208015 212346 222328 238295 259754 285509 313676 341328 364593 380226 387740 389480 388076
56887 388076 384505 379141 373471 369285 366873 365607 365852 368497 372872 377147 381170 387067 396527 409096
$$ packed form
56961B825405K63061K44433K25513K07041J91258J79069J67724J54099J38921
56952D596524J24548J09963R2025P1161N1296L3740J5944j849j3717j6638j9999
56941E042998m1059q8814j54048k16458k60400k83061k89741k85316k71842k51844
56931B900415k29832k09530j91485j74545j58440j43888j31275j20459j11240
56922A429721j03186r5767q9278q4666q1728p8658p4353o9924o6701o3987o0349
56911E61124n6003n2119m8441m3659l7779l2237k7551k2603j6621j0431n125n40
56899B08015M331R982J5967K1459K5755K8167K7652K3265J5633P514J740j404
56887C88076l571n364n670m186k412j266K45K645M375M275M023N897R460J2569
$$ plain form
56873 409096 423803 440849 460904 484113 510441 539426 568408 592249 606178 608625 601056 586333
56861 586333 567857 548848 530932 513800 496761 479943 463681 447992 433356 420821 410533
56850 410533 401276 392154 383540 375664 367733 359487 352249 347112 343415 340415 339261 341592 347034 353754
56836 353754 360873 368771 377512 386538 395657 404900 413567 420720 426570 432426 439374 447777 457656 468569
56822 468569 479277 488254 494294 496376 493843 487511 479588 471595 463292 454639 447579 444360 445042 448333
56808 448333 454250 464172 478624 496695 517607 541530 568919 600235 636120 676742 720947 766546
56796 766546 810561 848391 874282 884815 881672 869622 852484 832326 811190 790923 771834 754037
56784 754037 739953 732902 733046 737353 744148 755305 773116 797388 826927 862044 904063 953526
$$ packed form
56873D09096J4707J7046K0055K3209K6328K8985K8982K3841J3929K447p569j4723
56861E86333j8476j9009j7916j7132j7039j6818j6262j5689j4636j2535j0288
56850D10533r257r122q614p876p931q246p238n137l697l000j154K331N442O720
56836C53754P119P898Q741R026R119R243Q667P153N850N856O948Q403R879J0913
56822D68569J0708Q977O040K082k533o332p923p993q303q653p060l219O82L291
56808D48333N917R922J4452J8071K0912K3923K7389L1316L5885M0622M4205M5599
56796G66546M4015L7830K5891J0533l143j2050j7138k0158k1136k0267j9089j7797
56784G54037j4084p051J44M307O795J1157J7811K4272K9539L5117M2019M9463
$$ plain form
56772 953526 1009656 1069880 1128451 1176905 1207801 1218184 1209366 1184757 1148759 1106257 1061331 1016434
56760 1016434 973400 934468 901474 874586 852791 835390 822590 815178 814221 820670 834585 854854
56748 854854 879848 908127 938576 970348 1002520 1032864 1056883 1069187 1066569 1049585 1021399 985938
56736 985938 947040 907900 870449 835563 803888 775809 750928 728890 710855 698805 692971 691149
56724 691149 691103 692545 696347 703109 713267 727243 744138 760820 773267 778657 775920 765266 748055
56711 748055 726578 703069 678893 654785 631285 608723 587363 567827 550749 535895 522312
56700 522312 509450 497279 485363 473124 461314 451878 445679 441432 437482 433493 429743 425984 422007
56687 422007 418475 416147 414927 414441 414817 416056 417285 417437 416251 414110 411562 409476 408739 409052 408865 407354
$$ packed form
56772I53526N6130O0224N8571M8454L0896J0383q818k4609l5998m2502m4926m4897
56760A016434m3034l8932l2994k6888k1795j7401j2800p412r57O449J3915K0269
56748H54854K4994K8279L0449L1772L2172L0344K4019J2304k618j6984k8186l5461
56736I85938l8898l9140l7451l4886l1675k8079k4881k2038j8035j2050n834j822
56724F91149m6J442L802O762J0158J3976J6895J6682J2447N390k737j0654j7211
56711G48055k1477k3509k4176k4108k3500k2562k1360j9536j7078j4854j3583
56700E22312j2862j2171j1916j2239j1810r436o199m247l950l989l750l759l977
56687D22007l532k328j220m86L76J239J229J52j186k141k548k086p37L13j87j511
$$ plain form
56671 407354 405628 405143 405624 405462 403608 400252 396260 392758 390639 389432 387144 382216 375502 369592 366377
56656 366377 365821 366678 367670 368147 368126 367659 366173 362980 358558 354472 351686 349811 348369 347654 347643 347187 345374
56639 345374 342973 341511 341397 341797 341831 341103 339667 338371 338726 341506 345730 349641 352231 353238 352392 349687
56623 349687 346109 343140 341501 340713 339671 337445 334113 331011 329431 328877 327680 325696 325036 327219 330923
56608 330923 333824 335658 337965 341373 344710 346612 346860 346059 344912 343836 342816 341719 340990 341414 342818
56593 342818 343757 343074 341096 338796 336660 334988 334202 334129 334049 334407 337318 344099 353249 362158 370032 377895
56577 377895 386470 395502 404516 412774 418922 422020 422645 422018 420565 418307 415841 413633 411041 407370 403258
56562 403258 399653 396123 391699 386803 382705 379579 376708 374200 372791 372151 371118 369582 368624 368818 369709
$$ packed form
56671D07354j726m85M81j62j854l356l992l502k119j207k288m928o714n910l215
56656C66377n56Q57R92M77k1m67j486l193m422m086k786j875j442p15j1m56j813
56639C45374k401j462j14M00L4p28j436j296L55K780M224L911K590J007q46k705
56623C49687l578k969j639p88j042k226l332l102j580n54j197j984o60K183L704
56608C30923K901J834K307L408L337J902K48q01j147j076j020j097p29M24J404
56593C42818R39o83j978k300k136j672p86p3q0L58K911O781R150Q909P874P863
56577C77895Q575R032R014Q258O148L098O25o27j453k258k466k208k592l671m112
56562D03258l605l530m424m896m098l126k871k508j409o40j033j536r58J94Q91
$$ plain form
56547 369709 370819 371831 372038 371169 370533 371705 374179 375948 376353 376681 377864 379343 380500 381603 382830
56532 382830 383795 384532 385706 387438 388997 389966 390645 391151 391287 391454 392508 394490 396542 398151 399438 400295
56516 400295 400421 400161 400050 399713 398681 398038 399452 402588 405415 407320 409829 413673 417367 419778 422240
56501 422240 426564 432330 437621 441608 445041 448801 453135 457936 463005 468217 473740 479552 484596 487416
56487 487416 488022 488066 488586 488703 487395 485512 484847 485728 486688 486361 484824 483016 481519 480277 479259 478864 479170
56470 479170 478999 476729 472567 468992 467807 467591 465553 461395 457512 455442 454178 452522 451256 451895 454479
56455 454479 457695 460400 462017 462046 460142 456648 452632 449355 447541 446775 445879 444419 443379 443498 443462 441078
56439 441078 436101 430547 426274 423586 422169 421767 421567 420478 418591 417089 416205 414643 411661 408471 406766
$$ packed form
56547C69709J110J012K07q69o36J172K474J769M05L28J183J479J157J103J227
56532C82830R65P37J174J732J559R69O79N06J36J67J054J982K052J609J287Q57
56516D00295J26k60j11l37j032o43J414L136K827J905K509L844L694K411K462
56501D22240M324N766N291L987L433L760M334M801N069N212N523N812N044K820
56487D87416O06M4N20J17j308j883o65Q81R60l27j537j808j497j242j018l95L06
56470D79170j71k270m162l575j185k16k038m158l883k070j264j656j266O39K584
56455D54479L216K705J617K9j904l494m016l277j814p66q96j460j040J19l6k384
56439D41078m977n554m273k688j417m02k00j089j887j502q84j562k982l190j705
$$ plain form
56424 406766 406926 408405 410818 413811 416687 419088 421531 424673 428493 432616 436891 441270 445544 449405
56410 449405 452446 454390 455915 458839 464429 471771 478970 485564 492419 499635 506309 512355 518571 524583
56396 524583 528686 530460 531922 535311 541003 548015 554866 559362 559547 556145 552609 551471 551784 551224 549462
56381 549462 548095 548140 548984 549395 548615 546734 544596 543021 541828 540050 537066 532788 527044 519986 512930
56366 512930 507220 502198 496015 488680 482492 478992 477344 476299 475741 475424 474268 472243 471208 472410 474529
56351 474529 475563 475337 474819 474248 473419 472815 473031 473838 474900 476535 478799 480738 481573 481696 481615 480928 479380
56334 479380 477985 478074 479877 482612 485074 485732 483620 479826 476908 476218 477142 479291 483515 489910 496867
56319 496867 503334 510190 518027 525331 530380 533331 534982 535160 534017 533292 534447 536860 539498 542814 547163
$$ packed form
56424D06766J60J479K413K993K876K401K443L142L820M123M275M379M274L861
56410D49405L041J944J525K924N590P342P199O594O855P216O674O046O216O012
56396E24583M103J774J462L389N692P012O851M496J85l402l536j138L13n60j762
56381E49462j367M5Q44M11p80j881k138j575j193j778k984m278n744p058p056
56366E12930n710n022o183p335o188l500j648j045n58l17j156k025j035J202K119
56351D74529J034k26n18n71q29o04K16Q07J062J635K264J939Q35J23q1o87j548
56334D79380j395Q9J803K735K462O58k112l794k918o90R24K149M224O395O957
56319D96867O467O856P837P304N049K951J651J78j143p25J155K413K638L316M349
$$ plain form
56304 547163 550965 552693 553402 555015 557137 557906 557170 556461 556456 556766 557816 560517 564067 566192 566048 565327 566201
56287 566201 569318 573923 578801 582869 585664 587516 589059 590910 593845 598337 603498 607552 609746 610729
56273 610729 610872 609988 609201 610869 615500 620719 624659 628379 633423 639043 643765 647905 652472 657300 662347
56258 662347 669107 678406 688346 696922 705215 715385 726780 736828 744899 752515 760477 768456 776886
56245 776886 786682 797406 807942 818537 829963 841324 851105 859846 869393 879911 890053 899629
56233 899629 909623 919797 928759 936325 943529 950469 956465 962318 970106 980573 992783 1006369 1022009
56220 1022009 1039533 1057594 1075600 1094427 1115230 1139023 1167107 1200167 1237051 1276035 1317032
56209 1317032 1361199 1409076 1460781 1517241 1579143 1645342 1714485 1787836 1868438 1957893 2055851
$$ packed form
56304E47163L802J728P09J613K122P69p36p09nL10J050K701L550K125j44p21Q74
56287E66201L117M605M878M068K795J852J543J851K935M492N161M054K194R83
56273F10729J43q84p87J668M631N219L940L720N044N620M722M140M567M828N047
56258F62347O760R299R940Q576Q293J0170J1395J0048Q071P616P962P979Q430
56245G76886R796J0724J0536J0595J1426J1361R781Q741R547J0518J0142R576
56233H99629R994J0174Q962P566P204O940N996N853P788J0467J2210J3586J5640
56220A022009J7524J8061J8006J8827K0803K3793K8084L3060L6884L8984M0997
56209A317032M4167M7877N1705N6460O1902O6199O9143P3351Q0602Q9455R7958
$$ plain form
56198 2055851 2161942 2276018 2397112 2524615 2660138 2805872 2961220 3122995 3288479
56189 3288479 3456206 3624254 3790065 3951548 4106342 4250653 4380985 4496134 4595131 4674379
56179 4674379 4729829 4761319 4771836 4763241 4735946 4692149 4635746 4569068 4493048 4410460 4325324
56168 4325324 4238715 4148621 4054361 3957653 3858794 3755644 3647751 3538153 3429437 3320715
56158 3320715 3209977 3097049 2982913 2868365 2754633 2643301 2534627 2427777 2323411
56149 2323411 2224001 2131047 2044145 1963215 1889129 1821455 1758228 1698958 1645479 1598604 1556109
56138 1556109 1515331 1476027 1439648 1407320 1379276 1354816 1332337 1310802 1291231 1275023 1261115
56127 1261115 1246938 1232184 1219270 1209896 1203393 1198460 1194205 1189510 1183939 1179393 1178379 1180729 1184554
$$ packed form
56198B055851J06091J14076J21094J27503J35523J45734J55348J61775J65484
56189C288479J67727J68048J65811J61483J54794J44311J30332J15149R8997P9248
56179D674379N5450L1490J0517q595k7295m3797n6403o6678p6020q2588q5136
56168D325324q6609r0094r4260r6708r8859j03150j07893j09598j08716j08722
56158C320715j10738j12928j14136j14548j13732j11332j08674j06850j04366
56149B323411r9410r2954q6902q0930p4086o7674o3227n9270n3479m6875m2495
56138A556109m0778l9304l6379l2328k8044k4460k2479k1535j9571j6208j3908
56127A261115j4177j4754j2914r374o503m933m255m695n571m546j014K350L825
$$ plain form
56114 1184554 1189996 1198777 1210116 1220824 1230104 1240773 1254746 1270479 1286006 1301604 1318316 1336530
56102 1336530 1356990 1380617 1406407 1432004 1457075 1483642 1512677 1543084 1574410 1607457 1641657
56091 1641657 1675000 1707319 1740574 1775322 1810205 1845772 1885497 1931995 1985345 2046001 2116074
56080 2116074 2196724 2287520 2389404 2505181 2636271 2782077 2942826 3118781 3305343 3492846
56070 3492846 3672848 3841502 3996295 4134369 4256147 4366362 4468685 4562020 4643469 4711075
56060 4711075 4761679 4790063 4793310 4773725 4735879 4683635 4621073 4551985 4475618 4385905 4277365
56049 4277365 4149739 4006066 3849991 3686660 3522485 3361617 3205339 3056121 2918649
56040 2918649 2795433 2685243 2587433 2503680 2433656 2373393 2320309 2275921 2241383 2214368 2192530
$$ packed form
56114A184554N442Q781J1339J0708R280J0669J3973J5733J5527J5598J6712J8214
56102A336530K0460K3627K5790K5597K5071K6567K9035L0407L1326L3047L4200
56091A641657L3343L2319L3255L4748L4883L5567L9725M6498N3350O0656P0073
56080B116074Q0650R0796J01884J15777J31090J45806J60749J75955J86562J87503
56070C492846J80002J68654J54793J38074J21778J10215J02323R3335Q1449O7606
56060D711075N0604K8384L247j9585l7846n2244o2562o9088p6367q9713j08540
56049D277365j27626j43673j56075j63331j64175j60868j56278j49218j37472
56040B918649j23216j10190r7810q3753p0024o0263n3084m4388l4538k7015k1838
$$ plain form
56029 2192530 2175839 2163267 2151740 2141013 2135034 2135406 2137830 2138173 2137645 2138485 2138718 2135212 2128583 2121386
56015 2121386 2114533 2108599 2105477 2105663 2107007 2108663 2112884 2120551 2129009 2137026 2147699 2163459 2182274
56002 2182274 2201762 2222868 2246478 2270732 2294903 2321627 2352234 2384315 2416902 2453126 2494376
55991 2494376 2536943 2578171 2620694 2666551 2712407 2755233 2797880 2844202 2893152 2942330 2992980
55980 2992980 3046913 3102705 3159259 3218813 3282473 3347490 3412899 3482676 3559168 3638919 3719454
55969 3719454 3804319 3896493 3992632 4089117 4188208 4293030 4402309 4515300 4635842 4766007
55959 4766007 4901977 5041931 5191419 5354819 5528236 5707377 5895570 6096988 6308756
55950 6308756 6527263 6755676 6997532 7249198 7506197 7770685 8045406 8327403 8615534
$$ packed form
56029B192530j6691j2572j1527j0727n979L72K424L43n28Q40K33l506o629p197
56015B121386o853n934l122J86J344J656M221P667Q458Q017J0673J5760J8815
56002B182274J9488K1106K3610K4254K4171K6724L0607L2081L2587L6224M1250
55991B494376M2567M1228M2523M5857M5856M2826M2647M6322M8950M9178N0650
55980B992980N3933N5792N6554N9554O3660O5017O5409O9777P6492P9751Q0535
55969C719454Q4865R2174R6139R6485R9091J04822J09279J12991J20542J30165
55959D766007J35970J39954J49488J63400J73417J79141J88193K01418K11768
55950F308756K18507K28413K41856K51666K56999K64488K74721K81997K88131
$$ plain form
55941 8615534 8917025 9238473 9577556 9931542 10305898 10705938 11128351 11570172 12037647
55932 12037647 12536831 13064549 13618735 14208256 14841803 15517025 16232089 16997711 17825515
55923 17825515 18715283 19666977 20694140 21810482 23013540 24296405 25664796 27127547
55915 27127547 28682865 30331854 32094561 33995445 36045055 38253613 40648192 43256121
55907 43256121 46086129 49148565 52481049 56134126 60151515 64592167 69554910 75154070
55899 75154070 81489509 88667433 96824007 106094574 116591076 128454250 141900491 157178237
55891 157178237 174528361 194249150 216739708 242384408 271429494 303982749 339780435
55884 339780435 377334997 413036556 441530809 457786071 459433517 447505362 425262492
$$ packed form
55941H615534L01491L21448L39083L53986L74356M00040M22413M41821M67475
55932A2037647M99184N27718N54186N89521O33547O75222P15064P65622Q27804
55923A7825515Q89768R51694J027163J116342J203058J282865J368391J462751
55915B7127547J555318J648989J762707J900884K049610K208558K394579K607929
55907D3256121K830008L062436L332484L653077M017389M440652M962743N599160
55899G5154070O335439P177924Q156574R270567J0496502J1863174J3446241J5277746
55891A57178237J7350124J9720789K2490558K5644700K9045086L2553255L5797686
55884C39780435L7554562L5701559K8494253J6255262J647446j1928155k2242870
$$ plain form
55877 425262492 396455465 364294261 331215428 298917725 268433828 240301386 214773425
55870 214773425 191920211 171649614 153765622 138047610 124264894 112160352 101485754
55863 101485754 92054630 83731218 76383844 69882472 64125039 59027503 54493715 50424336
55855 50424336 46748995 43424325 40407734 37656657 35145567 32859397 30774006 28861490
55847 28861490 27107246 25502287 24025194 22650206 21367177 20176096 19068167 18029562
55839 18029562 17057852 16157043 15320502 14534759 13796065 13107952 12466274 11861349 11291385
55830 11291385 10759589 10260957 9785226 9330239 8900049 8492822 8102651 7730358 7380739
55821 7380739 7051749 6737400 6438358 6158783 5895835 5643159 5401638 5175842 4962716
$$ packed form
55877D25262492k8807027l2161204l3078833l2297703l0483897k8132442k5527961
55870B14773425k2853214k0270597j7883992j5718012j3782716j2104542j0674598
55863A01485754r431124q323412p347374o501372n757433n097536m533788m069379
55855E0424336l675341l324670l016591k751077k511090k286170k085391j912516
55847B8861490j754244j604959j477093j374988j283029j191081j107929j038605
55839A8029562r71710r00809q36541p85743p38694o88113o41678o04925n69964
55830A1291385n31796m98632m75731m54987m30190m07227l90171l72293l49619
55821G380739l28990l14349k99042k79575k62948k52676k41521k25796k13126
$$ plain form
55812 4962716 4754784 4552071 4360209 4179071 4003914 3835772 3680183 3537055 3401796
55803 3401796 3275073 3161625 3060427 2965341 2874401 2789348 2707104 2621125 2530835 2441255 2353956
55792 2353956 2266658 2180877 2101361 2028213 1957471 1889017 1826118 1767781 1709604 1651989 1599737
55781 1599737 1553614 1509923 1468392 1432848 1403534 1375938 1348021 1322257 1300142 1280837 1265422
55770 1265422 1256261 1251786 1247577 1242586 1238791 1235431 1229545 1221628 1214362 1206101 1192024 1171775 1149639
55757 1149639 1127059 1101285 1071859 1042283 1014421 986784 958968 932458 906709 879809 853385
55746 853385 831560 814762 799792 786094 776445 771133 767119 763573 762792 764876 766729 767204 768172 769738
55732 769738 769502 767438 766583 767875 768977 768894 768962 768505 764637 757650 751909 749926 749709 749036 748119 746927 744074
$$ packed form
55812D962716k07932k02713j91862j81138j75157j68142j55589j43128j35259
55803C401796j26723j13448j01198r5086r0940q5053q2244q5979r0290q9580q7299
55792B353956q7298q5781p9516p3148p0742o8454o2899n8337n8177n7615n2252
55781A599737m6123m3691m1531l5544k9314k7596k7917k5764k2115j9305j5415
55770A265422r161m475m209m991l795l360n886p917p266q261j4077k0249k2136
55757A149639k2580k5774k9426k9576k7862k7637k7816k6510k5749k6900k6424
55746H53385k1825j6798j4970j3698r649n312m014l546p81K084J853M75R68J566
55732G69738k36k064q55J292J102q3O8m57l868o987n741j983k17o73r17j192k853
$$ plain form
55715 744074 739603 735108 730156 722343 711537 700171 688777 675405 660216 646563 636547 629325
55703 629325 624424 622572 622330 619932 613566 604347 592646 577413 559634 542281 526093 509533 493419
55690 493419 480903 471848 462013 449485 437610 429604 424146 418208 410751 401799 391217 380175 371023
55677 371023 364351 358809 354310 352099 351185 348606 344139 340784 339464 337310 332619 327532 324107 321463
55663 321463 318510 315826 313005 307750 299604 291302 284573 277858 269955 262595 257468 253928 251512 251496 253880
55648 253880 255979 256100 255754 256378 256964 256975 258330 262102 266157 268426 269797 271396 271796 269522 265850 262575
55632 262575 259216 254945 251094 249188 248354 247150 246364 247880 252263 259220 268610 279168 288177 294498
55618 294498 300233 307583 315821 323117 329348 335091 339653 342199 343206 342866 339801 333447 326114 320461
$$ packed form
55715G44074m471m495m952p813j0806j1366j1394j3372j5189j3653j0016p222
55703F29325m901j852k42k398o366r219j1701j5233j7779j7353j6188j6560j6114
55690D93419j2516r055r835j2528j1875q006n458n938p457q952j0582j1042r152
55677C71023o672n542m499k211r14k579m467l355j320k154m691n087l425k644
55663C21463k953k684k821n255q146q302o729o715p903p360n127l540k416j6K384
55648B53880K099J21l46O24N86J1J355L772M055K269J371J599M00k274l672l275
55632B62575l359m271l851j906q34j204p86J516M383O957R390J0558R009O321
55618B94498N735P350Q238P296O231N743M562K546J007l40l065o354p333n653
$$ plain form
55604 320461 316236 311626 306610 302857 301220 301281 302697 305400 308875 312450 315753 318290 319632 320618 323016
55589 323016 327287 332081 336439 340739 344928 347914 349478 350588 350885 348377 342899 337384 334025 331483
55575 331483 327725 323323 319737 316242 310982 303736 295552 286787 277329 267606 257769 247090 235636 225096
55561 225096 216497 208618 200258 192377 186185 180648 174038 166691 160138 154481 148702 142896 138320 135585
55547 135585 134140 133064 131448 128762 125778 124165 124329 124840 124641 124293 124106 122890 119935 116625 114614
55532 114614 113822 113544 113943 114984 115431 114455 112862 111367 109292 106457 104552 104752 105621 105294 104188 103539
55516 103539 102828 101067 99398 99900 102518 105289 106965 107499 106729 104691 102772 102720 104779 108049 111898 115585
55500 115585 117554 116951 115088 113789 113041 111893 110628 110085 109709 108367 106601 105992 106538 106496 104755 101800
$$ packed form
55604C20461m225m610n016l753j637O1J416K703L475L575L303K537J342R86K398
55589C23016M271M794M358M300M189K986J564J110K97k508n478n515l359k542
55575C31483l758m402l586l495n260p246q184q765r458r723r837j0679j1454j0540
55561B25096q599p879q360p881o192n537o610p347o553n657n779n806m576k735
55547A35585j445j076j616k686k984j613J64N11j99l48j87j216k955l310k011
55532A14614p92k78L99J041M47r76j593j495k075k835j905K00Q69l27j106o49
55516A03539p11j761j669N02K618K771J676N34p70k038j919n2K059L270L849L687
55500A15585J969o03j863j299p48j148j265n43l76j342j766o09N46m2j741k955
$$ plain form
55484 101800 98517 95527 93500 92770 92802 93141 94436 97307 100698 102671 102438 100546 97661 94371 91725
55469 91725 90728 91604 94204 98351 103041 106562 108588 110852 114375 117436 118055 117202 117456 119443 121804 123936
55453 123936 126334 128527 129045 127680 125888 124750 124087 123619 123335 122557 120251 116621 113151 110794 109186
55438 109186 107744 106338 104599 101675 97147 91629 86239 81860 78758 76524 74569 72847 71596 70336
55424 70336 68142 65343 63728 64301 65963 67141 67405 66581 63892 59462 55271 52907 51439 49204 46551
55409 46551 44855 43803 41958 39517 38157 38223 38149 36994 35808 35947 37248 38275 37590 34752 30868 27974
55393 27974 27137 27499 27833 28268 29537 31303 32499 32818 32736 32596 32675 33576 35522 37933 40565 44009 48002
55376 48002 50557 50322 48749 48171 48697 48770 47853 46511 44655 42046 40130 40976 44223 47084 47644 46547
$$ packed form
55484A01800l283k990k027p30L2L39J295K871L391J973k33j892k885l290k646
55469I1725r97Q76K600M147M690L521K026K264L523L061O19q53K54J987K361K132
55453A23936K398K193N18j365j792j138o63m68k84p78k306l630l470k357j608
55438A09186j442j406j739k924m528n518n390m379l102k234j955j722j251j260
55424G0336k194k799j615N73J662J178K64q24k689m430m191k364j468k235k653
55409D6551j696j052j845k441j360O6p4j155j186J39J301J027o85k838l884k894
55393B7974q37L62L34M35J269J766J196L19q2j40P9R01J946K411K632L444L993
55376D8002K555k35j573n78N26P3r17j342j856k609j916Q46L247K861N60j097
$$ plain form
55360 46547 45300 44541 44290 44549 45189 45936 46430 45878 43565 40596 39751 42064 44774 44674 42414 41149 41760
55343 41760 42207 41369 40653 41349 42838 44162 45413 46726 47507 47319 46414 45161 44109 44413 46612 49067
55327 49067 49322 47034 44000 41503 39562 38541 39118 40274 39571 36255 32353 30123 30107 31972 35026 37129
55311 37129 35445 29847 24010 21661 22836 24958 26291 26936 27373 27686 28028 28739 29905 31206 32296 33256
55295 33256 34830 37830 41734 44363 43960 41312 38755 37307 36049 34198 32326 31274 31056 31198 31255 30832
55279 30832 29912 29052 28509 27593 25907 24540 24627 25365 25181 24334 24366 25370 26067 26457 27930 30433 32039 31976
55261 31976 31726 32260 32504 31702 31086 31701 32378 31595 29963 29320 30408 32783 35895 38944 40626 40426 39489
55244 39489 39083 38836 37518 34914 31959 29531 27979 27373 27580 28477 30385 33572 37095 39151 39136 38391
$$ packed form
55360D6547j247p59k51K59O40P47M94n52k313k969q45K313K710j00k260j265O11
55343D1760M47q38p16O96J489J324J251J313P81j88r05j253j052L04K199K455
55327D9067K55k288l034k497j941j021N77J156p03l316l902k230j6J865L054K103
55311C7129j684n598n837k349J175K122J333O45M37L13L42P11J166J301J090R60
55295C3256J574L000L904K629m03k648k557j448j258j851j872j052k18J42N7m23
55279C0832r20q60n43r16j686j367Q7P38j84q47L2J004O97L90J473K503J606o3
55261C1976k50N34K44q02o16O15O77p83j632o43J088K375L112L049J682k00r37
55244C9489m06k47j318k604k955k428j552o06K07Q97J908L187L523K056j5p45
$$ plain form
55228 38391 38406 39226 40110 40679 40756 40006 38416 36389 34079 31636 30261 31438 34476 36453 35605 33399 32143
55211 32143 31914 31355 30321 29957 30625 31382 31518 31478 32165 33976 36371 38024 37839 36221 34776 34313 33990
55194 33990 32974 31950 32013 32905 33467 33384 33306 33518 33552 33136 32786 33307 35155 38220 41859 45097 47094 47477
55176 47477 46375 44438 42706 41903 41801 41651 41159 40552 39964 39480 39532 40345 41118 40835 39840 39502 40252 41118
55158 41118 41281 40904 40253 39349 38845 39916 42770 46348 49844 53230 55958 56678 55062 52661 51095 50411
55142 50411 49852 49097 47967 46117 43967 42916 43600 44686 44230 41700 38208 35535 35272 37796 41441 43691
55126 43691 43813 43395 43951 45119 45651 44839 42508 39172 36792 37545 40768 42889 41756 39427 39163 41228
55110 41228 43524 45035 46441 48043 49288 50111 51024 51908 52227 52338 53250 55030 56520 56651 55308 53150
$$ packed form
55228C8391J5Q20Q84N69P7p50j590k027k310k443j375J177L038J977q48k206j256
55211C2143k29n59j034l64O68P57J36m0O87J811K395J653j85j618j445m63l23
55194C3990j016j024O3Q92N62q3p8K12L4m16l50N21J848L065L639L238J997L83
55176D7477j102j937j732q03j02j50m92o07n88m84N2Q13P73k83r95l38P50Q66
55158D1118J63l77o51r04n04J071K854L578L496L386K728P20j616k401j566o84
55142E0411n59p55j130j850k150j051O84J086m56k530l492k673k63K524L645K250
55126D3691J22m18N56J168N32q12k331l336k380P53L223K121j133k329k64K065
55110D1228K296J511J406J602J245Q23R13Q84L19J11R12J780J490J31j343k158
$$ plain form
55094 53150 51277 50627 50918 50707 49184 47228 45876 44730 43057 41568 41554 42779 43725 43758 43754 44684 46663
55077 46663 49251 51666 52930 52876 52822 54259 56952 59272 60222 60279 60330 60683 61152 61491 61787 62715 64992 68212
55059 68212 70890 72211 72965 74063 75055 75135 74813 75385 77219 79627 81998 84041 85454 86351 87533 89361
55043 89361 90928 91412 91556 92500 93651 93172 90291 85949 81449 77812 76177 77299 80357 83342 84861
55028 84861 84862 83853 82375 81116 80481 80027 79123 78132 78092 79342 81124 82388 82425 81185 79719 79790 82104 85293
55010 85293 87396 87777 86817 84664 81657 79264 78931 80182 81202 81061 80193 79162 78456 79117 81762 84980
54994 84980 86377 85510 84318 84498 85892 87704 89647 91315 91889 91361 91029 91977 93774 95248 95869 95842 95427
54977 95427 94660 93431 91714 90055 89596 90882 92837 93817 93601 93402 93971 94787 95306 95894 97039 98468 99533
$$ packed form
55094E3150j873o50K91k11j523j956j352j146j673j489j4J225R46L3mR30J979
55077D6663K588K415J264n4n4J437K693K320R50N7N1L53M69L39K96R28K277L220
55059F8212K678J321P54J098R92Q0l22N72J834K408K371K043J413Q97J182J828
55043H9361J567M84J44R44J151m79k881m342m500l637j635J122L058K985J519
55028H4861Jj009j478j259o35m54r04r91m0J250J782J264L7j240j466P1K314L189
55010H5293K103L81r60k153l007k393l33J251J020j41q68j031p06O61K645L218
54994H4980J397q67j192J80J394J812J943J668N74n28l32R48J797J474O21k7m15
54977I5427p67j229j717j659m59J286J955R80k16j99N69Q16N19N88J145J429J065
$$ plain form
54960 99533 99870 99388 98123 96460 95124 94794 95903 98589 102399 106258 109204 110893 111116 109532 106656
54945 106656 104402 104473 106564 109016 110782 111763 111912 111380 111100 111752 112482 112101 111228 111558 113137 114143 113525
54928 113525 112099 110741 109197 107252 105584 104878 105219 106623 108889 110808 111101 110427 110698 112044 112506 111498
54912 111498 111323 113791 117165 118417 117229 115811 115587 115977 116133 116105 116135 116093 115936 115930 116369 117633 120430 125429
54894 125429 132623 141281 150249 158198 164346 169322 174645 180851 186948 192308 198190 206377 216938 228471
54880 228471 240121 252260 265337 279168 293367 307491 320477 330717 337137 339811 339306 335743
54868 335743 328680 317732 303254 286612 269735 254118 240151 227460 215785 205313 196226 188284
54856 188284 181059 174525 169149 165239 162425 160140 158523 158234 159212 160373 161047 162094 164790 169063 173782
$$ packed form
54960I9533L37m82j265j663j336l30J109K686L810L859K946J689K23j584k876
54945A06656k254P1K091K452J766R81J49n32k80O52P30l81q73L30J579J006o18
54928A13525j426j358j544j945j668p06L41J404K266J919K93o74K71J346M62j008
54912A11498j75K468L374J252j188j418k24L90J56k8L0m2j57oM39J264K797M999
54894A25429P194Q658Q968P949O148M976N323O206O097N360N882Q187J0561J1533
54880B28471J1650J2139J3077J3831J4199J4124J2986J0240O420K674n05l563
54868C35743p063j0948j4478j6642j6877j5617j3967j2691j1675j0472r087p942
54856A88284p225o534n376l910k814k285j617k89R78J161O74J047K696M273M719
$$ plain form
54841 173782 178543 184081 190959 198893 207628 217551 229069 242091 256347 271406 285910 297553 304535
54828 304535 306866 305923 302998 298456 291851 282511 270156 255250 238834 222106 206199 191850 178968
54815 178968 166934 155786 146547 139755 134384 129218 124717 122160 121291 120332 118318 115847 113297 110019
54801 110019 105999 102830 101876 102434 102794 102415 102097 102492 103465 104692 106032 107193 107574 106691 104776 102906
54785 102906 102262 102884 103471 102873 101408 100094 99030 97528 95447 93144 90310 86346 82059 79550 79902
54770 79902 82082 84502 86578 88390 90019 91718 93658 95136 95147 94035 93167 92661 91111 88334 86584
54755 86584 87891 91630 95969 100321 104871 108981 111854 113970 116183 118036 118623 118546 119323 121180 123145
54740 123145 125150 128305 132839 137348 140665 143451 147365 153423 161426 170308 178724 185956 192639 200287
$$ packed form
54841A73782M761N538O878P934Q735R923J1518J3022J4256J5059J4504J1643O982
54828C04535K331r43k925m542o605r340j2355j4906j6416j6728j5907j4349j2882
54815A78968j2034j1148r239o792n371n166m501k557q69r59k014k471k550l278
54801A10019m020l169r54N58L60l79l18L95R73J227J340J161L81q83j915j870
54785A02906o44O22N87n98j465j314j064j502k081k303k834l964m287k509L52
54770G9902K180K420K076J812J629J699J940J478J1j112q68n06j550k777j750
54755H6584J307L739M339M352M550M110K873K116K213J853N87p7P77J857J965
54740A23145K005L155M534M509L317K786L914O058Q003Q882Q416P232O683P648
$$ plain form
54726 200287 209943 221617 234941 249773 265896 282471 298108 311584 322500 331103 337277 340019
54714 340019 338466 333245 325945 317326 307152 295938 285397 276431 267963 258914 250341 244257 240936
54701 240936 238724 236212 233445 231119 229688 229344 230113 231829 234350 237595 241175 244659 248619 254503 262782
54686 262782 272267 282248 294191 309831 328432 347662 366677 386332 406430 424757 439286 449645
54674 449645 455724 456459 451018 440173 425515 408029 388212 366919 345177 323628 302876 283919
54662 283919 267440 252959 239495 227001 216381 207920 200420 192473 184348 177891 174329 172622 170451
54649 170451 166649 162135 158556 156656 156097 156164 156140 155500 154274 153093 152586 152869 153695 154706 155497 155931 156487
54632 156487 157605 158523 157680 154765 151619 150372 151263 152813 153589 153284 152574 152504 153554 155008 155905 156742 159116
$$ packed form
54726B00287R656J1674J3324J4832J6123J6575J5637J3476J0916Q603O174K742
54714C40019j553n221p300q619j0174j1214j0541q966q468r049q573o084l321
54701B40936k212k512k767k326j431l44P69J716K521L245L580L484L960N884Q279
54686B62782R485R981J1943J5640J8601J9230J9015J9655K0098J8327J4529J0359
54674D49645O079P35n441j0845j4658j7486j9817k1293k1742k1549k0752j8957
54662B83919j6479j4481j3464j2494j0620q461p500p947q125o457l562j707k171
54649A70451l802m514l579j900n59O7k4o40j226j181n07K83Q26J011P91M34N56
54632A56487J118R18q43k915l146j247Q91J550P76l05p10p0J050J454Q97Q37K374
$$ plain form
54615 159116 163303 167616 170964 174511 179501 184856 188621 190688 192202 193232 193249 193385 195831 200826 206284
54600 206284 210610 214080 217147 219383 220716 222057 223924 225803 227405 229105 230603 230785 229792 229709 232203
54585 232203 236698 241901 247753 254550 261401 267373 273479 281851 293043 305556 318030 330617 344015
54572 344015 358283 373067 388145 403090 416837 428141 436453 441930 444500 443208 436908 425780
54560 425780 411806 397348 383403 369586 355551 341733 328765 316909 306331 297349 290026 283920
54548 283920 278491 273476 268759 264227 259890 255777 251673 247319 242761 238032 232664 226304 219837 214881
54534 214881 211806 209021 204801 199103 192977 186836 180226 173172 166875 162789 161238 161076 160667 159218 157148
54519 157148 155096 152809 149480 145066 140643 137191 134551 131955 129208 126900 125595 125118 124723 123917 123057
$$ packed form
54615A59116M187M313L348L547M990N355L765K067J514J030J7J36K446M995N458
54600B06284M326L470L067K236J333J341J867J879J602J700J498J82r93q3K494
54585B32203M495N203N852O797O851N972O106Q372J1192J2513J2474J2587J3398
54572C44015J4268J4784J5078J4945J3747J1304Q312N477K570j292o300j1128
54560D25780j3974j4458j3945j3817j4035j3818j2968j1856j0578q982p323o106
54548B83920n429n015m717m532m337m113m104m354m558m729n368o360o467m956
54534B14881l075k785m220n698o126o141o610p054o297m086j551j62m09j449k070
54519A57148k052k287l329m414m423l452k640k596k747k308j305m77l95q06q60
$$ plain form
54504 123057 122963 123832 124829 125109 124951 125339 126639 128320 129891 131439 133110 134675 135778 136154 135519 133788
54488 133788 131490 129530 128451 128338 129269 131188 133400 135096 136513 138778 142315 146160 149245 151657 154177
54473 154177 157213 160610 164083 167443 170821 174952 180738 188188 196192 203639 210347 216757 223295 230269
54459 230269 237649 244479 249073 250353 248726 245393 241260 236829 232606 229003 226002 223084 219258 213358
54445 213358 205069 195855 188076 182848 179433 176850 174985 173585 171416 167553 162791 158634 155276 151638
54431 151638 147214 142969 140461 140713 143728 148266 152196 153882 153492 152581 152440 153220 154363 155263 155555 155347
54415 155347 155211 155602 156357 157116 158007 159471 161556 163868 166123 168361 170664 173034 175364 177291 178389
54400 178389 178864 179604 180998 182109 181688 179778 177605 176073 175060 174065 172803 171171 169429 168456 168981 170279
$$ packed form
54504A23057r4Q69R97K80j58L88J300J681J571J548J671J565J103L76o35j731
54488A33788k298j960j079j13R31J919K212J696J417K265L537L845L085K412K520
54473A54177L036L397L473L360L378M131N786P450Q004P447O708O410O538O974
54459B30269P380O830M594J280j627l333m133m431m223l603l001k918l826n900
54445B13358q289r214p779n228l415k583j865j400k169l863m762m157l358l638
54431A51638m424m245k508K52L015M538L930J686l90r11j41P80J143R00K92k08
54415A55347j36L91P55P59Q91J464K085K312K255K238K303K370K330J927J098
54400A78389M75P40J394J111m21j910k173j532j013r95j262j632j742r73N25J298
$$ plain form
54384 170279 170312 167679 163138 158920 156739 156534 156856 156316 154846 153517 152965 152329 150216 146506 142559 139744
54368 139744 138469 138653 140226 142747 145191 146691 147233 147379 147762 149008 151505 154711 157158 157705 156566
54353 156566 154774 153152 152317 153179 156408 161359 166248 169687 171654 173017 174619 176918 179927 183200 186295
54338 186295 189483 193676 199428 206354 213676 220885 227644 233652 239072 244486 249649 252763 252076 248250
54324 248250 244127 241859 240981 239598 236584 232084 226695 221112 216247 212721 210074 207027 202622 196907
54310 196907 190779 185659 183006 183353 185589 187755 188749 188952 189118 189114 188009 185190 181263 177934 176840 178126
54294 178126 180196 181241 181024 180879 182032 184355 186770 188409 189324 190462 192987 197220 202090 206033 208521
54279 208521 210450 213061 216907 221704 226520 229984 231114 230242 228555 226430 222986 217741 211921 207190
$$ packed form
54384A70279L3k633m541m218k181k05L22n40j470j329n52o36k113l710l947k815
54368A39744j275J84J573K521K444J500N42J46L83J246K497L206K447N47j139
54353A56566j792j622q35Q62L229M951M889L439J967J363J602K299L009L273L095
54338A86295L188M193N752O926P322P209O759O008N420N414N163L114o87l826
54324B48250m123k268q78j383l014m500n389n583m865l526k647l047m405n715
54310A96907o128n120k653L47K236K166R94K03J66mj105k819l927l329j094J286
54294A78126K070J045k17j45J153K323K415J639R15J138K525M233M870L943K488
54279B08521J929K611L846M797M816L464J130q72j687k125l444n245n820m731
$$ plain form
54265 207190 203534 199444 194121 188449 183492 178926 173749 168057 163252 160370 158884 157535 155867 154400
54251 154400 153506 152793 151666 149922 147569 144672 141732 139636 138631 137760 135976 133499 131387 129983 128640
54236 128640 126949 125427 124755 124950 125474 125730 125310 124111 122288 119903 116895 113721 111522 110948 111254 111431
54220 111431 111747 112915 114138 113613 111103 108368 106567 104908 102664 100856 100611 101119 100789 99650 99040 99428
54204 99428 100076 100707 102027 104452 107420 110181 112414 113883 114305 113851 113203 112917 112992 113044 112563 111321 110030
54187 110030 110210 112649 116223 119008 120355 121064 121759 122153 121971 121518 121066 120666 120876 122622 125679 128178
54171 128178 128505 127163 125975 125888 126510 127450 128943 130934 132584 133211 133139 133018 132789 131933 130378 128460 126274
54154 126274 123963 122535 123150 125225 126410 125332 123407 122847 123654 124093 123636 123534 124233 124183 122200 119548
$$ packed form
54265B07190l656m090n323n672m957m566n177n692m805k882j486j349j668j467
54251A54400q94p13j127j744k353k897k940k096j005q71j784k477k112j404j343
54236A28640j691j522o72J95N24K56m20j199j823k385l008l174k199n74L06J77
54220A11431L16J168J223n25k510k735j801j659k244j808k45N08l30j139o10L88
54204I9428O48O31J320K425K968K761K233J469M22m54o48k86P5N2m81j242j291
54187A10030J80K439L574K785J347P09O95L94j82m53m52m00K10J746L057K499
54171A28178L27j342j188q7O22R40J493J991J650O27p2j21k29q56j555j918k186
54154A26274k311j428O15K075J185j078j925n60Q07M39m57j02O99n0j983k652
$$ plain form
54138 119548 118278 118410 118222 116933 115620 115411 115938 116077 115525 115086 115600 116878 117746 117131 115042 112409 110082
54121 110082 108347 107305 107129 107761 108806 109883 110664 110625 109451 107840 107054 107418 108062 108382 108693 108942 108125
54104 108125 106001 104237 104385 105391 104724 101817 98861 97950 98755 99480 99204 98472 98078 97924 97239 95726 94191
54087 94191 93634 93836 93544 92277 91102 91053 91606 91507 90478 89133 87779 86343 85130 84498 84004 82999 82032
54070 82032 82613 85400 89479 93500 96784 99208 100797 101588 101353 99464 95686 91151 87944 87561 90030
54055 90030 94122 97816 99090 97328 93987 91122 89377 88038 86639 85521 85005 85163 86263 88305 90102
54040 90102 90039 88000 85601 84310 84300 85205 86897 89171 91595 94085 96829 99518 101579 103320 105784 109088
54024 109088 111875 112869 112180 110798 109636 109316 109880 110374 109735 108485 108485 110521 113177 114692 114953 114974 115431
$$ packed form
54138A19548j270J32j88j289j313k09N27J39n52m39N14J278Q68o15k089k633k327
54121A10082j735j042j76O32J045J077P81l9j174j611p86L64O44L20L11K49q17
54104A08125k124j764J48J006o67k907k956r11Q05P25k76p32l94j54o85j513j535
54087I4191n57K02k92j267j175m9N53r9j029j345j354j436j213o32m94j005r67
54070H2032N81K787M079M021L284K424J589P91k35j889l778m535l207l83K469
54055I0030M092L694J274j762l341k865j745j339j399j118n16J58J100K042J797
54040I0102o3k039k399j291j0R05J692K274K424K490K744K689K061J741K464L304
54024A09088K787R94o89j382j162l20N64M94o39j250%K036K656J515K61K1M57
$$ plain form
54007 115431 116514 118350 120535 121932 121835 121016 120970 122487 125329 128583 130878 131125 129840 129105 130484 133579
53991 133579 137169 140867 144739 148171 150447 152036 154121 157051 160233 163406 166937 170844 174490 177529
53977 177529 180528 184408 189677 196269 203776 211720 219789 227701 234870 240771 245984 252209 260522 269863
53963 269863 277998 283808 288148 292604 298058 304364 310733 316276 320420 322955 323733 322745 320700 319010 318545
53948 318545 318555 317278 313548 307556 300336 292966 286105 279803 273715 267698 262074 257147 252737 248481 244361
53933 244361 240681 237610 234899 231952 228302 224344 221442 220671 221522 222550 223241 224212 225466 225772 224402
53918 224402 222366 220938 219890 218217 215907 213805 212247 211021 210346 210657 211489 211727 211094 210490 210580 210832
53902 210832 210369 209280 208668 209413 211001 211688 210122 206808 203633 201999 202013 203346 205693 208120 209311 209333
$$ packed form
54007A15431J083J836K185J397r7q19m6J517K842L254K295K47j285p35J379L095
53991A33579L590L698L872L432K276J589K085K930L182L173L531L907L646L039
53977A77529K999L880N269O592P507P944Q069P912P169N901N213O225Q313R341
53963B69863Q135N810M340M456N454O306O369N543M144K535P78r88k045j690m65
53948C18545J0j277l730n992p220p370o861o302o088o017n624m927m410m256m120
53933B44361l680l071k711k947l650l958k902p71Q51J028O91R71J254L06j370
53918B24402k036j428j048j673k310k102j558j226o75L11Q32K38o33o04R0K52
53902B10832m63j089o12P45J588O87j566l314l175j634J4J333K347K427J191K2
$$ plain form
53886 209333 210062 212950 217349 222068 227318 233675 240152 245221 249181 253662 259041 264255 269099 274742
53872 274742 281679 288933 295691 302162 308238 312983 316234 319272 322992 326577 328956 330513 332285 334313
53858 334313 335972 337472 340050 344732 351373 358636 364776 369120 373138 379248 388044 397455 405254 411658
53844 411658 418640 427201 436245 443825 448734 451000 451491 451173 450491 449455 448144 446641 444451 440688 435152
53829 435152 428639 421947 415193 408362 401749 395327 388315 379953 370236 359545 348199 336744 325969
53816 325969 316067 306449 297003 288810 282864 278686 274941 270870 266404 261528 256526 252382 249876 248405
53802 248405 246436 242900 237603 230824 223394 216675 211363 206572 201146 195614 191806 190591 191078 191938 192415
53787 192415 191999 190349 187935 185790 184231 182513 179935 176560 172777 169069 166343 165469 166051 166605 166354
$$ packed form
53886B09333P29K888M399M719N250O357O477N069L960M481N379N214M844N643
53872B74742O937P254O758O471O076M745L251L038L720L585K379J557J772K028
53858C34313J659J500K578M682O641P263O140M344M018O110Q796R411P799O404
53844D11658O982Q561R044P580M909K266M91l18o82j036j311j503k190l763n536
53829D35152o513o692o754o831o613o422p012q362r717j0691j1346j1455j0775
53816C25969r902r618r446q193n946m178l745m071m466m876n002m144k506j471
53802B48405j969l536n297o779p430o719n312m791n426n532l808j215M87Q60M77
53787A92415m16j650k414k145j559j718k578l375l783l708k726q74N82N54k51
$$ plain form
53772 166354 165994 166321 167077 167728 168325 168850 168604 167244 165716 165170 165457 165693 165865 166767 168603 170668 172398
53755 172398 173852 175190 176460 177902 179726 181594 183128 184839 187618 191279 194647 197455 201118 206996
53741 206996 214681 222700 230288 237623 244756 251396 257795 264946 273475 282740 291341 298355 303906 308657
53727 308657 313024 316936 320272 323308 326542 330140 333804 337177 340128 342561 344277 345207 345476 345010 343322
53712 343322 340015 335320 329845 323985 317943 312217 307583 304395 302105 299624 296115 291487 286238 280851
53698 280851 275394 269794 264437 260014 256650 253566 249965 245907 241905 238097 234440 231362 229322 227771
53684 227771 225524 222446 219834 218632 218045 216694 214626 213227 213294 213952 213645 211605 208246 204599 201685
53669 201685 200199 200446 202361 205450 208718 211081 212206 212786 213686 214960 216065 216823 217684 219050 220904
$$ packed form
53772A66354l60L27P56O51N97N25k46j360j528n46K87K36J72R02J836K065J730
53755A72398J454J338J270J442J824J868J534J711K779L661L368K808L663N878
53741B06996P685Q019P588P335P133O640O399P151Q529R265Q601P014N551M751
53727C08657M367L912L336L036L234L598L664L373K951K433J716R30K69m66j688
53712C43322l307m695n475n860o042n726m634l188k290k481l509m628n249n387
53698B80851n457n600n357m423l364l084l601m058m002l808l657l078k040j551
53684B27771k247l078k612j202n87j351k068j399O7O58l07k040l359l647k914
53669B01685j486K47J915L089L268K363J125N80R00J274J105P58Q61J366J854
$$ plain form
53654 220904 223219 226297 230418 235424 240828 246079 250651 254201 256881 259304 262083 265580 270031 275398
53640 275398 280947 285553 288849 291580 294313 296330 296713 296289 297373 301248 306721 311649 315184 317968 320783
53625 320783 323905 327464 331454 335288 338119 339882 341551 344113 347595 351101 353436 353850 352859 352342 354007
53610 354007 357465 360556 361873 362118 362514 362896 362362 361048 360056 359983 360683 362133 364261 365943 365566 363014
53594 363014 360082 358519 358530 359506 360965 362153 361809 359473 356471 354649 354442 354944 355523 356458 358057 359887
53578 359887 361091 361166 360425 359778 359859 360363 360656 361046 362635 365692 369086 371855 374412 377442 380589 383267
53562 383267 386016 389757 394176 398108 401147 403669 405700 407204 409287 413397 419262 425281 431275 439037
53548 439037 449403 460443 469721 477032 483599 489749 495024 499962 505967 513440 521396 529126 537138 546088
$$ packed form
53654B20904K315L078M121N006N404N251M572L550K680K423K779L497M451N367
53640B75398N549M606L296K731K733K017L83m24J084L875N473M928L535K784K815
53625C20783L122L559L990L834K831J763J669K562L482L506K335M14r91n17J665
53610C54007L458L091J317K45L96L82n34j314r92p3P00J450K128J682l77k552
53594C63014k932j563J1R76J459J188l44k336l002j822k07N02N79R35J599J830
53578C59887J204P5p41o47Q1N04K93L90J589L057L394K769K557L030L147K678
53562C83267K749L741M419L932L039K522K031J504K083M110N865O019N994P762
53548D39037J0366J1040R278P311O567O150N275M938O005P473P956P730Q012Q950
$$ plain form
53534 546088 555636 564886 573511 582015 590958 600023 607892 613326 616539 619081 622002 624682 626072 626658
53520 626658 628301 632247 637971 643878 648442 650837 651394 651636 653036 655463 657468 658224 658393 658878 659707 660732
53504 660732 662542 665692 669448 672222 673145 672609 671567 671003 671845 674379 677567 679692 679952 678957 677693 676799
53488 676799 676963 678937 682437 685812 687682 688554 690100 693142 697143 701398 705728 709973 713758 717025 720226
53473 720226 723789 728015 733528 741032 750270 760062 769891 780786 793913 808795 823688 837509 850777
53460 850777 864906 881199 900347 922156 945579 969460 993501 1018324 1044627 1072426 1101039
53449 1101039 1129703 1158427 1188355 1220826 1255798 1291668 1327211 1363303 1402084 1444572 1489620
53438 1489620 1535077 1579468 1622806 1666387 1711723 1759152 1807501 1855425 1902705 1949851 1996965
$$ packed form
53534E46088R548R250Q625Q504Q943R065P869N434L213K542K921K680J390N86
53520F26658J643L946N724N907M564K395N57K42J400K427K005P56J69M85Q29J025
53504F60732J810L150L756K774R23n36j042n64Q42K534L188K125K60r95j264q94
53488F76799J64J974L500L375J870Q72J546L042M001M255M330M245L785L267L201
53473G20226L563M226N513P504R238R792R829J0895J3127J4882J4893J3821J3268
53460H50777J4129J6293J9148K1809K3423K3881K4041K4823K6303K7799K8613
53449A101039K8664K8724K9928L2471L4972L5870L5543L6092L8781M2488M5048
53438A489620M5457M4391M3338M3581M5336M7429M8349M7924M7280M7146M7114
$$ plain form
53427 1996965 2043845 2090746 2138086 2185613 2232818 2279934 2327464 2374864 2420910 2465345 2508926
53416 2508926 2551695 2592630 2631353 2668852 2705943 2742267 2777445 2811895 2845655 2877564 2906618
53405 2906618 2933008 2956766 2976598 2991606 3003261 3013886 3023616 3030551 3033655 3033745 3031412 3025695 3015495
53392 3015495 3001066 2983365 2962804 2939492 2914045 2887413 2860066 2831772 2801965 2770107 2735947
53381 2735947 2699583 2661113 2620322 2577223 2532915 2489396 2448239 2409606 2372412 2335121 2296709
53370 2296709 2257681 2220183 2186423 2156746 2129825 2104683 2081657 2061065 2041978 2023204 2005071
53359 2005071 1989492 1978264 1971655 1968531 1967537 1968336 1971942 1979688 1991793 2007313 2025536 2046846 2071828
53346 2071828 2100257 2131620 2166121 2204148 2244898 2286597 2328470 2371741 2418194 2468256 2521086
$$ packed form
53427A996965M6880M6901M7340M7527M7205M7116M7530M7400M6046M4435M3581
53416B508926M2769M0935L8723L7499L7091L6324L5178L4450L3760L1909K9054
53405B906618K6390K3758J9832J5008J1655J0625R730O935L104R0k333n717j0200
53392C015495j4429j7701k0561k3312k5447k6632k7347k8294k9807l1858l4160
53381B735947l6364l8470m0791m3099m4308m3519m1157l8633l7194l7291l8412
53370B296709l9028l7498l3760k9677k6921k5142k3026k0592j9087j8774j8133
53359B005071j5579j1228o609l124r94P99L606P746J2105J5520J8223K1310K4982
53346B071828K8429L1363L4501L8027M0750M1699M1873M3271M6453N0062N2830
$$ plain form
53335 2521086 2576137 2633873 2695033 2759905 2828552 2901057 2977060 3055505 3135597 3217963 3304192
53324 3304192 3394997 3489303 3585257 3681594 3777765 3873462 3968779 4064422 4160850 4257147 4351498
53313 4351498 4442941 4532041 4619591 4705271 4787895 4866340 4939586 5006252 5064979 5115463 5158692
53302 5158692 5196047 5228323 5255534 5277125 5292093 5299178 5297367 5286406 5266789 5239311 5204729 5163756
53290 5163756 5117080 5065101 5007603 4943869 4873262 4795848 4712579 4625009 4534734 4442850 4349863
53279 4349863 4256253 4163129 4071991 3983663 3897633 3812620 3727636 3642385 3557000 3471911 3387877
53268 3387877 3305730 3225925 3148520 3073566 3001355 2932319 2866908 2805477 2748070 2694416 2644407
53257 2644407 2598473 2557045 2519617 2484634 2450524 2416758 2384120 2354187 2328355 2306760 2287958
$$ packed form
53335B521086N5051N7736O1160O4872O8647P2505P6003P8445Q0092Q2366Q6229
53324C304192R0805R4306R5954R6337R6171R5697R5317R5643R6428R6297R4351
53313D351498R1443Q9100Q7550Q5680Q2624P8445P3246O6666N8727N0484M3229
53302E158692L7355L2276K7211K1591J4968P085j811j0961j9617k7478l4582m0973
53290E163756m6676n1979n7498o3734p0607p7414q3269q7570r0275r1884r2987
53279D349863r3610r3124r1138q8328q6030q5013q4984q5251q5385q5089q4034
53268C387877q2147p9805p7405p4954p2211o9036o5411o1431n7407n3654n0009
53257B644407m5934m1428l7428l4983l4110l3766l2638k9933k5832k1595j8802
$$ plain form
53246 2287958 2270061 2252358 2235754 2221768 2211472 2205309 2203165 2204217 2207077 2210482 2213862 2217333 2221592
53233 2221592 2227892 2237569 2251144 2268075 2287491 2308935 2332445 2358491 2387963 2421457 2458151 2496085
53221 2496085 2534150 2573193 2614407 2657157 2699455 2740361 2780781 2821702 2862605 2902076 2939287
53210 2939287 2974304 3007285 3037865 3065209 3088434 3107143 3121671 3132645 3140309 3144604 3145937 3145268
53198 3145268 3143114 3138746 3130786 3118473 3102217 3083112 3062048 3039014 3013005 2982785 2947932 2909027
53186 2909027 2866887 2822028 2775033 2726853 2678226 2629069 2578928 2527885 2476676 2426107 2376710
53175 2376710 2328755 2282158 2236507 2191657 2148166 2106664 2066814 2027437 1987724 1947915 1908883
53164 1908883 1871550 1836636 1804239 1773420 1742813 1712011 1681935 1653638 1627226 1602241 1578387
$$ packed form
53246B287958j7897j7703j6604j3986j0296o163k144J052K860L405L380L471M259
53233B221592O300R677J3575J6931J9416K1444K3510K6046K9472L3494L6694L7934
53221B496085L8065L9043M1214M2750M2298M0906M0420M0921M0903L9471L7211
53210B939287L5017L2981L0580K7344K3225J8709J4528J0974P664M295J333o69
53198C145268k154m368p960j2313j6256j9105k1064k3034k6009l0220l4853l8905
53186B909027m2140m4859m6995m8180m8627m9157n0141n1043n1209n0569m9397
53175B376710m7955m6597m5651m4850m3491m1502l9850l9377l9713l9809l9032
53164A908883l7333l4914l2397l0819l0607l0802l0076k8297k6412k4985k3854
$$ plain form
53153 1578387 1555399 1532699 1509880 1487196 1464996 1442996 1420742 1398478 1376778 1355475 1333786
53142 1333786 1311539 1289439 1267936 1246589 1224906 1203131 1181747 1160738 1139859 1119291 1099445
53131 1099445 1080298 1061321 1041895 1021579 1000329 978921 958791 940746 923868 906313 887228
53120 887228 867350 847647 828092 808255 788575 770331 754424 740602 727806 714841 700792
53109 700792 685499 669992 655984 644370 634234 623681 611592 598402 585349 573428 562960
53098 562960 553630 544673 535371 525590 515732 506204 497222 489065 482002 475879 470254 465029 460288 455520
53084 455520 449934 443930 439104 435977 432831 427979 422274 417704 414176 409774 404125 399248 396394 394159
53070 394159 390937 387492 385411 384306 382505 379757 377313 375525 373249 369790 365894 362320 358816 355044
$$ packed form
53153A578387k2988k2700k2819k2684k2200k2000k2254k2264k1700k1303k1689
53142A333786k2247k2100k1503k1347k1683k1775k1384k1009k0879k0568j9846
53131A099445j9147j8977j9426k0316k1250k1408k0130j8045j6878j7555j9085
53120H87228j9878j9703j9555j9837j9680j8244j5907j3822j2796j2965j4049
53109G00792j5293j5507j4008j1614j0136j0553j2089j3190j3053j1921j0468
53098E62960r330q957r302r781r858r528q982q157p063o123n625n225m741m768
53084D55520n586o004m826l127l146m852n705m570l528m402n649m877k854k235
53070C94159l222l445k081j105j801k748k444j788k276l459l896l574l504l772
$$ plain form
53056 355044 351414 348309 345395 342453 340182 339337 339430 338954 336708 332555 327251 322084 318380 316698 316440
53041 316440 316531 316567 316980 318088 319231 319140 317219 314390 312329 311749 311679 310831 309381 308803 309952 311968 313410
53024 313410 314042 315042 317588 321549 325595 328481 330242 332076 334902 338192 340524 341197 340849 340471 340327
53009 340327 340093 339598 339027 338560 338174 337716 336923 335358 332533 328189 322590 316582 311158 306722 302845 299007
52993 299007 295293 291904 288256 283546 278415 275061 274879 276431 276695 274237 270376 267095 264575 261285 256104
52978 256104 249652 243499 238577 234728 231510 228939 227359 226946 227476 228350 228662 227662 225412 222722 220183
52963 220183 217670 215138 213335 213007 213743 214409 214491 214058 212729 209964 206600 204698 205178 206595 206956 205859
52947 205859 204124 202277 200498 199385 199538 200699 202196 203868 205672 206906 207040 206953 207978 209759 210441
$$ packed form
53056C55044l630l105k914k942k271q45R3m76k246m153n304n167l704j682k58
53041C16440R1L6M13J108J143r1j921k829k061n80p0q48j450n78J149K016J442
53024C13410O32J000K546L961M046K886J761J834K826L290K332O73l48l78j44
53009C40327k34m95n71m67l86m58p93j565k825m344n599o008n424m436l877l838
52993B99007l714l389l648m710n131l354j82J552K64k458l861l281k520l290n181
52978B56104o452o153m922l849l218k571j580m13N30Q74L12j000k250k690k539
52963B20183k513k532j803l28P36O66Q2m33j329k765l364j902M80J417L61j097
52947B05859j735j847j779j113J53J161J497J672J804J234J34q7J025J781O82
$$ plain form
52932 210441 209207 207303 206169 205797 205587 205623 206256 207208 207994 208676 209435 209896 209614 208912 208590 209114 210504 212443
52914 212443 213945 213639 211312 208726 207924 209096 211110 213764 218067 224138 230227 234464 236659 237712 238040
52899 238040 237400 235849 234064 232855 232846 234374 237147 240088 242111 243145 244117 245904 248475 251056 252930
52884 252930 254146 255546 258008 261587 265660 269946 274975 281171 287851 293629 297716 300415 302534 304847
52870 304847 308064 312580 317992 323281 327873 332265 337218 342450 346562 348402 348271 347524 347012 346313 344708
52855 344708 342565 341101 340805 340822 340191 338974 337535 335366 331662 326854 322542 319678 317628 315262 312269
52840 312269 309117 306498 305188 305697 307404 308555 307859 305814 303809 302225 300170 297005 293381 290637 289732
52825 289732 290868 293556 296668 298836 299407 299093 299369 300974 303078 304100 303383 301808 300614 299974 299138 297725
$$ packed form
52932B10441j234j904j134l72k10L6O33R52P86O82P59M61k82p02l22N24J390J939
52914B12443J502l06k327k586q02J172K014K654M303O071O089M237K195J053L28
52899B38040o40j551j785j209rJ528K773K941K023J034R72J787K571K581J874
52884B52930J216J400K462L579M073M286N029O196O680N778M087K699K119K313
52870C04847L217M516N412N289M592M392M953N232M112J840j31p47n12o99j605
52855C44708k143j464k96J7o31j217j439k169l704m808m312k864k050k366k993
52840C12269l152k619j310N09J707J151o96k045k005j584k055l165l624k744r05
52825B89732J136K688L112K168N71l14K76J605K104J022p17j575j194o40q36j413
$$ plain form
52809 297725 296189 294974 293971 293090 292705 293053 293749 294443 295474 297214 299118 300196 300282 300162 300483 301218 302138
52792 302138 303132 303911 304065 303715 303609 304182 304868 304704 303410 301550 299821 298557 298008 298675 300858 303822 305944
52775 305944 306266 305777 306497 309122 312167 313661 313136 311618 310388 310295 311648 313916 315857 316742 317201 318117
52759 318117 318996 318328 315513 311536 307776 305048 303879 304695 307233 310388 313088 315077 316773 318714 321083
52744 321083 323192 323538 321139 316887 312892 310375 308910 307660 306358 304805 302446 299104 295498 292544
52730 292544 290533 289153 287679 285057 280684 275392 270741 266939 262517 256637 250629 246366 243952 241947
52716 241947 239202 235504 231028 226282 222225 219520 217811 216351 214917 213464 211511 208740 205615 202484
52702 202484 198710 193887 189267 186533 185456 184384 182891 182186 182648 182821 181688 180411 180551 181606 181619 179630
$$ packed form
52809B97725j536j215j003q81l85L48O96O94J031J740J904J078Q6j20L21P35R20
52792C02138R94P79J54l50j06N73O86j64j294j860j729j264n49O67K183K964K122
52775C05944L22m89P20K625L045J494n25j518j230r3J353K268J941Q85M59R16
52759C18117Q79o68k815l977l760k728j169Q16K538L155K700J989J696J941K369
52744C21083K109L46k399m252l995k517j465j250j302j553k359l342l606k954
52730B92544k011j380j474k622m373n292m651l802m422n880o008m263k414k005
52716B41947k745l698m476m746m057k705j709j460j434j453j953k771l125l131
52702B02484l774m823m620k734j077j072j493p05M62J73j133j277J40J055J3j989
$$ plain form
52686 179630 176356 172740 169006 165117 161242 157483 153674 149699 145789 142416 139972 138416 137073 135121
52672 135121 132570 130489 129844 130301 130730 130736 131041 132182 133569 134316 134555 135157 136199 136513 135108 132468 129845
52655 129845 127646 125314 122748 120989 121091 122914 125459 127907 129845 130986 131375 131558 131781 131124 128377
52640 128377 123964 120275 119489 121428 123904 124940 124299 123035 122153 121895 122078 122625 123555 124651 125502 125950
52624 125950 126265 126784 127615 128697 129847 130717 131204 132055 134366 138055 141444 143128 143868 145794 149858 154925
52608 154925 159278 162208 163921 164792 165275 166110 168062 171448 175937 180578 184049 185424 184969 183985 183710 184519
52592 184519 186084 187858 189287 189918 189580 188338 186345 184009 182134 181228 180626 178868 175305 170964 167520
52577 167520 165750 165205 164999 164519 163577 162385 161415 161115 161600 162558 163342 163226 161860 159529 156786 153868 150714
$$ packed form
52686A79630l274l616l734l889l875l759l809l975l910l373k444j556j343j952
52672A35121k551k081o45M57M29OL05J141J387P47K39O02J042L14j405k640k623
52655A29845k199k332k566j759J02J823K545K448J938J141L89J83K23o57k747
52640A28377m413l689p86J939K476J036o41j264q82k58J83N47R30J096Q51M48
52624A25950L15N19Q31J082J150Q70M87Q51K311L689L389J684P40J926M064N067
52608A54925M353K930J713Q71M83Q35J952L386M489M641L471J375m55r84k75Q09
52592A84519J565J774J429O31l38j242j993k336j875r06o02j758l563m341l444
52577A67520j770n45k06m80r42j192r70l00M85R58P84j16j366k331k743k918l154
$$ plain form
52560 150714 147507 144778 142862 141590 140673 140077 139868 139881 139785 139401 138910 138802 139426 140294 140004 137410 132974
52543 132974 128638 126251 126343 128350 131442 134988 138665 142414 146128 149367 151671 153056 153843 154145 154131 154698
52527 154698 156932 160599 163974 165648 165880 165723 165513 164912 163912 162983 162551 162989 164835 168223 172232 175601
52511 175601 178086 180464 183167 185640 187236 188150 189116 190607 192668 195256 198455 202331 206591 210224 211736
52496 211736 210338 207050 204157 203195 203855 205087 206796 209791 214238 218956 222517 224578 225785 226745 227536
52481 227536 228070 228378 228500 228507 228747 229619 230876 231589 231185 230280 230113 231320 233564 236052 237949 238604 238141 237839
52463 237839 239173 242282 245858 248676 250567 251743 251964 251036 249634 248829 248925 249223 248830 247285 244678 241647
52447 241647 239144 237675 236796 235773 234649 234098 234368 235102 236297 238460 241303 243087 242306 239674 237373
$$ packed form
52560A50714l207k729j916j272r17n96k09J3r6l84m91j08O24Q68k90k594m436
52543A32974m336k387R2K007L092L546L677L749L714L239K304J385P87L02j4N67
52527A54698K234L667L375J674K32j57k10o01j000r29m32M38J846L388M009L369
52511A75601K485K378K703K473J596R14R66J491K061K588L199L876M260L633J512
52496B11736j398l288k893r62O60J232J709K995M447M718L561K061J207R60P91
52481B27536N34L08J22PK40Q72J257P13m04r05j67J207K244K488J897O55m63l02
52463B37839J334L109L576K818J891J176K21r28j402q05R6K98l93j545k607l031
52447B41647k503j469q79j023j124n51K70P34J195K163K843J784p81k632k301
$$ plain form
52432 237373 236330 235374 233453 231514 231248 232763 234736 236531 238782 241774 244606 246435 247464 248057 248021
52417 248021 247641 248368 251179 254925 257705 259342 260948 262367 261994 259453 256639 255277 254950 254538 254348 255362
52401 255362 257231 258539 258730 258457 258125 257392 256298 255734 256201 256841 256370 254765 253514 254060 256150 257879
52385 257879 257492 255137 252593 251336 251251 251394 251432 251847 253018 254670 256187 257035 256838 255410 252943 250115
52369 250115 247883 246853 246638 246063 244483 242807 242584 244082 245995 247181 247816 248464 248926 248755 248212 247842
52353 247842 247639 247477 247938 249715 252399 254812 256495 257976 259517 260549 260689 260621 261482 263593 266101 267820
52337 267820 268404 268738 270084 272757 275961 278906 281411 283123 283107 281110 278688 278043 279999 283924 289050
52322 289050 294572 298707 299356 296363 292174 289649 289856 292172 295598 299417 303201 306832 310202 312786 314059
$$ packed form
52432B37373j043r56j921j939k66J515J973J795K251K992K832J829J029N93l6
52417B48021l80P27K811L746K780J637J606J419l73k541k814j362l27m12j90J014
52401B55362J869J308J91k73l32p33j094n64M67O40m71j605j251N46K090J729
52385B57879l87k355k544j257q5J43L8M15J171J652J517Q48j97j428k467k828
52369B50115k232j030k15n75j580j676k23J498J913J186O35O48M62j71n43l70
52353B47842k03j62M61J777K684K413J683J481J541J032J40o8Q61K111K508J719
52337B67820N84L34J346K673L204K945K505J712j6j997k422o45J956L925N126
52322B89050N522M135O49k993m189k525K07K316L426L819L784L631L370K584J273
$$ plain form
52307 314059 314498 315424 317496 320056 322291 324279 326372 328356 330027 332123 335844 341520 348256 354782 360351
52292 360351 365103 369985 376049 383333 390475 395762 398647 400233 402395 406282 411312 415803 419021 422328
52278 422328 427436 433724 438614 440835 441921 443778 446241 448319 450563 454362 459525 464484 468833 473804
52264 473804 479922 486018 491338 497112 504800 513825 522431 530267 538721 548871 560305 572156 584186
$$ packed form
52307C14059M39R26K072K560K235J988K093J984J671K096L721N676O736O526N569
52292C60351M752M882O064P284P142N287K885J586K162L887N030M491L218L307
52278D22328N108O288M890K221J086J857K463K078K244L799N163M959M349M971
52264D73804O118O096N320N774P688R025Q606P836Q454J0150J1434J1851J2030
$$ [...]
##END NTUPLES=NMR SPECTRUM
##END=
