
##TITLE=AC1103_ROVE100A_5867950_VllEZNSyBV
##JCAMPDX= 6.0         $$ Bruker NMR JCAMP-DX V2.0
##DATA TYPE= NMR SPECTRUM
##DATA CLASS= NTUPLES
##ORIGIN= BRUKER
##OWNER= Administrator
$$ 1.72 TOPSPIN		Version 2.1
$$ 2012-03-31 00:20:53.484 -0500  Administrator@TOPSPIN
$$ Compression mode = diff/dup
##.OBSERVE FREQUENCY= 400.13188235
##.OBSERVE NUCLEUS= ^1H
##.ACQUISITION MODE= SIMULTANEOUS (DQD)
##.ACQUISITION SCHEME= undefined
##.AVERAGES= 8
##.DIGITISER RES= 22
##SPECTROMETER/DATA SYSTEM= spect
##.PULSE SEQUENCE= zg30
##.SOLVENT NAME= COFFEE_meoh
##.SHIFT REFERENCE= INTERNAL, COFFEE_meoh, 1, 14.98061
##AUDIT TRAIL= $$ (NUMBER, WHEN, WHO, WHERE, PROCESS, VERSION, WHAT)
$$ ##TITLE= Audit trail, TOPSPIN		Version 2.1
$$ ##JCAMPDX= 5.01
$$ ##ORIGIN= Bruker BioSpin GmbH
$$ ##OWNER= Administrator
$$ $$ C:\Bruker\TOPSPIN/data/COFFEE/nmr/AC1103_ROVE100A_5867950_VllEZNSyBV/10/pdata/1/auditp.txt
$$ ##AUDIT TRAIL=  $$ (NUMBER, WHEN, WHO, WHERE, PROCESS, VERSION, WHAT)
(   1,<2012-03-31 00:20:46.750 -0500>,<Administrator>,<TOPSPIN>,<go>,<TOPSPIN 2.1>,
      <created by zg
	started at 2012-03-31 00:19:39.875 -0500,
	POWCHK enabled, PULCHK disabled,
       configuration hash MD5:
       1A 1E CE 29 27 FD 77 03 67 4E F0 E3 C4 B2 CB 90
       data hash MD5: 64K
       42 6A 02 1B B8 CE C8 EB 6A 5E 29 A6 97 B2 99 CB>)
(   2,<2012-03-31 00:20:49.437 -0500>,<Administrator>,<TOPSPIN>,<proc1d>,<TOPSPIN 2.1>,
      <Start of raw data processing
       efp LB = 0 FT_mod = 6 PKNL = 1 PHC0 = 0 PHC1 = 0 SI = 32K 
       data hash MD5: 32K
       EF 0D AD E4 FB F2 3C 77 A5 D9 20 33 39 09 35 28>)
(   3,<2012-03-31 00:20:49.765 -0500>,<Administrator>,<TOPSPIN>,<proc1d>,<TOPSPIN 2.1>,
      <pk PHC0 = 210.2838 PHC1 = 0 
       data hash MD5: 32K
       0E FA C0 FC DB 8A FE C1 AC 3E 2A 30 90 00 9D 0F>)
(   4,<2012-03-31 00:20:49.859 -0500>,<Administrator>,<TOPSPIN>,<proc1d>,<TOPSPIN 2.1>,
      <abs ABSG = 1 
       data hash MD5: 32K
       7E 59 51 0A D7 3C B7 0D F3 50 EB A2 94 82 30 B1>)
(   5,<2012-03-31 00:20:49.921 -0500>,<Administrator>,<TOPSPIN>,<proc1d>,<TOPSPIN 2.1>,
      <abs ABSG = 2 
       data hash MD5: 32K
       43 EA 70 93 1B 3B D6 D2 9B 3A 5A D5 09 B0 52 99>)
(   6,<2012-03-31 00:20:49.968 -0500>,<Administrator>,<TOPSPIN>,<proc1d>,<TOPSPIN 2.1>,
      <abs ABSG = 3 
       data hash MD5: 32K
       CE BE 15 4D 98 A4 AA 24 C8 30 D3 E3 DD 33 CF CB>)
(   7,<2012-03-31 00:20:50.000 -0500>,<Administrator>,<TOPSPIN>,<proc1d>,<TOPSPIN 2.1>,
      <abs ABSG = 4 
       data hash MD5: 32K
       5B 4A 93 50 0F 17 C8 73 F6 5F 9A 09 09 28 4B F1>)
(   8,<2012-03-31 00:20:50.015 -0500>,<Administrator>,<TOPSPIN>,<proc1d>,<TOPSPIN 2.1>,
      <abs ABSG = 5 
       data hash MD5: 32K
       45 B3 68 57 71 1E 21 EA 26 43 F4 06 02 B2 9B 49>)
$$ ##END=
$$ 
$$ $$ hash MD5
$$ $$ C2 C0 29 ED 36 25 E3 92 91 83 D7 AE 3A 75 BC 65
##$RELAX= 
##$RELAX= 
##$RELAX= 
##$RELAX= 
##$RELAX= 
##$RELAX= 
##$RELAX= 
$$ Bruker specific parameters
$$ --------------------------
$$ [...]
##$TP= (0..7)
150 150 150 150 150 150 150 150
##$TP07= 0
##$TPNAME0= <>
##$TPNAME1= <>
##$TPNAME2= <>
##$TPNAME3= <>
##$TPNAME4= <>
##$TPNAME5= <>
##$TPNAME6= <>
##$TPNAME7= <>
##$TPOAL= (0..7)
0.5 0.5 0.5 0.5 0.5 0.5 0.5 0.5
##$TPOFFS= (0..7)
0 0 0 0 0 0 0 0
##$TUNHIN= 0
##$TUNHOUT= 0
##$TUNXOUT= 0
##$USERA1= <user>
##$USERA2= <user>
##$USERA3= <user>
##$USERA4= <user>
##$USERA5= <user>
##$V9= 5
##$VALIST= <valist>
##$VCLIST= <CCCCCCCCCCCCCCC>
##$VD= 0
##$VDLIST= <DDDDDDDDDDDDDDD>
##$VPLIST= <PPPPPPPPPPPPPPP>
##$VTLIST= <TTTTTTTTTTTTTTT>
##$WBST= 2048
##$WBSW= 25
##$XGAIN= (0..3)
0 0 0 0
##$XL= 0
##$YL= 0
##$YMAX_a= 559949
##$YMIN_a= -676202
##$ZGOPTNS= <>
##$ZL1= 120
##$ZL2= 120
##$ZL3= 120
##$ZL4= 120
##$ABSF1= 14.98061
##$ABSF2= -5.57192
##$ABSG= 5
##$ABSL= 3
##$ALPHA= 0
##$AQORDER= 0
##$ASSFAC= 0
##$ASSFACI= 0
##$ASSFACX= 0
##$ASSWID= 0
##$AUNMP= <proc_prof1d_extract_pilot.lims>
##$AXLEFT= 0
##$AXNAME= <>
##$AXNUC= <1H>
##$AXRIGHT= 0
##$AXTYPE= 0
##$AXUNIT= <>
##$AZFE= 0.1
##$AZFW= 0.1
##$BCFW= 0
##$BC_mod= 0
##$BYTORDP= 0
##$COROFFS= 0
##$CY= 15
##$DATMOD= 1
##$DC= 0
##$DFILT= <>
##$DTYPP= 0
##$F1P= 0
##$F2P= 0
##$FCOR= 0.5
##$FTSIZE= 32768
##$FT_mod= 6
##$GAMMA= 0
##$GB= 0
##$INTBC= 1
##$INTSCL= 1
##$ISEN= 128
##$LB= 0
##$LEV0= 0
##$LPBIN= 0
##$MAXI= 10000
##$MC2= 0
##$MEAN= 0
##$ME_mod= 0
##$MI= 0
##$NCOEF= 0
##$NC_proc= -8
##$NLEV= 6
##$NOISF1= 0
##$NOISF2= 0
##$NSP= 0
##$NTH_PI= 0
##$NZP= 0
##$OFFSET= 14.98061
##$PC= 1
##$PHC0= 210.2838
##$PHC1= 0
##$PH_mod= 1
##$PKNL= yes
##$PPARMOD= 0
##$PPDIAG= 0
##$PPIPTYP= 0
##$PPMPNUM= 2147483647
##$PPRESOL= 1
##$PSCAL= 4
##$PSIGN= 0
##$PYNMP= <proc.py>
##$REVERSE= no
##$SF= 400.13
##$SI= 32768
##$SIGF1= 0
##$SIGF2= 0
##$SINO= 400
##$SIOLD= 32768
##$SPECTYP= <>
##$SREGLST= <1H.CDCl3>
##$SSB= 0
##$STSI= 32768
##$STSR= 0
##$SW_p= 8223.68421052632
##$SYMM= 0
##$S_DEV= 0
##$TDeff= 65536
##$TDoff= 0
##$TI= <>
##$TILT= no
##$TM1= 0
##$TM2= 0
##$TOPLEV= 0
##$USERP1= <user>
##$USERP2= <user>
##$USERP3= <user>
##$USERP4= <user>
##$USERP5= <user>
##$WDW= 1
##$XDIM= 32768
##$YMAX_p= 469483398
##$YMIN_p= -711501
##$CURPLOT= <Network HP LaserJet P1505>
##$CURPRIN= <$Network HP LaserJet P1505>
##$DFORMAT= <normdp>
##$LAYOUT= <+/1D_H.xwp>
##$LFORMAT= <normlp>
##$PFORMAT= <normpl>
##$SURQMSG= 1
$$ End of Bruker specific parameters
$$ ---------------------------------
##NTUPLES= NMR SPECTRUM
##VAR_NAME=  FREQUENCY,     SPECTRUM/REAL,   SPECTRUM/IMAG
##SYMBOL=    X,             R,               I
##VAR_TYPE=  INDEPENDENT,   DEPENDENT,       DEPENDENT
##VAR_FORM=  AFFN,          ASDF,            ASDF
##VAR_DIM=   32768,         32768,           32768
##UNITS=     HZ,            ARBITRARY UNITS, ARBITRARY UNITS
##FACTOR=    0.250966925370066, 1,           1
##FIRST=     8223.43324360095, 4763,         31716
##LAST=      0,             120362,          69578
##MIN=       0,             -711501,         0
##MAX=       8223.43324360095, 469483398,    0
$$ Real data points
##PAGE= N=1
##DATA TABLE= (X++(R..R)), XYDATA
$$ [...]
23813 90151 379884 -95982 -112889 -99759 64015 -280979 14468 -25686 -68685 49633 227012
23802 227012 86162 -33006 216014 190396 -135688 65042 21058 -43949 -59270 4770 -383219
23790 -170338 -4001 -132985 -122769 -190290 526489 -105844 -42532 -79544 -41872 325168 8863
23778 255097 -362781 -36896 -194626 143409 -377222 -125555 55810 30004 145846 -330759
23767 125000 -207958 146768 164872 152340 64319 -66145 -2602 -160968 -150686 -99816 10242
23755 30173 -111066 -177615 315741 137571 42737 -157932 -20229 -39690 -38328 90606 -10635
23743 -27738 -302723 -14731 260561 -22911 -119985 -173670 -13665 -203227 181682 -160670 153152
23731 149629 31571 -21854 -83639 -197683 -105688 192106 244740 -49607 -70926 13403 77303
23720 77303 -358716 -183262 74490 204722 281237 -385004 -38962 8414 98257 -110926 99645
23708 216177 16362 -267716 -82131 85763 203975 -166382 -211046 186135 154031 -224277
23697 41777 18064 80290 197109 192778 109223 106020 178435 -8456 -146292 -202066 217028 80511
23684 -113425 -64321 -278904 -233290 76580 -13223 281703 339157 -19501 3697 -53572 -129733
23673 -129733 -58422 -143066 133848 -112661 -173470 -181374 -46712 124229 -421464 141186 57673
23661 28034 -218548 -151713 -181188 -160046 32825 -299208 142901 37668 120575 -251087 145221
23649 -17197 105106 96114 -145560 -119068 67044 52737 199550 176002 -163849 -192420 -243567
23638 -243567 -75463 -395901 -170676 -64492 -137800 -416832 -311700 196871 -115582 134486
23627 -213242 244561 56521 -78740 199348 -33302 9234 248917 -29581 168422 238698 146974
23616 146974 144911 108920 107766 54898 -124914 -212495 78690 353165 242612 -237393 -4993
23604 -51129 -200532 53491 96224 -104401 17848 -131027 -94029 131237 -424419 78955 301330
23593 301330 -63048 -201182 134980 -60826 100922 -24495 -189022 27338 209625 313533
23583 313533 -224586 77784 -135884 43905 -301181 161446 289166 151147 53488 260178
23573 260178 82681 -126245 -23692 264655 -97918 -273343 306391 -4537 318673 -83243 -32946
23561 144714 48675 -274704 -175528 -64356 -248162 -22833 85499 263916 262361 -210512 -477697
23550 -477697 -16160 307339 -9752 -197701 -164450 -264314 -462573 65446 97918 252824 37829
23538 -104426 -26803 -36912 -68313 -107155 -334435 155422 -70263 122256 -252885 -66869 131073
23526 -224395 -266099 -9393 -450 108157 -177755 58097 -262796 -301074 10263 80325 -122561
23514 70864 -90216 -202259 37932 112760 -34634 -107734 -123975 -56477 331051 -14295 82974
23502 -29494 47580 -142954 260141 70335 -102766 -17361 -226194 24608 -106803 5382 -244325
23490 -115472 3614 220274 182650 -43604 -767 -187595 -136730 -249640 310615 80061 -140292
23478 152849 -182222 98914 121811 -239033 -23931 -140073 -191834 -203029 -46056 304290 -60931
23466 -116584 -105649 192920 17947 22070 -79881 137596 -81054 251637 141003 64357 -143211
23454 -36586 -169902 -247197 -29748 -288302 -166205 93171 -166818 79256 -217511 104100
23443 439927 155828 -95795 25324 -56379 29073 130718 -71984 214865 275166 49054 11389
23431 -127027 285891 118050 18305 -204159 -318832 34481 -65488 72821 11693 -122398
23420 55535 -230812 -122895 25365 -16516 47580 260031 88737 -252384 257656 -285980
23409 -220700 -130789 291919 42085 90251 -34384 227365 170591 -42635 -61768 65591 -187390
23397 -6476 -27871 129553 219088 -179884 123517 -86841 49139 -355146 -156282 -149246 -76216
23386 -76216 111155 -216970 -382787 208047 -124309 -158580 -95362 332765 -237385 51617
23375 237765 150479 263388 216124 38532 75378 -174524 -318727 -182476 -49006 -178031
23365 -178031 -72556 -123882 -151750 -100067 152099 35171 -232738 -131492 -205589 24657 -125829
23353 111845 -129859 242735 -173281 -113051 -181990 118509 -102205 -190133 -203988 75367
23342 -135216 -243342 140734 -180000 17598 -55496 -224322 189414 -286819 -11959 5335
23331 43866 -25695 -87440 48471 -62351 -65639 43380 326014 -127241 -2844 70235 78811 157529
23319 157529 336203 35646 117846 -128243 -176028 67614 -41204 -228041 -4345 -50610 -77510
23308 -77510 -115018 -67449 -344758 -116350 -101009 223938 259290 200031 109796 -249925 -62286
23296 5462 -15275 -90707 -100119 -63897 252121 -106301 -92070 69577 -181800 106313 -138920
23284 -241894 -12157 -52108 62994 110740 96810 172395 -160619 16596 -168788 -23956 -59017
23273 -59017 -134298 47943 16325 293963 -60315 -150684 -153133 -69826 -161578 -352581 -87220
23261 105605 143472 -225909 -2447 -39658 -158145 51107 248182 -209149 192547 103969 435603
23250 435603 -56564 -344516 100582 44424 -2343 -53962 -115179 52039 157648 123926 95283
23239 95283 -13990 -264535 -170972 -60202 223473 -151220 -129699 346595 175997 -160325
23228 -264503 -137348 -144183 -43292 -72932 -230575 -58425 -77460 -80330 -362750 184842 -137760
23216 180919 -37381 -98045 -324642 77538 -415382 141294 -50588 86951 -319516 131547
23205 -305891 -276259 -267494 -85414 -52392 9695 -201634 113269 -149922 -122183 -72560 -230603
23194 -230603 -243558 -231110 -62258 -240592 -142855 114612 90689 130095 -209171 -37992 -37073
23183 -37073 24307 -159560 59303 68086 -305249 -113381 174687 -23504 110259 -289070 86120
23171 35523 -118590 -191423 28363 -611695 246566 -448416 188171 249072 -125965 63341
23160 88574 22922 -129286 -196581 34001 -234696 -430117 -329448 -302634 119388 -140862
23149 384076 32794 344622 101951 216019 24892 -117559 -512 -211849 -133598 -171936 -206120
23138 -206120 -301827 100598 7711 -89425 29640 -79238 -177681 -306257 254229 172062 255349
23127 255349 126240 -94973 -251534 30533 -303187 82279 -46928 291824 131235 22396
23116 73877 62597 115403 -321314 -45615 125727 -79917 -140067 -154969 79762 -89766 -169009
23105 -169009 76788 148474 -166746 -86826 96020 136555 -131859 20993 13501 310135 -4974
23093 -89955 132409 -182162 -48465 26009 82789 -43496 105163 130001 5615 -150176 -80651
23082 -80651 167625 -134384 -59793 -91552 -133102 84569 -30058 -85652 90035 -158410 -173965
23071 -173965 -47453 73507 53547 27685 -45010 -317133 -251686 183081 74724 49483 227306
23060 227306 -129317 -100216 -175301 -122114 -223388 -40399 238462 -290716 -78234 194491
23049 -179509 -205656 104685 -36766 -191796 -336002 174676 19519 13302 -33567 -97370 288353
23037 90756 84970 166320 170412 111380 -100691 21812 74349 -274271 -140939 205237 107178
23026 107178 17787 -323061 -33471 182563 -335887 71051 168257 102503 -10513 129045 100663
23015 100663 297616 -222595 -232128 -201973 -13820 -9214 -24388 -193191 436965 -50048 -27713
23004 -27713 -132845 170740 195251 -47328 -111855 12008 -19228 -213040 -207917 51457 -404382
22992 -361944 126252 -9637 -72254 61604 218473 -22030 -204639 -144992 85682 170687 52960
22980 -240527 -178622 69390 -389312 53787 100536 -183088 -369475 34092 -221740 118658
22969 -90775 138483 -138683 211324 56980 191674 -207160 9831 -65765 -186935 253519
22958 -232204 84804 -256782 -143069 -89709 -10270 -380918 112841 166226 117763 -34870 351695
22946 254956 -209509 420110 -78411 237477 -208643 73484 -416701 -39876 -170885 -239655
22936 -239655 134620 18253 -108235 198436 -11163 37131 152995 128655 208132 -75347 72031
22924 128290 -229381 -110825 -261546 -42021 -113092 -29963 -98912 93025 -89629 -114392 -130294
22913 -130294 141386 -392571 61659 163970 50180 80445 -61068 123014 -45260 -365810
22903 -365810 99990 332741 477963 -325900 98402 89649 84058 -263873 198842 27987 14887
22892 14887 -90695 236493 36422 -288402 -53936 17952 251862 -331252 -556 -193357 82217
22880 26075 57581 19346 -66951 5654 -140235 176183 22109 234282 -39234 194969 -41643
22868 -47256 -5556 -75647 -78935 93583 215589 -18185 -280092 -287394 -77618 17142 -213277 -191819
22856 -191819 -164489 -69055 -175450 16077 179744 -303512 -185920 -308807 -390024 -94822
22845 -128805 -24682 -120180 -269911 -229764 228105 -31840 387291 249154 300158 29515 58208
22834 58208 -58663 -178775 39912 149211 -236663 -310308 -17171 -70457 270090 -20296 -42393
22823 -42393 37041 -174809 -331779 -12279 -61576 -79601 -40602 109433 -140912 -42561 -11667
22811 173496 -369516 -42860 -215590 -315854 -157865 -144482 -69030 9382 -57245 73371 -98692
22799 49724 -63530 -2281 -52611 2328 -253711 -210475 17401 427071 170287 -331646 -91192
22787 -29396 59240 -108805 280398 101976 -71571 87703 -155712 428912 -298989 -87029
22776 -11430 -227687 23266 -127888 -52913 -175685 107424 118086 223107 97216 186498 122158
22765 122158 -307653 -199319 -26392 101151 -297652 -90651 -14255 -189332 -194071 127591
22754 -61506 -312571 227960 -88139 -93324 99968 207383 -369888 22898 -87738 202731 -183868
22742 -8666 61456 -30709 -191601 240934 -4573 -225647 -484680 -28489 77997 56475 -183457
22730 -400920 -209782 -157409 253773 64318 47766 -51377 261022 -110101 47179 -36590 -166192
22719 -166192 67061 -188123 108857 -56773 -164129 -21387 11939 -46178 53359 -224354 140116
22707 -15860 -212960 -265048 -1726 161798 180112 -251230 -52019 251081 57423 -29830 -17050
22696 -17050 -255944 67407 -207783 -112137 -6155 66866 -159333 -269673 -105703 -123445 21372
22684 -6127 -111351 -44221 -92949 -338314 4055 -399256 -55832 52187 -79351 7171 -98725 -106797
22672 -106797 -224003 375643 141882 -224478 -319949 257240 -259100 234719 38135 306635
22662 306635 -133509 -62176 327133 64152 37745 139126 979 90399 -96103 157595 23802
22650 54994 -215481 -22640 100771 112777 -436093 -63937 264923 187307 21344 -157976 43951
22638 -239754 -280047 57114 -404712 -59601 179822 111311 -82425 -232123 -246547 92375 37478
22626 -117097 -22422 -32558 -129237 193980 35208 -221408 128328 -125794 14964 212233
22616 212233 -69905 -178068 181863 -53508 6936 -40596 -23655 -89525 -373995 226774 -189376
22604 137517 188270 -200896 -68421 -48770 125829 -52405 -66256 -97974 6289 35984 212664
22593 212664 -274087 130250 11371 -224162 161749 -326210 5192 -33594 -35866 155596 309611
22582 309611 142255 -339 -222386 -66643 -49234 -43319 -46767 122725 97351 -67643 -102967 -2551
22569 73139 -89154 140896 93487 93377 -23492 -281671 -329871 188706 81470 39808 -359818
22557 62504 -554709 15855 -204039 -204740 141162 190002 -131596 -270799 186058 -129745 -181406
22546 -181406 -62011 -308220 101567 44900 -80567 -59132 237412 55994 293463 85202 163280
22535 163280 -225972 203397 -172335 -452823 12300 84013 -137672 48977 -213745 -1154
22524 -247634 -100757 -114866 103361 -217817 87918 -149440 -107208 6397 -121585 347536
22513 -234134 144106 -343941 -44128 -260371 159177 -35291 -78255 61114 -128741 -8062 -84141
22502 -84141 15106 127413 296774 -266009 -92423 162023 -165737 -35808 94670 -112350
22491 -46377 12195 149474 -73056 -24174 172988 -248736 -231876 -98211 -287467 63294 172602
22480 172602 -169072 -26333 -50950 73408 -169178 -3803 135285 123363 137322 -170357 -300927
22469 -300927 249907 -308021 82957 165779 -229852 -173206 274319 -155125 86110 -141789
22458 -181336 -7471 40562 126817 3107 -321655 -25860 -50282 152626 192232 -182177 296990
22446 268215 28449 11438 -275689 -44097 94007 -193963 48374 -209067 157451 -6003 -221366
22435 -221366 25714 -61128 393 -130495 -62463 -102180 211493 -28293 251183 -9131 -77556
22424 -77556 -8544 -1282 128622 33377 354947 -187385 -67695 -46851 -357279 123464 99404
22413 99404 5285 -82198 -135926 276037 -170950 -107040 -38274 -147018 -132847 13546 351159
22402 351159 -158823 147359 -49101 -154509 39250 255412 -22561 185470 121179 -70250
22391 32765 57771 -293112 -223841 224949 -103602 -116682 -313521 39289 -172409 103816
22380 209397 7886 -87930 -253020 -35836 -40146 1027 55807 140125 -333293 -292718 -164131
22369 -164131 180482 -119973 340029 -150228 -101182 35757 -257933 358038 56114 -179185
22358 -56432 13713 59989 7130 -109964 -128254 197022 -14386 76296 53333 -31297 -40640 -459917
22346 -459917 -24928 -73935 -103249 -554549 51915 -135496 -85680 57658 -72558 93253 -47052
22334 -169432 61162 241031 -12985 -166966 -36165 -76426 22722 -10942 132292 126481 277485
22323 277485 -312741 4363 -31836 -98747 -297134 -99115 52929 -26953 -235088 -55178 -174153
22312 -174153 -32318 90486 161606 -156572 92606 -167569 309894 -68397 -167197 -255239 -121591
22300 -145836 -205507 -82530 -324028 133019 149551 95328 -90165 197729 -25781 -209124 -217523
22289 -217523 -199826 44552 -65741 -250018 -50057 -174452 -64075 -66990 -169817 115919 -290144
22277 61550 79502 -227646 -111538 209602 -202798 128315 -47133 -237520 -111071 337430
22266 134800 -256476 -117948 89264 129468 14167 -216167 -180963 195978 100948 -82084 149037
22254 -6973 -265171 -244743 -234335 29470 -193826 -114710 46910 166749 33916 66116 -161493
22242 213167 -67220 -23197 312951 52961 14980 -34799 215242 -17722 78381 -104906 145067
22230 14732 10374 -89350 160911 -75614 -107249 -21628 -188964 133211 56279 -144049 -96795
22219 -96795 306843 101169 -29527 -198201 -94013 -119088 -7653 -161992 -93057 229875 -114719
22207 1439 31148 151809 -15521 108251 84343 29884 79992 6763 19774 28623 -157477 179652
22194 -60271 7413 31634 -10865 -83285 -84341 -279232 -26011 -71639 177410 -121459 -189693
22183 -189693 -132069 122982 327221 -418670 -209377 -31284 68759 4447 196199 -132765
22172 136950 -211577 -376 13030 -26719 -11989 -162763 -11141 -46608 -246673 -65 197886 79013
22159 -6773 -132399 -148 129225 95690 2785 -228404 -220191 -63087 258015 39352 26121 166320
22147 166320 -133497 -73078 -37390 258537 -129210 -13747 -25072 -40242 -94910 -215443 152172
22135 143268 -137364 -112500 -37499 -53607 -224144 184071 -141609 -318855 -141518 1394
22124 -152780 -126413 17463 53317 -152767 50172 113128 164716 -230531 -94276 165468 99599
22113 99599 117447 48804 -65719 -55757 109101 -169865 -146725 -209593 -112370 240017 20481
22101 -81940 -120548 -78338 180093 196868 147385 -128275 81218 -107389 -117690 98389 -221246
22089 19836 304546 -31390 -96871 20888 148705 64481 -39971 -55394 -164000 -224256 -29361
22077 -71420 -39525 157767 -424315 -293651 -234785 142288 142054 -26888 74403 -191671 83222
22065 -411202 -36968 -17484 -177916 43329 317082 214814 -250488 -168637 -88036 -312722
22055 -312722 -169295 19486 106155 -37979 13306 -198717 -105702 57970 -111001 28567 54300
22044 54300 -211145 -271007 420612 -325912 -135463 108649 -274219 -92390 84678 -56686
22033 -13528 -330687 -559725 8503 179412 31922 25968 -261321 -173621 -166804 40166 -73263
22021 -256999 -121291 -325944 -196236 -199724 -59444 -115836 38781 -190473 321420 -195817
22010 38523 -217774 141680 81603 241188 20083 78771 -164596 -295850 180221 67926
21999 92433 243305 -239631 -127122 2815 7353 56763 -286191 -341889 -109792 110708 182066
21988 182066 -71025 1041 103418 121273 181527 -172129 -138559 104347 202499 -319976 -29039
21976 98210 32186 107668 -81564 -40726 17647 -76724 -69541 -211412 17863 -27583 -262151
21965 -262151 83583 122371 -248674 182886 43039 -42667 -456618 -116914 71443 -240995
21954 -153203 -94306 96099 -355521 1120 23618 -409221 -383257 -44309 -205058 75455 66469
21943 66469 -1633 92652 -112349 102139 265019 23438 574556 266854 31266 -218795 324482
21931 136703 34770 -10882 -80403 -190622 127043 44385 104114 -8136 253384 189461 353421
21920 353421 -34645 -14686 232624 -41489 374618 -36547 74264 -116484 148061 60699 -9461
21908 41522 34597 -236795 -87581 -161054 -309563 227568 -89215 -196443 -722 283071 167226
21897 167226 -467011 166478 -151559 -292625 -113223 100534 206829 41358 -167570 -254058
21887 -254058 -172052 62179 -221611 -351537 197214 -88106 -141286 -160340 393203 -65718 -251211
21876 -251211 -152516 -188187 -206464 -11439 -190176 -1675 -100825 130967 -199817 -21237 -221984
21865 -221984 125643 -156989 -185596 -40060 -377276 -127631 -221930 -156268 1227 -232711 -44787
21853 -355917 75998 -14210 -74996 197165 -105601 -90796 498 -73749 -67738 -11215 -427546
21842 -427546 107648 -166595 188356 -259765 23280 -86201 -88603 31552 194737 153052 -190923
21830 127039 181 18830 -19520 -141020 346067 60980 -454206 -122756 18204 52758 50427
21819 50427 -393445 410325 -122097 -5033 -240116 -9982 -35025 -196791 149189 -428482 18161
21807 -247812 351898 -144512 116613 116295 216813 -183881 -170941 -47759 -90926 -150788 66568
21795 -356736 244831 -66003 -23227 -69765 139289 122984 -115689 43204 188498 -244303
21784 292169 -377098 -94855 -59887 -36334 -102369 360781 -83130 -130713 -210382 -181173 -230076
21773 -230076 -146687 920 2058 -95249 -15743 -123454 -94877 -119316 156402 6229 81169 -132478
21760 12546 27075 -7235 -247970 -117021 17813 17047 -6902 247332 -255574 -168833 -193473 -115739
21748 -115739 -237139 -161638 -410509 32266 147988 12131 -274661 423529 60256 80330
21738 80330 -22437 261360 154056 -175984 -223067 189397 -232970 -164222 -200605 38332 -305612
21726 113626 76263 38806 -193637 -62243 69934 -82039 -331799 -152795 180160 -293784
21715 33685 77028 162278 -27230 312462 41356 239363 203627 -297043 -84662 -148480 33420
21703 4214 -108714 -336518 -43137 -245437 160753 135866 -154558 -178949 -194679 107822 64843
21692 64843 95496 -84239 -100632 88645 59799 191696 -87421 -47452 -169443 77382 -160266
21680 -8269 -29134 22565 -277064 -74827 -163182 269376 -61569 -275220 -242773 90527 -43532
21668 -204572 78021 -179134 38691 242885 -25119 196817 -138683 127086 -137650 223644
21657 -73461 -347643 -5983 -176102 227972 83502 51503 -154098 81000 -297032 -217567 -75814
21645 56300 -24490 330973 -91138 -94702 185553 84275 54260 -168201 -371848 -7895 140045
21633 188195 -185109 -149112 -13838 34999 37444 -70004 66622 -16393 147870 -80083 125537
21621 -243077 -32237 342981 59752 -119291 -334501 -112502 -192289 26628 -26162 -31183 -182239
21610 -182239 -117477 -176546 -198935 191489 -318827 -180094 45414 -170951 -145601 -73789 -47373
21599 -47373 -195550 -140240 274732 -17356 -24510 -200307 -235940 13459 -14912 82769 93848
21588 93848 -96909 25286 -31959 -121088 47154 -234739 37794 -340948 218920 93752 87745
21577 87745 181014 -89613 -286754 160554 211148 -20579 -65269 -372445 -172297 87432 -114473
21565 -2174 34599 -91842 -16220 36740 -8373 -90258 -107307 68025 111376 191931 -237805 -98612
21552 -19287 208777 103846 139235 12848 -130043 141195 7349 74282 60143 -254743 -113672
21540 -372627 -118894 73612 108519 70672 -105157 56025 184265 -43740 -33236 -8779 144
21528 185419 159711 -135176 38576 -73041 5266 11458 157672 -147946 -235393 304512 -104891
21516 -118600 -182761 -156962 -285487 87509 87041 -49749 82483 411068 104843 81077 25461
21504 -186881 -69678 -141833 114964 111405 -38124 -265458 -140970 -141790 8472 -146032 -79613
21493 -79613 107157 76765 -155917 149300 -8986 342672 28271 -115784 -380746 324589
21482 -53066 -74941 -151087 -21988 213207 -145663 85807 109059 83188 -40770 -123235 1115
21470 115738 -193687 -120046 93852 -13695 100188 -260681 -72527 -318155 -24340 -153363
21460 -153363 166809 -40191 -31115 233624 -25405 90217 -118518 -85860 -454812 111498 -156352
21448 -118298 330167 116257 -69582 564993 101841 -72016 -41905 13482 -287956 -18633
21437 -340012 -31343 175901 232634 8261 -21067 267158 118589 -392985 417205 103935
21426 103824 -206796 213086 369728 268349 222842 388181 259892 229545 -230186 439975
21415 9943 -135174 86239 -140494 -59479 273030 -202516 -16380 47506 -204263 -154392 -75066
21403 -232323 -12368 -38744 167331 154330 48093 -116966 156645 -335975 33205 68811 119433
21392 119433 -18573 82056 -123194 157039 32165 150452 -239807 -149466 -343019 -272559
21382 -272559 -73747 -161147 -249789 318296 -138698 -6381 -210217 -236792 74589 -72713 -41823
21371 -41823 124362 75222 -41843 97473 -340152 -37468 20058 -184667 -225606 -50228 -294922
21360 -294922 -102606 35524 -179855 -42045 -168463 -220926 59089 -194289 10862 177201
21350 177201 -413340 -108763 -166652 -155525 -17146 -171465 -291887 -75594 122568 -68310
21339 339858 -113166 70468 -114663 -225723 -53452 -63738 -5536 -2244 132521 -127358 -289563
21328 -289563 -152372 -237951 -71042 -49056 42713 -121653 -186115 47378 96534 -102918 167363
21316 83208 -18016 -247763 51509 203927 -10850 -94511 -336985 -320559 -120334 -215737 -44694
21304 -325482 91597 -255300 -97797 141278 279678 132055 -229491 -74607 97198 -361056
21293 136423 138500 -39648 31573 -187683 -280499 -210917 85253 -290938 -132434 -35973 163955
21281 -175775 -152495 -213693 68921 279480 11778 -15559 -157366 -287912 10719 113225 154595
21270 154595 227996 -198072 103813 -167929 -274036 172810 -217441 -92441 -45118 -36708
21260 -36708 -144392 -107667 327365 -56760 -219813 -99973 304057 6807 68148 95973 41320
21248 -263383 -257208 -312654 -77264 152490 47096 67110 173158 -70086 -174758 227891 323965
21237 323965 -301135 -89539 -89440 -323762 -60636 12540 -121512 21123 -300038 -108851 257835
21225 -59965 -168035 303179 -185412 -341061 -36556 11432 -101501 -295113 -146470 11435
21214 72102 145570 -93868 52552 -7033 -33060 -109457 77071 -602619 -161458 -277389 -12009
21202 -45904 -117483 -187458 -20024 -33743 -268165 114248 -51868 36606 -28134 -175 -19077 -91224
21190 -91224 -303844 -252209 46757 -95726 160355 84869 94296 442159 -132670 102935 -168087
21178 -102750 91937 102867 26167 -115459 -107294 -206791 -380603 -250345 37964 -245657 -70155
21166 -166305 -83214 -276076 -54228 -134113 267784 -269383 145005 -454569 93171 -236500
21155 164541 -44459 253520 219185 -46507 490528 114719 -123749 -120175 -38285 142694 109952
21144 109952 -37920 -73389 -226708 -5943 26977 -278631 292686 -132008 -187350 -78369 -123666
21133 -123666 -31286 -49690 287 25763 -133161 -88515 -290717 -48150 103742 -42503 -41557 -390442
21121 -390442 252723 -263986 -152593 -43758 -264133 50234 -185927 -22391 33612 227529
21111 227529 -81337 42238 100283 3726 109969 15387 -191108 -214678 24961 54119 -140203
21099 35493 293579 30007 -207271 -245796 -174342 -227132 -125537 -464022 -76000 279271 -186651
21087 -198039 107623 -143579 242330 -325776 -168158 83526 -133035 -177348 6335 137361
21077 137361 54135 -54213 -58406 188491 41688 470016 12487 -179828 -139064 -2444 -20560
21066 -20560 16035 124294 -318676 78808 -183076 -139149 -98634 -142046 -223935 -93308 -106965
21055 -106965 -119017 -162274 -58883 11004 -67445 -456458 57744 -94657 107185 -18979 -170126
21044 -170126 -121899 -84472 -56362 249333 -101 168024 22469 126055 -206869 -184841 2546
21032 162598 -68872 -327598 10847 44399 -23078 -179024 142391 56163 150092 -319946 -37313
21020 407844 -81988 107300 -84954 64064 -10778 -189267 -27025 -14425 -69590 -24549 115542
21008 -2463 -46825 107660 -199817 -22557 -116150 -183695 -55616 140279 -181138 -6571 -64454
20997 -64454 -155335 -147818 -122833 -32291 -307403 -108186 -266944 -312945 -255881 -96734 -55856
20986 -55856 -6844 -222802 -221219 -329235 -414515 -18204 167099 -155038 -135006 -44587 78378
20974 -72146 -190216 -260048 -80582 -318768 -145148 -181069 -141428 -101429 -146708 -1824 154068
20962 -90788 -156741 -43512 -10368 -270868 2156 -234089 -60682 -51276 121458 83865 -151526
20950 10848 81933 174630 -9849 155808 -60597 128434 170948 -191590 22110 -3130 267837
20938 -245497 141723 -241058 -179700 1732 26586 -32881 -2664 61693 -10976 -123486 162414
20926 96342 -243280 246062 91142 297929 168025 -335631 -140076 -328559 -44831 -253862
20916 -253862 134835 -121114 -26168 2002 -11322 58320 -214612 -461525 -133627 112706
20905 -365845 -149437 -444765 -105194 -246930 -40188 -257370 241091 251621 53345 100019
20895 100019 -107484 -90431 28906 -48676 -307743 -226262 -103821 165092 -11269 215520
20884 -14347 22947 85430 -66644 -126238 193954 31597 -178461 -37664 -94750 31608 42777
20873 42777 247880 -269120 -206558 121896 70086 -248298 -225519 41296 -119853 -14324 -89101
20862 -89101 -146507 -303678 -26318 63878 384718 160985 -139473 69770 115151 117743 -41914
20850 -253195 173689 50067 -93422 -267719 382079 -142876 -92621 -169858 -88836 319034
20839 77649 -414389 139366 42651 -184734 -192707 251591 -184012 279210 454741 -140565
20828 45217 281516 29189 -184518 -106892 -159878 -137389 -132982 94883 104021 -112395 197878
20816 70265 153361 -213868 -109235 -456318 51757 120704 -279306 -220507 -29196 46623 -236318
20804 -105260 5334 -107165 34217 -82705 116738 122715 34463 -158027 -259602 -16943 -132937
20793 -132937 -194855 -434137 210434 -132681 -140081 123706 -284526 -60974 31346 26892 -89336
20781 60369 111828 -173315 73035 -171144 -73503 237272 -45845 -114904 -322274 -16990 129277
20769 508481 65126 -143883 -159576 -16697 -124768 -121353 88855 213088 -100854 163011 53090
20757 45606 -124247 -3876 389667 -668461 -38812 -175545 30685 137823 126050 48704 -133107
20745 182809 -286400 -162116 163909 75721 -189419 -247205 29443 -14359 105979 36055
20734 -201741 131282 102717 4804 11541 17862 32679 -210656 -100236 -3004 -5473 -362850 144819
20721 -33189 -258329 -149335 -15679 -9148 63828 -232785 -155476 222920 -304968 50455 -16913
20709 189937 -295249 -115904 -278695 205626 83832 -213940 -198967 179008 -308958 -108804
20698 -14364 -31492 -76456 29990 -290627 129257 125419 -12798 55308 -82207 47428 -9240 -29521
20686 -29521 -42977 -164326 120158 -195606 45542 218890 131028 -136088 9319 -293272 161960
20674 273036 -209275 38694 42697 -761 112874 60414 -378299 60953 -410375 -419302 -302515
20663 -302515 -63011 -115399 -143486 97390 -101522 20339 195524 -177078 -32908 -118168 231437
20651 207911 -52101 -363550 -167281 -154607 227509 37959 93254 -69907 -243157 95575 -283077
20639 -297313 -66272 -226985 -236310 -209104 -167100 -10166 56382 -227633 -216837 -391007 18901
20627 -143925 138753 -160193 13494 -117638 -25435 -319775 -278473 -136457 -102386 71077
20616 -305485 -79835 -200117 -112027 -40574 397586 137873 -97963 108942 3531 -197998 -46401
20604 -39817 213551 26768 -27739 -31239 -280541 -108181 98429 30290 54234 -108348 318602
20592 68616 67812 -182570 -167405 187965 -155966 -23033 -245835 -364741 -547356 32360 70592
20581 70592 -130986 74002 -220465 69775 -196776 33908 -168292 137832 99029 6818 -176111
20569 -218084 180919 165065 86433 -324435 24160 325182 230972 -161198 67083 -205217
20558 -106914 -61652 303742 171871 196193 -125245 129570 -143728 -64850 -143055 195208
20547 -9174 -54886 -151619 -152637 5282 330632 -222429 88024 284765 113218 -202688 -34076
20535 120535 36533 -121800 -289059 21443 236635 -239851 232019 64715 -470355 158376
20524 120109 -90421 -62985 -72792 89658 304815 165393 -282734 -307685 101879 -188295 -70631
20512 -271319 -45296 -9995 -5168 -128679 -252735 -161928 -219261 -47681 -265634 -70678 -60510
20501 -60510 -385386 -323228 -102765 235805 291474 214842 -183285 -159639 164046 -431323
20490 -131818 197162 20361 -287678 -53254 -78627 119708 -35934 -216242 -6179 -11515 -131790
20479 -131790 6585 87738 -160723 -20389 -17729 90144 -66061 63555 -175498 280469 -95054
20467 -45853 -44091 110978 -175653 -238246 146057 77253 -17295 -52753 -226098 -91692 -116089
20456 -116089 -77080 -171035 -47941 -258715 163483 -126801 124018 306307 121134 -54265
20445 -247032 -1888 -151018 100229 374289 186746 1708 -149990 -44631 46255 183166 -239516
20433 388018 124847 84598 -120891 -147926 -2377 -110720 -188518 -263911 -190948 320279 58286
20421 75981 61973 24345 -59126 -80272 -156662 -65446 635 -84310 -186824 -183217 -16828 2080
20408 -30856 -148319 67260 -108490 -69316 60166 -52016 -61761 -618834 -6734 384235 71232
20396 -246121 -235907 -343313 -303154 -71064 -95991 104348 -316758 91471 9262 108641 -141125
20384 -227213 -282767 -152002 -189592 -306145 207689 247987 -229941 116491 -409219 221079
20373 34928 -196061 -54942 77097 10473 30216 -106549 242023 -293805 -106974 -55442 -81840
20362 -81840 175519 285633 -229815 65843 72321 -362640 -71468 -209203 26986 130008 -110921
20350 -371538 -250654 165380 233826 -94931 -139390 223547 -73551 -13146 -186617 479354
20339 -234780 115473 -295833 52949 104169 -33906 -61525 -6549 -457053 -129556 18864 138069
20328 138069 39872 -114106 -208120 -107317 -173035 -283470 -246568 -81107 -18157 270243 7787
20316 232005 -94018 -40656 -75866 10522 -56290 -118399 -165791 -81530 -222239 -198400 -186681
20305 -186681 -88173 71347 -128825 90307 152878 246638 -23501 124810 236494 91384 -156284
20293 -238211 163986 -114905 141465 -201888 370798 -163025 -132609 -103045 840 97175 -176721
20281 -187613 -142706 -285724 -100127 -110236 -242107 -198417 128667 -14755 119748 229490
20271 229490 -21368 49183 449537 -81035 -94827 472784 -329672 24753 -48872 82411 -31629
20259 -101977 121399 -277645 -162660 6344 8454 -43068 138290 -4596 -35704 -111987 93725
20247 -184330 293843 -120548 554508 260022 56628 -324774 -440458 67906 -205418 -146159
20237 -146159 -249512 -30584 -21810 148121 -23838 -451421 50685 113273 120109 -94799 -147901
20226 -147901 -224454 -272573 -112705 -207030 -86833 -130082 43453 -130914 -396541 -62860 66599
20214 -193077 238257 -145487 -123068 -154573 -36853 -164508 -208479 22814 195971 -59225 -52160
20203 -52160 181826 -105908 -10008 62869 -336992 -154815 -55924 -27947 168447 -276370
20192 29321 300488 -130567 64283 -133794 -129614 -36077 -96334 24315 159086 -293839 -146424
20180 81745 -457890 -70326 6512 -177466 66069 226971 -425853 142764 -117066 -143246 -232680
20169 -232680 -222001 -298680 -359136 -272991 145332 42240 277913 -308863 -74663 -104000 30910
20157 353341 -203495 -253511 181731 -178711 -110363 -163303 -105699 -143401 -163013 5671 155765
20146 155765 43388 116254 -22937 15949 -191404 -12302 117457 327513 -244440 -222326 60723
20134 39155 -224902 -179269 -91784 -113792 -222444 -197283 -94265 143404 -243165 118679 77842
20123 77842 310685 -345712 -303082 411258 349772 18651 -317208 -128852 -15023 305609
20112 -68348 222317 146108 80164 76963 199547 -284536 42630 4013 -82479 132474 174973
20101 174973 -391104 -89221 -162456 99775 -112941 -165309 -85659 -299329 166024 41494 399814
20090 399814 -30047 -177112 34900 -1718 -208862 -174392 263393 -322556 128904 533674
20080 533674 78443 -74573 -85018 -154506 -275496 -194926 -6472 -102840 -215077 -385384 318431
20068 60380 -166191 -51177 -379153 -227765 -189793 -67150 -156693 -126845 -235762 -162655 -70552
20056 42506 -140260 -116429 18538 -247156 -272304 -362421 -50622 250949 353177 5167 -68692
20044 171597 -395645 -160363 -266707 -19788 -303239 -119061 204609 33215 -68150 -164825
20034 -164825 350486 -14632 -296549 -93967 229719 -32935 64702 84768 1825 276085 -27838
20022 26875 198519 -504036 -303213 -65145 74148 196017 -131405 -244732 -6536 -299675
20012 -299675 87977 -152022 -124291 -31300 -107862 -5567 182346 -123850 -258622 -195270 14823
20000 9063 -174503 82486 82225 -123592 80104 -303457 -94435 240785 6951 154420 -119209
19988 169619 -16753 -360950 -288983 -172833 -319112 18407 -279363 101286 157715 -156842
19977 34111 208838 -256265 87080 -34226 -37512 122083 -254967 19897 96818 -4340 -345031
19966 -345031 -107767 -132306 -158875 -991 -92831 -18166 -78144 12101 -39936 62469 113829 -78029
19953 -43847 -170958 -50838 -21215 -8145 13181 -171783 83271 8492 -219076 139087 -107939
19941 -45836 65919 -260653 -49698 -39289 -301473 -170469 219625 21630 -65890 -108446 139630
19929 -95389 196944 110701 49170 20653 32533 243616 -274448 56669 -20415 53590 304160
19918 304160 -108935 -136846 -102436 -120031 16275 48650 -113511 -78690 -90901 45929 -33484
19906 99189 2160 206172 14399 46363 -116333 136484 -130622 71986 -234821 -18314 -147496
19895 -147496 -116841 -95729 -343288 103188 -95635 109322 -222788 -78112 -34743 -132126 -7182
19883 -271530 54897 -167019 -118866 112018 14730 62501 -151715 -187586 240907 236613 89472
19871 -27053 -58373 17774 -24845 -3605 247669 -90478 -68557 -309260 -208463 157967 22140
19859 411841 -426495 52606 -244992 121535 103093 -208966 -129154 49364 -7783 -75086 -24184
19847 77638 -266018 134223 -145916 -211559 -293790 -51895 -54724 -251478 -201594 -10254 112360
19835 146716 125426 -262178 -159495 17945 -60052 89163 -227304 60715 -255269 238969
19824 199422 -23867 -250492 -347935 206737 -262594 -176172 -227953 -33398 -43011 59873 240130
19813 240130 75089 -324078 -223902 17616 -55863 63948 -86994 12369 15417 69369 -79321
19801 73663 104831 218604 80489 -100144 -61135 -234363 -212492 88121 -343593 -110641 -126344
19790 -126344 236636 -249032 -14741 11632 -44824 114876 -250779 33420 -225550 -106093
19779 -383742 -147746 -52091 -55863 9539 -485486 170595 -122670 259771 2490 -147168 -293930
19768 -293930 -239937 342801 4781 -151413 -34007 -141184 55950 99897 203336 45316 42179
19757 42179 -181627 33246 281859 -103563 -211411 -3542 -164495 58498 29125 -292557 -336426
19746 -336426 39260 129222 116402 -138894 11935 -21272 347924 -235890 -107632 -44461 -27588
19735 -27588 166315 100086 103918 81317 -162440 -181807 -50290 -246030 -292518 -128002 327021
19723 -447481 -146910 -59194 228078 -283378 -234684 -24639 -170992 -198950 134722 168403
19713 168403 77524 160612 -182540 -68056 134152 -25346 -69531 -137264 -139380 194866 171333
19702 171333 -235161 -395521 -32766 144279 78625 -118550 -131434 -269997 -69036 -25190
19691 64284 273109 124555 -30055 19873 -121284 72896 259356 -18759 193327 140844 31013
19679 -100556 -148381 -125766 26452 -126605 -90823 88261 -180993 -32269 476355 179036 101491
19668 101491 -176779 -32684 -14401 221217 16289 -205578 10341 -63996 -308975 247543
19657 -156086 -124046 -265760 110151 77224 -93375 -75148 44348 -185195 64796 265507 -307788
19645 142253 -263190 -57990 -249568 -32757 7266 -119034 6586 -106643 163995 106859 178610
19634 178610 104424 445543 272916 -80234 206589 362336 23123 -90223 172426 -160135
19623 -310538 -74053 102297 15481 178945 -311288 301475 -461679 -116000 -24863 115125
19612 -78340 -221042 -84100 -315584 -196962 -90565 -16777 170565 -1366 -201760 -279174 -47495
19600 -159122 316693 54070 50115 91289 -225257 116276 62072 -362320 -223714 -215033 -243207
19589 -243207 -38872 109618 -12959 174611 5957 153227 -108546 75849 -201146 -324756
19579 -324756 182325 -87568 -198793 -149091 36513 -4736 -241040 176399 -448241 -39833 50962
19567 -80045 261933 140350 46891 154523 -195654 213891 -131395 81583 19390 -159171
19556 -7963 -81288 -62584 -71108 -121755 -58642 -61152 240014 -9446 96786 237434 -98139 -212160
19544 -212160 166456 -176493 71720 -355975 -134654 -150332 269068 -43829 -180214 -183495
19534 -183495 34988 -141694 212770 31888 -220097 53342 66935 11349 -47083 -92897 34702
19522 -393979 -59686 -179307 77645 -67881 -28646 -205126 -262079 -43809 -347534 5280 267610
19511 267610 -154713 -9519 -140870 -292048 -74065 -11614 87961 -284091 -18231 -16883 -68138
19500 -68138 -39510 -147305 146109 -148210 -99689 -70213 46530 30752 -53160 -232319 -41503
19488 -248636 196344 -315167 -306557 254318 -465679 -91172 -130131 44914 -296418 -103485
19477 192447 -156362 -79072 -5307 144687 173660 -53646 -21747 -40745 -125297 -139563 195043
19465 -209623 -14225 -154203 88121 -312259 79695 -420236 44083 -262398 -99046 144817
19454 151719 -67653 -182170 -487 -71257 -91704 366330 269143 28765 -308725 -26653 245076
19442 204316 -124085 -256517 -187283 -297879 -345195 -358939 -75537 -432544 19926 -428867
19431 342420 127672 -150460 -123762 -166051 140655 -299755 60664 -76016 125286 -181392
19420 -239487 98019 -254902 -128390 -112343 -321434 -122219 173804 45293 46510 99492 -165918
19408 -84289 -173111 171764 -162141 -10741 228093 -60408 -126082 49900 -140152 -4949 -260044
19397 -260044 -379684 -55341 62719 -204334 -47353 -268245 78796 -65569 -151712 118754 -181077
19385 20321 -110415 -82030 -114053 -156270 -11023 22887 -14569 -12391 -439818 7163 -143860
19373 81410 131894 -190085 73089 311421 -107283 279828 -2862 -129235 -3366 24053 -262614
19361 -279756 -217116 -179423 286176 -220994 -109149 -186738 211815 -392637 -44864 89476
19350 -74953 5182 -263942 -281190 28218 -153907 -55830 -58270 -3748 -339642 -91658 32338 74205
19338 74205 -66225 -157524 -288083 -230141 -218635 -31469 -219071 40336 -145591 -72439 -282570
19327 -282570 83164 -483501 -48137 -45092 -208150 -29872 -122566 -120596 -32122 -133493 -26292
19315 -149491 -128852 -51755 -325007 124356 -169174 11220 313032 320925 -140154 -227296 -118901
19304 -118901 175695 -126010 76622 -119735 -133129 -90540 -160399 65550 142553 128363 41143
19292 -41950 82301 -237338 -93781 -26794 54575 558 100916 40439 -149873 -283722 -161687
19281 -161687 -348998 355804 -160973 -160448 32864 -493295 96089 466283 -47780 172015 -144194
19269 8313 -150793 -332780 -37931 -140840 73443 193472 130838 77376 112917 -6971 -59040
19258 -59040 -69940 10335 -6662 -129360 138624 595286 -372799 -426603 2991 255893 -130269
19246 80430 -153570 -96850 -329500 -262915 147592 -141268 211638 211115 177010 65084 136287
19235 136287 -141224 61380 -167895 -217512 115031 -405001 20184 6828 -64215 -233541 -13474
19223 45720 74834 -99087 -27859 -236865 4292 60531 -187168 -230925 -389480 -310614 -111403
19211 -241275 -236905 184448 93734 13367 76218 7405 -28344 26332 286916 -167109 449671
19199 -33133 -46483 -59720 84853 96629 131543 -47866 -96321 -242960 79693 -149231 100666
19187 -158579 -321249 246256 157479 -38200 -187819 -87049 -188470 118119 81565 -156697
19176 294279 -78409 -51268 83349 -59769 67901 90943 -266358 119444 61302 -39369 -77184
19165 -77184 -20674 206615 -172639 160713 -93526 -170480 -278070 -24444 -119403 47073 -179916
19153 -88257 56917 15307 -237007 -64373 -48956 3842 -294055 -106456 19937 -75432 -183357
19142 -183357 -118090 -298747 305730 -76613 -264590 -81587 -113090 185532 -158548 -49207
19131 -278925 18578 -25084 -28746 19646 20311 304952 189435 -419580 286020 -148844 149633
19119 -105095 -253278 -126672 -175440 -168405 223038 -177669 35939 116346 -90336 -35659 -107208
19108 -107208 16223 121295 -121039 251652 88768 -205461 149207 -99608 199649 -160818
19097 -207423 -80937 271098 -35122 -231559 -216174 87003 -12630 -76781 -106301 -74917 248456
19085 101766 186227 -26325 -315827 61723 -162702 -97143 180291 -276127 -5254 160016 70978
19073 -204665 -22479 -134325 -26669 25143 -9906 166779 -255695 -170603 62592 -402051 -281505
19062 -281505 -220831 -329587 -250224 -344813 63843 -192446 202565 -105328 -22366 -37167 -85583
19051 -85583 -167812 -300800 29327 -232575 -39862 330347 269135 -233338 -21916 25820 -144025
19039 155841 -21254 -305897 165986 145357 46681 -13337 -241416 146004 -100286 248919
19028 173373 207545 70196 91082 -186210 -152092 138514 74333 196511 -22873 217815 -309435
19016 -187044 37367 142190 -111639 156133 252007 -248308 91418 -51578 78829 68152 -100927
19004 -179888 -323121 -18616 -154483 -79428 -9381 -216714 261468 -231184 100792 -16800
18993 34323 67268 61302 -27372 -253638 89067 105458 -292262 -2067 -298568 161167 -141701
18981 -57987 -195947 276112 260612 -62056 28881 125611 -244992 -6640 87480 -4329 282936
18969 -20973 -190557 -124845 -172630 -211787 165840 -309854 -127802 103816 -325938 204222
18958 -275848 162919 -20313 97892 -2266 81008 180954 -139231 151470 58028 -149976 181209
18946 83471 -111356 -265342 -255254 -371160 -22415 -6965 -337696 34370 -71321 -328663 30758
18934 199881 157509 -60866 -225038 -49916 -130130 -139438 65580 -120122 -291514 66189 -191869
18922 10094 -223182 -287556 -222429 -75417 45145 -510830 248238 -143488 -43458 -127361 -267955
18911 -267955 -391435 -219525 -45028 -66313 -136290 -92870 -52386 -202255 -76347 -388666 -49699
18899 -83309 -280941 -256616 378605 85647 157931 -249071 283941 -77119 -63732 82690 -149490
18887 45863 -126234 38411 -292765 -38898 39586 -458800 -204379 -204112 -1728 -250841 -44324
18875 -243121 169701 -400107 -101510 -118017 -56484 -177741 -286523 15374 205289 -21482
18864 -125402 -84528 -55048 -185537 -109132 -214610 130051 -402537 67053 56730 -243016
18853 40956 -63979 -190944 18785 -71555 36096 -274061 -278746 -36111 -228006 -169768 -158891
18842 -158891 -17595 168607 92826 -157443 31858 -138345 -138190 -79778 -366032 -134122 -18935
18830 77526 -68750 -182651 134353 307677 -120242 -115823 150388 -183814 2120 94621 -91944
18818 8933 -247839 -90729 197358 25587 12000 298055 23761 -64843 -282310 151086 92383
18807 92383 47728 -121047 -134952 108390 -325778 -32735 -286307 -179212 -158722 -99983 374692
18795 187273 445730 -156530 -99761 30803 664 103635 224370 10204 -23253 -334298 107727
18783 -101026 56129 -229061 -184257 -386444 -206597 136684 57387 51775 261636 163495 -277985
18771 -139474 53379 260727 228092 -21387 132630 -67468 -21060 -57999 114557 -276108 226577
18759 -212514 182690 -107897 364891 -158484 -56608 -118901 -229515 -290739 -17563 -128735
18749 -128735 -30890 -26642 86084 84038 141397 -265999 58566 -138599 139691 -101969 53473
18737 -23464 -212466 55343 -246521 78416 -8133 141024 195512 21498 -206185 -279343 -495556
18726 -495556 -173562 399976 281708 -8589 66762 -90870 -68552 254568 -8713 -238887 -19357
18714 42717 87866 304159 18057 75153 108385 344811 -11269 -2636 -212057 145615 13232
18702 292237 -101887 296552 -334111 239506 125956 -113934 57416 134255 -235067 -354766
18692 -354766 -130254 -36634 41874 -13671 34520 -114659 138409 -186596 -197493 -160978 460996
18680 98343 32986 -57281 -161834 123682 -424410 -9123 2914 121440 118615 -91253 -70616
18669 -70616 4411 56024 -362147 -329505 16793 -127626 -84365 -114390 -47740 46701 -224723
18657 -11344 -156021 -428783 -403526 -256836 -109145 144199 316584 -84671 -164352 -171093 -273475
18646 -273475 -158942 204912 146057 -39872 -35991 -144236 122395 -245342 34304 -306408
18635 85447 35842 16952 -94164 -177526 -36451 -198718 -277740 259840 -269938 -8458 -3362
18623 -137431 -84377 -206230 -284559 -51788 -217429 48962 -211427 -64163 -184082 -90833 -109284
18612 -109284 -21314 47861 -45405 175958 98504 5227 -46088 43869 -320881 163750 -82591
18600 -164576 -114962 199130 -181313 -139925 111675 -8889 156237 -75652 -328112 147708
18589 -163462 -76454 -17185 -24416 92091 -93873 -91949 -6483 -94517 44194 27332 -70106 -220197
18577 -220197 73536 -153320 71951 292890 -73676 200220 -127905 -185084 146214 -323014
18566 -150032 -723 222817 -96857 -471787 -58166 -491051 -165468 177022 -240579 -41831 74553
18554 -48684 70797 -71255 106850 -110405 -67480 -407521 -84730 185857 -42890 228838 -63057
18542 76750 78075 145642 55888 -377835 138779 -308247 -208684 88885 -193132 8458 119756
18531 119756 191645 730 -401666 -46488 159199 88460 226228 13129 -206000 -29103 154103
18519 -47666 -145165 53954 -30459 171089 -267046 -177061 -59941 -166364 -129127 -103779 169899
18507 -256456 -151839 44277 -34114 -390474 -301045 -151157 -252488 -77285 -109550 -308417
18497 -308417 -29907 -257624 -192760 -365697 252588 174842 181534 -275793 208461 -294617
18486 23523 -28172 138292 138293 -89382 -276393 176524 163882 -9363 -320160 115425 -130724
18474 -34828 -55411 -309374 -108980 -173017 129181 192457 -198437 108408 -155167 -121626
18464 -121626 264623 163114 140164 -114353 -94688 42538 -80556 138258 -200654 -59500
18453 174424 1555 -74391 -175442 -102634 -54747 6234 163164 -241967 -218214 93172 17115
18441 135483 -208471 78873 81586 176234 49000 -93373 -128200 8096 39474 170568 -55223
18429 130516 -196780 176548 -26588 290030 69151 38833 -62094 4255 -29545 164991 -98991
18417 -78276 194256 229762 -194757 -137429 16070 24293 57939 -408822 -99397 191402 -133954
18405 38688 134356 -253229 -86552 -88847 -6566 -202080 -29112 -107310 -14122 280481 -59750
18393 -276189 -177052 -82376 -321442 49587 131300 -79739 -204611 53089 -326320 264608 -60130
18381 4401 115535 -43609 -126618 -155010 -39199 40565 -260661 -83542 -272659 -176618 89497
18369 -90637 101820 122300 -47873 157811 -280068 186888 -71564 62691 -65673 154716 -224674
18357 12036 -324942 88885 -355772 79126 -228406 -206231 -14610 -133131 131011 -61428 62819
18345 -72871 406723 102044 59441 382738 -419710 -260210 -292863 88279 304824 -93973
18334 20341 2280 -124937 31237 -69993 20391 61671 -36933 -98403 154270 -167937 54940
18322 170047 -98562 166616 -110275 91414 -275292 196657 -42719 -162397 -142634 -221864
18312 -221864 -112402 -280932 -11925 -67886 -26775 -142688 -162829 -85583 61820 27688 -58599
18300 -187490 -239715 22767 -65607 -197900 43028 -348551 -158443 103174 -104994 434875
18289 -350239 184732 -15949 -117709 -36423 -177598 -391995 -10388 -332856 -19416 -158776
18279 -158776 90392 -104597 -119341 -162974 -242296 -45998 -90651 -52076 -348631 -335127 -44426
18267 5444 -210202 -27027 26292 127070 -187337 192128 -279972 -121488 -211009 136922
18256 168495 -302833 7024 -110658 -174572 -166224 41156 243396 198487 -193552 256925 160718
18245 160718 169962 179054 44939 -139088 265399 -144581 -26061 45814 -9206 -204956 -105126
18234 -105126 58169 -79966 131433 -221863 -224555 195471 -18552 427619 -78783 50908 1531
18222 -116645 -67288 -116025 157803 7176 31783 -228322 -133151 -86608 146795 15483 35386
18211 35386 4550 90626 -152237 160807 -68238 60757 -104747 -57983 205199 39244 -188791
18199 -230208 -295182 -95169 -299059 -82027 33915 -2437 -447498 -166576 49861 -209414 302168
18187 -84793 77176 143324 -40388 360332 56934 -183602 -103544 140553 -123998 389789 -104708
18175 215898 291526 230415 151423 -54945 111796 68610 -163165 148889 50656 52750 108072
18164 108072 28713 -272318 90968 20390 -354698 77160 -146752 -124263 3262 152610 96964
18153 96964 211386 -255529 128544 199838 212303 34317 -316439 -181490 -250332 41811 -79177
18141 198871 196750 349830 -180831 -105851 -12876 -61939 55686 -205942 106679 -29152 -31004
18130 -31004 -49911 -170338 147533 -104780 67895 -1711 -61887 -180277 33242 214943 40992
18118 92988 -136938 22112 102257 108980 -99267 74977 -120564 77648 -90942 6628 -216377
18106 -126687 165252 -32033 -270867 -76277 -50781 -25044 -133548 -101900 -586354 -313042
18096 -313042 -257956 91772 -27260 -122585 -164213 30190 347274 268128 -179095 150940 -120575
18084 270602 463312 -143119 75565 -213515 133685 20602 -68460 -4036 -320312 -77073 197297
18072 47228 -18697 -58987 -180989 -305978 -863 101399 129557 167341 -100199 188300 81960
18060 -160728 139763 -150473 -39399 397612 294309 103034 118055 91393 98887 86288 150426
18049 150426 282517 2737 -80524 -225140 29768 261472 -152093 -105306 46906 -359789 -61329
18037 -229049 -183907 -26646 -72508 -299580 -56633 26744 -12639 -133006 -129229 -260851 -206726
18026 -206726 320366 -100377 -28005 81877 -89522 -158632 53095 -152843 141039 26310 -128995
18014 -72419 -75648 247132 51822 -441502 10629 -185909 -140413 -64852 38073 -27022 101770
18002 -69226 -36270 -156132 -91075 -228561 -75332 -247339 -532641 -18756 9954 -47044 92525
17990 -82140 -20836 -256658 93268 -252508 -238654 155877 169177 -50999 -173736 33138 -222492
17978 -148745 156352 169657 54959 72624 -14689 -72263 110641 -90649 109705 -246655 -9900
17966 244818 -58021 63619 266442 121384 -5749 -87565 -23742 71024 -212873 -238350 3275
17954 -67349 -40727 -143265 -267379 31487 -146513 -272485 -107334 -14742 -228769 -88710
17943 74831 -193700 75348 155118 240774 -147269 -41440 -101305 201314 12176 337151 -36068
17931 37208 164107 -32536 -4539 26453 -167719 -131688 -54944 180247 151936 277316 -256546
17919 -62802 82918 158078 144583 -221263 -129111 -164457 9826 -54058 -226767 -214722 227625
17907 -122592 -52419 10778 176647 -150248 -124655 114496 -18464 -251176 -168553 210184
17896 -70608 -227641 -54304 52487 164760 -171921 180566 15167 315514 151005 -35114
17885 23760 125374 23737 273947 65771 555260 -101606 169959 24890 93458 512786
17875 512786 350208 -19465 -11369 245252 195622 -207855 245151 46210 100666 130770 -39010
17863 57398 85378 -426866 -34711 -62324 122406 334576 -69447 -71412 218209 -3201 -44070
17852 -44070 43173 162643 -20197 -374095 -399604 -31747 28969 -64537 116420 75454 -171528
17840 106220 -155948 -23587 -6109 46454 -73320 64667 -41493 -182020 -39494 -147524 -276244
17829 -276244 34447 59918 74767 241261 -168553 26405 351955 -140977 -33247 49947 152951
17818 152951 -195854 -58861 -152039 -6811 21164 -12407 190120 12488 91328 -29243 -24523
17807 -24523 -364005 -62784 -132670 102462 136868 -236951 150282 154291 16081 -46260 -219346
17796 -219346 -117783 -12733 -62646 -309525 -48500 -204673 86250 199678 298243 -94204 -76576
17785 -76576 55995 201947 -277870 117791 81208 80960 84808 -9740 17136 -96270 109319 86015
17773 86015 -277502 411318 64406 -6872 198823 -95216 13647 -279727 -74468 50913 111830
17762 111830 132922 -46404 39114 -174492 183672 70613 -182489 173486 -12009 105692
17751 33191 133376 169772 -63434 297615 112017 -117374 335742 -173147 364589 -169108
17740 113063 83532 171957 4902 6692 128520 -189060 -87880 -12360 -77802 137845 -398040
17728 -289570 154607 -132588 -50458 -229478 151078 77995 -147856 -281640 -4857 202924
17717 -408606 -13843 -116943 -39548 31097 265690 -1909 -156841 309991 -178880 -44466 -331972
17706 -331972 -14249 89037 -49266 -425875 157160 -84654 61466 335652 533312 76772 -131211
17694 112932 -161798 48507 88113 76210 90854 -202963 144969 -30581 239025 87435 -329982
17682 33169 159201 -119672 212780 24118 119946 60606 -115974 -205464 136656 -173796
17671 -67177 67162 173634 137245 63344 -53349 106294 -153668 44810 103167 100400 -24270
17659 218954 -113506 94311 -95626 368179 378643 -72166 64769 -3104 -192131 -86198 22910
17647 -77854 3703 66197 -145243 11528 -23650 245237 113335 92427 -332624 46496 -207333
17635 277678 -72515 -132764 254078 113622 -182786 97261 290471 -106931 -10292 -36236
17625 -36236 -124765 144338 -148935 58585 175948 -356204 136949 1659 62971 -317410 -32954
17613 -209974 -83816 88999 142122 236304 197621 170021 391538 -62025 132014 3248 -82958
17601 -66631 -11987 105898 37773 236538 602022 -139317 -48919 -81178 -62718 -64715 109449
17589 109612 38012 116376 94436 20097 6874 52765 -17425 -64552 206557 -44169 -306743
17578 -306743 375523 187805 -26280 -244223 -71379 -25937 -160661 29949 116490 257160
17568 257160 -168234 57268 100736 174382 261377 -24739 109326 196196 -52530 -130337 105777
17556 -218404 10307 439268 153887 175304 16703 99980 -90459 210168 -242836 272998
17545 -98141 345616 46025 -14849 185491 164377 39626 412872 -161768 375727 225965
17535 225965 -40897 38318 28597 -146378 127694 394382 -34693 -192021 167777 51919 127627
17524 127627 133973 -14793 -31398 107887 289544 -32780 35799 79627 141338 -137 92336 29563
17511 49093 110196 59888 -46032 139611 68127 -100955 83372 104073 1594 236604 -228523
17499 205478 80070 136728 105807 346426 123690 -229632 -276286 103484 123570 303586
17489 303586 336209 -177535 308864 242228 363413 -1931 412148 32794 -156072 278415
17478 60798 305562 99414 12222 307216 216883 215883 413554 114113 -5542 419933 19237
17466 -206790 142460 -95141 35929 259480 414260 111857 299672 -95305 199737 19642
17455 -52583 122129 179318 34175 134211 178063 141016 -31521 -158538 -189294 176765 315502
17444 315502 319185 99063 358366 -27301 117539 272262 143989 261037 338554 300290 251309
17433 251309 105320 157535 450705 202410 16487 223922 262981 -29146 451619 377373
17423 377373 -106997 346375 203306 155735 113608 443979 4948 123443 270623 13118
17412 22872 234960 129473 260864 336902 26005 257765 550235 275856 289798 297924 443019
17401 443019 -27671 146333 538962 82537 89091 219646 287364 217480 226881 182731 98027
17390 98027 -174648 159409 119251 -217986 39737 94976 89508 161431 347580 52639 299953
17379 299953 230073 135648 333107 -65233 27363 -18986 137431 -6746 -129436 391702 183943
17367 163787 325089 -184327 186813 -215915 229075 455929 185006 254530 170705 11383
17356 267913 412670 39151 -22129 -113464 171869 -40463 107198 150118 -208825 194315
17345 82783 247163 133222 -17784 73547 258786 224258 246992 43454 417759 203109 -137614
17333 -107208 155427 219716 591509 -41881 231250 536713 14740 551020 214602 426090
17323 426090 241201 -50245 410780 197129 75534 120612 -200677 96480 17133 103602 271739
17312 271739 118363 95849 193101 285841 66037 311220 189431 351546 258671 186737 27709
17300 213656 304619 277511 198315 32090 283829 66485 -153076 220658 242497 70891 138818
17289 138818 269056 224171 49358 -161303 151663 312623 57350 216366 28100 -133760
17278 44268 195610 30658 -92490 284367 -14208 303881 64859 -12190 272415 -37479 269997
17266 -45687 317955 127380 393984 46163 14788 335641 -31445 184660 122273 339104
17256 339104 308592 362360 362654 -35079 224556 274103 -47623 195610 120546 198844 113297
17245 113297 271481 28090 184888 57779 39517 286518 -152844 -78716 120352 244153
17235 244153 115491 110151 130433 72049 148818 -69621 174219 31668 248610 77982 -4015
17223 -181845 -16722 275885 250831 -151469 251513 317325 170427 280606 388207 141213
17212 169285 140958 87489 2639 272086 160582 -69749 108705 394909 41657 140481 269742
17201 269742 233187 238067 60181 323768 537796 -9357 299425 156589 317536 404861 118900
17189 419283 20570 366367 224227 422460 126580 63141 372126 193781 403059 201762
17179 201762 283440 192631 112779 321579 173192 205340 359243 -219342 140811 -50540
17168 235901 -98795 532271 -62523 435207 233966 5992 109220 200557 316715 328481 442199
17157 442199 438785 373006 -127025 113043 210218 325157 356985 277030 600249 -138034 134608
17145 311304 143768 95253 31229 140467 66631 284879 439328 290749 520524 570481
17135 570481 538006 511522 155513 329533 455757 110141 290107 318801 108150 38193
17124 272224 444960 193120 58217 10421 275109 45052 586890 608733 391059 401470
17114 401470 348282 358077 135688 397401 335368 390067 128788 363451 343429 264731 254519
17103 254519 440880 -2280 438183 251132 169103 304288 314511 107283 312040 375132
17093 375132 473947 753996 277387 532245 481310 338015 550704 275773 490106 256031
17083 256031 444253 334085 367453 93273 234947 155484 177563 228027 317194 21260 374627
17072 374627 932669 574492 503376 517685 451674 172349 600876 254633 480582 340590
17062 340590 364655 271590 271500 463223 326038 407988 577219 605777 195187 718028 162514
17050 185586 561144 418543 484894 638489 228367 345116 424268 430957 99735 488572
17040 488572 473961 328422 818739 330974 486187 665156 434148 190950 651943 507167
17030 507167 253025 541890 663264 627092 124512 689208 801668 288002 564707 526250
17020 526250 660464 664894 468785 797831 593320 879742 525504 686242 520890 669815
17010 669815 616042 545875 824511 212732 696830 377117 681951 427635 570510 580962
17000 580962 500817 868668 650556 436257 572336 726803 505122 893240 591198 318754
16990 318754 585483 483000 654581 885510 1044152 794116 1030821 759467 524751 321890
16980 321890 918659 521110 777496 444526 524122 557876 848281 879184 533148 792747
16970 792747 898129 840131 780857 756435 479692 861815 777289 772850 845714 359910 1067332
16959 1067332 912695 783044 586830 575875 720054 958311 895046 860337 720765 738374
16949 738374 839885 861167 647470 768200 860812 739534 733940 650297 1089155 774626
16939 774626 1088108 915239 935795 937907 954574 878689 736875 902401 731057 835273
16929 835273 764401 806016 1113258 797650 1001261 1021883 852148 1383739 1063854 1155551
16919 1155551 1118827 1142490 1228127 990136 1235092 1026757 1067170 1042115 1328789 1534257
16909 1534257 1233126 1420766 1153406 1105062 1330364 1406572 1317150 1286291 1408112 1403728
16899 1403728 1157164 1649140 1173242 1690309 1489919 1299951 1390659 1487279 1299494 1654947
16889 1654947 1465385 1323909 1380959 1604709 1709934 1437378 1637152 1718199 1715233 1590615
16879 1590615 1647753 1915696 1590177 1811933 1654402 1727113 1769127 1745685 1939697 1900327
16869 1900327 1857423 1953524 1807253 1976509 1887017 2153360 1988117 2476780 2294264 2157742
16859 2157742 2654936 1967151 2365405 2270181 2541233 2129720 2380450 2249559 2413675 2560509
16849 2560509 2743368 2445048 2772065 2625374 2485497 2839933 2833255 2366185 2885912 2732802
16839 2732802 2934799 2980102 3145067 2870614 2800710 3230836 3287855 3247091 3303269 3191481
16829 3191481 3256709 3417627 3256847 3631031 3427480 3579303 3570111 3663690 3796944 3840683
16819 3840683 3844169 4188292 4082479 4053190 4146025 4277240 4181411 4444115 4401281 4687231
16809 4687231 4642810 5090462 4853571 4932348 5007494 5283762 5086956 5198640 5495726 5455760
16799 5455760 5891356 5666787 5816575 6157946 6082313 6260627 6216063 6872843 6957468 6897977
16789 6897977 7067372 7260506 7593310 7743052 7645082 7883828 8333316 8328290 8927683 9269618
16779 9269618 9123655 9480362 9563695 10066651 10266482 10325890 11118138 11075291 11233978 11852173
16769 11852173 12126506 12528695 12751982 13352321 13510942 14351112 14691697 15119767 15755923
16760 15755923 16347035 16792027 17010008 17649494 18345764 19109257 20186947 20788254 21700687
16751 21700687 22329736 23542306 24241595 25589858 26287796 27774791 29125863 30004959 31462471
16742 31462471 32912077 34481246 36375418 37866890 39936026 42013536 44095622 46627165
16734 46627165 48862904 51593748 54893547 57336126 61109630 64116084 68469396 72116954
16726 72116954 76639655 81509722 86397670 92089003 97867604 104024950 110995914 118014151
16718 118014151 125330419 133056833 141202517 149645085 158288358 166832129 175277897 183532641
16710 183532641 191286144 198635612 204791245 210149833 214316330 217409499 218368471 217961275
16702 217961275 216165641 213154341 208094840 202418055 195682105 188214760 179933027 171460896
16694 171460896 163257483 154425416 145997437 137557413 129794909 122297830 114629390 107997859
16686 107997859 101688468 94924683 89347670 83957872 78957556 74273175 69854766 65504741
16678 65504741 61833850 58558604 54758089 52112324 49427825 46684747 44237751 41714286
16670 41714286 39748923 37847475 36238761 34113227 32617309 31314837 29543376 28959574
16662 28959574 27046264 25687901 24793012 23767612 23098597 21979773 21428603 20310185
16654 20310185 19478609 18928454 18163979 17663413 16466626 16497326 15608447 15095460 14881586
16645 14881586 14112937 13710348 13334620 13134398 12537406 11878660 11755891 11218679 10936180
16636 10936180 11015255 10720442 10387526 9815135 9533183 9128068 9286272 8514854 8407944
16627 8407944 8684811 7763634 7843701 7573864 7485393 7399407 6767383 6826107 6972456 6564489
16617 6564489 6229220 6316306 6076648 5674864 5522561 5731692 5421190 5299221 5189007 4906012
16607 4906012 5071976 5087321 4800730 4822405 4581770 4472397 4462413 4439001 4484646 4379441
16597 4379441 4127725 3966322 3890725 4093860 3778062 3790354 3506894 3568031 3447483 3607621
16587 3607621 3275455 3317368 3120188 3391851 3375772 3080137 3218386 2730424 2982744 2974189
16577 2974189 3068695 2924399 2795775 2791182 2736105 2286682 2704283 2327247 2791985 2466339
16567 2466339 2454563 2434466 2126796 1940791 2032099 2266851 2081478 2325804 2024142 1938029
16557 1938029 1741374 1796234 1725960 1667910 1847571 2147027 1779045 2076916 1531779 1994669
16547 1994669 1869032 1571624 1885862 1747758 1827806 1618210 1361849 1757593 1477745 1264301
16537 1264301 1622122 1360980 1474593 1262901 1363701 1148880 1472121 1284788 1367661 1335991
16527 1335991 1228422 973620 1588393 1566579 1400959 1098690 1220120 1433931 1025138 1324757
16517 1324757 1239787 1184141 752115 1288163 1258738 1134653 1251560 1246091 1264981 790563
16507 790563 1185101 1047147 1077940 739026 787364 869822 1041417 777003 894345 1068921
16497 1068921 822428 1181414 1158987 1029482 1029641 1043652 1309706 857174 971808 682657
16487 682657 623738 1028925 561803 736246 1157703 736025 881638 700634 565179 803160
16477 803160 786132 874741 453577 785976 878155 608952 796714 883342 767601 542306
16467 542306 684898 512292 688396 914403 720837 707643 602392 825864 522083 561703
16457 561703 134002 385838 716194 618822 575360 613972 772382 498395 534284 446393
16447 446393 467548 524810 465226 594498 562907 1018444 884250 457496 507241 504671 307777
16436 307777 600024 240355 873744 597672 528823 442682 386451 478671 -29628 458343
16425 481418 677366 420618 368311 428114 387399 483215 299449 606672 720801 191639
16414 623437 597966 568301 581958 660439 628794 448562 508154 337198 491958 523714 319852
16403 319852 427790 348547 248124 605586 143929 262432 159590 728912 191026 329041
16393 329041 521360 72243 438001 350013 718014 266145 346687 521278 471104 355594
16383 355594 229783 330314 575337 387823 358110 329719 215342 362499 553821 455357
16373 455357 169283 352725 322127 54501 55595 583703 268820 337792 610006 319222
16363 319222 419692 336968 536121 156430 166257 30293 333770 569985 343562 51411
16352 433932 674442 559525 162160 235051 137651 238417 457584 486592 181711 362156
16342 362156 371849 697128 234635 479660 203724 312791 499294 186650 130263 148317
16332 148317 550309 126205 273005 466793 103399 70067 554702 196 356037 198212
16322 198212 358901 272714 249578 156932 148196 169818 329601 123648 365847 284349 408121
16311 408121 337073 -67342 94253 575245 155618 396957 446103 233159 125584 422755
16301 422755 -60916 135381 37522 -67321 231333 322086 381403 633537 308504 382917 527484
16290 527484 245015 354410 797797 204984 39524 327262 444225 274755 287788 73666
16279 98206 504115 129098 184392 171303 355832 212291 323951 430183 -159350 294571
16268 308133 23019 103126 103786 313904 255241 -22816 278355 350226 19164 283955 382777
16257 382777 93712 279278 289520 91239 -343508 272615 459926 160971 124134 351672
16247 351672 335528 154689 -9261 154834 300108 67970 -41953 375132 367292 -12799 79288
16235 124698 -417842 458273 381951 417933 -22126 500722 355690 157090 288151 88661
16224 52427 126792 350596 66283 376446 82990 -95041 227999 318195 352783 429226 232085
16213 232085 -16481 260848 216186 388352 246267 352385 29068 78241 555687 185901
16202 4480 -2046 -116499 -78047 30732 407953 -111657 173992 201393 -26706 149047 247972
16191 247972 119555 -32901 -74686 -46520 157760 -352014 67869 143028 323538 458287
16181 458287 -460 69863 126343 63990 -17620 89679 190863 260902 393653 229468 70446
16169 51889 159103 18241 116826 121909 77567 -163683 86694 -161373 -285347 188023 -293182
16157 1692 -18020 -15082 129702 73776 -1732 215230 -34452 249776 168531 -6804 287839 -205433
16144 115864 575041 14302 128311 370723 216630 297639 203180 258909 153574 -125030
16133 196576 -144036 287852 -46749 214785 -230082 185993 426858 -69064 -170539 23390
16122 149199 247750 -27662 -227821 47778 125602 -78829 -19747 144714 24339 -98889 286616
16110 152158 334063 -269456 -60364 83000 357939 -74309 366609 197595 230189 -210047
16099 135757 85234 -60357 113018 129897 -1012 254854 59640 136307 -192055 222110 93196
16087 231659 257762 82546 101527 250488 -35048 -117495 22790 16008 -5051 -40156 -66256 -489520
16075 -489520 -151942 59097 -64084 103745 -106387 -52034 265396 99128 -50127 -79782 92519
16063 -70051 68356 45108 159363 -145701 163225 37336 -161087 148222 -22609 -88678 35276
16051 -61623 278733 -440622 38266 -73235 -140483 -107846 32234 -167062 77110 83971 221512
16040 221512 -385237 -109076 -241687 26921 -60731 252899 123419 -266830 -246355 168934
16029 -306299 88176 2641 2 -81634 -267125 -187543 64130 282751 -162829 195832 -134236
16017 -265763 -161171 141302 -346339 180754 -266917 69986 24479 182244 -19257 42058
16006 177172 -298405 1508 202345 -301351 -64473 125561 -72873 -74246 -86402 -205162 -250147
15995 -250147 -168399 -155794 363469 -88629 6050 -251292 -203824 19006 -46983 -21505 -192458
15984 -192458 -103070 265023 81596 -124091 -140394 -14972 -171354 48634 -485217 -105574
15973 71297 132811 -211024 -61465 -38947 -93167 27455 160144 -89201 37843 102340 -36715
15961 124022 -989 -48304 -391929 146863 -364926 -243617 356642 109945 -272404 -23154
15950 86618 -370750 211453 -264099 210826 -144252 -416444 -174155 293 -71256 207722
15939 -285846 -103941 24707 -2413 182790 319 71651 160602 -130358 8055 -33794 139756
15927 32814 162652 -122507 -27754 179346 139954 -77246 -289594 108754 74252 -40505 10938
15915 -106172 43256 -305248 -173044 -169455 28278 -4703 -111407 -229250 -245961 21095 95280
15904 95280 -147063 -149852 150529 371382 28787 13388 147775 94912 66745 -60247 63656
15892 -207619 -1710 -115587 -33730 -5112 -210802 44041 -168096 160687 113358 -99274 -194078
15881 -194078 -122753 -87368 -109120 141026 -346314 66904 -216911 -281966 107334 53958 -324771
15869 183794 -38703 111964 140319 33098 150062 -99912 -248697 14951 -71420 -36342 -33935
15858 -33935 -189406 127028 65193 352544 133249 -438290 119523 -180444 -187006 -113819
15848 -113819 -21597 -41610 84965 -208303 175496 -300184 -70966 178739 -91438 95751 -145417
15836 -151200 -114346 -388996 -24352 8280 -222774 -88191 127754 -118217 425530 222187
15826 222187 34481 219969 234275 -148387 74682 -7195 -33446 187826 -34841 -38141 -122276
15815 -122276 -173799 -241484 -154117 311848 147222 225758 -716 -66450 -83750 -304937 125968
15803 -43369 -86497 -46234 55157 -129355 -171753 -117155 -69697 225158 -212807 -62222 -194299
15792 -194299 -157529 -208505 -212694 15202 -313488 -167315 -115030 -53525 -227725 17342 -101122
15780 -215685 137112 -138525 -294641 258013 -66498 57348 -157358 186130 99484 -125319
15769 -5506 -168586 -69955 -270010 -43173 33005 21589 17428 -298243 224837 -18113 -70804
15758 -70804 231783 -95691 -148372 135251 403456 -241162 263904 101691 -482511 -22495
15747 -235401 -111917 -114732 -133978 -216912 -82546 407446 -231687 115197 172285 292518 104664
15735 26426 74862 229555 357259 7741 -257002 -266931 -114453 -326104 203896 189636 109728
15724 109728 266842 -44078 -389126 255019 224891 -213902 -133238 20269 -58230 -306851
15714 -306851 -14673 -88685 -78786 73452 -186542 -67386 -119721 -147531 -86445 288301 30915
15702 -389568 -39616 -196366 158117 195555 -74520 -106175 11247 33714 -86714 48418 -248492
15690 148095 -163376 -7280 -328726 -79959 -85182 183013 -120710 -60774 -61747 -86149 -104293
15679 -104293 -319095 -168728 267814 190251 -673529 -192613 -180616 -25828 -81062 -33793
15668 -113544 205913 -1414 -271027 -238329 -303813 -296016 -25960 15377 69588 -218000 -195585
15657 -195585 59573 -17518 -148848 24825 -380916 -79917 -225286 -154056 -113464 -234149 66870
15645 244027 -141620 -178907 -153580 -336391 -216784 -172358 256191 356817 95062 -20460
15634 -100314 242867 153457 -110228 266215 -39180 -191293 -264278 106041 -55742 -179631
15624 -179631 76053 283740 -315256 -258549 62418 -18080 -12175 100824 -237885 -32685 -284419
15613 -284419 -99094 -306596 13283 -91083 -5267 -130832 -10090 -179844 -336122 94841 -511275
15601 -182592 -30421 203877 -108324 18055 192460 437862 -66615 -208932 -50588 21070
15590 -19358 -145848 -135390 235219 256648 -119865 -20932 -269980 3723 -100880 189569 -107132
15578 176919 22303 -396018 5503 185444 -305282 31796 -234697 181923 95351 182272 272486
15567 272486 157375 311982 269878 -54274 -23702 -197514 -58157 -325470 55716 -99974 163054
15555 81250 -177083 112824 39067 -69693 -206619 -54874 114284 12138 228644 -69173 -151115
15544 -151115 181707 -227436 -256325 -25879 -72723 -308188 -38219 -283017 217449 -42880
15533 -45990 -124337 -181869 -39629 -181011 250746 -68937 172553 201648 13319 32715 -78943
15521 -28636 30419 -140403 -116289 341354 55107 -39896 48259 166465 -22298 -314572 150630
15509 46998 -121505 131776 -225161 252973 447206 140516 19749 77156 22256 232421
15499 232421 -41605 90869 -255076 201593 -81811 -46823 277861 83612 -50146 343701 -150723
15487 -117746 -27968 -279853 115936 -103793 -286638 -255985 65420 -163209 63400 25186
15476 -56890 -4355 -136145 -4790 -345904 105818 -169872 -287241 -48610 -126372 64018 33336
15465 33336 19821 -81175 20503 99757 95533 -116225 -211828 172227 323859 184365 -1666
15453 -202002 67239 -190273 -38560 248724 -29342 22379 81585 192331 -88075 37530 -322210
15441 165264 -346656 -118165 143061 -1340 -162327 24892 -276861 150696 -68797 66390
15430 -187116 175796 82354 -31427 -3643 -143230 40579 333418 105545 -74203 181144 139333
15419 139333 -48623 -143868 223575 68730 21643 -335650 24125 -291222 775 272836 -10788
15407 -165916 -244468 55935 198585 -242961 -166012 -32338 235287 44777 -93021 195078 -203388
15395 172985 -144956 -125096 -55152 -280093 -220832 144582 -62912 -375362 46791 -159124
15384 185029 88727 207414 24466 29989 45830 186499 -130076 40681 -57931 -415405 12690
15372 97912 7988 175772 80407 -146638 264915 59720 -131678 47615 -147625 -109802 -443822
15361 -443822 -244603 167108 -152412 107473 252579 -129403 -410562 295304 102254 -18417
15350 -137213 -52291 -142717 -235044 210340 34131 310094 -157490 -68335 -168570 -308337
15340 -308337 40348 -141335 265185 128635 -171149 29611 -160979 225445 -15062 98233
15329 183141 257731 48242 202373 243406 -180008 378659 215686 316420 27001 106924
15319 106924 94775 134644 -124028 143447 218743 -88576 -136075 26106 327152 202650 96703
15307 102161 -192740 231964 -30700 -51221 -153665 228741 218827 17250 168530 88213 36991
15295 99206 200773 -72753 -108923 166715 171385 -68488 270091 147906 -17942 343604 -88855
15283 -87169 220601 -71489 200013 -370788 146505 164598 82622 117516 140479 92593 -6099
15271 -93478 -97966 34212 127973 67444 150540 45285 -274399 90934 16776 -28929 -20822 -301614
15259 -301614 78217 122472 346979 142056 308731 -126981 276127 -280426 17515 66484
15249 66484 220350 189432 49960 296815 227480 174304 373096 61221 157161 29991 55629
15238 55629 137542 610460 370851 686996 1686506 1235134 1492711 1423674 840551 667507
15228 667507 664310 127373 128973 337431 -53933 228231 -85441 277552 45694 211418 -143209
15216 225261 254107 215722 104565 -4443 -230782 -293746 101427 511611 336786 -23782 122621
15204 130430 172399 205766 143710 5537 8049 -8452 -128927 14055 18748 -269537 -110042 279291
15191 62174 295360 -60981 59395 299001 116689 -100532 231158 305592 247733 -166428
15180 165386 6577 -131867 -29271 -222035 329374 164016 -48870 4554 -88306 256306 -207656
15168 322955 -63621 -243606 395086 -32938 47066 158303 122092 -474109 34363 10588 70056
15157 70056 236440 196882 -72740 186438 52197 277238 104858 53355 2369 195157 -327514
15145 116840 338335 179276 -54352 -266425 56924 6627 91792 323581 186822 -235489
15134 -93399 -221315 113776 159219 31915 136508 301652 -71639 459232 259060 -31579
15123 423982 335332 135015 125989 167726 67747 335221 313653 289562 243898 45103 84394
15112 84394 251753 226352 133184 270542 453485 119774 -17232 203747 185744 84461 333921
15101 333921 52928 -35032 116064 35502 194968 -21452 135346 291985 -12486 206675
15090 179787 138286 331246 189571 29794 -44154 190172 313877 393387 184106 -103690
15079 344981 -134320 38214 174072 247980 381803 150987 -34761 220313 371980 300838
15069 300838 253897 436509 64219 -114413 -39614 196517 348859 111650 332081 198546
15059 198546 176150 196524 422645 226740 116632 -3108 -74825 181923 189063 92243 75380
15048 75380 65936 137407 419276 162897 177565 207253 16339 116075 359712 95562 -226140
15036 95544 -220005 101685 70523 276794 399241 -166212 324115 38950 -53845 38247
15025 203566 231015 52356 532919 58609 5209 71910 -92598 295915 88953 188702 405075
15014 405075 174153 48582 144970 -134183 443645 417853 296501 169169 20383 153311
15004 153311 -86522 265862 402344 304580 -153820 61399 333294 428335 429479 334548 125871
14992 11894 112447 70652 249748 440020 -66550 434487 435863 250679 391508 231432
14982 231432 512739 -35334 227358 459959 196341 436233 116542 356220 273199 497667
14972 497667 196003 20188 250085 202659 296981 -19006 195268 134484 -138885 -122274 165659
14960 399603 261179 239102 408010 283195 253537 687408 289984 531687 233979 311013
14950 311013 351679 507369 380418 340123 432382 92520 154294 264052 270288 158444 509000
14939 509000 -79257 103134 194999 283258 61872 579849 48041 161091 452284 236723
14929 236723 76936 399227 199814 222201 393382 257083 501256 242797 479669 43820
14918 436639 596314 429746 229915 349468 319055 300037 153047 408590 469621 509701
14908 509701 184343 -15038 288301 435571 319757 397799 -144841 149210 141208 338195
14898 338195 170337 368861 481949 25853 410221 156095 356635 411049 362301 665413
14888 665413 330640 174719 525346 554083 230046 496927 20211 524092 288945 418664
14878 418664 463612 369503 133874 268074 505766 302222 732684 61907 109691 560687
14868 560687 614248 360229 566588 91539 539348 655004 36433 243587 238835 383444
14858 383444 684098 590853 454839 341420 338308 435918 491650 382920 210432 387948
14848 387948 219681 369012 514579 662062 525195 427605 549869 109951 296564 348816
14838 348816 338164 222596 358855 657467 530686 524432 257314 276515 247599 387158
14828 387158 504240 796354 668710 568671 569824 280888 492233 414229 677569 414223
14818 414223 269028 572832 339442 382172 533625 443707 771191 385805 267066 390986
14808 390986 398439 504017 461947 190840 506240 511195 398781 627199 499349 364783
14798 364783 401999 591128 442913 602006 606682 757454 465540 663080 282395 376753
14788 376753 638241 280604 389548 863646 549385 747541 712163 427630 351690 604875
14778 604875 561887 753508 549773 602780 729373 398023 740915 930108 806144 800590
14768 800590 737050 564697 672459 664224 555130 593651 805787 615997 384798 451750
14758 451750 772406 198280 328603 771681 620002 687587 1058084 393869 509470 781584
14748 781584 873367 762248 208596 593879 725871 645557 639313 772657 869725 808375 731431
14737 731431 561633 729711 687753 715825 964438 976602 351267 830328 756239 508564
14727 508564 892294 1091664 666869 920736 766818 936962 902633 576756 943250 617225
14717 617225 837148 504871 686036 928636 902542 938049 547659 870026 828311 671586
14707 671586 610429 790017 843143 759244 552989 845285 1191023 913458 588534 1047457
14697 1047457 948475 829678 1052809 733596 919029 945455 757452 691320 873015 766970
14687 766970 946696 1051171 825872 899230 940553 848110 895878 1004362 1354085 1052771
14677 1052771 837631 1189843 558126 1091306 892329 810754 833086 1198026 1006254 830478
14667 830478 885314 1108987 1485664 1292926 998598 930882 1129090 976109 1085396 817006
14657 817006 979563 1018679 925693 929142 1018425 1376004 926266 1313730 1272994 1265315 1347995
14646 1347995 1208414 997966 1398329 1447464 1341183 1012984 1446718 1327708 939926 1586590
14636 1586590 1329461 1152768 1143477 1360662 1350694 1367156 1343140 1120776 1373620 1137941
14626 1137941 1268965 1487841 1221765 1647925 1553032 1737024 1259852 1521289 1224177 1354635
14616 1354635 1498240 1000484 1547297 1257016 1557928 1579854 1827238 1417706 2052632 1715728
14606 1715728 1697374 1804416 1176522 1547336 1702344 1828047 1582674 1860197 2062455 1609905
14596 1609905 1448723 1725617 1726743 1619423 1614992 1921059 1463024 1551726 1747372 1534458
14586 1534458 1747456 2148188 1757184 2005630 1847251 2130664 1944372 1802929 1949370
14577 1949370 1425874 1688663 2089118 2006222 2055890 1920809 2231098 2132228 2343644 1814756
14567 1814756 2355656 2278521 2338287 2229670 2299742 2124117 2140552 2039113 2285027 2510436
14557 2510436 2441344 2306718 2347026 2568031 2562002 2692691 2733665 2823302 3128674 2847187
14547 2847187 3294309 2910323 3366068 3429198 3446543 3885505 3949121 4523598 4554956 5435449
14537 5435449 6020327 7260708 8965856 11843888 15972845 22089415 29894481 29781750
14529 29781750 20441673 12687207 8678266 6065836 5087338 4180779 3498910 3301970 3293414
14520 3293414 3090994 2941887 2814318 2792974 2701778 2543351 2628321 2685534 2706604 2727752
14510 2727752 2711197 2820351 2692413 2695801 2799496 3091312 2731014 2900635 2978386 2681786
14500 2681786 2827214 2731521 3055394 2796916 3452035 3129140 2953464 3324748 3147678 2847556
14490 2847556 3451473 3395662 3570603 3385700 3557676 3677147 3505686 3490415 3710076 3661495
14480 3661495 3689805 3892809 3793072 3426534 4080927 3461326 3826113 3986624 4167659 4114086
14470 4114086 4007695 3901903 4041146 4177586 4213644 4326033 4583525 4700542 4163392 4197821
14460 4197821 4681541 4709570 4509805 4739854 4770468 4449343 4770514 4588644 5052962 5366772
14450 5366772 5060600 4733428 5367623 5397512 5090331 4982807 5517640 5384213 5744830 5378286
14440 5378286 5666274 5833800 5781571 5648349 6052270 5907546 6359516 6316615 6082025 6530286
14430 6530286 6425516 6382009 6720215 6534340 6621955 6900396 6640976 7049011 6816143 7180193
14420 7180193 7224281 7084604 7356364 7404712 7288361 7729835 7533624 8043019 7984498 8496337
14410 8496337 8212275 8359039 8313206 8452130 8486597 8489495 8805961 9172853 9521970 9336274
14400 9336274 9471429 9709269 9617982 9873461 9856219 10389221 10031476 10321731 10566455 10696781
14390 10696781 10943711 11009096 11294981 11634693 11666161 12092572 12110237 12137741 12317156 12555613
14380 12555613 13145449 12954720 13227113 13669590 13421256 13637442 14403285 14383632 14258071
14371 14258071 14806491 15196067 15724272 15999017 15825657 16137429 16823184 17097206 17555270
14362 17555270 17542844 17585810 18173359 18683036 18982584 19271171 19924047 20184208 20479340 21005810
14352 21005810 21698011 21933073 22650379 23127553 23393328 24336857 24300912 25038140 25466636
14343 25466636 25936748 26703744 27533763 28160385 28207709 29279487 29745608 30886366 31382660
14334 31382660 32669939 32823562 34290702 34993457 35874365 36732828 37878517 38914426 39793184
14325 39793184 40612303 41848393 43567147 44744939 46107995 47579172 48447906 50054054
14317 50054054 51617361 53508696 55023024 56530965 58870983 60656688 62774983 65071819
14309 65071819 67315544 69536840 71884534 74475600 77149336 80383744 82928151 86318973
14301 86318973 89506367 92870976 97235854 100996875 104893251 109097553 113761589 118706654
14293 118706654 123407290 129246747 134689229 141033248 147464272 153883297 161603043 168910702
14285 168910702 176964379 185408853 194249571 203932602 213724119 224043062 234654258 246174034
14277 246174034 258132482 270596821 283643174 297420783 311573945 325616647 340369209
14270 340369209 355174359 369570410 383626209 396789378 409458933 420530026 431224826
14263 431224826 440790136 449046852 456216149 462561923 466872659 469395351 469483398 469006941
14255 469006941 467947544 463274724 456705839 449440409 439750619 429067769 417585313 405574834
14247 405574834 392773516 379828953 366381443 352617307 339294678 325756146 312574303
14240 312574303 300090339 287176653 274982670 262614858 250605544 239352816 228625669
14233 228625669 217849626 207800324 198144611 188584694 179730533 170977804 163120887 155141790
14225 155141790 148054134 141537616 135294332 129512244 123974363 118693056 113619591 109182604
14217 109182604 104863026 101016876 96922117 93382006 89763412 86614442 83304156 80256766
14209 80256766 77112800 74570389 72585938 69667499 67534021 65288658 63314253 61096729
14201 61096729 59346004 57491827 55699246 53797669 52353088 50862885 49344849 47781230
14193 47781230 46474107 46099319 44171170 42808459 41626312 40798537 39684656 38627509
14185 38627509 37806735 36573773 35354709 34519501 33951865 33230064 32362043 31471701 30747777
14176 30747777 30043416 29116578 28482253 27814261 27152022 26392644 26057654 25461136 24888269
14167 24888269 24141638 24064255 23360690 22598959 22306662 21867668 21450367 21064979 20454031
14158 20454031 20250131 19669809 19286689 19056584 18674140 18141441 17849015 17276328 17378167
14149 17378167 17073241 16635042 16385272 16080884 15874220 15719697 15224262 14869700 14830796
14140 14830796 14821835 14235536 14038454 13479103 13438122 13355047 13042076 12780690 12776346 12630169
14130 12630169 12369961 12323174 12317500 11978732 11508171 11506098 11681528 11279120 10666893 10809302
14120 10809302 10542121 10494719 10208282 9968183 10131896 10044085 9844086 9398450 9488187 9270363
14110 9270363 9158675 9047568 9064812 8881892 8857116 8689448 8225024 8183913 8431879 8358689
14100 8358689 7846883 8163632 7752677 7804445 7497057 7710314 7551092 7337652 7616788 7542450
14090 7542450 7371346 7070777 6748455 6544897 6975776 6949224 6752915 6873601 6374158 5968062
14080 5968062 6618789 6465545 6382638 6044106 5873247 6193507 5692898 5632615 5985245 5873007
14070 5873007 5631022 5311812 5654138 5320464 5846628 5570803 5325155 4902635 5399634
14061 5399634 5104225 5348589 4937422 4856697 4764229 4598780 4734624 5073546 4517631 4658179
14051 4658179 4773234 4342878 4404613 4625455 4472868 4448699 4455355 4400859 4256425 4153296
14041 4153296 4295109 4288410 4063092 3947835 4040376 3692256 4160238 3719770 3824538 3932083
14031 3932083 3826363 4030229 3770507 3545818 3602705 3898116 3491492 3491821 3348959 3600330
14021 3600330 3452905 3602307 3451189 3385635 3288527 2865922 3339134 3517006 2977915 3221369
14011 3221369 3218959 3681125 3458721 2935281 3163543 2931452 2934258 2907649 2848296 3150053
14001 3150053 3079576 2588281 3084526 3177086 2508341 2504641 2606642 2854712 2513931 2843661
13991 2843661 2741462 2528100 2611337 2551052 2987644 2785069 2493695 2709672 2551761 2827874
13981 2827874 2700909 3322922 3521852 3675424 3974176 4783395 5691584 8128198 11487766
13972 11487766 17031117 25491312 28362044 21626139 15193351 10899184 8127020 6612239
13964 6612239 5773821 5032939 4333744 4161497 3613219 3473855 3560379 3199024 3115893 3028739
13954 3028739 2736182 3295791 2730409 2874456 2981545 2605228 2301370 2451576 2434179 2741985
13944 2741985 2160685 2505455 2186969 2379887 2073532 2306793 2054143 2233812 2436529
13935 2436529 1986544 2127302 2080855 2023558 2025997 2162520 1875229 2125886 2247072 2186718
13925 2186718 2082982 2032208 1794210 1930491 1765599 2189777 1651098 1835386 1731330 2003213
13915 2003213 1930827 1921575 1730822 1744874 1758311 1937275 1998022 1409661 1493421 1650325 1584548
13904 1584548 1435960 1481600 1973291 1370283 1444796 1691129 1778543 1293357 1822952 1889623
13894 1889623 1695460 1577693 1178426 1364088 1476291 1492414 1607092 1525252 1751447 1587758
13884 1587758 1729118 1486764 1377008 1656023 1489200 1419382 1521086 1406165 1314753 1626427
13874 1626427 1174022 1309443 1434167 1408585 1388132 1451252 1288572 964643 1546961 1465773
13864 1465773 1257991 1278696 1424041 1564401 1404455 1262971 1398617 1222495 972640 1144094
13854 1144094 1211281 1191903 1324319 1000580 1066780 1395697 1352549 1280606 1189948 915343
13844 915343 1360379 1245752 1161688 1204033 1168692 1021905 1344848 1374602 1036570 1187844
13834 1187844 1167753 1362487 977742 1394511 879630 856354 1002384 1025230 1148926 852379
13824 852379 1032461 1005962 1116266 984927 1027630 906163 1164319 817692 981596 878337
13814 878337 1238477 1002342 964041 968120 1161745 1170709 1252042 1059700 889395 1242239 1029281
13803 1029281 1044769 1065538 1227835 1009666 956676 753267 1074758 935751 1001257 810515
13793 810515 960832 1176708 804371 1014552 967076 770324 1084998 778615 983382 933707
13783 933707 1230033 958089 1020930 1000107 1227376 803128 960248 913530 944701 865267
13773 865267 852394 844962 675345 756248 801907 803961 958339 710026 1139958 798979 949612
13762 949612 842323 838586 1127890 934070 879675 595735 585295 728863 925504 813633
13752 813633 413417 508785 602758 898563 834107 523411 457972 969412 605711 641808
13742 641808 960078 818363 859152 808262 685362 746952 881192 860988 676231 757172
13732 757172 775568 755089 554508 788808 636432 674719 758413 614126 690946 692316 767094
13721 767094 775394 552813 699501 755688 632131 776830 614605 525684 685488 541618
13711 541618 381555 675777 814704 647503 817004 571385 624590 391638 490244 382155
13701 382155 914314 509347 640347 1063320 274519 441179 566523 680436 609651 508535
13691 508535 705603 912692 563710 825449 644815 628363 722021 441627 836580 780586
13681 780586 551774 694133 426342 568999 537202 457173 198298 355565 714593 686519
13671 686519 314398 684842 578386 711641 503653 538369 677953 414314 433935 520223
13661 520223 529367 321595 595800 417389 809086 692428 409504 496164 478791 234944
13650 867747 301001 562108 298032 514537 760328 613694 493323 285495 645533 616072
13640 616072 476130 575106 389146 636090 451596 366382 544996 485928 674382 339931
13630 339931 431301 245388 668523 597436 735687 531698 332194 489456 201161 553214
13620 553214 99047 275934 324538 467084 369143 247654 407926 549337 519766 678079
13610 678079 300009 447820 428935 567943 615675 610560 237055 390817 537608 583004
13600 583004 228913 554919 281744 123353 145790 619270 738682 494700 692907 274563
13589 254585 107865 317325 454103 446246 452190 296571 640186 40217 307427 372526 535940
13578 535940 369079 644123 650555 412384 451865 615596 513214 455756 366702 597007
13568 597007 278486 365054 370485 487662 447695 683522 486104 130912 165511 490211
13558 490211 300983 394284 349229 383216 491391 492459 407331 439800 347882 282162 488832
13547 488832 528233 118074 478117 253827 640019 472533 508713 605164 519061 483919
13537 483919 399555 312560 679073 375590 235425 698045 288022 688986 560318 549739
13527 549739 364371 360448 167228 268053 470849 509826 505015 307748 153822 295321
13517 295321 655107 196898 478872 447816 518603 510324 314759 127453 309822 461553
13507 461553 389751 320667 249580 518877 519605 639685 237980 63989 293587 233992 500613
13496 500613 653324 294549 81479 248511 197530 334394 285979 133150 77184 406035
13486 406035 163086 243343 5510 277077 374494 222898 418431 75071 23495 445703 471503
13475 471503 340769 249657 201512 357010 249283 109311 52830 444174 536644 419336
13465 419336 210041 347149 142308 477532 458113 249933 379268 60912 260642 266572
13455 266572 607104 709409 308366 -45377 185962 116560 254575 -106765 195138 -25216
13444 427174 299448 203680 390405 172236 385758 147471 -63100 294642 272081 -126837
13433 296008 136813 -86550 33270 338700 289573 384162 54829 265115 228902 194538 457376
13422 457376 368659 -282656 444971 295752 262081 43714 101795 119826 300137 18798 237998
13411 237998 225500 408728 462649 333475 358374 295065 229058 447608 -56030 242748 157522
13400 157522 165827 215971 545702 10489 164136 506700 142512 -192772 172929 103466
13390 103466 271942 104216 89728 442907 605962 403470 383243 332858 148477 44333
13379 476647 255292 11752 349163 290163 313522 324006 373729 17655 163108 39219 161497
13368 161497 72970 211378 43973 399789 1429 226404 409259 232564 158384 428210
13358 428210 482199 79376 702077 493840 -35431 241293 88650 370809 464763 330166
13348 330166 373265 395821 39990 296759 180435 227502 395352 212593 21135 250510
13338 250510 200979 246531 131505 456003 388336 62358 152460 469129 166797 386845
13328 386845 220551 83162 213603 358606 220316 110800 197064 499638 132326 435852
13318 435852 505418 316514 330203 602863 103420 672384 320290 476373 34710 150362
13308 150362 112601 357483 134174 62881 316608 409869 227917 531293 -15786 200886
13297 298803 343759 -143406 9948 220140 232503 -18493 -77901 247156 16238 -114946 141760
13285 12014 167748 13881 167519 35478 172569 186946 83711 -286082 256318 161836 217002
13274 217002 75349 92881 384352 272948 45769 169531 114754 349574 131375 198720
13264 198720 -199380 367725 368000 85319 192890 -84752 80969 178043 -155411 397077 -40585
13252 85048 395538 223507 134627 34212 3644 28433 85397 225770 326647 281833 174612
13241 174612 328348 416170 75353 -16849 158543 208898 519909 218287 -137714 241504
13230 -81462 93725 136437 180699 188023 114292 271531 -64676 -251910 49338 -3884 369573
13218 63477 324935 320426 -81141 438273 -155213 136649 42829 68839 418911 238533 86762
13206 278044 -82616 158894 -10555 486717 -15617 223009 255573 96924 224539 130193 41557
13194 -431956 167247 49199 181884 55640 -158070 220394 -92855 153859 3797 597596
13184 597596 179663 172169 231800 370544 26080 635126 35116 160069 147875 317258 145103
13172 448240 49520 132501 -111049 187535 333903 262638 347007 100029 116816 -11262 -58183
13161 -58183 -30502 124614 41161 105006 160 -91944 196858 -153854 196015 -221869 223446
13149 354096 389792 8035 16158 329024 -35327 230761 14354 28699 -91919 -42846 182682
13137 -33423 -183003 87945 43388 108582 207065 295188 191606 -120681 -84245 -217537 159107
13125 106905 49512 411861 36741 238969 143119 51297 -139978 346569 82778 130558 -8006
13113 165365 254387 -125845 285275 -51678 52769 259341 5694 477902 138064 506557
13103 506557 201042 126406 160370 -116717 216598 219187 193004 -93792 -94949 118185 169624
13092 169624 -56050 57822 7117 131324 217633 426617 235497 342943 232942 284085 197778
13081 197778 180640 237316 60599 100548 237548 96487 -155936 150404 -31125 -159777 35737
13069 -141374 116373 523289 126173 75542 223084 342477 164946 -97423 -14313 108660
13058 538158 207396 -68025 -111507 -272790 46211 -30450 -20130 321378 -38117 152805 207229
13047 207229 42226 2990 -109932 -60593 294486 256305 -139401 432522 223824 -30879 127588
13035 84158 62552 -22900 122896 275773 -64769 -88033 130715 27389 400760 -1738 12421
13023 151250 -183037 132312 71226 317637 -82581 126452 277971 253320 -83994 114736
13012 275006 166952 9864 284169 -45947 -47275 441129 -220236 -338794 -77433 86138 111882
13001 111882 150289 -60003 403223 321950 136686 158023 280399 146864 249144 364032
12991 364032 -181044 -3821 -96461 143213 -73167 -123368 -5987 43526 133864 23688 -38063
12979 202276 217216 -21392 -48202 55734 175968 93728 405250 170227 184251 -37247 -30429
12968 -30429 191648 272379 203185 242932 64652 100512 -29580 20550 51574 -239527 5620
12956 247076 -104839 234482 -151951 374096 219473 -71712 129804 54700 -237590 -104266
12945 -150 316915 -31036 84322 -364396 -44043 -40591 189622 353893 -29775 36501 180790
12934 180790 82605 -54139 93814 201809 -358204 54225 183071 -73891 -9877 199445 -350532
12922 326410 77617 121946 -128044 101967 238037 334536 57297 358436 171691 307580
12912 307580 47907 149202 -74365 -33767 188969 260514 309698 109692 -82299 191544 144536
12901 144536 7638 19107 -325582 153916 342429 47130 -5271 203252 -47963 -34526 -81611
12890 -81611 99269 41893 -111347 -86719 89106 365400 -131049 119531 89349 47940 -332
12878 62684 158303 192512 -57024 -58621 40789 -68249 -69420 37145 -59242 207752 138459 -92179
12865 -123678 -42364 58673 -80501 -167686 88638 6079 95312 169674 264916 -88080 -90857 281151
12852 163049 123937 27592 383086 80623 -73822 23590 -102562 -29268 127227 -22390 79968
12840 263694 -329661 -75827 204418 185113 -67920 230574 73914 -152820 -284813 63438
12829 -127419 208113 -156668 107111 -103612 194819 -43581 -166826 -5327 80932 -175785
12818 92463 175313 -889 76930 110712 103775 422267 49209 228403 166695 14725 76930 313725
12806 313725 215239 -46445 -226324 149284 -68742 -81108 79826 -64789 -13858 15718 310373
12795 310373 -134407 116915 236391 -274423 -240554 2420 168525 -19028 -63259 -313229
12785 -313229 96366 9674 132915 -94831 -391388 69076 185641 146374 -176885 -128363 -64631
12774 -64631 -186328 36958 111149 -26556 245248 218345 176358 -170159 -117038 166927 86497
12763 86497 -36502 -80073 237862 -67205 92402 -205982 -76369 53062 40246 -154919 216333
12751 -408010 147771 -95507 177226 320755 99760 125657 -239638 24425 -204701 101843
12740 508041 -204720 -52932 -86915 197674 175813 288214 -36950 91947 -52324 -179048 207184
12728 -14568 -46684 -180067 -361698 -167448 195345 -33755 25729 -185661 3797 64184 40215
12717 40215 -28486 162310 -38069 202666 -22332 343325 -269857 124019 214015 381840
12707 381840 119213 5198 -246406 -64029 72965 -204123 -6168 70791 269354 476508 134292
12695 41233 -116226 -148065 -273791 -37828 160520 215090 97652 -11832 374636 186442 -6262
12683 36491 122649 221002 139690 -74546 114138 6022 71502 184980 -411263 177709 266175
12672 266175 131282 -181393 257320 257403 -17126 109486 164897 -113648 172905 148767 -151704
12660 191242 -210415 -152239 60669 -202791 2045 117189 244272 -67190 -89793 69210 133812
12649 133812 3824 -37461 221655 180892 146925 40570 161489 322708 226340 414113 -15819
12637 -10064 -237539 182531 422531 -50132 -188180 88970 423686 -50700 177423 369418
12627 369418 9551 1034 273600 29803 73330 81420 197053 84468 151044 67932 511453
12616 511453 76206 2516 217039 117923 176818 294359 221989 270572 207297 204801 271990
12605 271990 344132 -182378 131526 109556 111062 303372 79561 -260211 -101341 -178169 158524
12593 -28381 -224785 2340 67792 -73029 405339 87244 255221 -282755 -37882 -216497 355569
12581 -72871 189062 154846 -23333 259532 169100 -55626 -276530 -99874 202347 23128 268665
12570 268665 69907 11689 -225491 203416 54969 231273 -61865 10840 344868 -7571 148770
12558 75102 -258514 291315 199999 38450 216259 -29263 50982 -112461 73065 160822 -106735
12546 -11844 -240260 56607 -102114 -260934 -2085 20268 33123 -230320 256661 169432 56224
12534 43346 1192 215581 73849 -64758 -203790 44462 128214 -16047 18695 397843 -25129
12522 -103622 -27357 -158780 -48152 133858 -246675 -34495 -26603 115820 -19312 114808 -2348
12510 400035 -144213 -31246 252211 -6655 408000 231760 -118069 23218 39037 48200 -154362
12498 -127618 165511 221291 183137 136332 306967 -218474 36160 -97826 8687 -181141 -171908
12487 -171908 -184354 -83757 12294 97641 195276 -5196 -242860 -177357 93025 71674 97107
12476 97107 93953 -39797 164795 59278 -147773 118 66796 -82756 -66984 -109246 -29683 -23351
12464 -23351 438189 85828 40410 -208472 -237225 61697 -71478 -18787 58210 9919 -241924
12452 43041 -13218 74469 41502 82981 -101262 2573 -19083 -36804 36792 275902 32786
12440 -68003 217591 -135504 -260556 -168599 471567 -114141 -47239 -58197 -22927 64045 -71876
12428 6441 -256301 57517 323831 -87165 -285842 -60876 -179150 -203531 -229361 76525 188094
12417 188094 -110395 -311665 68433 39897 92749 15927 243048 -216 17868 -24787 325311
12405 50680 361922 90061 -12831 -67186 409201 7855 2930 265784 127718 150666 -111832
12393 -276585 124600 -832 265991 23466 -102594 176290 -21371 45605 -78252 -34275 70104
12381 -306166 161691 -89373 92278 78666 62557 229523 -14637 -135363 -246663 -58633 -401555
12370 -401555 276017 31938 95262 62747 -14247 -9766 -67432 99922 -32668 -241317 75330
12358 -379910 -272781 153613 222769 -135715 -275161 99997 32855 -49699 -42868 365298 -110014
12346 251277 -176177 -79380 -126160 217638 -32478 -88947 -88178 61018 -55764 37778 39230 20917
12334 20917 -141684 108922 94414 57555 -250702 58877 92673 16179 -26883 150849 203228
12323 203228 142918 27238 -129797 -191709 -175866 -37972 -75996 -198698 97496 -30455 30296
12311 -94506 211045 331265 106267 17951 -75997 -80834 -125828 -38162 170685 300002 416347
12300 416347 79070 -274864 297199 -53884 -99019 -119929 -6890 -255874 35175 -229945 -87184
12288 -6586 -284605 -171851 114863 -22242 27393 -365966 -174695 44530 115483 -157197 344889
12276 97113 110342 135887 218571 476925 222637 90451 104978 26385 -297402 24611 -155336
12264 -57461 -154066 -131434 157646 133808 244333 20404 157481 334927 6109 50009 164822
12253 164822 -137073 108262 73473 -87300 257970 213204 -162137 -206693 -341361 107098
12242 265185 133279 -150236 -326485 -37393 188207 356273 -125947 197942 37623 -46185
12231 -72593 39041 147140 230515 136256 -264795 384920 362442 -89759 43539 47239 21317
12219 -24378 -40335 -75542 79637 118986 -111799 238720 -124917 396325 131291 -99395 602892
12207 -74640 293826 261401 -13205 67836 374314 60157 294677 129253 -22619 226878 502358
12196 502358 225145 27834 -188355 -29456 75318 -25761 186965 102685 -336456 130678
12185 191561 -88856 304902 359442 107013 149813 132587 2066 152966 261276 120909 151644
12174 151644 426749 280620 263560 45301 146708 -83391 -114525 435312 99157 -118221
12163 237764 24911 59743 486359 149554 -85251 -175583 -170298 269696 -101084 23341 -8614
12151 -337334 254122 20402 370693 243833 174712 316434 64637 102313 134617 187173 -85026
12139 13571 -112718 129663 269608 204232 -159189 -51364 249546 -277004 -190955 -22411
12128 304316 281146 45070 70594 -41469 -165168 -26226 90131 -6823 297085 65702 215235
12117 215235 -31457 -199786 109455 67022 185585 324093 -218597 -66471 -82536 38406
12106 -85859 -193291 -41657 26576 -94470 57609 241918 -84686 -161901 -84058 1203 -115907
12094 99119 -38057 93882 -223778 -206585 -9387 415477 66216 73723 -141073 173754 -14183
12082 -216020 -171853 253881 1583 -208757 -19618 318180 123101 -11078 -101578 -3199 111442
12070 230021 123693 -316399 -374116 126668 -4810 -170561 -312886 -185256 165533 99708
12060 99708 173606 129982 -63047 -116420 38075 114531 130630 -186730 -207929 167072 -49857
12048 -203825 -83797 -76967 356547 -176769 -60841 72403 -172320 336443 153560 -159955
12037 237700 305669 969830 393972 199006 410865 216884 138063 -85007 -7863 72630 147671
12026 147671 -125853 -43413 52594 -274734 137298 45453 -18907 30309 -241955 40963 4137
12014 36025 -78503 105840 337155 -34078 -117214 209744 -7271 -43565 -61368 208468 -51614
12002 -179396 -46612 -328785 -157220 88146 -185621 56815 -51997 -60887 221338 16699 -51226
11990 -330215 148362 -49837 217504 -153772 -132074 96224 -34054 -214695 -277639 -15234 -279115
11979 -279115 194891 -191003 -12177 67680 -175179 -136837 35715 52091 131185 13807 162750
11968 162750 -263534 -252763 74362 -213819 164556 -162863 -170930 -186091 33190 -51454 -83571
11957 -83571 -244627 143829 -178846 29740 41543 13408 -96523 -138249 214443 -200122 59275
11945 -82828 42900 -141808 -120691 -138504 -59454 146384 -75744 -234071 122326 78722 177167
11934 177167 191955 175625 105060 10939 40980 -279413 10832 -28779 10711 -323645 -4940
11922 110362 -184213 47985 -145993 165920 -244659 163516 53122 184551 -252073 -250294
11912 -250294 72121 -93459 -282605 165243 -167459 -372710 43383 226995 53460 -304991
11901 -127406 -102657 312598 217312 235577 -346949 28799 -365927 -306072 -360668 99913 71841
11890 71841 60815 -50967 -101080 59404 -56059 -68997 105020 -89229 -422493 -220545 -167044
11879 -167044 -262838 231157 -63275 -84127 35361 -70171 -202451 96570 199506 153862 -116810
11867 -85558 -99316 -230952 154091 230825 60098 -113981 -182461 118294 239447 175411 -230159
11855 -211836 166263 -252280 73895 -316592 -68536 239789 107675 -233500 -30984 120847
11844 -17840 -158417 10327 -85457 -240448 -9619 116286 -101598 -113578 208998 207210 37408
11832 38353 198110 -415376 105057 -96766 -268137 -38973 -9351 -88762 -25342 65877 275167
11821 275167 191801 41709 99162 -301358 -32197 -5328 228092 61179 -273957 30697 83253
11810 83253 251611 79386 -356031 104126 180277 116760 18300 -387464 -176515 -169296 -26894
11798 -176109 -25224 -74669 -159360 -66595 47118 39399 259536 148017 -85330 -107260 -36763
11786 -101170 -37351 -77131 174875 99449 80207 -220857 -283494 -11542 -13234 38730 -57377
11774 -157174 -216281 -457643 -97783 -106665 24176 -247555 49402 184506 -270938 -110006 -196098
11763 -196098 34791 -104092 -144492 -140831 158447 -169639 -55304 -19699 154798 332791 95999
11751 -207074 11832 219580 111580 90443 -305023 -182315 -153018 -131896 17923 23875 360284
11740 360284 69965 -147584 123494 -108550 214862 -34157 107790 -98382 -200193 -105440
11730 -105440 96085 -112669 104079 -131566 -177189 103026 169842 1813 283753 293352 -74748
11718 -25446 -181502 -199782 -57728 191825 178837 42695 -145072 -99251 55022 -310085 159363
11706 146960 -149988 125965 44879 -70849 4688 -134881 -300035 -82992 113961 301742
11696 301742 14344 -8528 -37054 -22868 60909 72072 -14253 -332118 101582 128095 -255009
11684 -60887 -86142 126016 -24390 -151607 173390 -43407 -18516 -267640 -214102 -42689 -155731
11673 -155731 105400 38508 -362440 372509 -96706 251155 189642 -82976 41311 -196360
11662 -151412 -71525 -29501 17485 -154794 -203381 182880 -362645 -124527 -215513 1642 -160174
11650 130662 -19736 -114035 -368120 -103524 180578 135569 226989 23531 -220124 5302 -11368
11638 8476 251438 7019 -204153 127750 90468 172079 -278075 1776 -63022 25965 50715
11627 50715 -59744 68598 -26436 -47140 -378626 -281859 -4626 57338 116967 223873 38308
11615 -163393 -516142 109294 360584 -17389 -120461 22632 101478 -220626 -19972 147976
11604 187576 -245789 -114961 -79923 231832 23073 -181378 -4167 -43894 -320600 295712
11593 27172 257313 -20719 209782 305013 -465338 219781 8923 -138122 -26871 107514 37458
11581 -35872 170413 -132995 47549 -156292 81351 186821 30393 5618 -137913 177778 -77392
11569 -127799 215725 96572 -115467 -168961 81141 42520 181684 105515 -48370 -28462 -83479
11558 -83479 -315367 -28889 49275 97695 -8047 -51125 -217953 -28010 -130386 -152557 13044
11546 -113754 -162239 -87283 -101877 102494 -7855 10912 138052 -30262 79449 -382898 204089
11534 -180905 314937 54469 -84909 128234 -495577 -223622 -202272 104309 -85952 100478
11523 -143840 -21147 -93140 -61017 -205856 185269 76633 215415 76209 90005 -126525 282808
11511 3156 31038 360985 -143389 186007 9033 147151 152819 229187 -14367 -139560 -136873
11500 -136873 26408 183735 1186 31391 -558 143209 23337 95175 97050 20626 318819 186384
11488 186384 157375 -160013 -19336 307832 -265267 -29756 -68239 -30289 67538 -184727 -30957
11476 -170158 -43090 90254 124292 -262245 106402 162748 165552 287336 -145662 108231 -15218
11464 25202 88517 -38775 -188568 -66228 -293109 -243213 171310 -226338 285976 -165039
11453 16450 1810 -6850 466070 107424 218340 315487 146830 208186 48186 218380 263115
11442 263115 41313 -254449 109706 58548 -124870 193220 6091 137643 73321 5322 -75406
11430 325993 81460 99424 67783 -152736 -32120 -44891 127781 59593 -159502 -30724 -142481
11419 -142481 170290 145937 90073 -113579 159442 -196562 77638 -209228 47652 -14936
11408 311795 -155154 30165 -22 -111787 130855 209214 39415 -318880 38900 -307198 40142
11396 -94356 158024 24806 141080 33435 74217 -175486 303802 176658 187195 152541 138237
11385 138237 -245180 -54461 -61862 128996 -51263 -385312 236526 294199 -316514 -99196 -24003
11373 305379 114666 205788 -257021 169456 -184982 7300 -199028 115212 -10859 68244
11362 -68622 -357396 -160211 19040 52441 -263776 73794 127769 -161380 -89439 192254 -269376
11350 -15916 -239758 272472 232053 -43245 -13579 196710 -40583 210222 -51055 285238 -55363
11338 52106 191566 -58327 -198440 -141217 25279 -82428 -388559 218460 -159566 -71082 3109
11326 -239944 -75479 -298261 -25117 347374 90799 193086 309889 -219326 157874 -180788
11315 43029 127590 -227072 98838 97974 86520 -180127 79812 -192811 53948 21229 -281024
11303 -4743 -122026 206774 -114228 -884 -41556 179247 64426 -338599 -25906 37194 116484
11292 116484 -237532 234260 31636 -252120 65212 37648 90280 -174575 -119167 -256 -286249
11281 -286249 -58024 -18898 -156255 -206977 15689 -176694 -318700 -143712 98832 -9531 -253826
11270 -253826 -137169 -106928 -117498 -87970 -291680 237051 77483 -13080 -125884 -5169 -9239
11259 -9239 76282 -61470 -39863 114012 180240 -146969 -12802 58294 -365127 -121069 -235139
11248 -235139 291577 -200654 -47932 83903 -165291 342210 -98150 -286409 -156757 -361450
11238 -361450 -3818 326 265267 143988 181100 -90722 -109109 189325 -122575 49781 -46565
11226 -183997 156463 -304560 44343 50643 -39655 36851 170714 -26347 -49202 -34333 -38037
11215 -38037 251688 -415596 -121641 -52775 -83584 184091 -133779 103791 42152 -133828
11204 -240174 95362 -33837 -108695 64947 301136 341811 52456 -263415 66353 -35674 -416151
11193 -416151 -352948 -120230 -14251 51303 262546 -2899 361532 59395 -149366 46760 170008
11182 170008 -26587 29475 -458715 3682 -93384 -24191 -297636 -168521 -133722 68486 -259740
11170 -85945 -281550 -74368 -119319 -54523 -466141 -467966 -345638 93409 228266 -73345 128068
11158 327826 -33363 -52449 49912 -152914 292885 -112181 -156893 -91614 193511 99931 -47279
11146 -211515 50740 -138566 64215 -376754 216799 132497 -30159 -109542 -57972 172298 14569
11134 -234880 184237 -9974 -73893 28112 -110925 93855 174601 -8956 64497 -26161 155788
11122 -185324 325234 222992 -84648 194925 48209 112198 -44687 -24501 72996 -20277 244015
11110 95334 -228352 -163173 144017 343368 144960 -3990 44449 -127842 31275 -222773 26206
11098 -199723 94573 -279883 142095 77100 -42718 209337 -51174 -150445 515113 106068
11087 183377 185374 19634 398469 277569 -36638 413147 151790 291210 97628 54875 38467
11076 38467 191589 238790 57291 310673 -224574 130508 -44172 116385 38743 56832 209554
11065 209554 406010 -110291 135550 308483 267618 132591 66351 326667 466189 353214
11055 353214 86638 261190 380431 256843 656908 324041 686819 375146 327141 235559
11045 235559 323121 617689 42565 345383 379288 604375 850998 636594 619293 761903
11035 761903 575335 640235 460961 979729 518468 389937 620752 662268 741378 587150
11025 587150 681270 863122 380999 676499 673198 438339 468521 634981 429542 564467
11015 564467 674582 302967 525806 544859 395853 389978 486999 655139 739328 519345
11005 519345 664598 666854 622987 829900 442323 548658 467193 645899 501493 618098
10995 618098 656899 261174 847772 619887 421435 700177 266891 493682 699997 804251
10985 804251 910348 479318 661604 519720 784273 680076 735923 516804 483972 642926
10975 642926 641606 788682 1060836 610737 516455 861747 1138129 941201 788957 1055526
10965 1055526 1253593 1182004 1079169 1563709 1663639 1925317 2093650 2594420 2420521 2588650
10955 2588650 2411012 2164209 1818444 2054489 1668570 1462754 1082090 1219156 1048309
10946 1048309 1334607 998108 726405 1152691 685668 513005 157254 588852 481023
10937 481023 355790 405411 340946 340090 503763 46376 302570 304547 296534 -200431 -13127
10925 228410 -180316 191979 269238 -307594 26342 -235056 -40908 216051 161215 252882
10915 252882 -133924 -183900 -109455 -38504 176022 -365148 6742 107445 -186453 221056
10904 23264 -155321 -59871 -193184 -67647 -232945 -57671 -222469 278280 33403 -12995 -25340
10893 -25340 64900 -288 -139951 -370329 -65022 -16393 -31640 -362590 34229 -28219 -234233
10882 -234233 -206768 108852 67067 -58806 -56627 -101643 152126 -40053 -4615 -200241 -58280
10870 -451484 206741 84923 -17080 51053 -221949 -45308 -20223 106997 7386 65134 -66640
10858 110144 -210260 -239593 171436 -227443 -38814 -32723 172556 -221638 47135 65409 60307
10847 60307 291965 -277951 183796 -238259 -407449 -48836 -5373 216055 -262023 68260
10836 -138177 -322821 278799 148452 -41613 -165117 19685 28614 62373 -163541 -82603 94342
10824 206525 235254 117474 159995 144031 40484 8261 14162 163252 -143998 226065 -250902
10812 -82481 -155709 -235419 -23834 -106143 110707 -84996 223589 -210076 -288232 -37900 149081
10800 62242 112718 -16428 -46844 210203 238625 -52358 124363 234367 222007 65110 -7394
10788 -266601 -211272 -28094 -361569 -119062 -243931 -120194 67425 285877 -193884 -38999
10777 73708 -80516 -141839 -191847 -134546 163443 -29347 -220050 18720 -18062 -38812 -50938
10766 -50938 -295959 -183833 120016 128194 -162404 -155327 -72244 250408 -206093 92941 100213
10755 100213 -274246 103163 39557 -298268 -10473 136805 -168912 43732 29917 -213480
10744 225147 -240944 -268916 87736 30101 -280389 149902 6141 -289537 -274759 87675 -217470
10732 -13046 346047 -136797 163715 199053 -204685 -272073 -210531 -431023 -165722 25158
10721 -95690 -327447 -14309 -41707 -266994 -97685 11247 135164 222403 54175 185587 56104
10709 41842 -181069 -315540 -139889 -83360 140400 51921 -311454 -117080 -128377 65400
10698 113201 -423363 -131942 -220777 -140781 99771 227811 -132367 -88331 82287 -19226 -24174
10687 -24174 -7115 223954 -154048 -185262 174547 -337953 -46258 -80847 -309814 -136029 139194
10675 82140 111042 52158 -114311 -114956 -31965 86088 197816 -212310 -94983 93339 -366037
10663 -192780 -278294 -71472 51195 12192 -317124 38338 79951 103213 80901 -364935 193205
10651 91594 -129192 293101 -35418 208822 -185851 -144467 -232514 194069 -202049 -285019
10641 -285019 -50333 60973 81994 -52348 37021 193233 148480 128643 -252669 254822 -61108
10629 306422 53230 -206981 467 -186212 -99578 -167847 7682 -108838 24414 -219714 18158
10617 -76021 -70935 -15713 -102948 -165137 10020 -256716 102212 -230712 307345 -305663 137178
10605 -184107 53659 -351 -118250 -353611 -62615 117069 -74809 299432 -230120 65403 -66909
10593 -89984 -70746 32761 -232433 35216 -87833 122834 -31024 -322813 -470503 -127470 -506234
10582 -506234 160787 135173 -348470 313199 122493 57833 97285 -169501 298150 18982
10571 30267 74810 -232320 -40366 -789 147413 64417 -245875 139346 -52470 -151687 -32756
10559 -129323 -53843 386 164527 -214667 24466 66343 250319 -32430 75457 -160011 178097
10547 256241 31693 123367 -197180 -174043 -251356 200277 -269511 -136267 -97132 41874 -161660
10535 175800 156292 -106496 -127255 -116641 -88004 -167885 -91512 -145782 -150175 -184411 232936
10523 293142 -167633 150597 -219714 26698 74166 -100650 -18158 -1035 -186539 314562
10512 -161467 -121131 83258 -4246 44517 -7177 290388 -225755 36447 -205129 37551 -108360
10500 -47200 -337325 295756 -39636 -3546 -40525 -138926 -130693 146951 -146959 -136687 106906
10488 -260063 97648 -32706 -166844 -9874 -33064 -93848 148252 176249 -339889 -39672 66773
10476 -216949 -44033 -72997 -105530 -212939 112444 -131521 320452 -78261 139399 190580
10466 190580 195021 -90146 -152870 -88293 -265525 -65286 -80277 240159 225916 -143081 39230
10454 -215259 -5734 -36933 104538 -164136 -39546 376819 153674 -154658 54604 -62944 181795
10442 -127724 -98456 -198237 15610 -176061 224802 -33398 132248 110286 -325998 -91256 -45400
10430 8382 -49053 -185140 169497 42865 -76651 -19246 -123762 29082 207646 -180994 73069
10418 -234275 379083 -110413 -39744 -49259 24982 -111864 208072 -38533 -471521 -27882 -251692
10407 -251692 -29092 -141506 -313181 -151237 -114300 -91865 -145359 162311 -156145 101768
10396 -64996 -218811 307000 -375271 -374905 -166039 -104042 244048 158736 -105162 -40908 200225
10384 -13419 42453 -62049 -80963 34627 283160 42964 -301108 186144 313069 247125 506503
10373 506503 27778 266917 -212562 274267 -51521 315907 306614 -64460 123502 -39050 135998
10361 278151 199171 420264 197860 168115 408843 49742 67585 319903 268051 195422 407252
10350 407252 372259 394993 469843 12329 237277 37464 139816 39299 164688 -255018 147631
10338 325957 399551 418299 340942 417664 100549 -23380 127167 50459 424757 180327 314241
10327 314241 598134 340116 64240 -34976 -182914 382301 145913 111113 -10576 141097
10316 133294 -11198 189336 -24172 71090 -123609 154390 -65729 271018 175566 201743 69342
10304 -466267 -132595 594284 56130 223842 123107 -32264 221802 150784 319931 -56895
10293 29173 -175513 47628 135996 -96613 -74265 -193093 253850 300719 37669 160181 128122
10282 128122 14281 -38732 -156270 -179694 -221450 309183 -51151 54890 236110 -172941 -338616
10271 -338616 -149001 -41 -265726 -106672 148393 -38625 -137559 -60643 -114417 -127955 -122729
10260 -122729 197517 223783 169112 111118 -301373 -209666 266734 112068 63440 276487
10250 276487 -103441 308422 2297 -85417 -403668 -186221 -130805 213185 -120405 -62562
10240 -62562 -235437 -62814 -83230 259828 -87791 -195660 -171797 -307541 -144386 203854
10229 -28624 224949 50178 196054 -167633 -334919 -316537 141734 -341038 -12281 -233379
10219 -233379 111091 121605 -322329 -352877 -77994 212149 15697 211329 -456623 79705
10208 -29818 40716 -42816 -418867 95798 36131 -50181 -2207 483830 -49035 -63177 -208780
10197 -208780 10542 -196833 266758 -14727 74436 43749 -45676 85876 118166 -287275 -360270
10186 -360270 -28159 -65565 -201073 24060 -123596 -118022 9913 -150639 -160949 -6136 -65484
10175 -65484 -7182 9165 -111526 -105173 -388177 171511 -334326 149634 163219 -206783 -71428
10163 -280350 -73643 32278 3771 -105830 -169432 94398 21168 -283971 -46734 -65787 -153862
10152 -153862 -39945 95139 -181297 -294624 37114 -182439 -90016 -23489 -289704 228473
10141 87626 -290767 -112438 -64028 -259876 -103311 -187332 -145799 13855 39769 163820 18629
10129 -92858 -19222 -300584 32332 235133 207298 -376055 -215827 -197893 -49877 112741 18149
10117 -157199 81001 190586 73508 -289985 -180303 -68027 118483 -224379 -142272 -227228
10107 -227228 203413 83951 -54544 172277 -25561 32590 99918 -110605 70108 -308643 -411113
10096 -411113 -244050 98095 -153230 -137068 62909 -212480 -296385 -153747 149666 -165187
10085 39272 97746 113538 -298588 86191 -113305 -198068 -333853 -108766 -207606 -343135 75743
10073 -58640 153245 77116 -133144 -418895 -105071 222730 -254748 -26642 -251550 328320
10062 -128804 93817 -40440 96919 -48391 108268 -27524 58406 48467 166896 232239 166473
10051 166473 121865 162127 105615 -101971 -49629 -99797 115673 -56011 12898 -161373 -285033
10040 -285033 -226926 70201 -36557 176009 -130771 -468870 -70953 -125832 -299746 202960
10029 -118024 -106155 24542 -145886 127498 -47741 133500 21910 166122 -77028 -405912
10019 -405912 -187352 123969 -161588 -211231 121454 -442263 24778 84252 -163162 5664
10008 -63203 -27778 34759 -365726 -194954 -249555 78164 44169 -66146 62239 -319111 -431957
9997 -431957 88167 -205758 -163521 101694 137220 -13493 128987 -248861 -304617 -214369 -55651
9985 -208439 -43764 294237 -161839 -212166 46341 -56829 73912 123906 174772 100729 32837
9973 -63298 -568703 -111427 -129438 -276692 103961 -112005 -33820 -400389 197855 -406009
9962 -28739 -244230 -114213 235234 -135908 -234511 131294 -159314 -384579 53974 -301451
9951 -113825 -311038 275109 128020 61067 -216885 -535974 337064 32441 -178024 -73355
9940 -207297 171685 -182071 -3266 13235 -80223 -137162 -245192 45099 130467 -30662 126804
9928 -117476 170209 -99014 148541 178217 -312655 -233333 -63453 -37903 194031 -248329 -25605
9916 226355 -169267 -190627 -154661 146255 -39377 8594 32124 162082 43701 59277 -378467
9904 -236563 10136 -101290 98805 -38504 -394246 23643 77541 -219113 -336277 64807 86625
9893 86625 94933 279857 -136578 138615 -40791 -338540 -312619 128320 -117732 169490 -26443
9881 332617 -12357 -5939 -26163 -159623 -74222 29612 21334 -255812 -113317 -46209 -27466
9870 -27466 315620 -330709 -181316 -309838 -93578 -26027 -25038 279821 16204 255825 69210
9858 -60346 -62209 -285796 -185299 -259360 120108 2316 53356 -268299 -60420 -119578 -133736
9847 -133736 47755 -360556 -187512 286991 -196646 148397 133234 -179347 -155881 -161242 -23921
9835 -25644 -16091 100278 12495 -39446 -230836 12720 174875 -71251 -299774 -193072 -61308
9823 -63167 76959 76826 -165693 -216197 -30310 55570 -68384 256253 157741 -324786 130099
9811 -20197 100031 -161904 -208672 10131 224319 59308 -245323 -95247 -169795 -332579 -82954
9799 -57351 -28015 207429 -192977 61545 -12763 -96673 -17003 -217717 -118094 -209467 -318797
9788 -318797 181631 -137456 -180244 -217181 -2816 96484 128278 162604 -175034 -474811 136244
9776 -223708 -139430 -111668 62244 187559 -11318 -131463 -39371 167927 -118589 29386 -130121
9764 -612918 -38015 -112240 174293 -19241 115717 -163456 -63656 -204894 27691 -106881 -231189
9753 -231189 -73264 -269285 47212 -220088 -78859 153431 -21190 179228 -110350 -448163
9743 -448163 110809 9497 -44681 -20419 23782 153986 -234539 40665 -282622 -136931 -259910
9732 -259910 -44707 -212010 97697 190295 69071 488569 61965 131062 219894 -156497 -31153
9720 -112283 -181252 71437 -71315 97024 -279648 154332 -37430 -48974 370335 177839 -213801
9708 -25334 -201604 14308 -23613 284867 -183303 -29063 -114406 -20049 -28514 -157477 67415
9696 13040 -50666 -14835 -51864 300532 -18146 229978 -168215 120902 -222133 -418978 -30935
9684 -50120 -57420 -310528 -148553 -28293 -8086 20897 -21045 1992 -275210 144061 78240 -121143
9671 -101233 149408 -463556 242163 -40772 -35714 127997 -29093 -364801 -176651 -241490 135266
9659 237124 -227985 217159 -80542 124328 -22976 -97854 101464 29716 19341 23384 -44837
9647 43344 -106284 121827 -346920 -232396 -4398 67309 -177596 -117719 -189678 146349 -110967
9635 117112 -136025 389560 130552 66086 -212820 -217767 193741 -235296 -67960 -14180 -96914
9624 -96914 161488 30288 -364919 -181568 95790 -106661 -45745 -251462 -136259 -156767 -349166
9613 -349166 189682 -123246 226144 -110340 19823 -201296 54774 -65697 -203008 -85147
9602 244058 119028 -45074 21790 -37848 -223590 55541 -151754 -151661 162237 -107063 177353
9590 -316004 214594 -115573 -318505 -299988 -96022 -127655 -312027 -363160 -94903 -44762 -228710
9579 -228710 -330727 300834 106128 201089 189593 -155565 37594 8975 -244501 -9391 -162507
9568 -162507 145217 -112597 47826 49729 -49627 253408 -90961 44074 -26218 -372830 -129150
9556 -42768 -108538 -295572 -203607 -35234 -363111 -216109 49605 117947 402420 221220 133270
9545 133270 -359960 -101226 -152794 -117021 -77075 -43384 -260730 -95391 -249027 -141908 -70828
9533 100105 -431410 -53427 -36988 225545 -341865 56385 181965 119082 262370 -70931 -317804
9522 -317804 -239482 -100758 196500 -123177 57935 108711 5395 -211039 -136889 -18377 24329
9510 -177169 19462 -104597 -52811 -183078 350006 -83661 -235637 -31813 -160090 -170997 -229011
9499 -229011 -135908 381508 -70526 -131061 -68513 -112153 39354 25459 38672 -302096 103241
9487 -54825 -78372 -113795 208171 10933 63013 184314 -196656 -276654 -152783 -136759 -21758
9475 29073 79833 -127937 -310055 -160840 62141 -325544 -132808 229025 62589 -41535 -125917
9464 -125917 -145331 -274216 -98517 -321434 94035 -1733 -89808 -254191 82045 -94756 102486
9452 -305461 66287 -181153 -267239 -172357 56750 -463301 289083 250661 -237923 26227 -231193
9440 -79041 382470 32242 -279529 -98788 -119525 -27273 -140807 -157077 -271892 -124151 -199534
9429 -199534 -219881 107089 145770 -2865 15029 173067 -204268 -225486 -183354 -55691 21130
9417 -88886 -3194 17787 23952 226269 122718 18037 -160630 -384750 -340590 -62131 91141
9405 -95575 77432 -179110 399107 -107328 189887 213896 -129323 140674 -8725 -109201 169867
9393 -25185 234044 240733 8163 93229 315018 -136738 -22102 177160 -8649 230807 -28568
9381 -102149 -99249 -226266 -65759 8283 33658 126542 -316757 166833 89983 -123323 -141352
9370 -141352 79030 71724 -128180 245040 166637 -94860 -140174 -319731 121414 -119659 -273514
9359 -273514 -18388 66847 -330793 -155410 68819 34485 -6237 -291532 224329 237795 -121803
9347 -113450 30643 -158213 -44384 -402630 -312737 34591 -284711 -85609 8879 86263 24909
9335 -195731 67581 29212 288237 -197855 -65545 23486 -64320 192421 102865 248815 -135718
9323 239992 -165029 -186346 -82292 -348427 24101 -29777 77740 -94073 -93272 174131 35094
9311 -269509 202407 -36743 -142615 -72570 -1254 -179743 -87614 178322 -239993 -2438 15232
9299 -287675 -196899 -449794 -1706 -109443 -90444 218380 21625 -270519 -177300 145751 -145481
9287 -48547 -209199 -108564 105087 -91258 -35014 -356529 161094 8559 -247413 -59839 -265505
9276 -265505 -195881 -107963 119007 -51943 -250427 -79585 -230059 -165570 -81775 15828 -76017
9264 41715 75917 -168074 100694 41812 -43724 16229 189541 -156990 -129496 -98540 84191
9252 234635 44032 120865 5226 -168334 -360585 -5204 -9913 112956 218103 -400895 -220096
9241 -220096 -169791 -299249 -70139 -294141 -423550 -25366 192928 -57207 -55799 -184794 -170694
9230 -170694 -298390 -100595 174954 32094 -484291 97673 -54182 -115686 117939 213508 -199782
9218 182057 -246808 -6403 170019 -72894 -197830 -85195 -236948 -104430 40685 -101527 -218346
9207 -218346 173739 -147725 81488 -218658 -57608 -114308 -42848 175455 -188258 359792
9196 -64009 -203389 -139694 6552 -19755 -159314 -196863 16921 158792 -196204 -258899 339253
9184 130978 -275018 -84877 -286583 -221112 206968 16649 -59919 -220543 243483 84270 84568
9173 84568 -118957 1840 -72053 117813 -126078 108175 -34267 -116749 -163146 65816 -120267
9161 -213779 -170863 -154865 -157334 -230374 -109498 142397 189462 -196885 -51735 -75833 -425591
9150 -425591 -47967 91375 265913 5188 -86173 -108158 258266 72276 -386010 -87683 65156
9138 37059 -236735 -29862 14604 -9564 29874 245866 -280060 170774 -358843 2235 102579
9127 102579 109256 -135244 50088 -172367 66683 -96831 -188871 -171041 174335 -72853 6074
9115 -372949 14838 160884 71565 161072 54013 -208569 -181691 115731 173360 -92988 34562
9103 -145746 -56242 -367511 -35606 -195741 -162125 -120081 142611 41362 -241085 -171282 -178191
9092 -178191 -199900 -62907 -226004 163048 -285821 56150 -178140 -263527 202306 -399902
9081 -151026 250377 273518 87714 417279 -107223 236319 -151270 13363 201973 4422 80606
9070 80606 -180774 -179559 75476 -224273 -7085 -148142 -212424 54178 -14158 -336408 -135066
9058 -43976 -225631 53766 -59529 17911 -34574 -70961 51751 251396 112431 -134164 -183087
9047 -183087 299195 267848 218740 -96168 -220617 290532 274679 -56784 -242015 -266784 -308669
9036 -308669 198899 17174 -233201 314272 -132754 -45794 -10238 28063 223631 -515 -224790
9025 -224790 -34518 169453 -123749 -312689 39974 -44874 -258291 -174538 -122851 -380332 144532
9013 -53730 6432 117687 138861 98463 -135940 -71846 110216 80425 235150 -284495 -327152
9002 -327152 226217 -128761 10608 104241 -169008 -333980 -2851 40931 175292 -124588 10946
8990 -16099 -117278 -250029 182285 -42702 -240041 -216975 -61694 16908 -23479 -95566 -286865
8979 -286865 33726 -294265 -257573 296682 181931 -5507 50599 2255 -368227 -94798 54717
8967 -73904 -318198 -348511 -17424 -271546 20913 2601 -111111 -99700 -313719 164916 -94535
8955 40603 -163206 -210999 151567 62798 -166685 97783 -177220 -159691 162788 58576 -21696
8943 -263672 -203062 257307 -46576 -11692 -182142 -164514 -161805 -370540 -2937 -82986 -27133
8931 10577 -336630 167373 52285 -279530 219136 267534 -80905 -132808 -58518 -33146 13458
8919 72339 176130 134732 245615 322694 154963 -61876 58839 347650 130762 562640 775636
8908 775636 1029053 2493614 5093051 5179210 2676840 1652375 787818 582442 364766
8899 364766 78582 302665 356692 288151 392738 43923 119922 324476 84981 -294804 250494
8887 -129200 1276 -163329 -111539 24978 175549 -138428 -441377 310143 -205904 -179975 216995
8875 -2449 -126934 -251140 -58047 -118809 -47218 154875 -119724 -57189 -307710 -102640 -203098
8864 -203098 -192753 95561 -42270 -168039 -162506 -207338 150248 145042 -165526 192216 56933
8852 -267234 -222749 -172564 10953 -38808 -201590 -226493 -295981 70123 -258719 -310276 -152265
8840 124469 -384067 -158566 131046 150009 -124931 -16150 108518 -104725 15690 126260
8830 126260 -236164 179589 217285 -22074 -297839 -321157 -119874 -161774 -79761 260964 83312
8818 -32147 211599 96009 20899 -13122 162276 -99090 -66617 -32751 -111575 -43876 -308233
8807 -308233 -180003 -213351 -53580 205729 330773 264771 -491265 -137977 40042 -26966 -168535
8796 -168535 24573 -363893 -36167 -376830 -24001 345568 101187 27835 209462 -8601 -77437
8785 -77437 112560 -147978 -161502 17203 176500 -408057 540751 -298572 -83409 -63400 -122553
8774 -122553 10853 -163186 291515 -234599 -390357 -287130 59439 -3146 127976 54242 -208391
8762 -117818 -99256 -55463 168414 -285961 -207600 -185142 118407 175813 31137 30859 61218
8751 61218 -142508 -189996 -4413 -96916 -48473 -291493 -158732 -237543 191943 -173786 -20097
8739 -198848 -209998 -237649 -228477 -156310 -356603 -265219 -169154 -3378 -138584 -21982 -88719 -283856
8727 -283856 -2924 110379 5006 -12063 172910 65286 -46120 187190 -162090 132789 -139401
8715 29738 -19060 288542 -307433 11873 -140688 -169394 -381241 130446 -144794 -126733 -217398
8704 -217398 141246 413759 -192152 14853 46131 -25348 85109 43860 -386141 -131503 -215323
8693 -215323 58652 -57551 -83203 -90445 -8729 -253945 210446 75877 -322889 -142436 208009
8681 -31922 249037 -69005 26311 149068 162334 30408 -12389 72405 -115670 -205133 -52218
8669 -178562 167083 135887 -79632 144766 -72251 -237775 109612 -127121 -81822 1770 186645
8658 186645 -170319 -35628 273198 237834 -31861 -351182 -52747 153632 188612 90962 65934
8647 65934 176222 119793 -106424 18680 -25341 22335 -368659 -239905 -4156 -167725 85535
8635 -124536 75786 -95190 -20610 153698 16983 56619 -360086 -204941 20211 46608 -97152
8623 -78182 -6351 174162 42129 -231068 -80637 -265006 -86079 42639 81023 -488 -279323 81122
8610 -226955 -57831 -180020 -77600 -145513 60690 24926 -62127 -377148 -169877 -46297 20882
8598 -170874 -62654 150072 79629 170534 -95743 293449 79318 -107403 -67362 -206544 -19014
8586 -288394 59067 -207655 -248966 -108471 -7102 195507 -264561 -67636 6559 140906 -63828
8574 162129 51370 75589 119429 -364317 107727 -102207 -28097 87195 -61196 -248551 -7883
8562 32341 -51876 -164433 310127 151858 -95431 -81085 -98506 -48058 -91309 -152368 71681
8550 74878 193982 -394447 -124335 -45644 -269622 44694 -300639 50517 319312 -174229
8539 -56149 104906 -64374 -165422 -52501 98481 19632 -221443 -17410 -70646 -128688 -98853
8528 -98853 -220312 -345159 77870 -546963 43385 -320196 -7842 -248604 -57835 -34954 -260931
8517 -260931 -202569 -25711 -6395 -52815 -132896 -25830 -105613 -2933 -228845 35656 66753 91020
8505 91020 -168345 -113242 93157 324996 -98967 289 82186 -233279 -110618 413604 93890
8493 103958 -211484 114053 189740 41888 -29990 -531737 67613 36612 13520 -58803 4636
8481 -427632 -133790 -75022 96967 -304715 245946 48743 -20090 190165 -249427 70295 114011
8470 114011 -85354 -139738 -273256 -232867 191671 -195360 53186 -140280 -246960 -325882 153977
8458 -172418 26262 -787 -28341 -49348 132851 67448 -38040 81662 137747 84262 -26684 48557
8445 -18707 -67492 3419 -211173 -130253 -263423 146697 -340468 51218 63385 -180636 18208
8433 -157992 -305497 188241 74037 -208187 -59954 -234985 111368 153491 40502 130144 -3245
8421 -160621 -224971 -34813 20503 3536 -208913 -117886 149216 104935 -316301 -126074 398599
8409 320708 30577 -197889 83310 -336505 33088 -251783 -35953 -61036 486533 136164 -30950
8397 -191925 38591 -519786 -182557 -32427 -81668 -199211 -444604 32133 -185583 -450583
8387 -450583 -156432 -67753 126600 -274528 -91418 -49592 382022 -240625 287406 -85110
8376 -94383 112475 20456 -5347 120732 -39577 78039 -192408 185845 -76713 -322744 -142781
8364 302526 -110381 -363810 227530 -101692 66948 -54807 513641 92461 -108301 6240 5723
8353 5723 -124126 350129 197807 13272 -291070 186331 -74178 -162786 16758 -457035 246483
8341 90334 -213865 -389348 -108708 -90556 -94190 -16454 -9835 -242003 105355 262784 -11403
8329 -170512 476733 -161814 129569 136681 -80941 224189 22227 86266 -62867 -68210 236248
8317 -88268 -237031 152583 -214506 189428 -20319 -39665 -246307 -357752 139167 1008 -223763
8305 155082 -56608 -37759 2126 51612 92673 -124243 23662 161629 20436 -302448 22550
8293 303554 -79105 -263939 -50025 -247035 110027 -110701 -258659 28794 -99067 -182771 71137
8281 14077 -187036 -141670 -167335 111639 23559 109840 -174743 9038 -312330 45481 -189180
8269 -96931 106542 -196348 209860 -250464 115167 -329189 366124 235955 -106696 -134230
8259 -134230 238236 -137496 35685 345756 -62171 298654 -191702 84999 -69928 -45624 204843
8247 -173801 -154563 -244247 -50603 -277127 163254 138180 -42820 46113 76654 -336555 51362
8235 228900 -37217 93703 -257617 -374464 -27440 -193359 117916 -114058 409743 122352
8224 28022 -34821 -13432 -205809 -211825 92161 -34578 -64829 8603 -242083 -280572 75528 53657
8212 53657 -142850 140519 -302002 -111608 162793 70187 -86160 -7321 253394 109512 -160238
8200 275515 236763 -119191 -270617 177702 3886 129858 112037 72592 -57636 -80835 205939
8188 -204839 29613 19734 -261428 -103811 -14792 -111574 227200 -303725 354993 -91234 -17949
8176 -128585 14894 -251855 -127047 -120452 -199663 -215854 22735 -13507 391708 -193203 -188904
8165 -188904 249038 -167797 -191901 -344344 9697 200709 14110 -150516 -220174 -125936 -280372
8154 -280372 -239088 31904 215865 14909 -460520 -70577 62402 -110294 8092 -32794 -89330
8143 -89330 -37978 -71544 22711 95172 7046 118702 125498 28324 -196129 27404 -248241 123941
8130 -224515 -73871 -114274 -18690 -44176 -207861 -323308 77245 -60809 -103937 163313 -369696
8118 -149430 254454 124206 -294061 62980 -108658 -372574 -17487 92860 -54576 282822
8107 -165146 20932 -233784 -139911 192266 -442894 16726 28218 -92381 -136611 84186 -7163
8095 58605 190924 -40181 118092 -27625 199260 -132347 22695 214611 -190217 -225213 354970
8083 -252804 77225 143569 -99272 260191 149489 -128602 47943 -223481 -96525 -100376 212551
8071 -98467 -88374 -69033 -61381 -155897 -235654 68853 49089 -88007 36076 97767 227975 56062
8058 -81909 183284 -114223 -172324 197350 -43775 98964 -132733 127531 20676 99925 12877
8046 -71758 197204 -51085 -177593 -139945 -98700 136782 195475 -118611 -327192 -195375 -72857
8034 114563 -113554 -9865 -91728 77794 -249353 257215 -77530 136155 -301156 259628 86772
8022 81404 156453 253136 -134081 184732 -28655 170979 -119339 199749 -214712 49006 217477
8011 217477 -218018 -147374 -236496 254439 -21671 -188619 -255136 53882 22901 -287431 -244677
8000 -244677 120532 -52995 147633 -20123 -20474 -123911 -361358 275729 144021 502142 9755
7988 102140 -7159 232177 62828 188180 -212200 16264 200276 -23945 -148398 57725 66022
7977 66022 -99952 17535 -59581 317199 45154 -149391 -147705 -302472 178131 -42553 -308496
7966 -308496 -89798 73012 153157 -108647 -28645 117377 62441 -70917 171248 -156844 -222484
7955 -222484 77781 -96358 -116960 80745 141330 84484 -96748 -33452 229872 -403305 3735
7943 -24169 -210477 128775 9577 -95221 348018 150096 -288863 57419 -54056 -148494 26844
7931 395556 -246286 -136596 -112827 -25428 20905 229680 114925 -250535 -235845 -27223 -101498
7920 -101498 -117449 206875 -138643 9448 69249 -109135 -181372 -86449 134075 255223 -235504
7908 -73291 90586 -7874 -62588 185204 478937 -183034 -103779 298458 -40169 -252108 -8580
7896 102201 136850 -109919 -28612 -288220 -56270 -2681 -146469 132324 109761 -124994 -40800
7884 -262394 15457 -157782 49265 298488 66940 -169447 -341292 -43750 57517 -296767 379815
7872 -13403 -149584 -71837 -206963 120536 -158008 -91093 36845 287417 10433 66228 57341
7861 57341 -125680 153278 -28276 -161462 -130315 -104368 -105208 -335047 -102973 -289353 -163283
7850 -163283 -204043 -50934 -345124 -247388 251984 -123338 -149167 -189581 -85642 365212 173593
7838 124483 34670 -301331 -21325 64097 -416713 146771 239768 -270957 37448 -93536 -186672
7827 -186672 -214414 105328 246635 5205 -31748 -204864 59152 -170623 -112141 -7514 -191051
7816 -191051 197289 -93970 -268191 -27210 -211741 -75547 626553 -240690 -80734 147270
7805 -56561 -121926 -40593 -4002 63892 130333 -55232 -242542 222551 -52513 30428 27783 -39965
7792 -56853 -130113 -222065 155926 231674 -216022 -127320 -64745 -76185 41282 -65092 -298984
7781 -298984 -348509 -211610 119925 -184812 -201102 2818 125833 73710 36160 -104281 -78548
7770 -78548 -192622 283142 76011 147055 121672 -21132 -186822 -347486 112504 -231744 348206
7758 30718 35674 58124 61267 5867 -269992 -75665 112392 -104536 -210688 -6695 -6892 426353
7745 -106365 15152 -208443 -96254 -385484 -153519 -18427 166390 5056 61094 -18779 -275802
7734 -275802 -204675 -88055 -132889 150212 70973 -412609 -216797 226084 92957 -187404 -223842
7723 -223842 -234081 -320395 -169201 -81172 -172309 -329752 -331450 -92584 66907 -311621 -87353
7711 -281653 -164804 172577 -115906 -233913 -132314 -30459 -147356 17234 -13479 204261
7700 184448 -132151 298039 -110450 336467 322065 -18969 -26710 -284321 76060 48065 144233
7689 144233 -27797 111967 18809 -4187 -106574 97519 297411 243745 -13335 -28003 -36776
7678 -36776 153096 2545 -91757 -90359 -77690 -194521 10017 64486 -455377 152411 -2782 121584
7665 -65888 -32801 36079 57206 39055 246088 28583 -58591 81915 160368 282844 -123965
7653 -1866 -112792 -199692 205905 165099 -59032 -70878 76795 -343359 -31557 115973 -230797
7641 228269 -135570 -220313 -174259 247949 -117787 -244818 107465 199459 -204210 163881
7630 247226 -17487 -111226 -369050 66030 18920 238566 -30177 -12216 -342501 307223 273578
7619 273578 68842 50943 -351019 31442 202044 -118300 1648 -118493 146582 -175911 39378
7607 -121564 -104615 -127518 -45947 -62176 -102398 -300157 20513 -129015 229857 -151965 118201
7595 -235493 -117148 452297 229049 7964 -93269 172410 -262741 -154849 -85533 -158915 121946
7583 -115351 -133787 276255 29283 -162388 223314 -238404 -150480 326416 -129072 -151558
7573 -151558 327979 93362 -178501 160185 170628 -264206 30618 82015 -13091 -304714 -163433
7562 -163433 -137077 314794 1205 -28787 -71377 -131243 57063 135557 -7076 -115371 -163128 -68597
7549 -127092 16815 -75230 -122121 -9343 36677 -103041 -63825 -1295 -390000 141230 55939
7537 148673 -59403 -362106 -133316 15494 -11873 29235 -15544 -69063 25155 -21845 320559
7525 -282611 51106 -91818 250379 169290 256515 -222762 -253435 -103753 29641 -169651 61033
7513 -162478 63125 52452 -109451 138020 73750 180719 -320191 -59474 73911 -61190 -387687
7502 -387687 -427839 -383127 -75299 -133296 -217578 399274 -194439 -82185 -76320 164996 92999
7491 92999 -125665 -248012 -133594 -55812 -117421 -110893 218603 -18540 -221871 -48518 147254
7479 -69295 -16515 80594 75108 -24376 257929 -66861 -121191 64983 -55719 -346916 110942
7467 75083 66509 -115515 -8671 -296397 -32623 336995 -68808 12849 120173 -45432 -219321
7456 -219321 87584 -103986 -175784 -138171 -327310 -134726 68784 10505 93016 -14174 -52449
7445 -52449 73221 -345382 -74194 187736 -94376 -226798 328581 26646 90454 -168798 111250
7433 -45026 -225833 -68605 228492 55656 -141873 -310736 90449 8216 -219782 -188874 39317
7421 -29444 -151919 -78878 -255989 94306 -61821 -215465 68245 -35952 -54040 -89203 58450
7409 -170232 6627 228265 -136232 185639 2946 233627 242396 -104672 17870 69650 242914
7398 242914 147405 27199 -112079 -32288 80544 199552 -281872 102352 -31569 139612 114487
7387 114487 102773 -42844 104936 -98907 -114046 23807 -102478 -163677 -54460 273863 57412
7375 9126 83741 -95058 -30182 35859 355162 -31331 -63614 107052 30212 44035 -200584
7363 85199 -5671 200086 -190546 251194 -35248 65322 -62807 -219555 -159564 -85746 -119940
7352 -119940 228432 73269 -94152 55308 -284373 -68436 218550 -122535 -126405 291356 -257541
7340 108588 38390 151421 114234 13672 -3146 91647 -428639 242371 13014 -164743 330856
7328 65461 10561 88014 -37198 115271 -7044 -29218 264668 -118431 -63230 -11543 155671
7316 -175024 95812 64959 55059 169732 172183 -87185 356336 -11879 -250978 -71745 -217828
7305 -217828 -335281 19439 -304865 126824 -156611 -33432 -6874 24782 22759 -90587 -450138
7294 -450138 -321924 -78085 169740 -175011 178932 -129206 17329 4087 -4799 118694 -202866
7282 -240194 -159574 29444 356531 126513 -154594 413513 74121 -437676 76137 -189798
7271 114979 201925 68949 64965 157951 -107160 135412 -143191 115197 -29077 -332709 26424
7259 -73957 12403 96847 -203975 -36572 141494 93977 307045 272510 -209296 -136020 39151
7247 -155360 -129081 25281 33291 91698 4902 39150 282121 -79568 225230 5845 -143182 14828
7234 -287276 -245669 -44225 -153469 -173934 -219665 11752 93571 -78525 89812 290997 304019
7223 304019 -358260 -329622 173341 44481 -195635 -108639 -124681 94709 80093 -106334 -560521
7212 -560521 -86956 -102729 38703 -270547 56582 -131379 -188558 170317 -268395 19332 186399
7201 186399 145260 -75225 -158561 7520 -372534 77715 -244687 -70225 271893 -146065 -142750
7190 -142750 77014 -116943 91936 -295702 -269068 6922 140151 -212928 80747 -133101 202001
7178 -3107 142900 -295572 96428 3881 246912 -145457 -251836 194554 -3039 -77586 89061
7166 37480 77072 -70785 -26093 377545 -122793 105914 -20776 -98342 -75867 101281 -172268
7154 -181082 52137 -174358 125820 216690 -19174 97442 -51691 420 -221120 45227 169525
7143 169525 43505 -311514 -38165 94024 63071 240875 -224792 -292544 111506 -116742 75839
7131 -33106 6682 -117303 -51768 39133 74552 -323172 150152 -85499 -82046 198057 -103080
7119 -82975 177812 -50760 26870 -50557 -142392 186502 76563 -118746 109543 -178916 -500692
7108 -500692 -251857 278813 126692 -129320 -142796 381018 89810 -94682 17104 77168 -53133
7096 135729 -115853 -16652 -122367 -336224 -16888 -47693 -189665 19800 188111 15420 129014
7085 129014 -42408 -257933 -5468 -5776 151222 -216955 -410714 -158484 -92488 -304208 -83452
7073 -162361 -18917 298009 108617 -245646 -194004 -120012 10772 237494 -274004 19440 194322
7062 194322 100561 -87761 12778 177676 151088 231624 -293184 297113 20805 338553 322816
7051 322816 234659 142347 -140926 -216122 -82395 110607 -77471 -114946 -92944 -50463 -192267
7040 -192267 -161986 -201083 -207127 143944 94148 -118011 254954 37634 134112 119192 -186687
7028 -183354 -173833 -282632 379293 -138853 139332 -45651 -115537 33176 -294862 69096 26095
7016 -28356 11746 174741 144021 -534657 209039 -297196 99255 -335213 -217865 107947
7005 526893 -79893 -293919 -32776 -139509 -77146 103770 261502 -162413 -211228 -43991 343009
6993 216190 -219231 -128499 -218629 -146533 -411979 -64224 -73941 313318 -137541 170775 -161062
6981 258376 -253914 64731 37901 -199496 -88891 165118 179891 -142543 61709 30735 -20529
6969 -11680 -206818 -29479 -94063 -118330 -199567 229652 62414 99379 -112252 239889 390283
6958 390283 -251274 -182070 -77429 -120788 48596 153389 146554 -3605 -203178 359695 -382451
6946 -155288 57874 86202 -101455 421869 31664 -104493 -152524 71035 13407 134387 -114749
6934 26141 -12701 -331512 39091 -1895 -72940 107077 -113337 -82402 -81780 61570 230319 -236592
6921 399323 -222746 -70047 -21967 140841 124041 -2724 -102287 55414 -61985 -56204 -6971 -2137
6908 -312746 -328537 311222 -94635 -299429 4224 195549 -33104 -150210 -153467 66237 -6200
6896 -52753 152364 61451 -160404 296164 8885 27706 86608 -117641 210123 162414 -200483
6884 -190022 -118949 63426 46618 -151326 -68860 -126556 133000 4036 -46706 124672 26142
6872 -220098 83616 -102460 144656 68592 -104191 36360 -162144 -122868 52562 274753 -59970
6860 347000 55421 16316 -249527 -98536 -95189 72448 62889 39215 635993 -295162 -79070
6848 7738 76860 -18281 128545 121322 -33572 118195 20348 -10204 -77416 77200 -40622 -89479
6836 -89479 -511185 -265812 120128 34785 207283 178085 179647 140419 113232 72132 -297443
6824 -150859 -108391 217801 -105961 -252411 -41504 -339757 -18655 49874 85433 -49098 344155
6812 -63655 -96148 62501 283795 -83913 74348 -113565 -42214 176209 76700 -259456 306055
6800 74333 -17389 -96440 -157005 -46298 21734 120167 -146746 -145092 65405 -218082 19693 -121050
6787 215212 -144479 -26911 -425102 195334 -251363 122609 -241299 15689 -98314 19344
6776 -72769 -289514 4869 -127106 -262265 70254 -260323 -39152 -88770 196074 238430 -126054
6764 -416239 23031 -73804 -101481 -102947 89190 85525 -28145 -177680 -153169 191146 -138614
6752 -213276 129312 205782 -81551 -79918 -36589 -227560 -7761 151609 20414 -171778 -181110
6741 -181110 208723 23991 119218 -228218 63435 -91417 159692 -5327 79129 -145722 2266
6729 194760 105315 212304 -166448 -38150 -179438 -100854 185602 108056 -273810 60666 -125667
6717 -189923 -139383 213909 253982 -119908 102332 -114897 -95690 -38238 -180639 -152864 244329
6705 -45129 -66460 169808 321142 58632 -111330 -31283 238477 -273898 -345092 -110910 -38258
6693 7651 386 381049 220001 209175 -145196 52176 -160963 -224818 49322 -123185 125594
6681 -149297 -511 -175676 -138532 -162328 58840 126738 -273127 -142569 110076 -120260 -89749
6670 -89749 62142 1075 -162133 -74073 -95897 -294751 248451 38284 206034 263046 -9357
6658 48856 -211184 19047 -186391 -214790 -168815 -125806 -15034 -226486 271157 -118441 30336
6646 -12263 53615 155916 -111568 -20920 -46801 122577 -60594 178861 -170252 -283981 -231284
6635 -231284 126642 -115804 -118169 227497 -257779 34550 -17670 -407263 -183536 275566
6624 -183662 122745 74361 325033 50352 -52531 190648 -25004 -160592 -351943 136865
6613 -417446 244195 -150014 165988 -257312 -157290 23635 -70696 23378 28342 -97061 126338
6601 -278136 -141428 514789 17526 123606 -67072 64906 135959 -4882 -127133 49591 -68127
6589 -312399 65930 -67401 -8429 97430 33969 -140110 318229 54593 -36291 -327789 -93569
6577 166461 98916 82967 140255 260425 -117068 28236 5342 71847 -39135 174746 -3552
6565 90671 -139529 -188790 57868 -126183 216254 -127510 21566 -66987 -27194 -15065 181738
6553 -131311 -1833 248100 55886 -102022 67246 -220851 154946 241318 31156 -338608 -276085
6542 -276085 -367221 -222145 -81324 127216 69964 172791 -224746 -176891 -159524 -190469 221709
6530 113046 -196071 -108474 -242165 -208378 -120081 -53348 183011 -81643 -306415 51445 -136573
6518 16928 -29272 19355 -108373 388495 203198 -14655 50715 -21753 110481 -142408 -217409
6507 -217409 -96747 8556 -103537 -26658 -310135 -34446 -56210 -134701 61178 -53786 170164
6495 110995 -216868 -74348 -28552 307976 -147893 -7976 15552 -253061 -133947 360911 -55526
6483 -126792 -146677 338447 114227 189852 161880 -203647 186210 -191509 2250 -85517 9991
6471 3238 114813 -166555 -8971 437964 244541 53662 -11896 -86454 -45496 -337909 150832
6459 -43142 208676 36438 185892 -46621 -153576 34770 -298917 45941 -182743 187700 -177711
6447 -67082 82026 163394 51185 -89130 -99444 -17008 -20184 -262572 -204864 160298 22916 137253
6435 137253 13345 11370 5184 -34367 -202549 110673 -39542 -42824 -32093 -109841 -238273 -17235
6422 -25037 222370 183030 85225 167547 -410354 94892 134098 169388 323673 -196916 -280417
6411 -280417 102590 27625 -107446 -32589 255263 13438 -267404 -190024 157111 85357 156036
6400 156036 -32438 262794 93652 -216145 -111865 -141806 59450 -24159 287244 -130482 122098
6388 167089 54506 -128407 -137626 89463 14268 -223424 -181904 -53375 -192312 84428 142562
6377 142562 -172232 165140 315388 -185905 82779 196038 86998 40129 -56452 172545
6366 -136374 -70244 26855 254926 42512 -161540 149382 -77071 -94275 -141740 88588 -196564
6354 118977 -96670 -91641 -7509 -199913 -79235 105446 -229932 -120437 -52690 -130189 44346
6342 -160568 148576 14943 -27419 206768 -119376 42262 90555 9010 -250385 291046 275311
6331 275311 46481 -23972 153154 -96396 323090 -319771 -169868 -258780 -2507 -126125 -219353
6320 -219353 -1239 41441 -365173 214617 -157080 -125569 -255151 -209165 -51424 30452 7041
6308 -102200 71301 178799 -198309 -243923 180912 -52915 29929 -169426 -157173 -162027 238072
6296 260888 175984 -200485 -145971 167267 -171285 -141542 -223569 -144102 -711501 212822 -541958
6284 -20437 -75975 -62701 -93219 127867 124820 -94310 353235 25344 54411 -95132 -261220
6273 -261220 8453 219328 -202935 -9750 -9341 -178460 99667 164520 36905 101264 91395 177806
6261 177806 -113298 274902 102321 79290 341521 -189816 95619 -334836 306204 193134
6251 193134 31850 -110748 206761 -112784 -19261 -310146 -61303 -57876 138607 -67907 -256980
6240 -256980 335498 -21416 -216489 -174320 195073 -286575 -58161 243267 210256 284871 358570
6229 358570 -259736 -165251 -45439 104560 67712 98937 -311714 -173597 -29055 -16428 -165028
6218 -165028 232003 196991 -101168 139795 -188645 -273679 73103 273705 -257667 58340
6207 90904 47051 10999 -176130 23637 -6215 166759 -102280 146969 84001 -76118 -34817
6195 133745 8940 51436 -258467 210134 -133032 -130869 -176039 -202993 -114155 9340 -107602
6183 -58724 2400 208229 232635 -201064 287619 -144738 141057 199589 -130236 -62340 -290554
6172 -290554 55525 76697 -214959 243115 148682 11656 122453 -137079 115774 -97830 -46563
6160 -345588 25574 357077 -53500 -159636 -72765 6560 107501 12903 -78720 19565 23776
6149 23776 -80093 307999 160947 182974 48133 54215 50193 -240052 -11886 192203 53684
6137 -118940 61365 -32311 -40282 -81104 103633 20198 55527 -148028 -228897 -54964 434302
6125 -247437 -311534 336999 -372522 -252146 -120337 214038 -30414 156027 -7106 70331 -48408
6113 -16944 92220 241081 -38459 85296 55691 181451 -100818 168530 -131052 96353 -28094
6101 -190414 -138735 227768 9217 65966 -112623 25247 123549 8136 -248308 -56520 4348 98812
6089 98812 -87539 80388 7677 48741 119537 286861 27479 -140168 9286 54767 30689 -41443
6076 -248707 73513 1174 75435 35395 183815 201687 92949 104287 -173751 130363 94953
6065 94953 164086 -134560 -47793 -57248 112516 31697 470789 318833 -208038 -206395 33080
6053 70764 57789 -52298 139217 -85695 -143535 -359055 -150537 179109 43860 190783 -31829
6041 255255 -251214 -159732 -12464 -167477 -92070 233858 258556 47129 -70321 21274 147184
6030 147184 329230 -248722 135193 -37213 -49458 274197 111720 -238841 323603 -79233
6019 -155063 -206001 -314429 -10224 -128675 117643 148190 289726 190960 -91858 192317 -57863
6007 229502 13297 -419574 -5660 -5405 276825 48758 -233702 -178452 -151325 -337980 -31968
5995 -309407 267655 -41790 54096 9756 198419 314775 57920 144055 15514 92513 57315
5984 57315 348699 161328 68824 -83234 121275 157809 -343606 -73749 -149147 143277 -65804
5972 -439980 -4277 258080 -114714 312178 -145241 -157761 129557 -311085 45093 -70993 18107
5960 5987 -180293 -12081 1765 -28259 -214227 69280 78100 1487 175052 -46975 45892 117576
5948 117576 6483 28267 -163931 26188 -11438 -74385 144508 -412818 35570 235919 100027
5936 101827 -160006 187365 200334 103975 -40695 29110 96080 -113112 66720 133645 131388
5925 131388 336350 -70311 102217 21763 -263092 -108798 56109 -9960 -411253 -8948 -60046
5914 -60046 229218 -78046 -93220 78543 123997 45746 244541 -24629 -370989 -300662 -51149
5902 -195692 384135 174316 38158 98176 -6121 -90948 116560 -321478 -85162 -195918 92130
5890 -268315 415494 -267214 -152825 -156900 46799 224285 -82049 172316 -176831 63408 154142
5879 154142 -3575 212690 -167449 -166755 166046 -100149 -77911 -168445 54465 191410 116237
5868 116237 183672 -27772 -115954 179501 -87356 295554 55920 74710 -187660 -15773 69305
5856 -139063 220303 291508 -61043 28306 -100205 -315560 171156 26271 -43245 125769 -238210
5844 19303 66377 -57255 -129882 -55869 108956 431223 -68621 -240264 225510 -5030 34276
5832 13646 -194117 -256135 356892 167938 59239 -160962 96351 -51279 270485 394436 28147
5820 -75377 60313 -154703 -103959 -15960 -278968 106315 -215811 113104 -106901 -220771
5810 -220771 60107 -73503 -96259 -130211 -12017 -316599 -128551 -486709 55615 -34461 42256
5798 88991 62375 -190155 186300 -31096 124376 -14199 -229821 470421 18280 -53760 219614
5786 -246790 25562 79241 -235659 -66121 -132071 23396 -90889 103245 137772 246788 252366
5775 252366 -6688 -197904 70473 129450 -117023 -225293 -57994 36799 -70487 -259993 -227346
5764 -227346 91384 -89954 128466 112669 -315499 -33645 -120098 -271450 127531 -5365 -37239
5753 -37239 139024 235690 -13846 -41237 22904 86725 -151420 168915 409080 6861 125941
5742 125941 172059 96998 -195536 -21769 10435 -103407 57835 -152404 -280024 -49855 -279451
5731 -279451 68465 -122451 114418 -38757 286889 281764 -153311 319124 -331751 -73480 123457
5719 -353936 277339 155998 19992 231562 37528 244924 -135443 247636 10867 -84669
5708 228322 98873 149038 -485802 -391640 -44171 5132 57609 144070 128639 -22825 306667
5696 -41691 119771 7098 -270653 121658 93579 -227657 266415 101703 -189039 -328690
5686 -328690 211152 -156896 57883 96262 130795 -228962 66337 -175586 -90299 286206 -379935
5674 24069 37732 -131122 -57887 133416 -23095 -47669 -237405 -80100 -234288 41621 117619
5663 117619 -147464 53194 -28449 177887 -76555 -102717 -161213 161164 -322456 32699 143447
5652 143447 -127055 173943 24434 54324 -136694 -66453 31747 191309 -179962 -26824 -124667
5641 -124667 -68380 227018 -328960 307024 -60585 -15792 247275 170310 -61335 -169529 -156214
5630 -156214 -98035 -173728 36483 -163579 -41182 370820 130511 -197082 -126292 48955 -123000
5618 -356976 -67480 41158 -80821 -258498 -50576 50965 -111246 70968 -88651 -69198 109562
5606 156626 -3624 192580 -155248 -74612 -204708 -273783 214042 51425 95008 56562 -208923
5594 96866 -181273 -23348 -84750 -31542 -4276 205093 330576 78757 394747 -62611 52474
5582 106202 53817 -46090 42850 14779 264129 352539 -133165 192972 -18430 -149438 65611
5570 -75360 154313 -138449 -48209 -267830 -200510 -259422 -5446 -219856 146765 456823 -61315
5558 -74121 57149 -67837 53343 203659 -116322 301935 -207071 -117893 -36252 217499 -381644
5546 -34109 134201 -310233 25563 82882 49539 160385 2980 -22104 177393 104525 337308
5535 337308 305629 -33959 -91475 60322 -101888 -180834 124475 121893 -82867 87215 138304
5524 138304 -265773 -91059 -75179 -24191 -65841 133246 -251036 -237889 172358 85074 103613
5513 103613 146779 -37190 -86056 82170 -86296 -31671 120639 179101 -221263 243671 -102610
5501 138564 65471 1408 -40463 8402 -139943 -164090 -184063 -149012 94616 -237325 5266 -116888
5488 109546 268496 -209215 30601 67898 -56266 -67807 79696 -78459 -341948 38528 197623
5477 197623 79758 2478 116568 -500363 83187 -54242 -135951 104575 -198039 188778 -169083
5465 240407 -290113 -25421 49088 204615 -74263 -146884 -168250 -140724 149803 -195573 -49820
5453 196909 22858 -6425 -543598 194376 142501 -80044 -2512 123103 9272 -59049 -56446 67101
5440 -258597 -135800 -1672 -70331 -187898 -121672 -248065 53628 336554 257025 151483 -199303
5428 25202 -60642 456842 -215658 -83598 8764 -117845 16138 156742 178673 118734 -360798
5416 -98366 -105979 38895 90992 -162016 -34027 -32590 122289 -294299 -113867 134237 51873
5404 138320 9214 263832 195064 44920 324723 188395 -2525 -35821 274353 -175549 97080
5392 -18738 -50288 -14562 8304 -16975 291965 -141893 -213552 305003 -124184 -51492 134894
5380 58011 -322306 78298 95373 -78869 -23476 -110941 450285 -127618 -143270 -39283 -142314
5369 -142314 318868 -46641 -93775 -112684 308857 22107 -167345 -48229 90816 -22681 -57536
5358 -57536 -153149 -267452 201143 135146 -366690 -141962 156980 20574 111977 -7600 98885
5346 56925 -30795 -11179 -93851 80696 -92355 72328 -96356 68390 30519 158880 -134111
5334 307639 -259719 -152096 -17590 -78397 152135 17757 97949 59183 224264 135430 -93439
5322 39212 234700 -130224 127411 -200479 -156893 -186032 33060 -27262 -110454 -65367 -79824
5311 -79824 339723 43882 4130 -91484 73209 111479 36677 -51029 243587 -153418 -45690
5299 23570 -193923 -228077 63704 -9130 -15910 166068 -45375 32091 -80842 225475 -199825
5287 2578 -49037 348236 129899 -199431 -173193 22713 -152066 -47720 1658 -41860 11520
5275 -143990 113430 164251 -197365 -78254 89266 -15588 -49123 116613 -194846 -64968 -95160
5264 -95160 173979 -16239 113548 -342720 -79005 233382 325909 -167832 185581 138355 125660
5253 125660 9228 367207 -66775 -128030 -322386 124424 -9043 90738 308615 29699 182782
5242 182782 -8104 -547782 -155664 -164600 53176 -148013 -61804 264700 -13995 36391 -165795
5230 97069 147942 -24963 120177 -10856 -142368 165991 -241895 -32811 93680 -347369 -152547
5218 97535 -29515 74078 294587 182195 92190 204655 556747 -30749 -6987 -27826 97903
5206 268647 151500 45563 150733 -185967 50361 -127962 -155417 -122502 -451615 -288789
5196 -288789 31409 101005 -55140 41241 -70866 36649 56369 -689 256361 -108775 -35613 -35024
5184 -35024 -53441 10664 -140098 -85175 148894 -70459 178963 303037 79502 -229059 -126166
5173 -126166 170550 -98019 38508 -130380 58738 -86623 57723 30519 -261907 -70474 39085
5161 88550 301578 -206494 -234230 -69242 175617 113243 208018 92946 -141894 189486 211015
5150 211015 -14734 250157 -54830 80753 34768 -35547 22015 392203 98578 -83235 194256
5138 166935 172049 201113 62630 131048 -131676 -60944 235403 -129946 -175539 74993 -163781
5126 -29725 43094 396295 -71068 106873 -51851 140355 -7231 87702 50333 -200573 -181419
5115 -181419 189439 13430 342293 74558 90083 141819 286862 104060 -481871 107061
5104 28494 -67948 -182980 149471 -25221 -5640 -415696 115323 57345 111439 22999 -244680
5092 195197 118752 -46134 -25220 -186156 -350527 -70764 -381716 33316 297355 390918 -83529
5080 -216858 71375 201145 194565 -133095 151291 -128241 -162525 160755 -322288 85170 -22103
5068 -291530 -56265 -175752 -298046 50350 -136384 198489 -116157 18274 -42081 -197757
5058 -197757 71180 33943 -40146 361691 -157572 -81225 189171 204621 173926 -22419 81735
5046 47745 32958 226894 114427 220984 -98798 193127 4508 -111649 82562 -55270 10854
5034 66032 -99429 -82246 84944 -62682 -216118 61330 34807 99709 -209560 81906 -34706
5022 -69531 256563 -60366 72468 164336 66880 158812 70524 166782 294876 -22515 196469
5010 -282075 198315 -257579 110327 -51317 -145917 -127633 96574 38293 -76801 166149 -234698
4998 58686 -42666 -159755 -13687 -52658 134581 -58428 166108 63781 -61924 485745 173149
4986 123468 199089 365839 -37869 389697 -268475 -284948 -72295 154596 -16873 68570 177099
4975 177099 95530 39322 -112274 34842 -159151 -7423 205168 -37295 164654 -64770 95796
4963 338812 -202047 -112390 -98795 -148261 22022 -133931 -1798 -96945 -177767 27220 296227
4952 296227 33665 -149312 -111273 199141 401750 -7849 -174186 -57954 -169492 107214 130111
4941 130111 144566 126572 -301776 -105340 -96497 -185472 -70312 -99962 -120269 38585 138311
4930 138311 54743 -61297 -134292 38363 375991 -148885 -280891 60376 -62402 180226 266169
4919 266169 -70578 -21132 38228 -154418 272597 225038 30480 -136137 -190269 195429 -313071
4907 -79240 -60583 180081 236077 -311336 112192 298911 -80716 44294 69769 282397 323244
4896 323244 202005 -78974 -16006 166710 294354 34571 211370 -43523 69611 -126247 -18549
4884 148393 -2216 -32442 105543 8698 -155847 -32267 -36030 48795 1524 -86938 -169034 171310
4871 26342 8846 37540 -186900 22150 65580 -354370 187477 151761 185637 96560 -7366 134191
4858 246121 -74351 -173020 42009 -300 -140345 -14980 -515835 46082 214790 115342 -58819
4846 66066 90501 1662 -104041 -223796 -513 182187 -110462 -72725 27937 -9699 -360951 -121616
4833 103173 -31091 376858 152401 -193018 140740 230013 -280327 -332304 198457 -83563
4822 184875 18552 13482 -119539 325941 -287224 -259494 -99562 6580 58792 163040 75207
4810 -27767 -142941 81429 -38464 -118311 225730 58084 117434 68306 -239053 -312086 -108043
4798 -103412 -283451 -255275 -143811 -109703 18234 76482 118082 -28177 205042 -347309 -59094
4786 -141768 -92797 -59903 -43591 18908 -128496 224556 212476 97828 -149761 329775 -22122
4774 -95522 -720 99560 -133944 -40229 75394 90591 51729 -110016 -45829 302241 -121595
4762 183823 66066 -8814 94912 -47388 -35262 74854 90501 -5792 202480 -60145 261970 136093
4750 136093 265311 250092 -211154 -321121 -166528 62041 -42486 -119383 188282 43977 -4573
4738 -282666 2743 34716 136299 -11095 222240 103765 -150761 84611 187758 18436 28718
4727 28718 38995 -91009 72981 -27656 399558 134240 -108415 367188 113338 100062 -174819
4715 -312028 -208903 127559 -17493 -13838 190256 100428 -160049 -65830 66234 -25800 -218681
4704 -218681 -263451 33498 119443 112544 39306 91304 12219 28237 282127 62551 306399
4693 306399 189273 -105636 -88258 17443 69521 -356628 -121674 -99216 -199743 40994 66590
4682 66590 -245199 -17873 -275026 18560 -79673 -274968 109676 45276 -3034 123982 -125976
4670 254560 98948 -408990 -197710 110797 -265572 78817 -14860 127365 -270794 165271
4659 -286802 -137904 -257419 -445558 -207528 -326116 229273 145973 -305926 -320829 99038
4648 -536965 -136757 -31783 126483 109641 149320 -38661 -238210 -186179 189187 425054 101258
4636 226020 -119892 167592 244417 13702 175931 130507 -149024 18917 175217 42962 106104
4625 106104 -18323 259896 69167 -22757 109411 242767 79949 59245 -112379 136014 -87690
4613 -34441 -58088 -190129 -302431 29009 121565 -579 267293 -107790 83263 233845 -176466
4601 84430 143755 113663 -126269 -52224 117033 -16281 -25241 16814 27323 61528 -112458
4589 20332 -213931 147421 52608 -129698 21930 13474 -178007 -185379 151240 41922 182272
4578 182272 339613 242133 216073 -248174 -26476 61044 30391 220030 -404944 266576 182332
4567 182332 -128529 165602 255154 -146490 61100 -119007 297218 144210 -209195 169670
4556 -96429 5823 132782 41177 173139 83552 -242288 -120158 57656 14415 -290948 -52064
4544 -44565 8335 -341973 -309201 -208706 142450 -298136 427407 261629 198387 -66695 311963
4532 22031 -172291 -221111 66929 67168 -39182 81644 -153714 -168138 -201190 263139 177499 276978
4520 276978 272831 -335531 -16729 364325 303572 -239858 -111586 -1574 -2851 -173189 -129212
4509 -129212 82506 127790 105380 135168 129815 -89687 -86020 27782 -168046 246880 158261 170440
4497 170440 -178422 76022 -91658 60783 285338 -13019 -128341 -347332 -313072 -234958 83446
4485 -195621 211279 -134172 26385 468947 -128605 -336192 -169095 -19349 -2922 -323795
$$ [...]
##END NTUPLES=NMR SPECTRUM
##END=
