
##TITLE=AC1103_ROVE100A_5867950_VllEZNSyBV
##JCAMPDX= 6.0         $$ Bruker NMR JCAMP-DX V2.0
##DATA TYPE= NMR SPECTRUM
##DATA CLASS= NTUPLES
##ORIGIN= BRUKER
##OWNER= Administrator
$$ 1.72 TOPSPIN		Version 2.1
$$ 2012-03-31 00:34:28.796 -0500  Administrator@TOPSPIN
$$ Compression mode = diff/dup
##.OBSERVE FREQUENCY= 400.13188235
##.OBSERVE NUCLEUS= ^1H
##.ACQUISITION MODE= SIMULTANEOUS (DQD)
##.ACQUISITION SCHEME= undefined
##.AVERAGES= 64
##.DIGITISER RES= 22
##SPECTROMETER/DATA SYSTEM= spect
##.PULSE SEQUENCE= noesygpps1d.comp
##.SOLVENT NAME= COFFEE_meoh
##.SHIFT REFERENCE= INTERNAL, COFFEE_meoh, 1, 14.96684
##AUDIT TRAIL= $$ (NUMBER, WHEN, WHO, WHERE, PROCESS, VERSION, WHAT)
$$ ##TITLE= Audit trail, TOPSPIN		Version 2.1
$$ ##JCAMPDX= 5.01
$$ ##ORIGIN= Bruker BioSpin GmbH
$$ ##OWNER= Administrator
$$ $$ C:\Bruker\TOPSPIN/data/COFFEE/nmr/AC1103_ROVE100A_5867950_VllEZNSyBV/12/pdata/1/auditp.txt
$$ ##AUDIT TRAIL=  $$ (NUMBER, WHEN, WHO, WHERE, PROCESS, VERSION, WHAT)
(   1,<2012-03-31 00:34:24.062 -0500>,<Administrator>,<TOPSPIN>,<go>,<TOPSPIN 2.1>,
      <created by zg
	started at 2012-03-31 00:22:52.312 -0500,
	POWCHK enabled, PULCHK disabled,
       configuration hash MD5:
       1A 1E CE 29 27 FD 77 03 67 4E F0 E3 C4 B2 CB 90
       data hash MD5: 64K
       8B D4 4B 95 DC 68 2D 2E F5 A0 1F E6 C3 9F AE 11>)
(   2,<2012-03-31 00:34:26.796 -0500>,<Administrator>,<TOPSPIN>,<proc1d>,<TOPSPIN 2.1>,
      <Start of raw data processing
       efp LB = 0.3 FT_mod = 6 PKNL = 1 PHC0 = 0 PHC1 = 0 SI = 128K 
       data hash MD5: 128K
       77 BC C4 F5 89 64 B3 C0 55 49 16 7C 08 8D 27 B9>)
(   3,<2012-03-31 00:34:28.046 -0500>,<Administrator>,<TOPSPIN>,<proc1d>,<TOPSPIN 2.1>,
      <pk PHC0 = 32.08557 PHC1 = 0 
       data hash MD5: 128K
       8F 17 E3 23 A8 FE 9B 45 55 6F 1C 8D 39 3C FC 73>)
(   4,<2012-03-31 00:34:28.281 -0500>,<Administrator>,<TOPSPIN>,<proc1d>,<TOPSPIN 2.1>,
      <abs ABSG = 1 
       data hash MD5: 128K
       2A 27 47 05 67 B7 55 31 C0 49 F6 73 0C DA B9 97>)
(   5,<2012-03-31 00:34:28.359 -0500>,<Administrator>,<TOPSPIN>,<proc1d>,<TOPSPIN 2.1>,
      <abs ABSG = 2 
       data hash MD5: 128K
       DB 79 33 5C 72 3C 5F 86 D3 0F C5 89 AD BD 23 73>)
(   6,<2012-03-31 00:34:28.421 -0500>,<Administrator>,<TOPSPIN>,<proc1d>,<TOPSPIN 2.1>,
      <abs ABSG = 3 
       data hash MD5: 128K
       BB 87 35 28 A3 8A F6 9B 72 79 0B 22 DD DA EF 24>)
(   7,<2012-03-31 00:34:28.656 -0500>,<Administrator>,<TOPSPIN>,<proc1d>,<TOPSPIN 2.1>,
      <abs ABSG = 4 
       data hash MD5: 128K
       40 27 75 80 A4 E8 3B 20 85 2C F2 98 1B CD DA F6>)
(   8,<2012-03-31 00:34:28.703 -0500>,<Administrator>,<TOPSPIN>,<proc1d>,<TOPSPIN 2.1>,
      <abs ABSG = 5 
       data hash MD5: 128K
       C3 18 F5 DA 72 96 59 7A E9 42 6B 6D 6C C3 B2 D3>)
$$ ##END=
$$ 
$$ $$ hash MD5
$$ $$ 3A 9E 8A EF FB BE F2 F7 89 06 EE C9 D5 BA 4C 14
##$RELAX= 
##$RELAX= 
##$RELAX= 
##$RELAX= 
##$RELAX= 
##$RELAX= 
##$RELAX= 
##$RELAX= 
$$ Bruker specific parameters
$$ [...]
##$TP07= 0
##$TPNAME0= <>
##$TPNAME1= <>
##$TPNAME2= <>
##$TPNAME3= <>
##$TPNAME4= <>
##$TPNAME5= <>
##$TPNAME6= <>
##$TPNAME7= <>
##$TPOAL= (0..7)
0.5 0.5 0.5 0.5 0.5 0.5 0.5 0.5
##$TPOFFS= (0..7)
0 0 0 0 0 0 0 0
##$TUNHIN= 0
##$TUNHOUT= 0
##$TUNXOUT= 0
##$USERA1= <user>
##$USERA2= <user>
##$USERA3= <user>
##$USERA4= <user>
##$USERA5= <user>
##$V9= 5
##$VALIST= <valist>
##$VCLIST= <CCCCCCCCCCCCCCC>
##$VD= 0
##$VDLIST= <DDDDDDDDDDDDDDD>
##$VPLIST= <PPPPPPPPPPPPPPP>
##$VTLIST= <TTTTTTTTTTTTTTT>
##$WBST= 2048
##$WBSW= 25
##$XGAIN= (0..3)
0 0 0 0
##$XL= 0
##$YL= 0
##$YMAX_a= 8785722
##$YMIN_a= -5134305
##$ZGOPTNS= <>
##$ZL1= 120
##$ZL2= 120
##$ZL3= 120
##$ZL4= 120
##$ABSF1= 14.96684
##$ABSF2= -5.58569
##$ABSG= 5
##$ABSL= 3
##$ALPHA= 0
##$AQORDER= 0
##$ASSFAC= 0
##$ASSFACI= 0
##$ASSFACX= 0
##$ASSWID= 0
##$AUNMP= <proc_prof1d_extract.lims>
##$AXLEFT= 0
##$AXNAME= <>
##$AXNUC= <1H>
##$AXRIGHT= 0
##$AXTYPE= 0
##$AXUNIT= <>
##$AZFE= 0.1
##$AZFW= 0.1
##$BCFW= 0
##$BC_mod= 0
##$BYTORDP= 0
##$COROFFS= 0
##$CY= 15
##$DATMOD= 1
##$DC= 0
##$DFILT= <>
##$DTYPP= 0
##$F1P= 0
##$F2P= 0
##$FCOR= 0.5
##$FTSIZE= 131072
##$FT_mod= 6
##$GAMMA= 0
##$GB= 0
##$INTBC= 1
##$INTSCL= 1
##$ISEN= 128
##$LB= 0.3
##$LEV0= 0
##$LPBIN= 0
##$MAXI= 10000
##$MC2= 0
##$MEAN= 0
##$ME_mod= 0
##$MI= 0
##$NCOEF= 0
##$NC_proc= -3
##$NLEV= 6
##$NOISF1= 0
##$NOISF2= 0
##$NSP= 0
##$NTH_PI= 0
##$NZP= 0
##$OFFSET= 14.96684
##$PC= 1
##$PHC0= 32.08557
##$PHC1= 0
##$PH_mod= 1
##$PKNL= yes
##$PPARMOD= 0
##$PPDIAG= 0
##$PPIPTYP= 0
##$PPMPNUM= 2147483647
##$PPRESOL= 1
##$PSCAL= 4
##$PSIGN= 0
##$PYNMP= <proc.py>
##$REVERSE= no
##$SF= 400.130005511589
##$SI= 131072
##$SIGF1= 0
##$SIGF2= 0
##$SINO= 400
##$SIOLD= 131072
##$SPECTYP= <>
##$SREGLST= <1H.CDCl3>
##$SSB= 0
##$STSI= 131072
##$STSR= 0
##$SW_p= 8223.68421052632
##$SYMM= 0
##$S_DEV= 0
##$TDeff= 65536
##$TDoff= 0
##$TI= <>
##$TILT= no
##$TM1= 0
##$TM2= 0
##$TOPLEV= 0
##$USERP1= <user>
##$USERP2= <user>
##$USERP3= <user>
##$USERP4= <user>
##$USERP5= <user>
##$WDW= 1
##$XDIM= 131072
##$YMAX_p= 423727826
##$YMIN_p= -164544278
##$CURPLOT= <Network HP LaserJet P1505>
##$CURPRIN= <$Network HP LaserJet P1505>
##$DFORMAT= <normdp>
##$LAYOUT= <+/1D_H.xwp>
##$LFORMAT= <normlp>
##$PFORMAT= <normpl>
##$SURQMSG= 1
$$ End of Bruker specific parameters
$$ ---------------------------------
##NTUPLES= NMR SPECTRUM
##VAR_NAME=  FREQUENCY,     SPECTRUM/REAL,   SPECTRUM/IMAG
##SYMBOL=    X,             R,               I
##VAR_TYPE=  INDEPENDENT,   DEPENDENT,       DEPENDENT
##VAR_FORM=  AFFN,          ASDF,            ASDF
##VAR_DIM=   131072,        131072,          131072
##UNITS=     HZ,            ARBITRARY UNITS, ARBITRARY UNITS
##FACTOR=    0.0627417313425165, 1,          1
##FIRST=     8223.62146879498, 1703,         -86389
##LAST=      0,             4497,            -86268
##MIN=       0,             -164544278,      0
##MAX=       8223.62146879498, 423727826,    0
$$ Real data points
##PAGE= N=1
##DATA TABLE= (X++(R..R)), XYDATA
$$ [...]
63779I77167k8101l0247l1825l1618l0510l0149l0653l0780k9858k8287k6332
63768F48807k3757k0815j8483j7246j6565j5990j5857j6274j6241j4768j2336
63757D60475j0335r311q702q075p607p250o446n029l653k907k683k856l854n833
63743C75934p768q311p414o296n730n150l848k374k005l015m165m133k966j816
63729C10943j502j838k237k494k748l087l426l558l208k281j293j125j956k835
63715B77355k755j837q95k03M37O63k13j805k585j806n04R7L13J153K405K761
63699B72581J661n3j309j714j258q2J188J689J280P51P90J325J982K497K340Q60
63683B84528j524k944j911P50K669K682J869J791K517L080L164L415M098M454
$$ y = [977167, 949066, 918819, 886994, 855376, 824866, 794717, 764064, 733284, 703426, 675139, 648807, 625050, 604235, 585752, 568506, 551941, 535951, 520094, 503820, 487579, 472811, 460475, 450140, 440829, 432127, 424052, 416445, 409195, 402749, 397720, 394067, 391160, 388477, 385621, 381767, 375934, 368166, 359855, 352441, 346145, 340415, 335265, 331417, 329043, 327038, 324023, 319858, 315725, 312759, 310943, 309441, 307603, 305366, 302872, 300124, 297037, 293611, 290053, 286845, 284564, 283271, 282146, 280190, 277355, 274600, 272763, 271868, 271665, 272102, 272765, 272552, 270747, 268162, 266356, 265852, 265949, 266262, 267415, 269820, 272581, 274242, 274189, 272880, 271166, 269908, 269826, 271014, 272703, 273983, 274734, 275524, 276849, 278831, 281328, 283668, 284528, 283004, 280060, 278149, 278899, 281568, 284250, 286119, 287910, 290427, 293507, 296671, 300086, 304184, 308638]
63669C08638L879L163L773N945Q184Q836P728O036N104N583P144Q408P753M933
63655C95107J700R9L00Q90R73Q74Q04J55j324k796l563m050m775n161m455l216
63639C71562k595k471j637K64K150L161L664M208M369L433J594j58r96n97J059
63624C87010L538N689O282N149L465K643K993L567L382K574K094K388K929L242
63610D36945L658M495N019M210K430J332J876L211L773K871J002p84j601j364
63596D67073r94j388k194k308j730j794l179m768n208m539l384j584J062L463
63582D38528M229L765L896N294O581O300M804L805M760P827J1667J4142J4035
63569E29633J2379J1349J1880J3079J4029J4995J6526J8459K0425K2474K4543
$$ y = [308638, 312517, 315680, 319453, 325398, 333582, 342418, 350146, 356182, 361286, 366869, 374013, 382421, 390174, 395107, 396807, 396906, 397206, 398096, 399069, 399943, 400747, 400902, 399578, 396782, 393219, 389169, 384394, 379233, 374778, 371562, 368967, 366496, 364859, 365123, 367273, 370434, 374098, 378306, 382675, 386108, 387702, 387544, 386548, 385951, 387010, 390548, 396237, 402519, 407668, 411133, 413776, 416769, 420336, 423718, 426292, 428386, 430774, 433703, 436945, 440603, 445098, 450117, 454327, 456757, 458089, 459965, 463176, 466949, 469820, 470822, 470038, 468437, 467073, 466079, 464691, 462497, 460189, 458459, 456665, 453486, 448718, 443510, 438971, 435587, 434003, 435065, 438528, 442757, 446522, 450418, 455712, 462293, 468593, 473397, 477202, 481962, 489789, 501456, 515598, 529633, 542012, 553361, 565241, 578320, 592349, 607344, 623870, 642329, 662754, 685228, 709771]
63558G09771K6131K7132K8300L0213L2482L4612L6919L9741M2543M4821M7268
63547A099933N0729N4304N5812N4284N0835M6858M2330L6419K8989K0868J2994
63536A554355N772q65o943j2066j5738j8259k0843k4218k7398k8770k8358k8077
63524A348592k9449l1966l4056l4808l4125l2074k8987k5783k3236k1094j8623
63513A034391j5824j3299j1051q397n167k061N44L239O424R243J0608J0891J1678
63500A031219J3871J6890J9768K2254K4449K6201K7490K8885L0976L3551L5967
63489A311521L8100M0368M2938M5668M8745N2481N6095N7479N4721M7552L7025
63478A832693K4433J1169r30j0279j6635k0788k3174k3699k3117k3476k6170l0128
$$ y = [709771, 735902, 763034, 791334, 821547, 854029, 888641, 925560, 965301, 1007844, 1052665, 1099933, 1150662, 1204966, 1260778, 1315062, 1365897, 1412755, 1455085, 1491504, 1520493, 1541361, 1554355, 1560127, 1559262, 1552319, 1540253, 1524515, 1506256, 1485413, 1461195, 1433797, 1405027, 1376669, 1348592, 1319143, 1287177, 1253121, 1218313, 1184188, 1152114, 1123127, 1097344, 1074108, 1053014, 1034391, 1018567, 1005268, 994217, 985820, 980653, 978592, 979136, 982375, 988799, 998042, 1008650, 1019541, 1031219, 1045090, 1061980, 1081748, 1104002, 1128451, 1154652, 1182142, 1211027, 1242003, 1275554, 1311521, 1349621, 1389989, 1432927, 1478595, 1527340, 1579821, 1635916, 1693395, 1748116, 1795668, 1832693, 1857126, 1868295, 1867365, 1857086, 1840451, 1819663, 1796489, 1772790, 1749673, 1726197, 1700027, 1669899]
63466A669899l3020l4224l5451l8156m1492m3790m5213m7373n0330n1576m8957
63455A200317m3529l8375l5109l2935l0904k9474k9268k9483k8641k6339k3462
63444H52798k0966j9164j7964j7050j5943j4395j2779j1601j0686r428p822o739
63432F88261o884p839q387p726o262n187n236n805n498l548n33K298M001M232
63418F35887L258J988J477J895K473K770L256M054M044K394K57n05lj09j625l339
63402F58172m274n095o386p178o431m877l858l144j447J297L650M637M774N139
63388F34979O408Q722J1432J3034J2716J1970J3276J6922K0565K2571K4140K7078
63376H23813L0879L3799L5953L9240M4138M8276M8899M5598M0141L4593L0221
$$ y = [1669899, 1636879, 1602655, 1567204, 1529048, 1487556, 1443766, 1398553, 1351180, 1300850, 1249274, 1200317, 1156788, 1118413, 1083304, 1050369, 1019465, 989991, 960723, 931240, 902599, 876260, 852798, 831832, 812668, 794704, 777654, 761711, 747316, 734537, 722936, 712250, 702822, 695000, 688261, 681377, 673538, 665151, 657425, 651163, 645976, 640740, 634935, 629437, 625889, 625356, 627654, 631655, 635887, 639145, 641133, 642610, 644505, 646978, 649748, 653004, 657058, 661102, 663496, 663753, 663248, 663245, 663136, 661511, 658172, 653898, 648803, 642417, 635239, 628808, 623931, 620073, 616929, 615482, 616779, 620429, 625066, 629840, 634979, 641387, 650109, 661541, 674575, 687291, 699261, 712537, 729459, 750024, 772595, 796735, 823813, 854692, 888491, 924444, 963684, 1007822, 1056098, 1104997, 1150595, 1190736, 1225329, 1255550]
63365A255550K7440K5944K5252K5584K7811L2056L6988M1150M4535M8094N2078
63354A642482N5685N8148N9107N7902N3551M5937L6304K6054J5467M234p050j6589
63342B031232k2780k5679k6955k8452l0895l4014l7601m1848m6532n0503n2611
63331A633362n2780n1698m9823m7370m4799m2376l9513l5611l1390k8121k5609
63320A184272k2335j7885j3618j0427p496m127j090J150L950Q437J3128J5695
63308A149654J6399J7653K0514K3776K6473K9164L2427L5900L9410M3419M7716
63297A482505N1150N3219N4587N5578N5679N5008N4482N3657N0162M2596L2484
63286B041107K2052J1550M70r948j7687k2765k7021l1236l4378l5819l6612l8148
$$ y = [1255550, 1282990, 1308934, 1334186, 1359770, 1387581, 1419637, 1456625, 1497775, 1542310, 1590404, 1642482, 1698167, 1756315, 1815422, 1873324, 1926875, 1972812, 2009116, 2035170, 2050637, 2054871, 2047821, 2031232, 2008452, 1982773, 1955818, 1927366, 1896471, 1862457, 1824856, 1783008, 1736476, 1685973, 1633362, 1580582, 1528884, 1479061, 1431691, 1386892, 1344516, 1305003, 1269392, 1238002, 1209881, 1184272, 1161937, 1144052, 1130434, 1120007, 1112511, 1108384, 1107294, 1108444, 1112394, 1120831, 1133959, 1149654, 1166053, 1183706, 1204220, 1227996, 1254469, 1283633, 1316060, 1351960, 1391370, 1434789, 1482505, 1533655, 1586874, 1641461, 1697039, 1752718, 1807726, 1862208, 1915865, 1966027, 2008623, 2041107, 2063159, 2074709, 2075179, 2065231, 2047544, 2024779, 1997758, 1966522, 1932144, 1896325, 1859713, 1821565]
63274A821565m0857m4547m8815n2678n4821n4868n3679n2110n0116m7258m3531
63263A278285l9341l5191l1440k7904k3853j9248j5814j5787j9242k3717k6914
63252I99834k8824l0453l1576l1038k8859k6603k5337k4238k1914j8501j5617
63241G16874j4341j4033j3474j2572j2284j3121j4437j5236j5025j3677j1273
63230E67401q473o533o277p229q121q064p088n976n751o678p575o910m974l974
63216D73778n132o761o459m409k944l158l662k822p68J183J896Q52j608l946m460
63201D31580l185j864j548j326j63J179J234M7r87j257j513k254k669j799k9J261
63185D16707J359R69J123J821K174J776J280J342J561J101L2o76m46K74P18N98
$$ y = [1821565, 1780708, 1736161, 1687346, 1634668, 1579847, 1524979, 1471300, 1419190, 1369074, 1321816, 1278285, 1238944, 1203753, 1172313, 1144409, 1120556, 1101308, 1085494, 1069707, 1050465, 1026748, 999834, 971010, 940557, 908981, 877943, 849084, 822481, 797144, 772906, 750992, 732491, 716874, 702533, 688500, 675026, 662454, 650170, 637049, 622612, 607376, 592351, 578674, 567401, 558928, 552395, 546118, 538889, 530768, 522704, 515616, 509640, 503889, 497211, 489636, 482726, 477752, 473778, 468646, 461885, 455426, 451017, 448073, 444915, 441253, 438431, 437663, 438846, 440742, 441594, 439986, 436040, 431580, 428395, 426531, 424983, 423657, 423494, 424673, 425907, 425954, 424967, 423710, 422197, 419943, 417274, 415475, 415446, 416707, 418066, 419035, 420158, 421979, 424153, 425929, 427209, 428551, 430112, 431213, 431245, 430569, 430123, 430397, 431115, 431713]
63169D31713L9p06j346j713j867j728q46R62K938M052M215M126M017L537K862
63154D50255K857L714M343L744K391J648K143L107L195J923L69J45J440K642K586
63139D86502K245L028M220M002K623K400M323O880Q753J0403J2052J2439J1119
63126E70989J0005J0753J2211J2457J1909J2310J3674J4541J4394J3716J2303
63115G09262R851P668P494Q767R257Q221O773N329L226R76J79N35m68l836p450
63100G65784r506j1225j4327j7682j8784j7512j6160j6183j6681j6063j3933j1281
63088E86447r617r748j0813j0978r591p949p265o915n765m240l528l304k096J42
63074D94780J643J428Q77J691L380L959K785J502J984M120O203P009O745O096
$$ y = [431713, 431752, 431046, 429700, 427987, 426120, 424392, 423546, 424508, 427446, 431498, 435713, 439839, 443856, 447393, 450255, 453112, 456826, 461169, 464913, 467304, 468952, 471095, 474202, 477397, 479320, 479689, 479834, 481274, 483916, 486502, 488747, 491775, 495995, 499997, 502620, 505020, 509343, 516223, 524976, 535379, 547431, 559870, 570989, 580994, 591747, 603958, 616415, 628324, 640634, 654308, 668849, 683243, 696959, 709262, 719113, 726781, 734275, 743042, 752299, 760520, 767293, 772622, 775848, 776824, 777003, 777538, 777070, 773234, 765784, 756278, 745053, 730726, 713044, 694260, 676748, 660588, 644405, 627724, 611661, 597728, 586447, 576830, 567082, 556269, 545291, 535700, 527751, 520486, 513571, 507806, 503566, 500038, 496734, 494638, 494780, 496423, 497851, 498728, 500419, 503799, 507758, 510543, 512045, 514029, 518149, 524352, 531361, 538106, 544202]
63060E44202N427N251O474R172J1738J2458J1558J0608J0247R956R881J0992J3090
63047F71054J4526J4707J5156J6917J8473J7840J5521J3714J3375J3672J3823
63036H38778J3807J3535J2698J1361R626P140L921J052p73k715o152j0092j2124
63023H80062j1887j1567j2740j4644j6088j7241j8582j9582j9430j7981j5322
63012G04998j1540p743n935o700p970p244m382j204Q85J705J426L39o84p03J85
62997F55433J038J481K179L821O172Q268R187Q623P114N806N746P191R500J1508
62983G43067J2188J1489J0514J0448J1258J2045J2537J3219J3843J3097J0599
62972H74304Q060P382Q144Q223O502L906J893J002Q74P31j96j977l713m588m946
$$ y = [544202, 549629, 554880, 561354, 570526, 582264, 594722, 606280, 616888, 627135, 637091, 646972, 657964, 671054, 685580, 700287, 715443, 732360, 750833, 768673, 784194, 797908, 811283, 824955, 838778, 852585, 866120, 878818, 890179, 899805, 906945, 910866, 911918, 911145, 908430, 902278, 892186, 880062, 868175, 856608, 843868, 829224, 813136, 795895, 777313, 757731, 738301, 720320, 704998, 693458, 685715, 679780, 673080, 665110, 657866, 653484, 652280, 653165, 654870, 656296, 656635, 655951, 655248, 655433, 656471, 657952, 660131, 663952, 670124, 678392, 687579, 696202, 703316, 709122, 714868, 722059, 731559, 743067, 755255, 766744, 777258, 787706, 798964, 811009, 823546, 836765, 850608, 863705, 874304, 882364, 889746, 897890, 906113, 912615, 916521, 918414, 919416, 920290, 921021, 920825, 918848, 915135, 910547, 905601]
62957I05601n461n542l878o14K453M254N695P735R609J0187J0085J0810J2240
62944I63174J2875J2598J3372J6233J9183J9482J7229J5032J4444J4478J3826
62933A131926J2916J2776J3106J2767J1439R691P829N830M086K890J314k024o924
62920A217622j1537j4649j6893j9321k2060k4859k7741l0287l1389l0688k9356
62909I58842k8464k7548k5823k3872k2669k1629j9285j5653j2393j0618r931r735
62897G31222j0111j0988j1660j1575j0914j0060r327r264j0269j1637j1945j0752
62885F02720r108q182q167q813r934j0972j1008r870q435p286n978m190k723k442
62871D95612k903l013k587k370k761l408l890m099l972l434k606j736r98n53n30
$$ y = [905601, 900140, 894598, 890720, 890106, 892559, 896813, 902508, 910243, 919852, 930039, 940124, 950934, 963174, 976049, 988647, 1002019, 1018252, 1037435, 1056917, 1074146, 1089178, 1103622, 1118100, 1131926, 1144842, 1157618, 1170724, 1183491, 1194930, 1204621, 1212450, 1218280, 1222366, 1225256, 1226570, 1224546, 1217622, 1206085, 1191436, 1174543, 1155222, 1133162, 1108303, 1080562, 1050275, 1018886, 988198, 958842, 930378, 902830, 877007, 853135, 830466, 808837, 789552, 773899, 761506, 750888, 740957, 731222, 721111, 710123, 698463, 686888, 675974, 665914, 656587, 647323, 637054, 625417, 613472, 602720, 593612, 585430, 577263, 568450, 558516, 547544, 536536, 526666, 518231, 510945, 504967, 500777, 498054, 495612, 492709, 489696, 487109, 484739, 481978, 478570, 474680, 470581, 466609, 463175, 460569, 458833, 457835, 457282, 456752]
62856D56752o37k95M80Q93O16O76K221M765O606O886O247N482M582L531L084L951
62840E05840N719P300Q234Q842R259R140Q555Q314Q746Q738P009M090J892J078
62826F02756J40k219m983o373o608p445r243j0366r747q446p942q196q263p798
62812E05267p137o691o900p929q801p963n489l602l907n222n493m780m649n251
62798D21453n032l316j352n10p24j132j096l66P27J065j92k119k856k160j792
62783D00598k748l497k042J127L405L066J016m80j11J449K452J796r4j935k840
62768D01162k729j999j345j397j806j069J689N005O280M736K049K1r78j115k89
62753D08215J024J517P69J05O75J652J493K43p85j014r20p57k83L07M87M54R30
$$ y = [456752, 456115, 455820, 456300, 457193, 457809, 458485, 460706, 465471, 472077, 478963, 485210, 490692, 495274, 498805, 501889, 505840, 511559, 518859, 527093, 535935, 545194, 554334, 562889, 571203, 579949, 588687, 595696, 599786, 601678, 602756, 602896, 600677, 595694, 589321, 582713, 575268, 566025, 555659, 545912, 537466, 529524, 521328, 513065, 505267, 498130, 491439, 484539, 476610, 467809, 459846, 454357, 450755, 446848, 441626, 436133, 431353, 426704, 421453, 416421, 413105, 411753, 411243, 410519, 409387, 408291, 407925, 408652, 409717, 409525, 407406, 404550, 402390, 400598, 397850, 394353, 392311, 393438, 396843, 399909, 400925, 400445, 400334, 401783, 404235, 406031, 405937, 404002, 401162, 398433, 396434, 395089, 393692, 391886, 390817, 392506, 397511, 403791, 408527, 410576, 410597, 409619, 408504, 408215, 409239, 410756, 411525, 411630, 412305, 413957, 415450, 415693, 414908, 413894, 412974, 412217, 411934, 412241, 412728, 413182, 414112]
62736D14112J796K051J407Q75J328K382L229L749M113L940K859J667J971M404
62722D49883P739J0126J0824J0483R994R658R347Q888Q059O851N922O127P113
62709E61014P159N319K995K122K333J581n88k317k491k457l676n416o345o970
62695E52263q543j0405j0561q620o397n543o146p594r218r810q217n009k410j913
62681D51877k968m272n199n426m439k385n15J49M6K75J108J959K333K170J635
62666D36348J124J125J646K210K691L651N276O684O945O395O239P077Q481R829
62652E05721J0973J2138J3550J5139J6425J6986J7202J8077K0073K2562K4767
62641F93613K6708K8693L0464L1502L1853L2015L2303L2833L3736L4721L4712
$$ y = [414112, 415908, 417959, 419366, 420241, 421569, 423951, 427180, 430929, 435042, 438982, 441841, 443508, 445479, 449883, 457622, 467748, 478572, 489055, 499049, 508707, 518054, 526942, 535001, 541852, 547774, 553901, 561014, 568173, 573492, 576487, 578609, 580942, 582523, 581935, 579618, 577127, 574670, 570994, 565578, 559233, 552263, 543720, 533315, 522754, 514134, 507737, 502194, 496048, 488454, 479236, 469426, 461209, 456200, 453790, 451877, 448909, 444637, 439438, 434012, 429573, 427188, 426673, 426822, 426868, 427143, 428251, 430210, 432543, 434713, 436348, 437472, 438597, 440243, 442453, 445144, 448795, 454071, 460755, 467700, 474095, 480334, 487411, 495892, 505721, 516694, 528832, 542382, 557521, 573946, 590932, 608134, 626211, 646284, 668846, 693613, 720321, 749014, 779478, 810980, 842833, 874848, 907151, 939984, 973720, 1008441, 1043153]
62630A043153L2701K8947K4740K1038J7682J3757Q342J245o481j3199j8304k2770
62618A130851k7420l1453l3702l4651l5688l6692l6116l3722l1464l0904l1221
62607G67818l0724k9135k7177k4952k2132j9241j7296j6331j5468j4381j3477
62596E37504j2662j1141q941p429p632q736r021p897o287n301n190n488n548m872
62582D31359l504k289k216l170l757k782p34P33O84k50r20r40o39l55k38m00o82
62565D09900o08j44k34j684l671m394l352j972j513j441o22P15J370J020N22N27
62549C94419P54P82O48M70J59k79o91j074j369j081J80J771K652L004M080N903
62533D10328O497M439J305J32J779L996M231K344L00q2J243K583K036p27l974
$$ y = [1043153, 1075854, 1104801, 1129541, 1150579, 1168261, 1182018, 1190360, 1191605, 1185124, 1171925, 1153621, 1130851, 1103431, 1071978, 1038276, 1003625, 967937, 931245, 895129, 861407, 829943, 799039, 767818, 737094, 707959, 680782, 655830, 633698, 614457, 597161, 580830, 565362, 550981, 537504, 524842, 513701, 504760, 497331, 489699, 480963, 471942, 464045, 457758, 452457, 447267, 441779, 436231, 431359, 427855, 425566, 423350, 420180, 416423, 413641, 412907, 413640, 414324, 414074, 413154, 412214, 411575, 411220, 410982, 410582, 409900, 409292, 409148, 408914, 407230, 403559, 399165, 395813, 393841, 392328, 390887, 390265, 390980, 392350, 393370, 393892, 394419, 395173, 395955, 396603, 397073, 397232, 396953, 396262, 395188, 393819, 392738, 392918, 394689, 397341, 400345, 404425, 410328, 416825, 421264, 422569, 422701, 424480, 428476, 432707, 435051, 435351, 435269, 436512, 439095, 441131, 440404, 436430]
62518D36430n621n285m288l829l881l919l839l762l534k993k434k312k631k948
62504C85154k866k306j458o09O7O00J000R72K10j020j884j681m06J281K391K147
62488C81592P94k91K3J165J589J038R17K081L383L335K288J830K579L808M865
62473D10996N708O106N714N179N892Q028R824R525P453N443M815N627P471J0016
62459E07797J2700J4781J6009J7015J8536K0385K1460K0954J9450J8608J9547
62448G07242K1635K3014K2244J9370J5551J1983R162O836M553K274L37j310l469
62435H39422o750j0333j2262j1326q385n620m528m610m008j542J834L974M254
62422G80120M625P183J1212J3936J4165J3724J4740J6884J8291J8211J7376J6317
$$ y = [436430, 430809, 425524, 421236, 417407, 413526, 409607, 405768, 402006, 398472, 395479, 393045, 390733, 388102, 385154, 382288, 379982, 378524, 377915, 377982, 378582, 379582, 380554, 380764, 379744, 377860, 376179, 375773, 377054, 379445, 381592, 382386, 382095, 382118, 383283, 384872, 385910, 386827, 388908, 392291, 395626, 397914, 399744, 402323, 406131, 410996, 416704, 422810, 428524, 433703, 439595, 447623, 457447, 466972, 474425, 479868, 484683, 490310, 497781, 507797, 520497, 535278, 551287, 568302, 586838, 607223, 628683, 649637, 669087, 687695, 707242, 728877, 751891, 774135, 793505, 809056, 821039, 830201, 837037, 841590, 843864, 844201, 842891, 839422, 832672, 822339, 810077, 798751, 790366, 784746, 780218, 775608, 771600, 770058, 771892, 775866, 780120, 784745, 791928, 803140, 817076, 831241, 844965, 859705, 876589, 894880, 913091, 930467, 946784]
62410I46784J4612J1894Q408M468K48l709o628q574j0674j3839j7701k1245k3986
62397H80058k6063k7462k7843k7201k6193k5523k5179k4561k3270k1484j9507
62386F05772j7281j4708j2373j1268j1576j2020j0985q212n197l776m404n723
62374D88249n845m149j880q08j360k389k680k179j651j630k036k322j823m39Q47
62359D57905P94m41j282q77k43m71r01l21P65R08K60M35J651K059O42r13l74K169
62341D61765M732N790N136L268J309Q78K775N805P940Q498Q318Q140P931P681
62327E39966P753Q219Q703R185J0185J1872J3613J4628J4837J4866J5652J7883
62315F87362K1259K4331K5723K5663K5795K7373L0178L3195L5741L7770L9739
$$ y = [946784, 961396, 973290, 981698, 986166, 986414, 982705, 976077, 967503, 956829, 942990, 925289, 904044, 880058, 853995, 826533, 798690, 771489, 745296, 719773, 694594, 670033, 646763, 625279, 605772, 588491, 573783, 561410, 550142, 538566, 526546, 515561, 507349, 502152, 498376, 493972, 488249, 482404, 478255, 476375, 475567, 474207, 471818, 469138, 466959, 465308, 463678, 461642, 459320, 457497, 457058, 457905, 458699, 458258, 456976, 456099, 455856, 455385, 454484, 454163, 454928, 455836, 456096, 456531, 458182, 460241, 460883, 459970, 459596, 461765, 466497, 472287, 477423, 480691, 482000, 482878, 485653, 491458, 499398, 507896, 516214, 524354, 532285, 539966, 547719, 555938, 564641, 573826, 584011, 595883, 609496, 624124, 638961, 653827, 669479, 687362, 708621, 732952, 758675, 784338, 810133, 837506, 867684, 900879, 936620, 974390, 1014129]
62304A014129M2473M6601N1837N7221O2202O7091P2370P8097Q4057Q9832R4489
62293A760399R6933R6864R4776R0784Q4149P4448O2437M9196L5085K0137M910
62282B470118r833k3699l6352m7162n6033o3951p1702p8456q2643q3897q3089
62271A833301q0806p7208p3150o9814o6844o2457n6112m9652m4919m1480l8025
62260A172834l4830l3228l3074l2533l0516k7954k6226k5414k4613k3215k1304
62249H59927j9318j7733j6697j5768j4446j3062j2401j2241j1224q796o405n807
62237G06029o716p268o393m577k434p3J887K277J256R61L000O134P932Q220R102
62222G19337J1565J3871J4073J2689J1764J2262J3626J5325J7346J9250K0108
$$ y = [1014129, 1056602, 1103203, 1155040, 1212261, 1274463, 1341554, 1413924, 1492021, 1576078, 1665910, 1760399, 1857332, 1954196, 2048972, 2139756, 2223905, 2298353, 2360790, 2409986, 2445071, 2465208, 2470118, 2460285, 2436586, 2400234, 2353072, 2297039, 2233088, 2161386, 2082930, 2000287, 1916390, 1833301, 1752495, 1675287, 1602137, 1532323, 1465479, 1403022, 1346910, 1297258, 1252339, 1210859, 1172834, 1138004, 1104776, 1071702, 1039169, 1008653, 980699, 954473, 929059, 904446, 881231, 859927, 840609, 822876, 806179, 790411, 775965, 762903, 750502, 738261, 727037, 718241, 711836, 706029, 699313, 692045, 685652, 681075, 678641, 678568, 680455, 682732, 683988, 684949, 687949, 694083, 702015, 710235, 719337, 730902, 744773, 758846, 771535, 783299, 795561, 809187, 824512, 841858, 861108, 881216]
62211H81216J9854J9831K1448K4676K8365L1619L4501L7532M1004M4919M9375
62200A234340N4758O1214O8025P3940P8386Q1993Q5619Q9249R2207R3938R3688
62189B107357Q9878Q0970O7328N1289L5090J9330L867j0884k4276l6462m8090
62178B335397n9044o8302p5094p9708q3085q5941q8267q9306q8034q3978p7818
62167A456820p1163o5606o1799n9022n5712n0745m4560l8668l4013l0242k6752
62156I18538k3867k2315k1889k1315j9532j6675j3768j1694j0441r225p423n497
62144G34897m651n334o404o092l641J83L801N813N894N173N304O754Q381R101
62130G59179R254R642J0175J0521J1474J4125J7894K0842K2127K2740K3553K4053
$$ y = [881216, 901070, 920901, 942349, 967025, 995390, 1027009, 1061510, 1099042, 1140046, 1184965, 1234340, 1289098, 1350312, 1418337, 1492277, 1570663, 1652656, 1738275, 1827524, 1919731, 2013669, 2107357, 2197235, 2278205, 2345533, 2396822, 2431912, 2451242, 2455109, 2444225, 2419949, 2383487, 2335397, 2276353, 2208051, 2132957, 2053249, 1970164, 1884223, 1795956, 1706650, 1618616, 1534638, 1456820, 1385657, 1320051, 1258252, 1199230, 1143518, 1092773, 1048213, 1009545, 975532, 945290, 918538, 894671, 872356, 850467, 829152, 809620, 792945, 779177, 767483, 757042, 747817, 740394, 734897, 730246, 724912, 718508, 712416, 708775, 708958, 712759, 718572, 724466, 729639, 734943, 741697, 750078, 759179, 768433, 778075, 788250, 798771, 810245, 824370, 842264, 863106, 885233, 907973, 931526, 955579]
62118I55579K3673K3135K3500K4811K6507K8454L0707L2865L4661L6771M0064
62107A280727M4332M8610N2593N6898O1864O6800P0423P1585O9601O4445N6692
62096A944570M6873L5018K1406P641l877j2138j8784k6586l6618m7244n5916o1590
62084A792755o5025o7151o7941o7136o5174o2646n9354n4881m9896m5788m2897
62073A144866m0074l6226l1374k5995k0427j5356j1644r031o055k170J263L122
62061I50899M432O674R089R599P927N903M649L531K202J863L417N747O891O117
62047A028940L953J049j989m198m826m258l692l875m431m331k821r8K765M778
62033A006966N949O943Q021Q860R395J0062J1146J2585J4448J6682J8379J8521
$$ y = [955579, 979252, 1002387, 1025887, 1050698, 1077205, 1105659, 1136366, 1169231, 1203892, 1240663, 1280727, 1325059, 1373669, 1426262, 1483160, 1545024, 1611824, 1682247, 1753832, 1823433, 1887878, 1944570, 1991443, 2026461, 2047867, 2055508, 2051631, 2039493, 2020709, 1994123, 1957505, 1910261, 1854345, 1792755, 1727730, 1660579, 1592638, 1525502, 1460328, 1397682, 1338328, 1283447, 1233551, 1187763, 1144866, 1104792, 1068566, 1037192, 1011197, 990770, 975414, 963770, 954739, 948684, 946514, 947777, 950899, 955331, 962005, 971094, 980693, 988620, 994523, 999172, 1002703, 1004905, 1006768, 1010185, 1015932, 1022823, 1028940, 1032893, 1033942, 1031953, 1027755, 1022929, 1018671, 1014979, 1011104, 1006673, 1002342, 999521, 999423, 1002188, 1006966, 1012915, 1019858, 1027879, 1036739, 1046134, 1056196, 1067342, 1079927, 1094375, 1111057, 1129436, 1147957]
62021A147957J7829J8546K1652K5512K8143K9646L1154L2642L3514L4650L7794
62010A459039M2827M7410M9733N0329N0699N1532N2954N5373N8909O2307O3391
61999B044503O0720N4698M7076L9351L1495K2375J1573K58j0232k0061l0110m0026
61987B211620m8383n4724n9974o4559o7615o8671o8782o9057o9151o8107o5853
61976A506744o2896n9295n4916n0083m5136m0027l5088l1310k8809k6124k2353
61965A050707j8984j7784j7780j6396j3354j1030j0933j2070j3261j4661j5994
61954H88460j5587j2757r404p542o766n893n582o948q636p992m953k236j365q19
61940G91980J202M261O975Q990J0260R739O585K072j310k490k552k891l717m470
$$ y = [1147957, 1165786, 1184332, 1205984, 1231496, 1259639, 1289285, 1320439, 1353081, 1386595, 1421245, 1459039, 1501866, 1549276, 1599009, 1649338, 1700037, 1751569, 1804523, 1859896, 1918805, 1981112, 2044503, 2105223, 2159921, 2206997, 2246348, 2277843, 2300218, 2311791, 2312049, 2301817, 2281756, 2251646, 2211620, 2163237, 2108513, 2048539, 1983980, 1916365, 1847694, 1778912, 1709855, 1640704, 1572597, 1506744, 1443848, 1384553, 1329637, 1279554, 1234418, 1194391, 1159303, 1127993, 1099184, 1073060, 1050707, 1031723, 1013939, 996159, 979763, 966409, 955379, 944446, 932376, 919115, 904454, 888460, 872873, 860116, 850712, 843170, 836404, 830511, 824929, 817981, 809345, 801353, 796400, 794164, 792799, 791980, 793182, 797443, 804418, 813408, 823668, 833407, 839992, 842064, 840754, 838264, 835712, 832821, 829104, 824634]
61926H24634m897n306o137p488q938r894j0184j0178j0140r809q860p459n992
61913G19352m600l337k593k758l565m167l917k894j678q56o04n27RJ181K466L250
61897F94762L539L746L961L905L646L971N708Q650J1372J2414J1768J0968J1526
61884G89936J3518J6113J8945K2183K5416K7662K8832L0164L2533L5146L6733
61873A077181L7224L7307L6878L5214L2499K9943K8227K6768K4681K1700J8016
61862A405638J3994J0316P417M527J15o072j2017j5104j4433j1090o762k706M11
61849A374234K659M856P783J1131J3728J4919J5282J5744J6276J5888J3765J0030
61837A516295N353J83n299j0779j5781k0060k3694k6769k9326l1525l3429l4562
$$ y = [824634, 819737, 814431, 808294, 800806, 791868, 781974, 771790, 761612, 751472, 741663, 732803, 725344, 719352, 714752, 711415, 708822, 706064, 702499, 698332, 694415, 691521, 689843, 688987, 688383, 687856, 687865, 689046, 691512, 694762, 698301, 702047, 706008, 709913, 713559, 717530, 723238, 731888, 743260, 755674, 767442, 778410, 789936, 803454, 819567, 838512, 860695, 886111, 913773, 942605, 972769, 1005302, 1040448, 1077181, 1114405, 1151712, 1188590, 1223804, 1256303, 1286246, 1314473, 1341241, 1365922, 1387622, 1405638, 1419632, 1429948, 1437365, 1441892, 1442007, 1435935, 1423918, 1408814, 1394381, 1383291, 1376529, 1373823, 1374234, 1376893, 1381749, 1389532, 1400663, 1414391, 1429310, 1444592, 1460336, 1476612, 1492500, 1506265, 1516295, 1521648, 1521831, 1516532, 1505753, 1489972, 1469912, 1446218, 1419449, 1390123, 1358598, 1325169, 1290607]
61825A290607l4423l3510l3097l3515l3558l2243l0250k8650k6987k4111k0475
61814I59788j7889j6942j6229j4563j2404j0477q432n891l641k488j765j63K510
61801H51414N534Q701J2235J5692J8282K0272K2827K6422L0476L4740L9723M5301
61789A131619N0010N2604N3688N4934N6933N8499N8043N5132N0615M5511L9987
61778A707575L3468K5713J7467R805L123k749p629j0943j2641j3391j3494j2218
61766A724086q814l786J375N523Q468J0488J1775J2435J2509J1743R446M743k892
61753A797099j3181k4928l6401m6011n2776n6502n7843n8090n8340n8604n8023
61742A276400n6175n3691n1323m8835m5444m1106l6695l2988k9993k7329k4693
$$ y = [1290607, 1256184, 1222674, 1189577, 1156062, 1122504, 1090261, 1060011, 1031361, 1004374, 980263, 959788, 941899, 924957, 908728, 894165, 881761, 871284, 862852, 856961, 853320, 850832, 849067, 848904, 851414, 856948, 865649, 877884, 893576, 911858, 932130, 954957, 981379, 1011855, 1046595, 1086318, 1131619, 1181629, 1234233, 1287921, 1342855, 1399788, 1458287, 1516330, 1571462, 1622077, 1667588, 1707575, 1741043, 1766756, 1784223, 1794028, 1797151, 1794402, 1786773, 1775830, 1763189, 1749798, 1736304, 1724086, 1715272, 1711486, 1712861, 1718384, 1726852, 1737340, 1749115, 1761550, 1774059, 1785802, 1795248, 1799991, 1797099, 1783918, 1758990, 1722589, 1676578, 1623802, 1567300, 1509457, 1451367, 1393027, 1334423, 1276400, 1220225, 1166534, 1115211, 1066376, 1020932, 979826, 943131, 910143, 880150, 852821, 828128]
61731H28128k1909j9005j6453j4830j4108j3677j3176j2733j2196j0823q348n821
61719F65049m637m951n613n568m750l717k954k608k442k067j500j293j732k203
61705F19014k050j750k215l063k799j170j4q80k697l025j121J339K442J816K83
61690F04110j189j789j111L03J146O60n13j242j421j850k714k876j298J230K638
61675E94084J976N13o1K45K70j33P4J185K078K110K238L373M673M758L858L410
61659F24651M012N029N834O195N657L999K220J690K202K198J143K28K74M42k59
61644F65515j405k118k525l248m049m036k864j041O05J275N24j150k456k536j694
61629F38797n86O13J735K161J539M37m16j018j562j691j133n15n94j034q44J79
$$ y = [828128, 806219, 787214, 770761, 755931, 741823, 728146, 714970, 702237, 690041, 679218, 670870, 665049, 660412, 655461, 649848, 644280, 639530, 635813, 632859, 630251, 627809, 625742, 624242, 622949, 621217, 619014, 616964, 615214, 612999, 609936, 607137, 605967, 605953, 605073, 602376, 599351, 598230, 599569, 602011, 603827, 604110, 602921, 601132, 600021, 600324, 601470, 602130, 601617, 600375, 598954, 597104, 594390, 591514, 590216, 591446, 594084, 596060, 596573, 596512, 596757, 597027, 596894, 596968, 598153, 600231, 602341, 604579, 607952, 612625, 617383, 621241, 624651, 628663, 633692, 639526, 645721, 651378, 655377, 657597, 659287, 661489, 663687, 664830, 665058, 665332, 665774, 665515, 664110, 661992, 659467, 656219, 652170, 648134, 645270, 644229, 644834, 646109, 646633, 645483, 643027, 640491, 638797, 638211, 638824, 640559, 642720, 644259, 644696, 644280, 643262, 641700, 640009, 638876, 638361, 637767, 636733, 635889, 636068]
61613F36068J289J856J826J352P37N39J075J855K164J913J450R40O75J370L176
61598F58285M765M637L134K039K168K584K321J597J039Q12J030J967L220L637
61584F93235K856K229L227N346O532N653L781K834L427M386M226K800J290O10
61570G42432J68j400m351p213q197p082n435n063o220p454p257n748m308l680
61556F69192l123j820l89j64j406l019l943m102m066m357n164o180o725o456n867
61541F12411n671n986o564p443q582r229q586p028n770n292n034m579m216m111
61527E24320l850l156k333j782j660k104l110m048m059l078j763m89O98J213L26
61512D95125j409k438k404k650l846m567l435j410m65q19j086o63k60j31M53J603
$$ y = [636068, 637357, 639213, 641039, 642391, 643128, 643667, 644742, 646597, 648761, 650674, 652124, 653064, 653739, 655109, 658285, 663050, 667687, 670821, 672860, 675028, 677612, 679933, 681530, 682569, 683381, 684411, 686378, 689598, 693235, 696091, 698320, 701547, 706893, 713425, 719078, 722859, 725693, 729120, 733506, 737732, 740532, 741822, 742432, 742600, 741200, 736849, 729636, 721439, 714357, 708922, 703859, 697639, 690185, 682928, 677180, 672872, 669192, 666069, 664249, 663860, 663696, 662290, 659271, 655328, 651226, 647160, 642803, 637639, 631459, 624734, 618278, 612411, 606740, 600754, 594190, 586747, 578165, 568936, 560350, 553322, 547552, 542260, 537226, 532647, 528431, 524320, 520470, 517314, 514981, 513199, 511539, 509435, 506325, 502277, 498218, 495140, 493377, 492888, 493586, 494799, 495125, 493716, 491278, 488874, 486224, 482378, 477811, 474376, 472966, 472501, 471682, 470596, 469933, 469673, 469542, 469995, 471598]
61496D71598K155J378K94L15J252J762J367R22J016R96J90p43o93O2J00q92j511
61479D79568q15P8l17j541k093j977k499l661l739j960J13Q35N53M07K99m76j484
61462D61291j635j129j394l044m961n643m746l148k042k048k858l617l807l584
61448D17635l192k554j682r85p43p99j120j990l166l561k564j111n52j002j642
61433C90972k264l321m574m875l593j451L46J266J530J515J389J120O99L49L74
61418C79482P08R11P54M85L23K38M32J310K513K752J370n05j213n53K83L80j16
61401C89554o60q99p69o54j192k260k608j251J050K612K802K333J904J593J455
61386C93010J645J875J620J009P25J092J851K723L446L544K958K632L460M820
$$ y = [471598, 473753, 475131, 475425, 475740, 476992, 478754, 480121, 481043, 482059, 483055, 483245, 482502, 481809, 481871, 481971, 481079, 479568, 478753, 478831, 478514, 476973, 474880, 472903, 470404, 466743, 463004, 461044, 461157, 461992, 462545, 462952, 463251, 462775, 461291, 459656, 458527, 457133, 454089, 449128, 443485, 438739, 435591, 433549, 431501, 428643, 425026, 421219, 417635, 414443, 411889, 410207, 409222, 408479, 407680, 406560, 404570, 401404, 397843, 395279, 394168, 393616, 392614, 390972, 388708, 385387, 380813, 375938, 372345, 370894, 371240, 372506, 374036, 375551, 376940, 378060, 378759, 379108, 379482, 380190, 381101, 381855, 382340, 382663, 382901, 383333, 384643, 387156, 389908, 391278, 390773, 389560, 389007, 389290, 389670, 389554, 388894, 387995, 387226, 386572, 385380, 383120, 380512, 379261, 380311, 382923, 385725, 388058, 389962, 391555, 393010, 394655, 396530, 398150, 399159, 399884, 400976, 402827, 405550, 408996, 412540, 415498, 418130, 421590, 426410]
61372D26410N294M641L877L504L010K286K116K869L875M517M806M483K879L18
61358D74885j431j030Q84K636L281K949K185J540J185N30j031k757l029j593k19
61343D78985l67j335j675j342j311j830k384k929l935n312o304o326n284l399
61329D35252j347j21Q8M12J769L191K874O99j410j815p54N62J515K227K772K902
61313D48816K427J571R40J054J780K385K379K097K149K603L055L318L544L828
61299D81946M086M238M182L765L168L062L961N612P345Q834J0097J1043J1549
61286E62888J1790J1990J1935J1228R888Q310O787N519M853M977N504N865N942
61273F67476N836N250L824J949N79J14N3k47r49j876k729l129k954k687k976l807
$$ y = [426410, 431704, 436345, 440222, 443726, 446736, 449022, 451138, 454007, 457882, 462399, 467205, 471688, 474567, 474885, 473454, 472424, 473308, 475944, 479225, 482174, 484359, 485899, 487084, 487614, 486583, 483826, 480797, 479204, 478985, 478618, 477283, 475608, 474266, 472955, 471125, 468741, 465812, 461877, 456565, 450261, 443935, 438651, 435252, 433905, 433784, 433872, 434284, 436053, 439244, 442118, 442817, 441407, 439592, 438838, 439400, 440915, 443142, 445914, 448816, 451243, 452814, 453754, 454808, 456588, 458973, 461352, 463449, 465598, 468201, 471256, 474574, 478118, 481946, 486032, 490270, 494452, 498217, 501385, 504447, 508408, 514020, 521365, 530199, 540296, 551339, 562888, 574678, 586668, 598603, 609831, 619719, 628029, 634816, 640335, 645188, 650165, 655669, 661534, 667476, 673312, 678562, 682386, 684335, 684914, 685028, 685081, 684834, 683885, 682009, 679280, 676151, 673197, 670510, 667534, 663727]
61257F63727m488m448l566j972j47R06M91o61r04L95K124K933K720K242J982K159
61241F63493L162N080O972P464O157L846J312j394m214o287o641n572m610m783
61227F63985n393n036l613k466k370k320r62J384L154L669L678L794L575K811
61213F63890K598M159P074R677J0950J1194J0997J0516R983R895J0231J0176R344
61200G80684Q804J0009J2780J5200J5723J4776J3837J3467J2916J1418R177O917
61188I25708N111L919L467L658L928L666K833J796O20j007l035m635n028m563
61174I36438m514n669p405q476q485q154q087p839o655m758l243k720k721k572
61160H55140k213j851j391p88n56j211k293k608j549J76J337J396Q67O27J032
$$ y = [663727, 659239, 654791, 651225, 649253, 649106, 650012, 650503, 649842, 648938, 649333, 651457, 654390, 657110, 659352, 661334, 663493, 666655, 671735, 678707, 686171, 692328, 696174, 697486, 696092, 691878, 685591, 678950, 673378, 668768, 663985, 658592, 653556, 649943, 647477, 645107, 642787, 641825, 643209, 646363, 650032, 653710, 657504, 661079, 663890, 666488, 670647, 677721, 687398, 698348, 709542, 720539, 731055, 741038, 750933, 761164, 771340, 780684, 789488, 799497, 812277, 827477, 843200, 857976, 871813, 885280, 898196, 909614, 918791, 925708, 930819, 934738, 938205, 941863, 945791, 949457, 952290, 954086, 954706, 953699, 950664, 946029, 941001, 936438, 931924, 926255, 918850, 910374, 901889, 893735, 885648, 877809, 871154, 866396, 863153, 860433, 857712, 855140, 852927, 851076, 849685, 848897, 848341, 847130, 844837, 842229, 840680, 840856, 842193, 843589, 844456, 845083, 846115]
61145H46115J572J398K54j176j870j337J57J878L062L500L980N744Q999J2348
61131H84624J4281J4870J5248J5740J5594J4563J3505J2950J2193J0653R298R628
61119A043147J1602J3594J4273J3676J2520J1382J0671J0490J0242R077P065N283
61107A173022M429M034L358K262P07j647m496o314n998m621m368n861p763q932
61093A137812r574j0026r956r320q844q734q048o285m586m200m717n096n613p271
61079A035542r754j1546j1954j1605j0964r824q349p209o460n510m408l866l652
61066I30441k405L48L237M771N062N188N900P501R944J2302J3264J2965J3331
61053A021849J5656J8885K1279K2784K4475K6532K8249K9542L0978L2351L2587
$$ y = [846115, 847687, 849085, 849339, 848163, 846293, 844956, 845113, 846991, 850053, 853553, 857533, 863277, 872276, 884624, 898905, 913775, 929023, 944763, 960357, 974920, 988425, 1001375, 1013568, 1024221, 1033519, 1043147, 1054749, 1068343, 1082616, 1096292, 1108812, 1120194, 1130865, 1141355, 1151597, 1160674, 1167739, 1173022, 1177451, 1181485, 1184843, 1187105, 1187812, 1186165, 1181669, 1175355, 1169357, 1164736, 1160368, 1154507, 1146744, 1137812, 1128238, 1118212, 1108256, 1098936, 1090092, 1081358, 1073310, 1067025, 1062439, 1058239, 1053522, 1048426, 1042813, 1035542, 1025788, 1014242, 1002288, 990683, 979719, 969895, 961546, 954337, 947877, 942367, 937959, 934093, 930441, 928036, 928384, 931621, 936392, 941454, 946642, 952542, 960043, 969987, 982289, 995553, 1008518, 1021849, 1037505, 1056390, 1077669, 1100453, 1124928, 1151460, 1179709, 1209251, 1240229, 1272580, 1305167]
61042A305167L1186K8894K6715K4952K3342K1569J9463J6899J3670R677N555K646
61030A529735J430K75k824p243j0120j0222r564j0304j2072j3619j5026j6361
61018A424085j5982j2746q729p195q516j0325j0981j0418q421m928j743q98j256
61005A321947L40M155O945P053O970R423J3598J7221K0073K3274K6710K9465L1851
60992A519025L5010L9085M3285M7318N1464N5704N9904O4469O9841P5604Q0801
60981B141510Q5016Q8826R3565J00624J10245J20951J30950J40004J49090J58702
60971C319483J68762J79647J91522K03029K12879K22515K34820K50323K67525
60962E250505K86797L10421L38237L67251L96880M30754M71924N20733N79463
$$ y = [1305167, 1336353, 1365247, 1391962, 1416914, 1440256, 1461825, 1481288, 1498187, 1511857, 1521534, 1527089, 1529735, 1531165, 1531440, 1528616, 1521373, 1511253, 1501031, 1491467, 1481163, 1469091, 1455472, 1440446, 1424085, 1408103, 1395357, 1386628, 1379433, 1370917, 1360592, 1349611, 1339193, 1330772, 1325844, 1324101, 1323203, 1321947, 1322287, 1326442, 1333387, 1340440, 1347410, 1356833, 1370431, 1387652, 1407725, 1430999, 1457709, 1487174, 1519025, 1554035, 1593120, 1636405, 1683723, 1735187, 1790891, 1850795, 1915264, 1985105, 2060709, 2141510, 2226526, 2315352, 2408917, 2509541, 2619786, 2740737, 2871687, 3011691, 3160781, 3319483, 3488245, 3667892, 3859414, 4062443, 4275322, 4497837, 4732657, 4982980, 5250505, 5537302, 5847723, 6185960, 6553211, 6950091, 7380845, 7852769, 8373502, 8952965]
60953H952965O53744P45652Q50319R64040J091039J237126J402261J586722J798587
60944A9282455K044351K317207K608521K922155L242623L471248L427687K973143
60936D2289390K158499J231541M72873K1612j44202j00589Q8389L20667M04138
60927D6742318J36070n32773j430529k279089k876498l178294l245142l156502
60919C0179561k973669k742751k496481k250535k009775j779514j566692j374168
60911A2985976j200915j046842r12733p97136o97804o14913n48721m95285m48629
60902F222998m06424l69788l38242l08936k80578k54312k30367k07261j85154
60893C641936j66833j54175j45678j38450j30816j22390j13377j04650r7270r1280
$$ y = [8952965, 9606709, 10352361, 11202680, 12166720, 13257759, 14494885, 15897146, 17483868, 19282455, 21326806, 23644013, 26252534, 29174689, 32417312, 35888560, 39316247, 42289390, 44447889, 45679430, 46152303, 46173915, 46029713, 45929124, 46017513, 46338180, 46742318, 46878388, 46345615, 44915086, 42635997, 39759499, 36581205, 33336063, 30179561, 27205892, 24463141, 21966660, 19716125, 17706350, 15926836, 14360144, 12985976, 11785061, 10738219, 9825486, 9028350, 8330546, 7715633, 7166912, 6671627, 6222998, 5816574, 5446786, 5108544, 4799608, 4519030, 4264718, 4034351, 3827090, 3641936, 3475103, 3320928, 3175250, 3036800, 2905984, 2783594, 2670217, 2565567, 2468297, 2377017]
60883B377017q5829q0571p5907p1891o8092o4449o1278n8576n6266n4630n3491
60872A646037n1744m8978m6619m5884m5558m3804m1295m0203m0586m0351l8600
60861A162415l6493l4704l2619l0350k8913k7885k5520k2035k0070k0649k1199
60850H61978j9283j6117j4394j4326j4037j2637j0856r342q160p509p395p021
60838G20901n719m131l354l390l400k995k311j370l69p9r72k420l625m748o178
60823F75840p315p201n970m647l863l665m149n234o194o326n799n024l762j825
60809F04866j32J79p10j803k882m257n229m490k309p44j175k721l697l659l401
60794E67836l658m299m388k868J27K625K435k67k947l676l029k433j907o76Q24
$$ y = [2377017, 2291188, 2210617, 2134710, 2062819, 1994727, 1930278, 1869000, 1810424, 1754158, 1699528, 1646037, 1594293, 1545315, 1498696, 1452812, 1407254, 1363450, 1322155, 1281952, 1241366, 1201015, 1162415, 1125922, 1091218, 1058599, 1028249, 999336, 971451, 945931, 923896, 903826, 883177, 861978, 842695, 826578, 812184, 797858, 783821, 771184, 760328, 750986, 742826, 735317, 727922, 720901, 715182, 711051, 707697, 704307, 700907, 697912, 695601, 694231, 693862, 693783, 692811, 690391, 686766, 682018, 675840, 668525, 661324, 655354, 650707, 646844, 643179, 639030, 633796, 627602, 621276, 615477, 610453, 606691, 604866, 604734, 604913, 604203, 602400, 599518, 595261, 590032, 585542, 583233, 582489, 581314, 578593, 574896, 571237, 567836, 564178, 559879, 555491, 552623, 552750, 555375, 557810, 557543, 554596, 550920, 547891, 545458, 543551, 542875, 543699]
60779E43699J185J96o00K8J358J788R20j90n86m67m96o63l38O56J637J931J769
60762E51827J875K344K422J563L12j42P59K249K823J573q26k622k675j601r52
60747E58929j403k261k790l248m154n163n456n028m646m476l716k185j370k876
60733E10157o045q301q053o336n093m757m337l347k396j981j770j362r39p81q69
60718D53790j269k189l168l054j544l3R5m51K54K522M455M559L659L406L871L827
60702D68730K977K497L241M535N296N450N533N550N206M900N350O276O620O365
60688E38526O901Q709R917Q534N491L681M027M327K613j3j147n57k31j360k879
60673E86539l332k949l174m654o495p396p095o408n979n446m278l076l204m844
$$ y = [543699, 544884, 545080, 544480, 544508, 545866, 547654, 548574, 548384, 547798, 547331, 546835, 546172, 545834, 546490, 548127, 550058, 551827, 553702, 556046, 558468, 560031, 560343, 560201, 560960, 563209, 566032, 567605, 566779, 564157, 561482, 559881, 558929, 557526, 555265, 552475, 549227, 545073, 539910, 534454, 529426, 524780, 520304, 516588, 514403, 513033, 510157, 504112, 495811, 487758, 481422, 476329, 471572, 467235, 463888, 461492, 459511, 457741, 456379, 455440, 454659, 453790, 452521, 450332, 447164, 444110, 442566, 442533, 442628, 442177, 442431, 444953, 449408, 453967, 457626, 461032, 464903, 468730, 471707, 474204, 477445, 481980, 487276, 492726, 498259, 503809, 509015, 513915, 519265, 525541, 532161, 538526, 545427, 554136, 564053, 572587, 578078, 581759, 585786, 590113, 592726, 592713, 591566, 591009, 590778, 589418, 586539, 583207, 580258, 577084, 572430, 565935, 558539, 551444, 545036, 539057, 533611, 529333, 526257, 523053, 518209]
60659E18209o380o321n218m785n599o658p045o890o487n451l305m33K005K993
60645D58635K397J030Qk49k29l44n5J361L376M530M303L869M538O108P315P379
60629E03972O571N545M772M447M512M577M173L172J884P25j58q29j157p33N09
60614E41982J662J497K8j214r78K11J073J470K220L321L744L095K224J872J739
60599E63946J505J710K938M819O543P780Q602R154R828J1110J2790J4119J5099
60586F69943J6629J8748K0022J9663J9095J9968K1663K2382K2019K2025K2849
60575H95006K3422K3173K2626K1761J9685J6553J4016J2864J1771R321N959K809
60563A078966j99l655p110r565j0955j1879j2470j2715j3314j4798j6163j5832
$$ y = [518209, 511829, 505508, 500290, 495505, 489906, 483248, 476203, 469313, 462826, 457375, 454070, 453637, 455642, 458635, 461032, 462062, 462070, 461821, 461592, 461248, 461193, 462554, 465930, 470460, 474763, 478632, 483170, 489278, 496593, 503972, 510543, 516088, 520860, 525307, 529819, 534396, 538569, 541741, 543625, 544350, 544192, 543363, 542206, 541473, 541982, 543644, 545141, 545169, 543955, 542977, 543188, 544261, 545731, 547951, 551272, 555016, 558111, 560335, 562207, 563946, 565451, 567161, 570099, 574918, 581461, 589241, 597843, 606997, 616825, 627935, 640725, 654844, 669943, 686572, 705320, 725342, 745005, 764100, 784068, 805731, 828113, 850132, 872157, 895006, 918428, 941601, 964227, 985988, 1005673, 1022226, 1036242, 1049106, 1060877, 1070198, 1076157, 1078966, 1078767, 1075112, 1068002, 1058437, 1047482, 1035603, 1023133, 1010418, 997104, 982306, 966143, 950311]
60551I50311j4005j2653j3021j4265j4852j4331j3294j2542j2600j3429j4232
60540H01087j4105j3094j2070j1534j1166j0630j0012r305q233o942o093n993
60528F81910o224o338o163n312l367r30N78P31P66J770L218M153M829O094P988
60513F83703J0209J3132J6858J9914K0707K0161K1003K4232K7866K9533K8675
60502I15993K5695K0776J4631Q940M529K30n017r858j1959j1157r321p340m237
60489I31905L46M759P562R835J3706J9229K4236K7231K9002L0832L2151L1023
60477A161817K6596J9992J2733N237k577r878j5013j6804j5253j1305o642l288
60465A145615k156j925m94K166L883L418K328K632L998M719M664N376P548J0214
$$ y = [950311, 936306, 923653, 910632, 896367, 881515, 867184, 853890, 841348, 828748, 815319, 801087, 786982, 773888, 761818, 750284, 739118, 728488, 718476, 709171, 700938, 693996, 687903, 681910, 675686, 669348, 663185, 657873, 654506, 653576, 654154, 654885, 655651, 657421, 660639, 664792, 669621, 675715, 683703, 693912, 707044, 723902, 743816, 764523, 784684, 805687, 829919, 857785, 887318, 915993, 941688, 962464, 977095, 986035, 990564, 990794, 985777, 975919, 963960, 952803, 943482, 936142, 931905, 932251, 937010, 944572, 954407, 968113, 987342, 1011578, 1038809, 1067811, 1098643, 1130794, 1161817, 1188413, 1208405, 1221138, 1226375, 1223798, 1213920, 1198907, 1182103, 1166850, 1155545, 1148903, 1145615, 1143459, 1141534, 1141040, 1143206, 1147089, 1150507, 1152835, 1155467, 1159465, 1164184, 1168848, 1174224, 1181772, 1191986]
60451A191986J2662J5503J9372K3772K7972L2062L6584M1835M8027N5352O3496
60440A568623P1777Q0119Q8973R7884J05263J10085J12761J13387J10179J00769
60430B559820Q4418O1988L4673M092k6997n5736q0909j02411j19287j29837j33720
60419B096094j32491j27751j20274j11300j02944r6165q9477q0989p0936o1156
60409A102611n2899m6372m1802l9194l7289l4313l0172k6577k4586k3218k1122
60398G25067j8493j6402j5071j3958j2998j2503j2003j0524q221o601o535o936
60386E84822o262m707l887m470n164m384k283n46n15k039m021n549o299o232n402
60371E23062m105l006k791l610m879n829o194o250o082n227l449j746j690l456
$$ y = [1191986, 1204648, 1220151, 1239523, 1263295, 1291267, 1323329, 1359913, 1401748, 1449775, 1505127, 1568623, 1640400, 1720519, 1809492, 1907376, 2012639, 2122724, 2235485, 2348872, 2459051, 2559820, 2644238, 2706226, 2740899, 2744991, 2717994, 2662258, 2581349, 2478938, 2359651, 2229814, 2096094, 1963603, 1835852, 1715578, 1604278, 1501334, 1405169, 1315692, 1234703, 1163767, 1102611, 1049712, 1003340, 961538, 922344, 885055, 850742, 820570, 793993, 769407, 746189, 725067, 706574, 690172, 675101, 661143, 648145, 635642, 623639, 613115, 604894, 598293, 591758, 584822, 578560, 573853, 569966, 565496, 560332, 555948, 553665, 553119, 552604, 550565, 546544, 540995, 534696, 528464, 523062, 518957, 515951, 513160, 509550, 504671, 498842, 492648, 486398, 480316, 475089, 471640, 469894, 468204, 464748]
60357D64748n108m677k526p01j28K84J494K685K627J512K10j348l454m909m036
60342D46673j444K59Ll80P69K367K493J392P77J037J105N66J40J95L61N90J139
60325D58042J562J160M60P03J760K162J441P32O01J28j051j596o15N79L16r55
60309D65429j615j318q64l29Q92K485L309L076K577K147J215l95j824k219j566
60294D71000l84P55J337J362J652K867M309M687M025L675M237M656L872K277R47
60279E11274K94K20P27J605K092J706J083J179J969K620K694K492K319K165K125
60264E36564K454L072L514L664M013M937O057O695O790O976P746Q953J0265J1789
60250F23489J3840J6196J8101J9145J9938K1602K4699K8591L1591L1831K8491
$$ y = [464748, 459640, 454963, 452437, 451736, 451608, 451892, 453386, 456071, 458698, 460210, 460420, 459072, 455618, 450709, 446673, 445229, 445488, 445491, 445111, 445880, 448247, 450740, 452132, 452909, 453946, 455051, 455617, 455757, 455952, 456313, 456903, 458042, 459604, 460764, 461224, 461927, 463687, 465849, 467290, 468022, 468623, 468751, 467700, 466104, 465489, 466068, 466384, 465429, 463814, 462496, 461632, 461303, 462195, 464680, 467989, 471065, 473642, 475789, 477004, 476609, 474785, 472566, 471000, 470616, 471371, 472708, 474070, 475722, 478589, 482898, 487585, 491610, 495285, 499522, 504178, 508050, 510327, 511274, 511568, 511788, 512515, 514120, 516212, 517918, 519001, 520180, 522149, 524769, 527463, 529955, 532274, 534439, 536564, 539018, 542090, 545604, 549268, 553281, 558218, 564275, 570970, 577760, 584736, 592482, 601435, 611700, 623489, 637329, 653525, 671626, 690771, 710709, 732311, 757010, 785601, 817192, 849023, 877514]
60239H77514K2569J5968R442J907p621j7793k5615k9309k9666k8366k6034k2658
60227G40338j9133j7079j6936j7075j5530j2365r660r019r651r461p755n956n460
60214E85258n704n136l564k471k883l922l960k698j487j724l379n220o086n729
60200E31295m518k823r85L73O15j29r72j262j155j017p52j87L55M15O7k77m18
60183E18625k69M02J530K289J905Q08K84R69K272L270L478K809J466J06m63k7
60167E39454Q91J632J853J539J056J045J716K381K239J536J288J911K801L345
60153E64687L650M102M743N328N612N498N058M317K978R15q51o24J709L880L869
60138F14871K510J975K451K277J100N47J479K704L166L484M333M947M336K693
$$ y = [877514, 900083, 916051, 925493, 927400, 919779, 901986, 876371, 847062, 817396, 789030, 762996, 740338, 721205, 704126, 687190, 670115, 654585, 642220, 632560, 623541, 613890, 604429, 596674, 590718, 585258, 579554, 574418, 570854, 568383, 565500, 561578, 557618, 554920, 553433, 551709, 548330, 543110, 537024, 531295, 526777, 523954, 522969, 523342, 523957, 523828, 522856, 521594, 520439, 519422, 518670, 518483, 518838, 519253, 519320, 519043, 518625, 518356, 518758, 520288, 522577, 524482, 525290, 525574, 526543, 528815, 532085, 535563, 538372, 539838, 539944, 539481, 539454, 540345, 541977, 543830, 545369, 546425, 547470, 549186, 551567, 553806, 555342, 556630, 558541, 561342, 564687, 568337, 572439, 577182, 582510, 588122, 593620, 598678, 602995, 605973, 606888, 606037, 605413, 607122, 611002, 614871, 617381, 619356, 621807, 624084, 625184, 625731, 627210, 629914, 633080, 636564, 640897, 645844, 650180, 652873]
60124F52873N99j793l771l775j500J003J697J002M95L58k03r02o72M59J374J503
60108F48747J098J81j243k281j873m24O41Q41R82J610K363K935L462L797L429
60093F64265K358J241N14Pn59j230j771j494L24L196N313N537M740M233L873L092
60077F93639K678L548M547L761J654O15J378K270K249K153K416K056R09N04J353
60062G25730J603kj773j560M9J137J701L095N075N843M861L495K793K375J792
60047G56214J467J719K064J895J042m68k408l987m361l675k876k456j985j045
60033G41140Q7P80O13l17j223j071J92J223R97M03J057K782L743L096K010J598
60017G57110J385N70m44r11j131j739k385k406k384l466n292o172n676n536p141
$$ y = [652873, 653472, 651679, 647908, 644133, 642633, 643636, 645333, 646335, 646830, 647188, 646985, 646083, 645411, 645870, 647244, 648747, 649845, 650026, 648783, 646502, 644629, 644205, 644846, 645687, 646669, 648279, 650642, 653577, 657039, 660836, 664265, 666623, 667864, 668378, 668385, 667826, 666596, 664825, 663331, 663655, 666851, 672164, 677701, 682441, 686674, 690547, 693639, 696317, 699865, 704412, 708173, 709827, 710442, 711820, 714090, 716339, 718492, 720908, 722964, 723873, 724377, 725730, 727333, 727331, 725558, 723998, 724047, 725184, 726885, 729980, 735055, 740898, 745759, 749254, 752047, 754422, 756214, 757681, 759400, 761464, 763359, 764401, 763933, 761525, 757538, 753177, 749502, 746626, 744170, 742185, 741140, 741227, 742007, 742620, 742303, 741080, 740009, 740201, 741424, 742421, 742824, 743881, 746663, 750406, 753502, 755512, 757110, 758495, 759065, 758621, 757710, 756579, 754840, 752455, 750049, 747665, 744199, 738907, 732735, 727059, 721523, 714382]
60002G14382r250r571p912o370o425p232p250o463o038o468p056p123o745o155
59988F14324n187l702k169j283j213j479j455q50K05J339K314L217M194M966M930
59973F18151L844K248J030O76R72J198O71o54k033k641k423k024j913k118k717
59958F12267l937n443o277o033n564n857o575o419m834k608q64l6J02j1M8M05
59942E58364O18J54p56j175p16k09n83j380j095Q13K925L272J611k79n61P82K336
59925E64121L159L597M260M773M224K617J150P95J072P82j97n86N21K102K237
59910E94627N78j004o68J174K471K020N22o24p68r8Q56J386R14j79m41J167L627
59893F05560M470K354j307l792l926k945k550k863k862k304k067k503k570j339
$$ y = [714382, 705132, 695561, 687649, 681279, 674854, 667622, 660372, 653909, 647871, 641403, 634347, 627224, 620479, 614324, 609137, 605435, 603266, 601983, 600770, 599291, 597836, 596986, 597191, 598530, 600844, 604061, 608255, 613221, 618151, 621995, 624243, 625273, 625949, 626921, 628119, 628790, 628136, 626103, 623462, 621039, 619015, 617102, 614984, 612267, 608330, 602887, 596610, 590577, 585013, 579156, 572581, 566162, 561328, 558720, 557856, 557820, 557922, 557911, 557959, 558364, 558982, 559136, 558380, 557205, 556489, 556280, 555697, 554317, 553222, 554035, 556960, 560232, 561843, 561564, 561003, 561785, 564121, 567280, 570877, 575137, 579910, 584134, 586751, 587901, 588696, 589768, 590550, 590353, 589767, 590288, 592390, 594627, 595205, 594201, 593533, 594707, 597178, 599198, 599720, 599096, 598328, 598230, 599086, 600472, 601386, 601207, 600766, 601933, 605560, 610030, 612384, 611077, 607285, 603359, 600414, 597864, 595001, 592139, 589835, 587768, 585265, 582695, 581356]
59879E81356L76R38L8r70r20r4M87K39p06j782k224j566k30O80M37p40k004k413
59861E70902j370P98K737L296K901K891L512L699L005K460K895L619L635L145
59847F08125K754K139Q76o8P03K751L997L373K033J497J798K027J832J635J871
59832F37343K647L827M966N422M958M144L822M253M963N316N021M217L330K991
59818F97220L857O069Q598R544P760M378J998J907K617J716j155l967m714l393
59804G32435j519l40J52P62J977L271L684L237L328N167Q137J0396J1066J1007
59790G92760J1244J1477J0613Q271N167K312L18o35o76j86K99K63o68k681n686
59775H32192r300j2899j5698j7035j6810j5631j4340j3366j2634j1919j1083j0100
$$ y = [581356, 581732, 582670, 582708, 581738, 580818, 580724, 581211, 581450, 580744, 578962, 576738, 575172, 574942, 575622, 576059, 575319, 573315, 570902, 569532, 570330, 573067, 576363, 579264, 582155, 585667, 589366, 592371, 594831, 597726, 601345, 604980, 608125, 610879, 613018, 613894, 613826, 614529, 617280, 621277, 624650, 626683, 628180, 629978, 632005, 633837, 635472, 637343, 639990, 643817, 648783, 654205, 659163, 663307, 667129, 671382, 676345, 681661, 686682, 690899, 694229, 697220, 701077, 707146, 715744, 725288, 733048, 737426, 739424, 741331, 743948, 745664, 744509, 740542, 735828, 732435, 730916, 730576, 730728, 731490, 733467, 736738, 740422, 743659, 746987, 752154, 760291, 770687, 781753, 792760, 804004, 815481, 826094, 834365, 839532, 841844, 842162, 841527, 840851, 840665, 840964, 841227, 840559, 837878, 832192, 822892, 809993, 794295, 777260, 760450, 744819, 730479, 717113, 704479, 692560, 681477, 671377]
59763F71377r138q536q347p978o692m623k980k918m287n616n572m430l887m978
59749E91395o511o261l898j687j692l191l935l258k475k473k639k504k764l717
59735E44390m124k965j481j834m025n751n382l706k237j159l3N42n09k671l853
59720E05202k942j294q07j293j029L93J283M19r43q17N52J055m9r42k1J589J622
59703E01978L5r90l41M40l40j779j631M08K276K479J848J668J474O8j967k405
59687E03221k03L044N009N096M461M212M323M083L062J585M62J61K54J5n15n65
59671E37705J04P05N39J7qN95J320J812J877J074p86k740l173j561P67J892J167
59654E41306l86j275r68o5P28J416K242K834K654K157K515L805M524L580J919
$$ y = [671377, 662239, 653703, 645356, 637378, 630686, 626063, 623083, 620165, 615878, 610262, 604690, 600260, 596373, 591395, 584884, 578623, 574725, 573038, 571346, 568155, 564220, 560962, 558487, 556014, 553375, 550871, 548107, 544390, 540266, 537301, 535820, 533986, 529961, 524210, 518828, 515122, 512885, 511726, 511693, 512235, 511726, 509055, 505202, 502260, 500966, 500159, 498866, 497837, 498230, 499513, 499932, 498989, 498172, 498724, 499779, 499730, 498788, 498767, 500356, 501978, 502013, 501023, 500682, 501122, 500782, 499003, 497372, 497780, 500056, 502535, 504383, 506051, 507525, 507593, 505626, 503221, 503018, 506062, 511071, 516167, 520628, 524840, 529163, 533246, 536308, 537893, 538355, 538516, 538770, 538785, 538270, 537705, 537809, 538514, 539053, 539070, 539062, 539657, 540977, 542789, 544666, 545740, 544954, 542214, 539041, 537480, 538247, 540139, 541306, 540920, 539645, 538677, 538612, 539340, 540756, 542998, 545832, 548486, 550643, 553158, 556963, 561487, 565067, 566986]
59639E66986J249J770K192J596K69r82j369k37K254M544M880L305J655J404K244
59624E91760K882K476J190m9k23P62J744J560M49n04r62j310j244Q9K334L702
59608F04656L114J457K6j163k571l648l395k019q82q37j431j832j888j986k116
59593E85485j503N69L442N054L878P88j670j903n14R48J527J000m69k111k733
59578E91788j872m45J73n33k023l330l580k463n73R82J538J198L43n74r35m57
59562E79237J67O0m50l35L14L79j97j26P49N14k069n322o700n945m657l716k829
59545E49074j928j234k79J406K897K712J049l32n88o90j670l140m011l702k416
59530E37148r22j48j66J25J512K943K633M89j826l130l642l731l201k092r19J6
$$ y = [566986, 568235, 570005, 572197, 573793, 574062, 573080, 571711, 571474, 573728, 578272, 583152, 586457, 588112, 589516, 591760, 594642, 597118, 598308, 598259, 598036, 598798, 600542, 602102, 602551, 602047, 601085, 599775, 598531, 598620, 600954, 604656, 607770, 609227, 609253, 608090, 605519, 601871, 598476, 596457, 595575, 594738, 593307, 591475, 589587, 587601, 585485, 583982, 584551, 587993, 593047, 596925, 597713, 596043, 594140, 593626, 594574, 596101, 597101, 596632, 594521, 591788, 589916, 589471, 589644, 589111, 587088, 583758, 580178, 577715, 577142, 578124, 579662, 580860, 581203, 580629, 579694, 579237, 579404, 579464, 579014, 578679, 578993, 579372, 579175, 579049, 579798, 580312, 578243, 572921, 566221, 560276, 555619, 551903, 549074, 547146, 545912, 545633, 547039, 549936, 552648, 553697, 553365, 552777, 552087, 550417, 547277, 543266, 539564, 537148, 536226, 536078, 535912, 536037, 537549, 540492, 543125, 543614, 541788, 538658, 535016, 531285, 528084, 525992, 525073, 525089]
59514E25089N16j91k448m569m232j720J57L2l36O74J970J941J241J224J312L16
59498E20976p99q1K060L347L179L220M256M963M405L496L081K549J566J417L211
59483E60846O089Q607J0764J3133J5096J5673J5499J6134J7633J8367J7271J4688
59471G29800J0960N851q3m951p309p577p023o206n147m176l518k662j173K33M98
59456F97517p7q3R91K083K174J586J105O66l46j977l644m989n999o467o156n554
59440F70830n701o874q026q010o890n501m168k679j429j414k674l644k896r95
59426F09929L13M93O38J545K592L040L343M300N657O564O949P476Q313Q857Q688
59411F78697P913O637M844K839J122k69j568k418k049m48J406K647L217L293K962
$$ y = [525089, 525605, 525414, 522966, 518397, 514165, 512445, 512602, 512634, 512298, 512972, 514942, 516883, 518124, 519348, 520660, 520976, 520177, 520096, 522156, 525503, 528682, 531902, 536158, 541121, 545526, 549022, 552103, 554652, 556218, 557635, 560846, 566935, 575542, 586306, 599439, 614535, 630208, 645707, 661841, 679474, 697841, 715112, 729800, 740760, 746611, 746528, 741577, 734268, 726691, 719668, 713462, 708315, 704139, 700621, 697959, 696786, 697019, 697517, 697440, 697357, 698348, 700431, 702605, 704191, 705296, 705962, 705616, 703639, 699995, 695006, 689007, 682540, 676384, 670830, 665129, 658255, 650229, 642219, 635329, 629828, 625660, 622981, 621552, 620138, 617464, 613820, 610924, 609929, 610242, 610735, 611373, 612918, 615510, 618550, 621893, 626193, 631850, 638414, 645363, 652839, 661152, 670009, 678697, 686610, 693247, 698091, 700930, 702052, 701783, 700215, 697797, 695748, 695300, 696706, 699353, 702570, 705863, 708825]
59396G08825K761L669N963Q708J0783J1921J2528J3225J4790J7552K0346K1124
59384H52195J9299J6560J4513J2535Q991L720j963p057j1231j3945j4757j4363
59372H64497j3938j3582j2769j2113j2944j4840j5341j2837q479m504j886l16
59360G40948P88K292N187R273J2751J4238J4552J5475J7552K0399K4247K9145
59348I06847L2748L1108K2678J0403r23q443j1947j2276j0492p890n233j947K576
59335I47209O602O250q77j2728k4219l1495l4297l4456l3178l0377k6165k1928
59323G10341j9310j8317j7057j3783r078n437m484n118m977l369j892j993k931
59310F02595k925j796j184k022k920j996L19J603O05j155j615r22o53r26m7K677
$$ y = [708825, 711586, 715255, 721218, 729926, 740709, 752630, 765158, 778383, 793173, 810725, 831071, 852195, 871494, 888054, 902567, 915102, 924093, 927813, 925850, 918793, 907562, 893617, 878860, 864497, 850559, 836977, 824208, 812095, 799151, 784311, 768970, 756133, 747654, 743150, 741264, 740948, 741736, 744028, 749215, 758488, 771239, 785477, 800029, 815504, 833056, 853455, 877702, 906847, 939595, 970703, 993381, 1003784, 1002861, 994418, 982471, 970195, 959703, 951813, 946580, 944633, 947209, 953811, 960061, 959184, 946456, 922237, 890742, 856445, 821989, 788811, 758434, 732269, 710341, 691031, 672714, 655657, 641874, 632796, 627359, 622875, 617757, 612780, 609411, 607519, 605526, 602595, 599670, 597874, 596690, 594668, 591748, 589752, 590071, 591674, 592279, 591124, 589509, 588587, 587934, 587008, 586961, 589638]
59294E89638N440O332O029O721Q977J1156J1771J1145J0601J1062J2604J4370
59282G05846J4886J3462J1473J1125J2692J4156J3932J2703J1914J1673J1119
59271H44981R968Q608P260N843M207J890j583n500q060q558q500r490j0947j1185
59257H18934r935q274o677m872l174k311j942r56P94K413L638N012O523P697R192
59242H16062J2478J7472K2182K5074K6013K4320J8155P355m715j3837j8596k0261
59230I11702k0217j9074j7373j5521j3353j0954r250q648p833n436k245n0J118
59217G82866K721M852N747M502K402R53L07M47K193N651Q974J0203R646R073R149
59202H59686R127Q692Q539Q886Q729P093M166P84k415m995o568p130p098o785
$$ y = [589638, 595078, 601410, 607439, 614160, 623137, 634293, 646064, 657209, 667810, 678872, 691476, 705846, 720732, 734194, 745667, 756792, 769484, 783640, 797572, 810275, 822189, 833862, 844981, 854949, 863557, 870817, 876660, 880867, 882757, 881174, 875674, 867614, 859056, 850556, 841066, 830119, 818934, 808999, 800725, 794048, 789176, 786002, 783691, 781749, 780793, 781587, 784000, 787638, 792650, 799173, 806870, 816062, 828540, 846012, 868194, 893268, 919281, 943601, 961756, 969111, 964396, 950559, 931963, 911702, 891485, 872411, 855038, 839517, 826164, 815210, 805960, 797312, 789479, 784043, 781798, 781748, 782866, 785587, 790439, 796186, 800688, 803090, 804043, 804350, 804797, 806990, 812641, 821615, 831818, 841464, 850537, 859686, 868813, 877505, 886044, 894930, 903659, 910752, 914918, 915702, 913287, 908292, 901724, 894594, 887496, 880711]
59188H80711o347o376p573r308r519p022l388j365j765k936l197k616k214k415
59174H14670k690k154l45K093L634L482K704K715L003J899m43j911j833k264m604
59159H17956p026p315o568p486r986j1345j0484r277r292r799r788r696j0006
59146F99888r993r177q396q207p648n961m288m073m835n077m605m352m510m479
59132F14287m215m044l454j686N16J481J214J713M078O682P181N360L017J720
59118F33850J615K072K566K989L624M813O312P251P126O494O121N841N045M132
59104F99851M427O313Q392R113Q558P958Q028Q690R885J1378J2039J0724Q104
59091H13460O199N587M497J523k065l946l659k586j843j717k470l984m991m390
$$ y = [880711, 874364, 867988, 860415, 851107, 841588, 834566, 831178, 829813, 828048, 825112, 821915, 819299, 817085, 814670, 811980, 809826, 809481, 811574, 815208, 818690, 821394, 824109, 827112, 829011, 828568, 826657, 824824, 822560, 817956, 810930, 803615, 797047, 789561, 779575, 768230, 757746, 748469, 739177, 729378, 719590, 709894, 699888, 689895, 680718, 672322, 664115, 656467, 650506, 646218, 642145, 637310, 632233, 627628, 623276, 618766, 614287, 610072, 606028, 602574, 600888, 601404, 602885, 604099, 605812, 609890, 616572, 623753, 629113, 632130, 633850, 635465, 637537, 640103, 643092, 646716, 651529, 657841, 665092, 672218, 678712, 684833, 690674, 695719, 699851, 704278, 710591, 718983, 728096, 736654, 744612, 752640, 761330, 771215, 782593, 794632, 805356, 813460, 819659, 825246, 829743, 831266, 829201, 825255, 821596, 819010, 817167, 815450, 812980, 808996, 804005, 799615]
59077G99615l095k903l634l401j819o57p05l43J570L367K948J080M81K328N314
59062H00146P671Q697Q632Q299Q680R875J0751J0406R528R349R926J0503J0987
59049I23450J1665J1909J0706Q447O814O751P693Q789R564R225O892L290R47J558
59035A027700L836M902L550J194j78j56K33Q3n40j174j705k299k895l300l702
59020A025549m562o028p833r725j1410j2179j1593j0784j1834j5116j8148j8188
59008H88149j5419j2417j0981j0727j0662j0615j0633j0104q380n962m284m251
58996G73714n259n840n201l939l115k982l088l257l654m039m057m383o124q545
58982G10231q987o187k371n00m75O6J897L342L195K411K401L328M759O520Q156
$$ y = [799615, 796520, 793617, 789983, 786582, 784763, 784106, 783401, 783058, 784628, 787995, 790943, 792023, 792504, 794832, 800146, 807817, 816514, 825146, 833445, 842125, 852000, 862751, 873157, 882685, 892034, 901960, 912463, 923450, 935115, 947024, 957730, 966177, 972991, 979742, 987435, 996224, 1005788, 1015013, 1021905, 1025195, 1026142, 1027700, 1031536, 1036438, 1039988, 1041182, 1041004, 1040848, 1041081, 1041164, 1040624, 1039450, 1037745, 1035446, 1032551, 1029251, 1025549, 1020987, 1014959, 1007126, 997401, 985991, 973812, 962219, 951435, 939601, 924485, 906337, 888149, 872730, 860313, 849332, 838605, 827943, 817328, 806695, 796591, 788211, 782249, 777965, 773714, 768455, 762615, 757414, 753475, 750360, 747378, 744290, 741033, 737379, 733340, 729283, 724900, 718776, 710231, 701244, 695057, 692686, 692186, 691711, 691777, 693674, 697016, 700211, 702622, 705023, 708351, 713110, 719630, 727786]
58967G27786Q777Q254P620P558P498P000O979Q460J0803J2388J2722J2777J3343
58954H51965J4017J4021J3241J2058J0581Q490N677K847J163J134J894K033J181
58941I40302L61N18J211J282N56J51Q82K016K193J310O99J268K210K127Q22q15
58925I57093k308l902n481o414o732p257q068q002o490m747m170m465m489m104
58911H80464l817l303j865R9J650L006N063P248P824O623N598N914O181M709K198
58896I27592P74J210K388L021K613J026j638m544o441o870o605o705p439q221
58882H90161q294p358n731m080k912k312k193k663l910n635o883o812n752n080
58868H20546n722p051p810p777p696p718p086n674m576m475m495l648k454j885
$$ y = [727786, 736563, 744817, 752437, 759995, 767493, 774493, 781472, 789932, 800735, 813123, 825845, 838622, 851965, 865982, 880003, 893244, 905302, 915883, 924373, 930050, 932897, 934060, 935194, 937088, 939121, 940302, 940663, 941181, 942392, 943674, 944230, 944381, 945263, 947279, 949472, 950782, 951481, 952749, 954959, 957086, 957908, 957093, 954785, 950883, 945402, 938988, 932256, 924999, 916931, 908929, 902439, 897692, 893522, 889057, 884568, 880464, 876647, 873344, 871479, 871578, 873228, 876234, 881297, 888545, 896369, 902992, 908590, 914504, 920685, 925394, 927592, 928366, 929576, 931964, 934985, 937598, 938624, 936986, 932442, 926001, 919131, 912526, 905821, 898382, 890161, 881867, 874509, 868778, 864698, 861786, 859474, 857281, 854618, 850708, 845073, 838190, 831378, 825626, 820546, 814824, 807773, 799963, 792186, 784490, 776772, 769686, 764012, 759436, 754961, 750466, 746818, 744364, 742479]
58854G42479j545m18J138J804J565J891L405M973N610N977P222R404J1777J3834
58840H09116J5263J5520J4272J2141J0488J0385J1758J3323J3569J2211J0501
58829I48547R633R382R045R123J0748J3593J5902J6808J7271J8094J8361J6674
58817A113181J3092Q953N412K819J053l18j933m241p199j0425j3304j5111j5585
58804A076394j5304j4948j4396j3298j2189j1852j1872j1226j0348j0880j3009
58793I37072j4840j5228j5508j7138j9020j8904j6518j3718j1896j0729r396p830
58781G66347o513n893o088o722p110p022o976p400p890p763o895n562l963k449
58767F78101j704k006k707l091l294l719l984l309j778m07j18j014k541l710l544
$$ y = [742479, 740934, 740516, 741654, 743458, 745023, 746914, 750319, 755292, 760902, 766879, 774101, 783505, 795282, 809116, 824379, 839899, 854171, 866312, 876800, 887185, 898943, 912266, 925835, 938046, 948547, 958180, 967562, 976607, 985730, 996478, 1010071, 1025973, 1042781, 1060052, 1078146, 1096507, 1113181, 1126273, 1135226, 1140638, 1143457, 1144510, 1144192, 1142259, 1138018, 1130819, 1120394, 1107090, 1091979, 1076394, 1061090, 1046142, 1031746, 1018448, 1006259, 994407, 982535, 971309, 960961, 950081, 937072, 922232, 907004, 891496, 874358, 855338, 836434, 819916, 806198, 794302, 783573, 774177, 766347, 759834, 753941, 747853, 741131, 734021, 726999, 720023, 712623, 704733, 696970, 690075, 684513, 680550, 678101, 676397, 674391, 671684, 668593, 665299, 661580, 657596, 654287, 652509, 652102, 651984, 650970, 648429, 644719, 641175]
58752F41175j881K91J806K455K695K615J859M97p83j400j363j009o59n85q12q56
58736F44045o1J474K616K303Q72q5N35K002K659J988J058Q78J187J325J449K053
58720F66298K947L695M524N757O739O519N363M456M216L962L103J645l08k354
58706G16562l420k856j714j489j968j866j221j190j669j430o60q72j873j516O68
58691F93486K377K344K479M402O421O309M996M918O280P491Q036Q324P927O570
58677G72360O046Q202J1612J2943J1532R979J0104J0883J0820J0144R826J0093
58665H94544J0704J1415J1751J1360J0665J0205R541Q098O656O356O656O078M856
58652A008885M723N986O944O558N703N192M527L397K533K163J184j105l977o832
$$ y = [641175, 639294, 639585, 641391, 643846, 646541, 649156, 651015, 651512, 650729, 649329, 647966, 646957, 646298, 645713, 644901, 644045, 643984, 645458, 648074, 650377, 651249, 651164, 651699, 653701, 656360, 658348, 659406, 660284, 661471, 662796, 664245, 666298, 669245, 672940, 677464, 683221, 689960, 696479, 701842, 706298, 710514, 714476, 717579, 719224, 718916, 716562, 713142, 710286, 708572, 707083, 705115, 703249, 702028, 700838, 699169, 697739, 697079, 696207, 694334, 692818, 693486, 695863, 698207, 700686, 705088, 711509, 717818, 722814, 727732, 734012, 741503, 749539, 757863, 765790, 772360, 778406, 786608, 798220, 811163, 822695, 832674, 842778, 853661, 864481, 874625, 884451, 894544, 905248, 916663, 928414, 939774, 950439, 960644, 970185, 978283, 984939, 991295, 997951, 1004029, 1008885, 1013608, 1019594, 1026538, 1033096, 1038799, 1043991, 1048518, 1051915, 1054448, 1056611, 1057795, 1056690, 1052713, 1045881]
58638A045881j0173j3905j6350j6476j5951j7212k0234k2721k3058k1662j9734
58627H48405j7967j6565j5454j4312j2908j1499j0522j0055r818r362q056n570
58615G06317k754j407k342m201m924l995k512j395m79O74K023L342M546N511N961
58600G04365N795N157M102K683J411J012J404J556Q40k4j78k16j440l558m550
58585G18359l283j039L14N26L23l48j834l197l005j564p15j224j982j981j504
58570F97846r75k81K19k96j493j839r83m71j073j253L34K413K988K356K397L727
58554G03616N300O221O406O010N536N923P268Q276Q079P518P291O246L443N49
58540G87682j60O57M38j247k295j555k26M48N91N31K50K78J203K128J647N46J274
$$ y = [1045881, 1035708, 1021803, 1005453, 988977, 973026, 955814, 935580, 912859, 889801, 868139, 848405, 830438, 813873, 798419, 784107, 771199, 759700, 749178, 739123, 729305, 719943, 711887, 706317, 703563, 702156, 699814, 695613, 690689, 686694, 684182, 682787, 682308, 682982, 685005, 688347, 692893, 698404, 704365, 710160, 715317, 719419, 722102, 723513, 724525, 725929, 727485, 728325, 728301, 728123, 727907, 726467, 722909, 718359, 715076, 714037, 714351, 714877, 715200, 714852, 713018, 709821, 706816, 705252, 704537, 703313, 701331, 699350, 697846, 696871, 696590, 696809, 696513, 695020, 693181, 692198, 691727, 690654, 689401, 689735, 692148, 695136, 697492, 699889, 703616, 708916, 715137, 721543, 727553, 733089, 739012, 746280, 754556, 762635, 770153, 777444, 783690, 787133, 787682, 787522, 788179, 788617, 787370, 785075, 783520, 783294, 783742, 784333, 784864, 785114, 785392, 786595, 788723, 790370, 790916, 792190]
58523G92190M264P115Q138Q435R367J0166R577Q276P899Q705R740J0563J1560
58510I05995J2879J4038J4465J4020J3223J3066J4092J5733J7146J8426K0093
58499A073176K1678K2079K1261K0398K0237K0428K0281J9058J5921J1109O736
58488A272362M556L237on064q809r676r829j1651j4505j6461j7290j7961j8575
58475A150328j8537j7889j7141j6491j6060j6056j5927j4488j1705r161p930p271
58463I81672o339n747o112o457n587m091l364l338k767j358q6L86L42Q9m99j293
58447I35451j627r99L13J579K344K743L062L092K340J062M76J298K614L011K277
58432I59036J119j38j337j630l95J361K149K175K738L758L906L130K984M210N874
$$ y = [792190, 796454, 803569, 811707, 820142, 829509, 839675, 849252, 857528, 865427, 874132, 883872, 894435, 905995, 918874, 932912, 947377, 961397, 974620, 987686, 1001778, 1017511, 1034657, 1053083, 1073176, 1094854, 1116933, 1138194, 1158592, 1178829, 1199257, 1219538, 1238596, 1254517, 1265626, 1272362, 1276918, 1280155, 1280149, 1275085, 1266276, 1256600, 1246771, 1235120, 1220615, 1204154, 1186864, 1168903, 1150328, 1131791, 1113902, 1096761, 1080270, 1064210, 1048154, 1032227, 1017739, 1006034, 996873, 988943, 981672, 975333, 969586, 963474, 957017, 951430, 947339, 943975, 940637, 937870, 936512, 936426, 936812, 937154, 937243, 936744, 935451, 933824, 932825, 933138, 934717, 937061, 939804, 942866, 945958, 948298, 949360, 949836, 951134, 953748, 956759, 959036, 960155, 960017, 958680, 957050, 956655, 958016, 960165, 962340, 965078, 968836, 972742, 975872, 978856, 983066, 988940]
58417I88940P168Q240R100R521J0072J1229J1575R473O360N429O579O061K234
58404A091981j792k943k449l004m446m972m541m182l516j669L66P90j73n75O53
58389A059528K892N033O193O015N315N268N261L186j027m258m101k048q55o70
58375A085732J2J243J998K470L580N022N980O878Q381R633R578R178J0096J1919
58361A171700J2761J1905R993P404M496K597K584L124K316M47q40j266j683j927
58347A223611j280m26n34q51L08K405K998J325p03j299n92P03K417M280N593N999
58331A243954N600M492L238L137M620O022N653M387M316N416N851N216N057O011
58317A312970O732O212N263N046N627O497P221P206O148M954N031O428P887Q810
$$ y = [988940, 996108, 1004348, 1013448, 1022969, 1033041, 1044270, 1055845, 1065318, 1071678, 1077107, 1083686, 1089747, 1091981, 1090189, 1087246, 1084797, 1081793, 1077347, 1072375, 1067834, 1063652, 1060136, 1058467, 1058833, 1059623, 1059450, 1058875, 1059528, 1062420, 1067453, 1073646, 1079661, 1084976, 1090244, 1095505, 1098691, 1097664, 1093406, 1089305, 1087257, 1086402, 1085732, 1085744, 1086987, 1088985, 1091455, 1095035, 1100057, 1106037, 1112915, 1121296, 1130929, 1140507, 1149685, 1159781, 1171700, 1184461, 1196366, 1206359, 1213763, 1218259, 1220856, 1223440, 1226564, 1228880, 1229327, 1228487, 1227221, 1225538, 1223611, 1222331, 1221905, 1221371, 1220520, 1220828, 1223233, 1226231, 1227556, 1226853, 1225554, 1224962, 1225665, 1228082, 1232362, 1237955, 1243954, 1249554, 1254046, 1257284, 1260421, 1265041, 1271063, 1276716, 1281103, 1285419, 1290835, 1296686, 1301902, 1306959, 1312970, 1319702, 1325914, 1331177, 1336223, 1341850, 1348347, 1355568, 1362774, 1368922, 1373876, 1378907, 1385335, 1393222, 1402032]
58303A402032R883J1521J3090J4087J4950J6094J6993J6822J5662J4625J4801
58292A560560J5969J6561J5414J3389J2298J2264J1723J0288R747J1266J3417
58281A702896J4384J4609J5592J7374J8813J9422J9312J8415J7147J6884J8415
58270A893263K0781K2757K4299K5393K5141K3425K1961K2162K3391K4678K6349
58259B153600K8351K9074K7874K6806K7640K9034K9089K8682K9572L0960L1010
58248B471692L0244L0432L1258L1150L0422L0639L1768L2716L3743L5655L7542
58237B827261L8127L8444M0517M4122M7405M9701N1407N2237N2172N2917N5849
58226C350159N9700O2684O5274O8443P1137P2415P4038P7760Q2138Q5228Q8199
$$ y = [1402032, 1411915, 1423436, 1436526, 1450613, 1465563, 1481657, 1498650, 1515472, 1531134, 1545759, 1560560, 1576529, 1593090, 1608504, 1621893, 1634191, 1646455, 1658178, 1668466, 1678213, 1689479, 1702896, 1717280, 1731889, 1747481, 1764855, 1783668, 1803090, 1822402, 1840817, 1857964, 1874848, 1893263, 1914044, 1936801, 1961100, 1986493, 2011634, 2035059, 2057020, 2079182, 2102573, 2127251, 2153600, 2181951, 2211025, 2238899, 2265705, 2293345, 2322379, 2351468, 2380150, 2409722, 2440682, 2471692, 2501936, 2532368, 2563626, 2594776, 2625198, 2655837, 2687605, 2720321, 2754064, 2789719, 2827261, 2865388, 2903832, 2944349, 2988471, 3035876, 3085577, 3136984, 3189221, 3241393, 3294310, 3350159, 3409859, 3472543, 3537817, 3606260, 3677397, 3749812, 3823850, 3901610, 3983748, 4068976, 4157175]
58215D157175R2656R6817R8586J00130J04673J10785J14782J17282J22078J29546
58205E244510J36372J41268J46240J52576J59918J68639J78970J88764J96273
58196F713530K03762K14092K25558K34845K43091K53654K65835K76712K87526
58187H918605L02140L20499L39801L60699L85807M13375M39258M64038M91407
58178A2435629N20850N49279N78758O14614O56532O99340P42082P88221Q37492
58169A8422797Q86170R35350R90306J051435J114328J178830J249294J326112
58161B7154622J406229J491886J589092J697600J812438J935310K073696K228899
58153D1389772K396379K577897K781139L007166L251438L517972L819239M161756
$$ y = [4157175, 4249831, 4346648, 4445234, 4545364, 4650037, 4760822, 4875604, 4992886, 5114964, 5244510, 5380882, 5522150, 5668390, 5820966, 5980884, 6149523, 6328493, 6517257, 6713530, 6917292, 7131384, 7356942, 7591787, 7834878, 8088532, 8354367, 8631079, 8918605, 9220745, 9541244, 9881045, 10241744, 10627551, 11040926, 11480184, 11944222, 12435629, 12956479, 13505758, 14084516, 14699130, 15355662, 16055002, 16797084, 17585305, 18422797, 19308967, 20244317, 21234623, 22286058, 23400386, 24579216, 25828510, 27154622, 28560851, 30052737, 31641829, 33339429, 35151867, 37087177, 39160873, 41389772, 43786151, 46364048, 49145187, 52152353, 55403791, 58921763, 62741002, 66902758]
58145F6902758M546062M981057N482916O060331O718127P474722Q355377R367613
58137A19888963J0505169J1775841J3198329J4768383J6455551J8233488K0077198
58130B24902922K1925438K3680805K5228901K6361009K6632760K5397803K2120064
58123C96249702J6701952R522475J253697p260294j5038957k1151500k5073874
58116C55203201k6886422k7089040k6241498k4766076k2958375k1028776j9099515
58109A87133499j7224970j5446478j3809018j2331712j1002009r807960q750848
58102I8760504p823870p006114o284328n658666n121507m650476m228422l853319
58094E4133802l523416l228318k959984k718659k502860k305490k123631j960750
$$ y = [66902758, 71448820, 76429877, 81912793, 87973124, 94691251, 102165973, 110521350, 119888963, 130394132, 142169973, 155368302, 170136685, 186592236, 204825724, 224902922, 246828360, 270509165, 295738066, 322099075, 348731835, 374129638, 396249702, 412951654, 422474129, 423727826, 416467532, 401428575, 380277075, 355203201, 328316779, 301227739, 274986241, 250220165, 227261790, 206233014, 187133499, 169908529, 154462051, 140653033, 128321321, 117319312, 107511352, 98760504, 90936634, 83930520, 77646192, 71987526, 66866019, 62215543, 57987121, 54133802, 50610386, 47382068, 44422084, 41703425, 39200565, 36895075, 34771444, 32810694]
58086C2810694j815838j681119j553567j438284j337496j246122j161116j085614
58078B1491538j020708r61980r07260q59391q18340p78359p36133o94782o57125
58069A4057460o21541n86775n54517n25129m96552m69031m45187m24447m03233
58060I531048l81439l62525l46592l29898l11946k96342k83593k69991k55004
58051F693718k42704k34051k24556k11983j99882j90985j83119j74400j66638
58042D865400j60803j54498j46917j41142j38670j36395j31860j27027j24003
58033C604085j21342j17335j13019j09248j04535r8322r2807q9235q5774q0979
58023B591489p5943p1288o5807n9854n6089n4997n3598n0605m8740m9639n0675
$$ y = [32810694, 30994856, 29313737, 27760170, 26321886, 24984390, 23738268, 22577152, 21491538, 20470830, 19508850, 18601590, 17742199, 16923859, 16145500, 15409367, 14714585, 14057460, 13435919, 12849144, 12294627, 11769498, 11272946, 10803915, 10358728, 9934281, 9531048, 9149609, 8787084, 8440492, 8110594, 7798648, 7502306, 7218713, 6948722, 6693718, 6451014, 6216963, 5992407, 5780424, 5580542, 5389557, 5206438, 5032038, 4865400, 4704597, 4550099, 4403182, 4262040, 4123370, 3986975, 3855115, 3728088, 3604085, 3482743, 3365408, 3252389, 3143141, 3038606, 2940284, 2847477, 2758242, 2672468, 2591489, 2515546, 2444258, 2378451, 2318597, 2262508, 2207511, 2153913, 2103308, 2054568, 2004929, 1954254]
58012A954254m9403m7279m6106m4619m1789l9922m0982m2687m1682l8248l4774
58001A486763l1841k8893k6757k6331k6295k4869k2625k1382k1507k2178k2867
57990A211218k3042k1875j9749j8368j8094j7194j5040j3684j4551j5895j5639
57979A018087j4606j4689j5647j5980j5534j5079j4567j3771j3540j4485j5469
57968H54720j4985j3258j1624j0742j0562j1040j1844j2281j2253j2258j2001
57957G21872j0564q440p557q467r352q680p068n670m613m023m586n953o407n308
57943F25184m070l656l017j177R47K071K194J656L95r93j307q73j477l256l970
57928F08651k747j920l467n934o941o623o441o398n678m628m048l761l575m296
$$ y = [1954254, 1904851, 1857572, 1811466, 1766847, 1725058, 1685136, 1644154, 1601467, 1559785, 1521537, 1486763, 1454922, 1426029, 1399272, 1372941, 1346646, 1321777, 1299152, 1277770, 1256263, 1234085, 1211218, 1188176, 1166301, 1146552, 1128184, 1110090, 1092896, 1077856, 1064172, 1049621, 1033726, 1018087, 1003481, 988792, 973145, 957165, 941631, 926552, 911985, 898214, 884674, 870189, 854720, 839735, 826477, 814853, 804111, 793549, 782509, 770665, 758384, 746131, 733873, 721872, 711308, 702868, 695311, 686844, 677492, 668812, 661744, 656074, 651461, 647438, 642852, 636899, 630492, 625184, 621114, 617458, 614441, 613264, 614211, 616282, 618476, 620132, 620527, 619534, 618227, 617354, 615877, 612621, 608651, 605904, 603984, 600517, 594583, 587642, 581019, 574578, 568180, 562502, 557874, 553826, 550065, 546490, 542194]
57914E42194o127p514p305o573o613o649n415l530k467k390k774l781n235n644
57900D70177m172k347j961k511k496j934j720j785j875k804m876o362n732m187
57886D25415l718l849k784q32J41lM28J890K950K777K149J867J996K678M011N129
57870D40245N055M288L994L862K563K69j192r74m54j321l570n758o406n160l309
57855D32132k927m726p172q505q866r403j0098r984q921p622o343n041m352m889
57841C33283n809n728m863m669n425n820n070l906l144k716k534l000l988m384
57827B72227l466k062j591k245k728j892k68N01j18n36R88L813N520M915L012
57812B76070R73j097k755k633o24J035M21j562k774k687k062j038M94J540J125
$$ y = [542194, 536067, 528553, 521248, 514675, 508062, 501413, 495998, 492468, 490001, 487611, 484837, 481056, 475821, 470177, 466005, 463658, 461697, 459186, 456690, 454756, 453036, 451251, 449376, 446572, 441696, 435334, 429602, 425415, 421697, 417848, 415064, 414232, 414373, 414370, 414798, 416688, 419638, 422415, 424564, 426431, 428427, 431105, 435116, 440245, 445300, 449588, 453582, 457444, 460007, 460276, 459084, 458110, 457656, 456335, 452765, 447007, 440601, 435441, 432132, 429205, 424479, 417307, 408802, 399936, 390533, 380435, 370451, 361530, 353908, 347565, 342524, 338172, 333283, 327474, 321746, 316883, 312214, 306789, 300969, 295899, 291993, 288849, 286133, 283599, 280599, 276611, 272227, 268761, 266699, 265108, 262863, 260135, 258243, 257975, 258476, 258358, 257822, 258810, 262623, 268143, 273058, 276070, 277043, 275946, 273191, 270558, 269934, 270969, 271390, 269828, 267054, 264367, 262305, 261267, 261761, 263301, 264426]
57797B64426J81L98J656K444K456K741L453L473K480J637J813K517K914K720J873
57782B97182M88o46n95N31J743K418K462J491q63l821n864o407o102n419m080
57767B72518k135o88q63k444l909l771k010j36M69K06M79J448J849J216N72K68
57751B63069r49l397m895l632j232q43l092n905p552p865p144n956n595o721p884
57736A90407p278n476m501m631m407l415k648k177r34Q62J445K29j264j776j649
57721A52787j226oJ746K423J295k26n56J0K55p1k76J71J354L029M502N003M489
57704A74703L517K318P81p19j502j592j561j529j335j499k742m697o230o947p064
57689A43902o267m197j824n34r9O87J604J371K90P2P55L27j867l663l141j085
$$ y = [264426, 264607, 265005, 266661, 269105, 271561, 274302, 277755, 281228, 283708, 285345, 287158, 289675, 292589, 295309, 297182, 297670, 297024, 296429, 296960, 298703, 301121, 303583, 305074, 304211, 300390, 294526, 288119, 282017, 276598, 272518, 270383, 269695, 268832, 266388, 262479, 258708, 256698, 256562, 257031, 257237, 257716, 259164, 261013, 262229, 262801, 263069, 262120, 258723, 253828, 250196, 248964, 248121, 245029, 239124, 231572, 223707, 216563, 210607, 205012, 198291, 190407, 183129, 177653, 173152, 168521, 164114, 160699, 158051, 155874, 154940, 155802, 157247, 157476, 156212, 154436, 152787, 151561, 151555, 153301, 155724, 157019, 156793, 156237, 156247, 156502, 156431, 156155, 156326, 157680, 160709, 165211, 170214, 174703, 178220, 180538, 181319, 180600, 179098, 177506, 175945, 174416, 173081, 171582, 168840, 164143, 157913, 150966, 143902, 137635, 133438, 131614, 131080, 130981, 131668, 133272, 134643, 134933, 135005, 135760, 136087, 134220, 130557, 127416, 126331]
57673A26331O97J629J846J156j08p49l38R8m3J03J050J779J430O80K78k71j341
57656A34227k023j704j411k160l251l488k927k185j326o32j056k464k928j413
57642A05259K81O6j280j606q78q16j718k025r00Q17K201L072L227K517J717J873
57626A11807K728L080K650K309K516K815K925L132L642M580O456R520J2815J5217
57612A86192J7190K0098K3948K7356K9965L3144L7570M1363M1517L6385K6268
57601E20996J2584k541j6417k6656l2419l4743l5540l6013l5776l3684k9666k5368
57589B24757k2509k0997j9277j6277j2412q799o234m837m197l814l636l921m356
57576I3491l944k392r12p53j388j275j14Q12N53m23j316k109l125m065m251l527
$$ y = [126331, 127028, 128657, 130503, 131659, 131551, 130802, 130464, 130562, 130519, 130622, 131672, 133451, 134881, 135561, 135839, 135568, 134227, 132204, 130500, 129089, 126929, 123678, 120190, 117263, 115078, 113752, 113120, 112064, 109600, 106672, 105259, 105540, 105606, 104326, 102720, 101842, 101026, 99308, 97283, 96383, 97200, 99401, 102473, 105700, 108217, 109934, 111807, 114535, 117615, 120265, 122574, 125090, 127905, 130830, 133962, 137604, 142184, 148640, 158160, 170975, 186192, 203382, 223480, 247428, 274784, 304749, 337893, 375463, 416826, 458343, 494728, 520996, 533580, 531039, 514622, 487966, 455547, 420804, 385264, 349251, 313475, 279791, 250125, 224757, 202248, 181251, 161974, 145697, 133285, 124486, 118252, 113415, 109218, 105404, 101768, 97847, 93491, 89547, 87155, 86243, 85490, 84102, 82827, 82713, 83525, 84078, 83655, 82339, 80230, 77105, 73040, 68789, 65262]
57560F5262k562k199k553k804k119p64J01r5p38j188j745k805l792l872l250k700
57544C2177k279j541p12m04l55K15R11L00j852l744l761k599k264l546E184a037
57527f593l712j573k90p42k625m298m062j885N30J510R59k23j602l251m532m217
57511c6606k226k88q1j398k746l065k310j020j43m59j438j433J00J536J427Q44
57495d9306J624L019K522q4j888q28J587K737K366J973J980J347l20j948k440
57480c7659j855r01p6L38K3j150k736l913m094l394k430j628r37l75m80j685l342
57463f6294m083l332j957j246j667k802l885m138l159j426o5K97J49K50O41Q27
57447i1890N68l8q80j672j737o20J094K170J933O52j138l002m186l772j786L48
$$ y = [65262, 62700, 60501, 57948, 55144, 53025, 52261, 52362, 52267, 51529, 50341, 48596, 45791, 41999, 38127, 34877, 32177, 29898, 28357, 27645, 27241, 26886, 27101, 28012, 28312, 26460, 22716, 18955, 16356, 14092, 10546, 5184, -1037, -6593, -10305, -11878, -12168, -12910, -15535, -19833, -23895, -25780, -25250, -23740, -22781, -23004, -24606, -27857, -32389, -36606, -38832, -39120, -39201, -40599, -43345, -46410, -48720, -49740, -49883, -50342, -51780, -53213, -53113, -51577, -50150, -49306, -47682, -44663, -42141, -42225, -44113, -44941, -43354, -40617, -38251, -36278, -34298, -32951, -33271, -35219, -37659, -39514, -40415, -40491, -40153, -40130, -41280, -44016, -47929, -52023, -55417, -57847, -59475, -60412, -60787, -61267, -62952, -66294, -70377, -73709, -75666, -76912, -78579, -81381, -85266, -89404, -92563, -93989, -94054, -93757, -93608, -93358, -92717, -91890, -91322, -91360, -92240, -93912, -95649, -96269, -95175, -93005, -91072, -90420, -91558, -94560, -98746, -102518, -104304, -103956]
57431a03956J179Q21N33Q82J163Q27N34J135K194K438J632J032J629K619K389
57416h2949O55j091j442p47m20r47j363r27n88j857m468o198n477l356k143k632
57400a15950l592l754l245k905l006l055k455j068N37J405J102K66j57q1j16l83
57384a36457l40K12P20P50M96K10j26l65j64L07L26m00j355j930j908j183J16
57367a41091J154J118M68L00L85n26k209k686j263J16j60r81p65l66j393k939
57351a50838k631m20J250R52k25r30j129j150r46q11j233j665r67N71J287O35
57335a58250n4J19L23k34p68l23O44J238J543J954J966R63m93j179p06L62J356
57318a51539J796J344L03l21M2P49R14O58O81J041J186R01M47n7o93j250j250
$$ y = [-103956, -102777, -101956, -101423, -100541, -99378, -98551, -98017, -96882, -94688, -92250, -90618, -89586, -87957, -85338, -82949, -82294, -83385, -84827, -85574, -85994, -86941, -88304, -89231, -89819, -91676, -96144, -102342, -107819, -111175, -113318, -115950, -119542, -123296, -126541, -129446, -132452, -135507, -137962, -139030, -138493, -137088, -135986, -135720, -135877, -135958, -136074, -136457, -136797, -136585, -135865, -135115, -134619, -134409, -134535, -134900, -135064, -134757, -134431, -134831, -136186, -138116, -140024, -141207, -141091, -139937, -138819, -138351, -138051, -137666, -138192, -140401, -143087, -144350, -144234, -144394, -145375, -146140, -146506, -147899, -150838, -153469, -153889, -152639, -151687, -151912, -152842, -153971, -155121, -156067, -156878, -158111, -159776, -160743, -160172, -158885, -158250, -158304, -158185, -157862, -158096, -158864, -159187, -158543, -157305, -155762, -153808, -151842, -150879, -151372, -152551, -153257, -152895, -151539, -149743, -148399, -148096, -148417, -148375, -147626, -146712, -146054, -145373, -144332, -143146, -142245, -141798, -141855, -142548, -143798, -145048]
57301a45048n53M18J061J082P62Q45J838L339M377M590M731N732P641R533J0224
57286h9428R077O656M564M049M741N341N449N862P001Q118Q406Q073d267C831
57271A2968J0880J2443J2605J1370J0138R754R368P983O151N143N257N905O696
57258A26661P503P937P831P682P813P613O473N003M361M845O023P568Q978R190
57244B25481P785O092N706O413P009P572R064J0905J1167R593Q283Q587R207Q596
57230C41460P575P918R490J0646J0880J1327J2701J4220J4823J4457J3847J3778
57218D83122J4766J6679J8463J8893J7817J6250J5235J5110J5726J6548J6516
57207F65125J4811J2171J0563J0919J2041J2395J2183J2602J3688J4270J3834
$$ y = [-145048, -145601, -145183, -144122, -143040, -142278, -141433, -139595, -136256, -131879, -127289, -122558, -116826, -109185, -99652, -89428, -80351, -73695, -69131, -65082, -60341, -55000, -49551, -43689, -36688, -28570, -20164, -12091, -4267, 3831, 12968, 23848, 36291, 48896, 60266, 70404, 80158, 89526, 97509, 103660, 108803, 114060, 119965, 126661, 134164, 142101, 149932, 157614, 165427, 173040, 179513, 184516, 188877, 193722, 199745, 207313, 216291, 225481, 233266, 239358, 245064, 251477, 258486, 266058, 275122, 286027, 297194, 306787, 315070, 323657, 332864, 341460, 349035, 356953, 366443, 377089, 387969, 399296, 411997, 426217, 441040, 455497, 469344, 483122, 497888, 514567, 533030, 551923, 569740, 585990, 601225, 616335, 632061, 648609, 665125, 679936, 692107, 702670, 713589, 725630, 738025, 750208, 762810, 776498, 790768, 804602]
57196H04602J3027J2214J0955R379Q745R650J0713J0175Q276O914P293Q855J0445
57183I31243J1449J1749J1385J0657J0148J0451J1931J4398J6770J7663J6942
57172A074786J6160J6671J7870J8220J7533J6915J6845J6723J6378J6439J7050
57161A261590J7707J8712K1173K4831K7500K7734K6812K6855K8053K9095K9457
57150A539519K9750L0167L0065K9029K7378K5671K4423K4076K4492K4716K3964
57139A833250K2579K1327K0225J8927J7781J7552J8353J9823K1999K4908K7454
57128B064178K8003K6324K4027K2861K3195K4220K4845K4337K2779K0930J9149
57117B324848J6773J3339R954Q250Q120P855O433M322J906j137m336o103n995
$$ y = [804602, 817629, 829843, 840798, 850177, 858922, 868572, 879285, 889460, 897736, 904650, 911943, 920798, 931243, 942692, 954441, 965826, 976483, 986631, 997082, 1009013, 1023411, 1040181, 1057844, 1074786, 1090946, 1107617, 1125487, 1143707, 1161240, 1178155, 1195000, 1211723, 1228101, 1244540, 1261590, 1279297, 1298009, 1319182, 1344013, 1371513, 1399247, 1426059, 1452914, 1480967, 1510062, 1539519, 1569269, 1599436, 1629501, 1658530, 1685908, 1711579, 1736002, 1760078, 1784570, 1809286, 1833250, 1855829, 1877156, 1897381, 1916308, 1934089, 1951641, 1969994, 1989817, 2011816, 2036724, 2064178, 2092181, 2118505, 2142532, 2165393, 2188588, 2212808, 2237653, 2261990, 2284769, 2305699, 2324848, 2341621, 2354960, 2364914, 2373164, 2381284, 2389139, 2395572, 2399894, 2401800, 2400663, 2396327, 2390224, 2384229]
57104B384229n925p727j0613j2562j3388j4693j7119j9517k0938k1838k2862k3792
57092B193255k4434k5399k7087k8681k9227k9255l0384l3505l8057m2924m7211
57081A837091n0262n1939n3244n6038o1658p0047q0274r1451j03123j15464j29379
57070I74212j45793j64389j83825k03653E1323a98540k76981l05258l35239l68984
57060a485002m07109m47689m88840n31337n77862o30470o89501p54512q25538
57051f837860r03760r91472j091110j203972j330028j469129j621953j789802
57043a7239086j974423k178557k405948k660272k944445l261245l613771m004444
57035d0282191m433905m901028n402789n932363o476837p017035p529308p986589
$$ y = [2384229, 2378304, 2370577, 2359964, 2347402, 2334014, 2319321, 2302202, 2282685, 2261747, 2239909, 2217047, 2193255, 2168821, 2143422, 2116335, 2087654, 2058427, 2029172, 1998788, 1965283, 1927226, 1884302, 1837091, 1786829, 1734890, 1681646, 1625608, 1563950, 1493903, 1413629, 1322178, 1219055, 1103591, 974212, 828419, 664030, 480205, 276552, 51323, -198540, -475521, -780779, -1116018, -1485002, -1892111, -2339800, -2828640, -3359977, -3937839, -4568309, -5257810, -6012322, -6837860, -7741620, -8733092, -9824202, -11028174, -12358202, -13827331, -15449284, -17239086, -19213509, -21392066, -23798014, -26458286, -29402731, -32663976, -36277747, -40282191, -44716096, -49617124, -55019913, -60952276, -67429113, -74446148, -81975456, -89962045]
57027h9962045q357063q602921q684831q574704q268245p780396p118099o252741
57019a53601045n126517l698981j996669j21066J790836L617321N277132O723315
57011a47135674P925232Q857917R503806R860440R945071R792072R445975Q955088
57003g2850073Q366602P721896P053343O385119N736149N120787M547583M020119
56995b3898475L540145L108859K725399K386398K088093J827449J600867J403752
56987e217513J232542J085704R61627Q56752c13999C75214O21954N63163N11072
56978B071403M64757M23535L86401L52797L23041K97282K74743K54567K36504
56969E085030K20874K09200K04293K06048K05673J88195J45209Q4491K3966k3383
$$ y = [-89962045, -98319108, -106922029, -115606860, -124181564, -132449809, -140230205, -147348304, -153601045, -158727562, -162426543, -164423212, -164544278, -162753442, -159136121, -153858989, -147135674, -139210442, -130352525, -120848719, -110988279, -101043208, -91251136, -81805161, -72850073, -64483471, -56761575, -49708232, -43323113, -37586964, -32466177, -27918594, -23898475, -20358330, -17249471, -14524072, -12137674, -10049581, -8222132, -6621265, -5217513, -3984971, -2899267, -1937640, -1080888, -313999, 375214, 997168, 1560331, 2071403, 2536160, 2959695, 3346096, 3698893, 4021934, 4319216, 4593959, 4848526, 5085030, 5305904, 5515104, 5719397, 5925445, 6131118, 6319313, 6464522, 6549013, 6572979, 6549596]
56959F549596n6384p9688r6138j06214j10782j11324j08902j04736j00744r8088
56949E576596r6084r3771r1686r1006r1630r2261r2038r1316r1078r2086r4221
56938D559419r6422r7834r9113j01723j05776j09751j12911j16559j21876j27670
56928C469784j31770j33841j35293j36687j36877j34878j31252j27096j22694
56919B279396j17695j12075j06311j00946r6180r1740q7046q1828p6494p1484
56909A337597o6405o0465n3770m7493m2494l8469l4754l1266k8072k4651k0438
56898H89320j5889j2312j0684j1013j2697j4929j6867j8173j9387k1090k2669
56887G13610k2751k1150j9418j8766j8257j6121j2481r457q402q172o654l269
$$ y = [6549596, 6493212, 6413524, 6317386, 6211172, 6100390, 5989066, 5880164, 5775428, 5674684, 5576596, 5480512, 5386741, 5295055, 5204049, 5112419, 5020158, 4928120, 4836804, 4745726, 4653640, 4559419, 4462997, 4365163, 4266050, 4164327, 4058551, 3948800, 3835889, 3719330, 3597454, 3469784, 3338014, 3204173, 3068880, 2932193, 2795316, 2660438, 2529186, 2402090, 2279396, 2161701, 2049626, 1943315, 1842369, 1746189, 1654449, 1567403, 1485575, 1409081, 1337597, 1271192, 1210727, 1156957, 1109464, 1066970, 1028501, 993747, 962481, 934409, 909758, 889320, 873431, 861119, 850435, 839422, 826725, 811796, 794929, 776756, 757369, 736279, 713610, 690859, 669709, 650291, 631525, 613268, 597147, 584666, 575209, 566807, 558635, 551981, 548712]
56875E48712Q00M353P251R718J1328J1158Q774M854P58k478m767o699q820j1189
56861E73753j3427j5011j5529j5077j4374j4184j4411j4068j2432j0041q108p030
56849D20061n998m314k612k139k980l838l685l035k824k729j573Q06L206M680
56835C93026N443N809N411M331L937N379P820R394R643R800J0721J1664J1371
56822D93749R429O405L311J139J72k95r32j278m43J272K578L059L550M655O153
56807E32524Q196J1554J5935J9505K1070K1673K2867K4339K4480K2617J9465J5714
56795G59939J1448O718J868k679o264q050p910o921o156n399l821j444J016L453
56781G35798O445J0217J4378J8639K2929K6875K9954L2048L3174L2734K9756K3809
$$ y = [548712, 549512, 553865, 561116, 570834, 582162, 593320, 602094, 606948, 607706, 605228, 600461, 593762, 584942, 573753, 560326, 545315, 529786, 514709, 500335, 486151, 471740, 457672, 445240, 435199, 427091, 420061, 414063, 409749, 407137, 404998, 402018, 398180, 394495, 391460, 388636, 385907, 384334, 385140, 388346, 393026, 398469, 404278, 409689, 414020, 417957, 423336, 431156, 440550, 450193, 459993, 470714, 482378, 493749, 503178, 509583, 512894, 514033, 514205, 513910, 512978, 511700, 511257, 512529, 515107, 518166, 521716, 526371, 532524, 540720, 552274, 568209, 587714, 608784, 630457, 653324, 677663, 702143, 724760, 744225, 759939, 771387, 778105, 779973, 777294, 771030, 762980, 755070, 748149, 741993, 736594, 732773, 731329, 732345, 735798, 742243, 752460, 766838, 785477, 808406, 835281, 865235, 897283, 930457, 963191, 992947, 1016756]
56769A016756J5201M746n977j4789k0398k3517k5544k6570k5814k3500k0782j7978
56757H31834j4460j0363o743l723p3M659R080J1812J3154J4085J4748J4849J4324
56744H93183J2619Q399J350o542j2862j7297k1010k4108k5433k4713k3198k1835
56732G38553k0218j7864j5274j2954j0441p251m064j882m30J449L926N738N848
56719F65136M570K592j49l842p704j0622j2630j4594j6441j6995j6047j5300j6174
56706E41800j7581j7197j4561j1607j0153j0066j0124r562q311o650n187m584
56694D16217m728m662l840k992l179m268n010m488l099j993j818k186k280j905
56680C69769j620j844k250k390k453k798l117k845k132j554j034j33O14nj835
$$ y = [1016756, 1031957, 1036703, 1030726, 1015937, 995539, 972022, 946478, 919908, 894094, 870594, 849812, 831834, 817374, 807011, 800268, 796545, 796472, 801131, 810211, 822023, 835177, 849262, 864010, 878859, 893183, 905802, 914201, 915551, 909009, 896147, 878850, 857840, 833732, 808299, 783586, 760388, 738553, 718335, 700471, 685197, 672243, 661802, 654551, 650487, 648605, 648175, 649624, 653550, 659288, 665136, 669706, 672298, 672149, 668307, 660603, 649981, 637351, 622757, 606316, 589321, 573274, 557974, 541800, 524219, 507022, 492461, 480854, 470701, 460635, 450511, 440949, 432638, 425988, 420801, 416217, 411489, 406827, 402987, 399995, 396816, 392548, 387538, 383050, 379951, 377958, 376140, 373954, 371674, 369769, 368149, 366305, 364055, 361665, 359212, 356414, 353297, 350452, 348320, 346766, 345732, 345599, 346213, 346208, 344373]
56665C44373l036k453j232j067j784j928j042o7K78K49J99J2l66o22o05n52p29
56648C29628j279k363l847m813m140j915K93R18j72j894l143l475l063k402k000
56633B96333j957j885j470j098j558k987m322m074j775J485L930M478L234J118
56619B89452p11j338o08P45J680J812J628J917L071M747N886N405L425J585J439
56604C20135K682L660L491K701J819O66o11r85Q2J694K739L186L385L011J772
56589C49427M06l79j252l083m930m954l325k310l071m056l453j763o99o26o08
56574C15324m00p88j849k220p81J680L213K942J904J560J995K089J346P28J293
56559C28036K588L195K628J786J454J313Q79N47R64J757J788O66o24p73M82K198
$$ y = [344373, 341337, 338884, 337652, 336585, 334801, 332873, 331831, 331764, 332042, 332291, 332490, 332502, 332136, 331514, 330909, 330357, 329628, 328349, 325986, 322139, 317326, 313186, 311271, 311564, 312482, 312310, 310416, 307273, 303798, 300735, 298333, 296333, 294376, 292491, 291021, 289923, 288365, 285378, 281056, 276982, 275207, 276692, 280622, 285100, 288334, 289452, 288741, 287403, 286795, 287540, 289220, 291032, 292660, 294577, 297648, 302395, 308281, 313686, 317111, 318696, 320135, 322817, 326477, 329968, 332669, 334488, 335154, 334543, 333558, 333640, 335334, 338073, 341259, 344644, 347655, 349427, 349833, 349454, 348202, 345119, 340189, 335235, 331910, 329600, 326529, 322473, 319020, 317257, 316558, 315932, 315324, 314924, 314136, 312287, 310067, 309286, 310966, 314179, 317121, 319025, 320585, 322580, 324669, 326015, 326743, 328036, 330624, 333819, 336447, 338233, 339687, 341000, 341879, 342426, 343390, 345147, 346935, 347601, 346977, 346204, 346686, 348884]
56543C48884L209L072K121Q62m23j426j638r06jk0j112k304k714k336j424P0J892
56526C45806L006K646J502R68J320J585J197P63Q44J037Q47P27J320K266K699
56511C68533K577K556K667K299J559J607L089N114O392O597O005M707L153K702
56497D19557M222O403O904N309L581L321L933M114L772L402K628Q33j298k280
56483D64401j764r18q18j428k251l011l450l248k520j858j633j714j954k264k234
56468D33336j432l78l57j840l708m578m275l470k566j700j301j697k358k387j793
56453C99496j475j872k349k159j449r51r65j019n01O17J515J162n63k454l038
56438C83995k052n48M88J030J379J360P28K3K10J399K431K046J71k091l532l715
$$ y = [348884, 352093, 355165, 357286, 358148, 357725, 356299, 354661, 353755, 353754, 353734, 352622, 350318, 347604, 345268, 343844, 343914, 345806, 348812, 351458, 352960, 353928, 355248, 356833, 358030, 358793, 359637, 360674, 361521, 362248, 363568, 365834, 368533, 371110, 373666, 376333, 378632, 380191, 381798, 384887, 390001, 396393, 402990, 408995, 413702, 416855, 419557, 423779, 430182, 437086, 442395, 445976, 449297, 453230, 457344, 461116, 464518, 467146, 467979, 466681, 464401, 462637, 461719, 460901, 459473, 457222, 454211, 450761, 447513, 444993, 443135, 441502, 439788, 437834, 435570, 433336, 431904, 431526, 431169, 429329, 425621, 421043, 416768, 413298, 410732, 409032, 407731, 406034, 403676, 401289, 399496, 398021, 396149, 393800, 391641, 390192, 389241, 388276, 387257, 386756, 387373, 388888, 390050, 389487, 387033, 383995, 381943, 381395, 381883, 382913, 384292, 385652, 386380, 386403, 386613, 388012, 390443, 392489, 392660, 390569, 387037, 383322]
56422C83322k986j932q90J47J224K093K279J582M65k22K1Q75J547J595J292J105
56406C91517J008O46J14J44J157K514L116K685J986J852K483L573M573M645L180
56391D25193Q41n86m3J438J981J170K75L04Q68J056N52n73k294m215n397n305
56375D15265m463l519k159L8K146K547J171n4L34J446J344m30k547l711l683k691
56359D01034r85P79J729J961K633M170N169M118J715J07Q8M17J44J2P37J306L72
56342D25506j463k248j256M64J871K878L317K505N25j088r00P96K552L454L591
56327D40504L323K839K247J550O13m03p97M2J826L497M172L800L008K410K066
56312D70697J631J163J384K652L935L748K082M79K2K21K98L23L71k94k026l528
$$ y = [383322, 380336, 378404, 377514, 377661, 378885, 380978, 383257, 384839, 385304, 385082, 385103, 385978, 387525, 389120, 390412, 391517, 392525, 393171, 393285, 393429, 394586, 397100, 400216, 402901, 404887, 406739, 409222, 412795, 417368, 422013, 425193, 426034, 425448, 425405, 426843, 428824, 429994, 430269, 430573, 431441, 432497, 433049, 432476, 430182, 425967, 420570, 415265, 410802, 407283, 405124, 405162, 407308, 409855, 411026, 410972, 411306, 412752, 414096, 413666, 411119, 407408, 403725, 401034, 400049, 400828, 402557, 404518, 407151, 411321, 416490, 420608, 422323, 422430, 422518, 422935, 423079, 423091, 423828, 425134, 425506, 424043, 421795, 420539, 421003, 422874, 425752, 429069, 431574, 432099, 431011, 430111, 430907, 433459, 436913, 440504, 443827, 446666, 448913, 450463, 451076, 450673, 449876, 449918, 451744, 455241, 459413, 463213, 466221, 468631, 470697, 472328, 473491, 474875, 477527, 481462, 485210, 487292, 487771, 487793, 488014, 488312, 488635, 489006, 488712, 486686, 483158]
56296D83158l202j395LL2m27l04L74J110J872K789L642M160M422M545M242L154
56280E08175J506J82PR33K015K448K500K945L603L333J948J174K649N482O916
56265E45816N453K422M45Q92K865M090L050P42j41J593L819L571P56j938k548
56250E70887j597l17J013K272K674J889R31Q32J191R86K06l42l15l6J82J33n04
56233E80085j538j849n36J714L234L356K931K894L234L537L716L740L273K228
56219F10019J306J355K263L055L181L155L605M145L873K862K433L540N454O526
56205F56772O017M664L632L369L540L716L968M824O432P951Q392Q145Q786J0874
56191G41082J2896J3272J2471J1923J1671J0804R826J0526J3183J5743J6511J6135
$$ y = [483158, 479956, 478561, 478564, 478596, 478169, 477865, 478239, 479349, 481221, 484010, 487652, 491812, 496234, 500779, 505021, 508175, 509681, 509863, 509870, 510803, 512818, 515266, 517766, 520711, 524314, 527647, 529595, 530769, 533418, 538900, 545816, 551269, 553691, 554136, 555028, 557893, 561983, 565033, 565775, 565634, 567227, 571046, 574617, 575373, 573435, 570887, 569290, 568973, 569986, 572258, 574932, 576821, 577752, 578584, 579775, 580761, 580967, 580625, 580310, 580274, 580456, 580589, 580085, 578547, 576698, 576162, 577876, 581110, 584466, 587397, 590291, 593525, 597062, 600778, 604518, 607791, 610019, 611325, 612680, 614943, 617998, 621179, 624334, 627939, 632084, 635957, 638819, 641252, 644792, 650246, 656772, 662789, 667453, 671085, 674454, 677994, 681710, 685678, 690502, 696934, 704885, 713277, 721422, 730208, 741082, 753978, 767250, 779721, 791644, 803315, 814119, 823945, 834471, 847654, 863397, 879908, 896043]
56179H96043J6028J6103J5352J3739J2272J1582J1352J0896R656P466M840K671
56167A028000J259Q1j274k536l452m267n119n740o196p035q193q713q293q024
56153I60498q643r025p667m987k767j805j407r57o39o30o39n11l87k51k4L7k08
56136I19988q5J178L082M116L519J978N17m06n11O43K952N279O277N617M191L266
56120I61601L502M601N748O469O950P508Q095Q578R084R695J0132J0236J0470
56107A062669J1321J2392J2762J2246J1763J2278J3729J5134J5680J5635J6121
56096A211730J7736J9632K0470K0356K0860K2883K5495K7541K9365L1896L4786
56085A482750L6844L8153M0470M5274N2181N9424O5419O9962P4436Q0690Q9071
$$ y = [896043, 912071, 928174, 943526, 957265, 969537, 981119, 992471, 1003367, 1013023, 1020489, 1025329, 1028000, 1029259, 1029340, 1028066, 1025530, 1022078, 1017811, 1012692, 1006952, 1000756, 993721, 985528, 976815, 968522, 960498, 951855, 942830, 935163, 930176, 927409, 925604, 924197, 923240, 922601, 921971, 921332, 920821, 920434, 920183, 920159, 920196, 919988, 919903, 921081, 924163, 928279, 931798, 933776, 934293, 933887, 933376, 934019, 936971, 942250, 948527, 954144, 958335, 961601, 965103, 969704, 975452, 981921, 988871, 996379, 1004474, 1013052, 1022136, 1031831, 1041963, 1052199, 1062669, 1073990, 1086382, 1099144, 1111390, 1123153, 1135431, 1149160, 1164294, 1179974, 1195609, 1211730, 1229466, 1249098, 1269568, 1289924, 1310784, 1333667, 1359162, 1386703, 1416068, 1447964, 1482750, 1519594, 1557747, 1598217, 1643491, 1695672, 1755096, 1820515, 1890477, 1964913, 2045603, 2134674]
56074B134674R7661J03923J06798J06622J03700R8028R0306Q2094P4756O8798
56064C067360O4163O0197N5257M7286L5395K0764N964o537j5719k2505k8760l5355
56052C247510m1541m6704n2028n9293o8319p6665q1925q3482q2073p8597p3667
56041B503216o7689o1016n4131m7597m1522l5564k9704k4471j9915j5185r945
56030B096477n391k740j374L02K680M964O886Q853J0728J1975J2998J4774J7094
56017B178226J8693J9312K0126K1791K3478K4342K4722K5350K6480K8172L0493
56006B441185L2960L4739L5601L5945L5845L5192L4727L5604L7672L9427L9997
55995B838894M0023M0401M1494M3675M7201N1104N3780N5147N6734N9098O0865
$$ y = [2134674, 2232335, 2336258, 2443056, 2549678, 2653378, 2751406, 2841712, 2923806, 2998562, 3067360, 3131523, 3191720, 3246977, 3294263, 3329658, 3350422, 3356386, 3349849, 3334130, 3311625, 3282865, 3247510, 3205969, 3159265, 3107237, 3047944, 2979625, 2902960, 2821035, 2737553, 2655480, 2576883, 2503216, 2435527, 2374511, 2320380, 2272783, 2231261, 2195697, 2165993, 2141522, 2121607, 2106422, 2096477, 2091086, 2088346, 2086972, 2087274, 2089954, 2094918, 2101804, 2110657, 2121385, 2133360, 2146358, 2161132, 2178226, 2196919, 2216231, 2236357, 2258148, 2281626, 2305968, 2330690, 2356040, 2382520, 2410692, 2441185, 2474145, 2508884, 2544485, 2580430, 2616275, 2651467, 2686194, 2721798, 2759470, 2798897, 2838894, 2878917, 2919318, 2960812, 3004487, 3051688, 3102792, 3156572, 3211719, 3268453, 3327551, 3388416]
55984C388416O1295O2040O4914O9005P1653P1800P1221P2515P6591Q2043Q6723
55973D178216Q9968R3046R6978J00904J03842J07258J13676J22730J31022J36493
55963E274133J40769J46243J52935J59531J65753J72124J78761J85845J94136
55954F770230K03725K13358K22315K31889K43774K57931K73261K89397L06641
55945I012521L25005L44538L65844L89111M13291M37276M61434M87239N15791
55936A2752050N47210N80873O16098O53105O93026P35917P79582Q22280Q65997
55927A9046138R14391R67767J023248J080118J141508J209890J284621J365365
55919B8033046J454145J552066J657780J771811J898837K042638K201899K374209
$$ y = [3388416, 3449711, 3511751, 3576665, 3645670, 3717323, 3789123, 3860344, 3932859, 4009450, 4091493, 4178216, 4268184, 4361230, 4458208, 4559112, 4662954, 4770212, 4883888, 5006618, 5137640, 5274133, 5414902, 5561145, 5714080, 5873611, 6039364, 6211488, 6390249, 6576094, 6770230, 6973955, 7187313, 7409628, 7641517, 7885291, 8143222, 8416483, 8705880, 9012521, 9337526, 9682064, 10047908, 10437019, 10850310, 11287586, 11749020, 12236259, 12752050, 13299260, 13880133, 14496231, 15149336, 15842362, 16578279, 17357861, 18180141, 19046138, 19960529, 20928296, 21951544, 23031662, 24173170, 25383060, 26667681, 28033046, 29487191, 31039257, 32697037, 34468848, 36367685, 38410323, 40612222, 42986431]
55911D2986431K561406K767780K995948L248255L529990L848008M208700M620658
55903G0767176N096859N650863O293105P032704P878231Q833336R897015J1073257
55895A32522546J2375695J3817742J5402173J7120813J8948939K0823258K2621051
55888B53632217K4145424K5083534K4947524K3119951J9114860J2944815N287993
55881C88276318k735204j0024182j5860948j9988751k2486944k3610462k3673947
55874B69895880k2978691k1775969k0264715j8602440j6907848j5259800j3705564
55867A40400853j2272871j0974343r808669q767771p844867p033980o324965n703961
55859G1669426n158136m677229m251862l873178l533631l226802k948059k696391
$$ y = [42986431, 45547837, 48315617, 51311565, 54559820, 58089810, 61937818, 66146518, 70767176, 75864035, 81514898, 87808003, 94840707, 102718938, 111552274, 121449289, 132522546, 144898241, 158715983, 174118156, 191238969, 210187908, 231011166, 253632217, 277777641, 302861175, 327808699, 350928650, 370043510, 382988325, 388276318, 385541114, 375516932, 359655984, 339667233, 317180289, 293569827, 269895880, 246917189, 225141220, 204876505, 186274065, 169366217, 154106417, 140400853, 128127982, 117153639, 107344970, 98577199, 90732332, 83698352, 77373387, 71669426, 66511290, 61834061, 57582199, 53709021, 50175390, 46948588, 44000529, 41304138]
55851D1304138k472809k274968k095993j930702j780064j646597j527999j419108
55843B6155898j318183j227147j146313j072816j004425r41494q84319q31210
55835A7729991p80370p31904o86719o44540o03979n64077n25055m87608m51712
55826A2254027m16415l81148l46968l15572k87343k61663k39155k21799k10312
55817I573652k03499k01366k06603k20902k41112k61275k77631k89757k97785
55808G373722l01124k99830k95005k87343k76762k63716k49414k34731k20129
55799D945668k06622j95279j85641j76162j66461j57665j50267j43242j35851
55790C428478j28788j22651j16574j09537j02016r5230q9442q4078p9048p4922
$$ y = [41304138, 38831329, 36556361, 34460368, 32529666, 30749602, 29103005, 27575006, 26155898, 24837715, 23610568, 22464255, 21391439, 20387014, 19445520, 18561201, 17729991, 16949621, 16217717, 15530998, 14886458, 14282479, 13718402, 13193347, 12705739, 12254027, 11837612, 11456464, 11109496, 10793924, 10506581, 10244918, 10005763, 9783964, 9573652, 9370153, 9168787, 8962184, 8741282, 8500170, 8238895, 7961264, 7671507, 7373722, 7072598, 6772768, 6477763, 6190420, 5913658, 5649942, 5400528, 5165797, 4945668, 4739046, 4543767, 4358126, 4181964, 4015503, 3857838, 3707571, 3564329, 3428478, 3299690, 3177039, 3060465, 2950928, 2848912, 2753682, 2664240, 2580162, 2501114, 2426192]
55780B426192p1916o9505o6933o3639n9537n5424n2664n1750n1371m9675m6317
55769A787461m2618l9799l7984l6857l6390l6477l6468l5670l3936l1520k8776
55758A390966k6358k5094k5022k4959k3741k1685k0009j8956j7545j5359j3430
55747A158808j2702j2561j1804j0453r534r389r390r238r341r701r514q523p838
55734A028820q504r798r909q170n816m385m030l762k903j703o59J63P45M44j556
55719I68977n092q889j1847j3922j5442j6291j6444j6629j7380j7849j6717j4162
55707G98313j1721j0252r386r129j0301j2657j4179j3529j1994j1509j1714j0818
55695F61124q833p861q899j0245r916q249p011o935p416q101r358j1024j1833
$$ y = [2426192, 2354276, 2284771, 2217838, 2154199, 2094662, 2039238, 1986574, 1934824, 1883453, 1833778, 1787461, 1744843, 1705044, 1667060, 1630203, 1593813, 1557336, 1520868, 1485198, 1451262, 1419742, 1390966, 1364608, 1339514, 1314492, 1289533, 1265792, 1244107, 1224098, 1205142, 1187597, 1172238, 1158808, 1146106, 1133545, 1121741, 1111288, 1101754, 1092365, 1082975, 1073737, 1064396, 1054695, 1045181, 1036658, 1028820, 1020316, 1010518, 1000609, 992439, 986623, 982238, 978208, 974446, 971543, 969840, 969181, 969344, 970089, 970533, 968977, 963885, 954996, 943149, 929227, 913785, 897494, 881050, 864421, 847041, 829192, 812475, 798313, 786592, 776340, 766954, 757825, 747524, 734867, 720688, 707159, 695165, 683656, 671942, 661124, 652291, 644430, 635531, 625286, 615370, 607121, 600110, 593175, 585759, 577658, 568300, 557276, 545443]
55682E45443j0849q968q202r309j0666j0007p068l960k834l649m631m475l506
55669D57319k826k952l553m117m646n613p300r135r980r238p504n898n008m726
55655C74823m687m428l393j475N45J650J700J353J062Q01P06J074J557J259J7
55640C72564j197j725k236l498m860n009l974l199l579m472m917m917m943m879
55626C19159m274l248k403j880j236l27J96l57j650k407j699k6R80J15k130m083
55610B94730m638m215l858l814l517k696j827j307r18m12j33n06j290j897k280
55595B61422k820l344k979j256J096K796L211K601J491L41l30q1Q49J461J048
55580B65506K89O98K665M508M203J943J03M24K033K854K122O27r90k826m633n531
$$ y = [545443, 534594, 525626, 517424, 508115, 497449, 487442, 480374, 476414, 473580, 469931, 465300, 460825, 457319, 454493, 451541, 447988, 443871, 439225, 433612, 426312, 417177, 407197, 397959, 390455, 384557, 379549, 374823, 370136, 365708, 362315, 360840, 361385, 363035, 364735, 366088, 367150, 367951, 368657, 369731, 371288, 372547, 372564, 371367, 369642, 367406, 363908, 359048, 354039, 350065, 346866, 343287, 338815, 333898, 328981, 324038, 319159, 314885, 311637, 309234, 307354, 306118, 305791, 305987, 305630, 303980, 301573, 299874, 299848, 300828, 300943, 298813, 294730, 290092, 285877, 282019, 278205, 274688, 271992, 270165, 268858, 267940, 267528, 267395, 266889, 265599, 263702, 261422, 258602, 255258, 252279, 251023, 252119, 254915, 258126, 260727, 262218, 262559, 262229, 262148, 262997, 264458, 265506, 265795, 266493, 269158, 273666, 277869, 279812, 279915, 280339, 282372, 285226, 287348, 287975, 286985, 284159, 279526, 273995]
55564B73995n320n087n749o653o442m946l531l555m917o070n445l062p53l53j652
55549B10460k772k620j995j953k218k021j537j363j311r42p42j391k211j873n58
55534A84953M2q34k053k423k149j776r92N60K074K376J425K91j13K92R64J179
55518A83816O08j20P7J304K366K260J363O93P42J511K807L779L117P97j130p66
55502B03224J099J947O95j388k708k886k301j438j049j754l137m080m238m220
55488A77766m190l463j893n36l19q72j281j213q98o70j020k184l300k954j173
55473A51800K51J40m27NQ35L05j751l591l838k725j094N33J663J722P87k68p45
55456A43602p58q09j143j576j551m53J591L345L597K611J819J952K139J076j328
$$ y = [273995, 268675, 263588, 257839, 251186, 244744, 239798, 236267, 232712, 227795, 221725, 216280, 213218, 212465, 212112, 210460, 207688, 205068, 203073, 201120, 198902, 196881, 195344, 193981, 192670, 191728, 190986, 189595, 187384, 185511, 184953, 184995, 184161, 182108, 179685, 177536, 175760, 174768, 175328, 177402, 179778, 181203, 181494, 181381, 181673, 182637, 183816, 184424, 184304, 184381, 185685, 188051, 190311, 191674, 192367, 193109, 194620, 197427, 201206, 204323, 205120, 203990, 203224, 204323, 206270, 206965, 205577, 202869, 199983, 197682, 196244, 195195, 193441, 190304, 186224, 181986, 177766, 173576, 170113, 168220, 167684, 167365, 166493, 165212, 163999, 163101, 162431, 161411, 159227, 155927, 152973, 151800, 152051, 152191, 151764, 151769, 152604, 152909, 151158, 147567, 143729, 141004, 139910, 140443, 142106, 143828, 144615, 144347, 143602, 142844, 142035, 140892, 139316, 137765, 137312, 138903, 142248, 145845, 148456, 150275, 152227, 154366, 155442, 154114]
55441A54114l694m369k904o41M67j31j142j290r15r38j095n13M39M53n87j270
55425A35984p99r1k09r06j307j032o4J450K666K283K05j899k454j731j011q21
55409A30264q08p46p00n83k84O1M59J178K051K272J412K1j172j878j680k6K413
55392A32254L565K275j23j721k344k650k174k74J801K093Q63J83N12J21j745l411
55376A29225l436k686k524k572j761l17Q32J692K726L514L367K792K794K874J393
55361A37913j815m519m527k257k4P08O59J331L020M555M607K848j6k724m036l539
55345A32184k257j815k520k950j975m31J70j46k14J87J42n55r94p84n53n49k12
55328A16728L45O0j113j480J5K053K762K155J399P84q9q41p69k45j10o2Q01K007
$$ y = [154114, 150420, 146051, 143147, 142506, 142973, 142842, 141700, 140410, 139495, 138557, 137462, 136949, 137388, 137841, 137254, 135984, 135185, 135094, 134885, 133979, 132672, 131640, 131576, 133026, 135692, 137975, 138180, 136281, 133827, 132096, 131085, 130264, 129456, 128710, 128010, 127427, 127143, 127204, 127663, 128841, 130892, 133164, 134576, 134597, 133425, 131547, 129867, 129841, 132254, 135819, 138094, 137971, 136250, 133906, 131256, 129082, 128808, 130609, 132702, 133565, 133748, 134260, 134381, 132636, 129225, 125789, 123103, 120579, 118007, 116246, 115929, 116761, 118453, 121179, 124693, 128060, 130852, 133646, 136520, 137913, 136098, 131579, 127052, 124795, 124771, 125479, 126138, 127469, 130489, 135044, 139651, 142499, 142483, 139759, 135723, 132184, 129927, 128112, 125592, 122642, 120667, 120236, 120406, 120260, 120046, 120233, 120375, 119820, 118826, 118042, 117489, 116940, 116728, 117073, 117133, 116020, 114540, 114555, 116608, 119370, 121525, 122924, 123708, 123619, 122778, 122009, 121764, 121654, 121592, 122393, 124400]
55310A24400K044O37p80j192j050q42j16J257K102J350l15j229q25l3K22J41N18
55293A26289J580K654K853J902K52j466k800l337k708j169J97L66n70j534j551
55278A20958n07R43J953K099J643J010J27j156j985r69J705L701L057M90j787
55263A31282k778k946k546j384j2N68M37N21P62J19j330k025j223p9L43N83J391
55246A21683K199K180J705J461J185M83k4J59p1k028m740n600l521j21K446L548
55230A20944L715L375K569J373J97k56M43J525J394k88j559n78J446J520r15l088
55214A31817k728r62j99p40j087n41L02J101K080K892K627J245k27j159j903k637
55198A29881k675j541K5Q50O66K46M14J279K147K102R56m06j048j245j922k915
$$ y = [124400, 126444, 127081, 126301, 125109, 124059, 123217, 123101, 124358, 126460, 127810, 127495, 126266, 125441, 125408, 125630, 125771, 126289, 127869, 130523, 133376, 135278, 135530, 134064, 131264, 127927, 125219, 124050, 124247, 124613, 124043, 122509, 120958, 120451, 121394, 123347, 125446, 127089, 128099, 128226, 127070, 125085, 124116, 125821, 129522, 132579, 133069, 131282, 128504, 125558, 123012, 121628, 121616, 122184, 122621, 123142, 123904, 124023, 122693, 120668, 119445, 119366, 119709, 120292, 121683, 123882, 126062, 127767, 129228, 130413, 130896, 130872, 131031, 130960, 128932, 124192, 118592, 115071, 114950, 117396, 120944, 124659, 128034, 130603, 131976, 132173, 131917, 132360, 133885, 135279, 134991, 133432, 132854, 134300, 135820, 134905, 131817, 129089, 128127, 127928, 127188, 126101, 125560, 125862, 126963, 129043, 131935, 134562, 135807, 135580, 134421, 132518, 129881, 127206, 125665, 125690, 126540, 127206, 127452, 127866, 129145, 131292, 133394, 134350, 133944, 132896, 131651, 129729, 126814]
55182A26814k891j355M29J161J172J396J689J338O08L09K59m08j417j296N39K854
55166A31201M028L507J653o34j957j301N38J519Q70r6j34K94L83N66J470K392
55150A44299K322J634J236P43q08k776l299j917k93L4p62j657j943j259K70J510
55134A37334J139n02j515q55M09Q71O94Q21J262J168J39j342k353k011j12K185
55118A37332L029J961N87N09J311J539R04L53L47K85l11j180j884k156j644k05
55102A40777J329J577K40j282j361M6J464J561M59o55r86q87j076j457j318n93
55086A37838n2k4J49Q89J442J011L2o16j023j616j741m24J563K130P34p54o78
55069A38860K33L50l97p67l22J28n3n31o48j44Q10J721K011J651J421J911K498
$$ y = [126814, 123923, 122568, 122997, 124158, 125330, 126726, 128415, 129753, 130361, 130670, 130929, 130521, 129104, 127808, 128347, 131201, 135229, 138736, 140389, 139755, 137798, 136497, 137035, 138554, 139424, 139328, 139194, 139488, 139871, 140437, 141907, 144299, 146621, 148255, 149491, 150234, 149426, 146650, 143351, 141434, 141141, 141175, 140413, 138756, 136813, 135554, 135824, 137334, 138473, 137971, 136456, 135601, 136010, 136881, 137575, 138396, 139658, 140826, 140965, 139623, 137270, 135259, 135147, 137332, 140361, 142322, 142909, 143418, 144729, 146268, 147172, 147525, 147872, 148157, 147846, 146666, 144782, 142626, 140982, 140777, 142106, 143683, 143923, 142641, 141280, 141326, 142790, 144351, 144810, 144155, 143169, 142282, 141206, 139749, 138431, 137838, 137786, 137762, 137911, 138800, 140242, 141253, 141285, 140669, 139646, 138030, 136289, 135865, 137428, 139558, 140292, 139538, 138860, 139093, 139443, 139046, 138279, 137957, 138085, 138032, 137501, 136853, 136709, 137519, 139240, 141251, 142902, 144323, 146234, 148732]
55052A48732J959R1j942k934k569j197N24J646J554R31J341L244N080M939K751
55037A64150K01j094q60k3J74p95j999j769K74K352K504R25o15j276j667k052
55021A58430j692n06J84n31j690j954j622j901k761k906j800m55o2n84r95l99
55005A38756J101K385K256P91n49n42N44J640K057J473k92k458l218j831n9M6
54989A42100r18q74J97K71j147k077j332k35O0N81K173L249K060k18r35L76J935
54972A45266K667K978K962K017M05o29o62m82m95k52J82q3j113j656j006j99m84
54955A49416j458j637l91J386K255J581J98k09J133L010L454K066K71o72q66q28
54939A58709n54j61m03j577k527j681J029L913N111M138K108P00P10J429J590
$$ y = [148732, 150691, 150782, 148840, 145906, 143337, 142140, 142664, 144310, 145864, 146795, 148136, 151380, 156460, 161399, 164150, 164351, 163257, 162397, 162374, 162548, 161753, 159754, 157985, 158259, 160611, 163115, 164040, 163425, 162149, 160482, 158430, 156738, 156232, 156416, 155885, 154195, 152241, 150619, 148718, 145957, 143051, 141251, 140796, 140734, 140150, 139155, 138756, 139857, 142242, 144498, 145289, 144740, 144198, 144742, 146382, 148439, 149912, 149620, 147162, 143944, 142113, 142054, 142100, 141182, 140308, 140505, 140776, 139629, 137552, 136220, 135985, 136045, 136626, 138799, 142048, 144108, 143890, 142955, 143331, 145266, 147933, 150911, 153873, 155890, 156295, 155666, 155004, 154522, 154027, 153775, 153957, 153874, 152761, 151105, 150099, 149900, 149416, 147958, 146321, 145930, 147316, 149571, 151152, 151350, 151141, 152274, 155284, 158738, 160804, 161075, 160403, 159537, 158709, 158155, 157994, 157591, 156014, 153487, 151806, 152835, 156748, 161859, 165997, 168105, 168805, 169515, 170944, 172534]
54924A72534Q38k05j089j912k359j543N62K335K154M97m74N93K807M145L537J626
54908A84046k13j303j959k550k831k535k141k290k672k261o46J567L512M417L455
54893A75596N61k399k873o65J537J501J26l64L25O81k8r48j232r57m53J9k8p76
54875A69623j233k05J758K723J916O27J07n4o61j317j181m60J01N30J259J963
54859A75496K090K312L952O764Q651Q198O430N292N254N310M861M464M823N773
54845B49670O441N858L515r6l486n248n272m493l584k660k184k983m832o025n241
54830B19380l276j940j753j782j464j350j856k438k492k154j645o34J041K491
54816B00128K524J200k8K25K001M175N543N722N226M831M778M613L814K578J802
$$ y = [172534, 173372, 173167, 172078, 170166, 167807, 166264, 166826, 169161, 171315, 171812, 171338, 171931, 174738, 178883, 182420, 184046, 183833, 182530, 180571, 178021, 175190, 172655, 170514, 168224, 165552, 163291, 162645, 164212, 167724, 172141, 175596, 176157, 173758, 170885, 170220, 171757, 173258, 173384, 173020, 173345, 174026, 173998, 173050, 171818, 170861, 170408, 170427, 170399, 169623, 168390, 168185, 169943, 172666, 174582, 175209, 175316, 175262, 174601, 173284, 172103, 171643, 171744, 172274, 173533, 175496, 177586, 179898, 183850, 190614, 199265, 207463, 213893, 219185, 224439, 229749, 234610, 239074, 243897, 249670, 256111, 261969, 265484, 265388, 261902, 256654, 251382, 246889, 243305, 240645, 238461, 235478, 230646, 224621, 219380, 216104, 214164, 212411, 210629, 209165, 207815, 205959, 203521, 201029, 198875, 197230, 196596, 197637, 200128, 202652, 203852, 203824, 204049, 206050, 210225, 215768, 221490, 226716, 231547, 236325, 240938, 244752, 247330, 249132]
54801B49132K178L189L264J345j638l498l331k649l305m883n399m379l747n130
54787B21149p480q406p150n206m143l869l258j945r74j499l107l895k590j57J367
54772A68837J351R05R00R67P39P75J382J625O67p06j046k12P28J179J369J290
54756A80750N66m97q72k28N23M67j40l33L74J501K074J529L94j16L91Q78L46n45
54738A87062m77K96J80j140j932r94L81K49j236k287k090j349m95R08K580L020
54722A82676J524l08l71J234K545K510J994J875J585K89j514k535k207p91J486
54707A89992M230O269O482N230L899L039K234J766K794N320P427P550O384N523
54693B58139N233M785M082L525K781J204p71j953k091k090k569l310m148n284
$$ y = [249132, 251310, 254499, 257763, 259108, 257470, 253972, 250641, 247992, 244687, 239804, 234405, 230026, 226279, 221149, 213669, 205263, 198113, 192907, 188764, 184895, 181637, 179692, 178718, 177219, 174112, 170217, 167627, 167470, 168837, 170188, 171093, 171993, 172960, 173699, 174474, 175856, 177481, 178148, 177442, 176396, 176184, 176912, 178091, 179460, 180750, 181316, 180819, 179947, 179719, 180242, 180709, 180569, 180236, 180610, 182111, 184185, 185714, 186108, 185992, 186383, 187261, 187607, 187062, 186585, 186881, 187061, 185921, 183989, 182995, 183376, 183625, 182389, 180102, 178012, 176663, 176168, 177076, 179656, 182676, 184200, 183892, 183521, 184755, 187300, 189810, 191804, 193679, 195264, 195553, 194039, 191504, 189297, 188506, 189992, 194222, 200491, 206973, 212203, 216102, 219141, 221375, 223141, 225935, 231255, 238682, 246232, 252616, 258139, 263372, 268157, 272239, 275764, 278545, 279749, 278978, 277025, 274934, 272844, 270275, 266965, 262817, 257533]
54679B57533o482o927o234m925l759l166l246l584l267j888m49k80j191j815j713
54664B08607j824k582k840j384J380L834M647L687K168J976L861O200O581M825
54650B39136L184L220M008M032L293K453J283o10k443l175l176l697n005o238
54636B36265o691o250m970l342k571l373m743n018l890k274n84J362K955K953
54622A99829J390j54o60q19j385j698q21P60J678J517J040Q76Q42O11L36L31N58
54605B04231O04J05r18k044k734k651j726k18J116J283M5j477j848j005k53l70
54589A92140n51K38J540J932R62l79j118j343j420j049J44J521J839Q57k12k04
54573A94897N17O45l20j464j684r28o1K32N9p6Nr7p71j597j469R3J958K280O00
$$ y = [257533, 251051, 244124, 237890, 232965, 229206, 226040, 222794, 219210, 215943, 214055, 213606, 213326, 212135, 210320, 208607, 206783, 204201, 201361, 199977, 201357, 205191, 209838, 213525, 215693, 217669, 221530, 227730, 234311, 239136, 242320, 245540, 249548, 253580, 256873, 259326, 260609, 259999, 257556, 254381, 251205, 247508, 242503, 236265, 229574, 223324, 218354, 215012, 212441, 209068, 204325, 199307, 195417, 193143, 192559, 193921, 196876, 199829, 201219, 201065, 200405, 199586, 198201, 196503, 195682, 196442, 198120, 199637, 200677, 201553, 202395, 203006, 203342, 203673, 204231, 204835, 204940, 204022, 201978, 199244, 196593, 194867, 194649, 195765, 197048, 197093, 195616, 193768, 192763, 192510, 192140, 191589, 191827, 193367, 195299, 196261, 195882, 194764, 193421, 192001, 190952, 191096, 192617, 194456, 195313, 195101, 194897, 195414, 196059, 195739, 194275, 192591, 191663, 191602, 191834, 191893, 191817, 191822, 191725, 190954, 189357, 187888, 187981, 189939, 192219, 192819]
54554A92819j558k494k265k172k626k403l65K644M366L612J661P65J551K477J895
54539A97907O7j329j255k34O01P62N58M76N83M88l4l92L56K009K874J737l34j230
54521B03610n51K16J50k8L07M70j81r26q43l06k14m86m25j0J89n6o38j482k061
54502A96735j281J028L099K993R77j000j773j644j027Q1J320K078K413K721K641
54487B09361J652O81J464L973N968N625L349O65j407k283j632j04Q82Q17O99J349
54471B31059K196K436K258K145J937J503J289J384J098L13R2Q82J305K59j071
54456B49085r71qlq21o10P89J137q00l183l620k272j088r85j156p10K61J125J526
54438B37696J596J740K030J857O17j091j695n60J022J368M17n29o75l96j92O4
$$ y = [192819, 191261, 188767, 186502, 184330, 181704, 179301, 178936, 181580, 185946, 189558, 191219, 191984, 193535, 196012, 197907, 197974, 196645, 195390, 195156, 195757, 196519, 197077, 197553, 198136, 198624, 198590, 198198, 198554, 200563, 203437, 205174, 204840, 203610, 203059, 203275, 203425, 203397, 203704, 204174, 203993, 203067, 202224, 201918, 201704, 201218, 200793, 200783, 200972, 200916, 200278, 198796, 196735, 195454, 196482, 199581, 202574, 203551, 202551, 200778, 199134, 198107, 198188, 199508, 201586, 203999, 206720, 209361, 211013, 211694, 213158, 217131, 223099, 228724, 232073, 232738, 231331, 229048, 227416, 227312, 228194, 229011, 229710, 231059, 233255, 235691, 237949, 240094, 242031, 243534, 244823, 246207, 247305, 247618, 247710, 248592, 249897, 250156, 249085, 248114, 248106, 248103, 247282, 246672, 247461, 248598, 247798, 244615, 240995, 238723, 237635, 236650, 235494, 234784, 235045, 236170, 237696, 239292, 241032, 243062, 244919, 245536, 244445, 242750, 242190, 243212, 244580, 244997, 244468, 243793, 243397, 243205, 243269]
54422B43269O32J235J428J170Q37Q18J343K410L643M429M441L960L457L019K479
54407B78570J931J709J803J817J611J555J774J654P17l71m78L47P89O3r88j097
54391B91406j69R31J641J903J483Q8j716k534j607J63J073L30j304k462k533k102
54375B84591k097k665l091k771j872q05M40J810K498J555n89k114j665J76J693
54360B75094J916J231M21l02j243k571l940m672m301l064j857j589k410l456l383
54345B45874j430J832M703N657M615K929K059K338L028L298K857J828M62q42j499
54330B77709j132m6R25J137O22j11n75n34j23J12l26j154j365n22M34L77l89o18
54312B74421k01m28j797k792j812N67K430K969K904K768K231J090k85j726l325
$$ y = [243269, 243901, 245136, 246564, 247734, 248571, 249389, 250732, 253142, 256785, 261214, 265655, 269615, 273072, 276091, 278570, 280501, 282210, 284013, 285830, 287441, 288996, 290770, 292424, 293141, 292770, 292292, 292639, 293428, 293491, 292503, 291406, 291237, 292168, 293809, 295712, 297195, 297283, 295567, 293033, 291426, 291589, 292662, 292992, 291688, 289226, 286693, 284591, 282494, 279829, 276738, 273967, 272095, 271290, 271730, 273540, 276038, 277593, 277004, 274890, 273225, 273401, 275094, 277010, 278241, 278662, 278360, 277117, 274546, 270606, 265934, 261633, 258569, 256712, 255123, 252713, 249257, 245874, 244444, 246276, 250979, 256636, 261251, 264180, 266239, 268577, 271605, 274903, 277760, 279588, 280050, 279208, 277709, 276577, 276531, 277456, 278593, 279215, 279104, 278529, 277995, 277872, 277984, 277658, 276504, 275139, 274617, 275051, 275428, 275039, 274421, 274220, 273792, 271995, 269203, 267391, 267958, 270388, 273357, 276261, 279029, 281260, 282350, 282065, 280339, 277014]
54297B77014m455l975k080p25j276k552k427o74R66J265O33k48j480l035l863
54282B53088k963r32N07L81p35j846k714l549m085l648k188p28l97j117j597o86
54266B26791J373L119L271J880K44k74M90J350Q93j003k826k839r29J129J461
54251B34130J21j055n70J051K110J859J174J066J265P87o04k103k958l127k790
54236B30356j851l47J091J707J502J206J341J571J170m9j389j886j227j6Q13Q89
54220B34881O30O05P86O13j59r26q38R0P76K32j208k182j819o99j08o53j852k910
54202B25259l498l660l283k046K1K136L322L424L267L517L692K789P85j143j991
54187B32591j882j419p77j6L27j80j017j216o83k35l55p08r97j486k239k635k211
$$ y = [277014, 272559, 268584, 266504, 265779, 264503, 261951, 259524, 258850, 259816, 261081, 261714, 261466, 259986, 256951, 253088, 250125, 249193, 249700, 250081, 249346, 247500, 244786, 241237, 237152, 233504, 231316, 230588, 230191, 229074, 227477, 226791, 228164, 231283, 234554, 236434, 236678, 236404, 236894, 238244, 239137, 238134, 235308, 232469, 231540, 232669, 234130, 234251, 233196, 232626, 233677, 235787, 237646, 238820, 239886, 241151, 241938, 241334, 239231, 236273, 233146, 230356, 228505, 228158, 229249, 230956, 232458, 233664, 235005, 236576, 237746, 237697, 236308, 234422, 233195, 233179, 233992, 234881, 235511, 236116, 236902, 237515, 237356, 236430, 235592, 235682, 236458, 236690, 235482, 233300, 231481, 230782, 230674, 230021, 228169, 225259, 221761, 218101, 214818, 212772, 212793, 214929, 218251, 221675, 224942, 228459, 232151, 234940, 235725, 234582, 232591, 230709, 229290, 228513, 228497, 228824, 228644, 227627, 226411, 225728, 225493, 225138, 224430, 223433, 221947, 219708, 217073, 214862]
54170B14862j465j131r78j77J222J954J024q96k081j670o14m83j538k377j714
54155B03938p1Q22K53n49qJ824L495L879L008J363o74k419k835j648n3M85Lj62
54137B10651P33K022K878L299L283K132l19k457k374m91Q26M41k07L97J506J415
54121B23735P7j106j474j601j783j488n42L29N25K91qn16j413k368k840k476j195
54104B06147O20J998K244J882J920K161J412k73j060J67J969K242J003j20n18
54089B21794r94j719j625l62P10M30l12J09J529K069O63j618l050l099k365j450
54073B10710o82l98n89m62P29K419L196K707K094K146K158J356M04L51Q58Q61
54057B27858M69O32J133O76q81k062k077j978k684l350k848j619p59j79P91J680
$$ y = [214862, 213397, 212266, 211288, 211111, 212333, 214287, 215311, 214415, 212334, 210664, 210050, 209567, 208029, 205652, 203938, 203867, 204689, 204942, 204393, 204385, 206209, 209704, 213583, 216591, 217954, 217280, 214861, 212026, 210378, 210325, 210810, 210813, 210651, 211384, 213406, 216284, 219583, 222866, 224998, 224679, 222222, 219848, 219357, 220183, 220624, 220417, 220814, 222320, 223735, 223812, 222706, 221232, 219631, 217848, 216360, 215818, 216147, 216672, 216963, 216955, 216439, 215026, 212658, 209818, 207342, 206147, 206767, 208765, 211009, 212891, 214811, 216972, 218384, 218111, 217051, 217218, 219187, 221429, 222432, 222312, 221794, 220800, 219081, 217456, 217094, 217804, 218234, 217922, 218031, 219560, 221629, 222292, 220674, 217624, 214525, 212160, 210710, 210028, 209630, 209041, 208579, 209308, 211727, 214923, 217630, 219724, 221870, 224028, 225384, 225788, 226139, 226997, 227858, 228327, 228959, 230092, 230768, 229887, 227825, 225748, 223770, 221086, 217736, 214888, 213269, 212510, 212331, 213122, 214802]
54041B14802J343Pp45j23R67J511J720K174K505J794N3j471j716j074q19j337
54025B19591j597p79L35M99pJ77J220J853J652J809K943L818L318K172J385M87
54009B38876j035j945r62P53J031n2o35k48r7l97p0P67P15o5M47K570L773K426
53991B45852M02J49J218J705J448J531J921J853J820K874M479N101M651M395M658
53976B84057M572M085M329N615O758O909O585O417O162N605N187N096M654L262
53962C59293J246n66j435p84J253L144L024R42j193k265l183m654n350l822j166
53947C44484M1j095l248n135o494o839n340k632j147k403m936o061n023l303k324
53932B88545k087j960j607r46k5O77N23m24j280j366q66l08L7o1q46j951k313
$$ y = [214802, 216145, 216152, 215407, 215284, 216251, 217762, 219482, 221656, 224161, 225955, 226008, 224537, 222821, 221747, 220928, 219591, 217994, 217215, 217550, 218049, 218042, 218219, 219439, 221292, 222944, 224753, 227696, 231514, 234832, 237004, 238389, 238876, 237841, 235896, 234934, 235687, 236718, 236666, 236031, 235783, 235686, 235289, 235219, 235986, 236701, 236636, 237083, 239653, 243426, 245852, 246254, 246403, 247621, 249326, 250774, 252305, 254226, 256079, 257899, 260773, 265252, 270353, 275004, 279399, 284057, 288629, 292714, 297043, 302658, 309416, 316325, 322910, 329327, 335489, 341094, 346281, 351377, 356031, 359293, 360539, 359973, 358538, 357754, 359007, 362151, 365175, 366117, 364924, 362659, 359476, 354822, 349472, 345650, 344484, 344525, 343430, 340182, 335047, 328553, 321714, 316374, 313742, 312595, 310192, 305256, 299195, 294172, 290869, 288545, 286458, 284498, 282891, 281945, 281920, 282597, 283120, 282696, 281416, 280050, 279184, 278876, 278913, 278852, 278006, 276055, 273742]
53915B73742j425k94l00j325j855r26Q01J971J926R99L6k08L94J189J550J723
53899B77998K352L178L131J959Q47Q39J356J099o3r92p91L38J635K559K915K889
53883C01249L030L709M473M454L551K809L198M350M931M349L701M564O926Q783
53869C64077Q271N893L966L891M746M861M073L809N208P794R902J0205Q955P895
53855D53546Q653J1023J3227J4097J4269J4839J5607J5542J4350J2548J0262P098
53843F05061L245m33l614o858j0366j3167j4095j3031j0939r109q524r262j0201
53830D98707j0010q780p987q403q865p967o202n415o316p661q008p329o608o552
53816C92604p123p774p748o502m310k259j309j511k330l438m735n751n731m467
$$ y = [273742, 272317, 272023, 271723, 270398, 268543, 267617, 268418, 270389, 272315, 273314, 273350, 273142, 273536, 274725, 276275, 277998, 280350, 283528, 286659, 288618, 289465, 290304, 291660, 292759, 292696, 291704, 290913, 291251, 292886, 295445, 298360, 301249, 304279, 307988, 312461, 316915, 320466, 323275, 326473, 330823, 335754, 340103, 343804, 348368, 355294, 364077, 372348, 378241, 382207, 386098, 390844, 395705, 399778, 403587, 408795, 416589, 426491, 436696, 445651, 453546, 462199, 473222, 486449, 500546, 514815, 529654, 545261, 560803, 575153, 587701, 597963, 605061, 608306, 607873, 604259, 597401, 587035, 573868, 559773, 546742, 535803, 526694, 518170, 508908, 498707, 488697, 479917, 471930, 463527, 454662, 446695, 440493, 435078, 428762, 421101, 413093, 405764, 399156, 392604, 385481, 377707, 369959, 363457, 359147, 356888, 355579, 354068, 351738, 348300, 343565, 337814, 332083, 327616]
53802C27616k805j914k149k766k730j690k01R31J381J388J140M47p80k052k769
53787C13047l009l270l308k058Q35M007N470M442J642j658m178m818l434j458
53773C02252o93j378k218k277j915j696j493j101o69q9J117K640L133J940K04
53758B97757n85m50l43n09m24R6Q00J638K527K985K841K793L289L606L140K862
53742C22023L918N460N684M645M029M231M001L208L501N291O384N078K690J376
53728C81519J065N27Q0Q44K103J837q5j455q36O47J252Q01Qj060k670m217m563
53711C75797l609k730l273m901n825m793k588j139j203j701j529j188j772l025
53697C36521l590k981k166j915j615l58J352J823N5k868m557l593r14J300K034
$$ y = [327616, 324811, 322897, 320748, 317982, 315252, 313562, 313361, 314292, 315673, 317061, 318201, 318648, 317868, 315816, 313047, 310038, 306768, 303460, 301402, 302237, 306244, 311714, 316156, 317798, 316140, 311962, 307144, 303710, 302252, 301559, 300181, 297963, 295686, 293771, 292075, 290582, 289481, 288812, 288723, 289840, 292480, 295613, 297553, 297757, 297172, 296722, 296379, 295870, 295446, 295542, 296342, 297980, 300507, 303492, 306333, 309126, 312415, 316021, 319161, 322023, 325941, 331401, 337085, 341730, 345759, 349990, 353991, 357199, 360700, 365991, 372375, 377453, 380143, 381519, 382584, 383111, 383191, 384035, 386138, 387975, 387890, 386435, 385599, 386246, 387498, 388299, 388307, 387247, 384577, 380360, 375797, 372188, 369458, 366185, 361284, 355459, 350666, 348078, 346939, 345736, 344035, 342506, 341318, 339546, 336521, 332931, 329950, 327784, 325869, 324254, 323896, 325248, 327071, 327126, 324258, 319701, 316108, 315194, 316494, 318528]
53682C18528K121K402K267Q95q96j253L90K809M756O064O853O897O353O135O822
53667C71143P844Q205P401N198J443l191o905q234p432n856m380l173k389k058
53653C57616j672q70l91j119k271j912L72K542K516O30j145j604r78J40J428K573
53637C55855L360M025M713M740L288R32n58k75Q57J569J841K316K915L005K624
53622C91207K414K422J794l2k397m073m458l856k772j378K46J497J387l15k363
53607C79323l181k736k351k522k125m77J089J036Ql41k67j511l909m818k750L52
53591C54820J836J742J902K777L106K223R67K50J37N23J554K935L700L119J501
53576C83092j40r52q11l06j6K97J368L072M147L894L356L830M822M802L659K962
$$ y = [318528, 320649, 323051, 325318, 326213, 325317, 324064, 324454, 327263, 332019, 338083, 344936, 351833, 358186, 364321, 371143, 378987, 387192, 394593, 399791, 401234, 398043, 391138, 382904, 375472, 369616, 365236, 362063, 359674, 357616, 355944, 355074, 354683, 353564, 351293, 349381, 349753, 352295, 354811, 355441, 354296, 352692, 351714, 351854, 353282, 355855, 359215, 363240, 367953, 372693, 375981, 376913, 376355, 376080, 376937, 378506, 380347, 382663, 385578, 388583, 391207, 393621, 396043, 397837, 397805, 395408, 391335, 386877, 383021, 380249, 378871, 379117, 380614, 382001, 381686, 379323, 376142, 373406, 371055, 368533, 366408, 365931, 367020, 368056, 368064, 367723, 367456, 365945, 362036, 357218, 354468, 354820, 356656, 358398, 360300, 363077, 366183, 368406, 369373, 369623, 369760, 370283, 371837, 374772, 378472, 381591, 383092, 382952, 382000, 381189, 380883, 380867, 381164, 382532, 385604, 389751, 393645, 397001, 400831, 405653, 410455, 414114, 417076]
53560D17076L653M851N387N349N448N643N258M038K544J598J490J678J314L77
53546D65704k1J005K700L356K374Q18L2N07K012L837M787L934J871L17K47J090
53530D94570J941K503K626K083J341J417K306K565J178j123l177m820o035n877
53516D91498l862j586j237k708l810l285k055j286p19L39J583K121J703Q28rn09
53500D77006l68O21K200L661M332M032L194K453K102K059K333L112M265N267O013
53485E22282P077Q610R608R187Q159Q279R940J1650J1965J1081J0338J0880J2912
53472F51968J5661J7894J9109K0118K1782K3391K3463K2126K1309K2159K3657
53461H82637K4522K5179K6734K8970L0674L1383L1686L2273L3663L6298L9714
$$ y = [417076, 420729, 425580, 430967, 436316, 441764, 447407, 452665, 456703, 459247, 460845, 462335, 464013, 465327, 465704, 465683, 466688, 469388, 472744, 475118, 475936, 475968, 476475, 478487, 482324, 487111, 491045, 492916, 493233, 493480, 494570, 496511, 499014, 501640, 503723, 505064, 506481, 508787, 511352, 512530, 511407, 508230, 503410, 497375, 491498, 487636, 486050, 484813, 482105, 478295, 475010, 472955, 471669, 470950, 471289, 472872, 474993, 476696, 477524, 477515, 477006, 476638, 477259, 479459, 483120, 487452, 491484, 494678, 497131, 499233, 501292, 503625, 506737, 511002, 516269, 522282, 529359, 537969, 547577, 556764, 564923, 573202, 583142, 594792, 606757, 617838, 628176, 639056, 651968, 667629, 685523, 704632, 724750, 746532, 769923, 793386, 815512, 836821, 858980, 882637, 907159, 932338, 959072, 988042, 1018716, 1050099, 1081785, 1114058, 1147721, 1184019, 1223733]
53450A223733M2027M1584L9142L7144L6834L7119L6499L4991L3831L3976L5325
53439A632205L6770L7034L6056L5404L6428L8193L8415L6549L4442L3612L3334
53428B028442L2219L0179K7785K4914K1548J8871J7917J7602J5869J2560R567
53417B257473Q023O974N251L205J719M59j894o083j1571j7089k1554k4632k6670
53404B173611k7956k8330k7868k7544k8353k9951l1183l1869l2928l4603l5904
53393A837122l6228l6256l6552l6376l4715l1670k7994k4235k1064j9473j9570
53382A512989j9867j8893j6767j4240j1126p110l281j124j83J599N216R613J3377
53369A450203J6018J7592J8419J9466K1761K5179K8748L2154L5716L9036M1213
$$ y = [1223733, 1265760, 1307344, 1346486, 1383630, 1420464, 1457583, 1494082, 1529073, 1562904, 1596880, 1632205, 1668975, 1706009, 1742065, 1777469, 1813897, 1852090, 1890505, 1927054, 1961496, 1995108, 2028442, 2060661, 2090840, 2118625, 2143539, 2165087, 2183958, 2201875, 2219477, 2235346, 2247906, 2257473, 2265496, 2272470, 2277721, 2280926, 2282645, 2283104, 2281210, 2275127, 2263556, 2246467, 2224913, 2200281, 2173611, 2145655, 2117325, 2089457, 2061913, 2033560, 2003609, 1972426, 1940557, 1907629, 1873026, 1837122, 1800894, 1764638, 1728086, 1691710, 1656995, 1625325, 1597331, 1573096, 1552032, 1532559, 1512989, 1493122, 1474229, 1457462, 1443222, 1432096, 1424986, 1421705, 1420581, 1420398, 1421997, 1427213, 1436826, 1450203, 1466221, 1483813, 1502232, 1521698, 1543459, 1568638, 1597386, 1629540, 1665256, 1704292, 1745505]
53358A745505M2538M4261M6457M7919M8702N0680N4627N8628O0820O2089O4388
53347B326614O7754P0812P3224P5637P7887P9256Q0295Q2531Q6269R0008R2140
53336C202427R2074Q9969Q6796Q4391Q3876Q3978Q2406P9000P5788P3663P0851
53325D105219O5664N9058N3170M8336M3153L6892L0380K4425J8633J2192N181
53314D502303j486p299j2931j9542k7373l5453m2960n0443n9014o8534p7414q4359
53302D015495q9536r3731r7049r9018r9533r9161r8582r8053r7351r6090r4299
53291B953092r2580r1318q9894q7224q3284p9496p7129p5738p3677p0029o5637
53280B067086o2118o0060n8319n5202n0276m4847m0586l7997l6398l4697l1853
$$ y = [1745505, 1788043, 1832304, 1878761, 1926680, 1975382, 2026062, 2080689, 2139317, 2200137, 2262226, 2326614, 2394368, 2465180, 2538404, 2614041, 2691928, 2771184, 2851479, 2934010, 3020279, 3110287, 3202427, 3294501, 3384470, 3471266, 3555657, 3639533, 3723511, 3805917, 3884917, 3960705, 4034368, 4105219, 4170883, 4229941, 4283111, 4331447, 4374600, 4411492, 4441872, 4466297, 4484930, 4497122, 4502303, 4500817, 4493518, 4480587, 4461045, 4433672, 4398219, 4355259, 4304816, 4245802, 4177268, 4099854, 4015495, 3925959, 3832228, 3735179, 3636161, 3536628, 3437467, 3338885, 3240832, 3143481, 3047391, 2953092, 2860512, 2769194, 2679300, 2592076, 2508792, 2429296, 2352167, 2276429, 2202752, 2132723, 2067086, 2004968, 1944908, 1886589, 1831387, 1781111, 1736264, 1695678, 1657681, 1621283, 1586586, 1554733]
53269A554733k7290k1719j7044j4407j2655r827n956k994j873j219N36L120N356
53256A448761O900Q137R215J0309J2075J4831J7797K0121K2150K4722K7675L0117
53244A652810L1869L3575L5519L7295L8674L9933M1353M2939M4582M5834M5893
53233B090276M4580M3049M2494M2344M0852L7521L3710L0618K7835K4414K0310
53222B478003J6083J1957P952M346J211k137o358j0986j4808j7347j9410k2090
53210B426416k5663k9629l3478l7088m0454m3326m5431m7075m9087n1864n4677
53199A968644n6374n6706n6477n6431n6506n6311n5721n4757n3372n1663n0027
53188A364299m8633m7020m4644m1795l9590l8894l9335l9439l7991l5321l3032
$$ y = [1554733, 1527443, 1505724, 1488680, 1474273, 1461618, 1451791, 1445835, 1442841, 1440968, 1439749, 1440285, 1443405, 1448761, 1455661, 1463798, 1473013, 1483322, 1495397, 1510228, 1528025, 1548146, 1570296, 1595018, 1622693, 1652810, 1684679, 1718254, 1753773, 1791068, 1829742, 1869675, 1911028, 1953967, 1998549, 2044383, 2090276, 2134856, 2177905, 2220399, 2262743, 2303595, 2341116, 2374826, 2405444, 2433279, 2457693, 2478003, 2494086, 2506043, 2513995, 2518341, 2519552, 2517415, 2511057, 2500071, 2485263, 2467916, 2448506, 2426416, 2400753, 2371124, 2337646, 2300558, 2260104, 2216778, 2171347, 2124272, 2075185, 2023321, 1968644, 1912270, 1855564, 1799087, 1742656, 1686150, 1629839, 1574118, 1519361, 1465989, 1414326, 1364299, 1315666, 1268646, 1224002, 1182207, 1142617, 1103723, 1064388, 1024949, 986958, 951637, 918605]
53177I18605l2252l2351l1796k9953k7509k5272k3363k1617j9968j8153j5800
53166F40571j3251j1622j1565j2459j3199j3282j2705j1535j0212r558r679r472
53154E02032q195o858o864p689p496o010n129o085p524p430n851m451m035l878
53140D14537l403l146l758m904n706n752n264m557l780l079k666k620k824l128
53126C59950l457l599l022j286J146K763K304K69j266p21J319K736K033k99k417
53111C56453k916k032j145j110j222k43J722L027K457P11n35n55J07P33R96O56
53095C57104l12j159q42N66J669J351J18o76n07n8j09o07q96n82J9K69ml04k30
53076C54810j90q09j788j943o22J425K817K855J865O99O2j11o98k282l979m189
$$ y = [918605, 886353, 854002, 822206, 792253, 764744, 739472, 716109, 694492, 674524, 656371, 640571, 627320, 615698, 604133, 591674, 578475, 565193, 552488, 540953, 530741, 521183, 511504, 502032, 493837, 486979, 480115, 472426, 464930, 458920, 453791, 447706, 440182, 432752, 426901, 422450, 418415, 414537, 411134, 407988, 404230, 399326, 393620, 387868, 382604, 378047, 374267, 371188, 368522, 365902, 363078, 359950, 356493, 352894, 349872, 348586, 349732, 352495, 354799, 355068, 353802, 353081, 354400, 357136, 359169, 358870, 356453, 353537, 351505, 350360, 349250, 348028, 347785, 349507, 352534, 354991, 355702, 355167, 354612, 354719, 355452, 356448, 357104, 356792, 355633, 354791, 355357, 357026, 358377, 358495, 357819, 357312, 357254, 357145, 356538, 355642, 355060, 355079, 355348, 355344, 355040, 354810, 354620, 353811, 352023, 350080, 349458, 350883, 353700, 356555, 358420, 359119, 359181, 359070, 358372, 356090, 352111, 347922]
53060C47922k738j206p01m36N61J509J095j81o18M5L20o29j919k636l026l385
53044C33977l198k289j570j660j817j251n92p81j338j084j28L26o8m19k11n0m90
53027C17357j194j596j586j173l69K87j48j849l805m963n250n014m127k345j71
53012B84054J373J774J381Q25M40J89n4k23lO57J110N40q92k031k170j903k043
52995B83024k215j382M89K089K200R20o10j209m57R71J693Q75q01j896j887j458
52979B80346j131n34N15J216Q68J12M5M55J37j066j670n48J368K057O93j659l339
52962B77865l465k235m74R59J659J829J849J771J283J80j242k214k087j087l48
52947B74243o17j078k17J791K679R28j837k672j118L83L1j093j150m15n79j887
$$ y = [347922, 345184, 343978, 343277, 342841, 343402, 344911, 346006, 345825, 345207, 345252, 345572, 344943, 343024, 340388, 337362, 333977, 330779, 328490, 326920, 325260, 323443, 322192, 321600, 320819, 319481, 318397, 318269, 318595, 318527, 318108, 317897, 317847, 317357, 316163, 314567, 312981, 311808, 311439, 311726, 311578, 309729, 305924, 300961, 295711, 290697, 286570, 284225, 284054, 285427, 287201, 288582, 289407, 289847, 290036, 289982, 289759, 289756, 290413, 291523, 292063, 291171, 289140, 286970, 285067, 283024, 280809, 279427, 279916, 282005, 284205, 285125, 284515, 283306, 282849, 283820, 285513, 286388, 285587, 283691, 281804, 280346, 279215, 278681, 279196, 280412, 281280, 281392, 281437, 281892, 282029, 280963, 279293, 278745, 280113, 282170, 282863, 281204, 277865, 274400, 272165, 271691, 272650, 274309, 276138, 277987, 279758, 281041, 281221, 279979, 277765, 275678, 274591, 274243, 273626, 272548, 272331, 274122, 276801, 277729, 275892, 273220, 272102, 272485, 272516, 271423, 270273, 269858, 269279, 267392]
52931B67392k670j709J92J400J352O99J32k65o13p79n18R0P17J323K233L335L622
52914B75933K308K64o52MN92l16j958k663k190j482p86M24J810K210J609J502
52898B76609K554L319K261P8j242j021l68l15o47p59p23r94j511j566p13N02J058
52881B76522P43M70Q22R29l41k368l276k507j519j459j546o82N72Q74N6j070k106
52864B64114k976l079k012o89k66k93N03J888K396J891J902K888L133J215j907
52849B68708m235m848l805j411J152J889K47j566j103J111K454J826O81N57J215
52834B62872J595J300N92k42r57j308j159l82J118K783L267J887l6l99J099K629
52818B74659K566J133m76j489j644r76j11l4r71k071k515k349j880j085o9O34
$$ y = [267392, 264722, 263013, 263205, 264605, 265957, 266656, 266788, 266523, 265910, 265131, 264613, 264703, 265420, 266743, 268976, 272311, 275933, 278241, 278505, 277853, 277857, 278449, 278133, 276175, 273512, 271322, 269840, 269054, 269478, 271288, 273498, 275107, 276609, 279163, 282482, 284743, 284821, 283579, 282558, 282190, 281875, 281228, 280469, 279746, 278752, 277241, 275675, 274962, 275464, 276522, 277265, 277735, 278557, 279486, 279145, 276777, 273501, 270994, 269475, 268016, 266470, 265788, 266360, 267234, 267290, 266220, 264114, 261138, 258059, 256047, 255358, 255092, 254799, 255302, 257190, 259586, 261477, 263379, 266267, 269400, 270615, 268708, 264473, 259625, 255820, 254409, 255561, 257450, 257697, 256131, 255028, 256139, 258593, 260419, 261100, 261657, 262872, 264467, 265767, 266359, 266117, 265160, 263852, 262693, 262311, 263429, 266212, 269479, 271366, 271330, 270931, 272030, 274659, 277225, 278358, 277882, 276393, 274749, 273773, 273662, 273628, 272657, 270586, 268071, 265722, 263842, 262757, 262688, 263322]
52802B63322Q67J262K237L099K955J998J278J304J589J344K81j148k075k035j608
52787B74670j759k402k372j089M82J093O67q7p22j095r60m22j34k98j16Q68J610
52770B67934Q98o74j429r59l61l07k90R0L71K16Q8M78J232J911K064J194o92k443
52752B69321k714j742j082j312j244J49K193L481L456K346N43j156j610n93O03
52737B70639O52l16j419k397l335l670k789j320o40j116j784j914j957k466k879
52722B43289k084n4J698J621j8j284p71P47J399N24r13j894k252j989r32N30J455
52705B39072J673K104L261M354M467L545J803o13k662k630n52J051K72j579k092
52690B51474j233p74j244j617j386p48P43L293M962L377m63k796k001l33M2q0
$$ y = [263322, 264189, 265451, 267688, 270787, 273742, 275740, 277018, 278322, 279911, 281255, 281536, 280388, 278313, 276278, 274670, 272911, 270509, 268137, 267048, 267530, 268623, 269290, 269203, 268481, 267386, 266426, 266004, 265870, 265572, 265456, 266324, 267934, 268832, 268158, 266729, 265770, 265409, 265102, 264812, 264902, 265273, 265489, 265577, 266055, 267287, 269198, 271262, 272456, 271764, 269321, 266607, 264865, 263783, 262471, 261227, 261376, 263569, 267050, 270506, 272852, 273395, 272239, 270629, 270036, 270639, 271291, 270975, 269556, 267159, 263824, 260154, 257365, 256045, 255405, 254289, 252505, 250591, 248634, 246168, 243289, 241205, 241151, 242849, 244470, 244452, 243168, 242397, 243144, 244543, 245067, 244154, 242260, 240008, 238019, 237087, 237617, 239072, 240745, 242849, 246110, 250464, 254931, 258476, 260279, 259666, 257004, 254374, 253822, 254873, 255145, 253566, 251474, 250241, 249467, 248223, 246606, 245220, 244472, 245215, 248508, 253470, 256847, 256384, 253588, 251587, 251254, 251296, 251216]
52674B51216O18J224L51j265j957j549p26O99K853M338L840K431K129K836K832
52659B69870J807J074Q57j70k284l777l490k460k064k047j495o46l93p49r72p87
52643B52274n28l51j16P5j02o54j265j732k055k123j737r61k04J34J1k38j29N97
52625B40896J723K736L308L516L517L186K224O57j025k278k887k718j470O94K392
52610B54471J980j41j306J57K341K155j56j242L26J854O88j739k167k09J748K413
52594B61173K642K883K388J350J377K918M205L802K536J793J426N95o17j639k514
52579B84318l334l496k691j756j367q18O97K403K971K556K330K503K385K053K315
52564B91069L114L412K859K136J543O10p11j747k305k786k882j695K94R92n53
$$ y = [251216, 251834, 253058, 253409, 252144, 250187, 248638, 247912, 248611, 251464, 255802, 259642, 262073, 264202, 267038, 269870, 271677, 272751, 273608, 273438, 271154, 267377, 263887, 261427, 259363, 257316, 255821, 255175, 254782, 254033, 253061, 252274, 251746, 251395, 251279, 251354, 251252, 250598, 249333, 247601, 245546, 243423, 241686, 240725, 240521, 240655, 240666, 240428, 240299, 240896, 242619, 245355, 248663, 252179, 255696, 258882, 261106, 261763, 260738, 258460, 255573, 252855, 251385, 252079, 254471, 256451, 256310, 255004, 255161, 257502, 259657, 259501, 258259, 258585, 260439, 261127, 259388, 257221, 257012, 258760, 261173, 263815, 266698, 269086, 270436, 271813, 274731, 278936, 282738, 285274, 287067, 288493, 289088, 288471, 286832, 284318, 280984, 277488, 274797, 273041, 271674, 270856, 271553, 273956, 276927, 279483, 281813, 284316, 286701, 288754, 291069, 294183, 297595, 300454, 302590, 304133, 304743, 304032, 302285, 299980, 297194, 294312, 292617, 292911, 293903, 293350]
52549B93350k597l047k184j625j630j108J89J312J774K013K040J132o48k031k184
52534B84756j777j669j499n62O90J104N25j05k03j33j26M23J985L752M189K735
52518B94085N00q46o54L24R07O79J97P8P1o52k228l421k804o17J177J073j33m41
52500B87295O67J609J014l42p79j26L15lr0P40J526J135J91K34J308J688K36j988
52482B94630k976j991p4J101N04j633l865m504l123r52N03R46R46O84j03r85p20
52465B78388J207L585M629L827K178Q26Q4k56l59l26l70n61o33l79j04k51o75
52448B90810o72R2J129J893K543L422M086L623K056O05K46N67N66M9m47p58j171
52431C08639j441p19J086K618K397N07j593k738k912k519j654m49L70M1j080j533
$$ y = [293350, 290753, 287706, 285522, 283897, 282267, 281159, 281348, 282660, 284434, 286447, 288487, 289619, 288971, 286940, 284756, 282979, 281310, 279811, 279249, 279939, 281043, 281568, 281463, 281260, 281127, 281001, 281424, 283409, 287161, 291350, 294085, 294585, 293739, 293085, 293409, 294316, 294995, 295192, 295270, 295341, 294689, 292461, 289040, 286236, 285619, 286796, 287869, 287736, 287295, 287962, 289571, 290585, 290243, 289464, 289338, 289653, 289650, 289560, 290300, 291826, 292961, 293152, 293386, 294694, 296382, 296618, 294630, 291654, 289663, 289589, 290690, 291194, 289561, 285696, 281192, 278069, 277117, 277620, 278566, 279512, 280196, 280093, 279108, 278388, 279595, 283180, 287809, 291636, 293814, 294640, 294724, 294468, 294109, 293783, 293413, 292852, 292219, 291840, 291736, 291485, 290810, 290138, 290230, 291359, 293252, 295795, 299217, 303303, 306926, 308982, 309587, 309833, 310400, 310966, 311015, 310568, 309810, 308639, 307198, 306479, 307565, 310183, 312580, 313087, 311494, 308756, 305844, 303325, 301671, 301222, 301592, 301633, 300553, 299020]
52415B99020k69K124M024M413L563K267J049K35J27O71J293J528J526J554J444
52400C24569J074R72J540J951Q71j519l273k932j205R4P5q39j809k097j292P5
52384C16255M89q79k799l178j647J29O90K68k37o00j009j286j126o38p6N21Q99
52367C05776M27r39k105k029j110m93l40K12J485K762L467L823M017L647K534
52352C21134J379R60J201J586J969K441K803K891L084L856M972N686N562M652
52338C64176L090J072r45k615m005m996m834l138j052k53q24j279q64m20n57l34
52322C42222J146K851K875Q31j866l781m426l778k081j87R93J653K789M566N871
52307C49678N822M865L987L555L356L195K934K374J611J080Q30K34j098k541l096
$$ y = [299020, 298751, 300875, 304899, 309312, 312875, 315142, 316191, 316426, 316553, 317224, 318517, 320045, 321571, 323125, 324569, 325643, 326615, 328155, 330106, 330977, 329458, 326185, 323253, 322048, 322142, 322217, 321378, 319569, 317472, 316180, 316255, 316744, 315865, 313066, 309888, 308241, 308370, 309060, 309328, 309091, 308491, 307482, 306196, 305070, 304432, 304356, 304877, 305776, 306203, 305264, 303159, 301130, 300020, 299527, 299187, 299399, 300884, 303646, 307113, 310936, 314953, 318600, 321134, 322513, 323473, 324674, 326260, 328229, 330670, 333473, 336364, 339448, 343304, 348276, 353962, 359524, 364176, 367266, 368338, 367393, 364778, 360773, 355777, 350943, 347805, 346753, 346500, 345676, 344397, 343533, 343113, 342556, 342222, 343368, 346219, 349094, 349925, 348059, 344278, 339852, 336074, 333993, 333806, 334799, 336452, 339241, 343807, 349678, 355500, 360365, 364352, 367907, 371263, 374458, 377392, 379766, 381377, 382457, 383287, 383521, 382423, 379882, 376786]
52292C76786k504j233K40J520K059J514L77l94l38L16J301K462L326L265K439
52277C91136J932K492L579M148M115M334N215O042N959N223M966N794P099P875
52263D59909P807P373P086P070P297P796Q524R243R627R392Q331O513M477K902
52249E63347J951J210M04j15J97J330K653L381L022J729L76L4R75K329L029K871
52233E88723K491K510L014L629L719K864J505R00J771L223L608K504J097M95M79
52218F22532L01R7O71K167L699M471M627M716M711M173L390L492N000O707O919
52203F77673N739N133O344Q158Q514P097N360M394M071M051M300M362L455J921
$$ y = [376786, 374282, 373049, 373289, 374809, 376868, 378382, 378759, 378365, 378027, 378343, 379644, 382106, 385432, 388697, 391136, 393068, 395560, 399139, 403287, 407402, 411736, 416951, 422993, 428952, 434175, 439141, 444935, 452034, 459909, 467716, 475089, 482175, 489245, 496542, 504338, 512862, 522105, 531732, 541124, 549455, 555968, 560445, 563347, 565298, 566508, 566912, 566797, 566994, 568324, 570977, 574358, 577380, 579109, 579485, 579519, 580494, 582823, 585852, 588723, 591214, 593724, 596738, 600367, 604086, 606950, 608455, 609355, 611126, 614349, 617957, 620461, 621558, 622053, 622532, 622833, 622930, 623601, 625768, 629467, 633938, 638565, 643281, 647992, 652165, 655555, 659047, 664047, 670754, 677673, 683412, 688545, 694889, 703047, 711561, 718658, 724018, 728412, 732483, 736534, 740834, 745196, 748651, 750572]
$$ [...]
##END NTUPLES=NMR SPECTRUM
##END=
