
##TITLE=AC1104_ROVE100B_5867635_VrXjcWTIYe
##JCAMPDX= 6.0         $$ Bruker NMR JCAMP-DX V2.0
##DATA TYPE= NMR SPECTRUM
##DATA CLASS= NTUPLES
##ORIGIN= BRUKER
##OWNER= Administrator
$$ 1.72 TOPSPIN		Version 2.1
$$ 2012-03-30 19:47:30.140 -0500  Administrator@TOPSPIN
$$ Compression mode = diff/dup
##.OBSERVE FREQUENCY= 400.13188235
##.OBSERVE NUCLEUS= ^1H
##.ACQUISITION MODE= SIMULTANEOUS (DQD)
##.ACQUISITION SCHEME= undefined
##.AVERAGES= 8
##.DIGITISER RES= 22
##SPECTROMETER/DATA SYSTEM= spect
##.PULSE SEQUENCE= zg30
##.SOLVENT NAME= COFFEE_meoh
##.SHIFT REFERENCE= INTERNAL, COFFEE_meoh, 1, 14.98061
##AUDIT TRAIL= $$ (NUMBER, WHEN, WHO, WHERE, PROCESS, VERSION, WHAT)
$$ ##TITLE= Audit trail, TOPSPIN		Version 2.1
$$ ##JCAMPDX= 5.01
$$ ##ORIGIN= Bruker BioSpin GmbH
$$ ##OWNER= Administrator
$$ $$ C:\Bruker\TOPSPIN/data/COFFEE/nmr/AC1104_ROVE100B_5867635_VrXjcWTIYe/10/pdata/1/auditp.txt
$$ ##AUDIT TRAIL=  $$ (NUMBER, WHEN, WHO, WHERE, PROCESS, VERSION, WHAT)
(   1,<2012-03-30 19:47:23.406 -0500>,<Administrator>,<TOPSPIN>,<go>,<TOPSPIN 2.1>,
      <created by zg
	started at 2012-03-30 19:46:16.843 -0500,
	POWCHK enabled, PULCHK disabled,
       configuration hash MD5:
       1A 1E CE 29 27 FD 77 03 67 4E F0 E3 C4 B2 CB 90
       data hash MD5: 64K
       85 A3 1A BC 38 F3 44 FF 70 2B 6D 17 92 BA EE 1F>)
(   2,<2012-03-30 19:47:26.015 -0500>,<Administrator>,<TOPSPIN>,<proc1d>,<TOPSPIN 2.1>,
      <Start of raw data processing
       efp LB = 0 FT_mod = 6 PKNL = 1 PHC0 = 0 PHC1 = 0 SI = 32K 
       data hash MD5: 32K
       56 9A A0 BC 05 0D A7 06 69 47 B7 C6 B0 85 FC 89>)
(   3,<2012-03-30 19:47:26.453 -0500>,<Administrator>,<TOPSPIN>,<proc1d>,<TOPSPIN 2.1>,
      <pk PHC0 = 210.0092 PHC1 = 0 
       data hash MD5: 32K
       73 6A D6 8B AA 0C AF 30 87 ED 85 CD 57 AB 8E 56>)
(   4,<2012-03-30 19:47:26.546 -0500>,<Administrator>,<TOPSPIN>,<proc1d>,<TOPSPIN 2.1>,
      <abs ABSG = 1 
       data hash MD5: 32K
       34 0D EE ED F9 DB 96 3C 28 B5 8D 69 27 B1 32 7D>)
(   5,<2012-03-30 19:47:26.578 -0500>,<Administrator>,<TOPSPIN>,<proc1d>,<TOPSPIN 2.1>,
      <abs ABSG = 2 
       data hash MD5: 32K
       D4 DB BF D3 3C F5 AB 13 A7 FF C3 3B BD 25 C6 3D>)
(   6,<2012-03-30 19:47:26.609 -0500>,<Administrator>,<TOPSPIN>,<proc1d>,<TOPSPIN 2.1>,
      <abs ABSG = 3 
       data hash MD5: 32K
       EC 7A 0D 4E 91 77 C7 01 4A 97 9F E2 5E 6E D5 B3>)
(   7,<2012-03-30 19:47:26.640 -0500>,<Administrator>,<TOPSPIN>,<proc1d>,<TOPSPIN 2.1>,
      <abs ABSG = 4 
       data hash MD5: 32K
       63 54 8D F2 C8 7D E3 15 B5 B2 B4 6F A4 00 91 8B>)
(   8,<2012-03-30 19:47:26.671 -0500>,<Administrator>,<TOPSPIN>,<proc1d>,<TOPSPIN 2.1>,
      <abs ABSG = 5 
       data hash MD5: 32K
       44 52 12 58 DA 4E B2 39 F9 7E 73 14 DC FF DD 48>)
$$ ##END=
$$ 
$$ $$ hash MD5
$$ $$ F4 E4 F0 0D 00 5A DB 23 40 CA B3 83 B2 3E 9A 75
##$RELAX= 
##$RELAX= 
##$RELAX= 
##$RELAX= 
##$RELAX= 
##$RELAX= 
##$RELAX= 
$$ Bruker specific parameters
$$ --------------------------
$$ [...]
150 150 150 150 150 150 150 150
##$TP07= 0
##$TPNAME0= <>
##$TPNAME1= <>
##$TPNAME2= <>
##$TPNAME3= <>
##$TPNAME4= <>
##$TPNAME5= <>
##$TPNAME6= <>
##$TPNAME7= <>
##$TPOAL= (0..7)
0.5 0.5 0.5 0.5 0.5 0.5 0.5 0.5
##$TPOFFS= (0..7)
0 0 0 0 0 0 0 0
##$TUNHIN= 0
##$TUNHOUT= 0
##$TUNXOUT= 0
##$USERA1= <user>
##$USERA2= <user>
##$USERA3= <user>
##$USERA4= <user>
##$USERA5= <user>
##$V9= 5
##$VALIST= <valist>
##$VCLIST= <CCCCCCCCCCCCCCC>
##$VD= 0
##$VDLIST= <DDDDDDDDDDDDDDD>
##$VPLIST= <PPPPPPPPPPPPPPP>
##$VTLIST= <TTTTTTTTTTTTTTT>
##$WBST= 2048
##$WBSW= 25
##$XGAIN= (0..3)
0 0 0 0
##$XL= 0
##$YL= 0
##$YMAX_a= 552569
##$YMIN_a= -670892
##$ZGOPTNS= <>
##$ZL1= 120
##$ZL2= 120
##$ZL3= 120
##$ZL4= 120
##$ABSF1= 14.98061
##$ABSF2= -5.57192
##$ABSG= 5
##$ABSL= 3
##$ALPHA= 0
##$AQORDER= 0
##$ASSFAC= 0
##$ASSFACI= 0
##$ASSFACX= 0
##$ASSWID= 0
##$AUNMP= <proc_prof1d_extract_pilot.lims>
##$AXLEFT= 0
##$AXNAME= <>
##$AXNUC= <1H>
##$AXRIGHT= 0
##$AXTYPE= 0
##$AXUNIT= <>
##$AZFE= 0.1
##$AZFW= 0.1
##$BCFW= 0
##$BC_mod= 0
##$BYTORDP= 0
##$COROFFS= 0
##$CY= 15
##$DATMOD= 1
##$DC= 0
##$DFILT= <>
##$DTYPP= 0
##$F1P= 0
##$F2P= 0
##$FCOR= 0.5
##$FTSIZE= 32768
##$FT_mod= 6
##$GAMMA= 0
##$GB= 0
##$INTBC= 1
##$INTSCL= 1
##$ISEN= 128
##$LB= 0
##$LEV0= 0
##$LPBIN= 0
##$MAXI= 10000
##$MC2= 0
##$MEAN= 0
##$ME_mod= 0
##$MI= 0
##$NCOEF= 0
##$NC_proc= -8
##$NLEV= 6
##$NOISF1= 0
##$NOISF2= 0
##$NSP= 0
##$NTH_PI= 0
##$NZP= 0
##$OFFSET= 14.98061
##$PC= 1
##$PHC0= 210.0092
##$PHC1= 0
##$PH_mod= 1
##$PKNL= yes
##$PPARMOD= 0
##$PPDIAG= 0
##$PPIPTYP= 0
##$PPMPNUM= 2147483647
##$PPRESOL= 1
##$PSCAL= 4
##$PSIGN= 0
##$PYNMP= <proc.py>
##$REVERSE= no
##$SF= 400.13
##$SI= 32768
##$SIGF1= 0
##$SIGF2= 0
##$SINO= 400
##$SIOLD= 32768
##$SPECTYP= <>
##$SREGLST= <1H.CDCl3>
##$SSB= 0
##$STSI= 32768
##$STSR= 0
##$SW_p= 8223.68421052632
##$SYMM= 0
##$S_DEV= 0
##$TDeff= 65536
##$TDoff= 0
##$TI= <>
##$TILT= no
##$TM1= 0
##$TM2= 0
##$TOPLEV= 0
##$USERP1= <user>
##$USERP2= <user>
##$USERP3= <user>
##$USERP4= <user>
##$USERP5= <user>
##$WDW= 1
##$XDIM= 32768
##$YMAX_p= 464501790
##$YMIN_p= -647164
##$CURPLOT= <Network HP LaserJet P1505>
##$CURPRIN= <$Network HP LaserJet P1505>
##$DFORMAT= <normdp>
##$LAYOUT= <+/1D_H.xwp>
##$LFORMAT= <normlp>
##$PFORMAT= <normpl>
##$SURQMSG= 1
$$ End of Bruker specific parameters
$$ ---------------------------------
##NTUPLES= NMR SPECTRUM
##VAR_NAME=  FREQUENCY,     SPECTRUM/REAL,   SPECTRUM/IMAG
##SYMBOL=    X,             R,               I
##VAR_TYPE=  INDEPENDENT,   DEPENDENT,       DEPENDENT
##VAR_FORM=  AFFN,          ASDF,            ASDF
##VAR_DIM=   32768,         32768,           32768
##UNITS=     HZ,            ARBITRARY UNITS, ARBITRARY UNITS
##FACTOR=    0.250966925370066, 1,           1
##FIRST=     8223.43324360095, -36906,       -89269
##LAST=      0,             -5487,           -142263
##MIN=       0,             -647164,         0
##MAX=       8223.43324360095, 464501790,    0
$$ Real data points
##PAGE= N=1
##DATA TABLE= (X++(R..R)), XYDATA
$$ [...]
19530G9653b5453l2590j9547A33170h7253D4963a08215A02244h8963B575L6880
19519C9455a77622k32638b861j67297N1396k704K0780p601r4745c5220A32569
19507A29335b15211j39172E7551b47770H8220a61945A23178a40632E0344P8033
19497A28377i1802J843I7827K58246a8531j20946A05649K51954b38260a14837
19486F0364f3451a7532r2465D04M8658Q6448D5743d0779D8466a36819e5606k75565
19474c31171b3989B56834c97711g3701k06034B21295h1915j7161a4892G9373a73222
19462B24161A02730d2144n1463j9614A72896f8502p647H4334a04785j6751n6947
19451a78483C2520a0922j36934j09389A81696a10197m564M7337A2353a66698A82572
$$ y = [79653, -25453, -58043, -77590, 133170, -87253, 44963, -108215, 102244, -88963, 2575, 39455, -177622, -410260, -2861, -170158, -118762, -121466, -100686, -108287, -203032, -35220, 132569, 129335, -215211, -354383, 57551, -247770, 88220, -161945, 123178, -140632, 50344, 128377, -91802, -89959, 97827, 356073, -18531, -139477, 105649, 357603, -238260, -114837, 60364, -63451, -17532, -109997, 404, 49062, 135510, 45743, -40779, 48466, -136819, -55606, -331171, -23989, 256834, -397711, -73701, -279735, 221295, -81915, -99076, -14892, 79373, -173222, 224161, 102730, -42144, -93607, -113221, 172896, -68502, -76149, 84334, -104785, -121536, -178483, 32520, -10922, -147856, -257245, 181696, -110197, -114761, -67424, 12353, -166698, 182572]
19439a92923O5019H8460i0362j70543J8875A78949a91130j28342F2563J21906
19429A84469g4085O947A71106a29081a3940B57306c23460a42487a4234B91362
19418G8576b8332j40906J6462m232E4666b97601J10425m3298i9398A81334g4516
19406g0059k3078i504l38288A96330A1009K4575J58510a0839I5378c2923m40677
19395d73600C5362N2432a83387n9244k03194a10928A97027B9393J3693k534a72977
19383b31823i5999A40995o312A0408a9028j72353B21847a30935D6084a84305C3004
19371a12899J3463o7942A80532a52043B3900a30706a5049j49014L4534M0607K3675
19360f5247l42047A89667a09785j54012g1125G1418f8795k45296A9533L3467c31135
$$ y = [-192923, -127904, 88460, -90362, -260905, -242030, 178949, -191130, -319472, 62563, 184469, -74085, -67138, 171106, -129081, -13940, 257306, -323460, -142487, -14234, 291362, 78576, -28332, -169238, -152776, -157008, 54666, -297601, -187176, -230474, -99398, 181334, -74516, -70059, -93137, -9504, -347792, 196330, 11009, 35584, 194094, -10839, 95378, -32923, -473600, 35362, 87794, -183387, -242631, -445825, -110928, 197027, 29393, 43086, 40552, -172977, -231823, -95999, 140995, 134683, 10408, -19028, -191381, 221847, -130935, 46084, -184305, 33004, -112899, -99436, -167378, 180532, -152043, 23900, -130706, -15049, -164063, -129529, -88922, -65247, -407294, 189667, -109785, -263797, -71125, 71418, -68795, -314091, 19533, 53000, -331135]
19348a92008N1241B09991h2998j42720N6714N8917n0478k5532m0704c5257n9685
19337i4942k6070B38578c19267N4235B08108a44420f0662J7420q1j5920j5967
19326g5210B05777K20494a76463C58274d652o4886A07135h3569l99786b10380
19315a5699q4159l9232B1019b18589A98517b5913j48804Q492D2838a2267k07842
19304b20109A77071B3459d17209K07412R1336j9341j09788A50938a66855I8059
19293I9103c0345j2400A10695C8162f1083k4823d985l1748B9101M7022J8147c3965
19280B37061h9243r9612e0329j73198A20694b26636B87592f0312B82546a5953
19269c21548j5234B33121A05830M9440c53555a24688A0445i3772H2562L84905
$$ y = [-192008, -140767, 209991, -82998, -225718, -169004, -110087, -160565, -186097, -226801, -35257, -94942, -121012, 238578, -319267, -265032, 208108, -144420, -60662, -43242, -43323, -59243, -75210, 205777, 426271, -176463, 358274, -4652, -69538, 107135, -83569, -483355, -210380, -15699, -99858, -139090, 21019, -218589, 198517, -25913, -174717, -166225, 42838, -12267, -220109, 177071, 23459, -417209, -209797, -118461, -137802, -247590, 150938, -166855, 98059, 99103, -30345, -42745, 110695, 38162, -61083, -85906, -4985, -36733, 29101, 76123, 94270, -33965, 237061, -89243, -188855, -50329, -223527, 120694, -226636, 287592, -60312, 282546, -15953, -321548, -336782, 233121, 105830, 155270, -353555, -124688, 10445, -93772, 82562, 467467]
19259D67467a51192n2737I7983m4553L623d114r591m02940e4260p3018A32700
19247B26351h8145j97616C0626J58690c08677d4863A20991b74621A60454h932
19236c2580m50277J76461A11125b7724a914q4112c5205k49916j1232e0319r1583
19225a41902J6910B06102p4268c21774G658h615C4371Q8101K998K2362Q2418b21783
19212a14916d2519D0725K8471b76095a16403e8039b344B32891b01312G7855d8404
19200I5448h3124d1127A57122E2538i9200j6462d1605I9667b35809L3968I5340
19188c0125m9240l27162a53520B20898a82570A9125J21780f23284b1304F9964
19177e1469k65726B0943J24619a37915A26185b08460r9978f3936p8592o3574A7499
$$ y = [467467, -151192, -203929, 97983, 53430, 57053, -4114, -13705, -416645, -54260, -127278, 132700, 226351, -88145, -285761, 30626, 189316, -308677, -44863, 120991, -274621, 160454, -8932, -32580, -482857, -306396, 111125, -27724, -1914, -86026, -35205, -285121, -296353, -50319, -141902, -124992, 206102, 131834, -321774, 7658, -8615, 34371, 122472, 125470, 147832, 230250, -221783, -114916, -42519, 40725, 69196, -276095, -116403, -58039, -2344, 232891, -201312, 77855, -48404, 95448, -83124, -41127, 157122, 52538, -99200, -115662, -41605, 99667, -235809, -201841, 95340, -30125, -79365, -406527, -153520, 220898, -182570, 19125, 140905, -623284, -21304, 69964, -51469, -317195, 20943, 145562, -137915, 126185, -208460, -308438, -63936, -142528, -206102, 17499]
19165H0569a11745n9685j24711G2243a04555A31558a21178l3609C9738a22582
19154D0416J5811O8880d2873B507K37252e4813l0491A11322l7859a92705j69897
19143c62602R6146B5292a46347H2943l1358J02922b63671B27902a58630f6204
19132c0867l00931D839J8736d4220H2593J00833a22460D5840a44972e9087q5460
19121a44547j96567j42177f8668l11658A77278g8820I0342l8284r691a69327B51494
19109E6277E783a21841c3902A26158l5754J25898L3998J5946a5768m826B9303
19097B32628a99953A55865e0775I9223e6769j37260A82092G4312c12199a37969
19086d7842k05825A9188R0147m9682a80278c0641I6641d9214k3785j42029r9297
$$ y = [80569, -111745, -171430, -296141, 72243, -104555, 131558, -121178, -154787, 39738, -122582, 40416, 56227, 125107, -42873, 2507, 239759, -54813, -85304, 111322, 73463, -192705, -362602, -266456, 25292, -146347, 82943, 51585, 154507, -263671, 227902, -158630, -66204, -30867, -331798, 4839, 23575, -44220, 82593, 183426, -122460, 45840, -144972, -59087, -144547, -341114, -483291, -68668, -380326, 177278, -78820, 90342, 52058, 42367, -169327, 251494, 56277, 5783, -121841, -33902, 126158, 90404, 216302, 250300, 266246, -15768, -20594, 29303, 232628, -199953, 155865, -50775, 99223, -56769, -194029, 182092, 74312, -312199, -137969, -47842, -253667, 19188, 109335, 59653, -180278, -30641, 96641, -49214, -72999, -215028, -314325]
19075c14325f8615K4826j38947h5931C47236a92656D2926d31171J58977P9978
19065a92216j78307E1051a06332A39070l7663b67368l0952B84723A24192R552
19055A33744a31851C13952I2496c06965a1208G452a97547j90298c7804j14668
19045a52472k2830d6888C0884d01908R6756f3725j11253P7723J3956j2710b7813
19033a61394A02913b30988P5467A0632c040k32314F2727O881h8450j35090b5664
19021C6108b15902A83024b34838A40005D18a24728J3618H0053L9603d7690q1624
19010a29314B91014j03301a48137M242A5815L985N1135Q2243i7720r3080d8916
18998c55431j07820A28088a17906l21951a55035p3273H8437B7605J53456E809
$$ y = [-314325, -68615, -43789, -182736, -85931, 347236, -192656, 42926, -431171, -272194, -192216, -370523, 51051, -106332, 139070, 101407, -267368, -298320, 284723, 124192, 133744, -131851, 313952, 92496, -306965, -11208, 7452, -197547, -387845, -37804, -152472, -175302, -46888, 30884, -401908, -305152, -63725, -174978, -97255, -83299, -96009, -27813, -161394, 102913, -230988, -155521, 10632, -3040, -235354, 62727, 69608, -88450, -223540, -25664, 36108, -215902, 183024, -234838, 140005, 418, -124728, -111110, 80053, 119656, -47690, -129314, 291014, 187713, -148137, -143895, 15815, 19800, 70935, 153178, -97720, -190800, -48916, -355431, -463251, 128088, -117906, -439857, -155035, -228308, 88437, 27605, 181061, 5809]
18987A13593c128D53102b94795A2449c7830B5094L8516a32971H2904a41542C08843
18975D0795Q8872a21578B91903d8999a1250r6989q1133h61k31441B67196c4522
18963E3764A8475l752b37371a17523M0888j37486C2988P9006a76821d967j77576
18952a82543B0843e1513b5535B27470I2791D989f4747l8206N0188J7967j49898
18941a84696g2393A6133a18444B39481a8433C6192J71940J65359J28410H3458
18930b166l72485e6561j19283h0573B44934p5744a44594B2577O6673a60562O506
18919a54056M4923L4165k12081A21343b59269D0022K52272B5923Q629a17691k9380
18908a47071B64281e7708B3249K6210J50158E7915b25690O4091h0700k01609a1389
$$ y = [113593, -3128, 453102, -294795, 12449, -37830, 25094, 63610, -132971, 82904, -141542, 308843, 40795, 129667, -121578, 291903, -48999, -11250, -108239, -189372, -861, -232302, 267196, -34522, 53764, 18475, 14723, -237371, -117523, -76635, -214121, 32988, 111994, -176821, -4967, -182543, 20843, -51513, -25535, 227470, 92791, 4989, -64747, -102953, -52765, -34798, -184696, -72393, 16133, -118444, 239481, -18433, 36192, 208132, 373491, 501901, 83458, -2166, -374651, -56561, -175844, -80573, 244934, 169190, -144594, 22577, 89250, -160562, -154056, -109133, -74968, -287049, 121343, -259269, 40022, 292294, 25923, 34552, -117691, -147071, 264281, -57708, 23249, 49459, 199617, 57915, -225690, -161599, -80700, -282309, -11389]
18896A7587K6879N6088d4817j0100a8894j7051h189r8034B29209q73a20190d4513
18883A27703a42987e5447A59207d62044a11055j97560n3365J3627a38730m4513
18873a83243o1895j09077I8747b54572a10525k13647P2321c0861C62446a84862
18862h8501m5620A62324g142A54489D5353d23319B13977F0952a14784b3539l24043
18851c47582c0293A41125Q3411a18840E6769a23444k60033D3499A7599f7058o474
18840g3532A98717a05269l58014a58086G8297j0330a08602A26660E851a0359l01371
18829c11730M9227N4851b3811j76285c022n2849A00141a24602A9413O6735a46902
18817c66398i5695B44457a09359m7978A5163a98306F9675i6745o9106L9157F1386
$$ y = [17587, 44466, 100554, -44817, -54917, -18894, -35945, -8189, -106223, 229209, 228336, -120190, -44513, 127703, -142987, -55447, 159207, -462044, -111055, -308615, -361980, -348353, -138730, -183243, -245138, -354215, 98747, -254572, -110525, -324172, -251851, -30861, 362446, -184862, -88501, -134121, 162324, -7142, 154489, 45353, -423319, 213977, 60952, -114784, -23539, -347582, -30293, 141125, 224536, -118840, 56769, -123444, -383477, 43499, 17599, -67058, -73532, 198717, -105269, -463283, -158086, 78297, 67967, -108602, 126660, 5851, -10359, -311730, -262503, -207652, -23811, -200096, -3022, -55871, 100141, -124602, 19413, 86148, -146902, -366398, -95695, 244457, -109359, -157337, 15163, -198306, 69675, -96745, -165851, -126694, 61386]
18805h8553A89095G6037h7361B91365H1047C4461N22641a841A07590A1155b96322
18793A28087g5624B1598a46043K291k12032a00079M5391C07964a05131a8879l25947
18782c44826M6699J9090c9451a4150C89000e387l09457a52414d6650K1087j62734
18771a88297r263j0908M5412j78552d2741K0862H3436b9710k82743A83821f2364
18759i5542d4455j89539j62974c6779I4728a3752k1022A68138F7295C3007a077
18747G3700J44843b16849A5963P334b05118C1924e0558m3182k81129a65299l6696
18736b01995G9937A9909b47287a04541B24946i0958F6941a20238I7173a02610
18725a53447A42466F7184b34916B17574C6003h926j62343B23385i6356B37894
$$ y = [-88553, 189095, 76037, -87361, 291365, 81047, 34461, 557102, -1841, 107590, 11155, -296322, 128087, -75624, 21598, -146043, -143752, -355784, -100079, -54688, 307964, -105131, -18879, -344826, -298127, -279037, -39451, -14150, 389000, -5387, -314844, -152414, -46650, -25563, -188297, -197560, -208468, -163056, -341608, -42741, -21879, 83436, -29710, -312453, 183821, -62364, -95542, -44455, -233994, -396968, -36779, 94728, -13752, -34774, 168138, 67295, 33007, -1077, 73700, 218543, -216849, 15963, 23297, -205118, 31924, -50558, -93740, -374869, -165299, -201995, 79937, 19909, -247287, -104541, 224946, -90958, 66941, -120238, 97173, -102610, -153447, 142466, 67184, -234916, 217574, 36003, -8926, -171269, 223385, -96356, 237894]
18714c08985a33207A33854g6924k5592A60833a42228D2396B0312b78051A53202
18703A89457n4329c83743J40399g9912J9749j61392M0047d2090j19325P1472j29478
18692b19421I5607c27773C88614b10278A12026b89490J30371E24785b14143G6877
18681f5270a686j37350A20745b07877N8520A08598h4807E681K67280E4873L6965
18670I1838a30399E5004a05475b5114l09389c5203A1754a61040B75516b3479n5106
18659g8585m5475l6338P7094m4670o3386A5445i5985j78715J17743L8814A30092
18647B53764e1580J2008l76889F3314e9421l3483k21452f1134j9481j63927D4798
18635G5959A1685h0736c9393J0417R859I3816b29130n4593Q2840b8611j21892
$$ y = [-308985, -133207, 133854, -76924, -102516, 160833, -142228, 42396, 20312, -278051, 153202, 189457, 135128, -383743, -243344, -79912, -60163, -221555, -181508, -42090, -161415, -89943, -219421, 95607, -327773, 388614, -210278, 112026, -289490, -159119, 524785, -214143, 76877, -65270, -1686, -139036, 120745, -207877, -149357, 108598, -84807, 5681, 272961, 54873, 91838, -130399, 55004, -105475, -25114, -334503, -35203, 11754, -161040, 275516, -23479, -78585, -124060, -160398, -83304, -127974, -191360, 15445, -95985, -274700, -156957, -118143, 130092, 253764, -51580, -39572, -416461, 63314, -59421, -92904, -314356, -61134, -80615, -244542, 44798, 75959, 11685, -80736, -39393, -28976, -19117, 93816, -229130, -283723, -200883, -28611, -150503]
18624a50503f9990C00252h5455A98549h2753o6106f3838C42988j64012J22294
18614C01270h6572H8563d00916a44240d9810J4203A96388e2268B19987C6413a19749
18602a18854E1167K9310a88878A04532B1988M27312d25802a68447a2209H6781
18591b21276A62661a16371Q169A17324i2934o0014I3195b82934a17412A4095g9327
18579A69296a03334o438j69578b2301G6019b39349g1140j1755j2772A56479b3600
18567C78005b56833H1483a79155P1338B64281b68136E348i6121j17474j0477l2852
18556b56924d6523l49851e012j60745e0999A85682A6200a67755j8556j17024c3211
18544c9124k58396a13486J8444l10819c8656H6402O324N8367m0786J0792K06447
$$ y = [-150503, -69990, 300252, -85455, 198549, -82753, -148859, -63838, 342988, 178976, 301270, -86572, 88563, -400916, -144240, -49810, -35607, 196388, -52268, 219987, 36413, -119749, -118854, 51167, 80477, -188878, 104532, 21988, 449300, -425802, -168447, -12209, 86781, -221276, 162661, -116371, -108202, 117324, -92934, -152948, 93195, -282934, -117412, 14095, -79327, 169296, -103334, -109772, -279350, -22301, 76019, -239349, -71140, -82895, -95667, 156479, -23600, 378005, -256833, 81483, -179155, -107817, 264281, -268136, 5348, -96121, -213595, -224072, -256924, -46523, -396374, -5012, -165757, -50999, 185682, 16200, -167755, -186311, -303335, -33211, -39124, -297520, -113486, -95042, -405861, -38656, 86402, 92726, 151093, 110307, 121099, 327546]
18533C27546j48740a15215l73673a86491m1474C1170J23912c84144a61129E508
18522c66024D1688J56505G7025b20244B26508l7148n4592k8525B1589J90086G6528
18510b25442m2763B07151e5289l70014a62060l3776K1047A79458P4726d64637
18499B61147b07688f6651j89588L2905R6265L5840D2267b32377K4766R8859k1030
18488a29782r0376L9670j2926b5925F7358J26930a7270r6108I0524K54995b21993
18476H5786b07435o5522K4757m7833n6860A2854a83497C98120a08377q676p2329
18465a89382A53438c8202M843i4j54813L2185J0496C3869f5565C4581a11217n057
18453a16274C1796K2546c5888l66219a69604C7455Q7707b17680I2320a31489j65165
$$ y = [327546, 178806, -115215, -488888, -186491, -227965, 31170, 155082, -384144, -161129, 5508, -366024, 41688, 198193, 77025, -220244, 226508, 189360, 134768, 106243, 21589, 211675, 76528, -225442, -268205, 207151, -55289, -425303, -162060, -195836, -174789, 179458, 254184, -464637, 261147, -207688, -66651, -256239, -223334, -127069, -91229, 42267, -232377, -207611, -108752, -129782, -220158, -180488, -193414, -25925, 67358, 194288, -17270, -113378, 90524, 345519, -221993, 85786, -207435, -272957, -248200, -296033, -352893, 12854, -183497, 398120, -108377, -117053, -189382, 153438, -38202, -33359, -94, -154907, -122722, -112226, 33869, -65565, 34581, -111217, -116274, 31796, 54342, -35888, -402107, -169604, 37455, 125162, -217680, 92320, -131489, -296654]
18442b96654B36039d3290p6966e699l48859J55593E1630K47978a56768A88350
18431b85914B68411a31012A15996h6836B1159J9939a05781O394H8282g8368c1296
18419b4278n1873E6825g2948r2088A20553n7456a31064R941j49661A01167a10194
18407a82951M5364K4100C4745J673a66244N6691j08735R9219j67631k7044C4606
18395a53214J6530c0819p1041k06089B9308b57753J248A15805b5382k15787G6010
18383C0972c08321d0185k70486A62363a39698l32931i4285A21397K14727a12050
18372H8767c32824B01732I2926C2468P3859b45742A0178O1346b11016I4117a63112
18360c05726A35933g7888Q618o6258A5756a68227P4554H0496L10442j86001e792
$$ y = [-296654, 236039, -43290, -120256, -5699, -354558, -198965, 51630, 299608, -156768, 188350, -285914, 268411, -131012, 115996, -86836, 21159, 41098, -105781, -99387, 88282, -78368, -31296, -24278, -76151, 56825, -72948, -165036, 120553, 63097, -131064, -121123, -270784, 101167, -110194, -182951, -137587, -113487, 34745, 36418, -166244, -109553, -218288, -119069, -286700, -313744, 34606, -153214, -136684, -30819, -101860, -307949, 29308, -257753, -256505, 115805, -25382, -241169, 76010, 30972, -308321, -40185, -310671, 162363, -139698, -472629, -94285, 121397, 336124, -112050, 88767, -332824, 201732, 92926, 32468, 106327, -245742, 10178, 71524, -211016, 94117, -163112, -305726, 135933, -77888, -69270, -135528, 15756, -168227, -93673, 80496, 390938, 204937, -5792]
18348b08656B24557E6849b96181J02068D9945b84804J32435N1146A9800a59238
18337D2021J86471a14916G3602Q3542A1221J9632L3498J8508J35347I9435d206
18325c1683A94696g3218A55809o4529c01457h4488q3041A45951b64931H4729A1737
18313d8726k50413N9322J01570A22522a52663J6302E7345h6179D3663L3766J4037
18302I1466K77409g2026j70929e2119C19722F6507K39073E7132a57282A47805
18291F5430a51255f9020C224L970c87197a72026A38858c3916F4637b15349a06217
18279C6416f292r218k07917A04194A7531P9170L63337b708k07911G8792Q3548
18268A62340K00798A8583a22133A08645a95956j41737A48918d2552j38185k92027
$$ y = [-208656, 224557, 56849, -296181, -194113, 49945, -284804, -152369, -101223, 19800, -159238, 42021, 228492, -114916, 73602, 157144, 11221, 30853, 64351, 82859, 218206, 99435, -4206, -31683, 194696, -73218, 155809, 91280, -301457, -84488, -167529, 145951, -264931, 84729, 11737, -48726, -299139, -239817, -138247, 122522, -152663, -136361, 57345, -86179, 43663, 77429, 91466, 368875, -72026, -242955, -52119, 319722, 66507, 305580, 57132, -157282, 147805, 65430, -151255, -69020, 3224, 7194, -387197, -172026, 138858, -33916, 64637, -215349, -106217, 36416, -6292, -15510, -223427, 104194, 17531, 96701, 460038, -2708, -210619, 78792, 162340, 363138, 18583, -122133, 108645, -195956, -337693, 148918, -42552, -180737, -472764]
18258d72764c6148A4834a57908j9279H2694a31381B976b61341M5769j24274A5574
18246a09228M0614n1946N5353G9190N4184a70969L7213k76443I0446a39455B61467
18234A35281n4481L3944a79599C30944f6191l56488a43661J6582l16783i3345
18223a03503A44843a78980a0571A9868a7166B04291J60599B0927a41096o2195
18213b03291E9879a59033n2940I9166i3317A94956c8294j47223M4582B97947d7538
18201a1287B26757J28424a30474p4439A85381a7659j642A7771a60039B84290b8425
18189g0599K8910A04462l6428a94632l2717L8997B06604a07236k11734R6062A36721
18177A09931c99877A69647k5890j7599J64601a12236B9254M732P532a34268M7094
$$ y = [-472764, -36148, 14834, -157908, -177187, 82694, -131381, 2976, -261341, -215572, -339846, 15574, -109228, -68614, -120560, -65207, 79190, 133374, -170969, -133756, -410199, 90446, -139455, 261467, 135281, 80800, 114744, -179599, 330944, -66191, -422679, -143661, -127079, -443862, -93345, -103503, 144843, -178980, -10571, 19868, -17166, 204291, 364890, 20927, -141096, -203291, 59879, -159033, -211973, 99166, -93317, 194956, -38294, -185517, -140935, 297947, -47538, -11287, 226757, 355181, -130474, -204913, 185381, -17659, -19301, 17771, -160039, 284290, -28425, -70599, -41689, 104462, 68034, -194632, -227349, -188352, 206604, -107236, -318970, -222908, 136721, 109931, -399877, 169647, 143757, 126158, 290759, -112236, 29254, 33986, 41518, -134268, -87174]
18166h7174o2021q7887j18961J60358A78229D701c00570R2344R9542C25995A23801
18154C05864j29955a27862k30690H4512B2395L35753a29032l6459J9491A73877
18143a01788C50810a64543j93248B85870b86739q6198A408a69244A22004n5889
18133F6115d9017m07872A7492a93706B40274k9326a2115j27868A14889a7421j70269
18122a87690r8478B76073A7167L0366b15101I9028R1666b4236G9156b9853D7313
18110B65945o7409b3602r5495A08742g0086k07878A005b76546j68913C37457b3812
18098d36214Q3633B9631a59911p3735A7695M1833c21034A842Q9419b98486a6955
18086d1369j23547r0222J7741B9732P4423J1761J05833a89020a8659k58188A66994
$$ y = [-87174, -149195, -237082, -356043, -195685, 178229, 4701, -300570, -208226, -108684, 325995, 123801, 305864, 175909, -127862, -358552, 84512, 22395, 358148, -129032, -165491, -146000, 173877, -101788, 350810, -164543, -357791, 285870, -286739, -372937, 1408, -169244, 122004, 66115, -49017, -456889, 17492, -193706, 240274, 210948, -12115, -139983, 114889, -17421, -187690, -286168, 276073, 17167, 47533, -215101, 99028, 190694, -24236, 79156, -29853, 47313, 265945, 198536, -23602, -119097, 108742, -70086, -277964, 1005, -276546, -445459, 337457, -23812, -436214, -352581, 29631, -159911, -233646, 17695, 59528, -321034, 1842, 91261, -298486, -16955, -41369, -164916, -255138, -237397, 29732, 104155, 115916, 221749, -189020, -18659, -276847, 166994]
18074B22719g7194k41737e6814F2947L38276e2247A10894M5362e2022j05940B15230
18062e2399j67571n6035B44439A16205c0600B22755a71450E1642a22248k70322
18052c92570C5720c92073D1138J23906b86970A23082A956J35768B4734K18348
18042B43082a45201l19764A4573J27582E0832e25476K41123d9490A0295J52222
18032A62517C7284a49357L4511b9693C978b41639B28525G5015a98607g3747B7098
18020E4804A0503a21374D6118J85950M4050i4425l3596f0326O219F2024q419F960
18007A5768c3607D2065O5665J07075a49493B17631G2901e7524B12432a46940A71196
17995B5576L9381i7885q3731c5318j98493J33A07422b00337A26923E7910K1928
$$ y = [222719, -77194, -318931, -56814, 62947, 401223, -52247, 110894, 156256, -52022, -157962, 215230, -52399, -219970, -276005, 244439, 116205, -30600, 222755, -171450, 51642, -122248, -392570, 35720, -392073, 41138, 165044, -286970, 123082, 1956, 137724, 24734, 243082, -145201, -464965, 14573, 142155, 50832, -525476, -284353, -49490, 10295, 162517, 37284, -149357, -114846, -29693, 3978, -241639, 228525, 75015, -198607, -73747, 27098, 54804, 10503, -121374, 46118, 232068, 276118, -94425, -128021, -60326, -54107, 62024, 53605, 6960, 15768, -33607, 42065, 107730, 214805, -149493, 217631, 72901, -57524, 212432, -146940, 171196, 25576, 64957, -97885, -181616, -35318, -233811, -233678, 107422, -200337, 126923, 57910, 79838]
17984G9838a61477E7424a8349B1182K7290a04247k1368A49722J2176G8005e9776
17972A46501J13389a82324f4746k53904a52976C67994i248H9138b47520i4709
17961c48575a19883C57430A5756K42255c9398l6271j52870N8284A09031d8826
17950b87460a40576B54316H1681p036c1900n0016A81634L4780M1897a19570C01061
17938B15257H3185b48518a0117j03521d6936k14547f4087C4519h318C3808L89037
17927D22845A9695c38052C1829P6584d72153A58543b30071j15042c9671A45276
17916a1706m5165I3097l158a0502H1621e4485E9846J7566d0829j11571D8002e7506
17903b9879j22261e2997q1702j1496j808c8908D20564A32540a42651B48779a25595
$$ y = [79838, -161477, 57424, -18349, 21182, 48472, -104247, -125615, 149722, 161898, 78005, -59776, 146501, 259890, -182324, -64746, -318650, -152976, 367994, -9248, 89138, -247520, -94709, -348575, -119883, 357430, 15756, 258011, -39398, -75669, -228539, -170255, 109031, -48826, -287460, -140576, 254316, 81681, 74645, -31900, -81916, 181634, 216414, 258311, -119570, 301061, 215257, 83185, -248518, -10117, -113638, -46936, -261483, -64087, 34519, -8318, 33808, 422845, 19695, -338052, 31829, 108413, -472153, 158543, -230071, -345113, -39671, 145276, -11706, -56871, 93097, 89939, -10502, 81621, -54485, 59846, 77412, -40829, -152400, 48002, -57506, -29879, -152140, -52997, -134699, -146195, -148003, -38908, 420564, 132540, -142651, 248779, -125595]
17891B16895L9423b47199h7668o2994E6157L11350i1813j54739d7276A19591K200
17880A21791B8228J89904i3049A39299l9422i875B72989f3325K2593A12102O1382
17869A73484b03440f6422o3661i316B7790a77101g3655L6422F0039c80977A68169
17857a6258k22268b941p8771c1824A1851J7593i2808I0065O6562n156A7996o313
17845A1683a12201J0892j04337B43312c37292B48013K433B1105a47305n6207B61031
17833a26626A7686a2018H8777h7448D5986a0717k20789B53880j24071b89857N3394
17822b36463f3292A98726a67599E5619M5233O6673A9697g8955B95813j22831i9978
17810d7260a6582j74582A60174i3540F8325J74530a6512A27097A8261J5926j2749
$$ y = [216895, 256318, -247199, -87668, -150662, 56157, 367507, -91813, -246552, -47276, 119591, 121791, 28228, 218132, -93049, 139299, 99877, -9875, 272989, -63325, -40732, 112102, 173484, -203440, -66422, -130083, -9316, 27790, -177101, -73655, -37233, 60039, -380977, 168169, -16258, -238526, -2941, -81712, -31824, 11851, 29444, -92808, 90065, 156627, 151471, 17996, 11683, -112201, -101309, -205646, 243312, -337292, 248013, 250446, 21105, -147305, -203512, 261031, -126626, 17686, -12018, 88777, -87448, 45986, -10717, -231506, 253880, 129809, -289857, -236463, -63292, 198726, -167599, 55619, 100852, 167525, 19697, -78955, 295813, 172982, -99978, -47260, -16582, -191164, 160174, -93540, 68325, 242855, -16512, 127097, 18261, 34187, 21438]
17799B1438O8924a26335C39856a89216I7530D4720R3852m8825M6722a21829L8400
17788h3429k82445H1518a41498a3669r4696j12399b7489k62879B8125M3201c16563
17776E4723a1834m04326i058q8317E4596J03297K4133I432d6472j09508K5332
17765a30648A61077D2791a12733M7716A02016a2652k08502D0250a52703b3766
17754a20487C07768c71099i910D604O5594H459J65358J17160c1467j20123D2132
17742B38613E2373K33290I2321K4221b71713I2465d2072k25700J24810f8244A47595
17730f7978A56593E8237g3213D05860A15167k5704a31434A48473p3833c5342A78202
17718b75324Q0635E04473d926E921d2976j69498G3538B0597L8929K5695g352j9740
$$ y = [21438, 90362, -126335, 339856, -189216, 97530, 44720, 138572, 89747, 136469, -121829, -83429, -365874, 81518, -141498, -13669, -108365, -220764, -27489, -290368, 28125, 71326, -316563, 54723, -11834, -416160, -9058, -97375, 54596, 157893, 182026, 9432, -46472, -155980, -130648, 161077, 42791, -112733, -65017, 102016, -12652, -221154, 40250, -152703, -23766, -120487, 307768, -371099, -9910, 4604, 70198, 8459, 173817, 290977, -31467, -151590, 42132, 238613, 52373, 285663, 92321, 116542, -271713, 92465, -42072, -267772, -142962, -68244, 147595, -67978, 156593, 58237, -73213, 405860, 115167, 89463, -131434, 148473, 74640, -35342, 178202, -275324, -194689, 504473, -4926, 5921, -42976, -212474, 73538, 20597, 59526, 85221, -7352, -27092]
17706b7092A95574a02606k0796j3438G3230q554a95067H8360d3882j43487F1114
17694g0474k05877D0426b76862f1301A60859b5074A26401O4492c4423j68290B98618
17682a30066A00874a11943k547A4382J03226j152n1808g4236c3185j40290I5159
17670a5718A4699J7128g9064A90901B7473c3362G4239f622j86364A24560f7867
17658a30530B17078g6355k08463c7978q6384A94620I3664K30771d46379h5934
17647a5172q854c100i79m5838I5832a52579D7305b97055J37043d027q3588I1054
17634D0338J23173m3645I804J23581a07693A67485B0783K36622O9136a8023j37064
17623a55087D6595M6855b52935G2867a75438J1118g0073A00414a83922B26461
$$ y = [-27092, 195574, -102606, -123402, -136840, 73230, 64676, -195067, 88360, -43882, -187369, 61114, -70474, -276351, 40426, -276862, -61301, 160859, -25074, 126401, 190893, -34423, -202713, 298618, -130066, 100874, -111943, -114490, 14382, 117608, 116456, 64648, -74236, -33185, -173475, 95159, -15718, 14699, 31827, -79064, 190901, 27473, -33362, 74239, -6622, -192986, 124560, -67867, -130530, 217078, -76355, -284818, -37978, -124362, 194620, 93664, 324435, -446379, -85934, -15172, -24026, -3100, -979, -46817, 95832, -152579, 47305, -297055, -160012, -4027, -87615, 91054, 40338, 163511, 119866, 9804, 133385, -107693, 167485, 20783, 257405, 326541, -18023, -155087, 46595, 93450, -252935, 72867, -175438, -164320, -70073, 100414, -183922, 226461]
17612c4959r9529A87290K3945J36197A43941E6902d0234A69140e8435C03454a08698
17600A03986K2861Q6728R7761C5275J06620O7261F2541c5580j08170A86475C6287
17588a86278c675j91265D710d9998L219n3128F8716K4685P3864f2585m5243B02886
17575A18266g6040F882K3231h8695D4468A9472O694K10885m7602q2362b2171A85090
17562E3541g7983B6792K97168k3974a04830G2415J6283J0544K90427A38018L8458
17551A76476i9423n3555B48426a09201E0820f9352A75269k7025d8640K0688E9437
17539C8156K1331b03661J9357A47535J8606d09274B74137c6817B99928a03353
17528b66206B03169q0590j8038K14766N8759A55047d5944j1966o0873A30965a31867
$$ y = [-34959, -134488, 187290, 211235, 347432, 143941, 56902, -40234, 169140, -58435, 303454, -108698, 103986, 126847, 213575, 311336, 35275, 141895, 209156, 62541, -35580, -143750, 186475, 36287, -186278, -3675, -194940, 4710, -49998, -46779, -99907, 68716, 93401, 167265, -62585, -107828, 202886, 118266, -76040, 6882, 30113, -88695, 44468, 19472, 26166, 237051, 189449, 107087, -22171, 185090, 53541, -77983, 26792, 323960, 299986, -104830, 72415, 88698, 99242, 389669, 138018, 176476, -99423, -152978, 248426, -109201, 50820, -69352, 175269, 148244, -48640, -27952, 59437, 38156, 59487, -203661, -184304, 147535, 166141, -409274, 274137, -36817, 299928, -103353, -266206, 203169, 122579, 104541, 319307, 378066, 155047, -45944, -57910, -118783, 130965, -131867]
17516A04481E769K40214b8227D23647E5447a58659I283J16474J63764a42538A51233
17504C7445M7593j4255J04769d9649A48322o1917a84833B54408L3386a00132A92290
17492B23026f7367b1733G4730k8814J25769B1531g114B57752H4102J17655A6154
17480E5017J47889M1361J30171A7067Q0981e2157B12702K2900e0270j04859N7488
17469i7641A12290h5327A21450K83225j60958b78587B57628i3495C10216a41764
17458D19564A67980F8802b1242A22926B1245J29238o2830g4120k96964C0815D455
17446A10112a64536B89465j2736L6284e976B2129K45013b5409A32506a13411a4527
17434A91257K19878A51680G0536j693M4658J86298C3059R5856m0751J89574j19082
$$ y = [104481, 5769, 245983, -28227, 423647, 55447, -158659, 9283, 125757, 289521, -142538, 151233, 37445, 85038, 70783, 175552, -49649, 148322, 86405, -184833, 254408, 287794, -100132, 192290, 223026, -67367, -21733, 74730, 45916, 171685, 21531, -7114, 257752, 84102, 201757, 16154, 55017, 202906, 244267, 374438, 17067, 98048, -52157, 212702, 235602, -50270, -155129, -97641, 112290, -85327, 121450, 404675, 243717, -278587, 257628, -93495, 310216, -141764, 419564, 167980, 68802, -21242, 122926, 21245, 150483, 87653, -74120, -371084, 30815, 4455, 110112, -164536, 289465, 276729, 313013, -5976, 22129, 267142, -25409, 132506, -113411, -14527, 191257, 411135, 151680, 70536, 68843, 113501, 299799, 33059, 128915, 88164, 277738, 158656]
17423A58656L1952K57205F8396a7554A28193J23215k0079J34695F0742K22287
17413B83029J3780F4067j1672a8544B09343i0167E74748B4149J98483q3286L2055
17402A71401J63070A40482J26730k4244E4875N1433K37128n85r9632n3931b2598
17390G3423a62165A02429l8920K06163a87553B88241G0554p088a64920N8900c5121
17378A9796J15136b3374B44725K05336A44719N0453J36588a69242D9610J151A0939
17366B39220M2895M2358H2207F672a48034g2531D56026o5865a2638B07333L1433
17355B38766L34306B21675c5560A18140b1074A15849R6754c3757D40690j09050
17345C31640G2465K3562L0344a11764b3030C80017A4971K96704A47943J39924
$$ y = [158656, 190608, 447813, 68396, -17554, 128193, 251408, 231329, 366024, 60742, 283029, 296809, 64067, 52395, -18544, 209343, -90167, 574748, 24149, 222632, 139346, 171401, 334471, 140482, 267212, 242968, 54875, 106308, 343436, 342851, 243219, 189288, -22598, 73423, -162165, 102429, 63509, 269672, -187553, 288241, 70554, 63466, -164920, -106020, -35121, 19796, 134932, -23374, 244725, 450061, 144719, 195172, 331760, -169242, 49610, 50761, 10939, 239220, 282115, 324473, 82207, 6672, -148034, -72531, 456026, 390161, -12638, 207333, 238766, 573072, 221675, -35560, 118140, -21074, 115849, 212603, -33757, 440690, 331640, 72465, 96027, 126371, -111764, -23030, 380017, 14971, 311675, 147943, 287867]
17335B87867J75327A35529D4594j0727R8345E6694f5003A94761a31715A0160Q8112
17324I8272P2720a21490B81409j38991Q1769G1092a8784I7669h3948A45773K869
17313A48642J5440G769L36424A24653b85971C11805Q7773e5693A0822d7447B17363
17301A5296K73930O1005C8135Q5965A6181a30261A20968E5370Q2169L3248j3817
17290A56970p0119J32924c10631C28377n6928k451I1820a45946A45934K15516
17280C61450a79560i099B76673a06014H3912P224M6951B3122L20987c9918A65810
17268G8991C3756l651J81383K4076H1662R5124n601L04657k34029P9210m5783
17257B75240J0072D0449c2395n9108C39575b237j26994A10779K67010E2840L71000
$$ y = [287867, 463194, 135529, 44594, 33867, 132212, 56694, -65003, 194761, -131715, 10160, 98272, 170992, -121490, 281409, 142418, 224187, 71092, -18784, 97669, -83948, 145773, 148642, 164082, 7769, 344193, 124653, -285971, 311805, 399578, -55693, 10822, -47447, 217363, 15296, 289226, 350231, 38135, 124100, 16181, -130261, 120968, 55370, 137539, 170787, 156970, 86851, 219775, -310631, 328377, 271449, 268998, 91820, -145946, 145934, 361450, -179560, -9099, 276673, -106014, 83912, 91136, 138087, 23122, 344109, -39918, 165810, 78991, 33756, 30105, 211488, 235564, 81662, 176786, 171185, 475842, 241813, 321023, 275240, 285312, 40449, -32395, -91503, 339575, -2237, -129231, 110779, 377789, 52840, 423840]
17246D23840b6739D6943K13875K50027A78004i9258B00957i672C35404H7509Q3284
17235A70793B5282b6387A63831L0826E442a52169A89866P7547q7195q9245N8414
17224A49387f082j1794F8492K32713A10240J4677K15965C6617J81344D4137J4594
17213E8731J65682F7646L83319j99300l3416D9990N4127J43963n4753H0304J44913
17202B25217A0146g6593G5676K01962A26454Q8667F0671M71318k42178o7744j06415
17191A15652K59531j86175Q25c2496I1354a59822b0565B4323L64814A51426E9965
17179A53669K72899F6892J07330C7248K94541m8130j16011Q7902J11758r7068
17169B70240q6794K52453E4094J4980C1395M2298p753L36760B6784K15911K27169
$$ y = [423840, -26739, 46943, 260818, 510845, 178004, -99258, 200957, -9672, 335404, 87509, 170793, 25282, -26387, 163831, 194657, 5442, -152169, 189866, 267413, 180218, 90973, 149387, -6082, -17876, 68492, 301205, 110240, 124917, 340882, 36617, 217961, 44137, 58731, 224413, 67646, 450965, 251665, 218249, 49990, 104117, 248080, 193327, 80304, 225217, 10146, -76593, 75676, 277638, 126454, 215121, 60671, 531989, 289811, 222067, 115652, 375183, 189008, 189833, -32496, 91354, -159822, -20565, 24323, 389137, 151426, 59965, 153669, 426568, 66892, 174222, 37248, 331789, 283659, 167648, 255550, 367308, 270240, 183446, 435899, 54094, 69074, 31395, 73693, 65940, 402700, 26784, 242695, 469864]
17158D69864j23069j42781K33243n2454o9330J54193k14534K38943H4464K03047
17148B87511K0067P5032o3019J81738f1537D12948k491j73096K50055H9036M05701
17137D94737g4670B50516J75552A95912Q5769L6388J68661l6070A31633N9273
17127A90906J04482J72512j52562E5787K17548H7134D3282N7231m2448j3881M61296
17116E05480L7071B25925n3008l8016K91234q6698H6190J54706A15760L83673
17106D99433A74427J77206K61022r3273E1871M85078j63468J24666H8569J4373
17096A02942M62401j115B41667K61324F2181K58729J26330j91836q4644M23166
17086E93926k38178j03337M10964A03592L53307j08480K2792R5951A71333K20717
$$ y = [469864, 346795, 204014, 437257, 384803, 315473, 469666, 255132, 494075, 84464, 287511, 307578, 382610, 319591, 501329, -61537, 412948, 410457, 237361, 487416, 89036, 494737, -74670, 250516, 426068, 195912, 281681, 318069, 486730, 450660, 131633, 190906, 295388, 467900, 315338, 55787, 273335, 87134, 43282, 100513, 58065, 44184, 505480, 542551, 225925, 172917, 134901, 426135, 339437, 86190, 240896, 115760, 499433, 174427, 351633, 612655, 519382, 51871, 536949, 373481, 498147, 88569, 102942, 565343, 564228, 241667, 502991, 62181, 320910, 447240, 255404, 170760, 593926, 355748, 252411, 663375, 103592, 456899, 348419, 371211, 467162, 171333, 392050]
17076C92050a4391E39512m5893j04807j07812R5991J9289j19736O0708J73402
17066E10654j24358J63045A09419K23642j45178H2771j9417J57621K90816k27631
17056B84160j31219K55055L18472B48585I4612M69190A11450L97265j28906Q5304
17046D65113k21808K85454j38685j45849K64546j29223L0460l6728r2283J88909
17036D69906L0972r7549K03901n5748A58475M08109B49747J32482J51111A71723
17025D72367K45817A14313M61103p8131j536m18N813K96022j24679j91328k0916
17014D60243j09121j00070J05958J28881r2967L59261k00834P9414j77548A96018
17003F90363k87949J60692J19801k38106j1744L09629R5383m00582L49500O708
$$ y = [392050, -14391, 539512, 493619, 388812, 281000, 376991, 396280, 276544, 337252, 510654, 386296, 549341, 109419, 333061, 187883, 82771, 63354, 220975, 511791, 284160, 152941, 407996, 726468, 248585, 94612, 563802, 111450, 508715, 379809, 465113, 243305, 528759, 390074, 244225, 508771, 379548, 410008, 373280, 280997, 469906, 500878, 403329, 607230, 551482, 158475, 566584, 249747, 382229, 533340, 171723, 472367, 718184, 114313, 575416, 497285, 495749, 495331, 501144, 797166, 672487, 481159, 460243, 351122, 251052, 357010, 485891, 392924, 752185, 551351, 630765, 453217, 196018, 690363, 402414, 563106, 682907, 444801, 433057, 742686, 838069, 437487, 786987, 793695]
16993G93695B26181N94391l37358J84389M0132k51100J79697k90209K32653j00950
16983D77826L07728R5190D08241m924L13499K62454D18076N19649j32828j83371
16973F21526J2471K26788j86122k055J60178j12308J71501M3506C93952l9374
16963C54578J90113J51434J03556R6918j54467l3749k1792J31782L87l47566J60222
16952F31416J91350R7759K3242K0718j71104j87516K48165K68946l10159L35859
16942A148676k49122R9956K97006m89114L81642l07279k64082M27565R3133k74308
16932H64073J87825p0191J75631j79037K68841j44454j22267j20256K52865J6917
16922A129947m8027r8139q1651K58288j54675J86253k11923J06767k5900J7100
$$ y = [793695, 226181, 820572, 483214, 667603, 707735, 456635, 636332, 346123, 578776, 477826, 785554, 880744, 408241, 403317, 716816, 979270, 418076, 937725, 804897, 621526, 633997, 860785, 674663, 672608, 832786, 720478, 891979, 935485, 393952, 354578, 544691, 696125, 799681, 896599, 742132, 708383, 686591, 818373, 818760, 471194, 631416, 822766, 920525, 943767, 964485, 793381, 605865, 854030, 1122976, 812817, 1148676, 899554, 999510, 1296516, 807402, 1189044, 881765, 617683, 1045248, 1138381, 864073, 1051898, 981707, 1157338, 978301, 1247142, 1102688, 980421, 860165, 1113030, 1129947, 1081920, 983781, 902130, 1160418, 1005743, 1191996, 980073, 1086840, 1060940, 1078040]
16912A078040m4675J19972j15309J87299l31M8993k5956P4536k39499K46612k12719
16901A116963K57214q8932o005L93229m40457P6326L02895j63596J2345o5338
16891A394644J81145j73714q1360K22487j69952L60903m82072L52318L69935k72788
16881A701546n0915J28480O3093j72875Q4934j96603L69184l45232L26739m8779
16871A859572K85510n4520l18151m7772K11004q864M11002j31864j74670p1093
16861A960154K68753j89612L83880k19757r0639M4013J56125Q0867k04574L43873
16851B533083j38493O9510K98663l65904K49046K2458Q4378l49308K63603K21559
16841B888595l18893L03900K37968j30127L18254n30816J38457K68549J40260
$$ y = [1078040, 1033365, 1153337, 1038028, 1225327, 1224996, 1273989, 1248033, 1322569, 1083070, 1329682, 1116963, 1374177, 1285245, 1279240, 1672469, 1232012, 1308338, 1611233, 1447637, 1459982, 1394644, 1575789, 1402075, 1320715, 1543202, 1373250, 1734153, 1252081, 1604399, 1974334, 1701546, 1650631, 1779111, 1842204, 1669329, 1754263, 1557660, 1926844, 1581612, 1908351, 1859572, 2145082, 2090562, 1772411, 1724639, 1935643, 1926779, 2337781, 2205917, 2031247, 1960154, 2228907, 2039295, 2423175, 2203418, 2112779, 2156792, 2312917, 2393784, 2189210, 2533083, 2394590, 2464100, 2762763, 2396859, 2645905, 2668363, 2752741, 2403433, 2667036, 2888595, 2569702, 2873602, 3111570, 2981443, 3299697, 2768881, 2907338, 3175887, 3316147]
16832C316147j38010L48496k81165J69685k03390J92046n3902K13166N36577m57334
16822C642316M26414m25446N55047k48411j42277L49360L03837l97865M29746
16813D492721l43590L75781j60612N12701n48674M17940L19644l147J87243k09856
16803E040151m6479O00286m6700q3953J82775P4010J66625J78858j24110O47373
16793F588836j21250J60888K91734K0900l5204P51537n5120L30994k74938P04596
16783H362973q4339R2685K23731O15912r7183K14334P44155l71619N36928L73310
16773A0610887l15459Q74305L42368K36257K83268K90720O58090K87928P76208
16764A4044572l4496O47610L66483L14844O74731O67452L88292P63101O03770
$$ y = [3316147, 3178137, 3526633, 3245468, 3415153, 3211763, 3403809, 3349907, 3563073, 4099650, 3642316, 4068730, 3643284, 4198331, 3949920, 3807643, 4157003, 4460840, 4062975, 4492721, 4149131, 4524912, 4364300, 4877001, 4328327, 4746267, 5065911, 5062764, 5250007, 5040151, 4993672, 5593958, 5547258, 5463305, 5646080, 5720090, 5886715, 6065573, 5941463, 6588836, 6467586, 6628474, 6920208, 6941108, 6905904, 7657441, 7602321, 7933315, 7658377, 8362973, 8278634, 8371319, 8595050, 9210962, 9113779, 9328113, 10072268, 9700649, 10237577, 10610887, 10295428, 11169733, 11512101, 11748358, 12031626, 12322346, 12980436, 13268364, 14044572, 14010076, 14657686, 15024169, 15339013, 16013744, 16681196, 17069488, 17832589, 18436359]
16755A8436359N56192J219916K82246R49716Q27360J251751K13002J594312Q46977
16746B6177831N68024J848627J050976J540234J597164J043837J987299J403686
16738C7217678J990310K228857K226161K304904K264365K621639L088631K994083
16730E6936628L372010K934011M097693L927317M722268M453395N050528N269703
16722I0763553O087333O078447O383878P513963P263058P621668Q088474Q489505
16714A48289879Q558390Q503296Q070034Q358909P589548P533734N817424N658984
16706B08380198M110115L025868J069428l62854j932798l387193n066293n731313
16698B00105158o743846p617676q098019q624849q771027q545929q105343q452818
$$ y = [18436359, 18992551, 20212467, 20494713, 21444429, 22271789, 23523540, 23736542, 25330854, 26177831, 26745855, 28594482, 29645458, 31185692, 32782856, 33826693, 35813992, 37217678, 39207988, 41436845, 43663006, 45967910, 48232275, 50853914, 53942545, 56936628, 60308638, 63242649, 67340342, 71267659, 75989927, 80443322, 85493850, 90763553, 96850886, 102929333, 109313211, 116827174, 124090232, 131711900, 139800374, 148289879, 156848269, 165351565, 173421599, 181780508, 189370056, 196903790, 202721214, 208380198, 212490313, 215516181, 216585609, 216222755, 214289957, 210902764, 205836471, 200105158, 193361312, 185743636, 177645617, 169020768, 160249741, 151703812, 143598469, 135145651]
16690A35145651q084185p550005p101718p047926o338893n983314n499123n332716
16682H2207771m927283m762109m486852l834399l455584l444820l414230l207911
16674E0674583k781508k300681k249519k363161k129527j926442j914079j596357
16666C3413309j426501j639540j436832r39457r52641j656025p96867j249007
16658B3316439o30879j135996p77421o13515p14742q99435m54996p74471q54802
16649A6460182o26134n13345m73977r3418o20353p53195o0612o20569l01461r08412
16639A1488706k74l54592m40803K09035p69070L5705n16132l3494m73892q6331
16629I058858m71049k86067k91126k34389J18262q2635m97478k54764J32810l06751
$$ y = [135145651, 127061466, 119511461, 112409743, 105361817, 99022924, 93039610, 87540487, 82207771, 77280488, 72518379, 68031527, 64197128, 60741544, 57296724, 53882494, 50674583, 47893075, 45592394, 43342875, 40979714, 38850187, 36923745, 35009666, 33413309, 31986808, 30347268, 28910436, 27970979, 27018338, 25362313, 24565446, 23316439, 22685560, 21549564, 20772143, 20158628, 19443886, 18544451, 18089455, 17314984, 16460182, 15834048, 15320703, 14846726, 14753308, 14132955, 13379760, 13319148, 12698579, 12397118, 11488706, 11488432, 11133840, 10693037, 10902072, 10133002, 10168707, 9652575, 9619081, 9145189, 9058858, 8587809, 8301742, 8010616, 7776227, 7894489, 7811854, 7314376, 7059612, 7192422, 6885671]
16619F885671m20317j59933j13258o7558K7361j66890j55016k96059k936j53981
16609E377084j01143j13117j12840m08444K20480j64171j17522m74050K44118
16600D350395J69621n70760Q5738p9555J02487k64948K2272n10438N34484m47380
16590C391916M24056m36915K86859m88095Q29r5970L0447m1806n1770J90002m84794
16579B724759K44373N9699k92099R8905K8596l16718J7838J93434k05343J08863
16569B662307j25087j34824J1550l9044l5856k80546J96755j83792l1630m6951
16559A992882K08549q7269q9944o8079k3246O2519k65497K50807m1709K4984r8415
16548A865582j02150K44279l57922K60664k13797q5348J9456l53282K13408J24657
$$ y = [6885671, 6465354, 6305421, 6192163, 6124605, 6151966, 5985076, 5830060, 5534001, 5531065, 5377084, 5275941, 5162824, 5049984, 4641540, 4862020, 4697849, 4580327, 4106277, 4350395, 4520016, 3949256, 4034994, 3955439, 4057926, 3792978, 3815250, 3304812, 3839296, 3391916, 3815972, 3379057, 3665916, 3177821, 3178650, 3082680, 3113127, 3071321, 3019551, 3209553, 2724759, 2969132, 3028831, 2736732, 2835637, 2864233, 2547515, 2565353, 2758787, 2553444, 2662307, 2537220, 2402396, 2413946, 2374902, 2339046, 2058500, 2255255, 2071463, 2039833, 1992882, 2201431, 2114162, 2024218, 1956139, 1932893, 1995412, 1729915, 1980722, 1939013, 1963997, 1865582, 1763432, 2007711, 1649789, 1910453, 1696656, 1611308, 1630764, 1277482, 1490890, 1615547]
16538A615547o503j75319R6792J57193n22977N65982n33517M10928n08152L68667
16528A468641R1808j54609k8062p0221o7310l6462O2770j63089K19729o0503k83627
16517I79065J03477O5357o450j39492J61482m18563J57648N0225K20010l97725
16507G75034J31546M58198l11777k11279J67944l7069n5962k559n8135K80389
16497A136330l90901K56440l03371N5068N36569p3521k12260m91902L00952J1446
16487H24850r0125J24066j79726k7240L00788l44366L4536J99457J40344R5431
16477A078015m85947J53605n8343J27287r7720L06346l94145j98524K76407j11452
16467E95529K0095o8388K07939J04579l89235J65780k3864j252J49235k71367
$$ y = [1615547, 1609044, 1433725, 1530517, 1687710, 1164733, 1730715, 1197198, 1608126, 1099974, 1468641, 1560449, 1405840, 1377778, 1307557, 1240247, 1203785, 1266555, 1103466, 1323195, 1262692, 979065, 1082542, 1147899, 1141449, 1001957, 1163439, 744876, 902524, 952749, 1172759, 775034, 906580, 1364778, 1053001, 841722, 1009666, 972597, 916635, 914076, 855941, 1136330, 745429, 1001869, 698498, 753566, 1290135, 1216614, 1004354, 512452, 813404, 824850, 734725, 858791, 679065, 651825, 952613, 608247, 642783, 842240, 982584, 1078015, 592068, 745673, 687330, 814617, 716897, 1023243, 629098, 430574, 706981, 595529, 615624, 547236, 755175, 859754, 470519, 636299, 612435, 611183, 760418, 489051]
16457D89051n7867K23106j69163O3965P6722M257K207M582M4689J62593k69541
16446E74601r2664J20015J87655C27744M65171l75108K86041C45586K02608B65055
16435C40228A43600O88715k68983j01453O8631Q0549j34669K6763K15612K7k36817
16424D81975M9975k43184N96912l86586j4436J82100j36303l0355O4651j22452
16414D42297N5181R273B52051L89195k20228J8776j26924o5015P9754J04877O3184
16403D95670k01483L57567k30664j74409A21134L76987A83034N07417B85114K0899
16393C06013Q3697o6929j03081Q9796j11113K03971O9836K14123B81464Q4335
16383C65799K23850P8096k89663r3890M3172K87395k18698q3995J97563j02487
$$ y = [489051, 431184, 654290, 485127, 549092, 625814, 630071, 632278, 636860, 681549, 844142, 574601, 481937, 601952, 789607, 327744, 792915, 417807, 703848, 345586, 548194, 265055, 340228, 143600, 832315, 563332, 461879, 530510, 611059, 476390, 503153, 718765, 718792, 481975, 531950, 288766, 885678, 499092, 484656, 666756, 530453, 500098, 564749, 442297, 497478, 506751, 252051, 641246, 421018, 439794, 312870, 247855, 327609, 432486, 495670, 294187, 651754, 421090, 246681, 121134, 498121, 183034, 690451, 285114, 306013, 389710, 322781, 219700, 309496, 198383, 402354, 472190, 686313, 281464, 365799, 589649, 667745, 378082, 284192, 327364, 614759, 396061, 312066, 509629, 407142]
16373D07142K37377A91130O49257k14942k08639L8530o1229J74034n3458o4169
16363D50514j0383A96517L57899p8440B05425R7811o9623J54738A49729K51218
16353D00947J66447j95729A22472J53640M05784l9556A70315Q6743K5049L1392
16343C13499J22214j70948J55753M8205r8737K32043B60436j18337D2010K21498
16333B63508L39991j9999B62044H4698J90013j111K89488k02355j11136k6520
16323B23077j0408n055d5146H0917J80093J48282q7429j45238o7801M43345G4547
16311D55532J6914B16365K00121j31414L36411k61722J72996O8120B51037K19982
16301D71019j87367K65992B50338j6129K07450r5358K0161m6164M24922l59920
$$ y = [407142, 644519, 191130, 840387, 625445, 416806, 455336, 394107, 568141, 514683, 450514, 440131, 196517, 554416, 475976, 205425, 303236, 233613, 388351, 149729, 400947, 567394, 371665, 122472, 276112, 681896, 642340, 170315, 257058, 282107, 313499, 435713, 264765, 420518, 468723, 369986, 602029, 260436, 142099, 42010, 263508, 603499, 583500, 262044, 84698, 274711, 273600, 563088, 360733, 249597, 223077, 212669, 207614, -45146, 80917, 261010, 409292, 321863, 176625, 108824, 552169, 74547, 455532, 472446, 216365, 416486, 285072, 621483, 359761, 532757, 600877, 251037, 471019, 283652, 549644, 250338, 234209, 441659, 346301, 366462, 320298, 745220, 385300]
16291C85300j70973A01427c944A90381K49893j49927r5657L8713K6390J26079
16281C85872A77401L88553j58559j80564K70632K40411B13860K76577a08781F1739
16270C12185J44390B01748L06674B35392Q8693A38617m9045J37419r7347R8697
16260B28341l2785m9895O1772J47076p6484P564I3487e0669A78616f7418E38368
16248C50177q947J8615I4489J11647J1070p466L1508a13173D44750A86969f0354
16236B90146F7858L46294Q2878j83662C804K33344J37428o8669r2837j0342M8981
16225B51709b38830C72311J73744k12557K34626B03231C2257K20490A13103M74493
16215E87596k25637a82811B13534b8120A61748J69034b9319C47965p4236F9153
$$ y = [385300, 214327, 101427, -3944, 190381, 440274, 290347, 194690, 233403, 259793, 385872, 177401, 565954, 407395, 226831, 497463, 737874, 213860, 490437, -108781, 61739, 312185, 456575, 201748, 508422, 235392, 324085, 138617, 89572, 226991, 129644, 228341, 195556, 145661, 207433, 354509, 278025, 285589, 93487, -50669, 178616, -67418, 538368, 350177, 341230, 359845, 94489, 206136, 217206, 209740, 241248, -113173, 444750, 186969, -60354, 290146, 67858, 414152, 497030, 313368, 3804, 237148, 374576, 305907, 213070, 202728, 251709, -238830, 372311, 546055, 333498, 568124, 203231, 32257, 252747, 113103, 587596, 361959, -182811, 213534, -28120, 161748, 330782, -29319, 347965, 273729, 69153]
16204g342B42634L73309A18272P5477H6010J89455M6281r9529J36646i1689E3070
16192B92885L19890A22278m3845a25160a7794G5832L82567g224A43679K5687J68618
16181C37984n8390j844q8816P8490a39820A77738J02782c56D94626I2126l0276
16170F1850L44049d6983E93613B0379M49060c38986a6362B73534I2500J08477
16160B00977N672m8961K13716n8999j07804E3309K78730k6688Q7252R8403j24539
16149C66467A76709l9634P0067p3934m0519J72495A27691K7590C9231Q1487K32462
16138C53180j38037I6050a0699H7083a4705F7791a87B05673J70516H7861a11899
16126B26827r8326J76915E7889N9244j7643A3099L18027a71676P3928A2064J4352
$$ y = [-7342, 242634, 615943, 118272, 193749, 86010, 275465, 321746, 222217, 358863, -91689, 53070, 292885, 612775, 122278, 78433, -125160, -17794, 75832, 458399, -7224, 143679, 169366, 337984, 279594, 277750, 188934, 267424, -139820, 177738, 280520, -356, 494626, 92126, 61850, 405899, -46983, 593613, 20379, 469439, -338986, -16362, 273534, 92500, 200977, 206649, 157688, 371404, 312405, 204601, 53309, 332039, 305351, 392603, 491006, 366467, 176709, 137075, 207142, 133208, 92689, 265184, 127691, 155281, 39231, 120718, 353180, 215143, 96050, -10699, 87083, -14705, 67791, -187, 205673, 376189, 87861, -111899, 226827, 128501, 305416, 57889, 117133, 99490, 13099, 331126, -171676, -97748, 12064, 26416]
16115B6416J69385r6629D0047B933L2448e9916D9153J9183b05931A55407J413
16104A56820f5136G155O1980a84327q8702A91825b12621J00711B18414C4172K25928
16093B60100i9924C5673c42266G3646h6737G6865J46727J16650l9299j07976P5505
16082B68472F3797f6472K9312j29069M3111j76667B06867e8286B17678K38233
16072D55911A53715J14989H3076a97879B67422a12450j5847A63696l0573E3744
16061d9759Q685A60193B9301K42085j15180a3015C73026b04543b415F7926d1643
16049A04025J60404E2675K7847j5248j6073J463c7074n8384l88H9793a9062r9154
16037a18216G6974c73229J74336h1133b6102I2775K27621k2069d6707K553j616
$$ y = [26416, 195801, 99172, 40047, 2933, 35381, -59916, 49153, 68336, -205931, 155407, 156820, -65136, 7155, 69135, -184327, -273029, 191825, -212621, -111910, 218414, 34172, 260100, -99924, 35673, -342266, 73646, -86737, 76865, 223592, 340242, 300943, 192967, 268472, 63797, -66472, -37160, -166229, -123118, -299785, 206867, -58286, 217678, 455911, 153715, 268704, 83076, -197879, 267422, -112450, -128297, 163696, 133123, 53744, -49759, -41074, 160193, 29301, 271386, 156206, -13015, 373026, -204543, -2415, 67926, -41643, 104025, 264429, 52675, 80522, 65274, 49201, 50664, -37074, -95458, -95846, 89793, -19062, -118216, 76974, -373229, -198893, -81133, -26102, 92775, 320396, 298327, -46707, -44154, -45770]
16026d5770r8345j83931a53909J1043A74102a85168J4362a8063A25450q799a564
16014D9415b57145j1J21533A04451b06070A80236E1094O4339e0151A91468a58044
16002A18578c18732a04106J8805D3329e9986O1E7616L6097C0639e214A55774b39693
15989E8129L5782b49013k4912M8114c9309o5909A14799c3549b320m0981n3745
15978i7046k16991A4312l358a15221C11084c09703i2256q3616a5441p968A33182
15966F4499B5360J07213b11478I5576D2933a34675A3387M7789a86638A4685K45407
15955B60092G1794J649a7078k9588B9572a8797A60805g9713A79089b58090A60544
15943b67099J15350H8432b21515H896a2720l80170J35595N3731b6585B68440F6930
$$ y = [-45770, -144115, -328046, -153909, -142866, 174102, -185168, -170806, -18063, 125450, 116651, -1564, 49415, -257145, -257156, -135623, 104451, -206070, 180236, 51094, 115433, -50151, 191468, -158044, 118578, -318732, -104106, -85301, 43329, -59986, -59925, 57616, 93713, 30639, -5214, 155774, -239693, 58129, 93911, -249013, -273925, -225811, -39309, -105218, 114799, -33549, -2320, -43301, -97046, -314037, 14312, 10954, -115221, 311084, -309703, -92256, -175872, -15441, -23409, 133182, 64499, 25360, 132573, -211478, 95576, 42933, -134675, 13387, 61176, -186638, 14685, 260092, 71794, 73443, -17078, -46666, 29572, -18797, 160805, -79713, 179089, -258090, 160544, -267099, -151749, 88432, -221515, 8896, -12720, -392890, -257295, -203564, -26585, 268440, 66930]
15931F5937a34010N5104l70544A16933l4255a03584i144q5975j2634A14690A8826
15919i5369k86476a38129m0898L9389A03028a928B77596E6506e5560q0121F6416
15907d6810k07320a24462k60346J63324h7789l20048A1625a56175k7047G6218
15896a1307l70368i0965E1651J5144J79055a33316J5534n3661A71023a0797r359
15885b0156o6199A18141L3965o2094d51953K23039B5495g9904E5010M22610e4107
15873a85412a6577A28873a29008M6310j35539A74408a74078k71443e97A90381
15862a28662k6271D6378a02261l355p0270j69400e942r7594l30530G1243J53585
15851B24828f627k34523F8178a56633m5330K4172A27601a11084B7450b16350d8801
$$ y = [65937, -134010, -78906, -449450, 116933, 82678, -103584, -9144, -95119, -107753, 114690, 18826, -95369, -381845, -138129, -179027, -139638, 103028, -1928, 277596, 56506, -55560, -135681, 66416, -46810, -254130, -124462, -384808, -221484, -87789, -407837, 11625, -156175, -183222, 76218, -11307, -381675, -90965, 51651, 66795, 245850, -133316, -117782, -171443, 171023, -10797, -20156, -86355, 118141, 152106, 90012, -451953, -228914, 25495, -79904, 55010, 477620, -54107, -185412, -16577, 128873, -129008, -82698, -218237, 174408, -174078, -445521, -597, 190381, -128662, -154933, 46378, -102261, -105616, -175886, -345286, -5942, -103536, -434066, 71243, 224828, -6627, -241150, 68178, -156633, -201963, -177791, 127601, -111084, 27450, -216350, -48801]
15839C35725b87375e5867j21627P6271k85328J88493E1167e1012G4299b75528
15828a179B179N2871c66335R5937A61681c6134k44796h0988B48772a62454C78168
15816i5142E8084b88070J30011G7681d4900C26939g4418G1967c9444A15255K01435
15805C16690n2782b492j56526M7564d3646o2894Q63A00947B9735O4278a05057
15793b16354d2026C0863i7934A15519a37578H9452k4934a57577A00753Q1913a42573
15781A09483k3061i0198B00126C5661H941J7817K17281a35152m4529o6808a01691
15769e8603r7182f8472j43124H3053J07147a68105j11490i8952J4355B00571K802
15758B03373g9172j64889d3576G91d5130k43449a16538k225j2377J7607L4373
$$ y = [335725, -287375, -55867, -177494, -101223, -386551, -198058, 51167, -51012, 74299, -275528, -1179, 2179, 55050, -366335, -270398, 161681, -36134, -280930, -80988, 248772, -162454, 378168, -95142, 58084, -288070, -158059, 77681, -44900, 326939, -74418, 71967, -39444, 115255, 316690, 263908, -2492, -159018, -111454, -43646, -106540, -105677, 100947, 29735, 94013, -105057, -216354, -42026, 30863, -97934, 115519, -137578, 89452, 64518, -157577, 100753, 182666, -142573, 109483, 86422, -90198, 200126, 35661, 8941, 26758, 244039, -135152, -179681, -246489, -101691, -58603, -155785, -68472, -211596, 83053, 190200, -168105, -279595, -98952, -84597, 200571, 203373, -79172, -244061, -43576, 791, -45130, -288579, -116538, -118763, -131140, -113533, -79160]
15747g9160N803j05214C4904b26656A56976a46565k56713A32440d06031A0423
15736B05165a37749A07595a58774C5122h6054E7a74621a6116n5432E7536A5872
15724e4193I0063k6080J4815a36584E3698a27298C4543b29390d3786n6853D7291
15712a14086A50707a4479k43607j08876O6893C1555J8225O9509J55206c32376
15701c93239J75664R3103B13469b0698D1356A4754J40094D7729b1868A65585d32559
15689b267j51337l1960b6352A43240a28057A22344K3453J21171h4215b3757B15827
15677b87162b748C09142a34795j64284e4469A12570i1887b2192l9935N938B14593
15665f5900K800k13116b2207k18270g9554H2238a41732M8715A75052b88008h7992
$$ y = [-79160, -73357, -178571, 34904, -226656, 156976, -146565, -403278, 132440, -406031, 10423, 205165, -137749, 107595, -158774, 35122, -86054, 57, -174621, -16116, -71548, 57536, 15872, -54193, 90063, 63983, 78798, -136584, 53698, -127298, 34543, -229390, -43786, -100639, 47291, -114086, 150707, -14479, -258086, -366962, -300069, 31555, 49780, 119289, 274495, -332376, -393239, -217575, -124472, 213469, -20698, 41356, 14754, 154848, 47729, -21868, 165585, -432559, -2267, -153604, -185564, -26352, 143240, -128057, 122344, 145797, 266968, -84215, -23757, 215827, -287162, -2748, 309142, -134795, -299079, -54469, 112570, -91887, -22192, -62127, -56189, 214593, -65900, -63100, -276216, -22207, -240477, -79554, 82238, -141732, -93017, 175052, -288008, -87992]
15653a8602l2796j60786A14650a63232I2133a25943e8754K004j30510j25006J41586
15642a70680M0196A25282c04976I8698h5134j34396a02837A33015a52311r3384
15632b45695A19102J04386a64202M0998I3888J11843m3952a77554Q6836G6049
15621a40106b7694k1017A71713b70042h3079F5243a51972C37306c4556A48392
15610c48097g7274E3305a19252a079B18639e2848I4791e1485r8124l7236n820
15599a92665N1075G8018J16620C7065i4428r9906N9154l8464a9077A94158c4691
15587B40379a2164A9299b6711G402a71133j18562J38808l60e9955D855J08790
15576A13645b64875f2777B6874a37160q2635A34883b22191A20711b1075D3173
$$ y = [-18602, -51398, -212184, 114650, -163232, 92133, -125943, -58754, -56750, -187260, -312266, -170680, -130484, 125282, -304976, 98698, -85134, -219530, -102837, 133015, -152311, -245695, 119102, 223488, -164202, -123204, 93888, 205731, 161779, -177554, -90718, 76049, -140106, -27694, -48711, 171713, -270042, -83079, 65243, -151972, 337306, -34556, 148392, -348097, -77274, 53305, -119252, -1079, 218639, -52848, 94791, -51485, -149609, -186845, -192665, -141590, 78018, 194638, 37065, -94428, -194334, -135180, -173644, -19077, 194158, -34691, 240379, -12164, 19299, -26711, 7402, -171133, -289695, -150887, -151247, -59955, 4855, 113645, -264875, -62777, 26874, -137160, -219795, 134883, -222191, 120711, -21075, 43173]
15565E7269a05646j54827I9169e2830B49439a00951L4395A87650J58287A21022
15554c95665D12538c3488B90098e60033H0520j6430J6626b28496C4080K64373
15544B98453d23183B14635J7169b18313c0944G8295d6853I1073C6780L609a8178
15532b24252M0749B06117b63104b1341B08382J190H5313b11847b6748j65632D69734
15520a08062j59273A43285k8765b30441r5514B1910a7293B28594B4647a7126E6057
15508a59316J4304H734L15580c21307g5098k18483G9301O3192a6289I3940b34749
15496A20010L8583c84111Q4441A86264A731J29484a58091B8080b6444k93926A43205
15484b38380C39310I8405a72637j68775A19951a70035I5930g7003K1565m25924
$$ y = [57269, -105646, -260473, 99169, -52830, 249439, -100951, -66556, 187650, 345937, 121022, -395665, 412538, -33488, 290098, -560033, 80520, 64090, 80716, -228496, 34080, 298453, -423183, 214635, 231804, -218313, -30944, 78295, -46853, 91073, 36780, 40389, -18178, -224252, -183503, 206117, -263104, -21341, 208382, 209572, 85313, -211847, -26748, -192380, 469734, -108062, -267335, 143285, 114520, -230441, -325955, 21910, -17293, 228594, 24647, -17126, 56057, -159316, -145012, 8734, 324314, -321307, -75098, -293581, 79301, 142493, -16289, 93940, -234749, 120010, 158593, -384111, -299670, 186264, 1731, 131215, -158091, 28080, -26444, -320370, 143205, -238380, 339310, 98405, -172637, -341412, 119951, -170035, 95930, -77003, -55438, -481362]
15474d81362h4104a6010B14567i8737A09192R8136e67734a98735B53308a90046
15463e0465j18778b1597A37116a29379A52313f4733C98363a85860j88318B52360
15452a4824A07475e2119m9514A39360J16700A9877J91854G2183K6849b01823A57008
15440A84738a89839A37287i1514A93984F2640a94520l1857N8559A39848o6342
15430G3506K5237b36262k1204B5992L43951a4655A28629a63847B77297i3976A37217
15418a66044B14630j2897C3770a44557a5147k45887A84919b07789a1995A45171
15407A06940N324d48315a43011G0789g3450F7261a44905A84450a88971D7007a00606
15395B48576I1364b03370A08576a91418f607o4236l8567A33712b00494j00857
$$ y = [-481362, -84104, -16010, 214567, -98737, 109192, 207328, -567734, -198735, 253308, -190046, -50465, -169243, -21597, 137116, -129379, 152313, -64733, 398363, -185860, -374178, 252360, -14824, 107475, -52119, -101633, 139360, 256060, 19877, 211731, 72183, 99032, -201823, 157008, 184738, -189839, 137287, -91514, 193984, 62640, -194520, -226377, -167818, 139848, 73506, 98743, -236262, -257466, 25992, 369943, -14655, 128629, -163847, 277297, -93976, 137217, -166044, 214630, 201733, 33770, -144557, -15147, -261034, 184919, -207789, -11995, 145171, 106940, 112264, -448315, -143011, 70789, -73450, 67261, -144905, 184450, -188971, 47007, -100606, 248576, 91364, -203370, 108576, -191418, -6607, -70843, -109410, 133712, -200494, -301351]
15385c01351A25347J976d30258A28525m2442l83B3917K6089f3802F2042B4354
15373C1064F765M2586R2134g6127A16276f0572B19539J70406b30319Q4991A73569
15361A43304a9073A18328Q9136a94570P0294B38262Q3674C1595g4229r8236L592
15350a68873G2834l0127g7729l3256r2742A99612K6561j4636a4699B62833b07029
15338h7896B77627a75212J9842A87654L440A2217d5954A12000O2462b37096C8046
15326B7624N4423J70262A19800a02052b9564B42041l1425b2789D4322h2031B21289
15314G853c0578m4956j21641Q2056M8900k12934H9223a08000H7844j3166J5329
15303I0007b29725A49187G0586h0662E12429c59871c4544m6165j22966b6451j18938
$$ y = [-301351, 125347, 127323, -430258, 128525, 86083, 85700, 23917, 50006, -63802, 62042, 24354, 31064, 6765, 49351, 141485, -76127, 116276, -60572, 219539, 389945, -230319, -145328, 173569, 143304, -19073, 118328, 207464, -194570, -124276, 238262, 321936, 31595, -74229, -172465, -168873, 72834, 42707, -77729, -110985, -203727, 199612, 226173, 211537, -14699, 262833, -207029, -87896, 277627, -175212, -155370, 187654, 191094, 12217, -45954, 112000, 174462, -237096, 38046, 27624, 82047, 252309, 119800, -102052, -29564, 242041, 210616, -22789, 44322, -82031, 221289, 7853, -30578, -75534, -197175, -115119, -66219, -279153, 89223, -108000, 87844, 74678, 90007, -229725, 149187, 70586, -80662, 512429, -359871, -34544, -80709, -203675, -26451, -145389]
15292a45389L5197L8255A73807J52829b68021g6006B09197i4918o2716D1867b68379
15280a63758g7249A78126a68229A8828J44071E745K12657D5878L9059e998E50381
15268D28163D3056J01220i1019A00851J7165O8165o1643c04115A30910N033J56515
15257B92458E9436L57092A27069o2484J39903k2597B6722J07969R99i9780B6123
15245a04758E5738i88j58408B11642a37882C64105j52989N6217J43042n2341K06756
15234E64790N5217P72830P13192m56252M68476p98455n05321j5111I0660J48030
15224B38690j5706B6839a33498e9249A17106J34434I3960J1516a47740K6596B56331
15212A73744c23136H0137g7137B05379a35987H481e8031C93072c01373A60184
$$ y = [-145389, -110192, -71937, 173807, 326636, -268021, -76006, 209197, -94918, -157634, 41867, -268379, -163758, -77249, 178126, -168229, 18828, 162899, 5745, 218402, 45878, 84937, -5998, 550381, 428163, 43056, 144276, -91019, 100851, 118016, 186181, 124538, -304115, 130910, 135943, 292458, 59436, 416528, 127069, 64585, 204488, 181891, 26722, 134691, 135690, -99780, 26123, -104758, 55738, -988, -159396, 211642, -137882, 364105, 211116, 267333, 410375, 358034, 564790, 620007, 1392837, 2106029, 1649777, 2118253, 1319798, 814477, 799366, 90660, 238690, 222984, 26839, -133498, -59249, 117106, 251540, 93960, 105476, -147740, -121144, 256331, 173744, -323136, 80137, -77137, 205379, -135987, 8481, -58031, 393072, -301373, 160184]
15201f0735m4152A85771d6882k36899E2636J82528q2461J07852A14074J4716J75411
15190C04201A7115f8299A65765d0450B0122c9052j62186b3594D8484c9884B97702
15178G1241N3761a3904o367A77441l3525D7062J48828I4218q921J54906P181h6192
15165F1472b235H6496J80503c07012D5534K72608J63791A25947O158C2430J11653
15154A44083N8481C8116J84746J45126d465G2079F946J24116h5141C0573a99999
15142F1725K94191a35179o6736f1750B50515I0307a31345k25032B35311j05476
15132A29835l0678e6851j6061j08899G1943G368L49705j37131J43563h4048C52879
15120A43973a2391A03892b4840A41773E9079K22862M4142j00225o2527N6642p1170
$$ y = [-60735, -104887, 185771, -46882, -283781, 52636, 235164, 152703, 260555, 114074, 128790, 304201, 17115, -68299, 165765, -40450, 20122, -39052, -201238, -23594, 48484, -39884, 297702, 71241, 125002, -13904, -20271, 177441, 143916, 47062, 195890, 94218, 85297, 240203, 247384, -86192, 61472, -2235, 86496, 266999, -307012, 45534, 318142, 481933, 125947, 132105, 32430, 144083, 202564, 38116, 222862, 367988, -4465, 72079, 6946, 131062, -85141, 30573, -199999, 61725, 355916, -135179, -201915, -61750, 250515, 90307, -131345, -356377, 235311, 129835, 99157, -56851, -72912, -181811, 71943, 7368, 357073, 219942, 363505, -84048, 352879, 143973, -12391, 103892, -24840, 141773, 59079, 281941, 326083, 225858, 163331, 219973, 148803]
15109A48803D3187p643n209J4360f5132A56338L71352K1294B36059N1020H1670
15097A00923B6022j2192M44393j11055D9676b2593B36011p2883E9582j6468d7468
15085c79739A82492K45730h0212A49536L29594a05484H2171R293l4101O8551N14706
15074F40620B23993m3496J69790B9797K9487M1410A661J84504N2001A5600a71047
15062a48705A27486L05051G3386a4242C12847j07480C8498K10415J06988E0031
15051B45095j19642J90967g2288j1388C77233q4776A31049h2384A72168k12b1031
15039I6115m2419R6301J43044a7955A16340M36539B27458p1145p7557K27089L6603
15028C42448I4095L73523B06851g718B26436K8073J91288A43555B3571J09163
$$ y = [148803, 43187, 35544, 30335, 44695, -65132, 156338, 527690, 548984, 236059, 287079, 81670, 100923, 26022, 13830, 458223, 347168, 49676, -22593, 236011, 163128, 59582, 43114, -47468, -379739, 182492, 428222, -80212, 149536, 479130, -105484, 82171, 91464, 57363, 125914, 640620, 223993, 180497, 350287, 29797, 59284, 100694, 1661, 186165, 238166, 15600, -171047, -148705, 127486, 432537, 73386, -14242, 312847, 205367, 38498, 248913, 355901, 50031, 245095, 125453, 316420, -72288, -83676, 377233, 292457, 131049, -82384, 172168, 171956, -21031, 96115, 53696, 149997, 293041, -17955, 116340, 552879, 227458, 156313, 78756, 305845, 342448, 94095, 467618, 206851, -7718, 226436, 254509, 445797, 143555, 23571, 132734]
15018A32734P9494R6682l9683l8689c484B28073j13641D878N3531J31011q6957
15007A02463m9176J6379A7911M56955B03297K11962A16372L12579B4607J45971
14997A70578K13619p4857g6918B76381A07070J99396p7932J27358G5915L06746
14987C82661A30317L46086m5068A77591n892L09276j97878b13063B89748A4184
14976E64981B07901J39333j00239m9858L1662k8563K65618A7455J80494J70164
14966C68113A47502b2708C42450j18299P4486A05463M27342B63084N7185H316
14955G00152B39238J84556J983j27646N8800C6889a18055G04954l09023A5319
14944h8171A02947J40026M5329j42316M52512q3350A55141N4891q3838L67513
$$ y = [132734, 212228, 308910, 269227, 230538, -3484, 228073, 114432, 4878, 58409, 189420, 102463, 53287, 69666, 17911, 474866, 203297, 415259, 116372, 428951, 24607, 170578, 384197, 309340, -76918, 276381, 107070, 306466, 228534, 355892, 75915, 382661, 130317, 476403, 431335, 177591, 171699, 480975, 283097, -213063, 289748, 14184, 564981, 207901, 347234, 246995, 197137, 228799, 200236, 465854, 17455, 197949, 368113, 147502, -22708, 342450, 224151, 298637, 105463, 532805, 263084, 320269, 8316, 700152, 239238, 423794, 425777, 298131, 356931, 36889, -118055, 704954, 395931, 15319, -88171, 102947, 242973, 288302, 145986, 598498, 515148, 155141, 210032, 126194, 493707]
14934D93707M3761B47804M4736R8468O2449r8101A51381J41216H3476J31683L60719
14923E75878k60646D0393M71201a96171C90973Q9192j20520N4163O0130j79920
14913B94018K55340j30315o1134M5711A95586J11533O7544l6382J92010k43473
14903B86818M721r7664K17032A16760L40257K6484A10234J93543J7622M3107l2654
14892C31852l0915g4211D82769G4898P9647J21778J79370j80125j8696A00991
14881A36807L97686k65692a6783F6440J66694Q3852L9791k8340J08668j63330
14871B73775J4035L8232N8840J37726M4620B66083K18632B22098P7546O2052L20334
14860F82030r7403j64577J62955G4802N78830B33097O3552R4626K19804q2999
$$ y = [493707, 537468, 247804, 292540, 391008, 453457, 355356, 151381, 292597, 83476, 215159, 575878, 315232, 40393, 511594, -196171, 390973, 480165, 359645, 413808, 473938, 294018, 549358, 419043, 357909, 403620, 195586, 307119, 374663, 338281, 530291, 286818, 291539, 193875, 410907, 116760, 457017, 483501, 110234, 303777, 321399, 364506, 331852, 300937, -74211, 482769, 74898, 154545, 276323, 455693, 275568, 256872, 100991, 136807, 534493, 268801, -16783, 66440, 233134, 316986, 356777, 328437, 437105, 273775, 287810, 326042, 384882, 522608, 567228, 266083, 484715, 222098, 299644, 361696, 682030, 584627, 420050, 583005, 74802, 653632, 233097, 296649, 391275, 611079, 528080]
14850E28080j78718l1494J8666r7990J09004o8467j07718k7949K65783A26296
14839B57857k6074M13504B64939J82765j14494J91204K0189j39180L78616A78219
14828C41970k719L26227k39931o5097J90653j1780L25141C09503K83424l6462
14818E56465j71378M02591j21662k7719j88436K1482j72817L44078B39887K92188
14808E32075j35314D4256P32619j31409k49374K79819p7933J91884k86058K36001
14798G39805l27319L7340L13601B56040M61913k79464J55705j01593J45987k62292
14788C76296m2724K03087K41812C02393M33148j57044l5281L57276j95239k53046
14778D52207O6802k20244M95248j64866r4840n959P5144B68414M69454C02670
$$ y = [528080, 349362, 317868, 336534, 238544, 347548, 279081, 171363, 143414, 409197, 126296, 257857, 231783, 645287, 264939, 447704, 333210, 524414, 544603, 405423, 784039, 178219, 341970, 339251, 665478, 425547, 360450, 551103, 539323, 864464, 309503, 592927, 556465, 385087, 787678, 666016, 638297, 449861, 471343, 298526, 642604, 239887, 532075, 396761, 44256, 776875, 645466, 396092, 675911, 597978, 789862, 503804, 739805, 412486, 449826, 763427, 256040, 717953, 438489, 594194, 492601, 638588, 376296, 333572, 536659, 778471, 302393, 735541, 578497, 543216, 900492, 705253, 452207, 519009, 298765, 794013, 629147, 534307, 528348, 603492, 268414, 737868, 302670]
14767G72345q3283j99281R2787L89065C15403K85992P008J57733j99347J84231
14757G51020j73701J90079j42581J88031m8362l5954N3093j34211J36696k00545
14747E83565P4327Q216Q2944j20029J03371j17826J49007P616k62784J04923M98046
14736A111376l19861j3611N031j09483j26392J61542q8245K02968M0291J18960
14726I82576j40046k23427J70921k72344L5674o7629M04777P3096l62075J44201
14716G45724r9332L27687j63354L7013k79107L6534K00287k9235L0673K39857
14706A046747K30589k82169k01496R7426K13801m75234L32076m31444L59441j47290
14696G42447J55839j42982K35310D21727M71171j75522K55693j756K63241n18875
$$ y = [772345, 689062, 489781, 582568, 971633, 315403, 601395, 608403, 766136, 566789, 751020, 577319, 767398, 624817, 812848, 764486, 728532, 781625, 647414, 784110, 583565, 657892, 666108, 749052, 629023, 732394, 614568, 763575, 771191, 508407, 613330, 1111376, 791515, 777904, 782935, 673452, 547060, 708602, 620357, 823325, 863616, 982576, 842530, 619103, 790024, 517680, 553354, 485725, 890502, 963598, 601523, 745724, 646392, 974079, 810725, 847738, 568631, 605165, 805452, 776217, 806890, 1046747, 1277336, 995167, 793671, 891097, 1104898, 629664, 961740, 530296, 889737, 742447, 898286, 755304, 990614, 421727, 892898, 717376, 973069, 971313, 1234554, 715679]
14686G15679L66391j77772K96287m1873m91496L22207k7987q0408K43538n3384
14676A071182k15163O4225K1891j04629j7133J29470M01688l06142O599j57556
14666H94432O7023n2014P0689m8031K79023j35965p106O1746m4106j1897K00056
14655A273850J5957L7450m69846L46019K11825j54080k93417k9607K36260l3236
14645A141175K34083l42578k31394N18513q4330L49329j55492k07879j01902K96445
14635A415970N0898l15037j12971K86144l62624O1850L33971o7954q6036O0397
14625A264608K28351n42574L34203q888K44308J50058m44751M39500O0980m24963
14615A300832K18000m834o4933K7176M48136l86862J14137k5865R9134m51737
$$ y = [715679, 1082070, 904298, 1200585, 1158712, 667216, 989423, 961436, 881028, 1124566, 1071182, 856019, 920244, 942135, 837506, 820373, 949843, 1351531, 1045389, 1051988, 894432, 961455, 909441, 980130, 932099, 1211122, 1075157, 1068051, 1129797, 1085691, 1073794, 1273850, 1289807, 1327257, 857411, 1203430, 1415255, 1261175, 967758, 938151, 1174411, 1141175, 1375258, 1032680, 801286, 1319799, 1235469, 1584798, 1429306, 1221427, 1119525, 1415970, 1466868, 1151831, 1038860, 1325004, 962380, 1024230, 1358201, 1290247, 1204211, 1264608, 1492959, 950385, 1284588, 1275700, 1520008, 1670066, 1225315, 1664815, 1725795, 1300832, 1518832, 1513998, 1449065, 1476241, 1924377, 1537515, 1651652, 1625787, 1724921, 1273184]
14605A273184L0243K07446j28667M23213K2876m77482J44545O4511o2570J46308
14595A643607j75173k5107L68545k01206M3960J02869j13950K16905q4863q3428
14585A692159L8358k3406J12620k10585J9687O77089p0892j99823k16589O3554
14575A882172m9084J0882J61741m39259N48620j02514K6157n8228j45207K16586
14565B051866J59550j32714J55337L1924L5251Q3865j62808K25870J91648k47714
14555B392075k21874M10324m13090N35040j38802J46467J77343l66194O37250
14546C158539j80427L71572k02782L80836K43726K22014J62969Q49833K66299
14537E272579O49491J122512K179043K097152M155295O221169P624908n28245
$$ y = [1273184, 1303427, 1510873, 1382206, 1805419, 1828295, 1350813, 1495358, 1559869, 1497299, 1643607, 1468434, 1443327, 1811872, 1610666, 1654626, 1757495, 1643545, 1860450, 1775587, 1692159, 1730517, 1707111, 1819731, 1609146, 1628833, 2305922, 2235030, 2035207, 1818618, 1882172, 1833088, 1843970, 2005711, 1566452, 2115072, 2012558, 2038715, 1980487, 1835280, 2051866, 2211416, 2078702, 2234039, 2265963, 2301214, 2385079, 2222271, 2448141, 2639789, 2392075, 2170201, 2580525, 2167435, 2702475, 2563673, 2710140, 2887483, 2521289, 3158539, 2978112, 3349684, 3146902, 3527738, 3771464, 3993478, 4156447, 5006280, 5272579, 5922070, 7044582, 9223625, 11320777, 15476072, 21697241, 29322149, 28793904]
14529B8793904q863167n377543m879028l055645j868477o35152m92357P046n64431
14520C065150k70089J55526n88550M45953p2011j57184j53886k7947J05692j08449
14510B394205J64128Q6118k90923L18378L4914k1286J58660n8495J22767m272
14500B904194Q1049r3386L68131l56802K45037P8406q5426K42642j12277Q600
14490C280168j26229p3791N34059r8661j5880r0663r7928l5531K20431r6629L84882
14479C784228l27479j1153L44001J31616J61981p1780k12486K09481O7885j03334
14469C972960j37919o5274N25545j07892j59124M14235O3783R5494J33516j90071
14459D545253M7201K19257j83061L3217p4131J66053K76044m0383L51978l07245
$$ y = [28793904, 19930737, 14553194, 9674166, 6618521, 4750044, 4114892, 3622535, 3629581, 3065150, 2795061, 2950587, 2362037, 2807990, 2735979, 2578795, 2424909, 2396962, 2502654, 2394205, 2558333, 2644451, 2353528, 2671906, 2706820, 2685534, 2844194, 2785699, 2908466, 2904194, 2985243, 2891857, 3259988, 2903186, 3148223, 3226629, 3141203, 3383845, 3271568, 3280168, 3153939, 3080148, 3614207, 3515546, 3499666, 3409003, 3311075, 3275544, 3495975, 3399346, 3784228, 3456749, 3445596, 3789597, 3921213, 4083194, 4011414, 3798928, 4008409, 4076294, 3972960, 3835041, 3769767, 4295312, 4187420, 4028296, 4442531, 4506314, 4601808, 4735324, 4545253, 4592454, 4811711, 4628650, 4661867, 4587736, 4753789, 5029833, 4989450, 5341428, 5034183]
14449E034183L9041p0052M13965n48556K19392L09561O4032j40189j23991M35669
14439E633055K24206l24763J55502J06709J4734L0970J98078K53125J1831J59329
14429F462776J02409j11040Q4391J3827K12509L03116l4798k43962K7248N34342
14419G350818l10140K82666J64117J91930j60997M66812o5020O746J23903J42229
14409H193064L05830J14231j76679L38411j08929O00682l63013J89876r265M09542
14399I493750K20749j1146R8843K7509O22886Q1912J2655l4537M27645J82225
14389A1122491K02956J12581k2055J36430K82083L29896J14433K452L2552M55971
14379A2769790N40191J38173k8008L36541O5624M84467L54162K46844O6844M04070
$$ y = [5034183, 5073224, 5003172, 5417137, 4868581, 5087973, 5397534, 5461566, 5321377, 5197386, 5633055, 5857261, 5532498, 5688000, 5794709, 5809443, 5840413, 6038491, 6291616, 6303447, 6462776, 6565185, 6454145, 6538536, 6552363, 6764872, 7067988, 7033190, 6789228, 6816476, 7350818, 7040678, 7323344, 7487461, 7679391, 7518394, 7985206, 7920186, 7926932, 8050835, 8193064, 8498894, 8613125, 8436446, 8774857, 8665928, 9266610, 8903597, 9093473, 9084208, 9493750, 9714499, 9703353, 9802196, 9829705, 10452591, 10534503, 10547158, 10512621, 10940266, 11122491, 11325447, 11438028, 11415973, 11552403, 11834486, 12164382, 12278815, 12281267, 12313819, 12769790, 13309981, 13448154, 13420146, 13756687, 13822311, 14306778, 14660940, 14907784, 14974628, 15378698]
14369A5378698q3482K78133O65907k0495M80278K59574L65096J20353O48735l01053
14359A7791744J187400N46706k51090Q02206K8556L89723Q02556L69830J08040
14350B1775671P21541K34761O80300L50156O27031O93405K62508N78092Q53124
14341B6776589M34601P58228N55283N85430Q46852R13972N20890Q68343P57968
14332C3018156O04828J042100O04476J032472P93894J238203J423682R46180J125221
14323D1829212J375406J148991J564046J001569J580990J441265J618634J527467
14315E3087580J647498J507877K013198K204122K052502J828021K078584K432995
14307F8852377K463330K689311K458929K774682L284464K709772L714717L464488
$$ y = [15378698, 15295216, 15573349, 16239256, 16218761, 16699039, 16958613, 17323709, 17444062, 18092797, 17791744, 18979144, 19525850, 19274760, 20076966, 20105522, 20495245, 21297801, 21667631, 21775671, 22497212, 22731973, 23412273, 23762429, 24389460, 25082865, 25345373, 25923465, 26776589, 27211190, 27969418, 28524701, 29110131, 29956983, 30870955, 31391845, 32260188, 33018156, 33622984, 34665084, 35269560, 36302032, 37095926, 38334129, 39757811, 40703991, 41829212, 43204618, 44353609, 45917655, 46919224, 48500214, 49941479, 51560113, 53087580, 54735078, 56242955, 58256153, 60460275, 62512777, 64340798, 66419382, 68852377, 71315707, 74005018, 76463947, 79238629, 82523093, 85232865, 88947582, 92412070]
14299I2412070L495007M342273L810404L984991M815636M683459M945845N600791
14291A28090476N619158N844563O279087O884622P017207P482291Q055096Q122368
14283A83394868Q892868R577563R396759J0684612J0590202J1185819J2381437
14276B56104128J2408240J2898532J3377858J3964892J4408563J4274194J4498533
14269C51934940J3757999J3305975J2877181J2007037J1354113J0462918R167267
14262D34867430Q101358O905842N810596M942952K836001J017788J9823j256066
14254D63245724m582329o960703o910540r440036j1439391j1761784j2393869
14247C99757072j2789581j3024168j3588524j3359626j3513601j3418665j3298643
$$ y = [92412070, 95907077, 100249350, 104059754, 108044745, 112860381, 117543840, 122489685, 128090476, 133709634, 139554197, 145833284, 152717906, 159735113, 167217404, 175272500, 183394868, 192287736, 201865299, 211262058, 221946670, 232536872, 243722691, 256104128, 268512368, 281410900, 294788758, 308753650, 323162213, 337436407, 351934940, 365692939, 378998914, 391876095, 403883132, 415237245, 425700163, 434867430, 442968788, 449874630, 455685226, 460628178, 463464179, 464481967, 464501790, 463245724, 458663395, 451702692, 444792152, 435352116, 423912725, 412150941, 399757072, 386967491, 373943323, 360354799, 346995173, 333481572, 320062907, 306764264]
14240C06764264j2548648j2840765j1720345j1673809j1361960j0939573j1170807
14233B24508357j0151507j0174845r537861r786159q560609q291610p993011p258521
14225A52754234o703824o531115o250363n528359n759890m770892m904974m967367
14217A07337450l643661m200059l727360l731309l510388l674430k597554k670491
14209G9582198l355858k431227k621018k117790k497100k453233j868350k243584
14201E9994038j736775j963179j568843j514728j528367j536838j655243j386611
14193D7103454j049121r63589j121828j557507j155294j303326r98278q24292
14185C8130219r47231j043837r30250q23880p15410j251764p59032l62360j226909
$$ y = [306764264, 294215616, 281374851, 269654506, 257980697, 246618737, 235679164, 224508357, 214356850, 204182005, 194644144, 184857985, 176297376, 168005766, 160012755, 152754234, 146050410, 139519295, 133268932, 127740573, 121980683, 117209791, 112304817, 107337450, 103693789, 99493730, 95766370, 92035061, 88524673, 84850243, 82252689, 79582198, 76226340, 73795113, 71174095, 69056305, 66559205, 64105972, 62237622, 59994038, 58257263, 56294084, 54725241, 53210513, 51682146, 50145308, 48490065, 47103454, 46054333, 45090744, 43968916, 42411409, 41256115, 39952789, 38954511, 38130219, 37182988, 36139151, 35208901, 34385021, 33669611, 32417847, 31658815, 31296455, 30069546]
14176C0069546o47791q45404q9714j022970m16640o76924o74480n30418n57029
14167B4608176n59700o14806j54103q94510k02877l78675o41631o00061l32433
14158B0229380m76440r1552l88346m12935k88723m71262n14209q7010k70308l50119
14148A6878476k46438l05101k89693j43747o47475J72086m04936o00519Q1995
14139A4494648k48432m87440j97611k61918j90168j8194n45616k3046j63715l75405
14129A1983103k528j27924k56350l51655K21139n98055j24310J79425m80474M7801
14119A0490172K83278q62627N5163l7119j38104k72992k3863k54210k37097K84187
14109I286788m78233k5177l1481k79351J0636j23659j23403k6190j4268k41158
$$ y = [30069546, 29421755, 28576351, 28486637, 27463667, 27047027, 26370103, 25695623, 25165205, 24608176, 24048476, 23433670, 23279567, 22385057, 22182180, 21803505, 21161874, 20561813, 20229380, 19752940, 19661388, 19273042, 18860107, 18571384, 18100122, 17585913, 17498903, 17228595, 16878476, 16632038, 16326937, 16037244, 15893497, 15246022, 15418108, 15013172, 14412653, 14494648, 14246216, 13758776, 13561165, 13299247, 13109079, 13090885, 12545269, 12522223, 12358508, 11983103, 11980575, 11852651, 11596301, 11244646, 11465785, 10867730, 10743420, 10922845, 10442371, 10490172, 10773450, 9910823, 9965986, 9928867, 9790763, 9517771, 9493908, 9239698, 9002601, 9286788, 8808555, 8783378, 8751897, 8472546, 8483182, 8359523, 8236120, 8209930, 8195662, 7954504]
14099G954504m1036k09769k1845k34386J346j79318N8738k91961J38922j49488
14089G025707J30336m13329J22170l93221K4853L77525m36609k68617L10775m93517
14079E986073K52777k65901J66828M2507k90813k36051J40382N7066j80501r0598
14069E581769Q7711O5385k94605o0516L57396k19673k86881n3205j34079k39014
14059D804288L26173L1111O1718l68876k54318K44135o32561O93215m94962J41081
14049D551004k8280Q5243l22921J20584r7992J91298l0174l29803J48672j06455
14039D181176k7562o2747k71565j29851J07048j55705l7818L25533q5692k30401
14029C612416K73029K9957l08021K4427j07913Q9121k0567j53261J92782m45298
$$ y = [7954504, 7913468, 7703699, 7681854, 7447468, 7448814, 7269496, 7328234, 7036273, 7175195, 7025707, 7156043, 6742714, 6864884, 6471663, 6496516, 6874041, 6437432, 6168815, 6479590, 5986073, 6238850, 5972949, 6139777, 6182284, 5891471, 5655420, 5795802, 5852868, 5672367, 5581769, 5669480, 5734865, 5440260, 5379744, 5737140, 5517467, 5230586, 5177381, 5043302, 4804288, 5130461, 5161572, 5223290, 4854414, 4600096, 4844231, 4211670, 4904885, 4409923, 4551004, 4522724, 4607967, 4285046, 4405630, 4307638, 4498936, 4468762, 4138959, 4287631, 4181176, 4153614, 4090867, 3819302, 3689451, 3796499, 3640794, 3602976, 3928509, 3842817, 3612416, 3885445, 3915402, 3607381, 3631808, 3523895, 3613016, 3592449, 3439188, 3631970, 3186672]
14019C186672K00418J53657k13486j02729N120r3543j45462M79175K9685j66052
14009C333455j56485M9831m40112K16723Q0948R1133o8296k52547Q236m751K34649
13998C092784n14921L3306K66000l67787j0652O89559n21225J76192n5013l47025
13988B441218K05239j4562K10575n23348o0265l0496M06186J70593J44999P23673
13978C673812j49629J52282P51640J111566J665955L755354N921559R083568K624167
13969B8590274o898327o793671m139747k888341j331234r31395n90952m78053
13961D538554n04934Q4355n27944o9150k18278N0554k29224p246l07850j09571
13951B699266J67624l1692k40155p1756J50208l53352J76655j63652L88370n36560
$$ y = [3186672, 3387090, 3540747, 3327261, 3224532, 3229652, 3136109, 2990647, 3469822, 3499507, 3333455, 3176970, 3226801, 2786689, 3003412, 3084360, 3175493, 3107197, 2854650, 2862886, 2858135, 3092784, 2577863, 2611169, 2877169, 2509382, 2498730, 3188289, 2667064, 2843256, 2788243, 2441218, 2646457, 2631895, 2842470, 2319122, 2258857, 2228361, 2634547, 2805140, 2950139, 3673812, 3524183, 3676465, 4428105, 5539671, 7205626, 10960980, 16882539, 25966107, 28590274, 21691947, 14898276, 10758529, 7870188, 6538954, 5607559, 5016607, 4538554, 4033620, 4117975, 3590031, 3520881, 3302603, 3353157, 3123933, 3116687, 2808837, 2699266, 2866890, 2835198, 2595043, 2523287, 2673495, 2320143, 2496798, 2333146, 2721516, 2184956]
13941B184956O3938J06250k76755O0757k15217P0779R1811K34943j40887M5690
13931B226265l03407O4279J45885j13075J10542O3034r4613j81990j68808J40472
13921A888584J9516K89300k61360O3209k52927R2495k11922L01661j55084K13090
13911A986562o4818l91539N05969m70243J40106q3386k8847j79413L99863l11854
13901A502400J56542K83459m32001N1967J38136q4727K3875m1710k52670q1029
13891A264242J83652m5819j11187O18624m42331P8322J89767n12912J34308J04591
13881A461257K23452l41611o7263Q1444K84023n2110j85061J71890l79172K39477
13871A436326J23221j76773L143j34574J81479k0337k22204J30628k717J48128
$$ y = [2184956, 2248894, 2355144, 2078389, 2139146, 1923929, 1994708, 2086519, 2321462, 2180575, 2226265, 1922858, 1987137, 2133022, 2019947, 2130489, 2193523, 2098910, 1916920, 1748112, 1888584, 1908100, 2197400, 1936040, 1999249, 1746322, 1838817, 1626895, 1928556, 1773472, 1986562, 1921744, 1530205, 2036174, 1565931, 1706037, 1622651, 1593804, 1414391, 1814254, 1502400, 1658942, 1942401, 1510400, 1562367, 1700503, 1615776, 1639651, 1597941, 1345271, 1264242, 1447894, 1402075, 1290888, 1909512, 1467181, 1545503, 1735270, 1222358, 1356666, 1461257, 1684709, 1343098, 1275835, 1357279, 1641302, 1589192, 1404131, 1576021, 1196849, 1436326, 1559547, 1382774, 1385917, 1251343, 1432822, 1412485, 1190281, 1320909, 1318192, 1466320]
13861A466320K09773m59863K13041l19134K42839J02349O5015j13368l8489k08224
13851A160259k05256L1833K34352r7732J72925l03406N0910M27722l44044K04744
13841A332307l08239p1142L95614k07347K01685j97757j04018J87170j79149j12241
13831I36883J16739J70551k10985J22322k77354L66941m18132L85290j61277Q0725
13821A111703r4589L8974p2155j91449L44516q0740K67344n21621L86265J10626
13811A298874m80329K04018o119J71972j63301Q1602j06262K73561j6281n4540
13801A203195m5550l08907Q5028P4025o9612j76874J25535P6329k50060J79754
13791H92863J2743l48231J53335J08640J39262J84749p9281l23356K87770k80443
$$ y = [1466320, 1676093, 1216230, 1429271, 1110137, 1352976, 1455325, 1520340, 1406972, 1368483, 1160259, 955003, 986836, 1221188, 1123456, 1296381, 992975, 1043885, 1471607, 1127563, 1332307, 1024068, 952926, 1348540, 1141193, 1342878, 1145121, 1041103, 1228273, 1049124, 936883, 1053622, 1224173, 1013188, 1135510, 858156, 1225097, 806965, 1192255, 1030978, 1111703, 1017114, 1056088, 983933, 792484, 1137000, 1056260, 1323604, 801983, 1188248, 1298874, 818545, 1022563, 1016444, 1188416, 1025115, 1106717, 1000455, 1274016, 1257735, 1203195, 1157645, 848738, 933766, 1007791, 938179, 761305, 886840, 963169, 713109, 892863, 905606, 557375, 710710, 819350, 958612, 1143361, 1064080, 740724, 1028494, 748051]
13781G48051K7529p6276Q217j00663J74588r8336O3888R7217j6668J35844k35976
13770G27415L13000m74934O0989K49540N0675q1248m5809K46187l88151J81893
13760H39557j36819K66459L75631n70253j17643J15897j43968r8074M38140l17381
13750F51546L49560l02057j03998K13596J00391D53486N10005n299j81194j75540
13740F01458K73438j26435k76538M84779k75105J6727K28402j29598J83436j99861
13730G80703j15087N9138j69800L11158l29564L25290j1841J2185r1508j41337
13720F29337K5500J95468J82415m84977L24275j44386r1370J13783J11275C97328
13709E31861K94799j14442R6440C70722J5806K18823j08533P9496p2900k3528
$$ y = [748051, 775580, 699304, 707521, 606858, 781446, 683110, 746998, 844215, 827547, 963391, 727415, 1040415, 565481, 626470, 876010, 926685, 845437, 799628, 1045815, 657664, 839557, 702738, 969197, 1344828, 774575, 656932, 772829, 628861, 530787, 968927, 651546, 1001106, 699049, 595051, 808647, 909038, 453486, 963491, 958192, 776998, 601458, 874896, 748461, 471923, 956702, 681597, 698324, 926726, 797128, 980564, 780703, 665616, 724754, 554954, 866112, 536548, 861838, 849997, 862182, 770674, 629337, 654837, 850305, 1032720, 547743, 872018, 727632, 636262, 750045, 861320, 397328, 531861, 826660, 712218, 808658, 370722, 386528, 605351, 496818, 576314, 503414, 479886]
13699D79886L09791k75602l9378J78410k101k20144L93589O7706k75217P7575
13689F94515k61865K40925k45675K93099k02083L28323k89019k41624L40563k85531
13679C71628L69741C66872K57536M3330k14608K47294K3764j91465m164p0224
13669D58335O2791j56237K04745k56191M00426J36931j75160j71659L12807k30616
13659E86172J16172l15739P9417A86557L01738K69577N5711k6681C70217O9696
13649D39913N4555j19831K10085p7881j25457q6142O89095D10281K91168k95656
13639D05793A67842J75957K79193j81243R1934J31934j87081K62861B33102M42473
13629F75575J9313l08020k9905N0842J10778J47753j01629M5647J22373l64642
$$ y = [479886, 789677, 514075, 474697, 653107, 651006, 430862, 824451, 892157, 616940, 694515, 432650, 673575, 427900, 720999, 518916, 847239, 558220, 316596, 657159, 371628, 741369, 366872, 624408, 667738, 453130, 700424, 724188, 532723, 528559, 458335, 521126, 364889, 569634, 313443, 713869, 850800, 675640, 503981, 816788, 586172, 702344, 386605, 466022, 186557, 488295, 757872, 813583, 786902, 370217, 439913, 494468, 374637, 584722, 506841, 381384, 295242, 984337, 410281, 701449, 405793, 167842, 343799, 622992, 441749, 533683, 665617, 478536, 741397, 233102, 675575, 694888, 386868, 356963, 407805, 518583, 666336, 564707, 610354, 732727, 368085]
13619C68085J3726K86574G7120M46490J93459k79121l7677P9316R3287K23576
13609G96450l00834J79225k81522r6292K35427L9142k26358n3383K52842k50984
13599B93713N82539C09507K03509r4721B6437L58432P3154j88467L12973A28274
13588D09184m9172J97954j44068J78254h8044F28506A35734K33671A57228J71260
13578C28488K24543p3471k20432L25929L30692l69227o6519k13591K01895q6000
13568C82307J7775r1055L11798Q6976k79325p1634Q4575p4599J69997A63352J99392
13557C62744K7372J06600A96522K66833j30342J42534k06067Q7868Q788m7621
13547C18515m286J3051M4101K47747k3071A95318J52191K4630N511A56932N18267
$$ y = [368085, 381811, 668385, 77120, 523610, 717069, 437948, 400271, 479587, 572874, 796450, 495616, 674841, 393319, 297027, 532454, 571596, 345238, 291855, 544697, 293713, 876252, 309507, 513016, 418295, 26437, 384869, 458023, 269556, 582529, 128274, 409184, 360012, 557966, 413898, 592152, -88044, 628506, 135734, 369405, 157228, 328488, 553031, 479560, 259128, 585057, 915749, 546522, 480003, 266412, 468307, 382307, 400082, 309027, 620825, 707801, 428476, 356842, 441417, 366818, 536815, 163352, 362744, 390116, 496716, 196522, 463355, 333013, 475547, 269480, 357348, 366136, 318515, 314229, 327280, 371381, 619128, 596057, 195318, 347509, 372139, 377650, 156932, 675199]
13536F75199G5097K55505n4366m8648N5701L42823j69616E9856P07916C03343
13525I0898K55488r0367m6373J67215J22123j13359j38855J39469M1164D7874
13514B07885K69939A34051L26860j86754L25309k24402O8447B05479J34408R0164
13504D30051j10902A07334L88222l138A88798L55457q5328o8936j55614k8924
13494B05453K0168K388J74257o529q4584j02946C4128M46068j95646j11430L58618
13483E31738k06808n178j00594M31467i0533E03992B0250L93864A98344H9730
13472B41447J80416O8909D0021M14273m3774K37494B8798N55362A62185J14329
13462B76514O4136J4864N5487a5135A41336O7453p4936b6382C68704H8544K34067
$$ y = [675199, 75097, 330602, 276236, 227588, 283289, 626112, 456496, 59856, 767772, 303343, 90898, 346386, 256019, 209646, 376861, 498984, 385625, 246770, 386239, 427403, 47874, 207885, 477824, 134051, 460911, 274157, 599466, 375064, 443511, 205479, 339887, 430051, 319149, 107334, 495556, 492418, 188798, 544255, 458927, 389991, 234377, 205453, 225621, 228009, 402266, 395737, 311153, 208207, 34128, 480196, 284550, 173120, 531738, 324930, 319752, 219158, 650625, -90533, 503992, 20250, 414114, 198344, 89730, 241447, 421863, 490772, 40021, 454294, 410520, 648014, 28798, 584160, 162185, 276514, 340650, 355514, 411001, -15135, 141336, 208789, 133853, -26382, 368704, 88544, 322611]
13451C22611K79664A96704J945P1332k4666J50233a09870G7757J15680K33775
13441D27212j66323r1458N694J76446m7270A7481J77728N602K01964j55757L0437
13430B77455J15494r2977P1584b49034B14430J11315a5374C91619j07780P1400
13420C55239A75183M0960K20436o8301K240p9787G3791L74211k15734d9790C50483
13408B71066D2736K47113r3279K27738A64233K92950a95301A39708P6185r1174
13398A24719n9458C1381a30440A57552k5292K67619j85840J68864k0980J2389
13388C74312J02709k03524J81689A79066l6382i8084D04164j57579J32748C0132
13377F3030J46373L33930A54460J77498l8918l8177m4660J88542j77594J09171
$$ y = [322611, 602275, 196704, 198649, 269981, 245315, 395548, -109870, 77757, 193437, 427212, 260889, 169431, 175125, 351571, 304301, 17481, 195209, 200811, 402775, 247018, 277455, 392949, 299972, 371556, -249034, 214430, 325745, -15374, 391619, 283839, 355239, 175183, 216143, 436579, 368278, 370518, 290731, 73791, 448002, 232268, -49790, 350483, 271066, 42736, 289849, 196570, 424308, 164233, 457183, -195301, 139708, 215893, 124719, 65261, 31381, -130440, 157552, 132260, 399879, 214039, 382903, 361923, 374312, 477021, 273497, 455186, 179066, 142684, -98084, 404164, 246585, 379333, 30132, 63030, 209403, 543333, 154460, 331958, 293040, 254863, 210203, 398745, 221151, 330322]
13367C30322j4647j16264l1499M3541K07154m854A42580O2804p9567E7412L01272
13356C58684J51999o8728g4158B98310a9581C00941J84077f7631A46572L51215
13346D97787B27396i5347C9761J33926J30259j45567P0673Q8401k0626a63966
13335D05430N5093j82622R5781j84602K5756J01423J23188I1718J83350C3466
13324A38105c1532D1883K25115D0684M9621K58383h037C00060Q5782a8324B55944
13312B39481n103e2131A40516a7225C75076k2531o0637J13259j5887E3263J50712
13301B03975N7637K5947E0445J93001K98258B63162N2241j36373a13511B14150
13290B64644Q8180C624K23650J32876R4617c157A62114c4177J732l3516C33008
$$ y = [330322, 315675, 199411, 167912, 211453, 418607, 413753, 142580, 205384, 125817, 57412, 358684, 510683, 441955, -74158, 298310, -19581, 300941, 485018, -67631, 146572, 497787, 227396, -95347, 39761, 173687, 303946, 158379, 229052, 317453, 296827, -163966, 405430, 460523, 277901, 373682, 189080, 214836, 316259, 439447, 91718, 275068, 33466, 138105, -31532, 41883, 266998, 40684, 90305, 348688, -8037, 300060, 385842, -18324, 255944, 239481, 234378, -52131, 140516, -17225, 375076, 352545, 291908, 405167, 389280, 53263, 203975, 261612, 287559, 50445, 243446, 541704, 263162, 315403, 179030, -113511, 214150, 264644, 352824, 3624, 227274, 360150, 454767, -3157, 162114, -34177, -32445, -65961, 333008]
13278A57253J5721K1924m6939m906j6101m5938J67479L84583k45898A5881K87955
13267C03836A33785J92483D9672a13473A5056L5544M1259M5454a11801B25502
13256D20777j47900a55022D77709p9491J11429A5432R6314J5746J10782I8325
13245B39145E6064N4128J77137G6975d0729C31225b3492j52196b724B4868J94438
13234B19306L62606A81068D5074L03867C4098n102P51c7795M412H6338j9666K9032
13222I5704j7179J13705E5552A2541J43344j15J45081a46258C03739j37649a28236
13210a97487D19344j7651A83832R2127I2903J75692J23142I6760b9889A75922
13199C29546j56791J09221H5122C6192K10658J81586o4229e192B61655O4866g4902
$$ y = [157253, 172974, 194898, 147959, 143053, 126952, 81014, 248493, 633076, 387178, 15881, 303836, 133785, 326268, 49672, -113473, 15056, 50600, 91859, 137313, -111801, 225502, 420777, 272877, -155022, 477709, 398218, 509647, 15432, 111746, 127492, 238274, 98325, 239145, 56064, 110192, 287329, 76975, -40729, 331225, -23492, -175688, -2724, 24868, 219306, 581912, 181068, 45074, 348941, 34098, 28996, 29747, -37795, -33383, 86338, 66672, 95704, 78525, 192230, 55552, 12541, 155885, 155770, 300851, -146258, 303739, 166090, -128236, -197487, 419344, 401693, 183832, 275959, 92903, 268595, 391737, 96760, -29889, 175922, 329546, 172755, 281976, 85122, 36192, 246850, 428436, 364207, -5192, 261655, 326521, -74902]
13187A71714c5221B45949K16213b19933A73623J50672b1043G5138N7651J20151
13177B52940N0597B8667a1162G2121h6360C05204q209A38908o6196B1425K14950
13166B36375j05627a49435B13026A02025b83249D9696N3330K31419f8484j573
13156g0057G2480R223O05i9030b4639C7646J58628c3626m6687C28622j54067l1823
13144A42732D419J27706D7208J36443a30146B62252q2478M0969q3349O5898R5415
13133B98707d0876A2067M70932H5220N6954J99902J9751A78466C786a40023B05905
13121F3338J1459C5835g5224J5725A78019F2922K9448c4329A33475n5287Q9613
13110A67801K2786P9411K49379A2099g0037E5233J19013J83371B5819J76279M1253
$$ y = [171714, -35221, 245949, 462162, -219933, 173623, 324295, -21043, 75138, 132789, 252940, 303537, 28667, -11162, 72121, -86360, 305204, 296995, 138908, 72712, 21425, 236375, 130748, -149435, 213026, 102025, -283249, 49696, 103026, 334445, -68484, -70057, 72480, 81703, 82308, -99030, -24639, 37646, 196274, -33626, -80313, 328622, 174555, 142732, 4419, 132125, 47208, 183651, -130146, 262252, 179774, 220743, 137394, 203292, 298707, -40876, 12067, 482999, 85220, 142174, 342076, 361827, 178466, 3786, -140023, 205905, 63338, 74797, 35835, -75224, -59499, 178019, 62922, 92370, -34329, 133475, 78188, 167801, 190587, 269998, 519377, 12099, -70037, 55233, 174246, 357617, 25819, 202098, 243351]
13099B43351a31739B0436a03776B9595J16688J64263g112A48589h3837I7447d3290
13087I6703j0270f5929B37549C8744A1711i6753B27465a03959r5193B72491a40222
13075h4342K1890A6112K98327H5141h5721A95865d9779C45757B1258L67913j25552
13064B63619E6344K44132A12888o257i4944C59413A79597o0601E162Q0428J39252
13053B24842I2098J10044b5978H4329a59434B30984G3324J8979a02930A56419
13042F9339K29537J67202r2127E0410K17154k1073B1631J92878m5546F3093b9394
13030A14721K80178a38656l2714F2654K67051A44327n4246A7073J90754a48156
13019a02987A52046g4518j16373H5600a8559K266A33526P8330O1830J4228m5238
$$ y = [243351, -131739, 20436, -103776, 29595, 146283, 310546, -7112, 148589, -83837, 97447, -43290, 96703, 86433, -65929, 237549, 38744, 11711, -96753, 227465, -103959, -199152, 272491, -140222, -84342, -62452, 16112, 314439, 85141, -85721, 195865, -49779, 345757, 21258, 389171, 263619, 56344, 300476, 112888, 106631, -94944, 359413, 179597, 118996, 5162, 85590, 224842, 92098, 202142, -25978, 84329, -159434, 230984, 73324, 92303, -102930, 156419, 69339, 298876, 466078, 373951, 50410, 267564, 246491, 21631, 214509, 168963, 63093, -29394, 114721, 394899, -138656, -171370, 62654, 329705, 144327, 90081, 17073, 207827, -148156, -102987, 152046, -74518, -190891, 85600, -18559, -16293, 133526, 211856, 273686, 287914, 242676]
13008B42676r9244o2033B1378J72154n7698e4761B1567d5961o1783o7297A75107
12996C65162k3330a81710f0036o460A61168m4746a67975A13871a8196j0181H8297
12984b60141K4602C16927d1640o8747C03304D8480a6332A62813M784J44127N2976
12973C64700D4812K7958J43250F4180f3598a7316B47122K6576J7050F8234j2430
12962E5804J36921K06777d0166B43751K3151E7427K35013a6329C12053c2385o7870
12951a00255C7298j7189J18430b56229B09939a30422A52177O7268a04123q7585
12941a91708C37042A21873J25462H7253A2358a19884A09335J77085R8899j22019
12931B63300D9291a45820N0416D0818J45073b332l0405l4330p7457F1628A0115
$$ y = [242676, 143432, 81399, 21378, 193532, 135834, -54761, 21567, -45961, -107744, -175041, 175107, 365162, 341832, -181710, -60036, -66496, 161168, 116422, -167975, 113871, -18196, -28377, 88297, -260141, -235539, 316927, -41640, -110387, 303304, 48480, -16332, 162813, 167597, 311724, 364700, 44812, 72770, 216020, 64180, -63598, -17316, 247122, 273698, 290748, 68234, 55804, 192725, 399502, -40166, 243751, 266902, 57427, 292440, -16329, 312053, -32385, -100255, 37298, 20109, 138539, -256229, 209939, -130422, 152177, 219445, -104123, -191708, 337042, 121873, 247335, 87253, 12358, -119884, 109335, 286420, 385319, 263300, 49291, -145820, -95404, 40818, 185891, -2332, -32737, -67067, -144524, 61628, 10115]
12919F8065K88029g3569B37715P220I8274a51752c0862E1862O5947J59866a846
12907B6297J95862b1904o6939B78416b20046A17300l7128b66416g0288a4586A86106
12895A82254M8112b38642C31586h320H4020d439C16922a93671B33829J48164E5280
12883D00102E726K09663J22883b35693i1952B87068c59395f1209G2768a08836
12872A41331j2780a73026B82385C2489J65799n1693o3285K36776K1750C8016J03624
12861A41640m4241K2267b8515E7721m806M03578A00184P7263d8923F5650M4626
12850A10276a02037A44267P228E6283j8884b08250l7495a3597A6289K23849H5801
12838C19860a96724D6819J55285G1470b7381B56206D214J56390A0068J84783P31
$$ y = [68065, 356094, -73569, 237715, 244935, 98274, -151752, -30862, 51862, 117809, 277675, -1846, 26297, 222159, -21904, -88843, 278416, -220046, 117300, 80172, -266416, -70288, -14586, 186106, 182254, 230366, -238642, 331586, -8320, 84020, -4439, 316922, -193671, 233829, 381993, 55280, 400102, 5726, 215389, 338272, -235693, -91952, 287068, -359395, -61209, 72768, -108836, 141331, 128551, -173026, 282385, 32489, 198288, 146595, 83310, 320086, 341836, 38016, 141640, 97399, 119666, -28515, 57721, 52915, 456493, 100184, 177447, -48923, 65650, 110276, -102037, 144267, 151495, 56283, 37399, -208250, -245745, -13597, 16289, 240138, 85801, 319860, -196724, 46819, 202104, 71470, -27381, 256206, 4214, 160604, 10068, 194851, 195582]
12827A95582K69071k12983A2941L46773D5186c6103B11495n7468n8470K61548
12817C57105a09334o3312j03483h6556q5661B18287B6718L31226I2168a30690
12806B35487G3718B5197L9566K58485p2532Q3009j34808d0543B38245J24654h871
12794a84425D21447C1919a16127E3930J6923k4699K4377a47472J3628C8012Q8886
12783A26898i7002D1548d2573B59762o9822d9194b0457D58794D700d83569A81819
12771a19314A10292a5059D0375K25848q7844a10482h843B47303F4890b92636Q6983
12760b05653E9353a66108Q0839A46340d4421j6640A69059o2008K14000A31476
12749f7918C21944g0096F9198a74194C67825d28949m7351e0685C2824i3017d942
$$ y = [195582, 464653, 251670, 12941, 359714, 45186, -36103, 211495, 154027, 95557, 357105, -109334, -172646, -276129, -86556, -172217, 218287, 26718, 357944, 92168, -130690, 235487, 73718, 25197, 64763, 323248, 250716, 333725, 198917, -40543, 238245, 362899, -8871, -184425, 421447, 31919, -116127, 53930, 70853, 46154, 70531, -147472, -133844, 38012, 126898, -97002, 41548, -42573, 259762, 189940, -49194, -20457, 458794, 4700, -483569, 181819, -119314, 110292, -15059, 40375, 266223, 178379, -110482, -8843, 247303, 64890, -292636, -205653, 59353, -166108, -85269, 146340, -44421, -61061, 169059, 107051, 321051, 131476, -67918, 321944, -70096, 69198, -174194, 367825, -428949, -476300, -50685, 32824, -93017, -4942]
12737e9175J7461B61323J10858a59569O2753I8197a9895C97299a55389e2438D49257
12725a27382A76413a63610D9308d7511B97123F8719l841O6959J94511b35958A37905
12713g8025A6102f1177k88078e0904A55758m9280a08851B96981I5954b1466C56375
12701A03670a67576A1119c64833A44590c02948C92798A71913b25737P1479f0539
12690b54761L4371H4929J44641b30316C30958j28964B160J75901K61836i6026
12679a6089F6287J11952g7405A12125d966B97770D4232O0768Q7842G7893J23407
12668B01300G5156L9162Q3708h1058k07284b7507A46134a46630F832J11021a71337
12656b80224I342J25656F3881b26948H8966J90614h8445F8323c3246A79677R0496
$$ y = [-59175, -41714, 261323, 372181, -159569, -96816, 98197, -19895, 397299, -155389, -52438, 449257, -127382, 176413, -163610, 49308, -47511, 297123, 68719, 64878, 131837, 326348, -235958, 137905, -78025, 16102, -61177, -349255, -50904, 155758, 106478, -108851, 296981, 95954, -21466, 356375, 103670, -167576, 11119, -364833, 144590, -302948, 392798, 171913, -225737, -154258, -60539, -254761, -220390, 84929, 229570, -230316, 330958, 201994, 2160, 178061, 439897, -96026, -16089, 66287, 178239, -77405, 112125, -4966, 297770, 44232, 105000, 192842, 77893, 201300, 75156, 114318, 198026, -81058, -288342, -27507, 146134, -146630, 6832, 117853, -171337, -280224, 9342, 134998, 63881, -226948, 88966, 279580, -88445, 68323, -33246, 179677, 270173]
12645B70173a51757C6418h1789G894b7249A24921J99579j04896o9680C7887J13516
12634A51403l6179n3551f0181b5906j7179B6955P7735a73589F5079b63687C16273
12622B84056B8582J05624O0219C8355a33518k0166A96305K597B3394J12794R6523
12611B32711J89039r9168J7118O536j18849m7460o7931J16333J3035H6354L12856
12600C99210i1054o3952A94068P0545D8051e7892j569j80105A17497J70774G3116
12588A13519K54294j34707a18475C55055A28218J76259H6453M8445a48451I309
12577b5260B25904g054k5968B52774b61215k94753b25080J11233j29701B8651
12566A84496a19294c9935F0896J34870J2302n3035d18135B14650I6566b48265
$$ y = [270173, -151757, 36418, -81789, 7894, -27249, 124921, 324500, 219604, 149924, 37887, 151403, 115224, 61673, -60181, -25906, -43085, 26955, 104690, -173589, 65079, -263687, 316273, 284056, 28582, 134206, 194425, 38355, -133518, -153684, 196305, 198902, 23394, 136188, 232711, 421750, 322582, 339700, 346236, 227387, 179927, 111996, 228329, 241364, 86354, 399210, -91054, -155006, 194068, 264613, 48051, -57892, -59461, -239566, 117497, 288271, 73116, 113519, 367813, 233106, -118475, 355055, 128218, 304477, 86453, 134898, -148451, 9309, -25260, 225904, -7054, -33022, 252774, -261215, -555968, -225080, -113847, -243548, 28651, 184496, -119294, -39935, 60896, 195766, 208068, 155033, -418135, 214650, 96566, -248265]
12555A38882J35312F6485O4980n7109Q127a66946e6126A66162b7631D18285c1190
12543D9169e7378F7005L65265A22778d55330A53669b01299H7624L1314d2890A75878
12531F8335P7984K09081O7850A4502c2224n9834B11189n8896j079b3829j89469
12520b13298D11311e636A2298J34764d1838A45527a69486A05727e308E8264a60302
12508C8754a52395E345g2429A21639b2659A57886a1353q3137b9678B34781b84254
12496a46464p26A07183D8675j4490J13475a3438k40915C9208K4111b3614A77637
12484H6620K04291H037a4190A01422m601K6558D8756e5796B37864b15290B746
12472A29134a79038I3001a07233P929a3469j3294l4684D1298P371J93991G9415
$$ y = [138882, 274194, 66485, 131465, 74356, 82483, -166946, -56126, 166162, -27631, 418285, -31190, 49169, -57378, 67005, 432270, 122778, -455330, 153669, -201299, 87624, 118938, -42890, 175878, 68335, 146319, 355400, 423250, 14502, -32224, -92058, 211189, 152293, 151214, -23829, -213298, 411311, -5636, 12298, 147062, -41838, 145527, -169486, 105727, -5308, 58264, -160302, 38754, -152395, 5345, -72429, 121639, -22659, 157886, -11353, -94490, -29678, 234781, -284254, -146464, -147190, 107183, 48675, 34185, 147660, -13438, -254353, 39208, 63319, -23614, 177637, 86620, 290911, 8037, -14190, 101422, 96821, 123379, 48756, -55796, 237864, -215290, 2746, 129134, -179038, 93001, -107233, -99304, -13469, -26763, -61447, 41298, 48669, 242660, 79415]
12460b1963A49079g4531A23564L5509d8381B9152A3994K63364c6325B72785h6805
12448a0275n7696I9412b88488H8744B4275a59978k4159c6211J6718m5356l9308
12437a04157D10393I0053a40082b969B41560a40105M7049A31733Q122K67655e5611
12425b29294f2552A32943A4972e3095E8784O2273m6858a43629O4602j58758N8644
12414a79141A08470a51804A25376a4504A32516J05235D125J32075c4448A51933
12403B7259g295a550F7748a84444B4465g820j92585A19798P3182p7084J86380
12392C02276b89099E8478b17358j28045G9966I460N3680b39895B69105c00156
12381B15743c01779a0057C3880a52723B11464j5268a94736j02725A94196e241
$$ y = [-21963, 149079, -74531, 123564, 159073, -48381, 29152, 13994, 277358, -36325, 272785, -86805, -10275, -67971, 99412, -288488, 88744, 24275, -159978, -184137, -36211, -19493, -64849, -104157, 410393, 90053, -140082, -2969, 241560, -140105, -93056, 131733, 139855, 407510, -55611, -229294, -62552, 132943, 14972, -53095, 58784, 121057, 74199, -143629, -79027, -237785, -179141, 108470, -151804, 125376, -14504, 132516, 237751, 4125, 136200, -34448, 151933, 27259, -7295, -1550, 67748, -184444, 24465, -7820, -200405, 119798, 192980, 115896, 302276, -289099, 58478, -217358, -345403, 79966, 9460, 63140, -239895, 269105, -300156, 215743, -301779, -10057, 33880, -152723, 211464, 196196, -194736, -297461, 194196, -5241]
12370a8512A19267L944l2986J88514j32404g0479J2985l6872A58183j2539J9084
12359A64728e8412F7386c09658F5769b02427C3858f6772C11919b00838B33682
12348d9072I1583P7370a23577M1438A05521a69954j64159B38298a52610I511L04334
12337C13845H0083d1299n4301B02765a30135E0820a3045F1493b58086D8069F59
12325h4572j35770g5234E4912M1150a82951A33384a62816b045B53437L525c0551
12313D48500C5043a82345C0550Q4529a17996N7832A38147A3193d37439B81906
12302d4199C7372b25977k97B238R1989C7527g8736D605J77884n6037b46000i4481
12289D04997c2202B20005b37952Q7427a2663F9143a73421A19824c25916a18521
$$ y = [-18512, 119267, 123211, 90225, 278739, 146335, -70479, -57494, -94366, 158183, 145644, 164728, -58412, 67386, -309658, 65769, -202427, 33858, -66772, 311919, -200838, 233682, -49072, 91583, 168953, -123577, -82139, 105521, -169954, -334113, 238298, -152610, 9511, 313845, 80083, -41299, -95600, 202765, -130135, 50820, -13045, 61493, -258086, 48069, 659, -84572, -220342, -75234, 54912, 96062, -182951, 133384, -162816, -2045, 253437, 256962, -30551, 448500, 35043, -182345, 30550, 115079, -117996, -60164, 138147, 13193, -437439, 281906, -44199, 37372, -225977, -226274, 2238, 94227, 37527, -78736, 4605, 182489, 126452, -246000, -94481, 404997, -32202, 220005, -237952, -150525, -12663, 69143, -173421, 119824, -325916, -118521]
12278B12853a18375H4401J24517C830a40079A187J34253A8525L4395M5624J45113
12267B43657a04891A26607g3683k34168C70785J6206F0259M3286b46879A88712
12256B04090p9991m466J70583c77782C05798b60929D3210K0737a87044B16859
12245e5086J5611I7478H263M6862M8314A5727f3167m5853B84488q6861g2657A02473
12232A20919K0583a08641B58644a04313B40464n7357K18226H7984K90855a25511
12221g9137A12851D0482c3125n057B02459c0428A48700k463R5947F3155P8721
12210A41876J15858R0713A23210J66711H8748M1519L58144a39094B68784r8523
12200A70261K35994j54184f5496a3778B61086a21521r4973J04205C65928D9749
$$ y = [212853, -118375, 84401, 208918, 3830, -140079, 1187, 135440, 18525, 52920, 98544, 243657, -104891, 126607, -73683, -307851, 370785, 386991, 60259, 103545, -246879, 188712, 204090, 124099, 119633, 290216, -377782, 305798, -260929, 43210, 63947, -187044, 216859, -55086, -39475, 97478, 8263, 55125, 103439, 15727, -63167, -109020, 284488, 197627, -72657, 102473, 120919, 141502, -108641, 258644, -104313, 240464, 183107, 401333, 87984, 378839, -125511, -79137, 112851, 40482, -33125, -38182, 202459, -30428, 148700, 146237, 242184, 63155, 141876, 257734, 348447, 123210, 289921, 88748, 130267, 488411, -139094, 268784, 170261, 406255, 252071, -65496, -13778, 261086, -121521, -216494, -112289, 365928, 49749]
12189G0809a20846A75139l7679K21811a7909q0034A28907c25573A38934l3835
12179A05099J24521A09814d7891A9522K80321O9485a11831C99809h8537b2958
12168E4268Q4529a32651G3759O2558R4774a46072B1865H443P0254p18c4625j73528
12156b08153A19409a4295k04055b0744A50159b43383B25978I2218j7013L72728
12146D47933i0136A35828h5697D74628A807J59390b6080B14531P911p2859E2370
12134b34449M4385C90875A47365j6909F2588f2715I3002f9461D9657K70775D5879
12122G5943J86564j06105K16151a07485B38304H5059O4227k945D9324d0612A67292
12110d1825F3401K05077a18885I9057j0178J79942G3123J75452h3757l4942B00369
$$ y = [70809, -120846, 175139, 137460, 359271, -17909, -97943, 128907, -325573, 138934, 105099, 229620, 109814, -47891, 19522, 299843, 369328, -111831, 399809, -88537, -22958, 54268, 138797, -132651, 73759, 136317, 231091, -146072, 21865, 8443, 78697, 77979, -34625, -208153, 119409, -14295, -218350, -20744, 150159, -243383, 225978, 92218, 75205, 447933, -90136, 135828, -85697, 474628, 1807, 161197, -26080, 214531, 222442, 149583, 52370, -234449, -190064, 390875, 147365, 130456, 62588, -62715, 93002, -69461, 49657, 320432, 45879, 75943, 262507, 156402, 372553, -107485, 238304, 85059, 149286, 146341, 49324, -40612, 167292, -41825, 63401, 268478, -118885, 99057, 88879, 268821, 73123, 248575, -83757, -118699, 200369]
12098B77828a03276H0220B8087a56851B22581a9740n5312j1152a4137D7042e4959
12086c18631J31280A25970a33150A67859f810C49352j65619c4153p943A13565
12075d1229J7778A86772c72961J36824B78385b3131A94265b21912H3145a64458
12064F07988B79808j08469b07520j03552A5215J92494C2809j2146a95662Q8048
12054a07614k23471a04331c5953j83557r6568B19200C2964K61784a78899B34768
12043e6087l3497l0584d5329m2929a5231k50505d0214l538A49949c13737L549
12032c10188C6173c06088A39810a61796H9014p73R2512E0806F054g6863B54707
12020E93924K35385B89461o2990M5661j5750C8198N892K428b6189j12136b3665
$$ y = [277828, -103276, 80220, 28087, -156851, 222581, -19740, -75052, -86204, -14137, 47042, -54959, -318631, -187351, 125970, -133150, 167859, -6810, 349352, 183733, -34153, -42096, 113565, -41229, -23451, 186772, -372961, -236137, 278385, -23131, 194265, -221912, 83145, -164458, 607988, 279808, 171339, -207520, -311072, 15215, 207709, 32809, 20663, -195662, -107614, -331085, -104331, -35953, -219510, -316078, 219200, 32964, 294748, -178899, 234768, -56087, -89584, -120168, -45329, -88258, -15231, -265736, -40214, -43752, 149949, -313737, -310188, 36173, -306088, 139810, -161796, 89014, 88241, 180753, 50806, 6054, -76863, 254707, 593924, 829309, 289461, 226471, 272132, 256382, 38198, 44090, 46518, -26189, -138325, -23665]
12008i3872A96046Q3665b11879a1274A35807i625k41877c4961j72132d9276B66715
11996B9064a49801k5366D5355b70497D0621L85507k0716c38487g1930q4363H6288
11984h0167b3232j46439r2859J11725c4875j20487l2921C72334a43057J1399a3101
11972B58797a65595k0713k2452A0145a8598B94451a50966M7734B41600a07266
11961D16964f8267A10181B2345L8985a6708D4108b08012F8992a17601A12888J54227
11950B67115a65810I6331j6114P3008N0819p6715l4620b55313H899L2288i4851
11938A00660b8119j21597A58836n8259c5140H6307B9122a33289B51862C5512Q1248
11927A16760a42519L6901J7235B77836j22608M6194L8245b65401C44855a02835
$$ y = [-93872, 196046, 279711, -211879, -11274, 135807, -9625, -251502, -34961, -207093, -49276, 266715, 29064, -149801, -175167, 45355, -270497, 40621, 426128, 405412, -338487, -71930, -156293, 86288, -80167, -23232, -169671, -262530, -150805, -34875, -155362, -188283, 372334, -143057, -131658, -13101, 258797, -165595, -186308, -208760, 10145, -18598, 294451, -150966, -103232, 241600, -107266, 416964, -68267, 110181, 22345, 61330, -16708, 44108, -208012, 68992, -117601, 112888, 267115, -165810, 96331, 80217, 153225, 204044, 127329, 92709, -255313, 8899, 41187, -94851, 100660, -28119, -149716, 158836, 100577, -35140, 86307, 29122, -133289, 251862, 35512, 116760, -142519, -105618, -88383, 277836, 155228, 201422, 239667, -265401, 344855, -102835]
11916c0354c394A68706h0150C12337c34577I0982a12907j71979R7390q4163A72783
11904B8611a50312g3027B25727I197c74935F0451J2612J24666b12211I9083c2743
11892H3164b72869e211D4551N4483b07227f6340A53784F4673a8922n9148K2682
11881e5388j18886n9997b5419J0321j49469A2322b169A24168b6002j957k08861
11870b36820B98073A7609M9460c02390J46096D0167L7629f5749A08049C1916h6457
11858A8961M299b25710p3287B20912J93894A47808a88683c752k23354A48155a36199
11846a09454l2345m16362A29198d56151a19977A21025b42667J19643e2317K3820
11836b8497k08585H1401C8506a26513l1104H0977g8801A67785a17390a1212j18563
$$ y = [-30354, -3394, 168706, -80150, 312337, -334577, 90982, -112907, -284886, -187496, -271659, 172783, 28611, -150312, -73027, 225727, 9197, -374935, 60451, 73063, 197729, -212211, 99083, -32743, 83164, -272869, -5211, 44551, 99034, -207227, -66340, 153784, 64673, -18922, -78070, -55388, -174274, -234271, -25419, -15098, -164567, 12322, -2169, 124168, -26002, -27959, -236820, 298073, 17609, 67069, -302390, -156294, 40167, 77796, -65749, 108049, 31916, -86457, 18961, 23260, -225710, -298997, 220912, 414806, 147808, -188683, -3752, -227106, 148155, -136199, -109454, -141799, -558161, 129198, -456151, -119977, 121025, -242667, -123024, -52317, -28497, -237082, 81401, 38506, -126513, -157617, 80977, -78801, 167785, -117390, -11212, -129775]
11825a29775j64464A14024k4992A6375c73414A53552j6711L0451b50606A42629
11814g0010F9520e93375C6495b0942I2084b05352A13098d66B32716B0934P4097
11803I5031a03941m2255L1829A37834a6624B31192c54962D9481L92703c2277k8396
11792f0673q6328j8024D1196n358b04905a157k71305h4795H2715c2084R535n8997
11780h1546F9156A4267K29882a16172A66482c70462A6646K92764b48267a22659
11769c89343B7577N9156J25525N5800A2778b64518b4110B60133a37599j84588
11759c22187H0760b71480b6210m9076A30584a08328A62793p4484M599k1087a72018
11747a06021I4511B8683c39485d6718o8662J517r4616B403Q2300K9730a33579
$$ y = [-129775, -294239, 114024, 89032, 16375, -373414, 153552, 136841, 167292, -250606, 142629, -70010, 69520, -593375, 36495, -20942, 92084, -205352, 113098, -466, 232716, 20934, 95031, -103941, -146196, -114367, 137834, -16624, 231192, -354962, 49481, 442184, -32277, -60673, -147001, -165025, 41196, 35838, -204905, -1157, -272462, -84795, 82715, -32084, -22549, -81546, 69156, 14267, 244149, -116172, 166482, -370462, 16646, 309410, -248267, -122659, -389343, 27577, 86733, 212258, 268058, 12778, -264518, -24110, 260133, -137599, -322187, 80760, -271480, -26210, -75286, 130584, -108328, 162793, 88309, 92908, 71821, -172018, -106021, 94511, 28683, -339485, -46718, -115380, -113863, -208479, 2403, 84703, 114433, -133579]
11735f4360l1517B82478A20955b0635l8397A69573a10536K4217B47849a94529
11724c8151H3663a41375A53626A2411a96850B5551h7313d858B06919i435A92767
11712i7184q7830a622B07884a34717j25400H4269b35801N7292K4478A8347b5666
11700b29763d8900A17385C9614c2303j62646P0878A45796K5886g1001A71506A4709
11688A82584F7825c4749q5002L6576B1892a18683m2588A20973B4829a44325F5871
11676H9226a64974f6021j08317c1109A37350A8509b52676K47B63176b74742B43255
11664b16972A07272M3848D4186g1833B02565E0323c08141e1790B15842i2322B06789
11652B2210L0294a84662B74915A6431a41212A8998d044k2257A1262i747k5756
$$ y = [-64360, -95877, 282478, 120955, -20635, -59032, 169573, -110536, -86319, 247849, -194529, -38151, 83663, -141375, 153626, 12411, -196850, 25551, -87313, -4858, 206919, -9435, 192767, -97184, -185014, -1622, 207884, -134717, -260117, 84269, -235801, -178509, -154031, 18347, -25666, -229763, -48900, 117385, 39614, -32303, -194949, -124071, 145796, 171682, -71001, 171506, 14709, 182584, 67825, -34749, -119751, -83175, 21892, -118683, -161271, 120973, 24829, -144325, 65871, 89226, -164974, -66021, -174338, -31109, 137350, 18509, -252676, -252429, 263176, -274742, 243255, -216972, 107272, 151120, 44186, -71833, 202565, 50323, -308141, -51790, 215842, -92322, 206789, 22210, 52504, -184662, 274915, 16431, -141212, 18998, -4044, -26301, 11262, -9747, -35503]
11641c5503A10253h1582K6622q9716F8165R7476h4220r7896A32595E0978J1562
11630F2540a78978K572H5806O9178d06859a09982k4098j03547A3681g3949A7165
11618g1175A63917D7645a68321C0852B451a57518A00430J14437a03981n4233j5813
11607a74027j20277B130J6010f7959A59345a91972F1523E288h0219k09165A6005
11595C96833F7471B7103L7800M9223a50202B11563J07969G3902a91012O2861I5322
11583F8770J0335h7920j02361h906B2062b7248j30294A6939a13351G5710o121
11572F9589a13837B10117F0779K77786H4609b03021A3956O1051J65522g0241D3663
11560I0207D4733L6190l1019a63124r151g4427C73947a9302j25768c7503k09270
$$ y = [-35503, 110253, -81582, -54960, -144676, 68165, 165641, -84220, -182116, 132595, 50978, 62540, -178978, -176406, 85806, 154984, -406859, -109982, -134080, -237627, 13681, -73949, 17165, -71175, 163917, 47645, -168321, 30852, 2451, -157518, 100430, 214867, -103981, -158214, -174027, -294304, 2130, 18140, -67959, 159345, -191972, 61523, 5288, -80219, -289384, 16005, 396833, 67471, 27103, 64903, 114126, -150202, 211563, 319532, 73902, -191012, -128151, 95322, 68770, 79105, -87920, -190281, -8906, 22062, -27248, -157542, 16939, -113351, 75710, 69589, -113837, 210117, 60779, 338565, 84609, -203021, 13956, 75007, 240529, -70241, 43663, 90207, 44733, 80923, 49904, -163124, -172275, -74427, 373947, -19302, -145070, -37503, -246773]
11549b46773A8907J6099b14425a04836j983D2661g5001k30395K1756A79627a74438
11537f5468K4200H2794B2358O645c45070d5510C659i5548k71201P8809O5334A90780
11524C30454j49228c8276j20946d4909G0695J08912K858l5346O8050a83117I6348
11512B40800f3844o4912A43870D2914h1380J0003B0940J25307b9490I2679g8585
11500D8593P7474l7253M4339B0328K83423A50585b70909F9466H730J08626p08
11489A16648M8937M821E0528N2639j4994J0325L10156j90402J09447A304K00O8716
11477G0220c25668I9267A8971K43612i6678A19143C0772L5495M3546m0782n266
11466F3765M2754L00771A9937a95253M0403B4439K01366q1228K50008F2016J88356
$$ y = [-246773, 18907, 35006, -214425, -104836, -106819, 42661, -75001, -305396, -283640, 179627, -174438, -65468, -41268, 82794, 22358, 29003, -345070, -45510, 3659, -95548, -366749, -287940, -222606, 190780, 330454, 181226, -38276, -159222, -44909, 70695, 179607, 182465, 147119, 215169, -183117, 96348, 240800, -63844, -128756, 143870, 42914, -81380, -71377, 20940, 146247, -29490, 92679, -78585, 48593, 126067, 88814, 133153, 20328, 303751, 150585, -270909, 69466, 8730, 117356, 116648, 165585, 170406, 50528, 103167, 88173, 98498, 408654, 218252, 327699, 1304, 1504, 70220, -325668, 99267, 18971, 262583, -96678, 119143, 30772, 66267, 109813, 69031, 63765, 106519, 407290, 19937, -195253, -154850, 24439, 225805, 144577, 394585, 62016, 250372]
11455B50372K4933a33883A15328M01907H8085a8265A61178e9174K0543L946G5099
11443h0936B06705m8309Q0529j17353a9476B02690j8275b29138A72568G4456a77202
11431F1396d276A15791f4753H3355a79296A51767h3904A18253O1197H2337K80959
11420C63296E2858b68766A79675K80924i640j63048g9824j9290b2083l06198J42001
11409a86280D32243A56905B1378a24427R560a2955l4768k71070C5342b40641H2350
11397B4951K26238c5732j59548R6720D8802F106K40196b88413b033j27535j87486
11386c17054Q0726j41598C9515J56614M2005G5759N7884J92744g2029A08662a61674
11374A9463a98126n8586a07353A09078J30654I729e1671r7643a6974A14036N9787
$$ y = [250372, 275305, -133883, 115328, 517235, 88085, -18265, 161178, -59174, -38631, -34685, 75099, -80936, 206705, 158396, 238925, 121572, -19476, 202690, 184415, -229138, 172568, 74456, -177202, 61396, -4276, 115791, -64753, 83355, -179296, 151767, -83904, 118253, 179450, 82337, 363296, 52858, -268766, 179675, 460599, -9640, -172688, -79824, -99114, -22083, -328281, -186280, 432243, 156905, 21378, -124427, -114867, -12955, -47723, -318793, 35342, -240641, 82350, 24951, 251189, -35732, -195280, -98560, 48802, 6106, 246302, -288413, -2033, -129568, -317054, -236328, -377926, 39515, 196129, 238134, 75759, 133643, 326387, -72029, 108662, -161674, 19463, -198126, -256712, -107353, 109078, 239732, 9729, -51671, -149314, -16974, 114036, 173823]
11363A73823O6237D100K4100J6134K3233J84804o5702q9189a60597A6921h9834
11351d1482A7203a43058K5478B76251r2514h6934G3300b8481q80j93433R6228
11340a26566A89837j8137l2033J51271E6611h843A24023c1988j21587G0678C0680
11328d7609A05927J74261H0566h034B00901i6369M4826A64024A1730a05179M2348
11317f2831C1005M30287a47835j46080e0409j75253O886a8906A47996b72309N2885
11306b19424C11544e7921n364j24820q2310B9247a74087p7419a3652A80525J04219
11295B84744E6691a04504A62867c02474a13103C43192d0720d790A97417e9839
11284e7946C4557N9294a5144j7930G9962J1984b59389o2494a51407N2575B96647
$$ y = [173823, 240060, 4100, 28200, 44334, 67567, 252371, 186669, 97480, -160597, 16921, -89834, -41482, 17203, -143058, -117580, 276251, 183737, -86934, 73300, -28481, -29361, -222794, -126566, 189837, 171700, 139667, 290938, 56611, -8843, 124023, -31988, -153575, 70678, 30680, -47609, 105927, 280188, 80566, -8034, 200901, -96369, -51543, 164024, 11730, -105179, -62831, 31005, 461292, -147835, -293915, -50409, -225662, -218776, -18906, 147996, -272309, -219424, 311544, -57921, -63285, -188105, -270415, 29247, -174087, -251506, -13652, 180525, 284744, 56691, -104504, 162867, -302474, -113103, 343192, -40720, -4790, 197417, -59839, -57946, 34557, 93851, -15144, -33074, 79962, 91946, -259389, -321883, -151407, -98832, 296647]
11272A46522O0963G001c97492C66992d4832j62234j5584N9878B15533A0579a46610
11260f6616j73364P8861g7701j68405c0104I5706a512A04270a40591b8444A42526
11248C652a84179l8093g1538r2903e8073q4391k6775e6301k6211j50743l37443
11237e70698h9260C4701a0353I1020J74848a07932c4541C56917A0823L55105b44212
11225A32645K1460a80100J6927H9754h9264H620L3114c41557B33651a05776B56692
11213b95666A74497b15856A52098R8111q9744c66468J05467a9203H8590b53314
11202A43003c51222a67051B3634a79889p3168l1162H9647i7405c9377a5262r2581
11191a07843e2524B157M1431p331a77901e349A2238b90118a26097j99810A90169
$$ y = [146522, 207485, 7001, -397492, 366992, -44832, -207066, -222650, -162772, 215533, 10579, -146610, -66616, -239980, -161119, -77701, -246106, -30104, 95706, -1512, 104270, -140591, -28444, 142526, 3652, -184179, -222272, -71538, -164441, -58073, -142464, -169239, -56301, -82512, -233255, -570698, -89260, 34701, -10353, 91020, 265868, -107932, -34541, 356917, 10823, 365928, -244212, 132645, 154105, -180100, -163173, 89754, -89264, 8620, 41734, -341557, 233651, -105776, 256692, -295666, 174497, -215856, 152098, 250209, 160465, -366468, -261001, -19203, 88590, -253314, 143003, -351222, -167051, 23634, -179889, -253057, -284219, 89647, -97405, -39377, -15262, -107843, -52524, 2157, 43588, 36257, -177901, -5349, 12238, -290118, -126097, -325907, 190169]
11179D0677b44357j89536B92744a98826N1642L4117k20681C3975J69964b99224
11168h2516p541B46450A06171j359A118L54250e6009a0863A6308R762a77452g9938
11155I1801a88409A31968a18030l11823A71250e4035J6264A18272g6979B03575
11144b20852N1492A28655a96853f8855A90124b46270H8214e8637p8125c6603j65964
11133b02567e9883k02548j0532A1083b45353H5925g4915B21963E0773a60974H8822
11121C43619n8244b0502C55474j3439h509n5294F1216R8887h9620H9064d0868
11109C26349c54712D09760g0110C05205j24725e1654m0882a5186E6737a13363
11098A81914n9720b75333a15582A7726a047C59101H1029Q9649q1484O6393b0463
$$ y = [40677, -244357, -433893, 292744, -198826, -147184, -113067, -333748, 33975, 203939, -299224, -82516, -90057, 246450, 106171, 104812, 1118, 355368, -56009, -10863, 16308, 26070, -177452, -79938, 91801, -188409, 131968, -118030, -429853, 171250, -54035, -37771, 118272, -76979, 203575, -220852, -169360, 128655, -196853, -68855, 190124, -246270, 88214, -58637, -136762, -36603, -202567, -59883, -262431, -272963, 11083, -245353, 85925, -74915, 221963, 50773, -160974, 88822, 343619, 285375, -20502, 355474, 342035, -8509, -63803, 61216, 160103, -89620, 89064, -40868, 326349, -354712, 409760, -70110, 305205, 180480, -51654, -92536, -15186, 56737, -113363, 181914, 122194, -275333, -115582, 17726, -1047, 359101, 81029, 170678, 89194, 155587, -20463]
11086E32925I3408J60637A4088i9191A03365K08884o2594a06297A88920d6359
11075A91365N8303j0021J14177o6483E6930J50167k4662G4231J05537j779K5853
11064B03842A1138M1680O7388j0859L59909a25944D86907k01567p9992K0285r4207
11053A31426k1680B3494L04506J16807J7778k00656m7917L76587B31244J24712
11043C55956K9344K61627j30147k35640K25738K6876J4342A49668L96539F1685
11032E34188j22787J53092K17179j80978l4157K70213O251k27651j19238k18059
11022B78053Q33791l29050j73110J40595k44230J06259J31353k74150P9095J65947
11012G14553l9119J21887j59826r867j9933A94896M82276j23183A21346L38643
$$ y = [532925, 93408, 254045, 14088, -99191, 103365, 312249, 249655, -106297, 188920, -46359, 191365, 249668, 239647, 353824, 287341, 56930, 207097, 182435, 74231, 179768, 177989, 203842, 11138, 52818, 120206, 109347, 469256, -125944, 486907, 285340, 205348, 225633, 131426, 109746, 23494, 328000, 444807, 462585, 261929, 214012, 590599, 231244, 355956, 385300, 646927, 516780, 281140, 506878, 533754, 548096, 149668, 546207, 61685, 534188, 411401, 564493, 781672, 600694, 566537, 836750, 843001, 615350, 496112, 278053, 1111844, 782794, 609684, 750279, 506049, 612308, 743661, 469511, 548606, 714553, 675434, 797321, 637495, 627628, 607695, 194896, 677172, 553989, 121346, 459989]
11002D59989O8932l4358P8387e2409D86328R9006R1670k74127R4876K35291N2464
10991G85508j51145k99683L22415k48762N36227m51126P8954J66560j45573J03860
10981F97235j04677J03594P438C35806L05048o6624k32839L15724L0807r8426
10971E89496J66877J25767j3345m4671J35362k99864L10735J69913K72964K44333
10961A657567M5983J28275J81068O9664J44078M21876j25859k63358j54031m16132
10951A689131p6455m49049j18839N6051N297j64266J54007r2009l34398J57813
10941H27283O784j8860j04823p2368B62053P3738R4529B14758C296J28600n5680
10930G6216J49919j05307J26679a44238A59821b2412C87694Q6064F696O326M20
$$ y = [459989, 528921, 494563, 572950, -52409, 486328, 585334, 677004, 402877, 497753, 733044, 785508, 634363, 334680, 657095, 408333, 944560, 493434, 572388, 738948, 593375, 697235, 592558, 696152, 703590, 335806, 640854, 574230, 341391, 657115, 687922, 589496, 756373, 882140, 868795, 824124, 959486, 659622, 970357, 1140270, 1413234, 1657567, 1703550, 1831825, 2012893, 2082557, 2226635, 2648511, 2522652, 2259294, 2105263, 1689131, 1612676, 1163627, 1044788, 1100839, 1106136, 941870, 1095877, 1003868, 669470, 827283, 834067, 815207, 710384, 638016, 262053, 335791, 430320, 214758, 3296, 131896, 76216, 226135, 120828, 247507, -144238, 159821, -22412, 387694, 473758, 6696, 13022, 13442]
10919A3442K07827a1638A45408J64312B6483R2409C4712J93527m1179A9140K5022
10908D4162a10339E6784a11541G8449b36902I6456b6235F7554b39813A33875b46289
10896C95164C9215J34501a41258I6965b89498J15126A31103a00330J3805j01482
10886a88007A40146o0816c1871D173g8469I9104c80486a13592e144C8579b7181
10874A0039J90728e2288a2282A21376J37897J117c9948N078E6820c0802k6688
10863e7490n6692j71962A29192o1622c6869C3340a7625j60461B14895D2405J5973
10852E8378h3214H8852L4653P2972f8365j19781J1377o1833P6705A64478c6368
10840A15243b58216A40002b59944b5944B2191K2843n903a96799A48440E5618J9579
$$ y = [13442, 221269, -11638, 145408, 309720, 26483, 118892, 34712, 228239, 187060, 19140, 44162, -110339, 56784, -111541, 78449, -236902, 96456, -26235, 67554, -239813, 133875, -246289, 395164, 39215, 173716, -141258, 96965, -289498, -174372, 131103, -100330, -86525, -188007, 140146, 79330, -31871, 4173, -78469, 99104, -380486, -113592, -5144, 38579, -27181, 10039, 200767, -52288, -12282, 121376, 259273, 260390, -39948, -34870, 56820, -30802, -57490, -114182, -286144, 129192, 67570, -36869, 33340, -17625, -178086, 214895, 42405, 58378, -83214, 88852, 123505, 196477, -68365, -188146, -176769, -238602, -161897, 164478, -36368, 115243, -258216, 140002, -259944, -25944, 22191, 45034, 39131, -196799, 148440, 55618, 75197]
10829G5197c65017a41420F9058N5003b35166o4969R5006D4518P9343L0949J01051
10818B55861A25332a25380j07591A90474J4413l1174E8976c40525A65332a367
10807i9266L7680A29741L7389a39001b3933o0635I931f0115j33462E0313K912
10796E3225b63949N2734E376d1799D86007H0173b16294A8385c6243j40574A37149
10784a07365c8623r4411k43314D2332c8536I9513O5874a9529A35106b27138B02856
10772e6780q1502A8933Q9150d4644q9221o1230h8865a528D3568I714e8693k36551
10760b95244d5759A58366a54455j6445l63429D6644b15978B48609a53720F9962
10749F5803Q9741l8149E1867c52692a75583d9731b3953A1107a55667l6920P2437
$$ y = [75197, -365017, -141420, 69058, 124061, -235166, -300135, -205129, 44518, 123861, 154810, 255861, 125332, -125380, -232971, 190474, 204887, 173713, 58976, -340525, 165332, -1367, -99266, -61586, 129741, 167130, -139001, -23933, -84568, 9931, -60115, -193577, 50313, 53225, -263949, -211215, 5376, -41799, 486007, 80173, -216294, 18385, -36243, -176817, 137149, -107365, -38623, -133034, -376348, 42332, -38536, 99513, 165387, -19529, 135106, -227138, 202856, -56780, -138282, 18933, 108083, -44644, -133865, -195095, -88865, -1528, 43568, 9714, -58693, -295244, -45759, 158366, -154455, -170900, -534329, 46644, -215978, 248609, -153720, 69962, 65803, 155544, 117395, 51867, -352692, -175583, -49731, -23953, 11107, -155667, -192587, -120150]
10738a20150k2759g53k8671l15474A25537h3731A58477b25421j31109B0695M611
10727B5306a82824k2781E2247L7752g9555A9506J32944K03339b02082B91213a62481
10715a46410B29650k6729f5981k71148J35161A18088f411r7729B58853h3813B4404
10703A9423M9408b08163h9730D2454R2944a54333g2285b9557k4339C68988a67434
10691A25938a15840N6707j06406P4843r4591H0752a2003r6799A1936P1397a74543
10679c60511B46477j14938a34556H6364A9950c7483j28726g8280j68214A71005
10668d16080a9177H3066f5457K1535J5063p3359B81176f554F6843j9063J82103
10657B29883d05413a98881G765a07250F9727a26139B01870a66147e0370a5528
$$ y = [-120150, -142909, -753, -29424, -344898, 125537, -83731, 158477, -225421, -356530, 20695, 25306, -182824, -205605, 52247, 89999, -79555, 19506, 152450, 355789, -202082, 291213, -162481, -146410, 229650, 202921, -65981, -337129, -201968, 118088, -6411, -104140, 258853, -83813, 24404, 19423, 68831, -208163, -89730, 42454, 135398, -154333, -72285, -29557, -53896, 368988, -167434, 125938, -115840, -59133, -165539, -90696, -185287, 80752, -12003, -108802, 11936, 83333, -174543, -360511, 246477, 131539, -134556, 86364, 19950, -37483, -166209, -78280, -246494, 171005, -416080, -19177, 83066, -65457, -43922, -28859, -102218, 281176, -6554, 66843, 47780, 229883, -405413, -198881, 7765, -107250, 69727, -126139, 201870, -166147, -50370, -15528]
10646a88495c4300B23097a6689k09486A68259e61516a09577o6205P3238A63677
10635b8990l90j61101f4016k35985a49034F355b01038d2254B27884H8279c7274
10623A8944E210c60002A87a10700L3516A48609b7036j6833b486C64757a32691
10611B7159i408A50114a64665g9871C8408J0211j5661p665K3068b41711r5930
10600c37641h6923k44961a51505E5979a50179f5019j26238A52414f5981k53860
10590c19841k5659K6859a14976B35486E5931a80599j18388A30237h7907n9326
10580a47233A32295n3136b03754f006j92085O1154j07036O85C3934b76272B66629
10568a9566A02701L70191g0366p4173j46352k4705A9895c41948C2579f5440E2946
$$ y = [-188495, -34300, 223097, -16689, -226175, 168259, -561516, -109577, -175782, -102544, 163677, -28990, -29380, -190481, -64016, -300001, -149034, 6355, -201038, -42254, 227884, 88279, -37274, 18944, 5210, -360002, 187, -110700, -77184, 148609, -27036, -43869, -2486, 364757, -132691, 27159, -9408, 150114, -164665, -79871, 38408, 48619, 32958, 25293, 48361, -241711, -337641, -86923, -331884, -151505, 55979, -150179, -65019, -191257, 152414, -65981, -319841, -345500, -318641, -114976, 235486, 55931, -180599, -298987, 130237, -87907, -147233, 132295, 79159, -203754, -6006, -198091, -136937, -243973, -243288, 33934, -276272, 266629, -19566, 102701, 472892, -70366, -144539, -290891, -315596, 19895, -341948, 32579, -65440, 52946]
10556f0046D1725J06320d11774a42137L6933c3480A50596g3215C63971q4991a83569
10544h7512D4902a26006o6737a9003r591A72046b2919j91391R8955B01655C7565
10532a10705A8633b43588a4255o2589p8116F3878a10953D1998j269c4843q1362
10521a16205G3789l742d15815c9033o0143A3665f8845o5718A76207a4608B23929
10509A3237i9053q7917A66009D8728K7463J85798a56715G1261j2643b7052k69724
10498b96776c7078A15121e9541A44493o7526O1481E5094a26908j85907E9470e5344
10486A47622i3281O015j02311h308A3226b72344a2387j59662r41A1965a24200
10474C35516a56228H9058a76522A29875d4647B4952a13240d3353H6252d722C446
$$ y = [-60046, 41725, 148045, -411774, -142137, -105204, -33480, 150596, -73215, 363971, 278980, -183569, -87512, 44902, -126006, -192743, -19003, -28594, 172046, -22919, -214310, -115355, 201655, 37565, -110705, 18633, -243588, -14255, -76844, -154960, 63878, -110953, 41998, 40729, -34843, -116205, 73789, 70047, -415815, -39033, -99176, 13665, -68845, -134563, 176207, -14608, 223929, 13237, -99053, -186970, 166009, 48728, 76191, 261989, -156715, 71261, 58618, -27052, -296776, -37078, 115121, -59541, 144493, 76967, 138448, 55094, -126908, -312815, 59470, -55344, 147622, -93281, -87266, -189577, -8308, 13226, -272344, -12387, -172049, -172990, 11965, -124200, 335516, -156228, 89058, -176522, 129875, -44647, 24952, -113240, -43353, 86252, -4722, 3446]
10462C13470d8893A03348f7940A7228a3216j20962F5385h5409j15362E1013a96793
10450a24758a8820B54724m5576F2364g4398A24118a30477F7537I635O8512J38665
10439B16812B5010N0462b11220A99722r4766D9327a62062j12047d0077B7780d4565
10427A8733b01136f5457a1604j61443A05742c32994G5314K03332l634j28613b613
10415I8246a30157J0464m78j69174B5072a35029B4038K193R0884D9671c22936
10403A10987e9432j19101A34974c85153a01117O489A7760K41367f8147K4636C92393
10391B11722G1392c78707d9760j20011E9086J73230b49330d7160B42617f4264
10380A20433n0061g5759c7856j80625B51146B5167a6697C89317A59220n1086j4902
$$ y = [313470, -48893, 103348, -67940, 17228, -13216, -134178, 65385, -85409, -200771, 51013, -196793, -124758, -18820, 254724, 209148, 62364, -74398, 124118, -130477, 67537, 9635, 78147, 216812, 25010, 75472, -211220, 199722, 104956, 49327, -162062, -274109, -40077, 27780, -44565, 18733, -201136, -65457, -11604, -173047, 105742, -332994, 75314, 278646, 275012, 146399, -2613, 98246, -130157, -119693, -120171, -289345, 25072, -135029, 24038, 26231, 117115, 49671, -322936, 110987, -59432, -178533, 134974, -385153, -101117, -94628, 17760, 259127, -68147, -43511, 392393, 211722, 71392, -378707, -49760, -169771, 59086, 232316, -249330, -47160, 242617, -64264, 120433, 70372, -75759, -37856, -218481, 251146, 25167, -16697, 389317, 159220, 108134, 93232]
10369I3232K52307c5121A69892k080i6389C10565n2129j01933K13431r1821o4443
10358B13670J90230q3215I2838g425B06112J00345E1796K93882M9903A75653C706
10346A06455m7956L7454J5056C7558K27385F5152P5276d7918D78363B18683j9438
10335A99245M57679L7534B59451J91821r5891J68466B50944a22681A09729d1494
10324d8630J2486B08040K14953A22200h5532A62444a30141j52565e6608A59043
10313E51603j66327I3940j2848K62152j212J07077A48449A4347f7011D18009h351
10301A81680P757I2915D6155P0875P0365f580j18272A0503a06175n361j0737F1196
10288A16930f6719l7452M3297B6130e8281I792R8222a90434d5884a8667C70478
$$ y = [93232, 345539, -35121, 169892, 167812, -96389, 310565, 258436, 156503, 369934, 278113, 213670, 403900, 320685, 92838, -7425, 206112, 306457, 51796, 345678, 395581, 175653, 3706, 106455, 58499, 95953, 111009, 37558, 264943, 65152, 140428, -47918, 478363, 218683, 199245, 656924, 694458, 259451, 451272, 355381, 523847, 250944, -122681, 109729, -41494, -48630, -36144, 208040, 422993, 122200, -85532, 162444, -130141, -282706, -56608, 159043, 551603, 385276, 93940, 81092, 343244, 342032, 449109, 148449, 14347, -67011, 418009, -8351, 181680, 189437, 92915, 46155, 117030, 187395, -6580, -124852, 10503, -106175, -111536, -122273, 61196, 116930, -66719, -104171, -60874, 26130, -58281, 9792, 108014, -190434, -45884, -18667, 370478]
10276B2796Q9076b5914j990k74547k2439a15458d8917p8520A26223a59045A88889
10264b73392A100h5441B7274g0815A327a68059D6151R842a41706A08656P1003
10253A79659Q9215b02152M3259B94726b57086A36825J00022a39476I636L23154
10243C32790j26336j3138m0761p2367O6266a82797A83776b02430j07457j51628
10233d61515b10973B66761b16168B8952c25714a06751L1312B53082B2548O34a29914
10221b94311B3775g3137n7901B07356k4651f7277B15521h3808g043A85877c10295
10209e6769A91869c1222A45392G2677a03823C5030a87198i3218r140D321a44707
10197C2302L41995g3780j54473M711A41232a31376N4013B33963J18597b46500
$$ y = [22796, 111872, -25914, -27904, -302451, -324890, -115458, -48917, -127437, 126223, -159045, 188889, -273392, 1100, -85441, 27274, -70815, 1327, -168059, 46151, 55993, -141706, 108656, 179659, 268874, -202152, -158893, 294726, -257086, 136825, 236847, -139476, 9636, 332790, 206454, 193316, 152555, 80188, 146454, -182797, 183776, -202430, -309887, -461515, -210973, 266761, -216168, 28952, -325714, -106751, -75439, 253082, 22548, 23182, -129914, -294311, 23775, -73137, -131038, 207356, 182705, -67277, 215521, -83808, -7043, 185877, -310295, -56769, 191869, -31222, 145392, 72677, -103823, 35030, -187198, -93218, -102358, 4321, -144707, 32302, 374297, -73780, -228253, -223542, 141232, -131376, -77363, 233963, 352560, -246500]
10186h6130A53147A7694J24555c4449A74466b73078A61136a7l59855i6524F3154
10174a92302g4132j64150k1697a01532j04000D9913a64766j89829G7059J50005
10164B27064d2787A97937g9361j94378g9166j84021A2619J7478N0166c5445B03447
10152C12107b11971p3467B36533b28927C5386K2789a07604G943c34166B93551
10141b5131A07767c393j51000j2836H1L8358b78944d8304A73147l2279e25934
10129b4911q9364E1914a08089G5142a22239A8109b1931B32452c87875B30500D2557
10117a84744f1308A72822a47254A06359h5044j22258A09618b43955R5644C3394
10106c32230f9627B33995a74978f5310n7286l7604k3028P1193a4273j76901b5564
$$ y = [-86130, 153147, 17694, 142249, -34449, 174466, -273078, 161136, -17, -359872, -96524, 63154, -192302, -74132, -238282, -259979, -101532, -205532, 49913, -164766, -354595, 77059, 227064, -42787, 197937, -79361, -273739, -79166, -263187, 12619, 30097, 80263, -35445, 203447, 312107, -211971, -285438, 236533, -228927, 35386, 58175, -107604, 7943, -334166, 293551, -25131, 107767, -3393, -154393, -167229, 81, 38439, -278944, -48304, 173147, 140868, -525934, -24911, -114275, 51914, -108089, 75142, -122239, 18109, -21931, 232452, -387875, 230500, 42557, -184744, -61308, 172822, -147254, 106359, -85044, -207302, 109618, -243955, -148311, 33394, -332230, -69627, 233995, -174978, -65310, -122596, -160200, -183228, -112035, -14273, -191174, -25564]
10094C49567a40418b3721j63071A27665a72251a465k69863q8921J16339C23555
10083b8042A52721i0530C1476e5231A38942c7310B06291B0835j172a66278Q388
10072a57890A47343m204b00136j55881a2636q7181A63153l6358c5681m05442J62586
10061b78537e7873p419A10983K424b66540J00385O7500j46287a01456o2260G5875
10049a83337B22295c12449A62592P6821g7807B0779J93189n3807c15693C6986
10038a59894n4685d4082n7382j44611n7389E7788P742B3087J87336n7730D5463
10026B07479b9939q3850a340m03641j0975o73a280H6234g7298j65153J10511q9880
10014b21820B2560g8946j22553L6799n0975a0841A42904J28803j19503c36699
$$ y = [349567, -140418, -23721, -186792, 127665, -172251, -1465, -271328, -360249, -243910, 323555, -28042, 152721, -90530, 31476, -55231, 138942, -37310, 206291, 20835, 19663, -166278, -157890, 147343, 143139, -200136, -356017, -12636, -99817, 163153, 126795, -35681, -441123, -278537, -57873, -65292, 110983, 113407, -266540, -166155, -98655, -244942, -101456, -163716, 75875, -183337, 222295, -312449, 162592, 239413, -77807, 20779, 213968, 160161, -315693, 36986, -159894, -214579, -44082, -101464, -246075, -303464, 57788, 65530, 23087, 210423, 152693, 45463, 207479, -29939, -113789, -1340, -404981, -415956, -416629, -1280, 86234, -77298, -242451, -131940, -221820, 22560, -78946, -201499, -164700, -215675, -10841, 142904, 271707, 152204, -336699]
10003c0364o4257p9372A36840a64883F5560D448K33013B2513h4424j55616A22106
9991D2096c00260B11868H3272a17301A6681a30031d564H2495A3502a51917H4628
9979B02862H6549b77520F2203c55616f3637k07271C47538b00316i7296A76775
9968i6965j79371h0695l8628G3810b94358A27989b0176k84121f7298o2899l09867
9957d40064a51241I7780J2841c63476d1080F7314j5841J59653b19150O7991D5774
9945d7830j8203B23332b93211A71937a86802m2409a9191n9795k40137a56919C119
9933d26154D65209b04435C63900a54111a0496H8770b16751A72400A6412K38296
9923B54708g9318A16378b22171B40044e370l072j0970B66081a86434N7291j27985
$$ y = [-30364, -94621, -173993, 136840, -164883, 65560, 4448, 237461, 22513, -84424, -240040, 122106, 42096, -300260, 211868, 83272, -117301, 16681, -130031, -4564, 82495, 13502, -151917, 84628, 202862, 86549, -277520, 62203, -355616, -63637, -270908, 347538, -200316, -97296, 176775, -96965, -276336, -80695, -119323, 73810, -294358, 127989, -20176, -304297, -67298, -130197, -440064, -151241, 97780, 110621, -363476, -41080, 67314, 51473, 211126, -219150, -151159, 45774, -47830, -66033, 223332, -293211, 171937, -186802, -229211, -19191, -78986, -319123, -156919, 3119, -426154, 465209, -204435, 363900, -154111, -10496, 88770, -216751, 172400, 16412, 254708, -79318, 116378, -222171, 240044, -5370, -8442, -19412, 266081, -186434, -129143, -257128]
9912b57128h6774k2102A47561F1415R7182N2684A00315b55349J4033E5367b84051
9900a02240j813L8663J4937D0283a75103A15526a49563k42764A63107c29621h3474
9888A40499f8587n2455M3163A9387J07245b2147l70611C72724c34450Q7326a07464
9876f8854m6922n5111j00802J9969C59750a17865A22826b26924d2250h296n7669
9865f5965C5396b43249N0086L034A9670g306E9353h442n9169j29665B6848c8043
9852b60229A6677b73065A19961R5690n3156a00749I3610j5968a12729G3076J44625
9841B17701b73192J33558j54264C23588b65889B80334G9409b89892a15410B20952
9830c53360a07050j01516R5484l31662e4083A59275l0865a58489g5580l54784
$$ y = [-257128, -86774, -108876, 147561, 61415, 158597, 211281, 100315, -255349, -241316, 55367, -284051, -102240, -104053, -65390, -50453, 40283, -175103, 115526, -149563, -392327, 163107, -329621, -83474, 140499, -68587, -121042, -77879, 19387, 126632, -22147, -392758, 372724, -334450, -247124, -107464, -68854, -115776, -170887, -271689, -251720, 359750, -117865, 122826, -226924, -42250, -8296, -65965, 35396, -243249, -193163, -190129, 19670, -7306, 59353, -8442, -67611, -197276, 26848, -38043, -260229, 16677, -273065, 119961, 215651, 162495, -100749, 93610, 77642, -112729, 73076, 217701, -273192, -139634, -293898, 323588, -265889, 280334, 79409, -289892, -115410, 220952, -353360, -107050, -208566, -113082, -444744, -54083, 159275, 128410, -158489, -75580, -430364]
9820d30364b1479m41683Q1106e4027j70762B7104c02948h5723j54089B06696i0776
9808c83804B66321b43926d179k4152I7780m7314P712J89701a4127m6741L0148
9797c0720E0311K8960A3429a99059G330K1535J86439r7287b35227A6246c82778
9785a47061a2080B27672a07499j42840E9651B8993b69819d1540j26970j73687
9775c42197d7756A34825b33054M618A17473l810B9262b81554E480a05886I6479
9763a2353G2853b42567J7309p727f9668p3894E4781g0991m1500e1197j04142k61138
9751d16477E677c58926J70310j75143B13870d2015j09618C18824a64052q8950
9741b53002o8371O6349C3122a79490r5032a3481r3657E8485a02547D3242b14126
$$ y = [-430364, -21479, -463162, -382056, -54027, -224789, 27104, -302948, -85723, -239812, 206696, -90776, -383804, 266321, -243926, -4179, -28331, 97780, 50466, 58178, 247879, -14127, -60868, -30720, 50311, 79271, 13429, -199059, 7330, 28865, 215304, 118017, -235227, 16246, -382778, -147061, -12080, 227672, -107499, -250339, 59651, 28993, -269819, -41540, -168510, -342197, -47756, 134825, -233054, -228436, 117473, 113663, 29262, -281554, 5480, -105886, 96479, -12353, 72853, -242567, -225258, -232985, -69668, -143562, 54781, -70991, -112491, -51197, -155339, -416477, 5677, -358926, -188616, -363759, 213870, -42015, -151633, 318824, -164052, -253002, -321373, -255024, 33122, -179490, -274522, -13481, -107138, 58485, -102547, 43242, -214126]
9729B3581d1431A1176c68249a77776J9885l8220f2315j36941D6776L0450a74070
9717c5881A58411e2105k01851a04229j26826J03510B56244b21285J09417b6860
9706a4209j03376A82180o5235K7694b07734b846B50934I3702b2923l19682d2984
9694d5091H2052g0081B99988a6390j72004D97a01313n6887F0374J00342a71077
9682e4226l06711h6592j17879l8701A95732q4492O3068a16926A43158h0312j09960
9671a90272f0223A3126g0661b7497q0030j39758A23405d7631j2330J3090k7600
9660g4471k40588D9887J3038R089a21386j77894k38767G9074c86544B92197b14917
9648f230B80896d54477a22327A7284d991l38881E6738e9429H7783b61833e6032
$$ y = [23581, -41431, 11176, -368249, -177776, -157891, -196111, -62315, -199256, 46776, 77226, -174070, -35881, 158411, -52105, -253956, -104229, -231055, -127545, 256244, -221285, -111868, -26860, -14209, -117585, 182180, 116945, 144639, -207734, -2846, 250934, 93702, -22923, -342605, -42984, -45091, 82052, -70081, 299988, -16390, -188394, 497, -101313, -158200, 60374, 160716, -171077, -54226, -360937, -86592, -204471, -243172, 195732, 111240, 174308, -116926, 143158, -80312, -190272, -60223, 13126, -70661, -27497, -107527, -247285, 123405, -47631, -59961, -46871, -74471, -315059, 49887, 62925, 72014, -121386, -299280, -538047, 79074, -386544, 292197, -214917, -6230, 280896, -454477, -122327, 17284, -4991, -343872, 56738, -59429, 87783, -261833, -56032]
9636c30794J14299d8539R138C15819b20472N514G7850a28461M257A01283a00260
9624b55653D01024D7717b20974J2719C5653c892D765b62177a24461j69322B99973
9612F2612c1124j42271J8832A06963a56967h713j21946I8104l4251M0413L4113
9601A38379e04012a6548H379b13057p4318j28394c5883k32104g659C03725a34618
9589G895c55952H7040a23109o1441J7061p3960F5174c48311d7417J1584A1237
9577a94894b8454j03935p9153A62862R9468H592J60717c2832j7763A99604b1561
9565d4289k2143A95228p6557a19653d5684C6108a38026B43475l1675i9424n6149
9554a55573A1094a78750C0902f0629A06314a74866H2813b4832F2127a3972k17705
$$ y = [-330794, -216495, -48539, -39401, 315819, -220472, -214958, 77850, -128461, -124204, 101283, -100260, -255653, 401024, 47717, -220974, -208255, 35653, -3892, 4765, -262177, -124461, -293783, 299973, 62612, -31124, -173395, -154563, 106963, -156967, -8713, -130659, 98104, 63853, 104266, 138379, -504012, -16548, 8379, -213057, -287375, -415769, -35883, -267987, -7659, 303725, -134618, 7895, -355952, 87040, -123109, -184550, -167489, -241449, 65174, -348311, -47417, -35833, 11237, -194894, -28454, -132389, -211542, 162862, 262330, 8592, 169309, -32832, -50595, 199604, -21561, -44289, -66432, 195228, 118671, -119653, -45684, 36108, -138026, 243475, 211800, -99424, -155573, 11094, -178750, 30902, -60629, 106314, -174866, 82813, -24832, 62127, -13972, -231677]
9543b31677A3759a70399e9099j22597E9647a09783n6846J5059A32708b67046A7141
9531h0364c8301j59171B4821f140b01D29669b3092B2705Q4903j005h6653A80982
9518a68780M7549j95209c7092n4901A96986l6440E6470e2062j42794A70164Q7542
9507B57706e3691j14520J1525j29444R3185C08839i5402j60763F2218b74805i266
9495a70323B03916c64776a61975k98490g8881c2895j3760A29231l7249a47311
9484a35174A61625a01818A44958o7769M4930a07417b2618o9086j7036q8598O7029
9473a30309m5108j9044h1828J1684r5528A87188b09341A56082B984a7902k45893
9462b63795a1049q2669j29423m022r5233i1826l6891j44987J02787l73751A53532
$$ y = [-231677, 13759, -170399, -59099, -181696, 59647, -109783, -166629, -151570, 132708, -267046, 17141, -80364, -38301, -197472, 24821, -6140, -201, 429669, -23092, 22705, 107608, 106603, -86653, 180982, -168780, -121231, -316440, -37092, -91993, 196986, 160546, 56470, -52062, -194856, 170164, 257706, -53691, -168211, -156686, -286130, -192945, 308839, -95402, -256165, 62218, -274805, -9266, -170323, 203916, -364776, -161975, -460465, -78881, -32895, -46655, 129231, 91982, -147311, -135174, 161625, -101818, 144958, 77189, 122119, -107417, -22618, -91704, -108740, -197338, -130309, -175417, -194461, -81828, -70144, -165672, 187188, -209341, 156082, 2984, -17902, -263795, -11049, -93718, -223141, -227163, -322396, -91826, -128717, -273704, -170917, -544668, 153532]
9450h9249j47794C066N0435j1793b11624j95344o7233B43033H489P0813a04422
9438a85785C24582b62417a12131q0417j48263F4885J47825I2440b3368B60265
9427d4605l02286A95457M7694c14541i6923A27551a61778j17893A2462e20366
9416c85786C9331A6086b81014D9985L5498b45952A15640c02786F7443L14101b51888
9404i5370D7908J64788J22876A05719A8882L5476f0180l1667j02573O8861f721
9392c49924A93179a83130E2367b66696Q7812G2525L055c9244n1395L6922b5190
9380A47229F6431k2461a53316a6347A647Q1713C321d61703d2766p6622A3075J82822
9368A95897a3823C0963e7634e642j48104J4928o7756A15412l6425a08914j84448
$$ y = [-89249, -237043, 3066, 53501, 41708, -211624, -406968, -474201, 243033, 8489, 79302, -104422, -185785, 324582, -262417, -112131, -192548, -340811, 64885, 212710, 92440, -23368, 260265, -44605, -346891, 195457, 243151, -314541, -96923, 127551, -161778, -279671, 12462, -520366, -385786, 39331, 16086, -281014, 49985, 85483, -245952, 115640, -302786, 67443, 381544, -251888, -95370, 47908, 212696, 335572, 105719, 18882, 54358, -60180, -91847, -194420, -125559, -6721, -349924, 193179, -183130, 52367, -266696, -178884, 72525, 75580, -39244, -90639, -53717, -25190, 147229, 66431, 43970, -153316, -16347, 1647, 83360, 3321, -461703, -42766, -119388, 13075, 195897, -13823, 30963, -57634, -5642, -153746, -138818, -206574, 115412, 78987, -108914, -293362]
9357b93362A04572a72260j73339B55710B0614p265a81920Q3611j73521a5545N76
9346a4969E3797b29136D4016h2834A2304c2356j39724j46224B15388g5559J6379
9335e9180a7608j49842D0697i655A61026F7681i6628m7356H789f5287I0506b36594
9322A74854a15787k30182A55783a54900d5951E1562e7133k40395h0070n1666A9638
9310b67569O1297E7346J34153b35912F1146R0892e29102A67952a9213j92229Q5775
9299a25667e1763l35060I0699l5291h3232C03272h8934B1857f1920l20474a53175
9287B2263N7001b01782b1717k5384k31065j22566C8502b85291A76599c28354a9478
9275b50148f6577J5380k79631B9558g7019A02913k521c61452B77225E4192e08911
$$ y = [-293362, 104572, -172260, -345599, 255710, 20614, 13349, -181920, -98309, -271830, -15545, -14969, 53797, -229136, 44016, -82834, 12304, -32356, -172080, -318304, 215388, -75559, -59180, -17608, -167450, 40697, -9655, 161026, 67681, -96628, -143984, 8789, -65287, 90506, -236594, 174854, -115787, -345969, 155783, -154900, -45951, 51562, -57133, -297528, -80070, -131736, 19638, -267569, -206272, 57346, 191499, -235912, 61146, 152038, -529102, 167952, -19213, -211442, -125667, -51763, -386823, 90699, 55408, -83232, 303272, -88934, 21857, -61920, -382394, -153175, 22263, 79264, -201782, -21717, -47101, -278166, -400732, 38502, -285291, 176599, -328354, -19478, -250148, -66577, -51197, -330828, 29558, -77019, 102913, 100392, -361452, 277225, 54192, -508911]
9263A48624f3047D27219a97575A04024m3231i6796j1873N1652j90066D03875a4238
9251C3791K85981E3206a677A14265b38073M2896m2815C4312e8655H9107b51686
9239a57446K2080m2897k54326I6899H118a58338C4437R8557g0986B35070p2615
9228A62455o0344E424M1584a7265k00909C0200d8678p1543c5675k19713B61437
9216e7253k05890a1913j55176h616j62010j123j65234D22457c8172m1434A84867
9204a43677B2428L588a98027M3666l2216P6607A33960O154o9939a03050j44548
9193b47598a15364B4704j1453a79384j71781g1447q283A71923J34450d2358j68346
9182b10704P6398K3718j43112a16470A23886A5932b4618o8824a1778r6334D3267
$$ y = [148624, -63047, 427219, -197575, 104024, 60793, -96796, -108669, -57017, -247083, 403875, -14238, 33791, 319772, 53206, -1677, 114265, -238073, -195177, -237992, 34312, -58655, 89107, -251686, -157446, -135366, -178263, -432589, 96899, 8118, -158338, 34437, 132994, -70986, 235070, 162455, 102111, 5424, 47008, -17265, -218174, 30200, -48678, -120221, -35675, -255388, 261437, -57253, -263143, -11913, -167089, -8616, -170626, -171749, -336983, 422457, -38172, -79606, 184867, -143677, 22428, 26016, -198027, -154361, -186577, -109970, 133960, 140114, 70175, -103050, -247598, -115364, 24704, 13251, -179384, -351165, -71447, -79730, 171923, 306373, -42358, -210704, -134306, -110588, -253700, -116470, 123886, 15932, -24618, -93442, -11778, -108112, 43267]
9170a36968k68995i1838H9359a37523e9503n0504L3022A43979D3575K8394k3494
9159D8475N1753D5842a3164m25924h3841j54995F768L577c49724A49049k0322
9148A28727i0637n0127A53335b60678R7627b6211A23860B2463a07422I4874i6298
9136A21992c8882J8015j62042P1569j03216h5199M0524C1544Q8392b81957A21262
9124b28170h9331L8804A3550a22333r0198j52817J70153B7414b14424N3548q615
9113a69491A18157b08628j1347B33736D262h34I7807a874B00345a02065l8044
9102a40109j0853f0010B74488A22050f5239n8350j09145A5245a28004l3148f1213
9090b02555O443B62042i0592m2958K7196B06352r7249J08479c9878k54971e0581
$$ y = [-136968, -405963, -91838, 89359, -137523, -59503, -110007, -76985, 143979, 43575, 71969, 48475, 100228, 45842, -13164, -439088, -83841, -238836, 6768, 10345, -349724, 149049, 128727, -90637, -140764, 153335, -260678, -163051, -26211, 123860, 22463, -107422, 94874, -96298, 121992, -38882, -20867, -182909, -111340, -214556, -85199, -44675, 31544, 119936, -281957, 121262, -228170, -89331, -50527, 13550, -122333, -212531, -365348, -195195, 27414, -214424, -160876, -169491, 118157, -208628, -219975, 233736, 4262, -834, 97807, -1874, 200345, -102065, -140109, -150962, -60010, 274488, 122050, -65239, -123589, -232734, 15245, -128004, -161152, -61213, -202555, -196112, 262042, -90592, -133550, -106354, 206352, 109103, 217582, -39878, -294849, -50581]
9078A19547a97390f2495a2477A3966a95747A45558b02903A15768b84687A39707
9067B26893a20735c4583A45857a6285r0331M137c3312k80855G004g7846O806n1633
9055a22673o1629A09181a32660A2809O354a92676b9523B8745P0442a21280j02587
9044b23867A81069e2362F2038c47920c3814m5521j13240f8641k17226A12812E0149
9032c49746A74701J20722C9514h4892k42899E1852K64893a95668B11504a29026
9021c04080A23405N1594b74842G022J1809c27928P5875d0598j05607C1557h6617
9009c0792A06601a40492b3825C81950a89681k44187B20383L0052E3770c64956
8998b08869d9194A16768a13200A14609b90903f2969B1301J57277a18801c7641
$$ y = [119547, -197390, -62495, -12477, 13966, -195747, 145558, -202903, 115768, -284687, 139707, 226893, -120735, -34583, 145857, -16285, -106616, -102479, -33312, -314167, 7004, -77846, -71040, -122673, -184302, 109181, -132660, 12809, 19163, -192676, -29523, 28745, 99187, -121280, -223867, 181069, -52362, 62038, -347920, -33814, -79335, -192575, -68641, -285867, 112812, 50149, -349746, 174701, 295423, 39514, -84892, -327791, 51852, 316745, -195668, 211504, -129026, -304080, 123405, 174999, -274842, 7022, 18831, -327928, -252053, -40598, -146205, 31557, -86617, -30792, 106601, -140492, -23825, 381950, -189681, -433868, 220383, 250435, 53770, -364956, -208869, -49194, 116768, -113200, 114609, -290903, -62969, 21301, 178578, -118801, -37641]
8987A14604a51441N9742C933d88530a378A8093a6313J080j31178o1259R0953k1618
8975a38335p3112E8299b7722r0429j33794J19593C6515R04a727E1442c5972l12573
8963c48545M6243A00964b65948Q3074A48850d220A62753b83020M2622F8130a58575
8951a82916J7405D3129a17642N5856b704I8073g9993j87462B4569a29167o0877
8940a90044B83075b82714d7476B52657A06714D5513b33597A44785h8739j45412
8930b34151h4433A32211D8016K54197H7723c20609E1880k1998a55258B03088a35419
8918B19953I075g4981F5879l1132J66189O3202A19681C6556L02542K28364J90516
8907G57978R87254J859776K605315B972864A189785m24809l37336j63534K59841
$$ y = [114604, -151441, -91699, 3933, -488530, -1378, 18093, -16313, -15233, -146411, -207670, -116717, -138335, -211447, 58299, -27722, -118151, -251945, -132352, 36515, 37419, -1727, 51442, -35972, -348545, -302302, 100964, -265948, -182874, 148850, -4220, 162753, -283020, -240398, 68130, -158575, -182916, -165511, 43129, -117642, -61786, -2704, 98073, -79993, -267455, 24569, -129167, -190044, 283075, -282714, -47476, 252657, 106714, 45513, -233597, 144785, -88739, -234151, -84433, 132211, 48016, 302213, 87723, -320609, 51880, 29882, -155258, 203088, -135419, 219953, 9075, -74981, 65879, 34747, 200936, 264138, 119681, 36556, 339098, 567462, 757978, 1745232, 3605008, 6210323, 2972864, 1189785, 764976, 427640, 264106, 523947]
8898E23947k17925E4719J63351H2052E080O954L184c58528H0935a2966q9392j47525
8886b49883B43731a5646o6936k68663C7476a49352k11703a38496F1353P2331C8113
8874B49081H48a62160G9655a87516m5962H1927a87883I928b31046N6193H3052
8862B33068H8944c3794r0690K3621j87461a40635C846a11350A77239M513b60642
8850c09780a42464b3353j47890b9262B31031b34302B54061B1938J33659G843b59045
8838d062k29054e9572M414B42461j5814Q8623c11029P1628R5727C5073b82875
$$ y = [523947, 306022, 54719, 218070, 82052, 5080, 12034, 15218, -358528, 80935, -12966, -102358, -249883, 243731, -15646, -82582, -351245, 37476, -149352, -361055, -138496, 61353, 133684, 38113, 249081, 848, -162160, 79655, -187516, -233478, 81927, -187883, 9928, -231046, -174853, 83052, 233068, 88944, -33794, -124484, -100863, -288324, -140635, 3846, -111350, 177239, 181752, -260642, -309780, -142464, -23353, -171243, -29262, 231031, -234302, 254061, 21938, 155597, 7843, -259045, -4062, -233116, -59572, -55158, 242461, 226647, 315270, -311029, -239401, -143674, 35073, -282875]
$$ [...]
##END NTUPLES=NMR SPECTRUM
##END=
