
##TITLE=AC1104_ROVE100B_5867635_VrXjcWTIYe
##JCAMPDX= 6.0         $$ Bruker NMR JCAMP-DX V2.0
##DATA TYPE= NMR SPECTRUM
##DATA CLASS= NTUPLES
##ORIGIN= BRUKER
##OWNER= Administrator
$$ 1.72 TOPSPIN		Version 2.1
$$ 2012-03-30 20:01:05.281 -0500  Administrator@TOPSPIN
$$ Compression mode = diff/dup
##.OBSERVE FREQUENCY= 400.13188235
##.OBSERVE NUCLEUS= ^1H
##.ACQUISITION MODE= SIMULTANEOUS (DQD)
##.ACQUISITION SCHEME= undefined
##.AVERAGES= 64
##.DIGITISER RES= 22
##SPECTROMETER/DATA SYSTEM= spect
##.PULSE SEQUENCE= noesygpps1d.comp
##.SOLVENT NAME= COFFEE_meoh
##.SHIFT REFERENCE= INTERNAL, COFFEE_meoh, 1, 14.96699
##AUDIT TRAIL= $$ (NUMBER, WHEN, WHO, WHERE, PROCESS, VERSION, WHAT)
$$ ##TITLE= Audit trail, TOPSPIN		Version 2.1
$$ ##JCAMPDX= 5.01
$$ ##ORIGIN= Bruker BioSpin GmbH
$$ ##OWNER= Administrator
$$ $$ C:\Bruker\TOPSPIN/data/COFFEE/nmr/AC1104_ROVE100B_5867635_VrXjcWTIYe/12/pdata/1/auditp.txt
$$ ##AUDIT TRAIL=  $$ (NUMBER, WHEN, WHO, WHERE, PROCESS, VERSION, WHAT)
(   1,<2012-03-30 20:01:00.531 -0500>,<Administrator>,<TOPSPIN>,<go>,<TOPSPIN 2.1>,
      <created by zg
	started at 2012-03-30 19:49:28.765 -0500,
	POWCHK enabled, PULCHK disabled,
       configuration hash MD5:
       1A 1E CE 29 27 FD 77 03 67 4E F0 E3 C4 B2 CB 90
       data hash MD5: 64K
       87 BE 6D 73 89 F0 B9 32 8B F3 1B 39 C1 E9 B1 A6>)
(   2,<2012-03-30 20:01:03.250 -0500>,<Administrator>,<TOPSPIN>,<proc1d>,<TOPSPIN 2.1>,
      <Start of raw data processing
       efp LB = 0.3 FT_mod = 6 PKNL = 1 PHC0 = 0 PHC1 = 0 SI = 128K 
       data hash MD5: 128K
       D6 78 C9 20 20 64 FF 7E 37 D5 CB 64 F8 E8 EC 06>)
(   3,<2012-03-30 20:01:04.515 -0500>,<Administrator>,<TOPSPIN>,<proc1d>,<TOPSPIN 2.1>,
      <pk PHC0 = 30.83862 PHC1 = 0 
       data hash MD5: 128K
       61 4C 59 A1 97 1E F0 4A 51 7D 47 BE 5B C1 45 BA>)
(   4,<2012-03-30 20:01:04.750 -0500>,<Administrator>,<TOPSPIN>,<proc1d>,<TOPSPIN 2.1>,
      <abs ABSG = 1 
       data hash MD5: 128K
       57 7C 1A E6 46 C6 FB 8A 6E A3 6A FB 2C 8D 1E 59>)
(   5,<2012-03-30 20:01:04.812 -0500>,<Administrator>,<TOPSPIN>,<proc1d>,<TOPSPIN 2.1>,
      <abs ABSG = 2 
       data hash MD5: 128K
       7E E4 E7 4A 97 DD CC 6E 18 11 08 BD E0 90 0F EE>)
(   6,<2012-03-30 20:01:04.875 -0500>,<Administrator>,<TOPSPIN>,<proc1d>,<TOPSPIN 2.1>,
      <abs ABSG = 3 
       data hash MD5: 128K
       AE F5 23 8F 52 DA C3 6E 14 DC 30 D8 F6 B5 89 E1>)
(   7,<2012-03-30 20:01:05.000 -0500>,<Administrator>,<TOPSPIN>,<proc1d>,<TOPSPIN 2.1>,
      <abs ABSG = 4 
       data hash MD5: 128K
       F4 2E 9B 7F 0E 0F BA 79 A1 60 70 CC 97 72 96 71>)
(   8,<2012-03-30 20:01:05.203 -0500>,<Administrator>,<TOPSPIN>,<proc1d>,<TOPSPIN 2.1>,
      <abs ABSG = 5 
       data hash MD5: 128K
       7B 57 F6 3C C3 73 1A 68 34 C6 C0 AB AD F5 DA 98>)
$$ ##END=
$$ 
$$ $$ hash MD5
$$ $$ 4B 4E B8 43 97 11 1D ED 39 C0 4C 4C DA C2 89 7C
##$RELAX= 
##$RELAX= 
##$RELAX= 
##$RELAX= 
##$RELAX= 
##$RELAX= 
##$RELAX= 
##$RELAX= 
$$ Bruker specific parameters
$$ [...]
##$TP07= 0
##$TPNAME0= <>
##$TPNAME1= <>
##$TPNAME2= <>
##$TPNAME3= <>
##$TPNAME4= <>
##$TPNAME5= <>
##$TPNAME6= <>
##$TPNAME7= <>
##$TPOAL= (0..7)
0.5 0.5 0.5 0.5 0.5 0.5 0.5 0.5
##$TPOFFS= (0..7)
0 0 0 0 0 0 0 0
##$TUNHIN= 0
##$TUNHOUT= 0
##$TUNXOUT= 0
##$USERA1= <user>
##$USERA2= <user>
##$USERA3= <user>
##$USERA4= <user>
##$USERA5= <user>
##$V9= 5
##$VALIST= <valist>
##$VCLIST= <CCCCCCCCCCCCCCC>
##$VD= 0
##$VDLIST= <DDDDDDDDDDDDDDD>
##$VPLIST= <PPPPPPPPPPPPPPP>
##$VTLIST= <TTTTTTTTTTTTTTT>
##$WBST= 2048
##$WBSW= 25
##$XGAIN= (0..3)
0 0 0 0
##$XL= 0
##$YL= 0
##$YMAX_a= 9388038
##$YMIN_a= -5095150
##$ZGOPTNS= <>
##$ZL1= 120
##$ZL2= 120
##$ZL3= 120
##$ZL4= 120
##$ABSF1= 14.96699
##$ABSF2= -5.58554
##$ABSG= 5
##$ABSL= 3
##$ALPHA= 0
##$AQORDER= 0
##$ASSFAC= 0
##$ASSFACI= 0
##$ASSFACX= 0
##$ASSWID= 0
##$AUNMP= <proc_prof1d_extract.lims>
##$AXLEFT= 0
##$AXNAME= <>
##$AXNUC= <1H>
##$AXRIGHT= 0
##$AXTYPE= 0
##$AXUNIT= <>
##$AZFE= 0.1
##$AZFW= 0.1
##$BCFW= 0
##$BC_mod= 0
##$BYTORDP= 0
##$COROFFS= 0
##$CY= 15
##$DATMOD= 1
##$DC= 0
##$DFILT= <>
##$DTYPP= 0
##$F1P= 0
##$F2P= 0
##$FCOR= 0.5
##$FTSIZE= 131072
##$FT_mod= 6
##$GAMMA= 0
##$GB= 0
##$INTBC= 1
##$INTSCL= 1
##$ISEN= 128
##$LB= 0.3
##$LEV0= 0
##$LPBIN= 0
##$MAXI= 10000
##$MC2= 0
##$MEAN= 0
##$ME_mod= 0
##$MI= 0
##$NCOEF= 0
##$NC_proc= -3
##$NLEV= 6
##$NOISF1= 0
##$NOISF2= 0
##$NSP= 0
##$NTH_PI= 0
##$NZP= 0
##$OFFSET= 14.96699
##$PC= 1
##$PHC0= 30.83862
##$PHC1= 0
##$PH_mod= 1
##$PKNL= yes
##$PPARMOD= 0
##$PPDIAG= 0
##$PPIPTYP= 0
##$PPMPNUM= 2147483647
##$PPRESOL= 1
##$PSCAL= 4
##$PSIGN= 0
##$PYNMP= <proc.py>
##$REVERSE= no
##$SF= 400.130005450318
##$SI= 131072
##$SIGF1= 0
##$SIGF2= 0
##$SINO= 400
##$SIOLD= 131072
##$SPECTYP= <>
##$SREGLST= <1H.CDCl3>
##$SSB= 0
##$STSI= 131072
##$STSR= 0
##$SW_p= 8223.68421052632
##$SYMM= 0
##$S_DEV= 0
##$TDeff= 65536
##$TDoff= 0
##$TI= <>
##$TILT= no
##$TM1= 0
##$TM2= 0
##$TOPLEV= 0
##$USERP1= <user>
##$USERP2= <user>
##$USERP3= <user>
##$USERP4= <user>
##$USERP5= <user>
##$WDW= 1
##$XDIM= 131072
##$YMAX_p= 405725233
##$YMIN_p= -143101806
##$CURPLOT= <Network HP LaserJet P1505>
##$CURPRIN= <$Network HP LaserJet P1505>
##$DFORMAT= <normdp>
##$LAYOUT= <+/1D_H.xwp>
##$LFORMAT= <normlp>
##$PFORMAT= <normpl>
##$SURQMSG= 1
$$ End of Bruker specific parameters
$$ ---------------------------------
##NTUPLES= NMR SPECTRUM
##VAR_NAME=  FREQUENCY,     SPECTRUM/REAL,   SPECTRUM/IMAG
##SYMBOL=    X,             R,               I
##VAR_TYPE=  INDEPENDENT,   DEPENDENT,       DEPENDENT
##VAR_FORM=  AFFN,          ASDF,            ASDF
##VAR_DIM=   131072,        131072,          131072
##UNITS=     HZ,            ARBITRARY UNITS, ARBITRARY UNITS
##FACTOR=    0.0627417313425165, 1,          1
##FIRST=     8223.62146879498, 2548,         -82902
##LAST=      0,             3192,            -82287
##MIN=       0,             -143101806,      0
##MAX=       8223.62146879498, 405725233,    0
$$ Real data points
##PAGE= N=1
##DATA TABLE= (X++(R..R)), XYDATA
$$ [...]
61384E09529K683L363L325J751k81q64M33K319L567M076M211M126L978M069M402
$$ 509529 512212 515575 518900 520651 520370 519506 519939 522258 525825 529901 534112 538238 542216 546285 550687
61369E50687M643M627M526M460M415M440M560M540M181L576K709J276l49o46J387
$$ 550687 555330 559957 564483 568943 573358 577798 582358 586898 591079 594655 597364 598640 598291 597645 599032
61354E99032M358N702M771L312K698K139L85k059l494l082j590m93q87k699m574
$$ 599032 603390 609092 613863 617175 619873 622012 622397 620338 616844 613762 612172 611679 610792 608093 603519
61339F03519n050m232l632m185n264n949o118n738m344k223r85j679l070l148
$$ 603519 598469 594237 590605 586420 581156 575207 569089 563351 559007 556784 555799 554120 551050 547902
61325E47902j769m48M0L36Q58R69K14p20q14J14J313J856J424P49J132K918M754
$$ 547902 546133 545685 545725 546061 546919 547888 548102 547382 546568 546682 547995 549851 551275 552024 553156 556074 560828
61308E60828N008L783K607K230J823O16o58n73J156L294M413M297L989M483N562
$$ 560828 565836 569619 572226 574456 576279 576895 576237 575664 576820 580114 584527 588824 592813 597296 602858
61293F02858O302O615P442R043J0115R590Q478Q613J0065J1306J1758J2407J3593
$$ 602858 609160 615775 623217 632260 642375 651965 660443 669056 679121 690427 702185 714592 728185
61280G28185J3981J2585J0385Q857P902O565N038M528N258N806M695K023p38k195
$$ 728185 742166 754751 765136 773993 781895 788460 793498 798026 803284 809090 813785 815808 815070 812875
61266H12875k264k166l074m674n464m657l282k885l648m495m733m741m974n075
$$ 812875 810611 808445 805371 800697 795233 790576 787294 784409 780761 776266 771533 766792 761818 756743
61252G56743m348k733r73J10L18J42K56R43J987L078M125N197O275P208P824Q056
$$ 756743 752395 749662 748689 748799 749117 749259 749515 750458 752445 755523 759648 764845 771120 778328 786152 794208
61236G94208P987P700O986N403K909K61j562k333k589k862l314l996m770n021
$$ 794208 802195 809895 816881 822284 825193 825454 823892 821559 818970 816108 812794 808798 804028 799007
61222G99007m216k924k486l247l875k872l03K534M530N473N849O463P780R238
$$ 799007 794791 791867 789381 786134 782259 779387 779084 781618 786148 791621 797470 803933 811713 820951
61208H20951R768R366R308J0265J1203J1073J0571J0908J1643J1473J0685J0942
$$ 820951 830719 840085 849393 859658 870861 881934 892505 903413 915056 926529 937214 948156
61196I48156J2546J3993J4576J5395J6828J7015J4537J1124R580R789Q969N781
$$ 948156 960702 974695 989271 1004666 1021494 1038509 1053046 1064170 1073750 1083539 1092508 1098289
61184A098289J997m78k270m956q186j0029r808q982q956r318q914p871p476q255
$$ 1098289 1100286 1099808 1097538 1092582 1084396 1074367 1064559 1055577 1046621 1037303 1028389 1020518 1013042 1004787
61170A004787r144q846p386n897n290n606o317o664n934l999j684mR15J682K469
$$ 1004787 995643 986797 979411 973514 968224 962618 956301 949637 943703 939704 938020 938016 938931 940613 943082
61155I43082K749K306J694J285P13j56m04Q96L191M937N336M846M067L142K359
$$ 943082 945831 948137 949831 951116 951829 951673 951269 952165 955356 960293 965629 970475 974542 977684 980043
61140I80043K402L558N252O743P910R096J0639J2784J5502J8145J9888K0936K2605
$$ 980043 982445 986003 991255 997998 1005908 1015004 1025643 1038427 1053929 1072074 1091962 1112898 1135503
61127A135503K5460K8030K8389K6828K5685K6306K7263K6323K3322K0241J8854
$$ 1135503 1160963 1188993 1217382 1244210 1269895 1296201 1323464 1349787 1373109 1393350 1412204
61116A412204J9258K0514K1494K0967J7987J3135Q631O224N209L476L26k811m669
$$ 1412204 1431462 1451976 1473470 1494437 1512424 1525559 1534190 1540414 1545623 1549099 1549425 1546614 1541945
61103A541945n923p932j0651j2894j4280j5670j7615j9447k0357k0613k0998k1543
$$ 1541945 1536022 1528090 1517439 1504545 1490265 1474595 1456980 1437533 1417176 1396563 1375565 1354022
61091A354022k1582k0852j9821j8751j7111j4383j1207r057q647q970q301o174
$$ 1354022 1332440 1311588 1291767 1273016 1255905 1241522 1230315 1221258 1212611 1203641 1195340 1189166
61079A189166l988l620n608q765j1306j2187j1504r922p892n535l221j723j263
$$ 1189166 1185178 1181558 1175950 1167185 1155879 1143692 1132188 1122266 1114374 1108839 1105618 1103895 1102632
61066A102632p27J266M412O809P525Q152J0858J5564K0161K3171K5047K6863K8871
$$ 1102632 1101905 1103171 1107583 1114392 1121917 1130069 1140927 1156491 1176652 1199823 1224870 1251733 1280604
61053A280604L0762L2432L4030L5696L7561L9627M1525M2834M3610M4191M4548
$$ 1280604 1311366 1343798 1377828 1413524 1451085 1490712 1532237 1575071 1618681 1662872 1707420
61042A707420M4268M3207M1525L9317L6761L4364L2196K9156K4086J7444J0813
$$ 1707420 1751688 1794895 1836420 1875737 1912498 1946862 1979058 2008214 2032300 2049744 2060557
61031B060557M901o81n764r496j2106j5056j8840k2209k4284k5831k7615k9177
$$ 2060557 2065458 2064777 2059013 2049517 2037411 2022355 2003515 1981306 1957022 1931191 1903576 1874399
61019A874399l0215l1434l2743l2441k9842k7015k5972k5640k3846k0933j8833
$$ 1874399 1844184 1812750 1780007 1747566 1717724 1690709 1664737 1639097 1615251 1594318 1575485
61008A575485j7470j4971j1051p422m842k320M45K396L498N484R307J3745J7398
$$ 1575485 1558015 1543044 1531993 1524571 1519729 1517409 1517854 1520250 1523748 1529232 1538539 1552284 1569682
60995A569682K0442K3576K6776K9888L3133L6354L8942M1079M3848M7763N2405
$$ 1569682 1590124 1613700 1640476 1670364 1703497 1739851 1778793 1819872 1863720 1911483 1963888
60984A963888N7663O3869P0540P6629Q2298Q8649R5505J01433J06362J12056J19420
$$ 1963888 2021551 2085420 2155960 2232589 2314887 2403536 2499041 2600474 2706836 2818892 2938312
60973B938312J27513J35934J45770J57093J67913J77067J86149J97043K09335
$$ 2938312 3065825 3201759 3347529 3504622 3672535 3849602 4035751 4232794 4442129
60964D442129K21468K32601K42242K50288K58886K71894K90806L13403L37934
$$ 4442129 4663597 4896198 5138440 5388728 5647614 5919508 6210314 6523717 6861651
60955F861651L65809L98145M32701M67185N03315N44955N94847O55835P32073
$$ 6861651 7227460 7625605 8058306 8525491 9028806 9573761 10168608 10824443 11556516
60946A1556516Q25380R33612J056641J200367J370430J567107J793132K060333
$$ 11556516 12381896 13315508 14372149 15572516 16942946 18510053 20303185 22363518
60938B2363518K377537K737317L128785L552141L979827M282810M236448L671614
$$ 22363518 24741055 27478372 30607157 34159298 38139125 42421935 46658383 50329997
60930E0329997K654452J494701N45115j3249j99000j04557J81991N18975O55617
$$ 50329997 52984449 54479150 55024265 55011016 54812016 54707459 54889450 55408425 56064042
60921E6064042L36197m98329j631241k713254l486309l885500l980144l871122
$$ 56064042 56400239 55901910 54270669 51557415 48071106 44185606 40205462 36334340
60913C6334340l642206l356698l055737k755508k459081k172446j905227j661979
$$ 36334340 32692134 29335436 26279699 23524191 21065110 18892664 16987437 15325458
60905A5325458j442243j247672j082092r45097q31188p35208o54486n86333n27549
$$ 15325458 13883215 12635543 11553451 10608354 9777166 9041958 8387472 7801139 7273590
60896G273590m76333m31606l91137l53203l18820k89140k62070k35087k10125
$$ 7273590 6797257 6365651 5974514 5621311 5302491 5013351 4751281 4516194 4306069
60887D306069j91398j78986j68757j58454j49566j42689j35447j26281j16769
$$ 4306069 4114671 3935685 3766928 3608474 3458908 3316219 3180772 3054491 2937722
60878B937722j08629j01389r4412q8354q3197p7394p0761o5739o3995o3717o2241
$$ 2937722 2829093 2727704 2633292 2544938 2461741 2384347 2313586 2247847 2183852 2120135 2057894
60867B057894n9573n7390n5966n4235n1983n0063m8768m7511m5939m4303m2803
$$ 2057894 1998321 1940931 1884965 1830730 1778747 1728684 1679916 1632405 1586466 1542163 1499360
60856A499360m1341l9742l7825l5532l3257l1598l0554k9515k8084k6384k4616
$$ 1499360 1458019 1418277 1380452 1344920 1311663 1280065 1249511 1219996 1191912 1165528 1140912
60845A140912k2989k1830k0935j9167j5948j2763j1646j2333j2704j1939j1207
$$ 1140912 1117923 1096093 1075158 1055991 1040043 1027280 1015634 1003301 990597 978658 967451
60834I67451j1035j0391r123q834j0013j0575r053p322p968j0405j1966j1811
$$ 967451 956416 946025 936902 928068 918055 907480 898427 891105 883137 872732 860766 848955
60822H48955j1309j1093j0270q667p566p674q065p853p451p477p488o728n336
$$ 848955 837646 826553 816283 807616 800050 792376 784311 776458 769007 761530 754042 747314 741978
60809G41978m056l229k707k339j979j182N61L192N870P571Q026P908P923P713
$$ 741978 737922 734693 731986 729647 727668 726486 727047 730239 736109 743680 751706 759614 767537 775250
60795G75250O264L563J160M49R33J021K63j73O37J978K355J161r82l076m462n026
$$ 775250 781514 785077 786237 786686 787619 788640 788903 788730 789367 791345 793700 794861 793879 790803 786341 781315
60779G81315n273o167q364j1405j3916j4755j3799j1655r093o930n870n918o150
$$ 781315 776042 769875 761511 750106 736190 721435 707636 695981 686888 679958 674088 668170 662020
60766F62020n739m985m626m345k960l21K080K844K136R40j35n53M88K926N130
$$ 662020 656281 651296 646670 642325 639365 639044 641124 643968 646104 647044 646909 646356 646844 649770 654900
60751F54900N647N142N319O384P050O768O329O244O043N396M656L933K984K179
$$ 654900 660547 665689 671008 677392 684442 691210 697539 703783 709826 715222 719878 723811 726795 728974
60737G28974K408L643M797N264N388N187M056K121N54m0k37m62n30r39k874o074
$$ 728974 731382 735025 739822 745086 750474 755661 759717 761838 762392 762352 762115 761653 761123 760184 757310 751236
60721G51236q452q851q537q777q786p655o666p536r592j0724j0384r494q156n782
$$ 751236 742784 733933 725396 716619 707833 700178 693512 685976 676384 665660 655276 645782 637626 631844
60707F31844l214k412l683n074m944l629k256j401j256j842k478k096m94J439
$$ 631844 628630 626218 622535 617461 612517 608888 606632 605231 603975 602133 599655 597559 597065 598504
60693E98504K848L380K766J078n46o44Q84K915M807O700Q108P931O360N182N423
$$ 598504 601352 604732 607498 608576 608030 607386 608270 611185 615992 622692 630800 638731 645091 650273 655696
60678F55696N950N427M404M322N314O248O459O214N754M936L864L027K637K372
$$ 655696 661646 667073 671477 675799 681113 687361 693820 700034 705788 710724 714588 717615 720252 722624
60664G22624J883J209N76J29k9J91O45P64q5j724k967k840k021k203l762n062
$$ 722624 724507 725716 726292 726421 726392 726583 727228 727992 727907 726183 723216 720376 718355 716152 712390 707328
60648G07328m834m178m924o735p579o825o035o409p195p300o940o654n912m041
$$ 707328 702494 698316 693392 686657 679078 672253 666218 659809 652614 645314 638374 631720 625808 621767
60634F21767j869j122k301m042m562l371j655j152k353l729l325j077J270K656
$$ 621767 619898 618776 616475 612433 607871 604500 602845 601693 599340 595611 592286 591209 592479 595135
60620E95135L813N404O506O081M998M985O157O980O606N917O055O987P890Q132
$$ 595135 598948 604352 610858 616939 621937 626922 633079 640059 646665 652582 658637 665624 673514 681646
60606F81646P502O046L999J690n80k435l430l565l511l811m136l910l454l675
$$ 681646 689148 695194 699193 700883 700303 697868 694438 690873 687362 683551 679415 675505 672051 668376
60592F68376m674n480n302m388l430k753k360k218k183j996j655j461j570j724
$$ 668376 663702 658222 652920 648532 645102 642349 639989 637771 635588 633592 631937 630476 628906 627182
60578F27182j674j456j211j038j140j638k058j539K9J537J857J284J135J978K901
$$ 627182 625508 624052 622841 621803 620663 619025 616967 615428 615457 616994 618851 620135 621270 623248 626149
60563F26149K804J902J442K086L076L309K858K897M060N424N566M343L028K697
$$ 626149 628953 630855 632297 634383 637459 640768 643626 646523 650583 656007 661573 665916 668944 671641
60549F71641L199L980N167P146R482J1090J1426J0844R737Q288P205P534R014
$$ 671641 674840 678820 683987 691133 700615 711705 723131 733975 743712 752000 759205 766739 775753
60536G75753R578P771N094M455O416Q474Q430O902N744N317M657L364J937O84
$$ 775753 785331 793102 798196 802651 809067 817541 825971 832873 838617 843934 848591 851955 853892 854576
60522H54576k84l59Q76K379K606J843K097M257O844Q286R059J0520J2744J4875
$$ 854576 854292 853933 854809 857188 859794 861637 863734 867991 874835 883121 892180 902700 915444 930319
60508I30319J6909J9714K3415K7030K9812L1944L3656L4367L3163K9723K4581
$$ 930319 947228 966942 990357 1017387 1047199 1079143 1112799 1147166 1180329 1210052 1234633
60497A234633J8693J2880P476K530j706m743o530p572p978o832l282K000P289
$$ 1234633 1253326 1266206 1273682 1276212 1274506 1269763 1263233 1255661 1247683 1240851 1237569 1239569 1246858
60484A246858J1770J6225K1511K7203L2180L6037L9208M1858M3175M1895L7290
$$ 1246858 1258628 1274853 1296364 1323567 1355747 1391784 1430992 1472850 1516025 1557920 1595210
60473A595210K9851K1227J3487P899M222J482m36m26K147N892Q410Q998R359J1118
$$ 1595210 1625061 1646288 1659775 1667674 1671896 1673378 1672942 1672516 1674663 1680555 1688965 1697963 1707322 1718440
60459A718440J3651J5231J5547J5730J6232J6298J5722J5627J6746J8142J8465
$$ 1718440 1732091 1747322 1762869 1778599 1794831 1811129 1826851 1842478 1859224 1877366 1895831
60448A895831J7634J6500J5621J5223J5673J7112J9211K2070K6733L3783M2168
$$ 1895831 1913465 1929965 1945586 1960809 1976482 1993594 2012805 2034875 2061608 2095391 2137559
60437B137559N0545N9188O9200Q0154Q9969R6996J00854J01146R6776Q7003P1981
$$ 2137559 2188104 2247292 2316492 2396646 2486615 2583611 2684465 2785611 2882387 2969390 3041371
60426C041371N1859K6480l435l5498o6585r3959j15527j30081j37862j40225j38445
$$ 3041371 3093230 3119710 3116275 3080777 3014192 2920233 2804706 2674625 2536763 2396538 2258093
60415B258093j33408j26280j18227j09331r9121q8525p9755p3486o7799o0985
$$ 2258093 2124685 1998405 1880178 1770847 1671726 1583201 1503446 1429960 1362161 1301176
60405A301176n4042m8933m5555m2236l8340l4547l1071k7486k4155k1988k0655
$$ 1301176 1247134 1198201 1152646 1110410 1072070 1037523 1006452 978966 954811 932823 912168
60394I12168j8791j6295j4684j4595j4576j3328j1715j1332j1979j1943j0308
$$ 912168 893377 877082 862398 847803 833227 819899 808184 796852 784873 772930 762622
60383G62622p859n874m881m624m512m028l106k190j774j994k631l234l266k692
$$ 762622 754763 748889 744008 739384 734872 730844 727738 725548 723774 721780 719149 715915 712649 709957
60369G09957k455l652n908p459p352o641o630o856n988m139k852k918l574l978
$$ 709957 707502 703850 697942 690483 683131 676490 669860 663004 657016 652877 650025 647107 643533 639555
60355F39555m151m077l105j096P20R74k47j701k440k276j281K95J696K163J778
$$ 639555 635404 631327 628222 627126 627846 628820 628573 626872 624432 622156 620875 621170 622866 625029 626807
60340F26807J323J150P72l02j823l038l306k434q63L88M77k28l84O91K062K346
$$ 626807 628130 629280 630052 629750 627927 624889 621583 619149 618286 618674 619151 618923 618539 619230 621292 623638
60324F23638J480O47O72J234J686J884J815J167o3r95o58O69J682J654J228J371
$$ 623638 625118 625765 626437 627671 629357 631241 633056 634223 634160 633165 632507 633176 634858 636512 637740 639111
60308F39111K062K489K083R82l36j312j384l82J088J990J835J080N46O87J372
$$ 639111 641173 643662 645745 646727 646391 645079 643695 643313 644401 646391 648226 649306 649852 650539 651911
60293F51911K138K556K560K508K689K806K268J046o3j81Q40K418L781M484M706
$$ 651911 654049 656605 659165 661673 664362 667168 669436 670482 670419 670238 671078 673496 677277 681761 686467
60278F86467N097N970O615N970M108K496K283K972L365L346L775M791N324M511
$$ 686467 691564 697534 704149 710119 714227 716723 719006 721978 725343 728689 732464 737255 742579 747090
60264G47090K830J324K60p02j403j040O73K817M265N154O671R284J1817J2977
$$ 747090 749920 751244 751504 750802 749399 748359 749032 751849 756114 761268 767939 777223 789040 802017
60250H02017J3322J4818J8342K2638K6031K8272L0105L2027L4485L8234M3023
$$ 802017 815339 830157 848499 871137 897168 925440 955545 987572 1022057 1060291 1103314
60239A103314M6301M4948L8550K9642K0373J0338j682j5086k7593l7143m2820
$$ 1103314 1149615 1194563 1233113 1262755 1283128 1293466 1291784 1276698 1249105 1211962 1169142
60228A169142m4606m3321m0505l7497l4637l1676k8396k4508j9746j4869j1688
$$ 1169142 1124536 1081215 1040710 1003213 968576 936900 908504 883996 864250 849381 837693
60217H37693j1034j1260j0023p181m566l181k176p97J97j87j561k670k864k414
$$ 837693 826659 815399 805376 798195 793629 790448 788272 787475 787672 787485 785924 783254 780390 777976
60203G77976j846j640k110l116m077m624m819m637l805k550j755j806j956j520
$$ 777976 776130 774490 772380 769264 765187 760563 755744 751107 747302 744752 742997 741191 739235 737715
60189G37715j188k122l973m847l543j072N07L27n79o62M45J662J792Q42j47m70
$$ 737715 736527 734405 730432 725585 722042 720970 721477 721804 721225 720563 721008 722670 724462 725304 725157 724687
60173G24687m16m46k45P99K515L978M584M560M310L741K603J108r3n28l08O5L17
$$ 724687 724271 723825 723580 724379 726894 730872 735456 740016 744326 748067 750670 751778 751685 751157 750849 750914 751231
60156G51231P37J853L635N202N548M535K945J678J128J243J748K221K257J870
$$ 751231 751968 753821 757456 762658 768206 772741 775686 777364 778492 779735 781483 783704 785961 787831
60142G87831J541J718K335K922L122K975K814K923L238L349K896J993J094N61
$$ 787831 789372 791090 793425 796347 799469 802444 805258 808181 811419 814768 817664 819657 820751 821312
60128H21312M24N57P75Q38O94P52J484K632L246K819J977J619J755J787J721K298
$$ 821312 821736 822293 823068 823906 824600 825352 826836 829468 832714 835533 837510 839129 840884 842671 844392 846690
60112H46690L670M670L912J434j221k488k119j062l71m21j061k133l454m466m548
$$ 846690 850360 855030 858942 860376 859155 856667 854548 853486 853115 852694 851633 849500 846046 841580 837032
60097H37032l886l495l807l838k549o71N5n99r52Q0J488K002K122K987M226M699
$$ 837032 833146 829651 825844 822006 819457 818786 818841 818242 817290 817370 818858 820860 822982 825969 830195 834894
60081H34894M792O049Q487J0241J0441J0650J2323J4242J3980J1179P844N662
$$ 834894 839686 845735 854222 864463 874904 885554 897877 912119 926099 937278 945122 950784
60069I50784M282K410l12k894m090l778l321m230o265p472o633m965m502n220
$$ 950784 955066 957476 957164 954270 950180 946402 943081 938851 932586 925114 918481 913516 909014 903794
60055I03794n029k620P01K594K376J620K231M381O413O754N737N056N467N768
$$ 903794 898765 896145 896846 899440 901816 903436 905667 910048 916461 923215 928952 934008 939475 945243
60041I45243M510J974l18j509j809j557j019q77j540j978o20K240M312M234L441
$$ 945243 949753 951727 951409 949900 948091 946534 945515 944638 943098 941120 940500 942740 947052 951286 954727
60026I54727M148O372Q054P687N768L837K947L086L490L329K411J184j4j397l225
$$ 954727 958875 965247 973301 980988 986756 990593 993540 996626 1000116 1003445 1005856 1007040 1007026 1005629 1002404
60011A002404n234o939q216r166r717r714r254q600p944p487p507q049q717q989
$$ 1002404 997170 990231 982015 972849 963132 953418 944164 935564 927620 920133 912626 904577 895860 886871
59997H86871q565p437o015n169n476o210n922m412l285l800n023n115l866k615
$$ 886871 878306 870869 864854 859685 854209 847999 842077 837665 834380 830580 825557 820442 816576 813961
59983H13961j982j180J81J087O73k52k33Q57J854K134K369L368M901O065O163
$$ 813961 811979 810799 810980 812067 812740 812488 812255 813112 814966 817100 819469 822837 827738 833803 839966
59968H39966M797J719k539o053o733m673k526k772n074p100p569p415p971r169
$$ 839966 844763 846482 843943 837890 831157 826484 823958 821186 816112 809012 801443 794028 786057 776888
59954G76888j0010r899q969p599o188n078m347l940m031m681n144m283k038L59
$$ 776888 766878 756979 748010 740411 734223 729145 724798 720858 716827 712146 707002 702719 700681 701040
59940G01040J941K919L560L217J424q26j919j370K9J318J886J467M71k4N15J420
$$ 701040 702981 705900 709460 712677 714101 713275 711356 709986 710015 711333 713219 714686 715157 715133 715648 717068
59924G17068J938K332K928K952J612k12q94l11K00o7n66q48j052j136r61j139
$$ 717068 719006 721338 724266 727218 728830 728618 727724 727413 727613 727546 726980 726132 725080 723944 722983 721844
59908G21844k265l393k955j329o40j611k484j733j07J037J683K312K608K320K115
$$ 721844 719579 716186 713231 711902 711262 709651 707167 705434 705327 706364 708047 710359 712967 715287 717402
59893G17402K292J697n75l335m584l884k273o71L69K62o86p52J179L642M312L122
$$ 717402 719694 721391 720816 717481 712897 709013 706740 706069 706438 706700 706014 705262 706441 710083 714395 717517
59877G17517J826R52n51k643l482k147j61O33K57l41j005j868k170j074Q17J903
$$ 717517 719343 720295 719744 717101 713619 711472 711311 711944 712201 711860 710855 708987 706817 705743 706560 708463
59861G08463J536O12K75O89J167J063M94L56J449L435M901M756L351J973J446
$$ 708463 709999 710611 710886 711575 712742 713805 714299 714655 716104 719539 724440 729196 732547 734520 735966
59846G35966J573J828K174K942M055M721M324L438L316M114M399L069J153O47
$$ 735966 737539 739367 741541 744483 748538 753259 757583 761021 764337 768451 772850 775919 777072 777719
59832G77719J910L407M032M368N284O444O985O780O172N167L776K707K723L411
$$ 777719 779629 783036 787068 791436 796720 803164 810149 816929 823101 828268 832044 834751 837474 840885
59818H40885L527K654J754J886K903L741L734L251L021L010K242m5l181n334n201
$$ 840885 844412 847066 848820 850706 853609 857350 861084 864335 867356 870366 872608 872563 869382 864048 858847
59803H58847l159p03Q63J014r1j611k249j197R35K695L460M138N909Q658J1090
$$ 858847 855688 854985 855848 856862 856771 855160 852911 851714 852649 855344 858804 862942 868851 877509 888599
59788H88599J2302J2743J3454J4796J6241J7105J6885J4993J1030N694Q63j840
$$ 888599 900901 913644 927098 941894 958135 975240 992125 1007118 1018148 1023842 1024705 1022865
59776A022865k324j481nJ490J750l46m160p637r740j1449j3771j5845j6182j5076
$$ 1022865 1020541 1019060 1019055 1020545 1022295 1021949 1017789 1010152 1000412 988963 975192 959347 943165 928089
59762I28089j4407j5120j6058j5659j3902j2187j1692j2275j2704j1722r186o315
$$ 928089 913682 898562 882504 866845 852943 840756 829064 816789 804085 792363 783177 776862
59750G76862m697m867n945o636o367n434m392l522k764j996j364j277j958l086
$$ 776862 772165 767298 761353 754717 748350 742916 738524 735002 732238 730242 728878 727601 725643 722557
59736G22557l970m137l690l177l194l900m820n202m760l913l216k819k675k903
$$ 722557 718587 714450 710760 707583 704389 700489 695669 690467 685707 681794 678578 675759 673084 670181
59722F70181l459l811l454k607j837j137j61P31N80p31k006k226j740j367j041
$$ 670181 666722 662911 659457 656850 655013 653876 653715 654446 655026 654295 652289 650063 648323 646956 645915
59707F45915k89N20N79O7lN05N05n45j609j455k05J308K811M212M648L418J605
$$ 645915 645626 646146 646725 646792 646789 647294 647799 647254 645645 644190 643985 645293 648104 652316 656964 660382 661987
59690F61987J235K547L548K859J642J656K521K445J132K55Q06J587J079k17m68
$$ 661987 663222 665769 669317 672176 673818 675474 677995 680440 681572 681827 682633 684220 685299 685082 684614
59675F84614R17K548K945K285J684J396O57o85j308lK265K965R59j968l146k037
$$ 684614 685531 688079 691024 693309 694993 696389 697046 696361 695053 695050 697315 700280 701239 699271 696125 694088
59659F94088l60L70L45M25O51M75j18m79k02L92Q01J027J458K087K206J192m01
$$ 694088 693728 694098 694443 694868 695519 695994 695876 695397 695195 695587 696388 697415 698873 700960 703166 704358 703957
59642G03957j001L20K654M112L723K103N49K2P84K289L367L249K514K437L263
$$ 703957 702956 703276 705930 710042 713765 715868 716417 716439 717223 719512 722879 726128 728642 731079 734342
59627G34342L948L650K656J505J90j198j906j455n29j07j71j10J5l79j164j429
$$ 734342 738290 741940 744596 746101 746291 745093 743187 741732 741203 741096 740925 740815 740830 740451 739287 737858
59611G37858p58K14P37P20M15n0n61q65q24n31n9O16J310J549R51l39j650k142
$$ 737858 737100 737314 738051 738771 739186 739136 738575 737710 736886 736355 736296 736912 738222 739771 740722 740383 738733 736591
59593G36591j462k29L98m5q23j028o96l92k10J5k1o66j317j011l0K19p87j958
$$ 736591 735129 734900 735298 735253 734430 733402 732706 732314 732104 732119 732098 731432 730115 729104 729074 729293 728506 726548
59575G26548k295k194k314k315j707j082j173j233R4K431L674K692Q64K14J026
$$ 726548 724253 722059 719745 717430 715723 714641 713468 712235 712329 714760 718434 721126 721990 722204 723230
59560G23230K087K549K535K266J669R67O96Q21N40n45j715k171k236k623k873
$$ 723230 725317 727866 730401 732667 734336 735303 735999 736820 737360 736815 735100 732929 730693 728070 725197
59545G25197j802K72J109p37l717m984l785j920r48n53j2J81p47k119k383j212
$$ 725197 723395 723667 724776 724039 720322 715338 711553 709633 708685 708132 708120 708301 707554 705435 703052 701840
59529G01840R4M50L34P67J680J952R78n58j697k487l613m933n239l943k296k020
$$ 701840 701934 702384 702718 703485 705165 707117 708095 707537 705840 703353 699740 694807 689568 685625 683329 681309
59513F81309l042l696l198k619k891l078j808L39J345N93k25N52K369L388K904
$$ 681309 678267 674571 671373 668754 665863 662785 660977 661316 662661 663254 663029 663581 665950 669338 672242
59498F72242J946J611J706J384O22M86J797L884N099M578L231K784M006O116P672
$$ 672242 674188 675799 677505 678889 679511 679997 681794 685678 690777 695355 698586 701370 705376 711492 719164
59483G19164P880P131O585P176Q779J0474J1783J3250J5442J7721J8735J7927
$$ 719164 727044 734175 740760 747936 756715 767189 778972 792222 807664 825385 844120 862047
59471H62047J5821J2756Q457L261j109k979k560j568j151r24j05J196K257K915
$$ 862047 877868 890624 899081 902342 901233 898254 895694 894126 892975 892051 891946 893142 895399 898314
59457H98314L939O051Q631R739P898L961O24l75q1p42k856m898n839o603q433
$$ 898314 902253 908304 916935 926674 934572 938533 939157 938782 938701 937959 935103 930205 924366 917763 909330
59442I09330j0780j1872j0994r350q684r613j1189j1745j0339p704n670n279n874
$$ 909330 898550 886678 875684 866334 857650 848037 836848 825103 814764 807060 801390 796111 790237
59429G90237o275o161n572l963j050J723K228M77r88j26K329M270M860M848N226
$$ 790237 783962 777801 772229 768266 767216 768939 771167 771644 770656 770530 772859 777129 781989 786837 792063
59414G92063O559Q948J1541J2651J1445R219P940P822P397N662L078O78o23j7
$$ 792063 798622 807570 819111 831762 843207 852426 860366 868188 875585 881247 884325 885003 884380 884363
59400H84363K439N025N792N188N725Q535J1780J3397J3833J4726J6107J6897J7438
$$ 884363 886802 891827 897619 902807 908532 917067 928847 942244 956077 970803 986910 1003807 1021245
59387A021245J9377K2940K6156K7355K6801K5112K1475J4852O088k570r752j5455
$$ 1021245 1040622 1063562 1089718 1117073 1143874 1168986 1190461 1205313 1211401 1208831 1199079 1183624
59375A183624j9535k1223k0655j9566j9445j9806j9327j8035j7085j6553j5142
$$ 1183624 1164089 1142866 1122211 1102645 1083200 1063394 1044067 1026032 1008947 992394 977252
59364I77252j2343r497p770o232l153J508O116R397J1309J2300J3032J4693J8230
$$ 977252 964909 955412 947642 941410 938257 939765 945881 955278 966587 978887 991919 1006612 1024842
59351A024842K3099K7957L2462L6718L8699L4445K2421O531o767j3860j5524j4243
$$ 1024842 1047941 1075898 1108360 1145078 1183777 1218222 1240643 1247174 1240407 1226547 1211023 1196780
59339A196780j1850r392p179m485p01K341N74q446k2078l4008l9340l8023l3657
$$ 1196780 1184930 1175538 1168359 1163874 1163173 1165514 1166088 1157642 1135564 1101556 1062216 1024193 990536
59326I90536k9768k7442k5812k3787k1024j7858j4843j2337j0195q086o313n850
$$ 990536 960768 933326 907514 883727 862703 844845 830002 817665 807470 799384 793071 787221
59314G87221o935q037p286m864k825k303k160r01J231K984L851M025L433K141
$$ 787221 780286 772249 764963 760099 757274 754971 752811 751910 753141 756125 759976 764001 767434 769575
59300G69575J150J483K629L152K709K264K456K988L777N353P651R601J0603J1601
$$ 769575 770725 772208 774837 777989 780698 782962 785418 788406 792183 797536 805187 814788 825391 836992
59286H36992J3876J7241K0151K1361K1079K0546K0760K1576K2014K1481K0405
$$ 836992 850868 868109 888260 909621 930700 951246 972006 993582 1015596 1037077 1057482
59275A057482J9418J8390J6879J5077J3321J0888O563O87m498p203q037q967j0980
$$ 1057482 1076900 1095290 1112169 1127246 1140567 1151455 1158018 1158705 1154207 1147004 1138967 1130000 1119020
59262A119020j3478j5538j6933j7974j8861j9304j8650j6561j3651j1226j0166
$$ 1119020 1105542 1090004 1073071 1055097 1036236 1016932 998282 981721 968070 956844 946678
59251I46678j0182j0211r299p205m498k154p29J42J308L235N853Q922J2103J4941
$$ 946678 936496 926285 916986 909781 905283 903129 902400 902542 903850 907085 912938 921860 933963 948904
59237I48904J7361J9940K3071K6160K8383K9589K9359K5788J7238N417n204j1900
$$ 948904 966265 986205 1009276 1035436 1063819 1093408 1122767 1148555 1165793 1171210 1166006 1154106
59225A154106j5897j9256k1474k0827j7730j4525j2507j1068r560q092o299l245
$$ 1154106 1138209 1118953 1097479 1076652 1058922 1044397 1031890 1020822 1011262 1003170 996871 993626
59213I93626Q43M115N303N384O236Q358J0862J3096J5161J6922J7563J6578J4678
$$ 993626 994469 998584 1003887 1009271 1015507 1023865 1034727 1047823 1062984 1079906 1097469 1114047 1128725
59200A128725J3069J1988J0428P430L272q94m260o737q390r162r257r208r274
$$ 1128725 1141794 1153782 1164210 1171640 1174912 1174018 1169758 1163021 1154631 1145469 1136212 1127004 1117730
59187A117730r181q740q218p913p692p327o861o377n705m702l506k251q87N09
$$ 1117730 1108549 1099809 1091591 1083678 1075986 1068659 1061798 1055421 1049716 1045014 1041508 1039257 1038370 1038879
59173A038879J584K229K864L969N552P184Q173P782N972M015L410L816L060j89
$$ 1038879 1040463 1042692 1045556 1049525 1055077 1062261 1070434 1078216 1084188 1088203 1091613 1095429 1098489 1098300
59159A098300m688q284j0451j2147j3942j5460j6285j6404j5962j5385j5347j5795
$$ 1098300 1093612 1085328 1074877 1062730 1048788 1033328 1017043 1000639 984677 969292 953945 938150
59147I38150j5590j3997j2003j0972j0627r702q112o920o385n760n051n250o415
$$ 938150 922560 908563 896560 885588 874961 865259 857147 850227 843842 838082 833031 827781 821366
59134H21366p127o452n071l873k786j705j236j496j361K1J874K995L475M036M443
$$ 821366 814239 807787 802716 798843 796057 794352 793116 791620 790259 790280 792154 795149 798624 802660 807103
59119H07103L939K910K664L499M209L761K643K137K824M215N529O523P555Q955
$$ 807103 811042 813952 816616 820115 824324 828085 830728 832865 835689 839904 845433 851956 859511 868466
59105H68466J0450J1425J1730J1918J2599J3810J5013J5367J4151J1539Q997Q110
$$ 868466 878916 890341 902071 913989 926588 940398 955411 970778 984929 996468 1005465 1013575
59093A013575Q722R050P857N729L734J871l97k904n089o867q209q518p605o795
$$ 1013575 1022297 1031347 1039204 1044933 1048667 1050538 1050141 1047237 1042148 1035281 1027072 1018554 1010949 1004154
59079A004154p582r351r875q208n693l855k727j853j526j934k068q02J459L361
$$ 1004154 996572 987221 977346 969138 963445 959590 956863 955010 953484 951550 949482 948680 950139 953500
59065I53500M486N491O545O960O718P058Q761J0720J1315J0829J1205J3242J5238
$$ 953500 957986 963477 970022 976982 983700 990758 999519 1010239 1021554 1032383 1043588 1056830 1072068
59052A072068J5161J3429J2369J3151J4442J4385J2940J1416J0429R372P854O521
$$ 1072068 1087229 1100658 1113027 1126178 1140620 1155005 1167945 1179361 1189790 1199162 1207016 1213537
59040A213537O065O029N264L310P83j484l203m353m673l889k432j461j767k867
$$ 1213537 1219602 1225631 1230895 1234205 1234988 1233504 1230301 1225948 1221275 1217386 1214954 1213493 1211726 1208859
59026A208859l568l443l286l990n506p140q412r087q858p866p328q548j1064j2694
$$ 1208859 1205291 1201848 1198562 1194572 1189066 1181926 1173514 1164427 1155569 1147703 1140375 1131827 1120763 1108069
59012A108069j2054j0330r838j1290j3257j3969j2809j0222p270n361n440o906
$$ 1108069 1096015 1085685 1075847 1064557 1051300 1037331 1024522 1014300 1007030 1001669 996229 989323
59000I89323p969p545o299n412m993m296l130k265k510l851n414o072n346m094
$$ 989323 981354 973809 967510 962098 957105 952809 949679 947414 944904 941053 935639 929567 924221 920127
58986I20127l815m822n698n173l887l237l118k291p98j95q92j027R46L841N259
$$ 920127 916312 911490 905792 900619 896732 893495 890377 888086 887288 887093 886201 885174 886120 889961 895220
58971H95220M713L804L718M069M216M490N588P532R640J1214J1914J1793J1156
$$ 895220 899933 903737 907455 911524 915740 920230 925818 933350 942990 954204 966118 977911 989067
58958I89067J0453J0239J1043J2768J4232J3922J1598Q613O411N332N129N569
$$ 989067 999520 1009759 1020802 1033570 1047802 1061724 1073322 1081935 1088346 1093678 1098807 1104376
58946A104376N896M840K358M62R44K903M015L770L785N115P081Q775R926R940
$$ 1104376 1110272 1115112 1117470 1117932 1118876 1121779 1125794 1129564 1133349 1138464 1145545 1154320 1164246 1174186
58932A174186P963M740K703L171M698N221M499L214J041k570o411q262p685o550
$$ 1174186 1182149 1186889 1189592 1192763 1197461 1202682 1207181 1210395 1211436 1208866 1202455 1194193 1186508 1179958
58918A179958o504p141p176o429n801n684n252l481n02K469M557O108P757R131
$$ 1179958 1173454 1166313 1159137 1152708 1146907 1141223 1135971 1132490 1131988 1134457 1139014 1145122 1152879 1162010
58904A162010R252Q193P355P845R319J0774J1589J1402R917P571N664M903M291
$$ 1162010 1171262 1179455 1186810 1194655 1203974 1214748 1226337 1237739 1247656 1255227 1260891 1265794 1270085
58891A270085K363q35l856n730o847p938r005r471q992p898p054p186q138q873
$$ 1270085 1272448 1271613 1267757 1262027 1255180 1247242 1238237 1228766 1219774 1211876 1204822 1197636 1189498 1180625
58877A180625q484p089n623m953n308o282p262q012q962j0507j2055j2268j0509
$$ 1180625 1172141 1165052 1159429 1154476 1149168 1142886 1135624 1127612 1118650 1108143 1096088 1083820 1073311
58864A073311p614n092l959m300n326n787n145m362m668n491m836k100Q81K199
$$ 1073311 1065697 1060605 1056646 1052346 1047020 1041233 1036088 1031726 1027058 1021567 1016731 1014631 1015512 1017711
58850A017711K064J817K002K501L484M962O335P508R504J2671J5361J6044J5820
$$ 1017711 1019775 1021592 1023594 1026095 1029579 1034541 1040876 1048384 1057888 1070559 1085920 1101964 1117784
58837A117784J6926J9305K0746K0167J8750J7665J6676J5557J5172J6301J8438
$$ 1117784 1134710 1154015 1174761 1194928 1213678 1231343 1248019 1263576 1278748 1295049 1313487
58826A313487K0383K1266K0902K0121K0598K3016K5280K4228J9529J4396J1738
$$ 1313487 1333870 1355136 1376038 1396159 1416757 1439773 1465053 1489281 1508810 1523206 1534944
58815A534944J0872Q955M510j473p231j1971j6126k0389k4464k7047k7464k6886
$$ 1534944 1545816 1554771 1559281 1557808 1550577 1538606 1522480 1502091 1477627 1450580 1423116 1396230
58803A396230k6868k7132k6248k4262k2812k2453k1849k0316j9199j9645k0649
$$ 1396230 1369362 1342230 1315982 1291720 1268908 1246455 1224606 1204290 1185091 1165446 1144797
58792A144797k0666j9810j9082j8518j7522j6180j4910j3621j2296j1555j1512
$$ 1144797 1124131 1104321 1085239 1066721 1049199 1033019 1018109 1004488 992192 980637 969125
58781I69125j1088r725q625q766q891p381n180m532n324n172l198j337j317k408
$$ 969125 958037 948312 939687 930921 922030 914649 909469 904937 899613 894441 891243 889906 888589 886181
58767H86181l092l166l195l254l276l528l880l603k780k637l542l889k365l20
$$ 886181 883089 879923 876728 873474 870198 866670 862790 859187 856407 853770 850228 846339 843974 843654
58753H43654j39j750k610j176J254K619K589K142J775J188K70o36j345j928k200
$$ 843654 843515 841765 839155 837979 839233 841852 844441 846583 848358 849546 849816 849180 847835 845907 843707
58738H43707j787q71k77n15j151j446j249q95m81J52Q14R10K87l13N0J460L077
$$ 843707 841920 841049 840772 840257 839106 837660 836411 835516 835035 835187 836001 836911 837198 836885 836935 838395 841472
58721H41472M075M424M716N370O196O704O598N818M407K678J355Q68N30q32l122
$$ 841472 845547 849971 854687 860057 866253 872957 879555 885373 889780 892458 893813 894681 895211 894379 891257
58706H91257m633m122k456j462j696k339k681k550j671j8J288R83k80l98J354
$$ 891257 886624 882502 880046 878584 876888 874549 871868 869318 867647 867629 868917 869900 869620 869222 870576
58691H70576L420M398M775N456O150O421O947Q336R726J0063R862J0218J0845
$$ 870576 873996 878394 883169 888625 894775 901196 908143 916479 926205 936268 946130 956348 967193
58678I67193J0696J0003R895J0474J0974J1563J3113J5169J6002J4999J3308J1755
$$ 967193 977889 987892 997787 1008261 1019235 1030798 1043911 1059080 1075082 1090081 1103389 1115144
58666A115144R903P790O837P896R704J0302R114O797M264K751L514O094P879O980
$$ 1115144 1125047 1132837 1139674 1147570 1157274 1167576 1176690 1183487 1187751 1190502 1194016 1200110 1207989 1214969
58652A214969M893M676O921R204R487Q286P062N984M221J515j424l793n327o467
$$ 1214969 1219862 1224538 1231459 1240663 1250150 1258436 1265498 1271482 1275703 1277218 1275794 1272001 1266674 1260207
58638A260207q176j1155j4928j8194k0440k2531k5110k7072k6748k4236k1452
$$ 1260207 1252031 1240876 1225948 1207754 1187314 1164783 1139673 1112601 1085853 1061617 1040165
58627A040165j9747j8694j7569j6782j6876j7035j5967j3758j1496r269o240k936
$$ 1040165 1020418 1001724 984155 967373 950497 933462 917495 903737 892241 882972 876732 873796
58615H73796j682l639o765q028o773m547k480n12J142J770J650K194M086O400
$$ 873796 872114 868475 861710 853682 846909 842362 839882 839370 840512 842282 843932 846126 850212 856612
58601H56612P985Q561Q050O277L925K534K619K916K368J622J473J195m4j191o98
$$ 856612 864597 873158 881208 887485 891410 893944 896563 899479 901847 903469 904942 906137 906093 904902 904204
58586I04204O77O75j057k452k197j383j336j723j821k094l103m103m112l475l019
$$ 904204 904881 905556 904499 902047 899850 898467 897131 895408 893587 891493 888390 884287 880175 876700 873681
58571H73681k391p45J525L182L920M264L999K315l31k070j831n28L99N06L2o55
$$ 873681 871290 870545 872070 875252 879172 883436 887435 889750 889419 887349 885518 884990 885389 885895 885927 885272
58555H85272p09Q95L816O099O446N887O147P171P564O886O018N389M406K836J486
$$ 885272 884563 885458 889274 895373 901819 907706 913853 921024 928588 935474 941492 946881 951287 954123 955609
58540I55609R30N48m31j616j872p89Q23J755J462K98r39j723k007j852j175oJ352
$$ 955609 956539 957087 956656 955040 953168 952379 953202 954957 956419 956717 955778 954055 952048 950196 949021 949015 950367
58523I50367K769M537O829R190J1080J2473J3428J3579J2768J1799J1469J1368
$$ 950367 953136 957673 964502 973692 984772 997245 1010673 1024252 1037020 1048819 1060288 1071656
58511A071656J0657R757R876J0950J1710J1983J3075J5233J6518J5614J4273J5243
$$ 1071656 1082313 1092070 1101946 1112896 1124606 1136589 1149664 1164897 1181415 1197029 1211302 1226545
58499A226545J8530K1511K2356K1682K0709J9422J7160J4023J0882Q367O353M242
$$ 1226545 1245075 1266586 1288942 1310624 1331333 1350755 1367915 1381938 1392820 1401187 1407540 1411782
58487A411782J580j537m592p256r624j1842j3770j5249j6300j6943j7089j6884
$$ 1411782 1413362 1411825 1407233 1399977 1390353 1378511 1364741 1349492 1333192 1316249 1299160 1282276
58475A282276j6662j6356j5599j4699j4679j5723j6398j5264j2689j0130q103
$$ 1282276 1265614 1249258 1233659 1218960 1204281 1188558 1172160 1156896 1144207 1134077 1125974
58464A125974o006l700k015j523j722j749j350q50o13n57j34J064K407K557J160
$$ 1125974 1119968 1116268 1114253 1112730 1111008 1109259 1107909 1107059 1106446 1105889 1105755 1106819 1109226 1111783 1112943
58449A112943m17q11m57n75q91J45K814N244N569M003K180J233J098J239J416
$$ 1112943 1112526 1111715 1111258 1110683 1109792 1109937 1112751 1117995 1123564 1127567 1129747 1130980 1132078 1133317 1134733
58434A134733J802K556L299L242K090N69l26l60O7O67J375K023K517K961L080
$$ 1134733 1136535 1139091 1142390 1145632 1147722 1148291 1147965 1147605 1147672 1148339 1149714 1151737 1154254 1157215 1160295
58419A160295K241P55K60J637L320L267K077K162M068N665N357M025L009K035
$$ 1160295 1162536 1163291 1163551 1165188 1168508 1171775 1173852 1176014 1180082 1185747 1191104 1195129 1198138 1200173
58405A200173L40j574k671k918k908k712k128j490j325j650k280l144l798l387
$$ 1200173 1200513 1198939 1196268 1193350 1190442 1187730 1185602 1184112 1182787 1181137 1178857 1175713 1171915 1168528
58391A168528j723L33K091L709M981M723K469k09j348r77o38j131j944k409k222
$$ 1168528 1166805 1167138 1169229 1172938 1177919 1182642 1185111 1184902 1183554 1182577 1181939 1180808 1178864 1176455 1174233
58376A174233j163M83J537J216N53J314L607N813O892P470Q454R806J1068J2111
$$ 1174233 1173070 1173553 1175090 1176306 1176859 1178173 1181780 1187593 1194485 1201955 1210409 1220215 1231283 1243394
58362A243394J2912J3345J3609J4129J4741J4599J3237J1104Q753O232L701J943
$$ 1243394 1256306 1269651 1283260 1297389 1312130 1326729 1339966 1351070 1359823 1366055 1369756 1371699
58350A371699J629K314K681J718n10k970m417m407l807l972n110n907n086k964
$$ 1371699 1373328 1375642 1378323 1380041 1379531 1376561 1372144 1367737 1363930 1359958 1354848 1348941 1343855 1340891
58336A340891r70Q3O36J355K223K933L629M613N630O040N752N448N586N679M963
$$ 1340891 1339921 1340004 1340640 1341995 1344218 1347151 1350780 1355393 1361023 1367063 1372815 1378263 1383849 1389528 1394491
58321A394491L501K208J876K525L580M339M498M598N650P775R530R443Q072P628
$$ 1394491 1397992 1400200 1402076 1404601 1408181 1412520 1417018 1421616 1427266 1435041 1444571 1454014 1462086 1469714
58307A469714R360J2234J4411J5222J5151J4729J4254J4152J4795J5997J7095
$$ 1469714 1479074 1491308 1505719 1520941 1536092 1550821 1565075 1579227 1594022 1610019 1627114
58296A627114J7524J7136J6215J5370J5094J5238J5132J4321J2927J1362J0130
$$ 1627114 1644638 1661774 1677989 1693359 1708453 1723691 1738823 1753144 1766071 1777433 1787563
58285A787563R820J0638J2010J3223J4443J6193J7900J8234J7149J6330J6964
$$ 1787563 1797383 1808021 1820031 1833254 1847697 1863890 1881790 1900024 1917173 1933503 1950467
58274A950467J8263J8937J9077J9531K0386K1123K1743K2560K3441K4162K5077
$$ 1950467 1968730 1987667 2006744 2026275 2046661 2067784 2089527 2112087 2135528 2159690 2184767
58263B184767K6467K7595K7404K5872K3936K2408K1757K2300K3705K4757K4614
$$ 2184767 2211234 2238829 2266233 2292105 2316041 2338449 2360206 2382506 2406211 2430968 2455582
58252B455582K3921K3817K4361K4933K5616K6944K8727L0346L1857L3520L4663
$$ 2455582 2479503 2503320 2527681 2552614 2578230 2605174 2633901 2664247 2696104 2729624 2764287
58241B764287L4503L3939L4807L7293L9664M0826M1594M2921M4505M5914M7674
$$ 2764287 2798790 2832729 2867536 2904829 2944493 2985319 3026913 3069834 3114339 3160253 3207927
58230C207927N0143N2426N3652N4547N6527N9731O3029O5697O8028P0493P3300
$$ 3207927 3258070 3310496 3364148 3418695 3475222 3534953 3597982 3663679 3731707 3802200 3875500
58219C875500P6804Q1276Q5941Q9228R0678R1918R4859R9243J03073J05537J08256
$$ 3875500 3952304 4033580 4119521 4208749 4299427 4391345 4486204 4585447 4688520 4794057 4902313
58208D902313J13031J19401J25554J30964J36668J43190J49779J55996J62630
$$ 4902313 5015344 5134745 5260299 5391263 5527931 5671121 5820900 5976896 6139526
58199F139526J70468J79181J88096J97078K06167K15250K24680K35340K47640
$$ 6139526 6309994 6489175 6677271 6874349 7080516 7295766 7520446 7755786 8003426
58190H003426K61289K76238K92723L10238L28022L46811L68109L91168M13148
$$ 8003426 8264715 8540953 8833676 9143914 9471936 9818747 10186856 10578024 10991172
58181A0991172M33432M55261M81245N09727N37956N66608N98170O32575O67838
$$ 10991172 11424604 11879865 12361110 12870837 13408793 13975401 14573571 15206146 15873984
58172A5873984P03865P42330P83454Q26228Q71429R21306R76380J035665J099833
$$ 15873984 16577849 17320179 18103633 18929861 19801290 20722596 21698976 22734641 23834474
58163B3834474J171002J249299J332723J420609J514212J613798J718538J829741
$$ 23834474 25005476 26254775 27587498 29008107 30522319 32136117 33854655 35684396
58155C5684396J951002K084561K230640K390739K568200K765017K981768L221531
$$ 35684396 37635398 39719959 41950599 44341338 46909538 49674555 52656323 55877854
58147E5877854L490222L792355M130658M511241M945368N444950O020240O682523
$$ 55877854 59368076 63160431 67291089 71802330 76747698 82192648 88212888 94895411
58139I4895411P444028Q314107R301532J0422582J1699949J3148632J4764310
$$ 94895411 102339439 110653546 119955078 130377660 142077609 155226241 169990551
58132A69990551J6521786J8374443K0256075K2093090K3791364K5135128K5637213
$$ 169990551 186512337 204886780 225142855 247235945 271027309 296162437 321799650
58125C21799650K4540635K1140275J5289782P685032l67018p544191j3020125
$$ 321799650 346340285 367480560 382770342 390455374 390088356 382544165 369524040
58118C69524040j6587240j8470745j9101564j8984427j8601736j8286060j8122130
$$ 369524040 352936800 334466055 315364491 296380064 277778328 259492268 241370138
58111B41370138j7980793j7673294j7096361j6264724j5252236j4131473j2958348
$$ 241370138 223389345 205716051 188619690 172354966 157102730 142971257 130012909
58104A30012909j1779788j0634337r547652q534967p606734o768932o021748n362312
$$ 130012909 118233121 107598784 98051132 89516165 81909431 75140499 69118751 63756439
58096F3756439m786798m287237l850013l462380l119339k820918k564480k343527
$$ 63756439 58969641 54682404 50832391 47370011 44250672 41429754 38865274 36521747
58088C6521747k152480j988113j846018j719390j602225j491554j386251j285954
$$ 36521747 34369267 32381154 30535136 28815746 27213521 25721967 24335716 23049762
58080B3049762j191392j103806j023427r49750q82857q22826p68346p18046o72858
$$ 23049762 21858370 20754564 19731137 18781387 17898530 17075704 16307358 15589312 14916454
58071A4916454o34929o04134n77660n52873n28630n04081m78836m54487m33253
$$ 14916454 14281525 13677391 13099731 12546858 12018228 11514147 11035311 10580824 10147571
58062A0147571m14448l94934l73948l54660l39429l26096l11228k95045k80446
$$ 10147571 9733123 9338189 8964241 8609581 8270152 7944056 7632828 7337783 7057337
58053G057337k68370k56953k44948k33359k23286k14141k04832j95378j86606
$$ 7057337 6788967 6532014 6287066 6053707 5830421 5616280 5411448 5216070 5029464
58044E029464j78967j72307j66232j60332j54391j48609j43300j38229j32770
$$ 5029464 4850497 4678190 4511958 4351626 4197235 4048626 3905326 3767097 3634327
58035C634327j26763j20836j15540j10633j05498r9997r4545q9432q4543p9860
$$ 3634327 3507564 3386728 3271188 3160555 3055057 2955060 2860515 2771083 2686540 2606680
58025B606680p5778p2493o9253o4969n9770n5246n2544n0851m8652m6118m4724
$$ 2606680 2530902 2458409 2389156 2324187 2264417 2209171 2156627 2105776 2057124 2011006 1966282
58014A966282m4457m3106l9351l5257l3994l5613l6963l5848l3506l2170l1646
$$ 1966282 1921825 1878719 1839368 1804111 1770117 1734504 1697541 1661693 1628187 1596017 1564371
58003A564371k9913k6420k3162k2242k3539k5305k6278k6473k6329k5893k4967
$$ 1564371 1534458 1508038 1484876 1462634 1439095 1413790 1387512 1361039 1334710 1308817 1283850
57992A283850k3605k2204k1212k0770k0609k0300j9683j8925j8155j7231j6047
$$ 1283850 1260245 1238041 1216829 1196059 1175450 1155150 1135467 1116542 1098387 1081156 1065109
57981A065109j4941j4444j4670j5122j5088j4159j2502j0961j0609j1737j3318
$$ 1065109 1050168 1035724 1021054 1005932 990844 976685 964183 953222 942613 930876 917558
57970I17558j3961j3506j3133j3657j4350j3967j2505j1149j0514r820q191o191
$$ 917558 903597 890091 876958 863301 848951 834984 822479 811330 800816 790996 782805 776614
57958G76614n363o265p663p921o827n563n064n082m939m519m060l500k709k047
$$ 776614 771251 764986 757323 749402 742575 737012 731948 726866 721927 717408 713348 709848 707139 705092
57944G05092j952k023j450l65R4n79j454j520j097j174j855k388k374k124j972
$$ 705092 703140 701117 699667 699302 699396 698817 697363 695843 694746 693572 691717 689329 686955 684831 682859
57929F82859k062k716m176n839o559n950m725l667k945k680l341m905o306o482
$$ 682859 680797 678081 673905 668066 661507 655557 650832 647165 644220 641540 638199 633294 626988 620506
57915F20506n747n355n816o328n969m970m355m585m897m213k572j270j275j949
$$ 620506 614759 609404 603588 597260 591291 586321 581966 577381 572484 568271 565699 564429 563154 561205
57901E61205j940j156q59j581k211j876j708l307o024p382o313m465l794m250
$$ 561205 559265 558109 557250 555669 553458 551582 549874 546567 540543 533161 526848 522383 518589 514339
57887E14339m580m311l769k964j770q20r53j803k074j301l85j28j98K3L48K00
$$ 514339 509759 505448 501679 498715 496945 496125 495172 493369 491295 489994 489609 489481 489283 489306 489654 489854
57871D89854l69o41j00R48J569R90n24j675j459m22O4l10n26j03j18j650m068
$$ 489854 489485 488844 488744 489692 491261 492251 491727 490052 488593 488171 488235 487925 487399 487296 487178 485528 481460
57854D81460n800o282o165n896n286m434m074m649n675o342o349n923n448n247
$$ 481460 475660 469378 463213 457317 452031 447597 443523 438874 433199 426857 420508 414585 409137 403890
57840D03890n316n203m406l096k151k319l427m457m379l167j979k071l234l800
$$ 403890 398574 393371 388965 385869 383718 381399 377972 373515 369136 365969 363990 361919 358685 354885
57826C54885k600m80O93K17q96j240k28J742L556L988K825J250M23L7q33j853
$$ 354885 352285 351805 352498 352715 351819 350579 350351 352093 355649 359637 362462 363712 364135 364172 363339 361486
57810C61486j912j314j769l717n342n126l999l777m568n110m903m511m153l428
$$ 361486 359574 358260 356491 352774 347432 342306 338307 334530 329962 324852 319949 315438 311285 307857
57796C07857k382j701j708k009k105j693n27J245K783L491M008N346P188Q164
$$ 307857 305475 303774 302066 300057 297952 296259 295732 296977 299760 303251 307259 312605 319793 327957
57782C27957P891P479P692P725O492M166J707m12k157l111k734j322J9M42q4j223
$$ 327957 335848 343327 351019 358744 365236 369402 371109 370697 368540 365429 362695 361373 361392 361834 361750 360527
57766C60527k790m661o478p619p485o044m162l065l086l193k195l01J045R00q0
$$ 360527 357737 353076 346598 338979 331494 325450 321288 318223 315137 311944 309749 309448 310493 311393 311313
57751C11313n71j13N99O99Qj149k503m108o055q067r428r487q428p390p419q228
$$ 311313 310742 310629 311228 311927 311935 310786 308283 304175 298120 290053 280625 271138 262710 255320 247901 239673
57735B39673q328o725m228k611k537k815j899K50K246L008K812K437J869N37j318
$$ 239673 231345 224620 220392 217781 215244 212429 210530 210780 213026 216034 218846 221283 223152 223689 222371
57720B22371k366j746l43L24J32L70J629K791K629J603J273K373M299O115P195
$$ 222371 220005 218259 217916 218240 218372 218742 220371 223162 225791 227394 228667 231040 235339 241454 248649
57705B48649P148N986M379K998J610l52k454l478l111k501k731l577m153m053
$$ 248649 255797 261783 266162 269160 270770 270418 267964 264486 261375 258874 256143 252566 248413 244360
57691B44360l389k415j664j884l159m473m631l407j574j78O1q28j928k283k002
$$ 244360 240971 238556 236892 235008 231849 227376 222745 219338 217764 217586 217647 216819 214891 212608 210606
57676B10606j958k282k184j416q54j018j200q15n07r74j715k019k153k369j702
$$ 210606 208648 206366 204182 202766 201912 200894 199694 198879 198372 197398 195683 193664 191511 189142 187440
57661A87440N89L096L571J789l62j440j481q74J53Q78O64K20O74J391N70j768
$$ 187440 188029 191125 194696 196485 196123 194683 193202 192328 192481 193359 194023 194243 194917 196308 196878 195110
57645A95110l366k869j469o35r0Q08J431J060L16j1m17j469k223j417M65J796
$$ 195110 191744 188875 187406 186771 186681 187489 188920 189980 190296 190285 189868 188399 186176 184759 185224 187020
57629A87020J945J474Q37J88M1P58J798K666L939O046P688P339N929O127Q892
$$ 187020 188965 190439 191276 191464 191505 192263 194061 196727 200666 206712 214400 221739 227668 233795 242687
57614B42687J2566J5624J8521K2199K6535L1216L6896M4220N2260N8603O0520
$$ 242687 255253 270877 289398 311597 338132 369348 406244 450464 502724 561327 621847
57603F21847N5905M4165K6985P609j1062k7212l9257m5824m7323m6242m4813m3154
$$ 621847 677752 721917 748902 756511 745449 718237 678980 633156 585833 539591 494778 451624
57591D51624m0438l6788l2932k8997k4956k1612j9590j7912j5065j1364q643p674
$$ 451624 411186 374398 341466 312469 287513 265901 246311 228399 213334 201970 193327 185653
57579A85653p279o322n087m169l310k117r87m02m9N09Q20N8j692l362l895k951
$$ 185653 178374 172052 166965 162796 159486 157369 156382 155980 155931 156440 157260 157318 155626 152264 148369 145418
57563A45418j021O62Q00p04k427l092l122l727m747m636k839j008j060k751m070
$$ 145418 144397 145059 145859 145155 142728 139636 136514 132787 128040 123404 120565 119557 118497 115746 111676
57548A11676l764k619k073k336k312j166N91J671J401L55l58j48O10R39N2j894
$$ 111676 107912 105293 103220 100884 98572 97406 97997 99668 101069 101424 101066 100918 101528 102467 102519 100625
57532A00625l683m078l253k753l635n072n433m421l214k660k348j833j581k058
$$ 100625 96942 92864 89611 86858 83223 78151 72718 68297 65083 62423 60075 58242 56661 54603
57518E4603k697k697k313k349k670k270q41O76J324J206R20N85j02j180k192k671
$$ 54603 51906 49209 46896 44547 41877 39607 38766 39442 40766 41972 42892 43477 43375 42195 40003 37332
57502C7332k631k625l183m029m159k974j211n5M37J238K580L266K301M09q41r82
$$ 37332 34701 32076 28893 24864 20705 17731 16520 16465 16902 18140 20720 23986 26287 26696 25855 24873
57486B4873q82j239j668j380k07J252K199K180J350L14l79n06j4J012K028K164
$$ 24873 23991 22752 21084 19704 19497 20749 22948 25128 26478 26792 26413 25907 25893 26905 28933 31097
57470C1097J277M70P42J396P61j317k817j940O48K780L395L186K957K483J257
$$ 31097 32374 32844 33586 34982 35743 34426 31609 29669 30317 33097 36492 39678 42635 45118 46375
57455D6375n01k060k873k644j223R96K930L662L348K796K349J734Q84K21P5M04
$$ 46375 45874 43814 40941 38297 37074 38070 41000 44662 48010 50806 53155 54889 55773 55994 56069 56473
57439E6473J208K511L765M051L327K662K685K576J496K30R8P02L59j168k150j598
$$ 56473 57681 60192 63957 68008 71335 73997 76682 79258 80754 80984 81082 81784 82143 80975 78825 77227
57423G7227r17j750l431m046l296k738l456m880n979o391o191n558n048n297o196
$$ 77227 76310 74560 71129 67083 63787 61049 57593 52713 46734 40343 34152 28594 23546 18249 12053
57408A2053E052b291p384o946n670m106l477l857l933l284l346m970o371n336
$$ 12053 5052 -2291 -9675 -16621 -22291 -26397 -29874 -33731 -37664 -40948 -44294 -49264 -55635 -60971
57394f0971k587q29r15j176o54n72j784k895k375r25j16Q5O41J219N93j032j976
$$ -60971 -63558 -64387 -65302 -66478 -67132 -67704 -69488 -72383 -74758 -75683 -75799 -75714 -75073 -73854 -73261 -74293 -76269
57377g6269j455l73M16J065J633J594J082J217K387L378L082K023J270R00N94
$$ -76269 -77724 -78097 -77681 -76616 -74983 -73389 -72307 -71090 -68703 -65325 -62243 -60220 -58950 -58050 -57456
57362e7456P76J750K379J303p95j733o74Q78J281O51Q3mk8l86r48j151l32J564
$$ -57456 -56680 -54930 -52551 -51248 -52043 -53776 -54450 -53572 -52291 -51640 -51557 -51561 -51589 -51975 -52923 -54074 -54406 -52842
57344e2842L439L884K729J231N07M74O15R35J634K414K767K609K145J519J023
$$ -52842 -49403 -45519 -42790 -41559 -41052 -40578 -39963 -39028 -37394 -34980 -32213 -29604 -27459 -25940 -24917
57329b4917J199K118K910K741K015J928K880M003g82C116L224K465J382J97j37
$$ -24917 -23718 -21600 -18690 -15949 -13934 -12006 -9126 -5123 -782 3116 6340 8805 10187 10384 10247
57314A0247J155L660O046P378P772P725P344O641O044O018O434O922P453P965
$$ 10247 11402 15062 21108 28486 36258 43983 51327 57968 64012 70030 76464 83386 90839 98804
57300I8804P972P404P249Q135Q751P396M839L608M188M286K661J309K280M458
$$ 98804 106776 114180 121429 129564 138315 145711 150550 154158 158346 162632 165293 166602 168882 173340
57286A73340N656O138P442Q993Q930P766Q121J0561J2500J1985J0071Q535P473
$$ 173340 178996 185134 192576 201569 210499 218265 226386 236947 249447 261432 271503 280038 287511
57273B87511O506O241O951P350O396N155N254O435P242P234O925O248M926L955
$$ 287511 294017 300258 307209 314559 320955 326110 331364 337799 345041 352275 359200 365448 370374 374329
57259C74329M838P219Q793Q130O353N492O114P167P578P385P427Q361R978J1419
$$ 374329 379167 386386 395179 403309 409662 415154 421268 428435 436013 443398 450825 459186 469164 480583
57245D80583J1954J1388R929Q168P089P245P751P100N432M868O735R512J0703
$$ 480583 492537 503925 513854 522022 529111 536356 544107 551207 556639 561507 568242 577754 588457
57232E88457R979R039Q985R417R873J0530J1253J1352J0696R988R606R246Q950
$$ 588457 598436 607475 616460 625877 635750 646280 657533 668885 679581 689569 699175 708421 717371
57219G17371R401J0772J2267J3253J3959J4646J4987J4791J4590J4871J5376J5622
$$ 717371 726772 737544 749811 763064 777023 791669 806656 821447 836037 850908 866284 881906
57207H81906J5532J5266J4948J4871J5272J5744J5568J4793J4135J3773J3320
$$ 881906 897438 912704 927652 942523 957795 973539 989107 1003900 1018035 1031808 1045128
57196A045128J3080J3888J5307J5646J4612J4262J6046J8412J8996J8007J7471
$$ 1045128 1058208 1072096 1087403 1103049 1117661 1131923 1147969 1166381 1185377 1203384 1220855
57185A220855J7928J7990J6926J5709J5409J6025J7151J8383J9013J8639J8122
$$ 1220855 1238783 1256773 1273699 1289408 1304817 1320842 1337993 1356376 1375389 1394028 1412150
57174A412150J8661J9899K0333J9667J9186J9509J9623J8695J7371J6527J5993
$$ 1412150 1430811 1450710 1471043 1490710 1509896 1529405 1549028 1567723 1585094 1601621 1617614
57163A617614J5246J4405J3816J3671J4424J6469J8996K0625K1710K4235K8519
$$ 1617614 1632860 1647265 1661081 1674752 1689176 1705645 1724641 1745266 1766976 1791211 1819730
57152A819730L1964L2644L2298L3729L6560L8080L7491L6642L6618L6306L4908
$$ 1819730 1851694 1884338 1916636 1950365 1986925 2025005 2062496 2099138 2135756 2172062 2206970
57141B206970L3477L2870L2023K9748K6925K5299K4827K3706K0945J7713J5852
$$ 2206970 2240447 2273317 2305340 2335088 2362013 2387312 2412139 2435845 2456790 2474503 2490355
57130B490355J5814J6526J6938J7139J7723J8488J8476J7451J6464J6399J6575
$$ 2490355 2506169 2522695 2539633 2556772 2574495 2592983 2611459 2628910 2645374 2661773 2678348
57119B678348J5776J4147J2971J2657J2201J0883R426Q989R746J1005J2125J2897
$$ 2678348 2694124 2708271 2721242 2733899 2746100 2756983 2766409 2775398 2785144 2796149 2808274 2821171
57107B821171J3439J3946J4264J3668J1581Q490N460K634r89n991j1522j6153
$$ 2821171 2834610 2848556 2862820 2876488 2888069 2896559 2902019 2904653 2903664 2897673 2886151 2869998
57095B869998j9162k0657k1117k1253k1760k2657k3220k2829k1571j9959j8549
$$ 2869998 2850836 2830179 2809062 2787809 2766049 2743392 2720172 2697343 2675772 2655813 2637264
57084B637264j7984j8727k0507k2623k4996k8493l4090m2215n2810o5168p7921
$$ 2637264 2619280 2600553 2580046 2557423 2532427 2503934 2469844 2427629 2374819 2309651 2231730
57073B231730r0166j02690j16828j32083j46482j59728j74298j92486k13938k37331
$$ 2231730 2141564 2038874 1922046 1789963 1643481 1483753 1309455 1116969 903031 665700
57063F65700k62874A11411b10755l53395l84892m18245m54785m94922n39277n88885
$$ 665700 402826 111411 -210755 -564150 -949042 -1367287 -1822072 -2316994 -2856271 -3445156
57053c445156o44087p04426p69923q41558r20539j007950j105277j214397j337116
$$ -3445156 -4089243 -4793669 -5563592 -6405150 -7325689 -8333639 -9438916 -10653313 -11990429
57044a1990429j475179j630430j804427j998582k215606k460140k736811l048083
$$ -11990429 -13465608 -15096038 -16900465 -18899047 -21114653 -23574793 -26311604 -29359687
57036b9359687l394791l777633m196243m646912n122036n610662o098023o565008
$$ -29359687 -32754478 -36532111 -40728354 -45375266 -50497302 -56107964 -62205987 -68770995
57028f8770995o988440p338872p577008p660480p566789p311775o932773o439324
$$ -68770995 -75759435 -83098307 -90675315 -98335795 -105902584 -113214359 -120147132 -126586456
57020a26586456n778285m855648l602883k033003k45531J614010L405570N027293
$$ -126586456 -132364741 -137220389 -140823272 -142856275 -143101806 -141487796 -138082226 -133054933
57012a33054933O420255P553866Q409293Q974422R249972R255960R030603Q623206
$$ -133054933 -126634678 -119080812 -110671519 -101697097 -92447125 -83191165 -74160562 -65537356
57004f5537356Q086210P468583O811145O145032N493355M873446M297523L772295
$$ -65537356 -57451146 -49982563 -43171418 -37026386 -31533031 -26659585 -22362062 -18589767
56996a8589767L299300K876476K500443K168431J878502J627959J412219J226112
$$ -18589767 -15290467 -12413991 -9913548 -7745117 -5866615 -4238656 -2826437 -1600325
56988a600325e34361C95077Q13527P14039O27626N53073M89855M36060L88630
$$ -1600325 -534361 395077 1208604 1922643 2550269 3103342 3593197 4029257 4417887
56979D417887L45345L05803K70441K39146K11137J85784J63066J43070J25538
$$ 4417887 4763232 5069035 5339476 5578622 5789759 5975543 6138609 6281679 6407217
56970F407217J10324R7801Q8085Q0228P3467O9083O9094P2748P7083Q2681R5663
$$ 6407217 6517541 6615342 6703427 6783655 6857122 6926205 6995299 7068047 7145130 7227811 7323474
56959G323474J18821J40712J38799R7636K3642n9548j29284j76913k05983k22755
$$ 7323474 7442295 7583007 7721806 7819442 7843084 7783536 7654252 7477339 7271356 7048601
56949G048601k30304k29567k22605k13170k04351j96768j89646j82957j77569
$$ 7048601 6818297 6588730 6366125 6152955 5948604 5751836 5562190 5379233 5201664
56940E201664j73600j70058j66508j63788j62334j60878j57907j53752j50093
$$ 5201664 5028064 4858006 4691498 4527710 4365376 4204498 4046591 3892839 3742746
56931C742746j47790j46196j44263j41325j36912j30980j24458j18654j13824
$$ 3742746 3594956 3448760 3304497 3163172 3026260 2895280 2770822 2652168 2538344
56922B538344j08989j03469r7837r3060q9223q5644q1875p8078p4458p0934o7447
$$ 2538344 2429355 2325886 2228049 2134989 2045766 1960122 1878247 1800169 1725711 1654777 1587330
56911A587330o4232o1421n8444n4333m8839m2893l7597l3019k8493k3830j9482
$$ 1587330 1523098 1461677 1403233 1348900 1300061 1257168 1219571 1186552 1158059 1134229 1114747
56900A114747j5572j1658p742m621k882k379l110n680r936j4106j6433j7267j8233
$$ 1114747 1099175 1087517 1079775 1075154 1072272 1069893 1066783 1061103 1051167 1037061 1020628 1003361 985128
56887I85128j9644k0131j8990j7512j7336j8332j8901j7856j5398j2497r896p639
$$ 985128 965484 945353 926363 908851 891515 873183 854282 836426 821028 808531 798635 790996
56875G90996n365k948p86P96K204M022N682N355J680m602j1087j5684j8020j9150
$$ 790996 785631 782683 781897 782693 784897 788919 794601 799956 801636 797034 785947 770263 752243 733093
56861G33093k0284k1796k3166k3575k2597k0451j7912j5863j4634j3643j2050
$$ 733093 712809 691013 667847 644272 621675 601224 583312 567449 552815 539172 527122
56850E27122r815p735o412n782n798o707q032q354p032n421n070n337m392k259
$$ 527122 517307 509572 503160 497378 491580 484873 476841 468487 461455 456034 450964 445627 441235 438976
56836D38976r62j387j961j264k44m62j408j145R52L525N051N270M928M904N445
$$ 438976 438014 436627 434666 433402 433158 432696 431288 430143 431095 434620 439671 444941 449869 454773 460218
56821D60218N669M244J175j639k477j818j292j182k94J978M860P606J0323J3086
$$ 460218 465887 470131 471306 469667 467190 465372 464080 462898 462604 464582 469442 477048 487371 500457
56807E00457J5339J6683J7489J8300J9389K1093K3678K6441K7698K6289K2558
$$ 500457 515796 532479 549968 568268 587657 608750 632428 658869 686567 712856 735414
56796G35414J7551J1928O106O86l971q078j1671j3948j4025j2126r479p055m752
$$ 735414 752965 764893 770999 771685 767714 759636 747965 734017 719992 707866 698387 691332 686580
56783F86580j749K559P804J2719J6315J9000K2165K6530L1421L5660L8323L8389
$$ 686580 684831 687390 695194 707913 724228 743228 765393 791923 823344 859004 897327 935716
56771I35716L4716K7196J7386P249k377j1469j9660k6118l0221l1646l0264k6800
$$ 935716 970432 997628 1015014 1022263 1019886 1008417 988757 962639 932418 900772 870508 843708
56759H43708k3060k0395j8087j4322q734k907J708N324Q965J3002J7030K0390
$$ 843708 820648 800253 782166 767844 759110 756203 757911 763235 772200 785202 802232 822622
56747H22622K2266K1858J8964J4165Q097R78o760j3937j9241k2355k4082k5390
$$ 822622 844888 866746 885710 899875 907972 908950 902190 888253 869012 846657 822575 797185
56735G97185k6523k6883k5721k2982j9445j5973j2721r444o324l941k446j271
$$ 797185 770662 743779 718058 695076 675631 659658 646937 637493 631169 627228 624782 623511
56723F23511K41K304M765P060Q088O839L466q16n064r138j2752j4972j5393j5109
$$ 623511 623752 626056 630821 637881 645969 652808 656274 655458 650394 641256 628504 613532 598139 583030
56709E83030j5527j6541j6790j5589j3797j2598j2169j1838j1132j0243r608r284
$$ 583030 567503 550962 534172 518583 504786 492188 480019 468181 457049 446806 437198 427914
56697D27914q903q231p541p187o889n938m316l053l143m381n670o150n694m651
$$ 427914 419011 410780 403239 396052 389163 383225 378909 375856 372713 368332 362662 356512 350818 346167
56683C46167l531k735k178j512r26j224k578l771l589k456j722j535q07P17J799
$$ 346167 342636 339901 337723 336211 335285 334061 331483 327712 324123 321667 319945 318410 317603 318320 320119
56668C20119J639J172J512K086J588J23r57j104j077j324j164j51Q88R61L46J4
$$ 320119 321758 322930 324442 326528 328116 328239 327282 326178 325101 323777 322613 322462 323350 324311 324657 324671
56652C24671R4j86j217k491l318l361k617j580j325k423l724l299j068O71J5k230
$$ 324671 324765 324579 323362 320871 317553 314192 311575 309995 308670 306247 302523 299224 298156 298827 298842 296612
56636B96612l913m395m709n502o281o565o418n783m577l574l789m709m513k578
$$ 296612 292699 288304 283595 278093 271812 265247 258829 253046 248469 244895 241106 236397 231884 229306
56622B29306n00J98J0K78J240K409L760N191N663M466K780K426L445M391M713
$$ 229306 228806 229004 229014 229292 230532 232941 236701 241892 247555 252021 254801 257227 260672 265063 269776
56607B69776N097N487M636K230j16p96k8J006J749K264K492K441K451K567K240
$$ 269776 274873 280360 284996 287226 287110 286314 286286 287292 289041 291305 293797 296238 298689 301256 303496
56592C03496J297N56O76J018N69n12j194j233j392j898j706J31K849M393L496
$$ 303496 304793 305349 306025 307043 307612 307100 305906 304673 303281 301383 299677 299808 302657 307050 310546
56577C10546J052q03r08nN63O02Q65J462J545P96K51R28K280K852K125R71M46
$$ 310546 311598 310795 309887 309882 310445 311047 311912 313374 314919 315715 315966 316894 319174 322026 324151 325122 325568
56560C25568Q52K013L703N438O276N411L077O13o48o34m45r35j719j883j313o25
$$ 325568 326420 328433 332136 337574 343850 349261 352338 352951 352303 351669 351224 350289 348570 346687 345374 344749
56544C44749p7O88J771K738L337L620L263J752l07j132J53K210L074K433J445
$$ 344749 344672 345360 347131 349869 353206 356826 360089 361841 361534 360402 360555 362765 365839 368272 369717
56529C69717Q93O06L77L58M81L47j48n67l79N76J824K387J631L32J03J281K305
$$ 369717 370610 371216 371593 371951 372432 372779 372631 372064 371685 372261 374085 376472 378103 378435 378538 379819 382124
56512C82124J949J160J566L043M245M775N103M885L413J706J986M582P173P873
$$ 382124 384073 385233 386799 389842 394087 398862 403965 408850 412263 413969 415955 420537 427710 435583
56498D35583P359P102P080O434N111L631K267J498K185M165N631N165L496K079
$$ 435583 442942 450044 457124 463558 468669 472300 474567 476065 478250 482415 488046 493211 496707 498786
56484D98786R57m79j631j586j228k361m795o304n745m323l378k737k047j936k702
$$ 498786 499743 499264 497633 496047 494819 492458 487663 481359 475614 471291 467913 465176 463129 461193 458491
56469D58491l289k906k545l449m902n172m232l794m634n403m667k889j710j926
$$ 458491 455202 452296 449751 446302 441400 436228 431996 428202 423568 418165 413498 410609 408899 406973
56455D06973k963l808l837l014j912j327j480j714j406r50j171j845j674p0J758
$$ 406973 404010 400202 396365 393351 391439 390112 388632 386918 385512 384562 383391 381546 379872 379802 381560
56440C81560K220J438R98J661K301J491n49k318k943k889k873k823k277j269l38
$$ 381560 383780 385218 386216 387877 390178 391669 391120 388802 385859 382970 380097 377274 374997 373728 373390
56425C73390J86M80P68R33P14K61J98J040K510L600L449K176P52Q5K43O28P14
$$ 373390 373576 374056 374824 375757 376471 376732 376930 377970 380480 384080 387529 389705 390457 390542 390785 391413 392127
56408C92127N46M95O65P60N33K16L03R08J516J436N20n25o07O49K203K282K07
$$ 392127 392673 393168 393833 394593 395126 395342 395645 396553 398069 399505 400025 399500 398893 399542 401745 404027 404234
56391D04234k630m066l380j782p44m61j63N94J462J805J381N16j52k24J09M08
$$ 404234 401604 397538 394158 392376 391632 391171 391008 391602 393064 394869 396250 396766 396614 396390 396499 396907
56375C96907N43N78K52p18j759j681k55J123R23q34k812l788l257j215J758M415
$$ 396907 397450 398028 398280 397562 395803 394122 393867 394990 395913 395079 392267 388479 385222 384007 385765 390180
56359C90180N578N054L465J503j87q27p1J369K301K194J323J51q61j110m45L43
$$ 390180 395758 400812 404277 405780 405593 404766 404695 406064 408365 410559 411882 412033 411172 410062 409617 409960
56343D09960L35k49l03P38K394L880M601M189K887J794J768K286K211J410O44
$$ 409960 410295 410046 409743 410481 412875 416755 421356 425545 428432 430226 431994 434280 436491 437901 438545
56328D38545J65k95l83M28J394J152M9j49P40P06j014k030j30L138M355K866J308
$$ 438545 438710 438415 438032 438460 439854 441006 441055 440906 441646 442352 441338 439308 439178 442316 446671 449537 450845
56311D50845J792L532M496L909K460J061J0q99j829k499k514k015j522j060k89
$$ 450845 452637 456169 460665 464574 467034 468095 468105 467206 465377 462878 460364 458349 456827 455767 455478
56296D55478M52L87j63J18J199J210o11k148j375L46J94j852l050j838O11K739
$$ 455478 455930 456317 456154 456272 457471 458681 458070 455922 454547 454893 455087 453235 450185 448347 448958 451697
56280D51697M264N226N466N537O356P490P362N656L829K884K399K344L827O892
$$ 451697 455961 461187 466653 472190 478546 486036 493398 499054 502883 505767 508166 510510 514337 521229
56266E21229R286Q870O182L463K076J857K017J656K73j317j411L79K308K656J759
$$ 521229 530515 539385 545567 549030 551106 552963 554980 556636 556909 555592 554181 554560 556868 559524 561283
56251E61283Q95L35k91n18M24K001K564J261r60k191j087J904M490M468K217L94
$$ 561283 562178 562513 562222 561704 562128 564129 566693 567954 566994 564803 563716 565620 570110 574578 576795 577189
56235E77189P67K469L938M993N842N618L733J659J329K394K884K245J806K372
$$ 577189 577956 580425 584363 589356 595198 600816 604549 606208 607537 609931 612815 615060 616866 619238
56221F19238L207L562L609L494K892J891J169R71R63J241K403M386O289P491P958
$$ 619238 622445 626007 629616 633110 636002 637893 639062 640033 640996 642237 644640 649026 655315 662806 670764
56206F70764P437N721L864L699N467P198P195O015N230N204N233N214N966P898
$$ 670764 678201 683922 687786 691485 696952 704150 711345 717360 722590 727794 733027 738241 744207 752105
56192G52105J0228J1695J1842J1464J1813J3279J5006J5994J6252J6479J6995
$$ 752105 762333 774028 785870 797334 809147 822426 837432 853426 869678 886157 903152
56181I03152J7719J8797K0351K1727K1970K1105K0006J9039J7795J6176J4643
$$ 903152 920871 939668 960019 981746 1003716 1024821 1044827 1063866 1081661 1097837 1112480
56170A112480J3161J1049Q184N185K100j777o121r104r748r674j1060j3553j4798
$$ 1112480 1125641 1136690 1144874 1150059 1152159 1150382 1144261 1135157 1125409 1115735 1104675 1091122 1076324
56157A076324j3788j2228j2166j3357j3746j2141r699q597r565j1158j1495j0162
$$ 1076324 1062536 1050308 1038142 1024785 1011039 998898 989199 980602 971037 959879 948384 938222
56145I38222q021n839l987l110l799n346o005m929l056j714j263j416j825j724
$$ 938222 930201 924362 920375 917265 913466 908120 902115 897186 894130 892416 891153 889737 887912 886188
56131H86188q8K951N648O563O257O212O713O816N944M502L185K618L242M780O132
$$ 886188 886100 889051 894699 901262 907519 913731 920444 927260 933204 937706 940891 943509 946751 951531 957663
56116I57663O662P121Q268R135Q109N611M153N251P597Q952Q887Q816R874J1614
$$ 957663 964325 971446 979714 988849 996958 1002569 1006722 1011973 1019570 1028522 1037409 1046225 1056099 1067713
56102A067713J2761J2786J2486J3043J4382J5040J4130J3028J4027J7308K0466
$$ 1067713 1080474 1093260 1105746 1118789 1133171 1148211 1162341 1175369 1189396 1206704 1227170
56091A227170K1443K0840K0580K1317K2327K3297K4743K6780K8928L1453L5566
$$ 1227170 1248613 1269453 1290033 1311350 1333677 1356974 1381717 1408497 1437425 1468878 1504444
56080A504444M1501M7482N1612N4245N7404O2276O8552P5983Q5025R5416J05403
$$ 1504444 1545945 1593427 1645039 1699284 1756688 1818964 1887516 1963499 2048524 2143940 2249343
56069B249343J13247J18591J21417J20626J14981J05202R3856Q3182P3970O6494
$$ 2249343 2362590 2481181 2602598 2723224 2838205 2943407 3037263 3120445 3194415 3260909
56059C260909O1131N7520N3891M7928L8183K4870J0023l194j2405j7905k2231
$$ 3260909 3322040 3379560 3433451 3481379 3519562 3544432 3554455 3551261 3538856 3520951 3498720
56048C498720k7772l5459m5626n8577p3342q6936r6240j00472j01009r9158r5049
$$ 3498720 3470948 3435489 3389863 3331286 3257944 3171008 3074768 2974296 2873287 2774129 2679080
56037B679080q8558q0267p1126o1785n2585m3971l6553l0613k5636k0563j4971
$$ 2679080 2590522 2510255 2439129 2377344 2324759 2280788 2244235 2213622 2187986 2167423 2152452
56026B152452r901o801n403l490O20N844R561J0777J1071J2258J4182J5461J5770
$$ 2152452 2142551 2135750 2130347 2126857 2127477 2133321 2142882 2153659 2164730 2176988 2191170 2206631 2222401
56013B222401J6331J8129K0582K2461K3528K4516K5885K7446K9210L1504L3961
$$ 2222401 2238732 2256861 2277443 2299904 2323432 2347948 2373833 2401279 2430489 2461993 2495954
56002B495954L5432L5647L6046L8007M1021M3575M5348M7221M9538N1725N3490
$$ 2495954 2531386 2567033 2603079 2641086 2682107 2725682 2771030 2818251 2867789 2919514 2973004
55991B973004N5124N6541N7261N7429N7715N8125N8229N8614O0604O4160O7499
$$ 2973004 3028128 3084669 3141930 3199359 3257074 3315199 3373428 3432042 3492646 3556806 3624305
55980C624305O9440P0859P3032P5820P8440Q1022Q4302Q8315R2309R5643R8366
$$ 3624305 3693745 3764604 3837636 3913456 3991896 4072918 4157220 4245535 4337844 4433487 4531853
55969D531853J01206J05144J10399J15931J20742J25520J31783J39501J47012
$$ 4531853 4633059 4738203 4848602 4964533 5085275 5210795 5342578 5482079 5629091
55960E629091J53473J59808J66932J74734J83373J93713K05594K17365K28274
$$ 5629091 5782564 5942372 6109304 6284038 6467411 6661124 6866718 7084083 7312357
55951G312357K39852K53889K70351K88373L07812L28645L50021L71173L92301
$$ 7312357 7552209 7806098 8076449 8364822 8672634 9001279 9351300 9722473 10114774
55942A0114774M13684M35201M57379M81395N07184N33284N59595N88338O21011
$$ 10114774 10528458 10963659 11421038 11902433 12409617 12942901 13502496 14090834 14711845
55933A4711845O56270O92311P29483P68958Q10733Q54731R02220R54353J011009
$$ 14711845 15368115 16060426 16789909 17558867 18369600 19224331 20126551 21080904 22091913
55924B2091913J072663J141416J218235J301148J388339J481205J582146J691264
$$ 22091913 23164576 24305992 25524227 26825375 28213714 29694919 31277065 32968329
55916C2968329J807578J931807K065880K211553K371483K549580K748357K968328
$$ 32968329 34775907 36707714 38773594 40985147 43356630 45906210 48654567 51622895
55908E1622895L211989L485514L794815M144035M540535M996821N524069O128646
$$ 51622895 54834884 58320398 62115213 66259248 70799783 75796604 81320673 87449319
55900H7449319O819094P610960Q519750R555640J0732379J2075724J3614388J5365095
$$ 87449319 94268413 101879373 110399123 119954763 130687142 142762866 156377254 171742349
55892A71742349J7328024J9480955K1758034K4027170K6069053K7521296K7801206
$$ 171742349 189070373 208551328 230309362 254336532 280405585 307926881 335728087
55885C35728087K6153570K1962986J5206734O673856k299550j0405194j6820410
$$ 335728087 361881657 383844643 399051377 405725233 403425683 393020489 376200079
55878C76200079k1298160k3985907k5204817k5308249k4611550k3366163k1767256
$$ 376200079 354901919 330916012 305711195 280402946 255791396 232425233 210657977
55871B10657977j9973250j8113307j6284336j4552278j2957515j1517354j0230177
$$ 210657977 190684727 172571420 156287084 141734806 128777291 117259937 107029760
55864A07029760r086759q079377p199703o433794n765318n181712m673192m228456
$$ 107029760 97943001 89863624 82663921 76230127 70464809 65283097 60609905 56381449
55856E6381449l835984l487893l178910k903185k655318k432666k233347k053575
$$ 56381449 52545465 49057572 45878662 42975477 40320159 37887493 35654146 33600571
55848C3600571j889881j742103j610984j494140j387389j288655j197829j114052
$$ 33600571 31710690 29968587 28357603 26863463 25476074 24187419 22989590 21875538
55840B1875538j036004r63909q98605q39317p84593p34495o89616o48894o10499
$$ 21875538 20839534 19875625 18977020 18137703 17353110 16618615 15928999 15280105 14669606
55831A4669606n73968n39397n05532m70988m36547m03972l73192l42615l11663
$$ 14669606 14095638 13556241 13050709 12579721 12143174 11739202 11366010 11023395 10711732
55822A0711732k80974k50633k20197j90120j61516j35177j12777r8664r8300j14269
$$ 10711732 10430758 10180125 9959928 9769808 9608292 9473115 9360338 9261674 9163374 9049105
55812I049105j44349j82829k22709k57802k84886l04072l16370l21724l20301
$$ 9049105 8904756 8721927 8499218 8241416 7956530 7652458 7336088 7014364 6694063
55803F694063l14211l05888k95470k81746k65235k48340k32618k17694k02915
$$ 6694063 6379852 6073964 5778494 5496748 5231513 4983173 4750555 4532861 4329946
55794D329946j88478j74817j62153j50784j40793j31589j22603j14175j06799
$$ 4329946 4141468 3966651 3804498 3653714 3512921 3381332 3258729 3144554 3037755
55785C037755j00054r3345q7053q1738p6902p2023o8034o6015o4844o2084n7165
$$ 3037755 2937701 2844356 2757303 2675565 2598663 2526640 2458606 2392591 2327747 2265663 2208498
55774B208498n2001m8384m6369m5222m4357m3084m1006l8968l8199l8268l7356
$$ 2208498 2156497 2108113 2061744 2016522 1972165 1929081 1888075 1849107 1810908 1772640 1735284
55763A735284l4933l2575l1610l1352l0587k9497k9061k9303k9220k8080k6018
$$ 1735284 1700351 1667776 1636166 1604814 1574227 1544730 1515669 1486366 1457146 1429066 1403048
55752A403048k3573k1251j9497j8667j8836j9521j9683j8446j6084j3822j2365
$$ 1403048 1379475 1358224 1338727 1320060 1301224 1281703 1262020 1243574 1227490 1213668 1201303
55741A201303j1274j0097r247q970q445p112o057o545p786p823o396n106m749
$$ 1201303 1190029 1179932 1170685 1161715 1153270 1146158 1140101 1133556 1125770 1117947 1111551 1106445 1101696
55728A101696m371l287k323k330k897l261l397l536l759m683p451j2200j7384
$$ 1101696 1097325 1094038 1091715 1089385 1086488 1083227 1079830 1076294 1072535 1067852 1060401 1048201 1030817
55715A030817k1268k3339k3863k3081k1556k0230j9297j7870j5531j3271j2027
$$ 1030817 1009549 986210 962347 939266 917710 897480 878183 860313 844782 831511 819484
55704H19484j1108r257o632m578l820l975m605n667o818p190o197m157k051q58
$$ 819484 808376 799119 792487 787909 784089 780114 775509 769842 763024 755834 749637 745480 743429 742571
55690G42571r09j608k089k404l614o305r531j1807j2714j2828j2511j1639j0351
$$ 742571 741662 740054 737965 735561 731947 725642 716111 704304 691590 678762 666251 654612 644261
55677F44261r187q356p534o539n607m941m442m046l954m377n277o408p359p715
$$ 644261 635074 626718 619184 612645 607038 602097 597655 593609 589655 585278 580001 573593 566234 558519
55663E58519p563p581q150q527p648n843m805n502o820o975n772m539m063l573
$$ 558519 550956 543375 535225 526698 519050 513207 508402 502900 496080 489105 483333 478794 474731 471158
55649D71158k072N4J501J679J295J292J748J945J215m49k352l594l792l455l382
$$ 471158 469086 469140 470641 472320 473615 474907 476655 478600 479815 479366 477014 473420 469628 466173 462791
55634D62791l784m294m893o060p778r027q915p795o536n138l136j037o8k56j11
$$ 462791 459007 454713 449820 443760 435982 426955 418040 410245 403709 398571 395435 394398 394330 394074 393963
55619C93963J065J692j17l745o448o380m233j938p57q17j590k274k315j971k010
$$ 393963 395028 396720 396603 392858 386410 380030 375797 373859 373102 372285 370695 368421 366106 364135 362125
55604C62125k669l359l653l819l998l542k025l79o9j213k348k149o74J079K088
$$ 362125 359456 356097 352444 348625 344627 341085 339060 338681 338612 337399 335051 332902 332228 333307 335395
55589C35395J732K61q55j5K513M525M458L185K404K149J189o45k106k453k223
$$ 335395 337127 337388 336533 336518 339031 343556 348014 351199 353603 355752 356941 356296 354190 351737 349514
55574C49514j882j089J45Q23K13j119k325l384m422m843m208l311l264l947m466
$$ 349514 347632 346543 346688 347511 347724 346605 344280 340896 336474 331631 327423 324112 320848 316901 312435
55559C12435m703n131n324m248k254j302k450m198m364k854j484j394j824j539
$$ 312435 307732 302601 297277 293029 290775 289473 287023 282825 278461 275607 274123 272729 270905 269366
55545B69366n02L77M96p5j111k358l222l044k024j259j473k139k365k072j600
$$ 269366 268864 269241 269737 269662 268551 266193 262971 259927 257903 256644 255171 253032 250667 248595 246995
55530B46995o74J059K671K596Q95m54k55K16p93k809l804k936j271k9N94Q35Q24
$$ 246995 246321 247380 250051 252647 253542 253088 252833 253049 252256 249447 245643 242707 241436 241407 242001 242836 243660
55513B43660P82Q75P09j23r61m82J569L863N078N178M827M334L648K780J684J84
$$ 243660 244442 245317 246026 245903 244942 244460 246029 249892 254970 260148 264975 269309 272957 275737 277421 277605
55497B77605j506k563k368j295m04l64r64j439j247o57n00j177k045k164j479
$$ 277605 276099 273536 271168 269873 269469 269105 268141 266702 265455 264798 264298 263121 261076 258912 257433
55482B57433p80o76j181k083l008l295k702k065k218k381j069J174J651r70m559
$$ 257433 256653 255977 254796 252713 249705 246410 243708 241643 239425 237044 235975 237149 238800 237830 233271
55467B33271o204n754n141n079m439k645o77N61J294J739J399K77m74r2N55K22
$$ 233271 227067 221313 216172 211093 206654 204009 203332 203893 205187 206926 208325 208602 208128 208036 208591 208813
55451B08813r24j895k562l402l993l263j350J86N15N51J114J358K33j355j532
$$ 208813 207889 205994 203432 200030 196037 192774 191424 191610 192125 192676 193790 195148 195381 194026 192494
55436A92494l40J27j154k456j696O02K065J656P07P87J774K481K329J600N39r08
$$ 192494 192154 192281 191127 188671 186975 187577 189642 191298 192005 192792 194566 197047 199376 200976 201515 200607
55420B00607k381k933k043m85N06P91J296K199K196M60j523j606j47J89j738l724
$$ 200607 198226 195293 193250 192765 193271 194062 195358 197557 199753 200213 198690 197084 196937 197126 195388 191664
55404A91664l269r73O83Q53P52J031Q25l26j306r25M19J309R09l66j211m31J785
$$ 191664 188395 187422 188105 188958 189710 190741 191566 191240 189934 189009 189428 190737 191646 191280 190069 189638 191423
55387A91423L483K771O9k354l099k801k426j832p25J97O6r28j980k689k892k282
$$ 191423 194906 197677 197746 195392 192293 189492 187066 185234 184509 184706 184772 183844 181864 179175 176283 174001
55371A74001j111n15j065j566n30J572K815K519K007K349K671J553o39j978j372
$$ 174001 172890 172375 171310 169744 169214 170786 173601 176120 178127 180476 183147 184700 184061 182083 180711
55356A80711J30P75L15M5P73J594J256J52p1J135K412K426J536P91J53j097k628
$$ 180711 180841 181616 181931 181976 182749 184343 185599 185751 185680 186815 189227 191653 193189 193980 194133 193036 190408
55339A90408l114k183j165j284j947j670k85P22K87p45q45m8O5j099j874n22J974
$$ 190408 187294 185111 183946 182662 180715 179045 178760 179482 179769 179024 178179 178131 178196 177097 175223 174701 176675
55322A76675K746Q00j546j595M00J997J908J271J553K465K619J609N19L60O69
$$ 176675 179421 180221 178675 177080 177480 179477 181385 182656 184209 186674 189293 190902 191421 191781 192450
55307A92450J81j383k913l443l236k910k172n13J343J975J226M07K58R0o19j037
$$ 192450 192631 191248 188335 184892 181656 178746 176574 176061 177404 179379 180605 181012 181270 181360 180741 179704
55291A79704k91J118K221K950L548L356J630q53k346k240j557j293j322j040l08
$$ 179704 179413 180531 182752 185702 189250 192606 194236 193383 191037 188797 187240 185947 184625 183585 183277
55276A83277M49N68l90j961k842k291j166o53l85R30L080M050K644J18j576k068
$$ 183277 183726 184294 183904 181943 179101 176810 175644 174991 174606 175536 178616 182666 185310 185428 183852 181784
55260A81784k138j896p62J065K393K499J853J058J6j304k021j252L14Q88j58j411
$$ 181784 179646 177750 176988 178053 180446 182945 184798 185856 185872 184568 182547 181295 181609 182497 182339 180928
55244A80928j366m65k73j132j815j376j83J078K166K633J721k75j495n53J567
$$ 180928 179562 179097 178824 177692 175877 174501 174318 175396 177562 180195 181916 181641 180146 179593 181160
55229A81160K684K070P79k24r82j589j622r60k99k53m30L0J252K275K029N94o39
$$ 181160 183844 185914 186693 186469 185487 183898 182276 181316 181017 180764 180334 180364 181616 183891 185920 186514 185875
55212A85875l99R19J664J072J56J31P59J020P00L42K14K93Q31J837K398J689L65
$$ 185875 185476 186395 188059 189131 189287 189418 190177 191197 191897 192239 192453 192746 193577 195414 197812 199501 199866
55195A99866l19m11r24j789j853j015n98j041r69M46J712Q41j899m364m933l632
$$ 199866 199547 199136 198212 196423 194570 193555 192957 191916 190947 191393 193105 193946 192047 187683 182750 179118
55179A79118j432M84J216R27R34K163L803M231L060J335q9j396k820l677k883
$$ 179118 177686 178170 179386 180313 181247 183410 187213 191444 194504 195839 195750 194354 191534 187857 184974
55164A84974k50K999M962M435J831j228l246l795l272k218j104l07Q9K65L33L50
$$ 184974 184724 187723 192685 197120 198951 197723 194477 190682 187410 185192 184088 183781 183870 184135 184468 184818
55148A84818P27J996L776M580L393J053o36r38o09m59m24k34j44n35j150j314
$$ 184818 185545 187541 191317 195897 199290 200343 199707 198769 198160 197701 197277 197043 196899 196364 195214 193900
55132A93900p53K01J069J632J867J822J617J353R53K94m20p27n24l27m97n35K08
$$ 193900 193147 193348 194417 196049 197916 199738 201355 202708 203661 203955 203535 202808 202284 201957 201460 200925 201133
55115B01133J241J238j91j852k535k353j962j283j06P99N35k73j33R43J249j8
$$ 201133 202374 203612 203421 201569 199034 196681 194719 193436 193330 194129 194664 194391 194258 195201 196450 196432
55099A96432j447j432l37M19N53Q58J465J486N01p23j316j328j229r31m0J095
$$ 196432 194985 193553 193216 193635 194188 195046 196511 197997 198498 197775 196459 195131 193902 192971 192931 194026
55083A94026J249k98k594l697k652l72J490K064J477K45r55j421j101q04j037
$$ 194026 195275 194977 192383 188686 186034 185662 187152 189216 190693 190938 189983 188562 187461 186657 185620
55068A85620j005K79K260L326K945K093J492O81o94j913k149j511n69L24P40J71
$$ 185620 184615 184894 187154 190480 193425 195518 197010 197691 196997 195084 192935 191424 190855 191179 191919 192090
55052A92090j117k020k041j828j759j040P57K354K282J094O74J615K567K211Q18
$$ 192090 190973 188953 186912 185084 183325 182285 183042 185396 187678 188772 189446 191061 193628 195839 196657
55037A96657l47m98KJ37n17r48K29K568L645K014n83j290J67J451J008k07o03
$$ 196657 196310 195812 195814 195951 195434 194486 194715 197283 200928 202942 202359 201069 201236 202687 203695 203488 202885
55020B02885j1Q21J537K064K030J301N74O13J060P85o35k334l119k572j133M93
$$ 202885 202874 203695 205232 207296 209326 210627 211201 211814 212874 213659 213024 210690 207571 204999 203866 204359
55004B04359J593J590N16n81m66O65J059m34k635l470k664j730j456j066k26o6
$$ 204359 205952 207542 208058 207477 207011 207676 208735 208301 205666 202196 199532 197802 196346 195280 195054 194988
54988A94988j241k430k120p50K66P05J190J479R35K31P05K053K434J152l64o39
$$ 194988 193747 191317 189197 188447 188713 189418 190608 192087 193022 193253 193958 196011 198445 199597 199233 198594
54972A98594J37R87J433J391Q08J44K99J386K236J724L1j726k584k119m86J400
$$ 198594 198731 199718 201151 202542 203350 203494 203793 205179 207415 209139 209170 207444 204860 202741 202255 203655
54956B03655K236J403m66k103k617j950q66l34m61k59Q77J842J037j201k591j531
$$ 203655 205891 207294 206828 204725 202108 200158 199292 198958 198497 198238 199115 200957 201994 200793 198202 196671
54940A96671J247L769M633L587J472j05l1J068J723J740K121K802K299K60j425
$$ 196671 197918 201687 206320 209907 211379 211274 211243 212311 214034 215774 217895 220697 222996 223256 221831
54925B21831j197Q4R46J652K992L957K879M35q28o9O89m20k568l515k366o8J937
$$ 221831 220634 220718 221664 223316 226308 230265 233144 233579 232751 232682 233371 232951 230383 226868 224502 224434 226371
54908B26371K718J965J31j550j789l72J557K465J835N31j92rM45O54P76R85R86
$$ 226371 229089 231054 231185 229635 227846 227474 229031 231496 233331 233862 233670 233661 234106 234760 235536 236521 237507
54891B37507O26M29R64J962K685K876K750K280J183l39j485j628r28j49j3p16
$$ 237507 238133 238562 239526 241488 244173 247049 249799 252079 253262 252923 251438 249810 248882 248733 248720 248004
54875B48004j726k203j780r08k36O4K11L82O10R05J151J187J171J528K292K923
$$ 248004 246278 244075 242295 241387 241151 241215 241426 241808 242418 243323 244474 245661 246832 248360 250652 253575
54859B53575L122L339L999M755N082N221N758O636P311P745Q380R077Q811O808
$$ 253575 256697 260036 264035 268790 273872 279093 284851 291487 298798 306543 314923 324000 332811 339619
54845C39619L646R51L4O61J106l44l611o840q399q385p897p498o996o167m773
$$ 339619 343265 344216 344250 344911 346017 345673 342062 335222 326823 318438 310541 303043 296047 289880 285107
54830B85107k398O74K619J440k477o150o876m770k141q56q17p16K52J525J995
$$ 285107 282709 283383 286002 287442 284965 278815 271939 267169 265028 264172 263355 262639 262891 264416 266411
54815B66411J600J746L686O773Q894Q642O678M939M890O495Q372Q936P716N625
$$ 266411 268011 269757 273443 280216 289110 297752 304430 309369 314259 320754 329126 338062 345778 351403
54801C51403L844K666J601J04k243n586r121j1138j0697q933p723p380o839n757
$$ 351403 355247 357913 359514 359618 357375 351789 342668 331530 320833 311900 304177 296797 289958 284201
54787B84201m950m732m435l933m080m936m994l160m82J119R89k75k074l847m628
$$ 284201 279251 274519 270084 266151 262071 257135 252141 248981 248499 249618 250607 250332 248258 244411 239783
54772B39783l866k311j134m98M5K83l37j402j771j121k01M53R11J040M14o58j128
$$ 239783 235917 233606 232472 231974 232019 232302 231965 230563 228792 227671 227470 227923 228834 229874 230288 229630 228502
54755B28502n43M61J339K211K943K732J400M4m30n12q46p06Q69L008L731K708
$$ 228502 227959 228420 229759 231970 234913 237645 239045 239089 238659 238147 237301 236595 237464 240472 244203 246911
54739B46911J609J480J343J55j364j974j839j841j742o64R62J562O62n11r92j232
$$ 246911 248520 250000 251343 251498 250134 248160 246321 244480 242738 242074 243036 244598 245260 244749 243757 242525
54723B42525j744j952j302m58k09p8P91J948K208J597J363K004K636K599K500
$$ 242525 240781 238829 237527 237069 236860 236782 237573 239521 241729 243326 244689 246693 249329 251928 254428
54708B54428L137M254N050N308N430N751O335P073P657P714P278O823O628O489
$$ 254428 257565 261819 266869 272177 277607 283358 289693 296766 304423 312137 319415 326238 332866 339355
54694C39355O251O081N888N040L199J097k13p27j465l039m733n359m822m432n438
$$ 339355 345606 351687 357575 362615 365814 366911 366698 365971 364506 361467 356734 351375 346553 342121 336683
54679C36683p410q506p537n351l715l242l168k946k995l553l793k831j083Q4j43
$$ 336683 329273 320767 313230 307879 304164 300922 297754 294808 291813 288260 284467 281636 280553 280637 280494
54664B80494j291k142j615N27L289N079N228M734M998O000O449N694M838N421
$$ 280494 279203 277061 275446 275973 279262 284341 289569 294303 299301 305301 311750 317444 322282 327703
54650C27703P418R010Q463N876K845O28r71k779m942o890q188q711q237o733n117
$$ 327703 335121 344131 352594 358470 361315 361943 360972 358193 353251 346361 338173 329462 321225 314492 309375
54635C09375m787o007p383p459o263m886m044l596l102k354j501r39q39q18m90
$$ 309375 304588 298581 291198 283739 277476 272590 268546 264950 261848 259494 257993 257054 256215 255397 254907
54620B54907l20j134k597l226k323r65l52j78L81R12M12q13j288n38K08k25j372
$$ 254907 254587 253453 250856 247630 245307 244342 243990 243812 244193 245105 245517 244704 243416 242878 243086 242861 241489
54603B41489j767o66J169K181J486k01j215p06N18J125O62n35k021l089k723p92
$$ 241489 239722 239056 240225 242406 243892 243691 242476 241770 242288 243413 244075 243540 241519 238430 235707 234915
54587B34915J159J474M89j3P65J921K462K328J725P93K25R96K799L765K469m15
$$ 234915 236074 237548 238037 238024 238789 240710 243172 245500 247225 248018 248243 249239 252038 255803 258272 257857
54571B57857k985m067l818k865j560lJ522K316J799M29m78l06L8m80j429j731
$$ 257857 254872 250805 246987 244122 242562 242559 244081 246397 248196 248625 248147 247841 247879 247399 245970 244239
54555B44239j411j243j172o00M0k28r97q87j1M9q91r60O17J912J193l91o28O38
$$ 244239 242828 241585 240413 239813 239853 239625 238628 237741 237730 237779 236888 235928 236545 238457 239650 239259 238631 239269
54537B39269J930K501K579K146J160K64p7m85j352j575j57J757K260J415P96Q80
$$ 239269 241199 243700 246279 248425 249585 249849 249772 249287 247935 246360 246203 247960 250220 251635 252431 253311
54521B53311Q65P64J486K687K647P60j418k228j667p13q1j5j92L40K048L712L672
$$ 253311 254176 254940 256426 259113 261760 262520 261102 258874 257207 256494 256413 256398 256206 256546 258594 262306 265978
54504B65978K218J206J170P09q41k070j824j100j382k396k827k156o49J433L367
$$ 265978 268196 269402 270572 271281 270440 268370 266546 265446 264064 261668 258841 256685 256036 257469 260836
54489B60836L688J864l36n56J318L155L073J073j453k902k500j038j52k56J26
$$ 260836 264524 266388 266052 265496 266814 269969 273042 274115 272662 269760 267260 266222 266070 265814 265940
54474B65940K017L966L839K017R75J802K945K821J877J373J472J586J576J478
$$ 265940 267957 271923 275762 277779 278754 280556 283501 286322 288199 289572 291044 292630 294206 295684
54460B95684Q45n25j682j480l03K32o61k028k505j820o71K31M65k05j570k710
$$ 295684 296529 296004 294322 292842 292539 292771 292110 290082 287577 285757 285086 285317 285782 285577 284007 281297
54444B81297k592j181L68Q64K73l45o4R05J444P80m89q40M62K341K949J769J16
$$ 281297 278705 277524 277892 278756 279029 278684 278620 279525 280969 281749 281260 280420 280882 283223 286172 287941 288057
54427B88057n89l98k26k16M29J966L347L382K298J581K205L384L455J911Q9n18
$$ 288057 287468 287070 286844 286628 287057 289023 292370 295752 298050 299631 301836 305220 308675 310586 310675 310157
54411C10157j34j80j089j742j214M7J272K541L958M590L624J973J403K201K905
$$ 310157 310023 309843 308754 307012 305798 305845 307117 309658 313616 318206 321830 323803 325206 327407 330312
54396C30312K281N45j341k515k385j109J16K26l24l08L39O70M84L38p7j605l523
$$ 330312 332593 333138 331797 329282 326897 325788 325904 326130 325806 325498 325837 326507 326991 327329 327252 325647 322124
54379C22124l893k660k053k859k705J70L459L589O73j834j770k09R40J046K77
$$ 322124 318231 315571 313518 310659 307954 308124 311583 315172 315845 314011 312241 312032 312972 314018 314295
54364C14295j067k254k476j901j320q37L0J056J400R97O48O95Q16J045J650J973
$$ 314295 313228 310974 308498 306597 305277 304440 304470 305526 306926 307923 308571 309266 310082 311127 312777 314750
54348C14750R05j193k430j735n7J229J915K452K933L288L595L585K704J196L25
$$ 314750 315655 314462 312032 310297 310240 311469 313384 315836 318769 322057 325652 329237 331941 333137 333462
54333C33462Q72K082K585J828K99j047j330n34J00o03j894j789m5J044k88k672
$$ 333462 334334 336416 339001 340829 341128 340081 338751 338217 338317 337714 335820 334031 333986 335030 334742 332070
54317C32070l376j831N5N95n6r20j533j940k174k241k231k112j588l30J626L615
$$ 332070 328694 326863 326918 327513 327457 326537 325004 323064 320890 318649 316418 314306 312718 312388 314014 317629
54301C17629M634M187K762J240l6j164j968k121j920j974k100j497k83K91m48
$$ 317629 322263 326450 329212 330452 330416 329252 327284 325163 323243 321269 319169 317672 317389 317680 317232
54286C17232j650k250k249k130j954j794k148l022l457k835j868j466j431j210
$$ 317232 315582 313332 311083 308953 306999 305205 303057 300035 296578 293743 291875 290409 288978 287768
54272B87768j032j106p72K19M08j478l932m103j781J63j82j226m34K085L945L654
$$ 287768 286736 285630 284858 285077 285485 284007 280075 275972 274191 274354 274172 272946 272512 274597 278542 282196
54256B82196K028P61N47P56M33n47j341j222n61k27k29K93J620K833K972K108
$$ 282196 284224 284985 285532 286288 286721 286174 284833 283611 283050 282823 282594 282887 284507 287340 290312 292420
54240B92420R34k8m30p0N60M00p99j764j190M17J294O26p26j723k280k584k274
$$ 292420 293354 293326 292896 292826 293386 293786 292987 291223 290033 290450 291744 292370 291644 289921 287641 285057 282783
54223B82783j127N4K49j67K79K013L512L123J127q26j745j769j027N40K102K143
$$ 282783 281656 281710 281959 281792 282071 284084 287596 290719 291846 291020 289275 287506 286479 287019 289121 291264
54207B91264M92r80o37P89J403P91J37J01lp72j711k089j940j692j453j044l49
$$ 291264 291756 290776 290139 290928 292331 293122 293259 293360 293357 292585 290874 288785 286845 285153 283700 282656 282307
54190B82307N79J337J139l37k035k209m19J859K917K494J386J76r77j726j562
$$ 282307 282886 284223 285362 285025 282990 280781 280362 282221 285138 287632 289018 289194 288217 286491 284929
54175B84929m22J214K732L585L275J717l84j874k048j140j6N43L78k5r5K08K95
$$ 284929 284507 285721 288453 292038 295313 297030 296646 294772 292724 291584 291568 292111 292489 292464 292369 292577 292872
54158B92872n13k344m486n615m776k519p51p85j758j772n15L56l37j599j824j038
$$ 292872 292359 290015 285529 279914 275138 272619 271868 271083 269325 267553 267038 267394 267057 265458 263634 262596
54142B62596n29p01n80N12J834K161J264K5o57p52r80j837k831k859j497M92K130
$$ 262596 262067 261366 260786 261298 263132 265293 266557 266582 265925 265173 264193 262356 259525 256666 255169 255661 257791
54125B57791L193L734L261J350j108k429k107j293j013q38p0P56N76m15r33m66
$$ 257791 260984 264718 267979 269329 268221 265792 263685 262392 261379 260541 260471 261227 261803 261388 260455 259989
54109B59989J85L36K82K55l25j736k785k003K80K080K087Q92k49r65j522j740
$$ 259989 260174 260510 260792 261047 260722 258986 256201 254198 254478 256558 258645 259537 259288 258323 256801 255061
54093B55061r46J052L464M985M777L130J258Q5p18k008l537l855k243J10J517
$$ 255061 254115 255167 258631 263616 268393 271523 272781 272866 272148 270140 266603 262748 260505 260615 262132
54078B62132J719J595J528J144M11j38l15n22q87r97n99K18J515L241M360L508
$$ 262132 263851 265446 266974 268118 268529 268391 268076 267554 266667 265670 265071 265289 266804 270045 274405 277913
54062B77913J001q90n94P55R60l47j594j632q80j13N72J172J159J76j123j670
$$ 277913 278914 278024 277430 278185 279145 278798 277204 275572 274692 274579 275151 276323 277482 277658 276535 274865
54046B74865j272p95j026j770k183j762p11N22J747K827L346K907J762P02J96
$$ 274865 273593 272798 271772 270002 267819 266057 265346 265868 267615 270442 273788 276695 278457 279159 279355
54031B79355Mk14l83l13j17J52Q47K144L318L337K191J038Q47J428K047K432K724
$$ 279355 279359 279145 278762 278449 278332 278484 279331 281475 284793 288130 290321 291359 292206 293634 295681 298113 300837
54014C00837K794K261J193K89J50O56J208J438J392J173O98j21j091j805j992
$$ 300837 303631 305892 307085 307374 307524 308180 309388 310826 312218 313391 314089 313968 312877 311072 309080
53999C09080j739j425j468k029k833l286k880j644j11J162K083K858L373L109
$$ 309080 307341 305916 304448 302419 299586 296300 293420 291776 291665 292827 294910 297768 301141 304250
53985C04250J977J047J705L910N929O304N490M822M490L704K700K946M941P098
$$ 304250 306227 307274 308979 312889 318818 325122 330612 335434 339924 343628 346328 349274 354215 361313
53971C61313P765P271O938O968O611N851N417N330M857M004L735M391M955M412
$$ 361313 369078 376349 383287 390255 396866 402717 408134 413464 418321 422325 426060 430451 435406 439818
53957D39818K958J513O86N85R42J104N18n79j494k122k861l520l351k391j703
$$ 439818 442776 444289 444975 445560 446502 447606 448124 447545 446051 443929 441068 437548 434197 431806 430103
53942D30103j888k399k759l344m358n109n140n005n109m844l920l478m437n598
$$ 430103 428215 425816 423057 419713 415355 410246 405106 400101 394992 390148 386228 382750 378313 372715
53928C72715n001k728p55k73p78j747l420n453o380n326l291j953j776j902j367
$$ 372715 367714 364986 364231 363958 363180 361433 358013 352560 346180 340854 337563 335610 333834 331932 330565
53913C30565R6K000L271K903R94j073j820r50O79J937K073R14r97k510k479o28
$$ 330565 330661 332661 335932 338835 339829 338756 336936 335986 336665 338602 340675 341589 340592 338082 335603 334975
53897C34975K174M411M951L848K220J229J158J447J465J157J089J879L339M227
$$ 334975 337149 341560 346511 350359 352579 353808 354966 356413 357878 359035 360124 362003 365342 369569
53883C69569L462J657Q03J970M022N143M994M552M404M279M007L897M115M560
$$ 369569 373031 374688 375491 377461 381483 386626 391620 396172 400576 404855 408862 412759 416874 421434
53869D21434N236O002O090M932L484L548N450P460P904O984O002N657N783O048
$$ 421434 426670 432672 438762 443694 447178 450726 456176 463636 471540 478524 484526 490183 495966 502014
53855E02014O243O253O336O994Q101Q651P922O473N403M974M652M238M150M527
$$ 502014 508257 514510 520846 527840 535941 544592 552514 558987 564390 569364 574016 578254 582404 586931
53841E86931M730M096K817J704J135N48p79k672m104m363l732k860k016j443j825
$$ 586931 591661 595757 598574 600278 601413 601961 601182 598510 594406 590043 586311 583451 581435 579992 578167
53826E78167l553n814p350p969q517r294r603r034q186p697p404o981o620o535
$$ 578167 574614 568800 561450 553481 544964 535670 526067 517033 508847 501150 493746 486765 480145 473610
53812D73610o455o135n770n467m958m279m052m450m637l918k887k611l236m102
$$ 473610 467155 461020 455250 449783 444825 440546 436494 432044 427407 423489 420602 417991 414755 410653
53798D10653m810n325n386m750l742k871k117j304p91j017j529j386l77Q78J860
$$ 410653 405843 400518 395132 390382 386640 383769 381652 380348 379557 378540 377011 375625 375248 376126 377986
53783C77986K335J908L99j349k054j558r22r09j260j611j939j860o17J517K890
$$ 377986 380321 382229 382628 381279 379225 377667 376745 375836 374576 372965 371026 369166 368549 370066 372956
53768C72956K302N21q71j454j774j788q00J016K210J588m55k498l340k521k55
$$ 372956 375258 375779 374908 373454 371680 369892 369092 370108 372318 373906 373451 370953 367613 365092 364837
53753C64837K513M358M391L113J847J362J403J554K019L212M865O119O486O369
$$ 364837 367350 371708 376099 379212 381059 382421 383824 385378 387397 390609 395474 401593 408079 414448
53739D14448O469O907P176O870O227N895O216O905P449P703P855P898P557O992
$$ 414448 420917 427824 435000 441870 448097 453992 460208 467113 474562 482265 490120 498018 505575 512567
53725E12567P083Q434J0293J1211J0836J0315J0675J1557J2060J2233J2897J4325
$$ 512567 519650 528084 538377 549588 560424 570739 581414 592971 605031 617264 630161 644486
53713F44486J5825J6522J5863J3334Q515J842n165j0967j5222j8649k1764k4073
$$ 644486 660311 676833 692696 706030 714545 716387 711222 700255 685033 666384 644620 620547
53701F20547k4645k3286k0936j8824j7390j6200j4655j2523r919p273n370m851
$$ 620547 595902 572616 551680 532856 515466 499266 484611 472088 462169 454896 449526 444675
53689D44675n437o008n788n170n008n448n750n095l275q54J134K009K087K182
$$ 444675 439238 433230 427442 422272 417264 411816 406066 400971 397696 396842 397976 399985 402072 404254
53675D04254K222J190j029k697k176l01N95j43p04L81K046K168M58j278j444l10
$$ 404254 406476 407666 406637 403940 401764 401463 402058 401915 401211 401592 403638 405806 406264 404986 403542 403232
53659D03232P49R80P80P44P17R9j053j825j546o30J62Q47J869K977L381L038K757
$$ 403232 403981 404961 405741 406485 407202 407301 406248 404423 402877 402247 402409 403256 405125 408102 411483 414521 417278
53642D17278K824K512J494Q06J562L274M304L846K655J885J712J367K10j265j611
$$ 417278 420102 422614 424108 424914 426476 429750 434054 437900 440555 442440 444152 445519 445729 444464 442853
53627D42853J08K927M585L815J595k12q97j025j064q36k97N0k37j024j901k564
$$ 442853 442961 445888 450473 454288 455883 455671 454774 453749 452685 451849 451552 451602 451365 450341 448440 445876
53611D45876k744k147p66R42K312K816K254R52k32n48k14k38j148k237k415j526
$$ 445876 443132 440985 440219 441161 443473 446289 448543 449495 449263 448715 448501 448263 447115 444878 442463 440937
53595D40937m59m6k66o16q05q68p60k53P51J866K375J738J40j402j683m25J306
$$ 440937 440478 440432 440166 439550 438745 437877 437117 436864 437615 439481 441856 443594 443734 442332 440649 440224 441530
53578D41530K110J737J202J376K058K717L489M626N440M858L079J753K102L582
$$ 441530 443640 445377 446579 447955 450013 452730 456219 460845 466285 471143 474222 475975 478077 481659
53564D81659M691M491L039J076k12K03K072L839M335M075M248M965N368N087M595
$$ 481659 486350 490841 493880 494956 494744 494947 497019 500858 505193 509268 513516 518481 523849 528936 533531
53549E33531M256L957L708L774M108M359M468M550M340L627L101L586M314L384
$$ 533531 537787 541744 545452 549226 553334 557693 562161 566711 571051 574678 577779 581365 585679 589063
53535E89063M76k178k460q90N45J090J369J542J014j45r60r99q81r91q06N3J050
$$ 589063 589539 587361 584901 584011 584556 585646 587015 588557 589571 589426 588466 587467 586586 585595 584789 584842 585892
53518E85892J577J775J978K001J717J727K734M537O256P364Q029Q698R765J1369
$$ 585892 587469 589244 591222 593223 594940 596667 599401 603938 610194 617558 625587 634285 644050 655419
53504F55419J2930J3206J1382P964M116M29l043n869p310p452p288p485p705p448
$$ 655419 668349 681555 692937 700901 705017 705446 702403 696534 689224 681772 674484 666999 659294 651846
53490F51846o801n961m667k775q33O10J933L848O072P365P093O052N552O132P452
$$ 651846 645045 639084 634417 631642 630809 631419 633352 637200 643272 650637 657730 663782 669334 675466 682918
53475F82918Q982J0446J1836J3318J4988J6545J7498J7880J8501K0098K2394K4390
$$ 682918 691900 702346 714182 727500 742488 759033 776531 794411 812912 833010 855404 879794
53463H79794K5487K5849K5712K4947K3711K3048K4202K7276L1019L3981L5659
$$ 879794 905281 931130 956842 981789 1005500 1028548 1052750 1080026 1111045 1145026 1180685
53452A180685L6425L6801L7150L7821L9141M1091M3109M4250M3741M1640L9064
$$ 1180685 1217110 1253911 1291061 1328882 1368023 1409114 1452223 1496473 1540214 1581854 1620918
53441A620918L7332L6701L6316L5643L5291L5791L6176L5063L2938L1903L2735
$$ 1620918 1658250 1694951 1731267 1766910 1802201 1837992 1874168 1909231 1942169 1974072 2006807
53430B006807L3625L2753L0816K9697K9528K8787K6964K5280K4503K3706K1852
$$ 2006807 2040432 2073185 2104001 2133698 2163226 2192013 2218977 2244257 2268760 2292466 2314318
53419B314318J9301J6927J4781J2507J0166P732M576N35l230n675p599j0532j4317
$$ 2314318 2333619 2350546 2365327 2377834 2388000 2395732 2400308 2400843 2397613 2391938 2384339 2373807 2359490
53406B359490j7405j9535k2228k6076k9287l0131k9616l0152l2307l4416l5258
$$ 2359490 2342085 2322550 2300322 2274246 2244959 2214828 2185212 2155060 2122753 2088337 2053079
53395B053079l5486l6098l6772l6522l5278l3956l3235l2898l2353l1342k9991
$$ 2053079 2017593 1981495 1944723 1908201 1872923 1838967 1805732 1772834 1740481 1709139 1679148
53384A679148k8393k6317k3435j9961j6819j4797j3580j1935r058n368j867R03
$$ 1679148 1650755 1624438 1601003 1581042 1564223 1549426 1535846 1523911 1514853 1509485 1507618 1508521
53372A508521L050M905O760Q807J0922J2792J4604J7235K1225K5743K9316L1538
$$ 1508521 1511571 1516476 1523236 1532043 1542965 1555757 1570361 1587596 1608821 1634564 1663880 1695418
53360A695418L3424L6036L9479M3321M7120N0185N1804N2377N3606N6568O0133
$$ 1695418 1728842 1764878 1804357 1847678 1894798 1944983 1996787 2049164 2102770 2159338 2219471
53349B219471O2359O3159O4411O7371P1198P4417P6701P8581Q0308Q1952Q4088
$$ 2219471 2281830 2344989 2409400 2476771 2547969 2622386 2699087 2777668 2857976 2939928 3024016
53338C024016Q7277R0950R3660R4598R4263R3542R2706R1533Q9981Q8363Q6935
$$ 3024016 3111293 3202243 3295903 3390501 3484764 3578306 3671012 3762545 3852526 3940889 4027824
53327D027824Q5544Q3637Q0731P6840P2326O7211O0924N3093M4377L6013K8512
$$ 4027824 4113368 4197005 4277736 4354576 4426902 4494113 4555037 4608130 4652507 4688520 4717032
53316D717032K1240J3354M754m003j2458k0561k8396l5827m2566m8698n5067o2612
$$ 4717032 4738272 4751626 4756380 4752377 4739919 4719358 4690962 4655135 4612569 4563871 4508804 4446192
53304D446192p1050p8658q3982q7440r0579r4005r7033r9248j01122j02639j02676
$$ 4446192 4375142 4296484 4212502 4125062 4034483 3940478 3843445 3744197 3643075 3540436 3437760
53293C437760j00681r8058r6562r5953r4456r1361q7813q4944q2542p9891p6989
$$ 3437760 3337079 3239021 3142459 3046506 2952050 2860689 2772876 2687932 2605390 2525499 2448510
53282B448510p4242p1766o9512o7512o5427o2413n8094n3218m8771m4771m0614
$$ 2448510 2374268 2302502 2232990 2165478 2100051 2037638 1979544 1926326 1877555 1832784 1792170
53271A792170l6297l2543k9738k7433k5073k2575j9998j7077j3643j0177p498
$$ 1792170 1755873 1723330 1693592 1666159 1641086 1618511 1598513 1581436 1567793 1557616 1550118
53260A550118n690l792r46K279M375M982N747Q366J2165J4880J5845J7029K0195
$$ 1550118 1544428 1540636 1539690 1541969 1546344 1551326 1557073 1565439 1577604 1592484 1608329 1625358 1645553
53247A645553K4255K6785K7408K8151L0513L3727L6361L8408M0883M3967M6601
$$ 1645553 1669808 1696593 1724001 1752152 1782665 1816392 1852753 1891161 1932044 1976011 2022612
53236B022612M7865M8136M8612M9879N1187N1232M9574M7000M4403M1761L8528
$$ 2022612 2070477 2118613 2167225 2217104 2268291 2319523 2369097 2416097 2460500 2502261 2540789
53225B540789L4541K9913K4554J8599J3062Q995N919K083l349r252j3966j7083
$$ 2540789 2575330 2605243 2629797 2648396 2661458 2670453 2676372 2678455 2675106 2665854 2651888 2634805
53213B634805j9493k2371k6388l1064l4662l5721l5158l5684l8455m1545m2838
$$ 2634805 2615312 2592941 2566553 2535489 2500827 2465106 2429948 2394264 2355809 2314264 2271426
53202B271426m3130m4748m7955n0774n2139n3098n4575n5875n6238n6395n7326
$$ 2271426 2228296 2183548 2135593 2084819 2032680 1979582 1925007 1869132 1812894 1756499 1699173
53191A699173n8471n8373n6676n4497n2996n2245n1372m9398m6226m2995m1047
$$ 1699173 1640702 1582329 1525653 1471156 1418160 1365915 1314543 1265145 1218919 1175924 1134877
53180A134877m0266l9101l6575l3522l1264k9831k8402k6828k5585k4543k3091
$$ 1134877 1094611 1055510 1018935 985413 954149 924318 895916 869088 843503 818960 795869
53169G95869k1398k0344j9960j9088j7151j5155j4263j4145j3668j2691j2113
$$ 795869 774471 754127 734167 715079 697928 682773 668510 654365 640697 628006 615893
53158F15893j2280j2329j1353r572p978p245p298p680p915p630o619n017l502
$$ 615893 603613 591284 579931 570359 562381 555136 547838 540158 532243 524613 517994 512977 509475
53145E09475l078m306o562q270q196o434m033k033j165j912l952n829o178n409
$$ 509475 506397 502091 495529 487259 479063 472629 468596 466563 465398 463486 459534 453705 447527 442118
53131D42118n123n653n435l522j424j110k082k112n75O86M6j878l474m115m059
$$ 442118 436995 431342 425907 422385 420961 419851 417769 415657 415082 415768 415814 413936 410462 406347 402288
53116D02288l373j988l52O96N81o76k365l147k067J15J413R04l30r97j234j685
$$ 402288 398915 396927 396575 397271 397852 397176 394811 391664 389597 389712 391125 392029 391699 390702 389468 387783
53100C87783k048j761j214r36l02J375K960K470n8k250k218m42J383K076J315
$$ 387783 385735 383974 382760 381824 381522 382897 385857 388327 388269 386019 383801 383359 384742 386818 388133
53085C88133m06j604q11J468K788J498j229k751j751Q77L227L863K626O63n48
$$ 388133 387727 386123 385312 386780 389568 391066 389837 387086 385335 386212 389439 393302 395928 396591 396043
53070C96043n56m5L46O49R25Q56M12J14K05K03j74l04M47J649K222J728Q20N32
$$ 396043 395487 395442 395788 396437 397362 398218 398630 398744 398949 399152 398978 398674 399121 400770 402992 404720 405540 406072
53052D06072J294K385K482J236k3J47J223J361N8j189j134k93K32J60l92j380
$$ 406072 407366 409751 412233 413469 413446 413593 414816 416177 416235 415046 413912 413619 413851 414011 413619 412239
53036D12239k197j867o12lp22j588j653j723k685l835m272m471m892m555k817
$$ 412239 410042 408175 407563 407560 406838 405250 403597 401874 399189 395354 391082 386611 381719 377164 374347
53021C74347j145j022j448p74K61Lp23K05K207K456L32j784k437k692l135k600
$$ 374347 373202 372180 370732 369958 370219 370222 369499 369704 371911 374367 374699 372915 370478 367786 364651 362051
53005C62051r90l64j665l010k861k354k714k754j246M25L63p38j060p39r74j377
$$ 362051 361061 360697 359032 356022 353161 350807 348093 345339 344093 344518 344881 344143 343083 342344 341370 339993
52989C39993q16Km42j542j287L84J562J536J470J723J211k1q4J786L487K684j98
$$ 339993 339177 339179 338737 337195 335908 336292 337854 339390 340860 342583 343794 343773 343689 345475 348962 351646 351448
52972C51448k837l783l314k298j273l62N48J327J365L32r93j507j299j325j682
$$ 351448 348611 344828 341514 339216 337943 337581 338129 339456 340821 341153 340160 338653 337354 336029 334347
52957C34347j449m13M27M16J8l68r06j191k08J661K255N52j490j601m52k15p57
$$ 334347 332898 332485 332912 333328 333346 332978 332072 330881 330673 332334 334589 335141 333651 332050 331598 331383 330626
52940C30626J80K968M778L301n2k094j862j084j254j846j738j018o77j102j715
$$ 330626 330806 333774 338552 341853 341801 339707 337845 336761 335507 333661 331923 330905 330228 329126 327411
52925C27411j880j432l92J111K355K197L26k010l175k798j673l50J192K515K666
$$ 327411 325531 324099 323707 324818 327173 329370 329696 327686 324511 321713 320040 319690 320882 323397 326063
52910C26063J619Q13J279K023J358n11j525m56J586K798K818K519K369K140J954
$$ 326063 327682 328495 329774 331797 333155 332644 331119 330663 332249 335047 337865 340384 342753 344893 346847
52895C46847K395L214K950O52k562m539m434l154j740n22k4j172l616n056l692
$$ 346847 349242 352456 355406 356058 353496 348957 344523 341369 339629 339107 339083 337911 334295 329239 325547
52880C25547q63L21j087k796k514p88K00l42j219j183k99O49J256J598J625J008
$$ 325547 324684 325005 323918 321122 318608 317820 318020 317678 316459 315276 314977 315626 316882 318480 320105 321113
52864C21113l02j643k127j695j139q78k81J107K285J856J95p49l4J131J232L18
$$ 321113 320811 319168 317041 315346 314207 313329 313048 314155 316440 318296 318491 317742 317708 318839 320071 320389
52848C20389n87q38k27J241K708K608O03j449j672o48l17j015j303n93j09p94
$$ 320389 319802 318964 318737 319978 322686 325294 325897 324448 322776 322128 321811 320796 319493 318900 318791 317997
52832C17997j815j923j191m73P5R77K223K937K391J077M02J147K294K032K16j061
$$ 317997 316182 314259 313068 312595 312670 313647 315870 318807 321198 322275 322677 323824 326118 328150 328366 327305
52816C27305j96J429J130j335l409l307k125j646j657q24Q75K029J719M45p06
$$ 327305 327109 328538 329668 328333 324924 321617 319492 317846 316189 315365 316240 318269 319988 320433 319727
52801C19727r65q4J535K926L279K628J511K55j070k237k764k102Q3L243N570N339
$$ 319727 318762 318678 320213 323139 326418 329046 330557 330812 329742 327505 324741 322639 322722 325965 331535 336874
52785C36874L002R90P48J068K20j449k418k496k642k797j896j53N52q15k972m003
$$ 336874 339876 340866 341614 342682 342902 341453 339035 336539 333897 331100 329204 329051 329603 328788 325816 321813
52769C21813l337j499Q64K885L394K073J60q08n57J27O40R19J011R55Q37N52j80
$$ 321813 318476 316977 317841 320726 324120 326193 326353 325545 324988 325115 325755 326674 327685 328640 329477 330029 329849
52752C29849j128j410m69J187K675L708M394M635M347L867L508L055K283J535
$$ 329849 328721 327311 326842 328029 330704 334412 338806 343441 347788 351655 355163 358218 360501 362036
52738C62036J127O49l81j516j910j664j705k418l315m047m806n468n254l730j621
$$ 362036 363163 363812 363431 361915 360005 358341 356636 354218 350903 346856 342050 336582 331328 327598 325977
52723C25977j08L48K45L70J014J662J395n5j712k204j273k2L31m02j488j966j263
$$ 325977 325869 326217 326462 326832 327846 329508 330903 330848 329136 326932 325659 325637 325968 325566 324078 322112 320849
52706C20849L78J887K257J547N76k14r43j443j128k6R82J389J725K458L036K743
$$ 320849 321227 323114 325371 326918 327494 327280 326337 324894 323766 323740 324722 326111 327836 330294 333330 336073
52690C36073J922J411J233P90O6l27k84m48j141j781j633p58N4K6r50k109k359
$$ 336073 337995 339406 340639 341429 341495 341168 340884 340436 339295 337514 335881 335123 335177 335203 334253 332144 329785
52673C29785j414k46k5o90j175q73j60M69J036J681K397L258M234M515L027J32
$$ 329785 328371 328125 328100 327410 326235 325362 325202 325671 326707 328388 330785 334043 338277 342792 345819 345951
52657C45951k132k341j454j346k195k601j922j039o11m1J213K334K160P53q89
$$ 345951 343819 341478 340024 338678 336483 333882 331960 330921 330310 330269 331482 333816 335976 336729 335840
52642C35840k258l487m339m095k600p70L05K46o26j637j919r32P49J654J028j65
$$ 335840 333582 330095 325756 321661 319061 318291 318596 318842 318216 316579 314660 313728 314477 316131 317159 316994
52626C16994m44K62O66J6q68p95K29J195J434J176R81J162J698K194J942O28r51
$$ 316994 316550 316812 317478 317494 316626 315831 316060 317255 318689 319865 320846 322008 323706 325900 327842 328470 327519
52609C27519j467o51K50m3j329k314k099p22J272L031L459K144K58l26P95K079
$$ 327519 326052 325401 325651 325608 324279 321965 319866 319144 320416 323447 326906 329050 329308 328982 329777 331856
52593C31856K028R51K20M53J120J439J040J34l91M42K322L352K047p16k703l040
$$ 331856 333884 334835 335055 335508 336628 338067 339107 339241 338850 339292 341614 344966 347013 346297 343594 340554
52577C40554k764k782k655j743m97J44p6o03o53L58K207L546L051J304M94J705
$$ 340554 337790 335008 332353 330610 330113 330257 330181 329578 328925 329283 331490 335036 338087 339391 339885 341590
52561C41590L466L793K675J518R38M03l75j007j267j356j284q88m45m60q48j061
$$ 341590 345056 348849 351524 353042 353980 354383 354008 353001 351734 350378 349094 348206 347761 347301 346453 345392
52545C45392r30o96l40K30N15r0j138j398m18J008J994K320K027J234N66P62J518
$$ 345392 344462 343766 343426 343656 344171 344081 342943 341545 341127 342135 344129 346449 348476 349710 350276 351038 352556
52528C52556J662P81k44o60p58q29l36R57J896J176o75j615m03K065L740L288
$$ 352556 354218 354999 354755 354095 353337 352508 352172 353129 355025 356201 355526 353911 353508 355573 359313 362601
52512C62601J042j448k776k732j994j011K94J675K281J660L93o83j351j660j345
$$ 362601 363643 362195 359419 356687 354693 353682 353976 355651 357932 359592 359985 359302 357951 356291 354946
52497C54946k98Q03J045K79q78j699j616l23J664K927K342L34j588k316j852p76
$$ 354946 354648 355451 356496 356775 355897 354198 352582 352259 353923 356850 359192 359526 357938 355622 353770 352994
52481C52994L04R88J265J491J798J740Q56n91j823k295j915q46M63J292J156K12
$$ 352994 353298 354286 355551 357042 358840 360580 361436 360845 359022 356727 354812 353966 354429 355721 356877 357089
52465C57089j038k111k404j338P74K466K434Q69r03j843j766r89p2L64J92o7J0
$$ 357089 356051 353940 351536 350198 350972 353438 355872 356741 355838 353995 352229 351240 351168 351532 351724 351657 351667
52448C51667L00Q33K125M099N396M852L168J968J580R84k82j476j970k022j930
$$ 351667 351967 352800 354925 359024 364420 369272 372440 374408 375988 376972 376690 375214 373244 371222 369292
52433C69292j466m88O46J517J902J589O10m24j047j753l148m424l939j512J119
$$ 369292 367826 367338 367984 369501 371403 372992 373602 373178 372131 370378 367230 362806 358867 357355 358474
52418C58474K328K105J231J88n97n61K51J050J444J947K840L407K965J899J007
$$ 358474 360802 362907 364138 364326 363729 363168 363419 364469 365913 367860 370700 374107 377072 378971 379978
52403C79978N27L49O41J501K420K729K285J442P40P90J761K754K492Q70q80j874
$$ 379978 380505 380854 381495 382996 385416 388145 390430 391872 392612 393402 395163 397917 400409 401279 400399 398525
52387C98525k437k915k850k037j353j570k238k629k959l593l861k861r92N05J155
$$ 398525 396088 393173 390323 388286 386933 385363 383125 380496 377537 373944 370083 367222 366230 366735 367890
52372C67890J386J485J461J599J935J496o54l622n185m313k219n59M51J682L461
$$ 367890 369276 370761 372222 373821 375756 377252 376598 372976 367791 363478 361259 360700 361151 362833 366294
52357C66294M941M956L289J073k23k12K47L52J67p0n66j250j189L46K731M830
$$ 366294 371235 376191 379480 380553 380330 380118 380365 380717 380884 380814 380248 378998 377809 378155 380886 385716
52341C85716O433P903Q906Q694P388N785M023J649j015k818l256k992k735k617
$$ 385716 392149 400052 408958 417652 425040 430825 434848 436497 435482 432664 429408 426416 423681 421064
52327D21064k731l186l449k693j167j27o3j6Q03J827K120J716J211Q21N28M96
$$ 421064 418333 415147 411698 409005 407838 407711 407648 407632 408435 410262 412382 414098 415309 416130 416658 417154
52311D17154O79N06k67q67l34J148K385K456J603R94J715L601N031M462K267K99
$$ 417154 417833 418339 418072 417205 416871 418019 420404 422860 424463 425457 427172 430773 435804 440266 442533 442832
52295D42832m95r95j943k437j382M46J269Q18N47J211J645N46j413k161o87J726
$$ 442832 442337 441342 439399 436962 435580 436026 437295 438113 438660 439871 441516 442062 440649 438488 437801 439527
52279D39527K974K498J733K112L215L603L186L538N609Q166R350Q922P980P098
$$ 439527 442501 444999 446732 448844 452059 455662 458848 462386 467995 476161 485511 494433 502413 509511
52265E09511O015M842M287M507M831M961N532P071R185J1175J2754J3651J3165
$$ 509511 515526 520368 524655 529162 533993 538954 544486 551557 560742 571917 584671 598322 611487
52252F11487J0863P440M356K702K694L777M831M687L193J601J276K088K681K244
$$ 611487 622350 629790 634146 636848 639542 643319 648150 652837 656030 657631 658907 660995 663676 665920
52238F65920J298O91O22R73J755K630K654J364j45k14J337L007L578L388L243
$$ 665920 667218 667909 668531 669504 671259 673889 676543 677907 677762 677548 678885 681892 685470 688858 692101
52223F92101K982J988O26J05Q75K027K522K455K610L291M079M578M752M501L516
$$ 692101 695083 697071 697697 697802 698677 700704 703226 705681 708291 711582 715661 720239 724991 729492 733008
52208G33008J976R84J540L127M087L807L606M817O755P728P634P910Q905R097
$$ 733008 734984 735968 737508 740635 744722 748529 752135 756952 763707 771435 779069 786979 795884 804981
52194H04981P598N802N341N714N478M825N164O621P856Q155Q105Q045P579O858
$$ 804981 812579 818381 823722 829436 834914 839739 844903 851524 859380 867535 875640 883685 891264 898122
52180H98122O718P111O937O029N643O230O273M613K537K081L275M545N141N570
$$ 898122 904840 911951 918888 924917 930560 936790 943063 947676 950213 952294 955569 960114 965255 970825
52166I70825O124O527O857P402P657O722M850L456L472M561N996P256P765P219
$$ 970825 976949 983476 990333 997735 1005392 1012114 1016964 1020420 1023892 1028453 1034449 1041705 1049470 1056689
52152A056689O398O495P295P245N871M865N745P470P744O229M996N683P416Q114
$$ 1056689 1063087 1069582 1076877 1084122 1089993 1094858 1100603 1108073 1115817 1122046 1127042 1132725 1140141 1148255
52138A148255O980N015L539L006L182L742M312M358L623K545J890J855J894J494
$$ 1148255 1155235 1160250 1163789 1166795 1169977 1173719 1178031 1182389 1186012 1188557 1190447 1192302 1194196 1195690
52124A195690P99L45M60J124K112L003L211K345N13j743l713m790m977n146o231
$$ 1195690 1196489 1196834 1197294 1198418 1200530 1203533 1206744 1209089 1209602 1207859 1204146 1199356 1194379 1189233 1183002
52109A183002p851q374o861m442l062l257l867l768k909j659k1K021L855M525
$$ 1183002 1175151 1166777 1159916 1155474 1152412 1149155 1145288 1141520 1138611 1136952 1136931 1138952 1142807 1147332
52095A147332L696K129J167J484K352K404J256l1m03j51j90n95p54n76m22m8J144
$$ 1147332 1151028 1153157 1154324 1155808 1158160 1160564 1161820 1161789 1161386 1161235 1161045 1160450 1159696 1159120 1158698 1158650 1159794
52078A159794K554K488N29j360j151N19J246J16j239j057K85J176J096J052J816
$$ 1159794 1162348 1164836 1165365 1164005 1162854 1163373 1164619 1164735 1163496 1162439 1162724 1163900 1164996 1166048 1167864
52063A167864K894L647M565O562R353J1662J3028J4307J5923J6736J5695J3772
$$ 1167864 1170758 1174405 1178970 1185532 1194885 1206547 1219575 1233882 1249805 1266541 1282236 1296008
52051A296008J2988J3731J4322J3303J1025Q678O711M793K667N57r44j291o23
$$ 1296008 1308996 1322727 1337049 1350352 1361377 1370055 1376766 1381559 1384226 1384783 1383839 1382548 1381925
52038A381925K0k10p62m04Q54J640J327R85J709L091M195M979N754O126N626M702
$$ 1381925 1381945 1381735 1380973 1380569 1381423 1383063 1384390 1385375 1387084 1390175 1394370 1399349 1405103 1411229 1416855 1421557
52022A421557L868K503r5k930m166l686l192l619l995l323k059r26L51K022L064
$$ 1421557 1425425 1427928 1427833 1424903 1420737 1417051 1413859 1410240 1406245 1402922 1400863 1399937 1400288 1402310 1405374
52007A405374K374O11m68k66K63L20J88K06oq65k084l148l975m672n164n601o535
$$ 1405374 1407748 1408359 1407891 1407625 1407888 1408208 1408396 1408602 1408596 1407731 1405647 1402499 1398524 1393852 1388688 1383087 1376552
51990A376552q120r397r154p393n354m211m253n122o055n975m301k041j115k074
$$ 1376552 1368432 1359035 1349881 1342488 1337134 1332923 1328670 1323548 1317493 1311518 1307217 1305176 1304061 1301987
51976A301987l292l137k119j743j843o16K569N848P091O390N489N386N536N206
$$ 1301987 1298695 1295558 1293439 1291696 1289853 1289237 1291806 1297654 1304745 1311135 1316624 1322010 1327546 1332752
51962A332752M508L868L263K509J933K101K869L158K089J25j393j845j953k694
$$ 1332752 1337260 1341128 1344391 1346900 1348833 1350934 1353803 1356961 1359050 1359175 1357782 1355937 1353984 1351290
51948A351290m179n895p470q584q829q453q774j0643j2804j3164j1735j0915j2412
$$ 1351290 1347111 1341216 1333746 1325162 1316333 1307880 1299106 1288463 1275659 1262495 1250760 1239845 1227433
51935A227433j5311j7875j9863k1933k3820k4656k4486k4166k3848k2772k0507
$$ 1227433 1212122 1194247 1174384 1152451 1128631 1103975 1079489 1055323 1031475 1008703 988196
51924I88196j7520j4509j1894r946q680p752o977o698p003p088o368n750o578
$$ 988196 970676 956167 944273 934327 925647 917895 910918 904220 897217 890129 883761 878011 871433
51911H71433q410r249q165o507n993o656p308p144o189m683k781o96J362L369
$$ 871433 863023 853774 845609 839102 833109 826453 819145 812001 805812 801129 798348 797652 799014 802383
51897H02383N500P916J0377J1871J1221Q700O553O816Q801R821Q406N591K980
$$ 802383 807883 815799 826176 838047 849268 857968 864521 871337 880138 889959 898365 903956 906936
51884I06936R40p45j782j914j707j855k157j814l05K431N995R269J0956J0945
$$ 906936 907876 907131 905349 903435 901728 899873 897716 895902 895597 898028 904023 913292 924248 935193
51870I35193J0533J0772J1265J1026R712P432M230M22l347o999j0996j4854j7036
$$ 935193 945726 956498 967763 978789 988501 995933 1000163 1000585 997238 990239 979243 964389 947353
51857I47353j7254j7463j9115k0713j9950j7305j5351j5011j4730j3355j1611
$$ 947353 930099 912636 893521 872808 852858 835553 820202 805191 790461 777106 765495
51846G65495j0303q954o961m683k755j406q15r31p25J082M209P022Q770J0133
$$ 765495 755192 746238 739277 734594 731839 730433 729618 728687 727962 729044 733253 740275 749045 759178
51832G59178J1317J1426J0417R699R705Q600M864j56l890n707o891q390j0064
$$ 759178 770495 781921 792338 802037 811742 820342 825206 825050 821160 815453 808562 800172 790108
51819G90108j1472j1843r928n564r25J398J404J366K739M906O901Q793J0914J2967
$$ 790108 778636 766793 756865 751301 750376 751774 753178 754544 757283 762189 769090 777883 788797 801764
51805H01764J4285J4263J2565R745P370O287N042J561l659p787r346r901j1269
$$ 801764 816049 830312 842877 852622 859992 866279 871321 872882 869223 861436 852090 842189 830920
51792H30920j2849j2991j1676j0223r049p291m529j763m81j373l880o551q009
$$ 830920 818071 805080 793404 783181 774132 766841 762312 760549 760068 758695 754815 748264 740255
51779G40255p920o841n157k847n33L97n38j937k235j694j560j857j445j37Q02
$$ 740255 732335 725494 720337 717490 716957 717354 716816 714879 712644 710950 709390 707533 706088 705951 706753
51764G06753O51L85J217K792L652L064J746R85J374K356K850K386J616J397J665
$$ 706753 707404 707789 709006 711798 715450 718514 720260 721245 722619 724975 727825 730211 731827 733224 734889
51749G34889J772J810K674M520O134O477O232O964R057J1288J2330J1947J0660
$$ 734889 736661 738471 741145 745665 751799 758276 764508 771472 780529 791817 804147 816094 826754
51736H26754Q980P193N371L215K66l435p090r866j1703j3120j4372j5063j4642
$$ 826754 835734 842927 848298 851513 851779 848344 841254 831388 819685 806565 792193 777130 762488
51723G62488j3101j1083r409q428p780o871n635m676m543n004n287m962m270l578
$$ 762488 749387 738304 728895 720467 712687 705816 700181 695505 690962 685958 680671 675709 671439 667861
51709F67861k885k027j090l46R9L87O60J055J854L351N412P368Q540Q863Q821
$$ 667861 664976 662949 661859 661513 661612 661999 662659 663714 665568 668919 674331 681699 690239 699102 707923
51694G07923Q732Q294O993M852K482K23k268n242p969r334r295q929q676p505
$$ 707923 716655 724949 731942 736794 739276 739499 737231 731989 724020 714686 705391 696462 687786 680281
51680F80281m583j159M31l31j330k56K849O063P884Q508R064J0334J2178J3740
$$ 680281 675698 674539 674970 674639 673309 673053 675902 681965 689849 698357 707421 717755 729933 743673
51666G43673J4088J2911J0780Q752P624P418P325O237L692L91k540m814o921q733
$$ 743673 757761 770672 781452 790204 797828 805246 812571 818808 822500 822891 820351 815537 808616 799883
51652G99883r040p187m484k981l081l486l469l844n138o035m925k252NJ049K018
$$ 799883 790843 783656 779172 776191 773110 769624 766155 762311 757173 751138 746213 743961 743966 745015 747033
51637G47033L765N293N262L957K576J323l82k014k018l6K292L460L725L798L115
$$ 747033 750798 756091 761353 765310 767886 769209 768827 766813 764795 764759 767051 770511 774236 778034 781149
51622G81149Q21k319m590n597o300o909o455m804l473l605m380m371l414k052
$$ 781149 781970 779651 775061 769464 763164 756255 749800 744996 741523 737918 733538 729167 725753 723701
51608G23701m8L183P043R980J1239J1436J1323J0933J0029Q607O692M242J538
$$ 723701 723653 726836 733879 743859 755098 766534 777857 788790 798819 807426 814118 818360 819898
51595H19898q99l000n363q364j1273j2584j1324q054m576k470j741j053O29K868
$$ 819898 818999 815999 810636 802272 790999 778415 767091 759037 754461 751991 750250 749197 749826 752694
51581G52694M274L801J268k744p054j0350j2191j3311j4338j4600j3041j0168
$$ 752694 756968 760769 762037 759293 752239 741889 729698 716387 702049 687449 674408 664240
51569F64240q075q224r920j1267j1000r176o601m225k807k595l140l504k857j117
$$ 664240 656165 647941 638021 626754 615754 606578 599977 595752 592945 590350 587210 583706 580849 579732
51555E79732Q37J803J313j35j821l273l790k556M1J932J549P0R8K212M260M427
$$ 579732 580569 582372 583685 583550 581729 578456 574666 572110 572151 574083 575632 575702 575800 578012 582272 586699
51539E86699L454L083L608M102M230M485N052N512N813O593Q373J0796J2890J3939
$$ 586699 590153 593236 596844 600946 605176 609661 614713 620225 626038 632631 641004 651800 664690 678629
51525F78629J4112J4163J4323J3702J1486Q603P178P978R428R965J0292J2099
$$ 678629 692741 706904 721227 734929 746415 755018 762196 770174 779602 789567 799859 811958
51513H11958J5292J8044J9515K0984K3843K7594L0618L2072L2386L2423L2924
$$ 811958 827250 845294 864809 885793 909636 937230 967848 999920 1032306 1064729 1097653
51502A097653L4388L6594L8266L8006L5955L4161L4913L8956M5436N3089O0783
$$ 1097653 1132041 1168635 1206901 1244907 1280862 1315023 1349936 1388892 1434328 1487417 1548200
51491A548200O7173P0869P1402O9276O4556N6156M3419K7849J2148k361j6266
$$ 1548200 1615373 1686242 1757644 1826920 1891476 1947632 1991051 2018900 2031048 2028687 2012421
51480B012421l0152m3417n5201o5200p3044p7955p9791p9492p7773p4237o8619
$$ 2012421 1982269 1938852 1883651 1818451 1745407 1667452 1587661 1508169 1430396 1356159 1287540
51469A287540o1976n5632m9680m3549l7516l2359k8028k3866j9969j7078j5193
$$ 1287540 1225564 1169932 1120252 1076703 1039187 1006828 978800 954934 934965 917887 902694
51458I02694j3493j1666j0288r761r748r890j0105j0149r718r179r296j0005j0385
$$ 902694 889201 877535 867247 857486 847738 837848 827743 817594 807876 798697 789401 779396 769011
51445G69011j0005r464r265r016q201p037o173o107p080q878j0450j0507q926
$$ 769011 759006 749542 740277 731261 723060 716023 709850 703743 696663 687785 677335 666828 657902
51432F57902o926n555m681l756k800k080j463o15N93K138L741M500L531J339l66
$$ 657902 650976 645421 640740 636984 634184 632104 630641 630026 630619 632757 636498 640998 644529 645868 645502
51417F45502o97n63r85j488j138l03j88j083k145k692k744k566k503k974l841
$$ 645502 644805 644242 643257 641769 640631 640328 640140 639057 636912 634220 631476 628910 626407 623433 619592
51402F19592m191l588k980l353m020l541j954n82K25J384L019L827L150K083J644
$$ 619592 615401 611813 608833 605480 601460 597919 595965 595383 595608 596992 600011 603838 606988 609071 610715
51387F10715J318O00P07L106P039J0123J1263J1627J2813J5217J8320K1361K3266
$$ 610715 612033 612633 613340 616446 623485 633608 644871 656498 669311 684528 702848 724209 747475
51374G47475K2898K0053J5804J1443P513M242K285K308L763M607K614k738r532
$$ 747475 770373 790426 806230 817673 825186 829428 831713 834021 837784 842391 845005 842267 832735
51361H32735j4714j6575j5986j4906j3875j1795q331n386n121o930p716n525j859
$$ 832735 818021 801446 785460 770554 756679 744884 736553 731167 726046 719116 711400 705875 704016
51348G04016L18K01j55J412M690P610Q636Q082P333P239P417P005N924N200N922
$$ 704016 704334 704535 704380 705792 710482 718092 726728 734810 742143 749382 756799 763804 769728 774928 780850
51333G80850Q035J0494J2457J3812J4509J4207J3131J2653J4103J7196K0485K3330
$$ 780850 788885 799379 811836 825648 840157 854364 867495 880148 894251 911447 931932 955262
51321I55262K6532L0802L5538L9784M3763M8655N5089O2535P0047P6953Q2836
$$ 955262 981794 1012596 1048134 1087918 1131681 1180336 1235425 1297960 1368007 1444960 1527796
51310A527796Q7476R0972R3332R3654R0214Q1824O9008N3545L6983J9814J911
$$ 1527796 1615272 1706244 1799576 1893230 1983444 2065268 2134276 2187821 2224804 2244618 2246529
51299B246529j6497l4449n0692o4487p5914q5291r2289r5952r5795r2721q8433
$$ 2246529 2230032 2195583 2144891 2080404 2004490 1919199 1826910 1730958 1635163 1542442 1454009
51288A454009q3954p8944p2646o5262n7958n1679m6338m1463l7165l3883l1317
$$ 1454009 1370055 1291111 1218465 1153203 1095245 1043566 997228 955765 918600 884717 853400
51277H53400k8523k5232k2302k0279j8342j5608j2887j1749j1853j0920p832m447
$$ 853400 824877 799645 777343 757064 738722 723114 710227 698478 686625 675705 667873 663426
51265F63426l270m372n864o600o873o818n911m330l383l855m898n189m479l423
$$ 663426 660156 655784 649920 643320 636447 629629 623718 619388 616005 612150 607252 602063 597584 594161
51251E94161k550k066k114k550k761k314j546j052r23r09r85j202j236o39N03
$$ 594161 591611 589545 587431 584881 582120 579806 578260 577208 576285 575376 574391 573189 571953 571314 571817
51236E71817J625K315K551K450K065J447O18l95j409k156k520k453j686j36J317
$$ 571817 573442 575757 578308 580758 582823 584270 584888 584493 583084 580928 578408 575955 574269 574133 575450
51221E75450J345r4j342r84M37J492J920K539L529M046L456J985J42j569k427
$$ 575450 576795 576701 575359 574375 574812 576304 578224 580763 584292 588338 591794 593779 593921 592352 589925
51206E89925j981q60k54m20n39q1O34J260J806K001J473P48R22J812J656m97l100
$$ 589925 587944 587084 586830 586410 585871 585790 586424 587684 589490 591491 592964 593712 594634 596446 598102 597605 594505
51189E94505l820k255o4J010N08q51j734j082P68K173J998Q69J50K76Q88J782
$$ 594505 590685 588430 588366 589376 589884 589033 587299 586217 586985 589158 591156 592025 592175 592451 593339 595121
51173E95121K640K446N53j801k430o94J861L435L415J974m65k893m074l881l499
$$ 595121 597761 600207 600760 598959 596529 595835 597696 601131 604546 606520 606055 603162 599088 595207 591708
51158E91708l692l763k949j954k057l081l389j869Q79L434M779M493K574k31k267
$$ 591708 588016 584253 581304 579350 577293 574212 570823 568954 569833 573267 578046 582539 585113 584882 582615
51143E82615k063K22K827M108L922L118K157R97P6M35K314M364M898L764K341
$$ 582615 580552 580774 583601 587709 591631 594749 596906 597903 597979 598414 600728 605092 609990 613754 616095
51128F16095J920K623L733M526M690M451M347M557M545L822K831K497K890L032
$$ 616095 618015 620638 624371 628897 633587 638038 642385 646942 651487 655309 658140 660637 663527 666559
51114F66559K197P32n59j199r83J21J480J839N76j422k822l478m251n323n715
$$ 666559 668756 669488 668929 667730 666747 666868 668348 670187 670763 669341 666519 663041 658790 653467 647752
51099F47752m832l613l488m565n645n783n107m077k824j610j232k207l878m884
$$ 647752 642920 639307 635819 631254 625609 619826 614719 610642 607818 606208 604976 602769 598891 594007
51085E94007m448k810p61P01P50l34r29J48J751J647k96j680q69Q72J476Q52K42
$$ 594007 589559 586749 585988 586689 587439 587105 586176 586324 588075 589722 589426 587746 586877 587749 589225 590077 590319
51068E90319N2l6K29J026J144n35k586k292M73K703K281N39j09O63J610K234L006
$$ 590319 590371 590335 590564 591590 592734 592199 589613 587321 587794 590497 592778 593317 593208 593871 595481 597715 600721
51051F00721M048M912N301N088M057K494J399J403J958K368K951M346O169P362
$$ 600721 604769 609681 614982 620070 624127 626621 628020 629423 631381 633749 636700 641046 647215 654577
51037F54577P343O168M155K169J484K220K667J411n67j291p73p58j865k899l109
$$ 654577 661920 668088 672243 674412 675896 678116 680783 682194 681627 680336 679563 678805 676940 674041 670932
51022F70932l120l146k206j36J356Q84n04p98M28K204L869N108N064L211Q73J40
$$ 670932 667812 664666 662460 662324 663680 664564 664060 663262 663690 665894 669763 674871 679935 683146 684019 684159
51006F84159J163K041J600O67J08o61k175l263k307N26L689O224P958Q292O664
$$ 684159 685322 687363 688963 689630 689738 689077 686902 683639 681332 681858 685547 691771 699729 708021 714685
50991G14685M295L561M909O039N220L968M763P182Q468P616O677P417Q645Q109
$$ 714685 718980 722541 727450 733489 738709 742677 747440 754622 763090 770706 777383 784800 793445 801554
50977H01554N781L752L524M746O400P955R275J0289J0973J1058R799O807L130
$$ 801554 807335 811087 814611 819357 825757 833712 842987 853276 864249 875307 885106 891913 895043
50964H95043N56m70j445l812p005r187r591r294r673j0695j1017r522o536l545
$$ 895043 895599 895129 893684 889872 882867 873680 864089 854795 845122 834427 823410 813888 807352 803807
50950H03807j797j182m66J315L815N765O330N917N681O391P815R136R793R909
$$ 803807 802010 800828 800362 801677 805492 811257 817587 823504 829185 835576 843391 852527 862320 872229
50936H72229R848R553Q584O886N237M482M389L819K243N98R6O09R57O61M72J031
$$ 872229 882077 891630 900214 907100 912337 916819 921208 925027 927270 927868 927964 928573 929530 930191 930663 931694
50920I31694J970K759L727N496P969J0466J2360J3037J1978R834Q644R565J0876
$$ 931694 933664 936423 940150 945646 953615 964081 976441 989478 1001456 1011290 1019934 1029499 1040375
50907A040375R875O670M320M780O513P028O171N487N456N043L643J938P54R5l92
$$ 1040375 1050250 1056920 1061240 1066020 1072533 1079561 1085732 1091219 1096675 1101718 1105361 1107299 1108053 1108148 1107756
50892A107756n99J09K341N838R260J1280J2134J3352J5648J8006J9517K0939K3383
$$ 1107756 1107157 1107266 1109607 1115445 1124705 1135985 1148119 1161471 1177119 1195125 1214642 1235581 1258964
50879A258964K6249K8050K8830L0280L3174L5822L5521L1006K3429J5390Q948
$$ 1258964 1285213 1313263 1342093 1372373 1405547 1441369 1476890 1507896 1531325 1546715 1555663
50868A555663M173j66m428p467q666r349j1027j3289j4968j6555j9495k3514k6656
$$ 1555663 1559836 1559670 1555242 1547775 1539109 1529760 1518733 1505444 1490476 1473921 1454426 1430912 1404256
50855A404256k7995k8304k8044k6810k5161k4714k5544k5472k3219k0312j8596
$$ 1404256 1376261 1347957 1319913 1293103 1267942 1243228 1217684 1192212 1168993 1148681 1130085
50844A130085j7488j5554j3387j2824j3934j4811j4216j2763j1502j0712j0258
$$ 1130085 1112597 1097043 1083656 1070832 1056898 1042087 1027871 1015108 1003606 992894 982636
50833I82636r908r077p244m995l833m494n959o581n899m981m930n354m725k422
$$ 982636 972728 963651 956407 951412 947579 943085 937126 930545 924646 919665 914735 909381 904656 902234
50819I02234K09J464J518J932L068L474K103j21j633j835q42J159L274M002L100
$$ 902234 902443 903907 905425 907357 910425 913899 916002 915881 914248 912413 911571 912730 916004 920006 923106
50804I23106K356L262M905N490N039M940N637O432P097P924Q432P879P035P763
$$ 923106 925462 928724 933629 939119 944158 949098 954735 961167 968264 976188 984620 992499 999534 1007297
50790A007297J0547J3790J5805J6257J5649J4686J4409J5550J7519J9099K0259
$$ 1007297 1017844 1031634 1047439 1063696 1079345 1094031 1108440 1123990 1141509 1160608 1180867
50779A180867K1998K4273K5691K5620K5173K5596K6991K9215L2407L5908L8122
$$ 1180867 1202865 1227138 1252829 1278449 1303622 1329218 1356209 1385424 1417831 1453739 1491861
50768A491861L8629L9132M1169M3920M5630M6222M7071M8716N0377N1617N3128
$$ 1491861 1530490 1569622 1610791 1654711 1700341 1746563 1793634 1842350 1892727 1944344 1997472
50757A997472N5591N8551O0694O0844N8778N5242N1110M6293L9967L1976K3333
$$ 1997472 2053063 2111614 2172308 2233152 2291930 2347172 2398282 2444575 2484542 2516518 2539851
50746B539851J4917O509k315j1066j8847k5321l0435l3895l5849l7394l9228m0277
$$ 2539851 2554768 2561277 2558962 2547896 2529049 2503728 2473293 2439398 2403549 2366155 2326927 2286650
50734B286650l8861l5051l0672k7104k4260k1716j9439j7044j3593q962m561j911
$$ 2286650 2247789 2212738 2182066 2154962 2130702 2108986 2089547 2072503 2058910 2049948 2045387 2043476
50722B043476r26l14O45J390J014o25k828m843o521q235j0205j2095j3475j4520
$$ 2043476 2042550 2042236 2042881 2044271 2045285 2044660 2041832 2036989 2030468 2022233 2012028 1999933 1986458 1971938
50708A971938j5893j7978k0508k3070k5681k8727l2340l5959l8514l9297l8707
$$ 1971938 1956045 1938067 1917559 1894489 1868808 1840081 1807741 1771782 1733268 1693971 1655264
50697A655264l7935l7689l7510l6589l4883l3045l1403k9682k7583k5137k2327
$$ 1655264 1617329 1579640 1542130 1505541 1470658 1437613 1406210 1376528 1348945 1323808 1301481
50686A301481j8894j4847j0786p516n412m236l358k044J15K842N317O923P859
$$ 1301481 1282587 1267740 1256954 1249438 1244026 1239790 1236432 1234388 1234503 1237345 1242662 1249585 1257444
50673A257444Q927J0738J3199J5781J8148K0302K2097K2981K2583K1448K0679
$$ 1257444 1266371 1277109 1290308 1306089 1324237 1344539 1366636 1389617 1412200 1433648 1454327
50662A454327K0783K1259K1414K1150K0716K0261J9985K0239K1059K1909K2439
$$ 1454327 1475110 1496369 1517783 1538933 1559649 1579910 1599895 1620134 1641193 1663102 1685541
50651A685541K3051K4200K5409K5823K5554K5765K7301K9858L2592L4902L6434
$$ 1685541 1708592 1732792 1758201 1784024 1809578 1835343 1862644 1892502 1925094 1959996 1996430
50640A996430L7005L6989L7420L9153M1903M4318M5119M4103M2108M0012L7908
$$ 1996430 2033435 2070424 2107844 2146997 2188900 2233218 2278337 2322440 2364548 2404560 2442468
50629B442468L5469L2866L0826K9536K8304K6743K5667K5910K6712K6421K4711
$$ 2442468 2477937 2510803 2541629 2571165 2599469 2626212 2651879 2677789 2704501 2730922 2755633
50618B755633K3065K2819K3601K4035K3200K1157J8914J8280K0923K6732L3568
$$ 2755633 2778698 2801517 2825118 2849153 2872353 2893510 2912424 2930704 2951627 2978359 3011927
50607C011927L9252M3391M6864N0153N2853N4404N4439N2778M9853M7065M5814
$$ 3011927 3051179 3094570 3141434 3191587 3244440 3298844 3353283 3406061 3455914 3502979 3548793
50596C548793M6085M6572M6204M5142M4218M4102M5015M6606M7885M7893M6758
$$ 3548793 3594878 3641450 3687654 3732796 3777014 3821116 3866131 3912737 3960622 4008515 4055273
50585D055273M5737M5863M6997M8487N0446N3856N9464O6797P4277Q0173Q3627
$$ 4055273 4101010 4146873 4193870 4242357 4292803 4346659 4406123 4472920 4547197 4627370 4710997
50574D710997Q4929Q4691Q2811P8556P1703O3104N3811M4009L3375K2122J1092
$$ 4710997 4795926 4880617 4963428 5041984 5113687 5176791 5230602 5274611 5307986 5330108 5341200
50563E341200Q00r017j8953k9666m2074n6832p2886q7008r5669r7408r3234q5038
$$ 5341200 5342000 5332983 5314030 5284364 5242290 5185458 5112572 5025564 4929895 4832487 4739253 4654215
50551D654215p4340o2336n0193l8791k8521j9620j2452p434n083o239j1693k1264
$$ 4654215 4579875 4517539 4467346 4428555 4400034 4380414 4367962 4360528 4355445 4349206 4337513 4316249
50539D316249l3547m6903o0300p3124q4732r4591j02408j07628j09429j07831
$$ 4316249 4282702 4235799 4175499 4102375 4017643 3923052 3820644 3713016 3603587 3495756
50529C495756j04390j00972r8109r5236r1967q8085q2698p5016o6075n8157n1913
$$ 3495756 3391366 3290394 3192285 3097049 3005082 2916997 2834299 2759283 2693208 2635051 2583138
50518B583138m5474l7306k8536k1214j5310r163k227M384R923J4875J9546K3504
$$ 2583138 2537664 2500358 2471822 2450608 2435298 2426135 2423908 2428292 2438215 2453090 2472636 2496140
50506B496140K6842L0471L4350L6770L6543L4833L3606L3199L2810L2655L3847
$$ 2496140 2522982 2553453 2587803 2624573 2661116 2695949 2729555 2762754 2795564 2828219 2862066
50495B862066L6253L8278L9243M0574M3972M9420N5641O1634O7070P1959P6747
$$ 2862066 2898319 2936597 2975840 3016414 3060386 3109806 3165447 3227081 3294151 3366110 3442857
50484C442857Q2118Q8003R3260R7092J00145J03420J06664J09008J10935J14403
$$ 3442857 3524975 3612978 3706238 3803330 3903475 4006895 4113559 4222567 4333502 4447905
50474D447905J20774J29423J38601J47109J55133J63932J74694J87138J99413
$$ 4447905 4568679 4698102 4836703 4983812 5138945 5302877 5477571 5664709 5864122
50465E864122K09986K19372K29064K39108K47875K54161K58035K59299K56567
$$ 5864122 6074108 6293480 6522544 6761652 7009527 7263688 7521723 7781022 8037589
50456H037589K48640K35616K17786J94463J64994J30171R1623N0448P467l5737
$$ 8037589 8286229 8521845 8739631 8934094 9099088 9229259 9320882 9371330 9378797 9343060
50446I343060p7256j16019j51544j82716k07763k25331k34805k35921k28854k14576
$$ 9343060 9265804 9149785 8998241 8815525 8607762 8382431 8147626 7911705 7682851 7468275
50436G468275j94299j68895j39618j08862p8943n0405k2908K157K1266L1376L1786
$$ 7468275 7273976 7105081 6965463 6856601 6777658 6727253 6704345 6706502 6727768 6759144 6790930
50425F790930K3098N614k0209n2350q7074j20334j49329j73240j92616k07771
$$ 6790930 6814028 6819642 6799433 6747083 6660009 6539675 6390346 6217106 6024490 5816719
50415E816719k17950k22528k22514k19750k14842k07216j97239j86774j76978
$$ 5816719 5598769 5376241 5153727 4933977 4719135 4511919 4314680 4127906 3950928
50406C950928j67070j56053j44472j33296j22210j10531r9200r0272q4369p9803
$$ 3950928 3783858 3627805 3483333 3350037 3227827 3117296 3018096 2927824 2843455 2763652
50396B763652p4505o8116o1852n6922n3282m9699m4982l9293l4095l0594k8421
$$ 2763652 2689147 2621031 2559179 2502257 2448975 2399276 2354294 2315001 2280906 2250312 2221891
50385B221891k6110k2719j8700j5340j3457j2582j1401r062n767j926K622P815
$$ 2221891 2195781 2173062 2154362 2139022 2125565 2112983 2101582 2092520 2086753 2084827 2087449 2095264
50373B095264J2366J4969J6328J8546K2358K6516L0197L4151L8738M2717M5397
$$ 2095264 2107630 2122599 2138927 2157473 2179831 2206347 2236544 2270695 2309433 2352150 2397547
50362B397547M8241N2685N7757O1794O5300O9872P5236P9913Q4304R0405R8384
$$ 2397547 2445788 2498473 2556230 2618024 2683324 2753196 2828432 2908345 2992649 3083054 3181438
50351C181438J06175J13003J20566J29656J38020J43391J46680J50018J52954
$$ 3181438 3287613 3400616 3521182 3650838 3788858 3932249 4078929 4228947 4381901
50342D381901J52879J48605J41513J33233J23985J13474J01625Q7705O9875M6940
$$ 4381901 4534780 4683385 4824898 4958131 5082116 5195590 5297215 5384920 5454795 5501735
50332E501735K0222p172l3132n7844q1971j04125j21269j31748j36769j38132
$$ 5501735 5521957 5514785 5481653 5423809 5341838 5237713 5116444 4984696 4847927 4709795
50322D709795j35527j27614j15021j00367q5193o8986n1791l5711k2466j1303
$$ 4709795 4574268 4446654 4331633 4231266 4146073 4077087 4025296 3989585 3967119 3955816
50312C955816j250N893P148K313o029j6303k9301m5246o1841p6592q9401j01217
$$ 3955816 3954566 3960459 3967607 3969920 3963891 3947588 3918287 3873041 3811200 3734608 3645207 3543990
50300C543990j11276j17479j19178j18073j16255j14447j12204j08803j03747
$$ 3543990 3432714 3315235 3196057 3077984 2961729 2847282 2735078 2626275 2522528
50291B522528r7216r0329q4314p9266p4422o9682o5836o2831n8996n2972m5746
$$ 2522528 2425312 2334983 2250669 2171403 2096981 2027299 1961463 1898632 1839636 1786664 1740918
50280A740918l9617l5456l2218k8965k6052k3935k2028j9542j6777j4667j3539
$$ 1740918 1701301 1665845 1633627 1604662 1578610 1554675 1532647 1513105 1496328 1481661 1468122
50269A468122j2914j2249j1291r962q490p379o758o048m876l910l962m579m469
$$ 1468122 1455208 1442959 1431668 1421706 1413216 1405837 1399079 1393031 1388155 1384245 1380283 1375704 1371235
50256A371235l358k363k268k319j330P30K825M108M446L964K856J696J407K476
$$ 1371235 1367877 1365514 1363246 1360927 1359597 1360327 1363152 1367260 1371706 1375670 1378526 1380222 1381629 1384105
50242A384105M426O329P792R058J0044R910Q225O133N389O109O534N471L865L203
$$ 1384105 1388531 1394860 1402652 1411710 1421754 1431664 1439889 1446022 1451411 1457520 1464054 1469525 1473390 1476593
50228A476593L372L252K633K108J619O54l35l69K56K75l16l6J613L296M168N296
$$ 1476593 1479965 1483217 1485850 1487958 1489577 1490231 1489896 1489527 1489783 1490058 1489742 1489706 1491319 1494615 1498783 1504079
50212A504079P603J0229J2401J5303J9861K3607K2316J4905M940l159p996j0957
$$ 1504079 1511682 1521911 1534312 1549615 1569476 1593083 1615399 1630304 1635244 1632085 1624089 1613132
50200A613132j3613j6199j7972j8382j7882j7568j7664j6948j4360j0843q382
$$ 1613132 1599519 1583320 1565348 1546966 1529084 1511516 1493852 1476904 1462544 1451701 1443319
50189A443319p536p199o735o799p538p629o031l673k194j816j640j478j939k783
$$ 1443319 1435783 1428584 1421849 1415050 1407512 1399883 1393852 1390179 1387985 1386169 1384529 1383051 1381112 1378329
50175A378329k585o45J731K614J707M64J43M59M10k57r70j432j954k635k992k869
$$ 1378329 1375744 1375099 1376830 1379444 1381151 1381615 1381758 1382217 1382627 1382370 1381400 1379968 1378014 1375379 1372387 1369518
50159A369518l010m109n726o934p742r012j1044j3120j4475j4889j4187j2169
$$ 1369518 1366508 1362399 1356673 1349739 1341997 1332985 1321941 1308821 1294346 1279457 1265270 1253101
50147A253101r483p619p333p681p350o364n618n115l700q02K417M044L410J803
$$ 1253101 1243618 1235999 1228666 1220985 1213635 1207271 1201653 1196538 1192838 1192036 1194453 1198497 1201907 1203710
50133A203710J171K064K836J285k818p160r251q873p694o977o689o658p242q246
$$ 1203710 1204881 1206945 1209781 1211066 1208248 1201088 1191837 1182964 1175270 1168293 1161604 1154946 1147704 1139458
50119A139458q278o215k923n56j49p29q43j93O32J286J905K525K956L285L974
$$ 1139458 1131180 1124965 1122042 1121486 1121337 1120608 1119765 1119572 1120204 1121490 1123395 1125920 1128876 1132161 1136135
50104A136135N238O659P700Q320Q738Q804Q177P232P182Q787J1278J3182J4120
$$ 1136135 1141373 1148032 1155732 1164052 1172790 1181594 1189771 1197003 1204185 1212972 1224250 1237432 1251552
50091A251552J4951J6048J6561J6097J6082J7993K0607K0829J7636J3629J1651
$$ 1251552 1266503 1282551 1299112 1315209 1331291 1349284 1369891 1390720 1408356 1421985 1433636
50080A433636J1170R471N660J761j36j75K27M25Q14J874L752O459R916J3823J7735
$$ 1433636 1444806 1454277 1459937 1461698 1461562 1461387 1461614 1462039 1462853 1464727 1468479 1474938 1484854 1498677 1516412
50065A516412K1116K3491K4858K5904K7292K8936L0577L2817L6509M1066M4627
$$ 1516412 1537528 1561019 1585877 1611781 1639073 1668009 1698586 1731403 1767912 1808978 1853605
50054A853605M6241M6624M6204M3825L8614L2104K7004K4320K2961K1771K0496
$$ 1853605 1899846 1946470 1992674 2036499 2075113 2107217 2134221 2158541 2181502 2203273 2223769
50043B223769J8894J6409J3017R291N146m43p995j6539k4635l1771l8221m3923
$$ 2223769 2242663 2259072 2272089 2281380 2286526 2286083 2278088 2261549 2236914 2205143 2166922 2122999
50031B122999m8205n0523n1135n0844n0101m8454m5217m0712l6258l2471k8322
$$ 2122999 2074794 2024271 1973136 1922292 1872191 1823737 1778520 1737808 1701550 1669079 1640757
50020A640757k2753j6753j2605j1012j0185q147m927j948k13J5j580n289j0262
$$ 1640757 1618004 1601251 1588646 1577634 1567449 1559302 1554375 1552427 1552214 1552229 1550649 1545360 1535098
50007A535098j4307j5428j3660j1097r901j0334j0998j0795r917q868p580o224
$$ 1535098 1520791 1505363 1491703 1480606 1470705 1460371 1449373 1438578 1428661 1419793 1412213 1405989
49995A405989n805o730p521o498m323l063k893j729J336M323N068M046L201L361
$$ 1405989 1400184 1393454 1385933 1379435 1375112 1372049 1369156 1367427 1368763 1373086 1378154 1382200 1385401 1388762
49981A388762M235N900Q520J1207J2726J3110J3318J3702J4018J4548J5759J7080
$$ 1388762 1392997 1398897 1407417 1418624 1431350 1444460 1457778 1471480 1485498 1500046 1515805 1532885
49969A532885J7452J7114J7389J8685K0087K1167K2540K4150K4561K2935K0560
$$ 1532885 1550337 1567451 1584840 1603525 1623612 1644779 1667319 1691469 1716030 1738965 1759525
49958A759525J9239J9004J8625J7801J7597J8760K0667K2306K3621K5416K8174
$$ 1759525 1778764 1797768 1816393 1834194 1851791 1870551 1891218 1913524 1937145 1962561 1990735
$$ [...]
##END NTUPLES=NMR SPECTRUM
##END=
