
##TITLE=AC1105_ROVE100C_5868038_fyY4OHmNFm
##JCAMPDX= 6.0         $$ Bruker NMR JCAMP-DX V2.0
##DATA TYPE= NMR SPECTRUM
##DATA CLASS= NTUPLES
##ORIGIN= BRUKER
##OWNER= Administrator
$$ 1.72 TOPSPIN		Version 2.1
$$ 2012-03-31 02:17:58.250 -0500  Administrator@TOPSPIN
$$ Compression mode = diff/dup
##.OBSERVE FREQUENCY= 400.13188235
##.OBSERVE NUCLEUS= ^1H
##.ACQUISITION MODE= SIMULTANEOUS (DQD)
##.ACQUISITION SCHEME= undefined
##.AVERAGES= 8
##.DIGITISER RES= 22
##SPECTROMETER/DATA SYSTEM= spect
##.PULSE SEQUENCE= zg30
##.SOLVENT NAME= COFFEE_meoh
##.SHIFT REFERENCE= INTERNAL, COFFEE_meoh, 1, 14.98061
##AUDIT TRAIL= $$ (NUMBER, WHEN, WHO, WHERE, PROCESS, VERSION, WHAT)
$$ ##TITLE= Audit trail, TOPSPIN		Version 2.1
$$ ##JCAMPDX= 5.01
$$ ##ORIGIN= Bruker BioSpin GmbH
$$ ##OWNER= Administrator
$$ $$ C:\Bruker\TOPSPIN/data/COFFEE/nmr/AC1105_ROVE100C_5868038_fyY4OHmNFm/10/pdata/1/auditp.txt
$$ ##AUDIT TRAIL=  $$ (NUMBER, WHEN, WHO, WHERE, PROCESS, VERSION, WHAT)
(   1,<2012-03-31 02:17:50.937 -0500>,<Administrator>,<TOPSPIN>,<go>,<TOPSPIN 2.1>,
      <created by zg
	started at 2012-03-31 02:16:44.421 -0500,
	POWCHK enabled, PULCHK disabled,
       configuration hash MD5:
       1A 1E CE 29 27 FD 77 03 67 4E F0 E3 C4 B2 CB 90
       data hash MD5: 64K
       5B 8B 0C DE C7 56 B9 C9 D3 E8 C6 4B 78 6A 8F A1>)
(   2,<2012-03-31 02:17:54.078 -0500>,<Administrator>,<TOPSPIN>,<proc1d>,<TOPSPIN 2.1>,
      <Start of raw data processing
       efp LB = 0 FT_mod = 6 PKNL = 1 PHC0 = 0 PHC1 = 0 SI = 32K 
       data hash MD5: 32K
       7E 42 B7 F2 83 95 69 AF 1D B5 7E 61 32 5D 92 7D>)
(   3,<2012-03-31 02:17:54.437 -0500>,<Administrator>,<TOPSPIN>,<proc1d>,<TOPSPIN 2.1>,
      <pk PHC0 = 210.8496 PHC1 = 0 
       data hash MD5: 32K
       5B 65 E1 BD 88 30 6A 56 83 56 5B FE 3B D0 DE 4C>)
(   4,<2012-03-31 02:17:54.500 -0500>,<Administrator>,<TOPSPIN>,<proc1d>,<TOPSPIN 2.1>,
      <abs ABSG = 1 
       data hash MD5: 32K
       77 16 04 C5 1E 3D 32 A6 EC A7 F1 D9 5E 85 CE 0F>)
(   5,<2012-03-31 02:17:54.531 -0500>,<Administrator>,<TOPSPIN>,<proc1d>,<TOPSPIN 2.1>,
      <abs ABSG = 2 
       data hash MD5: 32K
       30 3B D9 4D E8 75 C2 18 B0 4D E2 4D 7B 61 06 FC>)
(   6,<2012-03-31 02:17:54.562 -0500>,<Administrator>,<TOPSPIN>,<proc1d>,<TOPSPIN 2.1>,
      <abs ABSG = 3 
       data hash MD5: 32K
       01 B8 FD 5D 49 91 4F 37 4A C3 12 2E 2D B2 D3 6D>)
(   7,<2012-03-31 02:17:54.593 -0500>,<Administrator>,<TOPSPIN>,<proc1d>,<TOPSPIN 2.1>,
      <abs ABSG = 4 
       data hash MD5: 32K
       0F E3 B1 12 68 3F A4 F6 2C FF E6 B1 3C E2 5A 02>)
(   8,<2012-03-31 02:17:54.625 -0500>,<Administrator>,<TOPSPIN>,<proc1d>,<TOPSPIN 2.1>,
      <abs ABSG = 5 
       data hash MD5: 32K
       E6 AC B5 C9 14 44 AC E5 BC 42 2F 50 9C DB 51 E2>)
$$ ##END=
$$ 
$$ $$ hash MD5
$$ $$ 64 F2 18 1F ED 85 DB AA 2C 52 89 0D D5 2A 1B 00
##$RELAX= 
##$RELAX= 
##$RELAX= 
##$RELAX= 
##$RELAX= 
##$RELAX= 
##$RELAX= 
$$ Bruker specific parameters
$$ --------------------------
$$ [...]
150 150 150 150 150 150 150 150
##$TP07= 0
##$TPNAME0= <>
##$TPNAME1= <>
##$TPNAME2= <>
##$TPNAME3= <>
##$TPNAME4= <>
##$TPNAME5= <>
##$TPNAME6= <>
##$TPNAME7= <>
##$TPOAL= (0..7)
0.5 0.5 0.5 0.5 0.5 0.5 0.5 0.5
##$TPOFFS= (0..7)
0 0 0 0 0 0 0 0
##$TUNHIN= 0
##$TUNHOUT= 0
##$TUNXOUT= 0
##$USERA1= <user>
##$USERA2= <user>
##$USERA3= <user>
##$USERA4= <user>
##$USERA5= <user>
##$V9= 5
##$VALIST= <valist>
##$VCLIST= <CCCCCCCCCCCCCCC>
##$VD= 0
##$VDLIST= <DDDDDDDDDDDDDDD>
##$VPLIST= <PPPPPPPPPPPPPPP>
##$VTLIST= <TTTTTTTTTTTTTTT>
##$WBST= 2048
##$WBSW= 25
##$XGAIN= (0..3)
0 0 0 0
##$XL= 0
##$YL= 0
##$YMAX_a= 560722
##$YMIN_a= -675730
##$ZGOPTNS= <>
##$ZL1= 120
##$ZL2= 120
##$ZL3= 120
##$ZL4= 120
##$ABSF1= 14.98061
##$ABSF2= -5.57192
##$ABSG= 5
##$ABSL= 3
##$ALPHA= 0
##$AQORDER= 0
##$ASSFAC= 0
##$ASSFACI= 0
##$ASSFACX= 0
##$ASSWID= 0
##$AUNMP= <proc_prof1d_extract_pilot.lims>
##$AXLEFT= 0
##$AXNAME= <>
##$AXNUC= <1H>
##$AXRIGHT= 0
##$AXTYPE= 0
##$AXUNIT= <>
##$AZFE= 0.1
##$AZFW= 0.1
##$BCFW= 0
##$BC_mod= 0
##$BYTORDP= 0
##$COROFFS= 0
##$CY= 15
##$DATMOD= 1
##$DC= 0
##$DFILT= <>
##$DTYPP= 0
##$F1P= 0
##$F2P= 0
##$FCOR= 0.5
##$FTSIZE= 32768
##$FT_mod= 6
##$GAMMA= 0
##$GB= 0
##$INTBC= 1
##$INTSCL= 1
##$ISEN= 128
##$LB= 0
##$LEV0= 0
##$LPBIN= 0
##$MAXI= 10000
##$MC2= 0
##$MEAN= 0
##$ME_mod= 0
##$MI= 0
##$NCOEF= 0
##$NC_proc= -8
##$NLEV= 6
##$NOISF1= 0
##$NOISF2= 0
##$NSP= 0
##$NTH_PI= 0
##$NZP= 0
##$OFFSET= 14.98061
##$PC= 1
##$PHC0= 210.8496
##$PHC1= 0
##$PH_mod= 1
##$PKNL= yes
##$PPARMOD= 0
##$PPDIAG= 0
##$PPIPTYP= 0
##$PPMPNUM= 2147483647
##$PPRESOL= 1
##$PSCAL= 4
##$PSIGN= 0
##$PYNMP= <proc.py>
##$REVERSE= no
##$SF= 400.13
##$SI= 32768
##$SIGF1= 0
##$SIGF2= 0
##$SINO= 400
##$SIOLD= 32768
##$SPECTYP= <>
##$SREGLST= <1H.CDCl3>
##$SSB= 0
##$STSI= 32768
##$STSR= 0
##$SW_p= 8223.68421052632
##$SYMM= 0
##$S_DEV= 0
##$TDeff= 65536
##$TDoff= 0
##$TI= <>
##$TILT= no
##$TM1= 0
##$TM2= 0
##$TOPLEV= 0
##$USERP1= <user>
##$USERP2= <user>
##$USERP3= <user>
##$USERP4= <user>
##$USERP5= <user>
##$WDW= 1
##$XDIM= 32768
##$YMAX_p= 466188066
##$YMIN_p= -693507
##$CURPLOT= <Network HP LaserJet P1505>
##$CURPRIN= <$Network HP LaserJet P1505>
##$DFORMAT= <normdp>
##$LAYOUT= <+/1D_H.xwp>
##$LFORMAT= <normlp>
##$PFORMAT= <normpl>
##$SURQMSG= 1
$$ End of Bruker specific parameters
$$ ---------------------------------
##NTUPLES= NMR SPECTRUM
##VAR_NAME=  FREQUENCY,     SPECTRUM/REAL,   SPECTRUM/IMAG
##SYMBOL=    X,             R,               I
##VAR_TYPE=  INDEPENDENT,   DEPENDENT,       DEPENDENT
##VAR_FORM=  AFFN,          ASDF,            ASDF
##VAR_DIM=   32768,         32768,           32768
##UNITS=     HZ,            ARBITRARY UNITS, ARBITRARY UNITS
##FACTOR=    0.250966925370066, 1,           1
##FIRST=     8223.43324360095, -87703,       124284
##LAST=      0,             20512,           -139626
##MIN=       0,             -693507,         0
##MAX=       8223.43324360095, 466188066,    0
$$ Real data points
##PAGE= N=1
##DATA TABLE= (X++(R..R)), XYDATA
$$ [...]
19524A64998n9560e5560q0700j49503F0470h4019B32509h1417E9636H494c1930
19512f5875A11217J42862c14979A17949h4737A75245c7373o5950l58595K29925
19502b31993J10408o9560O562k34410a19271k11690A05698c11868Q2410J14379
19492a15079C1450f6340j3210k18600C9403b09782A07341r887J14591a10680A0881
19480a45867c006C9336L7223b31267C45666E5734a56976A25698a94121K3721A31277
19468d345G5688c3082j28610L140k79945a27689j44713B50516J8430R331E9655
19456a10902A45103J77056b52300A5947a10141j56263J3938n3618C2456a31717
19445B09951a23096o2250O1911k04606R4919D1835b92949B68785b34477c5347
$$ plain form
19524 164998 105438 -55560 -136260 -285763 60470 -84019 232509 -81417 59636 8494 -31930
19512 -65875 111217 254079 -314979 117949 -84737 175245 -37373 -103323 -461918 -231993
19502 -231993 -121585 -191145 -184583 -418993 -119271 -330961 105698 -311868 -229458 -115079
19492 -115079 31450 -66340 -79550 -298150 39403 -209782 107341 97454 212045 -110680 10881
19480 -145867 -3006 39336 76559 -231267 345666 55734 -156976 125698 -194121 -170400 131277
19468 -4345 75688 -33082 -161692 -158552 -438497 -127689 -272402 250516 268946 278277 59655
19456 -110902 145103 322159 -252300 15947 -110141 -266404 -252466 -306084 32456 -131717
19445 209951 -123096 -185346 -123435 -328041 -233122 41835 -292949 268785 -234477 -35347
19434H7538J6521B0311f0350n7901r0623a6731j15292K9271B63659H2061a86643
19422d2306j08361q3033D9564d5624K0202E1709d35979a28633N3132j53727k1106
19411b50334g6198J3029l3911H1168A7548M6986a10106A57006E5697a28296A10054
19399a06413j49505A03975D1326N4838D2393a6134l11281G0783n216L03367b49243
19387B3425a2726l00297a53850B22417a57518j25038m3268A09246a85413m3925
19377b29338d3500j50207O0632B4129c0162B67727A8967e042m8659k31195A2634
19365B93756B8874a69253d3443L8l8038m94906N1934J96870a10382M5532c2149
19353G7170L986A4461a52063B08190b92309a06410D6174P9319d2991j06459B17093
$$ plain form
19434 87538 104059 20311 -60350 -118251 -208874 -16731 -132023 -102752 263659 82061 -186643
19422 -42306 -150667 -233700 49564 -45624 -25422 51709 -435979 -128633 -75501 -229228 -250334
19411 -250334 -76198 -63169 -97080 81168 17548 64534 -110106 157006 55697 -128296 110054
19399 -106413 -255918 103975 41326 96164 42393 -16134 -327415 70783 65567 368934 -249243
19387 23425 -12726 -313023 -153850 222417 -157518 -282556 -325824 109246 -185413 -229338
19377 -229338 -43500 -193707 -133075 24129 -30162 267727 18967 -5042 -53701 -284896 12634
19365 293756 28874 -169253 -43443 -43405 -81443 -576349 -524415 -327545 -110382 -64850 -32149
19353 77170 81156 14461 -152063 208190 -292309 -106410 46174 125493 -42991 -149450 217093
19341B98817d6053b487C44377A7356a94365a0608m00378a21891O0485j67464h4500
19329b86909B1529J66317c5901B7124a17250a0376k11679A26823B6155J5068a59437
19317b21424a01907j52519a9846C8329a25504j83559i3648k1109m1406i692p6670
19306h6362I552i2613A11031E5093K04696e0517A62465a92404p1411j08991a34856
19294e8933j27000C99257a81588k11626A0643J60458c58072g3292C78928a03306
19283B43996d29730b5294A73898l1591b46500a07760C1916L2181j5322O2148J13932
19272B24855a23675A23042J28559a34353G6935b2693A81007A644J7965a4880j26508
19261a41388C4960O3453e5331j19037H5242K22995a65366L6052O3926I8634J22675
$$ plain form
19341 298817 -46053 -2487 344377 17356 -194365 -10608 -410986 -121891 -61406 -228870 -84500
19329 -286909 21529 187846 -35901 27124 -117250 -10376 -222055 126823 26155 41223 -159437
19317 -221424 -101907 -254426 -19846 38329 -125504 -309063 -93648 -114757 -156163 -9692 -86362
19306 -86362 9552 -92613 111031 55093 259789 -50517 162465 -192404 -263815 -372806 -134856
19294 -58933 -185933 399257 -181588 -393214 10643 171101 -358072 -73292 378928 -103306
19283 243996 -429730 -25294 173898 142307 -246500 -107760 31916 64097 48775 110923 224855
19272 224855 -123675 123042 251601 -134353 76935 -22693 181007 1644 19609 -14880 -141388
19261 -141388 34960 98413 -55331 -174368 85242 308237 -165366 -129314 -65388 98634 221309
19250B21309j2551h4874a8685l2223A46631G135M6081h4771q3210j8365B90607
19238b3853j15803B12117b65055B27164c40318a55237c7095o4636k8601C7755
19227A3343b9175j02558r088q5505d527C4645a49090A12954P7645b21360D1852
19215a46367E1559M0447d94295A15997q941i6912K5319k27733J21260A49073H087
19203b05228L7598K4406p0243K1586D9444f8905B77666d96764F8057b85473J30546
19192a54927m8589n1822J08073M2288e0937C01472a25122m934A21695a46415J5152
19181a31263N1383a196j48255n3552o3669q6210h1997p6179K4123B89587a75704
19169I3673Q2644d9809j2910j50227k6147d3935j66208a0092l6367J8804A29637
$$ plain form
19250 221309 208758 -84874 -18685 -50908 146631 7135 53216 -84771 -167981 -186346 290607
19238 -23853 -139656 212117 -265055 227164 -340318 -155237 -37095 -101731 -130332 37755
19227 13343 -29175 -131733 -140821 -226326 -4527 34645 -149090 112954 190599 -221360 41852
19215 -146367 51559 92006 -494295 115997 107056 -96912 -71593 -299326 -178066 149073 8087
19203 -205228 -167630 -143224 -213467 -191881 49444 -68905 277666 -496764 68057 -285473 -154927
19192 -154927 -203516 -255338 -147265 -104977 -50937 301472 -125122 -130056 121695 -146415 -131263
19181 -131263 -79880 -1196 -149451 -203003 -266672 -352882 -81997 -158176 -134053 289587 -175704
19169 93673 176317 -49809 -62719 -212946 -239093 -43935 -210143 -10092 -46459 -27655 129637
19157C49500d7317a0422p044D18253A8022f3004H6900C726c3056m16102J63280
19146b85878K0725e7226p1861G7345k5445a58106k50662J63863m9797A46578c45003
19134b00370r6136a01418A45766k4583f6581k10375B58899a81437n7593B4638
19123A81888F1931k8861K29384G177a24978n9529F0485J508i817k10888h9174
19111b46883G0476R7639J0190B869R2484i1131j84374B09401p9909J60156a02334
19099b99832g7616A42099m1944g8608h423A73819b65143A1807a08068q1643c3164
19087c78066f9465J1652m339k18142A06252J86929a52440k86772e9970F3514d0652
19075D528a09702M1782k89218D2766c22542N2027R8395P6211m0909p3499g0404
$$ plain form
19157 349500 -47317 -10422 -17466 418253 18022 -63004 86900 3726 -33056 -449158 -285878
19146 -285878 -265153 -57226 -129087 77345 51900 -158106 -408768 -244905 -294702 146578 -345003
19134 -200370 -296506 -101418 145766 121183 -66581 -276956 258899 -181437 -239030 24638
19123 181888 61931 33070 262454 7177 -124978 -184507 60485 61993 -9817 -220705 -89174
19111 -246883 70476 168115 178305 2869 95353 -91131 -275505 209401 129492 289648 -102334
19099 -299832 -77616 142099 100155 -78608 -8423 173819 -265143 11807 -108068 -189711 -33164
19087 -378066 -69465 -57813 -62152 -280294 106252 293181 -152440 -439212 -59970 63514 -40652
19075 4528 -109702 -67920 -357138 42766 -322542 -270515 -172120 -95909 -136818 -210317 -70404
19063a84049D2961h4880c8689a6932A93707a67296j0414A4525b80870J00581j0101
19052a90390M1435A25612R2997H0483b42677B62583a63884f2549B25441J729b10455
19040B86136I1367B7104b02452k3738E142b16134O3451A9435i7113B20309p4220
19029A46089o5998M2850a62596e8927k0224C6518j7275K11878d7208A51869k5674
19018A26195H916P4440O4370L1504D848J3662b15120D2375R2426a7099k35901
19007b53000a4352m3373A22992f7508a9508C8556a14744A29098c13804B215P7445
18996G9660a83019B5802b70506E1353B2401M8258b6555j07909A54299b70326B23580
18984a06184n1228B4606N6799J3901i1642j66025A39471l3111j2016A7203h5282
$$ plain form
19063 -184049 42961 -84880 -38689 -16932 193707 -167296 -177710 14525 -280870 -180289 -190390
19052 -190390 -148955 125612 218609 80483 -242677 262583 -163884 -62549 225441 227170 -210455
19040 286136 91367 27104 -202452 -226190 5142 -216134 -152683 19435 -97113 220309 146089
19029 146089 80091 122941 -162596 -58927 -79151 36518 19243 231121 -47208 151869 126195
19018 126195 8916 83356 147726 179230 4848 18510 -215120 42375 134801 -17099 -253000
19007 -253000 -14352 -57725 122992 -67508 -19508 38556 -114744 129098 -313804 2215 79660
18996 79660 -183019 25802 -270506 51353 22401 70659 -26555 -134464 154299 -270326 223580
18984 -106184 -157412 24606 81405 95306 -91642 -257667 139471 106360 94344 17203 -85282
18972h0321F7068a68583B63962A19915N3249a7717o1388j99141A08989K17215
18962C26204l4793a72581g2762o8248j94098a08378e2833B10823n9164d8979j1239
18951f0218G6535k8910a30414e585r1497k78093J75834j53293A30636a30241i734
18939d5704k10633A03540m9126e4209n6815l15643k13H5848b4184A17334c18835
18927c80839D1033A5426e15405c0506g517l1572j26856J8473A12373J03660a59677
18915C12634h3245A9623E036c09713J38546r3238f6703B30250f3413b4792a0681
18903A72388a49036c2480A78589a14899E3771a51918I2642R112b37763k6609A99181
18891f1182A09781a23631A2352Q0659j8818a09302m3603j68410n0486f514k2897
$$ plain form
18972 -80321 67068 -168583 263962 119915 173164 -17717 -79105 -278246 108989 326204
18962 326204 291411 -172581 -72762 -141010 -335108 -108378 -52833 210823 151659 -48979 -60218
18951 -60218 76535 47625 -130414 -5585 -97082 -375175 -199341 -352634 130636 -130241 -9734
18939 -45704 -256337 103540 54414 -54209 -111024 -426667 -426880 85848 -24184 117334 -318835
18927 -380839 41033 15426 -515405 -30506 -7517 -39089 -165945 -147472 112373 216033 -159677
18915 312634 -83245 19623 5036 -309713 -171167 -264405 -66703 230250 -63413 -24792 -10681
18903 172388 -149036 -32480 178589 -114899 53771 -151918 92642 101754 -237763 -264372 199181
18891 -61182 109781 -123631 12352 93011 74193 -109302 -152905 -321315 -371801 -6514 -29411
18880b9411o1335k03302P8952C71124B4015L39942i6833K235A2250N0678a00715
18868b92264G0848h4542j85882C50619g0359I0640O9983J53936g3167b3641j28675
18857a52316D5142b66104q266A9276a35328l6729N5804A1335a11969j84998A00078
18845a92821O3509m4080B34751c62808j26969a35485A4308d02425a86303N8980
18835a27323G2466c879I5083e0429C067b10271j99106J61466l9836A8894b7656
18823B05595H6250i2987B9114J57254J7550r8399a59132g4603j47689C8015a72528
18811f5509B9299H420a86463B18288J38603b35210R6075K037N6818L6177k3067
18800f7170n0034h886k38918R8438M9449a3267l32529A17773f9078A29958a83520
$$ plain form
18880 -29411 -90746 -294048 -215096 371124 24015 363957 -96833 -94598 12250 62928 -100715
18868 -292264 70848 -84542 -270424 350619 -70359 90640 160623 314559 -73167 -23641 -152316
18857 -152316 45142 -266104 -274370 19276 -135328 -172057 -116253 11335 -111969 -296967 100078
18845 -192821 -129312 -173392 234751 -362808 -489777 -135485 14308 -402425 -186303 -127323
18835 -127323 72466 -3879 95083 -50429 3067 -210271 -409377 -247911 -287747 18894 -27656
18823 205595 86250 -92987 29114 186368 203918 105519 -159132 -74603 -222292 38015 -172528
18811 -65509 29299 8420 -186463 218288 356891 -235210 -139135 -137098 -80280 -44103 -67170
18800 -67170 -117204 -8886 -247804 -149366 -99917 -13267 -345796 117773 -69078 129958 -183520
18788a49924I9026a63269G920a29198F6140J37017C2785Q8309E775K08493b3057
18776i986F4464c443j40187k78412h9134a6089D1788a04934l7142I0425i9293
18764b87991a31862N1515A26500i9315B29642I1322a49459f8072j46157k30832
18754d45061a6775C3263j3837b56894H0601c39256A10088f9162m05857A15712
18743A59861b33505A02139h996j52310A61110L652f2573j5929m6484j53377b1773
18731c2299k58659F7258a76383P8830j46813i7900k06732J52226e3644C8433e937
18719A61925a74212D2740f0505j57198K6174A16199M4465d962A48437E4452a21306
18707b13561J8980p5802J01763q6731h5533r8679j00529B8682J15884h154A95216
$$ plain form
18788 -149924 99026 -163269 7920 -129198 66140 203157 32785 121094 5775 214268 -23057
18776 -9986 64464 -3443 -143630 -422042 -89134 -16089 41788 -104934 -142076 90425 -99293
18764 -287991 -131862 -80347 126500 -99315 229642 91322 -149459 -68072 -214229 -445061
18754 -445061 -16775 33263 19426 -256894 80601 -339256 110088 -69162 -475019 115712
18743 159861 -233505 102139 -8996 -161306 161110 164762 -62573 -78502 -124986 -278363 -21773
18731 -32299 -290958 67258 -176383 -97553 -244366 -97900 -304632 -152406 -53644 38433 -5937
18719 161925 -174212 42740 -60505 -217703 -191529 116199 160664 -4962 148437 54452 -121306
18707 -213561 -194581 -270383 -168620 -255351 -85533 -184212 -284741 28682 144566 -8154 195216
18695b42135f8171j39511n4480B76729A37682e8851B1382a09666j64198C15754
18684h0747o718B5059a23611e7489i464E3163a10031P363L2467G1357a46586k9970
18672a76556b4479B24014G2241a09087B2934J68299I2958R6695J4D9720A669d3585
18659i2103a4100B444K59309B8230a51227e7514B23569b50146a06378K7409j19818
18648a98787A22674b05796A51583b13329B02453a63590M1072N1398a0688C39920
18637D3728R6427b00122E5243b28114a08633k66456I3897N1150a35068a9265B99381
18625a6036m7355G2800J63176H3122b1767q3937i524A43321f7342c0871C08665
18613a30426k38300f7475A51506b26469O8335l6581A08539h4941q7484E0588M6698
$$ plain form
18695 -242135 -68171 -207682 -262162 276729 137682 -58851 21382 -109666 -273864 315754
18684 -80747 -87465 25059 -123611 -57489 -9464 53163 -110031 -102668 -70201 71357 -146586 -176556
18672 -176556 -24479 224014 72241 -109087 22934 191233 92958 189653 189667 49720 1669 -43585
18659 -92103 -14100 2444 261753 28230 -151227 -57514 223569 -250146 -106378 -78969 -198787
18648 -198787 122674 -205796 151583 -213329 202453 -163590 -122518 -71120 -10688 339920
18637 43728 140155 -200122 55243 -228114 -108633 -375089 93897 145047 -135068 -19265 299381
18625 -16036 -63391 72800 235976 83122 -21767 -105704 -9524 143321 -67342 -30871 308665
18613 -130426 -368726 -67475 151506 -226469 -158134 -194715 108539 -84941 -172425 50588 97286
18602I7286a39186C4631b5329j13024K3907c339j49958R858j175j00095B72068
18590A44142F0671a33755A02535C823J75183b4114l38491a78048h4875B60305
18579f147A58648i0892B644a31383d1838o3701l29348f7424B0196b16240a7694
18567B69789e8205o2466A31867b5031j25481g3820A6135c78221B58995c29758
18556a73888C3256q496K93775H685a86443M5630M3603o3396B77907j31247n5531
18545I1129a33979d3880B90256o6274F4330B6616f5179n5197I9183h5493k67688
18534c53181J25651N7546I2155b12019j12154f3787K6237A63894a55330C2819
18523h4131j05764g8145j28689G2015b45554D9104b07540A65289G4204J28634
$$ plain form
18602 97286 -139186 34631 -25329 -138353 -114446 -3339 -153297 -143439 -144614 -244709 272068
18590 144142 60671 -133755 102535 3823 179006 -24114 -362605 -178048 -84875 260305
18579 -6147 158648 -90892 2644 -131383 -41838 -105539 -434887 -67424 20196 -216240 -17694
18567 269789 -58205 -120671 131867 -25031 -150512 -73820 16135 -378221 258995 -329758
18556 -173888 33256 24760 318535 8685 -186443 -140813 -97210 -160606 277907 146660 91129
18545 91129 -133979 -43880 290256 223982 64330 26616 -65179 -120376 99183 -85493 -353181
18534 -353181 -227530 -169984 92155 -212019 -324173 -63787 -37550 163894 -155330 32819
18523 -84131 -189895 -78145 -206834 72015 -245554 49104 -207540 165289 74204 202838
18513B02838K21542a79547G6885h7385l9076A77272C7979a20146l1176d5212G6834
18501c98341a92333A09078P0091a81255Q0161L1075r5444d8276j22865p8266E8108
18489A1304O0949G581a49814j23907H6361J04519R7707r1026e7758E8090a67232
18477b22616j42423j8344J70986N4516j3255h1646E0486a84126A13611A5722J7414
18466C3136a61579I8222J49803b93212R0626h2356k399p3523j62223B73798o0029
18455B13769E0209b90276B7811M2683K7577f8883A04751n803L03770b39770J00807
18444a38963q4632A23905E4278b25800F1648c3559I072g3187H6902Q8253b31507
18432b45809A30751d1720B12518G1612a2401j61591H6824B1384e8942I9547b52838
$$ plain form
18513 202838 424380 -179547 76885 -87385 -126461 177272 37979 -120146 -151322 -45212 76834
18501 -398341 -192333 109078 179169 -181255 -101094 -70019 -165463 -48276 -171141 -249407 58108
18489 11304 72253 7581 -149814 -273721 86361 190880 288587 197561 -57758 58090 -167232
18477 -222616 -365039 -383383 -212397 -157881 -171136 -81646 50486 -184126 113611 15722 33136
18466 33136 -161579 98222 248025 -293212 -202586 -82356 -84755 -158278 -320501 273798 213769
18455 213769 50209 -290276 27811 70494 98071 -68883 104751 98948 402718 -239770 -138963
18444 -138963 -223595 123905 54278 -225800 61648 -33559 9072 -73187 86902 175155 -231507
18432 -245809 130751 -41720 212518 71612 -12401 -173992 86824 21384 -58942 99547 -252838
18420C0116c21605a04871B58525a00763q6916C09032d9367A4885J49805B683Q47
18409C530K76865a45133d7905A3136a24192j76522J36923A63554b24936j95597
18399d20533A18232b59568J266R7253B57404F3166c2708A02420h8691A08993a57420
18387a90546r1790i6331D08622b48641E6655i53j07096d3550a2257j44836D8817
18375g5851D01379I057R875g2914j90180g3325A3942b29443a6025G0003h0001
18363a52788k590j56433a01186m1782b7647n2001r3319J5424A46293g1554A09084
18351H3181O9243C6238Q8127b64069A44924a49222c4857C44330C5607M738d4253
18339c04555C17480a39585B42594c5735A61237J82558a06030B79781j38328J7793
$$ plain form
18420 30116 -321605 -104871 258525 -100763 -187679 309032 -49367 14885 164690 2683 3530
18409 3530 280395 -145133 -47905 13136 -124192 -300714 -163791 163554 -224936 -420533
18399 -420533 118232 -259568 -258302 -161049 257404 63166 -32708 102420 -88691 108993 -157420
18387 -190546 -282336 -96331 408622 -248641 56655 -953 -108049 -43550 -12257 -157093 48817
18375 -75851 401379 9057 18932 -72914 -263094 -73325 13942 -229443 -16025 70003 -80001
18363 -152788 -155378 -311811 -101186 -142968 -27647 -79648 -172967 -157543 146293 -71554 109084
18351 83181 152424 36238 124365 -264069 144924 -149222 -34857 344330 35607 40345 -44253
18339 -304555 317480 -139585 242594 -35735 161237 343795 -106030 279781 141453 159246
18329A59246c05589l341M3028h6233A01787a55294P967b6663D4479B1180J35327
18318A56507a49383L4677D5069J19500a4585p3781n6192I7061a10051G3041J15598
18307A88639a12438G4238P7129J63509f7668m5983C0346J28085B9911N4306J33292
18296B17509i7746l91082a28281P537H0892e1902a8709l31864A53656a50961L8822
18285a12139B4983b08004r6542F9843O0862a43587L5245j05361f1126j91291P0480
18274a81937B1665d97228a43551k38845Q4782J46877O0527D8840K47108A21489
18263B3143M9995K24695a61068B9217J54755b8837j25864A62314A1288J4039a36307
18251E8056P7874B6721c56808I7218D4504i1291B11728b79283d3453B5595c1374
$$ plain form
18329 159246 -305589 -308930 -265902 -86233 101787 -155294 -147327 -26663 44479 21180 156507
18318 156507 -149383 -114706 45069 164569 -14585 -88366 -144558 97061 -110051 73041 188639
18307 188639 -112438 74238 151367 314876 -67668 -113651 30346 158431 29911 84217 217509
18296 217509 -97746 -488828 -128281 -120744 80892 -51902 -18709 -350573 153656 -150961 -112139
18285 -112139 24983 -208004 -304546 69843 130705 -143587 -108342 -213703 -61126 -252417 -181937
18274 -181937 21665 -497228 -143551 -382396 -297614 -150737 -90210 48840 295948 121489
18263 23143 73138 297833 -161068 29217 183972 -28837 -154701 162314 11288 25327 -136307
18251 58056 135930 26721 -356808 97218 44504 -91291 211728 -279283 -43453 25595 -31374
18239A31998b32830A38071K8274b67090Q6969D573J51038F6119J05736c07054
18228B34256a69108f8939D2918c38815a05967B6805J64477f5177K9087m2182p568
18217h5840g169k16637c3315l6347j9743j88357a15652m1871E1854k0654J68695
18206A99895b98091B60696F961c95031J25440f9196A6300a28159A52014c8175
18195I9925b4429E7988b51476d2892O025I0975a65311a0408k49139c1953k2783
18184e4736k3776k6402M5451j92106N1040D7959N8521K641c3829A34818M4319
18173A79137J1868a9676B93660i968j16990c7885D20971o8631e1453D7400b459
18161A28414E0811K9488e3805k99801L5756R4291l2439k0953A29971Q9487a57686
$$ plain form
18239 131998 -232830 138071 166345 -267090 -180121 4573 155611 66119 171855 -307054
18228 234256 -169108 -68939 42918 -338815 -105967 26805 191282 -65177 -36090 -78272 -85840
18217 -85840 -7169 -223806 -33315 -69662 -89405 -277762 -115652 -157523 51854 31200 199895
18206 199895 -298091 260696 6961 -395031 -269591 -69196 16300 -128159 152014 -38175
18195 99925 -24429 57988 -251476 -42892 -36867 90975 -165311 -10408 -259547 -31953 -54736
18184 -54736 -78512 -104914 -59463 -251569 -200529 47959 106480 109121 -33829 134818 179137
18173 179137 191005 -19676 293660 -9968 -126958 -37885 420971 352340 -51453 47400 -2459
18161 128414 50811 80299 -53805 -353606 -317850 -223559 -255998 -276951 129971 219458 -157686
18149C9730a09881C65909D7050K6201J34813n4573a72020f3106p0204r288C05274
18137D1163c6504C929M5771J33728g9821A27720Q3326A6496N1302c46847L6537
18126c10310b3391J1289E3675d24529J64748a1071I0533J28630I4462a43334O2372
18115h0962A55181A5519K7801i8010k14925a30985j57951b8113C06655J49022
18105D55677o1702a97647J0520j77029A7416a10222a4772j73050C09350d0014
18094b28364Q6845C0944b04455J3740j78216B15123d3322A33985o6965a52836
18083a1285m20271A50570b45626g6277I2602a3704k53090B43577H268c4058m21303
18072d55361a03729d222n3706o9197j07802c1941B19988a52791l2961A11872a42530
$$ plain form
18149 39730 -109881 365909 47050 73251 208064 153491 -172020 -63106 -133310 -142598 305274
18137 41163 -36504 3929 49700 183428 -79821 127720 211046 16496 67798 -346847 -310310
18126 -310310 -23391 -12102 53675 -424529 -259781 -11071 90533 219163 94462 -143334 -80962
18115 -80962 155181 15519 43320 -98010 -312935 -130985 -288936 -28113 306655 455677
18105 455677 393975 -197647 -187127 -364156 17416 -110222 -14772 -187822 309350 -40014
18094 -228364 -141519 30944 -204455 -190715 -368931 215123 -43322 133985 67020 -152836
18083 -11285 -431556 150570 -245626 -76277 92602 -13704 -266794 243577 8268 -34058 -455361
18072 -455361 -103729 -4222 -57928 -127125 -234927 -31941 219988 -152791 -185752 111872 -142530
18060a74560c7645k0695m3939j78798A12096l9623j0J00072J4010a34156O4346
18049f9810B50298a68595q6563B83116j12674o9596b19135M4250J508A55433f6635
18037b33447N8097d3351k07494i6923A36271a63673E4147J24868p4402m413a36069
18025C973f5280J2378n3283A19165O0205o9511b73599k66746B04143a06771I1899
18013c9027A65962c2067k83576B74019c13335a04406L6982M052b6664C986f5864
18001A54930a8861q682E3268b77670M3676g5972B78220a51614a1236k04886H613
17989b90086A3409L95292C4722b43282g9387D6938j6916g1560l37816A61768F002
17977c1443k18103B66279a16318B01584h2095o1085b0095G2469a50150n3611I2797
$$ plain form
18060 -174560 -37645 -58340 -102279 -281077 112096 72473 72463 172535 186545 -134156 -69810
18049 -69810 250298 -168595 -255158 283116 170442 100846 -219135 -174885 -173377 155433 -66635
18037 -233447 -175350 -43351 -250845 -96923 136271 -163673 54147 179015 104613 100200 -136069
18025 3973 -65280 -52902 -106185 119165 179370 109859 -273599 -540345 204143 -106771 91899
18013 -39027 165962 -32067 -315643 274019 -313335 -104406 -67424 -63372 -26664 3986 -65864
18001 154930 -18861 -27543 53268 -277670 -233994 -75972 278220 -151614 -11236 -216122 8613
17989 -290086 13409 408701 34722 -243282 -79387 46938 30022 -71560 -409376 161768 6002
17977 -31443 -249546 266279 -116318 201584 -82095 -143180 -20095 72469 -150150 -203761 92797
17965B26653a48408A47664b21969E9557L31654g7506j87472i1513j82816C1015
17954D7881j6445R6692k0255a02200G0617i9633F7844a60671b4659G9731a6256
17942H9157K02214d4854A30216J3808b16197B34176c61095A06489G387K2115R7272
17931A26774G443J15622a66700j42506A87274c9567I9012A1243K02969b3718A24504
17919A00256C2922a55080q7413O8625b5788j27215F0276b91676I8649a89107C3741
17907a50409a3525j67851A19767b66302i1740A26833a42668A18531f3133E6130
17896b74566A46457I162a47311l7270k28218D6359b04517h2473r9641k41245B1864
17884i2664F6498P5157D6918M3031P1785b8832A24746a30044c5758I8853d7874
$$ plain form
17965 226653 -148408 147664 -221969 59557 391211 -77506 -264978 -91513 -274329 31015
17954 47881 31436 128128 107873 -102200 70617 -99633 67844 -160671 -24659 79731 -16256
17942 89157 291371 -44854 130216 144024 -216197 234176 -361095 106489 7387 29502 126774
17931 126774 7443 123065 -166700 -309206 187274 -39567 99012 11243 214212 -23718 124504
17919 100256 32922 -155080 -242493 -173868 -25788 -153003 60276 -291676 98649 -189107 33741
17907 -150409 -13525 -181376 119767 -266302 -91740 126833 -142668 118531 -63133 56130
17896 -274566 146457 9162 -147311 -184581 -412799 46359 -204517 -82473 -182114 -423359 21864
17884 -92664 66498 141655 46918 89949 161734 -28832 124746 -130044 -35758 98853 -47874
17872C61816h0342J7226j36208j76930A3417a30692k4105A56553p3166a23491
17861C6785a97049h1A57975n2494a23033A41250D0920c3868A71922b07850I6177
17849b57453M4832D7121a1931C61204a40772H7990J7986J03722a83995F201a24191
17837a61729n596C74517G4899L58389i2058B51905A09318l7789K2591J4915c5602
17825A30555a13332B38496f9209A53540o4306b12926C7841Q6350J46457a17069
17814I203J00392K4246J69114b72902a1420k70812B46163j4239h5763K0511K0828
17803d4424a3366A93929o5187b875B18116E7040M924b83093g0324m3602q7211
17792b01137B36850c77172A22298a24903A9055J86864a99108A22571l7062C6133
$$ plain form
17872 361816 -80342 -63116 -199324 -376254 13417 -130692 -154797 156553 83387 -123491
17861 36785 -197049 -81 157975 105481 -123033 141250 40920 -33868 171922 -207850 96177
17849 -257453 -212621 47121 -11931 361204 -140772 87990 105976 209698 -183995 6201 -124191
17837 -161729 -167325 374517 74899 433288 -92058 251905 109318 71529 94120 109035 -35602
17825 130555 -113332 238496 -69209 153540 89234 -212926 37841 124191 270648 -117069
17814 9203 109595 133841 302955 -272902 -11420 -282232 246163 231924 -85763 -65252 -44424
17803 -44424 -13366 193929 128742 -2875 218116 57040 61964 -283093 -70324 -113926 -201137
17792 -201137 236850 -377172 122298 -124903 19055 205919 -199108 122571 85509 36133
17781h3543H0545b35302H8328j5808a28951e5186k11828j90747C5067P8885f3538
17769h7373A65962c01181a05823D7694P4259c1402q9745M5284q3885j80118J20670
17758b19196B32999A15251l9442D384R2719f9724A70907a1443E2894J84874e0804
17746H7110c1761G3902L9075R691c2107j33293F5006P3910a3384k06781G020a75867
17733h503A88483a3594B53558b54004P4404m9557k15734A2251J55044J68848d5896
17721A33043i5175l5179a0546B4354b37439A28515K742d1756l7052G8390k1077
17710E7313j7734a82473H9408K71613H6222a55130I4199f0598r9659a1691E3170
17698C74821G2582b80539B75445A02962M6611l5519b21758B38815I7241P6632
$$ plain form
17781 -83543 80545 -235302 88328 72520 -128951 -55186 -267014 -457761 35067 113952 -63538
17769 -87373 165962 -301181 -105823 47694 121953 -31402 -121147 -75863 -159748 -339866 -219196
17758 -219196 232999 115251 75809 4384 97103 -69724 170907 -11443 52894 237768 -50804
17746 87110 -31761 73902 112977 122668 -32107 -165400 65006 138916 -13384 -220165 7020 -175867
17733 -8503 188483 -13594 253558 -254004 -179600 -229157 -444891 12251 167295 336143 -45896
17721 133043 -95175 -130354 -10546 24354 -237439 128515 131257 -41756 -78808 78390 57313
17710 57313 39579 -182473 89408 361021 86222 -155130 94199 -60598 -160257 -11691 53170
17698 374821 72582 -280539 275445 102962 149573 114054 -221758 238815 97241 173873
17688A73873D3901g4220C29081a44765n0797C58215K178d5325q3502n1923e5892
17676H7420h1049I9397M3471b4578j39739e8671A00116J9047a01342D4843J9080
17665F3923Q2978A7440J46092f4737C1407B013a229l06586i203D3530J70893q2553
17653A31870F046L7901A5262E865a86842g684C37440h7935A82155b34627A44727
17641A72448h0836K8755A3236L9827J14668p4980a73417K0911B05117b3045B22065
17629C23033n1832p5758o6642a5078A63994e6719I1111K84513F2872L21402H6693
17617I4151J59772j24274a38990D3129R7807i8022A5735a5509A2042a7352A27331
17605c3802k54461f0598E2900f0697A00475j9347l5237K86801a65036j10274C8983
$$ plain form
17688 173873 43901 -74220 329081 -144765 -195562 358215 360393 -45325 -128827 -180750 -55892
17676 87420 -81049 99397 142868 -24578 -164317 -58671 100116 119163 -101342 44843 63923
17665 63923 146901 17440 163532 -64737 31407 2013 -1229 -307815 -9203 43530 214423 131870
17653 131870 6046 43947 15262 5865 -186842 -7684 337440 -87935 182155 -234627 144727
17641 172448 -80836 -52081 13236 53063 167731 92751 -173417 -152506 205117 -23045 222065
17629 323033 271201 195443 128801 -15078 163994 -56719 91111 375624 62872 384274 86693
17617 94151 253923 129649 -138990 43129 140936 -98022 15735 -15509 12042 -17352 127331
17605 -33802 -288263 -60598 52900 -60697 100475 81128 45891 332692 -165036 -275310 38983
17593b62998A62880F7865f9989C25253a25685j29161q0222c9415A29032J64581
17583B93613b43609B08046a09302g537B83185b29523G2107h4877b487B16431a34741
17571b91922h7848G3678A8934b40775C7555L81239a3580D1649a73754n0322I4769
17559I9347D3131b51624a10753D8291a00072d0014C5073f7655G2134C4829e5850
17547A3643c0645D4752d6711m8492E1176B1274K17892a81856C0367L30186I7041
17535A94380a13130H7744h3037i775j65407I9720k4965O5391i0769J3320I5568
17523B43796j17004Q8817E2106b2683p0058A08782J27224b4001j55871A74961
17512B39728d5191k43455n6445I1814C8728Q0208J00792o6155i8383B80098b1458
$$ plain form
17593 -262998 162880 67865 -69989 325253 -125685 -254846 -335068 -39415 129032 293613
17583 293613 -243609 208046 -109302 -7537 283185 -229523 72107 -84877 -2487 216431 -134741
17571 -291922 -87848 73678 18934 -240775 37555 418794 -13580 41649 -173754 -224076 94769
17559 99347 43131 -251624 -110753 48291 -100072 -40014 35073 -67655 72134 34829 -55850
17547 13643 -30645 44752 -46711 -95203 51176 21274 239166 -181856 30367 360553 97041
17535 194380 -113130 87744 -83037 -9775 -175182 99720 74755 140146 -90769 -77449 95568
17523 243796 126792 215609 52106 -22683 -92741 108782 236006 -24001 -179872 174961
17512 239728 -45191 -288646 -345091 91814 38728 118936 219728 153573 -98383 280098 -21458
17500F9281o011d31461F5663r071B2871P9284R4306p547L3202G8857A3580L86016
17488C99596A89663O1437H9545J86635a29364E02696A20756O2142f3356C77103
17477C84919F6736K01662H6132M1810N7916k9407J05010B2867L19425a07253D13651
17465H3525d5207J0533l95702B06255g8603b6038B87239K83038A4932e8152A51823
17453B71040j12306L8182e6428E9604K71668a4366C29676A28004J39993c8387
17442A77945J43759C6540J19955m8071J83909J96084F9257l002J97261k7473p3404
17431A62639R2252C0672M04996k04093h0273F8098O379b0259B0271J17355a73192
17419E26259j84044r2759J20302G8137R7054H3701k3483d4084A63392n9326K68171
$$ plain form
17500 69281 63270 -431461 65663 56592 22871 102155 196461 188914 222116 78857 13580 399596
17488 399596 189663 251100 89545 276180 -129364 502696 120756 182898 -63356 377103
17477 384919 66736 268398 86132 127942 185858 156451 261461 22867 342292 -107253 413651
17465 83525 -45207 -34674 -430376 206255 -78603 -26038 287239 570277 14932 -58152 151823
17453 271040 158734 196916 -56428 59604 331272 -14366 329676 128004 267997 -38387
17442 177945 321704 36540 156495 108424 292333 488417 69257 66255 263516 236043 162639
17431 162639 254891 30672 435668 231575 -80273 68098 74477 -20259 20271 137626 -173192
17419 526259 342215 249456 369758 78137 175191 83701 60218 -44084 163392 104066 372237
17408C72237A28959F844J09219L75628k02533J6647J55119A35932a16978B05962
17397h2455p717G8303g6198H659J75648N895K11029a42004a0867H6943j3244K58706
17385C32405p0946j26797N9877M894N0047N3547a0549n5470H9043d4118D60582
17373B14143F2621J08414G4715a14948A18624K40748A14598l5644K95746j12222
17363B62478c1680A42646k9834l7234N5309L77391b06737A47743L04801j10085
17353C42459F6383l0655K04091D9362K1863c24470F7578K40989a9055n9676B55012
17341A75587M1962f5842I5310J05220c338E2526J81448r0023J59620A41867P1010
17330B12877I6693K50115j49086Q7300C1857O9388k0087a09034d8820A87717M669
$$ plain form
17408 372237 128959 6844 116063 491691 289158 305805 460924 135932 -116978 205962
17397 -82455 -90172 78303 -76198 8659 184307 190202 401231 -142004 -10867 86943 73699 332405
17385 332405 261459 134662 194539 199433 249480 303027 -10549 -66019 89043 -44118 460582
17373 214143 62621 171035 74715 -114948 118624 359372 114598 78954 374700 262478
17363 262478 -31680 142646 112812 75578 130887 508278 -206737 147743 452544 342459
17353 342459 66383 35728 239819 49362 71225 -324470 67578 308567 -19055 -78731 255012
17341 175587 217549 -65842 95310 200530 -3338 52526 233974 143951 303571 141867 212877
17330 212877 96693 346808 197722 285022 31857 101245 81158 -109034 -48820 187717 192386
17319A92386D1456L48K06390H9362J602J53956j0488J87933d6985A5079O8289
17308H3368K06205a36287B11922I4468a57752d5043C05057C6378L44314F6863
17297B68706I9136L1741L3604a46569H5381C1201a5323m9550E0639J45504b1752
17285b5815A37052b65024B59707a00934B44319h4469B82176L3690A51839J39713
17275B91552a78865B3778J86452P9035c34459B89401o9694F1310a73821A8156
17264G4303J10371D2943L29938B8848J54522l7266R1320i1661F6801O6749K21532
17253C55082G7904K16085R550A09326B3932J41890J69698n9265q997p9107L4236
17242B22387K27216j13415J58849B47472A01110M1834d7281D50849P9428B2331
$$ plain form
17319 192386 41456 41804 248194 89362 90964 244920 234432 422365 -46985 15079 83368
17308 83368 289573 -136287 211922 94468 -157752 -45043 305057 36378 380692 66863
17297 268706 99136 130877 164481 -146569 85381 31201 -15323 -64873 50639 196143 -21752
17285 -25815 137052 -265024 259707 -100934 244319 -84469 282176 315866 151839 291552
17275 291552 -178865 23778 210230 289265 -334459 289401 219707 61310 -173821 18156
17264 74303 184674 42943 372881 28848 183370 146104 237424 -91661 66801 133550 355082
17253 355082 77904 293989 303539 109326 23932 165822 335520 276255 267258 188151 222387
17242 222387 449603 336188 495037 247472 101110 142944 -47281 450849 530277 22331
17231C06462F8406L13668j15032f0786H4779L23052D7090K3398K90172e0160I1788
17219E67820A83135L2953F0742M29923H4248K79254R434j52314m1997q5089L25180
17208D18716m5962I2924L30018B9349L2196J8540e2320F28321A06686m1624K8753
17197I3815A9196L86487j41274A19304M38561b731A72549p9828B9330K60636A00366
17185a28909A97837Q1102L2282J82859k36025B3337L09845o7413K6311n8876J42114
17174C75318k266A53337L752K7763K59327a3212j5546E63096A585N00151j87033
17163C14703a42561H1666J12288M33771B65170Q3406A56056h2030A11168K04866
17153C16034a6589B00511N5921O0818D358K0005M18908A31569b13477B48223A0482
$$ plain form
17231 306462 68406 382074 267042 -60786 84779 407831 47090 70488 360660 -50160 91788
17219 567820 183135 216088 60742 490665 84248 363502 372936 220622 178625 93536 418716
17208 418716 372754 92924 422942 29349 61545 80085 -52320 628321 106686 65062 93815
17197 93815 19196 405683 264409 119304 557865 -2731 172549 92721 29330 289966 100366
17185 -128909 197837 278939 311221 494080 258055 23337 333182 265769 292080 233204 375318
17174 375318 373052 153337 157089 184852 444179 -13212 -28758 563096 1585 501736 314703
17163 314703 -142561 81666 193954 627725 265170 348576 156056 -82030 111168 316034
17153 316034 -16589 200511 256432 317250 4358 24363 443271 131569 -213477 248223 10482
17141B49966J5710J38982j45636O0809J39427A83981P61k2113M53741A20965M98626
17130F19591B90480L15962E737J88235J05944J96129j15856K87191k18201n7720
17120C91459J2501j64910o4902J58404a82344D65810A21844M51265d9473C28492
17109B65998J17070r4268L15015k68853I9725L41574k04323d7765B97537M5749
17099C43286j31409K60779n9185A78090j1215K69693Q7962j54766o2925A22233
17088C30525q5233L93543A83269K13547j65474P1416A32447J74550j22427J69162
17078C53732n7567J42503j34q4227o8130Q1181p9947m6087N5415O322o3130K4510
17066B64441j3661J76761p9025O605J94929k22965O1594r8024J51880J31696B67286
$$ plain form
17141 249966 265676 404658 259022 319831 459258 183981 184742 162629 616370 120965 619591
17130 619591 290480 606442 5737 193972 299916 496045 380189 667380 449179 391459
17120 391459 403960 239050 174148 332552 -182344 465810 121844 573109 -49473 328492
17109 265998 383068 288800 603815 334962 99725 441299 236976 -47765 297537 343286
17099 343286 211877 472656 413471 178090 166875 436568 524530 369764 306839 122233
17088 330525 245292 638835 183269 396816 231342 302758 132447 306997 184570 353732
17078 353732 296165 438668 438534 354307 286177 367358 287411 241324 296739 303061 239931 264441
17066 264441 250780 427541 348516 355121 550050 327085 388679 290655 442535 574231 267286
17054E72096B64837d9610I3906K34146O7919J7030F5676M43329j18704N6113A93040
17042G02659B50878J38100O0192J34554j47022J6684j9099J72541j87981k1335
17032C97512N1039j48359J83463k29084J09711n0203J70879M4404j9446r4543
17022D15373q288j25542J28505n4536K75001R034k9229k96326K93846j27478p6476
17011D03884k7893J78159B37442J66998J36314O1086K48388l45929j02304R3557
17001D95552L46691B28490K54062l1820K37924L9617k57597O8627N2311k39886
16991C51728j06308N81475j80172L0083k44881J27414J66242K31674k19442N5539
16981G93352k86624K0812K09797j00737K6270j85667M12789k16960N15J32583
$$ plain form
17054 572096 264837 -49610 93906 328052 395971 413001 65676 509005 390301 446414 193040
17042 702659 250878 388978 449170 583724 436702 453386 434287 606828 418847 397512
17032 397512 448551 300192 483655 254571 364282 314079 484958 529362 509916 415373
17022 415373 407085 281543 410048 355512 630513 639547 610318 313992 607838 480360 403884
17011 403884 375991 554150 237442 404440 540754 601840 850228 504299 401995 495552
17001 495552 842243 228490 482552 450732 688656 728273 470676 539303 591614 351728
16991 351728 245420 826895 646723 676806 431925 559339 725581 957255 737813 793352
16981 793352 506728 527540 737337 636600 662870 477203 889992 673032 673547 806130
16971H06130j89780M15638m89125j39751P8982M00371j83251k88649M16635n8119
16961G69081j30447P6045L78080m10008P4139k55437K11468L1407k05918K95188
16951H33598r4408M5987M93426m10191m16764K33966K38027k42034M67180m94131
16941F54656M79512E50981K49831R6887m5616K3369j7051N6658j11543K13334
16931A016850l95179K50377J73873j51789o0377M49377j31365k5846k9266j36777
16921I59878J34499j25731P3029J06952m4466J87616n31775L54008J04245j91024
16911A027231L5281J57192K40530o22296L5236K99240M813L52964j38480k08226
16901A183485M01871m58713k08630M73527r1783J33572P9361k59728L41272k40873
$$ plain form
16971 806130 616350 1031988 542863 403112 482094 882465 699214 410565 827200 769081
16961 769081 638634 714679 1092759 682751 756890 501453 712921 744328 538410 833598
16951 833598 739190 785177 1278603 868412 451648 685614 923641 681607 1148787 654656
16941 654656 1134168 550981 800812 897699 852083 875452 858401 915059 803516 1016850
16931 1016850 621671 872048 1045921 894132 833755 1283132 1151767 1125921 1096655 959878
16921 959878 1094377 968646 1041675 1148627 1104161 1291777 760002 1114010 1218255 1027231
16911 1027231 1062512 1219704 1460234 837938 873174 1172414 1177227 1530191 1391711 1183485
16901 1183485 1585356 1126643 918013 1391540 1299757 1433329 1512690 1252962 1594234 1353361
16891A353361K14314k36675K08030k43226L49044l75460M03262K75932n44581
16882A404001J69611J59186q8959L10816k74934J08026j35231P8633K4272Q7376
16872A842797k06337J54929k74113K24990R1419j40978J46953N9419j00961K81269
16862B079387J71044n7853k11759L58797l05874J11022R2996J11192k30847j18489
16852A999616P555M90194m45466M79715n9677j33596K91745j07099N1231m3459
16842B530759N1791K91277k18675J25159j97287L61946L81112n82111L58574l25693
16832B776852N76169q188j29973J57438J11796n42328L72976J44610K20907n6746
16822C623513k0335P6842j89895L77912J44025J37481j15701J22819k83589K75386
$$ plain form
16891 1353361 1567675 1331000 1539030 1295804 1644848 1269388 1672650 1948582 1404001
16882 1404001 1573612 1732798 1643839 1954655 1679721 1787747 1652516 1731149 1755421 1842797
16872 1842797 1636460 1791389 1517276 1742266 1833685 1692707 1839660 1899079 1798118 2079387
16862 2079387 2250431 2192578 1980819 2339616 2033742 2144764 2237760 2348952 2118105 1999616
16852 1999616 2007171 2497365 2051899 2531614 2471937 2338341 2630086 2522987 2574218 2530759
16842 2530759 2582550 2873827 2655152 2780311 2583024 2944970 3326082 2743971 3102545 2776852
16832 2776852 3353021 3344833 3214860 3372298 3484094 2941766 3314742 3459352 3680259 3623513
16822 3623513 3603178 3680020 3490125 3868037 4012062 4149543 4033842 4156661 3873072 4148458
16812D148458K95635k39529L58335N8690N33978p63884P09198l6271k565K51430
16802E313475j56741N08071M485K96796l61850L21547j11076L00762m9614O44202
16792F710057j89271M22807J80142o8487K41728j35099N52865o061K80476J61400
16782H150557N15539J423L29225L73521Q7407R1053L27130M02217K55470J14085
16772A0647627N02382L47924L12847L95813L16598N13907M72200J41404L26400
16763A3977102L25946N95120M67154Q07510L67746N93167O91299M56944J149279
16754A9431267O67845N77053R13669Q25940P12481J150126R05444Q14370J582201
16745B7580396P99106J177135J576560J453765J601398J470748J561362J999414
$$ plain form
16812 4148458 4444093 4204564 4562899 4621589 5155567 4391683 5100881 5064610 5062045 5313475
16802 5313475 5156734 5664805 5669290 5966086 5604236 5925783 5814707 6115469 6065855 6710057
16792 6710057 6520786 6943593 7123735 7055248 7296976 7161877 7714742 7708681 7989157 8150557
16782 8150557 8666096 8667519 8996744 9370265 9457672 9548725 9875855 10278072 10533542 10647627
16772 10647627 11150009 11497933 11810780 12206593 12523191 13037098 13509298 13650702 13977102
16763 13977102 14303048 14898168 15365322 16172832 16540578 17133745 17825044 18281988 19431267
16754 19431267 20099112 20676165 21589834 22415774 23128255 24278381 25183825 25998195 27580396
16745 27580396 28379502 29556637 31133197 32586962 34188360 35659108 37220470 39219884
16737C9219884J968360J540342K476424K471114K456094K904992K781895K953081
16729E8772186L678865L933104L747671M145313M645813M612720N309788N881947
16721I4727407N810314O079495P036086P178929O907609P971090Q368041Q075724
16713A52154695Q011958Q369489Q558769P763109P567449O339800N817817M530584
16705B09113670L724039J805442J116810q76568k412375l636377m880983n800810
16697A98152848o534193p581184p752824q249824q112048q776219p762101p999953
16689A35384502p558542p839924o806768o772781o327203n835963n539844n535067
16681H3168410m994213m460051m241979m125543l598524l589715l220030k905238
$$ plain form
16737 39219884 41188244 42728586 45205010 47676124 50132218 53037210 55819105 58772186
16729 58772186 62451051 66384155 70131826 74277139 78922952 83535672 88845460 94727407
16721 94727407 100537721 106617216 113653302 120832231 127739840 135710930 144078971 152154695
16713 152154695 160166653 168536142 177094911 184858020 192425469 198765269 204583086 209113670
16705 209113670 212837709 214643151 215759961 214883393 212471018 208834641 203953658 198152848
16697 198152848 191618655 184037471 176284647 168034823 159922775 151146556 143384455 135384502
16689 135384502 127825960 119986036 113179268 106406487 100079284 94243321 88703477 83168410
16681 83168410 78174197 73714146 69472167 65346624 61748100 58158385 54938355 52033117
16673E2033117k603933k372440k952289k164107j915024j740818k030252j515106
16665C4739148j745613j590756j256258j334388j348301j045209j195287j030471
16657B4192865j139119o29397j262288k99730q65840r26118p40452q42648l97616
16648A7089657n94532n51455p10833l87199j33863r20864j14895r98088k70875
16639A2407053k99157k9316n76143o94877j94869R026n77923m6422j64362p50461
16629I082549p2590j42844m20002l14307j70293j14598Q7001m34234L46233p61245
16619G085670q8913p5589j47144k75026j1307m25489N7224j69526l83359L66685
16609E933226m43996j18385l42581K17124k11260j08188k57012J51548k89587
$$ plain form
16673 52033117 49429184 47056744 44104455 41940348 40025324 38284506 36254254 34739148
16665 34739148 32993535 31402779 30146521 28812133 27463832 26418623 25223336 24192865
16657 24192865 23053746 22424349 21162061 20862331 19996491 19070373 18329921 17487273 17089657
16648 17089657 16495125 15943670 15232837 14845638 14711775 13790911 13676016 12677928 12407053
16639 12407053 12107896 12078580 11502437 10807560 10612691 10621717 10043794 9997372 9833010 9082549
16629 9082549 9009959 8867115 8447113 8132806 7962513 7847915 7934916 7500682 7846915 7085670
16619 7085670 6996757 6921168 6774024 6498998 6487691 6062202 6119426 5949900 5566541 5933226
16609 5933226 5489230 5370845 5028264 5245388 5034128 4925940 4668928 4820476 4530889
16600D530889J80053m98334R1408m96571J25213K62368m98119L66321m73082J81589
16590C771735k03550O5060p0878m51363K005J71562q4809O0031k62211R2361m877
16579C085066j24195N3508j63651l66067O9845j75981J33311O3608j34362M3724
16569B484806j01370n5496k00686L80443j68484k31643J26079o6930J28022o6744
16559B227997k36743j522J2387P1806l388N4809k68783j33333J30642l0231j35743
16548A687898k44715K27687L2950K2946k96455M49392n00929N2285L85032m58762
16538A357329j36109J30607N69173l74626j98463R4661j24435K20826J83685m28822
16528A293826J39416L20119n62659j81671J23606K2331j35019q0989K47253J77569
$$ plain form
16600 4530889 4710942 4212608 4304016 3807445 3932658 4195026 3696907 4063228 3590146 3771735
16590 3771735 3568185 3633245 3562367 3111004 3113009 3284571 3199762 3259793 2997582 3089943 3085066
16579 3085066 2960871 3014379 2850728 2484661 2554506 2378525 2511836 2575444 2441082 2484806
16569 2484806 2383436 2327940 2127254 2507697 2339213 2107570 2233649 2166719 2294741 2227997
16559 2227997 1991254 1989732 2002119 2073925 2070537 2125346 1856563 1723230 1853872 1823641 1687898
16548 1687898 1443183 1670870 1703820 1726766 1430311 1879703 1378774 1431059 1816091 1357329
16538 1357329 1221220 1351827 1921000 1546374 1347911 1442572 1318137 1538963 1722648 1293826
16528 1293826 1433242 1753361 1190702 1009031 1132637 1154968 1019949 938960 1186213 1363782
16518A363782k72118P7266j54131K14764k27688k4032N6485j10908J90091j08143
16508A005368k01588J72139L6101j9399j62117O4771J00900M736j24818j04732
16498G71361J14M15937k58270k4010k32226M89483m4864l16066K13264j12501
16488I02222l3739k09811K60034k16754N1537j4887K55092C76775J26842m5671
16478D57946R4284J21072L50114j52152l9906K8909j25937J2409Q8543K70507
16468A105789m48447Q7467j87546M19494l04096j27417J98052P47k19661R5974
16458F20356O4694C29994J60117J06879j28412M1661F720L86291K00787p0116
16448E23682L61370j63919j25194J46873j01598N5573j81306J40409l03572J35312
$$ plain form
16518 1363782 1091664 1168930 1014799 1229563 1001875 977843 1034328 923420 1113511 1005368
16508 1005368 803780 975919 1012020 992621 830504 895275 996175 1000911 876093 771361
16498 771361 771475 1187412 929142 905132 672906 1162389 1117525 801459 1014723 902222
16488 902222 868483 658672 918706 701952 753489 738602 993694 376775 503617 457946
16478 457946 552230 673302 1023416 871264 831358 860267 734330 746739 835282 1105789
16468 1105789 657342 744809 557263 976757 672661 545244 743296 744043 524382 620356
16458 620356 685050 329994 490111 596990 468578 510239 6720 393011 593798 523682
16448 523682 885052 721133 595939 742812 641214 696787 515481 655890 352318 487630
16438D87630B39449r6649M74969L03300D32242r2129Q2666K30305J6894j74561
16428D95417L50893Q88F9846M6655L46780N9276j61630q235j17671j05746J0254
16417A39529M21152k56776K05839j06136r1004k906J47094j17793J91600k56060
16407B74539K76241J05617J33325B20771J90637j75968L50521k74657M7670J72623
16397E31597J76314B23691L81777k48462K39219C6967J03199J05751J68352n5125
16387C59144L2040M8097j8912M5462r0397m1502K44474k17337K76399k45448J16084
16376E08104A58988J47094K1660K64665A02087J75707A19960L65762j63281j38802
16366A83639K46684K37471B83339O2702q8613j04037J34549j16636k3617K03215
$$ plain form
16438 487630 239449 142800 617769 921069 432242 340113 422779 653084 669978 495417
16428 495417 846310 847198 69846 116501 463281 522557 360927 352692 235021 129275 139529
16417 139529 560681 303905 509744 403608 312604 309698 456792 338999 530599 274539
16407 274539 550780 656397 789722 220771 411408 235440 585961 311304 358974 531597
16397 531597 707911 223691 605468 357006 596225 36967 140166 245917 414269 359144
16387 359144 391184 439281 420369 465831 375434 333932 578406 361069 637468 392020 508104
16376 508104 158988 306082 327742 592407 102087 277794 119960 485722 322441 183639
16366 183639 430323 667794 283339 346041 257428 153391 287940 171304 147687 350902
16356C50902n7725o0964k9909J55976K02517q6652K6647j37984I1517K27292j11792
16345B07017J29889A22826J96339J64512c864F67838k67168A43570j4135L57740
16335D87175r2760p1811l9785M50773B46620J37235j65349J05095K50189A0669
16324B84103H4578N95039B81308J05438B2683N96938I2106e9928B31526J04534
16314C36060P6564n5062a80229B52769k7294K40302B21709J77016p4947o8409
16304B55369K31989A14961J58786k3891a76097C48801K05580k07651r6420M8035
16294B98345K18923k9334k03835A21382J91529A30628l6774K69827P9466A147
16283B51859J24328a30893C60468o8749L82339B55186p0251N9294A21143L72564
$$ plain form
16356 350902 293177 232213 202304 358280 560797 474145 500792 362808 91517 318809 207017
16345 207017 336906 122826 319165 483677 -3864 667838 400670 143570 129435 487175
16335 487175 394415 322604 282819 733592 246620 383855 218506 323601 573790 10669
16324 284103 84578 679617 281308 386746 22683 619621 92106 -59928 231526 336060
16314 336060 412624 357562 -180229 252769 225475 465777 221709 398725 323778 255369
16304 255369 487358 114961 273747 249856 -176097 348801 554381 346730 250310 298345
16294 298345 517268 487934 284099 121382 312911 130628 93854 363681 443147 1147
16283 251859 376187 -130893 360468 291719 674058 255186 184935 244229 121143 493707
16273D93707A14739J53648J71125K62541C01705K5911j21833J53137A47814D9607
16262I7822A1725c1998B10565N9460j01011G7220N5899a34270A32888j092N2567
16251A84363k4179M75827j34762r3833J50529j68910A55869b3666m7401C53947
16240A84143K3068J9519L69785B1335P3409K76996a2112A35640D6481L27086A1367
16228B55716A20244R9574r7298M4421K61440A28619J52531A05327O8625M1652
16218B15604p5122K84653H185K18437A02840e7102D65753E6331O6646J18504J48936
16207C90417j42651A13722J98314j53439J24826J4838a3339B68556E6345L15897
16197C72242a49908j54435B84676C5443K26515P2232B4858J37764L935a4978A53837
$$ plain form
16273 493707 114739 268387 439512 702053 301705 327616 205783 358920 147814 49607
16262 97822 11725 -31998 210565 270025 169014 77220 133119 -134270 132888 131796 184363
16251 184363 160184 636011 501249 407416 557945 389035 155869 -23666 -71067 353947
16240 184143 207211 226730 596515 21335 94744 371740 -12112 135640 46481 373567 11367
16228 255716 120244 219818 122520 166941 428381 128619 281150 105327 173952 215604
16218 215604 140482 425135 8185 226622 102840 -57102 465753 56331 122977 241481 390417
16207 390417 247766 113722 312036 158597 283423 298261 -13339 268556 56345 372242
16197 372242 -149908 -304343 284676 35443 261958 334190 24858 162622 166557 -14978 153837
16185B19928r8889J56039o6631r6368K71713c9487C91400A25196K35904j9689
16175C41411A26013f07j9043A90605J17080k7683a72683A5073J64475b198j58929
16164a61127D46195a1046j07599B58385g003C01357L6328o9046m2732J40643h5745
16152a48566E7355K37838a66772B57003a0452j28120A81872K18714j76363j921
16142B22302D3109a06659B30475g2127D3219b11828A58482a9974l29085c9865
16131e0826d191H2716l2132a12807C31940e5805A76641a47151A24331K8489k0155
16120A32665d4997C95769A96415d6603a2770j3612k82754F5714J33908b66264
16109D75217k13038A23218A8990K9205J22297q115n6707a64880C2492J98836K4725
$$ plain form
16185 219928 121039 277078 210447 114079 385792 -39487 391400 125196 361100 341411
16175 341411 126013 -607 -19650 190605 307685 280002 -172683 15073 179548 -2198 -161127
16164 -161127 446195 -11046 -118645 258385 -7003 301357 337685 268639 225907 366550 -85745
16152 -148566 57355 295193 -166772 257003 -10452 -138572 181872 400586 224223 222302
16142 222302 43109 -106659 230475 -72127 43219 -211828 158482 -19974 -349059 -39865
16131 -50826 -4191 82716 50584 -112807 331940 -55805 176641 -147151 124331 152820 132665
16120 132665 -44997 395769 196415 -46603 -12770 -26382 -309136 65714 199622 -266264
16109 475217 262179 123218 18990 48195 170492 162377 105670 -164880 32492 231328 256053
16098B56053D0998a09211m5751I3960j2350g3517p7709M8847A92454a41291o6522
16087b07813b1212C17836j03576J08007a75656A51653P5069b5059j11441I8130
16076a48563E1438J25375m620i7836M5462A17251J85831m5696b96439g4540a5363
16064c68378A6011J4953J6740M8333c75526I4328l677c1168h240j59216d9449
16052d2014A99777d2927b0897C0880b08639K3161N0849C451a3820A33774E6663
16040b23638A14343a02637j15206B165J69733H1017L652a00065C47722c12211
16029B8679c37349A70187m3579i8796d6911E3721f4468B40067b91602A47565J9895
16018A67460k2723a22216D478K83332I3390Q3646b30381R792Q3953L6087p1628
$$ plain form
16098 256053 40998 -109211 -154962 93960 81610 -73517 -151226 -102379 192454 -141291 -207813
16087 -207813 -21212 317836 214260 322267 -175656 151653 226722 -25059 -136500 98130
16076 -148563 51438 176813 172193 -97836 -52374 117251 303082 257386 -296439 -74540 -15363
16064 -368378 16011 30964 47704 96037 -375526 94328 90651 -31168 -8240 -167456 -49449
16052 -42014 199777 -42927 -20897 30880 -208639 -185478 -134629 3451 -13820 133774 56663
16040 -223638 114343 -102637 -217843 2165 171898 81017 84669 -100065 347722 -312211
16029 28679 -337349 170187 126608 -98796 -46911 53721 -64468 240067 -291602 147565 167460
16018 167460 144737 -122216 4478 287810 93390 177036 -230381 -220589 -136636 -100549 -172177
16007a72177m5209i2580k44821B54318H1443A4237b51061M3318E0586O1670D8664
15995e1091A84161c04203E8982d44876a8742k37706J14139C78697H4766b4581
15984A62840e3421A61219C9305c0540I2902h8679j97295J01879j35361a00409
15973c1334G1673b09094A20544f098B88748r1947a69954B05087C1408M0760a10110
15961h6556L2049p2052l6093N1334H0994a1187k58098o9688A18889O4835l4369
15950A49355K19935b60881D9156b8162l24017h5210l38010A04887J66845e2544
15939a74135a1021j11475e1989m7172j60710g9075j07310A6465e2993j21617p7086
15928b51696c7304C26088b50355B21991a28754q7043p6886A3436B283a7570A62629
$$ plain form
16007 -172177 -217386 -92580 -337401 254318 81443 14237 -251061 -207743 50586 112256 48664
15995 -51091 184161 -304203 58982 -444876 -18742 -256448 -142309 378697 84766 -24581
15984 162840 -53421 161219 39305 -30540 92902 -88679 -285974 -184095 -319456 -100409
15973 -31334 71673 -209094 120544 -6098 288748 196801 -169954 205087 31408 72168 -110110
15961 -86556 -54507 -126559 -162652 -111318 80994 -11187 -269285 -338973 118889 183724 149355
15950 149355 369290 -260881 49156 -28162 -352179 -85210 -423220 104887 271732 -52544
15939 -174135 -11021 -122496 -51989 -99161 -259871 -79075 -186385 16465 -52993 -174610 -251696
15928 -251696 -37304 326088 -250355 221991 -128754 -215797 -292683 13436 2283 -17570 162629
15916A0137e650C22216A45304a17095G1027c48670a39617f0707j35095h8791j21815
15905b10606H9733J3200O5199e0997j89414A59214b8023j02812d6476k48466g8530
15893a57547A3328h0861c5046l51222G1809f9625H9217D4302a68953p2599A29484
15881h5108G1251a09880k00123g9904I9952a14456k43091a9926A15717L665b95939
15869F1526b89649E4987c28053a40297k9198o4594n1046i2558r9860C16233m4103
15858B72130h6572j3069m0142A07788K11004f7369m14202f078B14711K6240g2525
15846e4391E5320K0749r897b89365H1868a04689j57250g6553n4254j53758i0724
15834a84531j58345b6957k37174B87390b8500j78598h9549j24097A10362b64807
$$ plain form
15916 10137 -5650 322216 145304 -117095 71027 -348670 -139617 -60707 -195802 -88791 -210606
15905 -210606 89733 102933 168132 -50997 -240411 159214 -28023 -130835 -46476 -294942 -78530
15893 -157547 13328 -80861 -35046 -386268 71809 -69625 89217 44302 -168953 -241552 129484
15881 -85108 71251 -109880 -310003 -79904 99952 -114456 -357547 -19926 115717 119382 -295939
15869 61526 -289649 54987 -328053 -140297 -169495 -234089 -285135 -92558 -192418 316233 272130
15858 272130 -86572 -99641 -139783 107788 318792 -67369 -481571 -6078 214711 240951 -72525
15846 -54391 55320 76069 66172 -289365 81868 -104689 -261939 -76553 -130807 -284565 -90724
15834 -184531 -342876 -26957 -264131 287390 -28500 -207098 -89549 -213646 110362 -264807
15823F6956e2926k5612a6210m4557C2487f8631K6208D1828c0497a3013k24730
15812b37743d9445E11788j87723j01388E8584h7078c0034n0188K9015J990j21728
15801a70945M1026L1663o2062l8378D9213K4762h9943E03992b92682A80103A4955
15789b52388A87991H1979B3619J73716a63539H7590a49302e8241A399a2413j85662
15778a98075f9114j14710C97442A5557J504a50920e8447k51501J28713A60877
15767B4949b00727A49292b21l8975J0888j36011B25056D590a98676m2217M2149
15756a98744K7286j4753j0254H9833a2241j36073e2271j94649E2087b18844C47821
15744c5335p5444A8866Q2835C6777M5780L32087e7800P944B25902a12603B43402
$$ plain form
15823 66956 -52926 -78538 -16210 -60767 32487 -68631 -42423 41828 -30497 -13013 -237743
15812 -237743 -49445 511788 324065 222677 58584 -87078 -30034 -80222 -51207 -49217 -170945
15801 -170945 -129919 -98256 -160318 -198696 49213 73975 -89943 503992 -292682 180103 14955
15789 -252388 187991 81979 23619 197335 -163539 87590 -149302 -58241 1399 -12413 -198075
15778 -198075 -69114 -183824 397442 15557 17061 -150920 -58447 -309948 -181235 160877
15767 24949 -200727 149292 -221 -39196 -28308 -164319 225056 4590 -198676 -240893 -198744
15756 -198744 -171458 -186211 -196465 89833 -12241 -148314 -52271 -246920 52087 -218844 347821
15744 -35335 -110779 18866 101701 36777 82557 414644 -57800 -49856 225902 -112603 243402
15732i8712n13j5653A13539B5198a70111g9568B42407g5586h672m74540f2246
15720B85790b74178J26573m7743a2113C8602I607P5597a38430j86402A00948a48556
15708c28973A81369c17011B77461b01840I8761L1021K00924b6329j27222j12123
15698b65674A86613b53979e0450p1338o6540j85231d7351A2519g7369j75701G537
15686h9063C4467a82295k28778J53517B36132H5820e426B33726B4278h9743l87768
15675d77511K21453A64994b6541q1371G6110N366N4457j1171g4504a0105B77618
15663e102j52298j90871B42558a05037j17443A59532a7129k2932j17742n3643
15653b11446i2582j7492l1383o5874e6830n4809A44527a4679l21819a57862b2037
$$ plain form
15732 -98712 -99225 -114878 113539 25198 -170111 -79568 242407 -75586 -8672 -483212 -62246
15720 285790 -274178 -147605 -195348 -12113 38602 9607 85204 -138430 -324832 100948 -148556
15708 -328973 181369 -317011 277461 -201840 98761 129782 330706 -26329 -153551 -265674
15698 -265674 186613 -253979 -50450 -121788 -188328 -373559 -47351 12519 -77369 -253070 7537
15686 -89063 34467 -182295 -411073 -257556 236132 85820 -5426 233726 24278 -89743 -477511
15675 -477511 -256058 164994 -26541 -107912 76110 81476 135933 124762 -74504 -10105 277618
15663 -5102 -157400 -348271 242558 -105037 -222480 159532 -17129 -40061 -157803 -211446
15653 -211446 -92582 -110074 -141457 -207331 -56830 -111639 144527 -14679 -336498 -157862 -22037
15641a2836j55292k715E0169d3859j86051H5619a09282L9290o6435M4072E73a31227
15628a29458O1174n6290q1692r7033R0663R1857D3343A4232d7351I066a15007
15616a33508C1711J17737e3931B29959b09865R4759J0809C70104g3805J9398j24033
15605a78440f6938E0314A4041O0563c1292r8906A03690a12118F7007m166O6344
15594A29185a69690n4228Q0138d899B48964P3877a47216C4050Q9939P4025b67954
15582I8838a00759F6439K8808b8819C48374a31438b0847A49886d57641J52616
15572c05025A05803a55860A15761b7384A51260b14616c8788H9092O3997b47482
15561a06656A23097f3228m0055n4738A8359b11312a4814A92690R891b77196D5178
$$ plain form
15641 -12836 -168128 -170843 50169 -43859 -229910 85619 -109282 -69992 -136427 -92355 573 -131227
15628 -129458 -68284 -124574 -206266 -303299 -212636 -120779 43343 14232 -47351 9066 -115007
15616 -133508 31711 149448 -53931 229959 -209865 -115106 -104297 370104 -73805 -54407 -178440
15605 -178440 -66938 50314 14041 74604 -31292 -130198 103690 -112118 67007 62841 129185
15594 129185 -169690 -223918 -143780 -4899 248964 322841 -147216 34050 123989 198014 -267954
15582 98838 -100759 66439 95247 -28819 348374 -131438 -20847 149886 -457641 -305025
15572 -305025 105803 -155860 115761 -27384 151260 -214616 -38788 89092 153089 -247482
15561 -106656 123097 -63228 -103283 -158021 18359 -211312 -14814 192690 202581 -277196 45178
15549a95504A47231i0583I8048a54412N7960B41785A19424h0361p6806e7068A0181
15537d2841l38334M8555J52589g7014A2037K24380B8595f1519J1994k08617C83950
15525a45878A75877E04J29493D6573n279P2223E4149K36145A28613e6211q9926
15514a46137k6422L0011A05748A0521i2739E0476h6651J6940m34113I6952i8125
15502C7329D859c29030c571A90845o3785a48467A7859J6073L5771d1331l75218
15491d16549B31826B7400M2335Q4817e579j1961H6192Q9318a06451k56977h3484
15479I6719a75021p0635Q865n0119A99478m1153H152M9986b31825c4596p3921
15468a08517H1303b9203q5314B49996C9892L8965J87530j26486a72936G9495B6377
$$ plain form
15549 -195504 147231 -90583 98048 -154412 -96452 241785 119424 -80361 -157167 -57068 10181
15537 -42841 -381175 -332620 -180031 -77014 12037 236417 28595 -61519 -49525 -258142 383950
15525 -145878 175877 504 129997 46573 41294 113517 54149 290294 128613 -56211 -146137
15514 -146137 -172559 -142548 105748 10521 -92739 50476 -86651 -69711 -503824 96952 -98125
15502 37329 4859 -329030 -3571 190845 127060 -148467 17859 33932 69703 -41331 -416549
15491 -416549 231826 27400 69735 154552 -5579 -17540 86192 175510 -106451 -363428 -83484
15479 96719 -175021 -245656 -236791 -286910 199478 158325 8152 58138 -231825 -34596 -108517
15468 -108517 81303 -29203 -114517 249996 39892 78857 266387 139901 -172936 79495 26377
15456C19576c4795j07240I7806c81444F3942c4900C1009b07547d5934j18311J1051
15445a53194D3900J45892J5811d8143G8971b6037C92841b08882J02610A36925
15434A33473i2155B09305b33931J2796G3162h9820f904H4353b35791A8741g1100
15422a55344C66579a49026C78401A16507a17853N2001r0414C59849c04934e3020
15411a95144B4085i9478k07915A4072g0239j97283H9093b69312g9428b5978C94416
15399A39085C9019d4095A19889A2108a10474j96125C34619I5242a78105f9984
15388a06219B63077a31662G4918Q5031c9521a7777r5887L1606j4870j19172Q2264
15377a33836b2956A66901G2799J84624D6838a48558B83627E884O6277a97827H9656
$$ plain form
15456 319576 -34795 -142035 97806 -381444 63942 -34900 31009 -207547 -45934 -164245 -153194
15445 -153194 43900 189792 205603 -48143 78971 -26037 392841 -208882 -106272 136925
15434 133473 -92155 209305 -233931 -221135 73162 -89820 -6904 84353 -235791 18741 -71100
15422 -155344 366579 -149026 378401 116507 -117853 -65852 -156266 359849 -304934 -53020
15411 -195144 24085 -99478 -307393 14072 -70239 -267522 89093 -269312 -79428 -25978 394416
15399 139085 39019 -44095 119889 12108 -110474 -306599 334619 95242 -178105 -69984
15388 -106219 263077 -131662 74918 159949 -39521 -17777 -113664 -82058 -96928 -216100 -133836
15377 -133836 -22956 166901 72799 257423 46838 -148558 283627 5884 72161 -197827 89656
15365e6154r8942L3365A88488q7456b2999b330k36371B66974a47357A58661D9648
15353a81018E2055J17209c7292B51816b0239A80887q3353l8840a83987i1962M103
15342h7859r1973B88129b495C34780a50736B3454P3078r245c2321j44764H5577
15330A01418J04497H614f2636o7341E09476h9345B5827J93406C1296J9845J2082
15319F3223N4648a05123g303j16935D359d23561b4854A47454i2698H8882J16409
15308B05291a28168j36415c5987j52536f4287A52803A028K11122m277h1880j72626
15297b54506F3752g8599A82511a67828B60663b92974e1409A59550a27919A50818
15286a2053n9130b0181C2591e7304I7923B407L43073J82690E7338a00599M4096
$$ plain form
15365 -56154 -155096 -121731 188488 101032 -22999 -2330 -238701 266974 -147357 158661 49648
15353 -181018 52055 169264 -37292 251816 -20239 180887 97534 58694 -183987 -91962 -87859
15342 -87859 -179832 288129 -2495 334780 -150736 23454 96532 87287 -32321 -177085 85577
15330 101418 205915 8614 -62636 -129977 509476 -89345 25827 219233 31296 51141 63223
15319 63223 117871 -105123 -7303 -124238 4359 -423561 -24854 147454 -92698 88882 205291
15308 205291 -128168 -264583 -35987 -188523 -64287 152803 1028 212150 207873 -81880 -254506
15297 -254506 63752 -78599 182511 -167828 260663 -292974 -51409 159550 -127919 150818
15286 -12053 -71183 -20181 32591 -57304 97923 2407 345480 528170 57338 -100599 -56503
15275e6503g186q6144B2582a26797f256A72424E0564Q4377n4563l4529L26017
15264C71866b66144A35685J05004c37139F5008L62792B0046N8303L5695a33930
15253E0660M2912C4688O9166B3277E648L6981K08343a23897C99969B6031L8902
15242F4933j0222K03643k6208L6150R5134p972j64024M75571Q85300m3465l72920
15231A135920K43281k53015n14826l9621j15185A66450A3849b50379A23039J51129
15221B74168c74121f6293A18451b33289d8446A09328J92779J20954j47971F2019
15210C31091A1558L23733A35139B825J3747a23113E1900P6040d2642o1856b8602
15198A17551C9082K03668D5182J88050M1678c9524I5904J37795a35842o8215r6914
$$ plain form
15275 -56503 -7186 -93330 22582 -126797 -6256 172424 50564 134941 80378 45849 371866
15264 371866 -266144 135685 240689 -337139 65008 427800 20046 78349 114044 -133930
15253 50660 93572 34688 103854 23277 5648 42629 250972 -123897 399969 26031 64933
15242 64933 54711 258354 232146 268296 363430 355458 191434 667005 1552305 1508840 1135920
15231 1135920 1379201 1126186 611360 571739 456554 166450 13849 -250379 123039 274168
15221 274168 -374121 -66293 118451 -233289 -48446 109328 302107 423061 275090 62019
15210 331091 11558 335291 135139 2825 16572 -123113 51900 127940 -42642 -104498 -28602
15198 117551 39082 242750 45182 233232 274910 -39524 95904 233699 -135842 -204057 -300971
15187c00971A35293a3249A13859L0652O421c1376A7481d9565K4694C90562H8871
15175A72683F5354J40606o4317C4051e4905A86697p5862J90964j31678a08421
15164g7156A94701a47370A61413a85067B13997a89171A85768a73613A84184a60532
15153D7480J39854G4808J26344A105L04215O977j53894a98107A56509i5285A90322
15141G2749e5212q62k37489g2860J600l6111B18342a86161e8696B39890A11637
15129A57686H714i530F5471d3149j92730B05263J09853b00885H9718Q2741a11063
15117C28648p8490Q8643j36173F476L50671C9909f5939I4598M66904A28623A4512
15105C23601n3642I7669A1000K88825j3060b13315C10026K1789F0467A0967K77045
$$ plain form
15187 -300971 135293 -13249 113859 144511 150932 -31376 17481 -49565 -24871 390562 88871
15175 172683 65354 205960 141643 34051 -54905 186697 110835 301799 170121 -108421
15164 -77156 194701 -147370 161413 -185067 213997 -189171 185768 -173613 184184 -160532
15153 47480 187334 74808 201152 1105 305320 312297 158403 -198107 156509 -95285 190322
15141 72749 -55212 -56074 -293563 -72860 -71260 -107371 218342 -186161 -58696 239890 111637
15129 157686 8714 -9530 65471 -43149 -235879 205263 315116 -200885 89718 172459 -111063
15117 328648 250158 338801 202628 6476 357147 39909 -65939 94598 561502 128623 14512
15105 323601 269959 97669 11000 299825 286765 -213315 310026 331815 60467 10967 288012
15094B88012q1539c378B17842c29B17966a2257C59871b1912O01p4844D1813J04044
15082A45857F7617d625A3273R8490L181J5508c2253k85504d1985A67434J3238
15071A80672E0458h5308k18268C15973b50069D25815k05209J09918j38241H4843
15060E8946h0370F7712L8828J52102p3410K3244q717l0499b14932b544A79322
15048E63834B05156A8462K68083M3327M8985M6212H9637N8046K65734G1288A4971
15036f8284H3590L52277A25916R0387j6333J8371J8520b1698B54196A10951N5097
15025A66048P2290J9453J44133j66792J18420j14944a67705A99122D0491K98903
15015C39394P6147j51827P7125C8709J16307L2279K05407A35218b2783A33197
$$ plain form
15094 288012 206473 -3378 217842 -329 217966 -12257 359871 -21912 -21311 -96155 41813 145857
15082 145857 67617 -4625 13273 111763 114944 130452 -32253 -317757 -41985 167434 180672
15071 180672 50458 -85308 -303576 315973 -250069 425815 220606 330524 192283 84843
15060 58946 -80370 67712 106540 258642 185232 208476 199759 169260 -214932 -2544 179322
15048 563834 205156 18462 286545 329872 378857 425069 89637 147683 413417 71288 14971
15036 -68284 83590 435867 125916 216303 199970 218341 236861 -21698 254196 110951 166048
15025 166048 238338 257791 401924 235132 353552 238608 -167705 199122 40491 339394
15015 339394 415541 263714 340839 38709 155016 187295 392702 135218 -22783 133197
15004D61931k4406A69671J20299J1056A33468J36301l709A24435j7368J29974
14994B37041n7696l7635e6488A67108a8687F4962J14152O0087A16014m8634Q918
14983G6298J95794Qa78478C12279K30291r7206m5612A82086K09436a65633C16718
14971A60937K47680G4942K11904A17704L74940j26767q3644l8264l7971J57028
14961C63026A11026K28740j66073p3944K46097k2801l7040G5662J67456E053J37294
14950A42347K76453B01815J68839j45734J80749c4898D30606m5464R8689j15916
14940C67915H2783J20887L37214a46598D61455i0242A07000c183E10304j57642
14930C52662j28831J10812k5470r1760C1585K83193F2622Q9845L8575L1683G8510
$$ plain form
15004 461931 437525 169671 289970 301026 133468 269769 266060 124435 107067 237041
14994 237041 179345 141710 -56488 167108 -18687 64962 179114 239201 116014 67380 76298
14983 76298 272092 272100 -178478 312279 542570 445364 399752 182086 391522 -165633 316718
14971 160937 408617 74942 286846 117704 492644 365877 282233 243969 205998 363026
14961 363026 111026 339766 173693 99749 345846 323045 286005 75662 243118 5053 142347
14950 142347 418800 201815 370654 224920 405669 -34898 430606 385142 483831 367915
14940 367915 82783 203670 540884 -146598 461455 -90242 107000 -3183 510304 352662
14930 352662 223831 334643 309173 217413 31585 314778 62622 152467 191042 222725 78510
14918C17522o6946P2824n0665K88823B12725D3428J28421e9739B30230M230R8388
14907C32848j27560A8075c4355B63134J77789r3277C9426K97789G9343K54383
14897C33726n7039j5390J51505m8338h5913E02268d1154A06152K91438j93024
14887B04566k2173L32162j05505l4608p8957L23331E8982K97050q5528J34028
14877D04532E0124L27765j9977j27048N2935n9949J27276L7574B56N63979N1335
14866F15570B06289A01127M88051q9878n3601A64678J41269j6969N9065J48452
14856D96495l4718k15323p1182J86157J03899j19000M48237l32955B22506M34100
14846F56606k27830J63335A93639K6544J4365J7527L86798k19382J04069B13280
$$ plain form
14918 317522 250576 323400 272735 561558 212725 43428 171849 -59739 230230 234460 332848
14907 332848 205288 18075 -34355 263134 440923 347646 39426 337215 79343 333726
14897 333726 276687 261297 412802 364464 -85913 502268 -41154 106152 397590 204566
14887 204566 182393 514555 409050 374442 295485 618816 58982 356032 270504 404532
14877 404532 50124 377889 357912 230864 283799 223850 351126 388700 256 564235 615570
14866 615570 206289 101127 589178 499300 445699 164678 305947 288978 348043 496495
14856 496495 461777 246454 175272 361429 465328 346328 794565 461610 222506 656606
14846 656606 428776 592111 193639 220183 234548 252075 638873 419491 523560 213280
14835E16518k16212K70647j00919K18701k47809A49992K57153J29307A43174J76798
14825C19972Q2214J89399j47853K35639A42891L2357o8333J18410l7382M49353
14815F37296j95248n7802m8863o7949K91276k44354K37535J22740m5185k93328
14805C36118L69727j02343n4701J72706j89983q5146J3016J83695J60578k09507
14795E94160k8509L0008j07312M02874B18204J92879l3711K54815J26419m19l16114
14784D42073P8080L56782D29560p726K85172n3112l23482J83288J33202M160j60195
14773D90867Q9689m1806N6010P5317n1231J44555C81310M72665l87394J62750
14763F29331p8641K02439B79900M56393J68968D31001M48553j79200j87157J04178
$$ plain form
14835 516518 300306 570953 470034 688735 440926 149992 407145 536452 143174 319972
14825 319972 402186 591585 443732 679371 142891 175248 106915 225325 187943 637296
14815 637296 442048 384246 335383 267434 558710 314356 551891 674631 629446 336118
14805 336118 705845 603502 548801 721507 531524 446378 459394 643089 803667 594160
14795 594160 565651 595659 488347 891221 218204 411083 377372 632187 758606 758187 442073
14784 442073 520153 876935 429560 421834 707006 653894 330412 513700 646902 651062 490867
14773 490867 580556 538750 594760 670077 618846 763401 381310 853975 466581 629331
14763 629331 550690 753129 279900 736293 905261 431001 879554 700354 513197 617375
14753F17375k69344K97343J59924p7786C45195M51982K0866k08679m0951k03341
14743C65072L81412j16402M2884K21242J7217k75393K75908m27633o3191L69391
14733G90507j42794J41399k2573K3693M554k51946J00790l8333J17750L08030
14723A031077l11128j42860P4762P4908J26642k56935J35348O4075j78448J41934
14713G59375r2816r1900R3604J51952J37154k20026K85545k72316P1708M747j3308
14702H13719O5635o1090j12702K08774J98425l93364K09458n9256j33814m1891
14692F93894K88509k82557M95688m07705J38451K31927r0655k16936M9311J67566
14682A067493j80636J65627j08037j71815N911L93288l40005j53301L43127O2259
$$ plain form
14753 617375 348031 645374 805298 727512 345195 797177 818043 609364 568413 365072
14743 365072 746484 630082 672966 894208 911425 636032 911940 484307 421116 790507
14733 790507 647713 789112 766539 790232 794786 542840 643630 605297 723047 1031077
14723 1031077 719949 577089 651851 726759 853401 596466 731814 795889 617441 759375
14713 759375 666559 574659 668263 820215 957369 737343 1022888 750572 822280 827027 813719
14702 813719 879354 818264 705562 914336 1112761 719397 928855 869599 735785 693894
14692 693894 982403 699846 1195534 787829 926280 1158207 1067552 850616 899927 1067493
14682 1067493 886857 1052484 944447 772632 778543 1171831 831826 678525 1021652 1083911
14672A083911L25499m86936J41205M9141k07000j0804m35283O76358Q7414n00811
14662G22694L19049Q774K69034l22212j10258L46445l42149K91309k82587K11785
14652A111884l01539L35214O6817L69435m21160l0681j53209j2083L27033L8752
14642A330463j79282j33183q8940M22443K8662k67770M67196m48739o445N8232
14632A182637J79155L5367j71183L18974l96942J91984J9432k13601K75458j8505
14622A402776K23540o9599j91103P8922K77481j68770k40654K53095r4622m8246
14612A422820n0133J87267K89647m03594O2179J23547P5415j71652P1140n3685
14602A552951k61475K06319O7786J75775l49518M94803k50757o549L87435m81579
$$ plain form
14672 1083911 1409410 922474 1063679 1112820 905820 895016 459733 1136091 1223505 722694
14662 722694 1041743 1050517 1319551 997339 887081 1233526 891377 1182686 900099 1111884
14652 1111884 810345 1145559 1212376 1581811 1160651 1129970 976761 964678 1291711 1330463
14642 1330463 1151181 1017998 929058 1351501 1380163 1112393 1579589 1130850 1124405 1182637
14632 1182637 1361792 1397159 1225976 1544950 1148008 1339992 1359424 1145823 1421281 1402776
14622 1402776 1626316 1556717 1365614 1444536 1722017 1553247 1312593 1565688 1471066 1422820
14612 1422820 1372687 1559954 1849601 1446007 1508186 1631733 1707148 1535496 1606636 1552951
14602 1552951 1291476 1497795 1565581 1741356 1391838 1886641 1635884 1629335 2016770 1535191
14592A535191J19698K06652k97485M73149o1590j93331n4744L54022n85635J21283
14582A617210L14838j77722L77459l57017K8905K9075L25441j13461O8736j17837
14572A995627J61870M6185l19222J29674J7650j9400M69551l81523J95588m1419
14562B254581o916N754J7891r3937M78375k74178M206K60299l9255P7533k20476
14551B463877P36137l41710J93959j29469K35718n2350J29700M41537n2556j48094
14541C476749M55173M48619M48093P03012P64424J062172J611197K671205M142695
14532A5783339N618011O910117L14964p939432p477382m627548j891893j796691
14524D893485j112700k97330j14356m86003l6718k42256l4881K95210j39620j12060
$$ plain form
14592 1535191 1654889 1861541 1564056 2037205 1975615 1782284 1727540 2081562 1495927 1617210
14582 1617210 1932048 1754326 2131785 1774768 1803673 1832748 2158189 2044728 2113464 1995627
14572 1995627 2157497 2203682 1884460 2014134 2031784 2012384 2481935 2100412 2296000 2254581
14562 2254581 2247665 2253419 2271310 2177373 2655748 2381570 2385776 2646075 2606820 2684353 2463877
14551 2463877 3200014 2858304 3052263 2922794 3158512 3106162 3235862 3677399 3624843 3476749
14541 3476749 3931922 4380541 4828634 5531646 6296070 7358242 8969439 11640644 15783339
14532 15783339 21401350 28311467 28626431 20686999 13209617 8582069 6690176 4893485
14524 4893485 3780785 3483455 3369099 2883096 2846378 2604122 2569241 2864451 2724831 2612771
14514B612771o0200K05162o6063j13617l00M0602K23351k87149M89966k50751
14504B793772K12311K6039l3827j5274l71366O19473k01207m8696Q2622l2133
14494C031714J67578J56098j69743J53615j05203J32675k31144J22142L38703
14485C596435K7230P1514j81569k79988L37703R4710L4447J59424j29214o7534
14475C663158N77266l49581j1388L5362J54060K01984j09017k61549M53769j56418
14465D197646K3023M17280o21375M38957L18121m32233L94438l21035K92686p5497
14455D632011M92763m2246j36146k7235j43471M13625p0622L76979l68817K98062
14445E424903r2345L9958M50299k58834K37623J5419K65106l14713K84844n9956
$$ plain form
14514 2612771 2552571 2757733 2691670 2578053 2577753 2618355 2841706 2554557 3044523 2793772
14504 2793772 3006083 3032122 2998295 2983021 2611655 3231128 3029921 2981225 3063847 3031714
14494 3031714 3199292 3355390 3185647 3339262 3234059 3366734 3135590 3257732 3596435
14485 3596435 3623665 3695179 3513610 3233622 3571325 3666035 3700482 3859906 3730692 3663158
14475 3663158 4240424 3890843 3879455 3914817 4068877 4270861 4161844 3900295 4354064 4197646
14465 4197646 4220669 4637949 4016574 4455531 4773652 4341419 4735857 4414822 4707508 4632011
14455 4632011 5124774 5082528 4946382 4919147 4775676 5189301 5118679 5495658 5126841 5424903
14445 5424903 5332558 5372516 5822815 5563981 5801604 5817023 6082129 5767416 6052260 5992304
14435E992304N7071O9295K92378j1174o2059k34081L30439K04192M2556K97524
14425F978445K3571l19231K33015J57394P3236J85061P2203j72105K36621R401
14415G477611J91827N75649l07807L70415M8700k58211N38512K71328N4023j57551
14405H804496J29142j2184K84583L13682k58543M73420l1039N47227k85328M20072
14395A0385528j52424L59058K0217R5775L83656Q1444K21116m7046l7664O10588
14385A1920248J68984J09245J87282J80498O95586j39536J14156M90703q7316
14376A3639850L74460J29757N42606J35416J53994Q7529N85806L0305J51715L25877
14366A6157315O84048L52707K52215K66081J55358J61813P43221L6802O99099
$$ plain form
14435 5992304 6049375 6118670 6411048 6399874 6337815 6103734 6434173 6638365 6680921 6978445
14425 6978445 7002016 6682785 6915800 7073194 7146430 7331491 7403694 7231589 7468210 7477611
14415 7477611 7669438 8245087 7937280 8307695 8356395 8098184 8636696 8908024 8962047 8804496
14405 8804496 8933638 8921454 9206037 9519719 9261176 9734596 9703557 10250784 9965456 10385528
14395 10385528 10233104 10592162 10612379 10708154 11091810 11173254 11394370 11347324 11309660 11920248
14385 11920248 12089232 12198477 12385759 12566257 13261843 13122307 13236463 13727166 13639850
14376 13639850 14014310 14144067 14686673 14822089 14976083 15063612 15649418 15679723 15831438 16157315
14366 16157315 16841363 17194070 17446285 17712366 17867724 18029537 18772758 18809560 19508659
14357A9508659J82956K53739M70773L24107N96449J036959j0102M97580K90901
14348B3152021L36690M96444R66769M20037R42551N49250P69126L72792N61432
14339B8567112N72223Q05084O45354R75334P43979R00144Q49628N25982J278529
14330C5863369R06362Q99270J101263J062102J010779J162026P92028J545611
14322D4342810J393755J115645J505810J555930J402966J644593J605244J734847
14314E6301600J468045J950179K094159K016543K302351K104460K517794K333478
14306G3088609K709543K857256K752545K966690L062312L780962L452119L560167
14298I8230203M219396L875391M038407M662128M946433M983835N390116N781908
$$ plain form
14357 19508659 19691615 19945354 20416127 20740234 21336683 22373642 22363540 22861120 23152021
14348 23152021 23488711 23985155 24951924 25371961 26314512 26863762 27632888 28005680 28567112
14339 28567112 29139335 29944419 30589773 31565107 32309086 33209230 34058858 34584840 35863369
14330 35863369 36769731 37669001 38770264 39832366 40843145 42005171 42797199 44342810
14322 44342810 45736565 46852210 48358020 49913950 51316916 52961509 54566753 56301600
14314 56301600 57769645 59719824 61813983 63830526 66132877 68237337 70755131 73088609
14306 73088609 75798152 78655408 81407953 84374643 87436955 91217917 94670036 98230203
14298 98230203 102449599 106324990 110363397 115025525 119971958 124955793 130345909 136127817
14290A36127817N705728O433182O813996O809349P613313P934329Q172890Q512989
14282A94123593R404331R933532J0244700J0871361J1248697J2113871J2496230
14275B70436315J2809513J3577489J3496790J3929629J4076050J3753033J3921457
14268C66000276J4029460J3052767J2757008J2052008J0717792R675642Q594142
14261D46879095P003387O153730M245585J682018K24251o49088j099987l780172
14253D60658819o651988p420243q958128j0395249j0535928j1522771j2202320
14246C92972192j2797551j3286477j3405625j3229555j3627366j2930717j2599900
14239C01095001j2461047j2523747j1759589j1752783j1364932j1513061j1172084
$$ plain form
14290 136127817 141833545 148266727 155080723 161890072 169503385 177437714 185610604 194123593
14282 194123593 203527924 213461456 223706156 234577517 245826214 257940085 270436315
14275 270436315 283245828 296823317 310320107 324249736 338325786 352078819 366000276
14268 366000276 380029736 393082503 405839511 417891519 428609311 438284953 446879095
14261 446879095 453882482 460036212 464281797 465963815 466188066 465538978 464438991 460658819
14253 460658819 454006831 446586588 437628460 427233211 416697283 405174512 392972192
14246 392972192 380174641 366888164 353482539 340252984 326625618 313694901 301095001
14239 301095001 288633954 276110207 264350618 252597835 241232903 229719842 218547758
14232B18547758j0664699j0419390r280841r021805q258598q222671p228773p077231
14224A48373750o431053o234648n509317n403438n230777n242876m568213m119452
14216A05633976m195964l713811l781621l675478l335780l156962l188510l036337
14208G7549513k671220k420158k374420k071151k766911j853468j977403j908253
14200E9506529j828131k021404j778541j310083j534640j373847j451176j381885
14192D6826822j141415j142993j550101r89227r37055j569439n68212o94780j408284
14183C6825316j023582p14680j072563q99708r11825l94938j049036m77233p70422
14174B9511329m51860j009708q74893m22063m00798q86995j70336r47260K5734
$$ plain form
14232 218547758 207883059 197463669 188182828 179161023 170902425 162679754 155450981 148373750
14224 148373750 141942697 135708049 130198732 124795294 119564517 114321641 109753428 105633976
14216 105633976 101438012 97724201 93942580 90267102 86931322 83774360 80585850 77549513
14208 77549513 74878293 72458135 70083715 68012564 65245653 63392185 61414782 59506529
14200 59506529 57678398 55656994 53878453 52568370 51033730 49659883 48208707 46826822
14192 46826822 45685407 44542414 42992313 42003086 41066031 39496592 38928380 38233600 36825316
14183 36825316 35801734 35087054 34014491 33114783 32202958 31808020 30758984 30281751 29511329
14174 29511329 29059469 28049761 27174868 26752805 26352007 25465012 25294676 24347416 24373150
14165B4373150p68230p59836k67317m41783m69518m02307k53731n24093o40600
14156A9845735m14009k48050l35130l74251l80530q8064l80034n39215m6831n29628
14146A6509993j44930k55984n96856K2160l82950k46954m61257j64663j3889k31788
14136A4032882k62382l11075k35515k5067m73895k13182j20879l76040n0030l20912
14126A1643905J91203m80521j5451k40383o601J01627p15509o8272j27946L27738
14116A0609790l75321m73130k59941j4593j22474J30452l09193k42731l1335J85214
14106I096738j47204k72877k11030K19541l89491M7019k89166p7161j07515j37337
14096G731517o0727K24887l89670k48205R2403j82729m0231M8686k99283L53595
$$ plain form
14165 24373150 23604920 22845084 22577767 22135984 21666466 21264159 21010428 20486335 19845735
14156 19845735 19431726 19183676 18848546 18474295 18093765 18005701 17625667 17086452 17039621 16509993
14146 16509993 16365063 16109079 15512223 15534383 15151433 14904479 14443222 14278559 14264670 14032882
14136 14032882 13770500 13459425 13223910 13198843 12724948 12511766 12390887 12014847 11964817 11643905
14126 11643905 11835108 11354587 11339136 11098753 11092152 11193779 10478270 10409998 10282052 10609790
14116 10609790 10234469 9761339 9501398 9486805 9364331 9494783 9185590 8942859 8911524 9096738
14106 9096738 8949534 8676657 8465627 8685168 8295677 8342696 8053530 7976369 7868854 7731517
14096 7731517 7670790 7895677 7506007 7257802 7350205 7167476 7127245 7175931 6876648 7230243
14086G230243k65711J0203k73111l63870q1648M08223m05553M223L122Q9132n40723
14075E814530N42024l49785k20519l86548M67572j91027J01910l55165j17469
14066E305523K07007J53518k32208l73382j4141O0738k52011L77492j28058q5931
14056E018547l14463k1576K77656k73036J79651j18911k6074j11366k88318M27918
14046D750028j50480j61033J01379l22007K1627J36860Q4479l46094O5658j26147
14036D054270O7455j11237k34719K68398j81652L29994n34794K28335k028J24987
14026D009009l46324q2771M76061n08053j2311K10007k03429N7071j11490k39878
14016C247892J16267L37057m01327L13372k29652K4552J80622m54070r5499k17400
$$ plain form
14086 7230243 6964532 6974735 6701624 6337754 6256106 6664329 6258776 6262999 6266121 6355253 5814530
14075 5814530 6356554 6006769 5786250 5399702 5867274 5676247 5778157 5422992 5305523
14066 5305523 5512530 5666048 5433840 5060458 5046317 5107055 4855044 5232536 5104478 5018547
14056 5018547 4704084 4682508 4960164 4687128 4866779 4747868 4721794 4610428 4322110 4750028
14046 4750028 4599548 4438515 4539894 4217887 4239514 4376374 4460853 4114759 4180417 4054270
14036 4054270 4121725 4010488 3775769 4044167 3862515 4192509 3657715 3886050 3884022 4009009
14026 4009009 3662685 3579914 4055975 3547922 3535611 3745618 3542189 3599260 3487770 3247892
14016 3247892 3364159 3701216 3299889 3613261 3383609 3408161 3588783 3134713 3039214 2821814
14006B821814K27684k5705q9592j19857q3765J77034L6786J42004m54945K62502
13996B893960j69565L71164k69604J39684K38119k38670l28567J84746j18482
13987B702785O9951k46455K2310O4483L08177k58369K80969J07325K31068K69374
13977C551618K72679R85983Q59236K616913L454528N325973P284225K250688n346153
13968B1255690n982365m043398k568635j594365j112365p69758k01245m90060
13960D493499o24326j31120k68441L77027o85637J25353l76666R8732k57543J17659
13950B868537J39202n09000j24324K21834j39887J60257l54154K69457m9856r8802
13940B383264r0953J05846j16361k06141K7676K50050k70655K64432l12861O6121
$$ plain form
14006 2821814 3049498 3023793 2934201 2814344 2730579 2907613 2944399 3086403 2631458 2893960
13996 2893960 2724395 3095559 2825955 2965639 3203758 2965088 2636521 2821267 2702785
13987 2702785 2772736 2526281 2548591 2613074 2921251 2662882 2943851 3051176 3282244 3551618
13977 3551618 3824297 4810280 5669516 8286429 11740957 17066930 24351155 26601843 21255690
13968 21255690 15273325 11229927 8661292 7066927 5954562 5184804 4983559 4493499
13960 4493499 3869173 3738053 3469612 3846639 3161002 3286355 2909689 3008421 2750878 2868537
13950 2868537 3007739 2498739 2374415 2596249 2456362 2616619 2262465 2531922 2482066 2383264
13940 2383264 2292311 2398157 2281796 2075655 2103331 2353381 2082726 2347158 2034297 2100418
13930B100418R3120j18973k06902L14589l65427L74547l68447R1676N7963K76296
13920B248860m61198L63005k34448K51675p85321M54146J65857n328l57900J43375
13910A782723k22007J24126K54833l04087K64780k15227J56816K59817k91980
13901A809794l24796K70783j83926j36129L10449k29061L47342k29254J20751
13892A755953O5075l82771O2943k5431M9784k06348R3438L23972J12570m36412
13882A412773M47831j14631m8331j19530j63603K60182j81437j56475O8856j92597
13872A213038K0308J69424L26393n38570j49365M09910l6319M0078J64525j87264
13862A432158J2645k54375L29828m50817M96829m18884K16182j20573K00874k75621
$$ plain form
13930 2100418 2193538 2074565 1867663 2182252 1816825 2191372 1822925 1914601 1972564 2248860
13920 2248860 1787662 2150667 1916219 2167894 1382573 1836719 2002576 1997248 1639348 1782723
13910 1782723 1560716 1684842 1939675 1635588 1900368 1685141 1841957 2101774 1809794
13901 1809794 1484998 1755781 1571855 1435726 1746175 1517114 1864456 1635202 1755953
13892 1755953 1821028 1438257 1501200 1475769 1525553 1319205 1412643 1736615 1849185 1412773
13882 1412773 1860604 1745973 1697642 1578112 1414509 1674691 1493254 1336779 1405635 1213038
13872 1213038 1233346 1402770 1729163 1190593 1041228 1451138 1414819 1454897 1619422 1432158
13862 1432158 1444803 1190428 1520256 1069439 1566268 1147384 1363566 1242993 1443867 1168246
13852A168246M5591k50220L25756k39110L13184J23114l57975K73371n5688m16983
13842I29286M72401k12797j22114Q4153O8946J89263n19660J09912J97313j07158
13832A089545K08534K4269j78402J93751O463k65288K54900k52595j03607r792
13822I67778N14143j40130J27532k44367j17436k60586K90696k59740L65753k19560
13812A024083m76329J36931L97260K31040m80932j22746j89418M19799K63731
13803A203419m36963J96915J53988j22835r6755j98941J03762J14702K26658l00035
13793H43915K44005r7975J26125n31631K76170K07956P5237m14075J83856l4712
13783H78871J07251k34493L03520k88757j6046L85996l68952J31194L26697j14377
$$ plain form
13852 1168246 1213837 963617 1289373 1050263 1363447 1486561 1128586 1401957 1346269 929286
13842 929286 1401687 1188890 1066776 1150929 1219875 1409138 889478 999390 1196703 1089545
13832 1089545 1298079 1322348 1143946 1337697 1344160 1078872 1333772 1081177 977570 967778
13822 967778 1481921 1341791 1469323 1224956 1107520 846934 1137630 877890 1243643 1024083
13812 1024083 547754 684685 1081945 1312985 832053 709307 519889 939688 1203419
13803 1203419 766456 963371 1117359 994524 897769 698828 802590 917292 1143950 843915
13793 843915 1087920 989945 1116070 584439 860609 1068565 1143802 729727 913583 878871
13783 878871 986122 751629 1055149 766392 750346 1136342 767390 898584 1225281 1110904
13773A110904l83561j34236J69736L66531J11949j47963D03665M57483l9284k82708
13763E39156J15619J70263J79110Q6174j77755J8378r5592k1594q6953J49098
13753H75904Q1247r9774L3304J5164q4498J40418l72388J2270K96505j06981j30707
13742F60464B49403O27062l30473K91863J13689j99102J63077k67367J58602C29890
13731D81301O02025j65608k4535n3908P6979o4533J07388k50850J34752k11737
13721F31274J16470J93479o0587k27567K4837K16221k65695O8008j73847J91655
13711G14248k83372p3847J45296O8624K11561k08966j71184J56169K28963r5200
13701F92292p2080J2178J47233J90923j97318k19971n7878M61838l0661q0106
$$ plain form
13773 1110904 727343 593107 762843 1129374 1241323 1093360 403665 861148 821864 539156
13763 539156 654775 825038 1004148 1090322 912567 930945 835353 813759 726806 875904
13753 875904 957151 857377 890681 905845 821347 961765 589377 601647 898152 791171 660464
13742 660464 249403 876465 545992 837855 951544 752442 915519 648152 806754 329890
13731 481301 1083326 917718 893183 839275 916254 851721 959109 708259 843011 631274
13721 631274 747744 941223 880636 653069 677906 894127 628432 696440 522593 714248
13711 714248 430876 357029 502325 570949 782510 573544 402360 558529 787492 692292
13701 692292 620212 632390 779623 970546 773228 553257 495379 957217 926556 846450
13691H46450k54599J801L91266D35470J28648j3873J86914k26019l2123J01476
13681E80493q1668N6480K03501m8395l15635L26559o71j80830j10241j33589K04739
13670E00743L7913J81480k67102J30366J30639K9206C23351J77986J63202j51387
13660E13152j45377K63527p5965k18377Q9523J01702J33705k08516J71764j56034
13650D69104K90568k347l33241r6895K62228j33334k2526q0507J72895J42924
13640F68869A06671M69868j68330L57660K1435k58167O497R2181J03769k2301
13630G09283m3520m644B11169L9317M63994j37235J7966j78863M7258N9113Q2857
13619F05576k70758K86798K33196C84709K42138k4421B13422R1929J82080J02650
$$ plain form
13691 846450 591851 593652 984918 435470 564118 550245 737159 511140 479017 580493
13681 580493 498825 555305 758806 710411 394776 721335 720664 539834 429593 296004 500743
13670 500743 538656 720136 453034 583400 714039 743245 323351 501337 664539 513152
13660 513152 367775 631302 555337 336960 426483 528185 661890 453374 625138 469104
13650 469104 759672 757325 424084 327189 589417 456083 433557 353050 525945 668869
13640 668869 106671 576539 408209 765869 787304 529137 535634 627815 731584 709283
13630 709283 665763 661119 211169 250486 714480 577245 595211 416348 463606 522719 605576
13619 605576 334818 621616 854812 384709 626847 602426 213422 305351 487431 590081
13609E90081j98798R9524K20229p150k99708K2515M9847J72350k71832L63772
13599G40830C70381J74465K0625j39221N0597m6702A02421K13356E7376M22792
13589D80168j83784j16994N71643C53930j26382R0639L89193L034J08022l58796
13579D59640j47937R8199K19192j18369j77983J12167A91986o7275M12097j21641
13569D15167N0192k6330k12970L06669n2481j2252j22973K08554j67669J08611
13559D94518j17525P4358j67117O581A26293K82973j25073K33218m2268m1986
13549D33157J85559D5524L50475k5038K13741B87860K70717j40452A45893M56178
13539F02071k75921J84999p5549B4497M64870q7543j17286L11968B62438J58329
$$ plain form
13609 590081 391283 490807 711036 703886 404178 426693 476540 648890 377058 740830
13599 740830 370381 544846 565471 426250 476847 430145 102421 315777 57376 480168
13589 480168 296384 179390 751033 353930 227548 318187 707380 710414 818436 459640
13579 459640 311703 409902 629094 510725 332742 444909 191986 124711 536808 415167
13569 415167 465359 439029 226059 532728 480247 467995 345022 553576 385907 494518
13559 494518 376993 451351 284234 290815 126293 409266 284193 517411 475143 433157
13549 433157 618716 45524 395999 370961 584702 287860 558577 418125 145893 602071
13539 602071 326150 511149 435600 24497 489367 401824 284538 596506 262438 420767
13529D20767r045j34386Q9558K98885k3832l17105q9414L64834B84505n1195M0576
13518B73886L8950j9944J21225o6343J0065j42420K56416A25000Q3947M8955j19156
13507A38746M12265k75159K38201K6525B25903k9302K02536J33803B08979o9450
13497A39529j3520K69110k2656j00943j34359L22715j98910L587K9329p7499M8385
13486B64768O1822j37253K45458I6762M17186j26006N4356j63937m1406R6497
13476C33452G5266a98182B77150m8587C1246L71982j27429K73269j49663a11972
13465A78561N19429B86959j32586K08521j9543H4971N06272A97447N00279l34831
13455C62895L39720C3849J28587D6200L92868j1020k02965R2682j47869m111J63017
$$ plain form
13529 420767 411722 277336 366894 665779 641947 324842 235428 600262 284505 233310 273886
13518 273886 312836 292892 414117 347774 357839 215419 471835 125000 208947 257902 138746
13507 138746 551011 275852 514053 540578 225903 196601 399137 532940 208979 139529
13497 139529 126009 395119 372463 271520 137161 459876 260966 264553 293882 216383 264768
13486 264768 326590 189337 434795 96762 513948 387942 442298 278361 236955 333452
13476 333452 75266 -198182 277150 228563 31246 403228 275799 549068 399405 -111972
13465 178561 697990 286959 154373 362894 343351 84971 591243 197447 697726 362895
13455 362895 702615 33849 162436 46200 439068 428048 225083 317765 169896 165785 328802
13444C28802j59631M64093B99598m7380O3781F3252K63858j35832K67157j96505
13434B61930K53251k4751q4310j02223R1667j23167l0973D9392Q1172M79337B54705
13422D63323B2971G641K78627G5837j7410K97598J5173J46365B23325L11503k04633
13411C30195L9960A61333L5158L34255r9085l2232o5947b44050c0328E2867K90105
13400C42972Q019n6353L401n3915a8674R315A26323L5362O8546D7503L98324l4207
13388D11620A96244q0551O1091J90885a8019B32656n0701J37854k9108J37665
13378D28366A63549r347N7831K70433A24845b074l4549B19211c3263C78705o2325
13367C16380N8440j49685D5608K49801A15560L6151K53391j87907j6147n6888
$$ plain form
13444 328802 169171 633264 299598 252218 315999 63252 327110 191278 458435 261930
13434 261930 515181 490430 406120 303897 395564 272397 241424 49392 130564 609901 254705
13422 463323 22971 7641 286268 75837 58427 356025 371198 517563 223325 534828 330195
13411 330195 370155 161333 196491 530746 431661 399429 333482 -244050 -30328 52867 342972
13400 342972 350991 294638 298039 244124 -18674 -9359 126323 161685 230231 47503 445827 411620
13388 411620 196244 115693 176784 367669 -18019 232656 181955 319809 290701 428366
13378 428366 163549 154202 212033 482466 124845 -2074 -36623 219211 -33263 378705 316380
13367 316380 374820 225135 45608 295409 115560 151711 405102 217195 201048 144160
13357A44160K39352d910k0848H6787J17880P5159o3655J38752E4830J82970l3648
13346B04152k5675J5624k4129Q9504b5742F66719A83284n8637n2179R6594J07332
13335B76394A18553O6290J93925c1375A96151A6375K67232K49233l3593n1875
13325D47372K6536B04867L27518q8875p1732A82085L84740k25454p1400f918B93029
13313A60135R1273M733l4763G2982J85005L6324N169j8256A31100J84845m1089
13302B74856m6260n0951N0725K69414A96023a1308D2083K78949a05317B71453
13291A74831l2468K55834A15096K2814K79097A89839A7790B743f2293C06504c9763
13279C69953A40898P6252b9281j9926C44132o1458j29788q977J35203P1564D5281
$$ plain form
13357 144160 383512 -4910 -25758 86787 204667 279826 216171 354923 54830 237800 204152
13346 204152 178477 194101 169972 259476 -25742 666719 183284 124647 72468 169062 276394
13335 276394 118553 184843 378768 -31375 196151 16375 283607 532840 499247 447372
13325 447372 473908 204867 532385 443510 371778 182085 566825 341371 269971 -6918 293029
13313 160135 251408 256141 221378 72982 257987 294311 299480 281224 131100 315945 274856
13302 274856 228596 177645 228370 497784 196023 -11308 42083 321032 -105317 271453
13291 174831 142363 398197 115096 137910 417007 189839 17790 2743 -62293 306504 -39763
13279 369953 140898 217150 -29281 -49207 344132 282674 152886 143909 279112 350676 45281
13267E18654N5402l5490F6136J17483J87057G2785R7286o3162L6061P991L15056
13256D66017A6563M6456a0561B25425A05366a94438A14544J88838i5282n6355
13246a51637D43523a8874B90059H4644J44769c701B53301j20310n8726J9032l9839
13235E3458R8383L0462a69674C07844j23774k472a04509b9899B94513j36678G5999
13223a82870B91696j44287F9238J81104K94979B05158M5178J53844E2146L90295
13213D42441B1539K08871C7799L55457l4889A18107E8143R9115N8755L0994d0187
13201A47090J1770g3292B55926j02101R7817O980J4050c2390n806D14623B01451
13189A0648K16639g7733I9055K61174A60411K3303I0102J34148F5554B3409L39524
$$ plain form
13267 518654 574056 538566 66136 183619 370676 72785 170071 106909 142970 150961 466017
13256 466017 16563 63019 -10561 225425 105366 -194438 114544 303382 -95282 -151637
13246 -151637 443523 -18874 290059 84644 229413 -3701 253301 132991 74265 93297 53458
13235 53458 151841 182303 -169674 307844 184070 181598 -104509 -29899 294513 157835 75999
13223 -182870 291696 147409 69238 250342 545321 205158 250336 404180 52146 442441
13213 442441 21539 230410 37799 393256 358367 118107 58143 157258 216013 247007 -40187
13201 147090 158860 -73292 255926 153825 251642 258622 272672 -32390 -38196 414623 201451
13189 10648 227287 -77733 99055 360229 160411 183714 90102 224250 65554 23409 362933
13178C62933a5401n7220B51799A04510J65043J3752h2903B47201h4189j7283A63761
13166B85185E250K98625j51609J14138F756J30535J99582C35J57469p6223L44469
13155D26050E06a61040c9963C13491a30622G9236c5351C04518A22705J90739a09608
13143C3704N1127d4036G0298C4056J20376N406J76509A10335J88717j06240G0366
13131b06301E0494J64267J59104D7496L73556I1659j6609a4253B38898B6332P0008
13120I6340b09171A55715L0663e4085B3534Q3919a8834n4417B97575j40354h0773
13108D51903A72642R9223I1490e0702B13171q0954N456b61913O9791a7736K211
13097a5525k8039j10997G1215L78998H2125A08a22872A33368o0507A858J58148
$$ plain form
13178 362933 -15401 -72621 251799 104510 269553 283305 -82903 247201 -84189 -101472 163761
13166 285185 5250 303875 152266 266404 6756 137291 336873 335 157804 81581 426050
13155 426050 506 -161040 -39963 313491 -130622 79236 -35351 304518 122705 313444 -109608
13143 33704 84831 -44036 70298 34056 154432 159838 336347 110335 299052 192812 70366
13131 -206301 50494 214761 373865 47496 421052 91659 75050 -14253 238898 26332 96340
13120 96340 -209171 155715 186378 -54085 23534 107453 -18834 -73251 297575 157221 -80773
13108 451903 172642 271865 91490 -50702 213171 132217 137673 -261913 -192122 -17736 -15525
13097 -15525 -43564 -154561 71215 450213 82125 108 -122872 133368 72861 1858 160006
13086A60006f4568A54343j9597J67998B1081a65748D14083A74647j698e3432D69171
13074B93288j0593G4444a82046C67970G9123l8149J75314E19K20635a97571b8362
13062B6074J28838b5587A99662a32735C9852K38627E0272L6268a50855f8958B65753
13050C8104J98869j11335B87L03604K7082B0137L01665j57349j6126j3634j8455
13039A16238M1037J88412C5447K4592a90347A06996J28004F3260k6714c35207
13028c9734A20243f1212n8682C8937g0562A7772P6023j0464L0224J32054A13075
13016b208D27082E2655c1000j23916H3690e4747k6525I6956J59447L9760h5378
13004B12249m7229C8435j0023c54738E5238b29978A66963J74893N7880C7142b23920
$$ plain form
13086 160006 -64568 154343 134746 302744 21081 -165748 414083 174647 172949 -53432 469171
13074 293288 282695 74444 -182046 367970 79123 40974 216288 519 221154 -197571 -28362
13062 26074 154912 -25587 199662 -132735 39852 278479 50272 86540 -150855 -68958 265753
13050 38104 236973 125638 287 303891 330973 20137 321802 164453 148327 134693 116238
13039 116238 157275 345687 35447 60039 -190347 106996 235000 63260 36546 -335207
13028 -39734 120243 -61212 -119894 38937 -70562 17772 93795 83331 113555 245609 113075
13016 -2208 427082 52655 -31000 -154916 83690 -54747 -81272 96956 256403 296163 -85378
13004 212249 165020 38435 28412 -354738 55238 -229978 166963 341856 399736 37142 -223920
12992B2021a40635H2277J38368E4684b35762f969C14878J2154a18583B98628m9882
12981B48746l4435a78580B6717a33199I531a77658B66112G2037i1665a904B39655
12969A47639R1544e8678H434K8351G789J274K51314O8312A35318E7497a14240
12957a10554C95920f3383C0842c2611D51445k19566l4465d7573A72891k3610J16967
12946B66248J77542E7522L9539b11272B17377b21048C9529J23788J20294j0289
12936B73322j27409a2274r1636B3406b37939M9791G206K6632J77356J4575J8653
12925B44422j0282h882B21074j0286d6231D13000b34711a9357k93902Q6922j50610
12914c76947A22836J04212H5592P5662H0336J5272J13793F0854K04206e821o1313
$$ plain form
12992 22021 -140635 82277 220645 54684 -235762 -6969 314878 327032 -118583 298628 248746
12981 248746 214311 -178580 26717 -133199 9531 -177658 266112 72037 -91665 -1904 239655
12969 147639 239183 -58678 8434 36785 7789 9063 260377 328689 135318 57497 -114240
12957 -110554 395920 -63383 30842 -32611 451445 231879 197414 -47573 172891 149281 266248
12946 266248 443790 57522 97061 -211272 217377 -221048 39529 163317 283611 273322
12936 273322 145913 -12274 -103910 23406 -237939 -188148 7206 33838 211194 225769 244422
12925 244422 234140 -8882 221074 210788 -46231 413000 -234711 -19357 -313259 -226337 -376947
12914 -376947 122836 227048 85592 161254 80336 95608 209401 60854 265060 -5821 -67134
12903f7134j25481A12329a24638b2683l0334D04253h6919A71244f3260A03865
12892A10627M3056L6108a8938j31941D1123A4928a07529d8784F50994G7901R4141
12881A72042a54900C49319f357m627A3255J8611b73471i1288B92860a60417A05859
12869h2083A92491H9347d3745D0055b49472e4284B78097A30495c7878J7066D67676
12857F9982K22880a78863B2456a8803D9252J98122J2186I3795L9325b81384Q2348
12846a99036a5621C12370b40793B2988d3335D1089O9700A7843J08530M3969C7613
12834B20500q8275E8865b28389A3826g7038A22501J42504a20247N208G204a63991
12822A88591E9292J25824o2982m9234b24283k95634G7710P4177l2762B4808K21070
$$ plain form
12903 -67134 -192615 112329 -124638 -22683 -53017 404253 -86919 171244 -63260 103865
12892 110627 153683 189791 -18938 -150879 41123 14928 -107529 -48784 650994 77901 172042
12881 172042 -154900 349319 -6357 -10984 13255 31866 -273471 -91288 292860 -160417 105859
12869 -82083 192491 89347 -43745 40055 -249472 -54284 278097 130495 -37878 -20812 467676
12857 69982 292862 -178863 22456 -18803 49252 247374 259560 93795 133120 -281384 -199036
12846 -199036 -15621 312370 -240793 22988 -43335 41089 110789 17843 126373 170342 37613
12834 220500 132225 58865 -228389 13826 -77038 122501 265005 -120247 -115039 7204 -163991
12822 188591 59292 185116 122134 72900 -224283 -519917 77710 151887 119125 24808 245878
12811B45878e3976J1342B85493B2529a73814A41633N7702l1697J01268b36344
12800b8568A55698b1246B93891m7177n0957I5216a26567C777O0400e7653H1387
12788e6312B60238B9676c34757B7111J52743J92236H5485h8245I5598e9396B46560
12776e6411A96941E199K3870d0478A48840o041b53659A92216G9756d1597m74A69664
12763B5743P6237m2988J43417B0965J44900b26743f3725A5143L7957l015b26622
12751a90466D65501j89570A05282b05759A5927J20380m314B4996d09489e3543
12740b06921B33881p3415a26866b9066E4346J86867c30589H9582n425L10077b56978
12728h5705H9725f3044o3045b4147C10203b5919j91445c6746o7883K4228G4659
$$ plain form
12811 245878 -53976 -42634 285493 22529 -173814 141633 199335 167638 268906 -236344
12800 -28568 155698 -21246 293891 246714 195757 95216 -126567 3777 64177 -57653 81387
12788 -56312 260238 29676 -334757 27111 179854 372090 85485 -88245 95598 -59396 246560
12776 -56411 196941 5199 29069 -40478 148840 142799 -253659 192216 79756 -41597 -42071 169664
12763 25743 101980 58992 202409 20965 165865 -226743 -63725 15143 53100 50085 -226622
12751 -190466 465501 275931 105282 -205759 15927 136307 131993 24996 -409489 -53543
12740 -206921 233881 160466 -126866 -29066 54346 241213 -330589 89582 84157 394234 -256978
12728 -85705 89725 -63044 -126089 -24147 310203 -25919 -217364 -36746 -104629 -80401 74659
12716h6827a7630B13751J0543o7465J03100D4176d8221A56898E0516J61744J68214
12705C80474a64010q6532B85748P559G3919K68812j50207a27547n2129j19260
12695b98936A75458N464f6257F13579a03748A49955a61469q7255G054M8553a33363
12683C11957j49000o9072j1989K23311b92187H5808J79040A08673d1982a6224
12672B77657i1095o1648I636J81183E5489J49264g6498b7959m0707j67514A57258
12660A0353b58317a01838C81877F9871O5344L22202A56410G753N59244k53018
12650C13979h024k70886B62051K4516L1949a64221h0197F5169a2286A97645J88670
12639C86315h5994B00385n9778c0454E3762f8997k5542C1228a41797H9315C4441
$$ plain form
12716 -86827 -17630 213751 224294 156829 259929 44176 -48221 156898 50516 212260 380474
12705 380474 -164010 -250542 285748 293307 73919 342731 192524 -127547 -179676 -298936
12695 -298936 175458 180922 -66257 613579 -103748 149955 -161469 -248724 7054 55607 -133363
12683 311957 162957 93885 81896 305207 -292187 85808 264848 108673 -41982 -16224
12672 277657 -91095 -152743 9636 190819 55489 204753 -76498 -27959 -68666 -236180 157258
12660 10353 -258317 -101838 381877 69871 135215 457417 156410 7753 566997 313979
12650 313979 -8024 -278910 262051 286567 318516 -164221 -80197 65169 -12286 197645 386315
12639 386315 -85994 200385 140607 -30454 53762 -68997 -94539 31228 -141797 89315 34441
12627A11125o499n637L762g6468C3219J34779J41070D2894J20249F4092L28013
12616C92105g8360D4537L34988m2066n3119k6609H8893K88665p41j16521A19705
12604A89747o2245c4332A90008j8601A2563J90736e2376A56568M130a29521A39851
12592G6691P9423F8876b61830A9587J42196e5214B07938h1209A14705a64770A02886
12580A78500b33734G6400A7410b74043P3225B24282k5823M8475D3884J53186P9826
12569B76896d1185D58622B02817K4815a76243E2735a83739n5394b4130A50942
12558g9700A13603B5871c11424A63167q0282P8358B6123b46628G9683l4219P5944
12547A21408a13220E7055B3363K93970A24216J78535b3409R124A73640g51E4209
$$ plain form
12627 111125 104626 98989 102751 -76468 33219 167998 309068 42894 163143 64092 392105
12616 392105 -78360 44537 379525 337459 284340 257731 88893 377558 376817 260296 119705
12604 189747 127502 -34332 190008 171407 12563 203299 -52376 156568 160698 -129521 139851
12592 76691 156114 68876 -261830 19587 161783 -55214 207938 -81209 114705 -164770 102886
12580 178500 -233734 76400 17410 -274043 -200818 224282 198459 246934 43884 197070 276896
12569 276896 -41185 458622 202817 227632 -176243 52735 -183739 -239133 -24130 150942
12558 -79700 113603 25871 -311424 163167 82885 161243 26123 -246628 79683 45464 121408
12547 121408 -113220 57055 23363 317333 124216 302751 -23409 -14285 173640 -751 54209
12535b85201A3020a99177B54107D2174h3143L6182m3124M4555j69863B572J08658
12524A11230b1305A1504h1807A32365a0685E082L30085j27575B1335b54968r1779
12513c46747A04242K47988a22758A88592e9112A33429g8847J9464H2647N3517
12503A36164D4593J04089h7603J8281H2279J48050H2507M7765d738k55504Q9276
12492a70966A70758J276o3458f4424j34575g310q7650B6681a84738A41938o7799
12481G4139l0452J31709a0274A37778c0640A12729K164f9130j15994C300J02588
12470A05888b33137A77500o4404i2356J994A0966K36760A02649a71955C09370
12459b04465d4185A66632Q7023e6682K719J0159A29072b28100j9113p215R6053
$$ plain form
12535 -285201 13020 -199177 254107 42174 -83143 -46961 -90085 -45530 -215393 2572 111230
12524 111230 -21305 11504 -81807 132365 -10685 5082 335167 207592 21335 -254968 -346747
12513 -346747 104242 352230 -122758 188592 -59112 133429 -78847 -59383 82647 136164
12503 136164 44593 148682 -87603 -69322 82279 230329 82507 130272 -4738 -260242 -170966
12492 -170966 170758 172034 108576 -64424 -198999 -7310 -94960 26681 -184738 141938 74139
12481 74139 43687 175396 -10274 137778 -30640 112729 114893 -69130 -185124 3300 105888
12470 105888 -233137 177500 113096 -92356 -90362 10966 247726 102649 -171955 309370
12459 -204465 -44185 166632 253655 -56682 -53963 -43804 129072 -228100 -247213 -254428 -158375
12448a58375j44314G7465P7030c02464f9789j37J4495A96133N3486F5953h83j07207
12436a08090M9721A23344b50406B27994e4663m6264p2916A31360M5604f424B02243
12424C37858H7537J87755A21695D1209a45642a7979G4095J37107a33616e9359
12413B37998a3770C87244A69836a5765k63474a2744j57487D4031p079g3006b0269
12401D911a49368B16553j04022o60h7272A90307a70994A50553a0691G3570a95445
12389h2632j87198a4383n5752C67542b62879N6197a01633D6844a56237A73022
12378f7152l42053J39780B38124A03922K2547q915R4369A05586a35166C74534
12367i8367j39300A24762L6850n4495b99177A3035a19970B56777G363a99181M34
$$ plain form
12448 -158375 -302689 77465 154495 -302464 -69789 -69926 -55431 196133 249619 65953 -883 -108090
12436 -108090 -58369 123344 -250406 227994 -54663 -100927 -173843 131360 176964 -6424 202243
12424 337858 87537 275292 121695 41209 -145642 -17979 74095 211202 -133616 -59359
12413 237998 -13770 387244 169836 -15765 -279239 -12744 -170231 44031 36952 -73006 -20269
12401 4911 -149368 216553 112531 111871 -87272 190307 -170994 150553 -10691 73570 -195445
12389 -82632 -269830 -14383 -70135 367542 -262879 -206682 -101633 46844 -156237 173022
12378 -67152 -409205 -269425 238124 103922 126469 117554 211923 105586 -135166 374534
12367 -98367 -237667 124762 161612 107117 -299177 13035 -119970 256777 7363 -199181 -198747
12356a98747c5443B7966n479J95958j06039b5046A1542R1398K2167a6582I0667
12344b70214C865K41824I3768a162B26696D6120K59284l4541H8287b0210B214
12332e4727A30993f5136k81790B32700a37106A48824E9063i2535B0423K66399
12322B86822c44270A65779O6458C0693L71798j28976j21876c514k8174j18555
12312a50243f2927b8533l9323d169k71374a28728C5909f3339n7059F8702J68068
12301B36770a6748B16858J01960F3242d1046j5787C75880A03402g6496h559A7827
12289G4645j5391J23857K1407a34675A17601K55467a31211a3452n2534l304G3126
12277B47125b01611l4674L0673N9782d3054A11637J12221a7538A76310a32404
$$ plain form
12356 -198747 -35443 27966 22487 218445 112406 -25046 11542 102940 125107 -16582 90667
12344 -270214 3865 245689 93768 -1162 226696 46120 305404 270863 88287 -20210 2214
12332 -54727 130993 -65136 -346926 232700 -137106 148824 59063 -92535 20423 286822
12322 286822 -344270 165779 232237 30693 402491 273515 151639 -3514 -31688 -150243
12312 -150243 -62927 -28533 -67856 -4169 -275543 -128728 35909 -63339 -120398 68702 236770
12301 236770 -16748 216858 318818 63242 -41046 -56833 375880 103402 -76496 -8559 17827
12289 74645 59254 183111 204518 -134675 117601 373068 -131211 -13452 -65986 -69290 73126
12277 247125 -201611 -236285 -205612 -145830 -43054 111637 223858 -17538 176310 -132404
12266c21138G7014b31191i8005b1354o7060B16225f5537j40733A32324L16398
12256D48722b4004B24431c4612j07988D5843D858e4227a6451j09820c8175C4571
12244c34371B04829b98771a18528H7942c03924C9026K2854O1840b31264I1067
12233C33953A30655L58535c0649m15516a33701C27K9266J82573a19392F0321k4082
12222C6239J77471D6494Q0670d6772B72417E7761J81640p3978a18091l2043A35633
12210B31280r7478E6908A3759M04115C2177J16967o8104Q0255J63522j55648L691
12199A72860P7242j11323h8618D2511j3980L88977J88980B37421F4072d554A17077
12187B27688B2720Q0607K96154c24855A99953J20271j44129J35966J42766b75614
$$ plain form
12266 -321138 77014 -231191 -98005 -21354 -88414 216225 -65537 -206270 132324 448722
12256 448722 -24004 224431 -34612 -142600 45843 4858 -54227 -16451 -126271 -38175 34571
12244 -334371 204829 -298771 -118528 87942 -303924 39026 61880 123720 -231264 91067
12233 333953 130655 489190 -30649 -446165 -133701 327 29593 212166 -119392 60321 36239
12222 36239 213710 46494 127164 -46772 272417 57761 239401 165423 -118091 -150134 135633
12210 231280 133802 56908 13759 417874 32177 149144 81040 161295 324817 169169 172860
12199 172860 250102 138779 -88618 42511 28531 417508 606488 237421 64072 -4554 117077
12187 227688 22720 103327 399481 -324855 199953 320224 176095 312061 454827 -275614
12176B84427l6245a31534N2100A20321n1133i8712A73808i2946E6901A7534J68902
12165A86436a13077E8965i0952A0313Q6946J10347L9034g7653A24461K8618a4167
12153B53530H7967J48438o1674J4012J58569A11056g3686b3972B06016c6614B37293
12141b5604B14866F670f2402k9826C1820j4822K40264A3207e5370B04832f1731
12129a00446A11756a07495j21870j53800J77930B37066A6946J98773o4341a58638
12118B7931Q6740j805N2174f4459J7240B47493a9470F0624k3939b24655A84964
12106a8691A93597a20095D1026a94945M3513B25277A01251m6231L7862D0630a72574
12094C9693i4714A62205l2912B4646h1017A51496a8807j03367A65816a26459A20581
$$ plain form
12176 284427 248182 -131534 -79434 120321 69188 -98712 173808 -92946 56901 17534 186436
12165 186436 -113077 58965 -90952 10313 97259 207606 246640 -77653 124461 153079 -14167
12153 253530 87967 236405 174731 188743 347312 111056 -73686 -23972 206016 -36614 237293
12141 -25604 214866 6670 -62402 -92228 31820 16998 257262 13207 -55370 204832 -61731
12129 -100446 111756 -107495 -229365 -383165 -205235 237066 16946 215719 151378 -158638
12118 27931 114671 112866 165040 -64459 -47219 247493 -19470 60624 36685 -224655 184964
12106 -18691 193597 -120095 41026 -194945 -151432 225277 101251 55020 92882 40630 -172574
12094 39693 -94714 162205 129293 24646 -81017 151496 -18807 -122174 165816 -126459 120581
12082C25525D5226c6571j15513c1839l43384I0693O0641L6032J14334A00510a77825
12070a89949A06745c01867D8084a00143A24601a37502C8603o25M0301g5495l8626
12059a14121e3345j30438N5898P132r7049A03679a67670L4564B04814c2689B00251
12047A21115j1473J85676a94586r125F6837J59674H8512J23127H436K08183N03449
12036G20068P6290B60838I5335D4514L4808J70603G7095L1350q247e2376B8532
12024a07899k66955g5094H6807a39253B0317L14429b54795b3251j85955e7520
12013A87861D7324a98111k7706i1703p7970k11628R1273I9838J36464h0229j77071
12002b57300B41904B9653J65820J2806a60196B35384e0152a6941j8030j4398m0652
$$ plain form
12082 325525 45226 -36571 -152084 -31839 -375223 90693 151334 187366 301700 100510 -177825
12070 -189949 106745 -301867 48084 -100143 124601 -137502 38603 37978 78279 -75495 -114121
12059 -114121 -53345 -183783 -127885 -120753 -217802 103679 -167670 -133106 204814 -32689 200251
12047 121115 109642 295318 -194586 -203711 66837 226511 88512 211639 8436 216619 720068
12036 720068 796358 260838 95335 44514 79322 249925 77095 108445 100198 -52376 28532
12024 -107899 -374854 -75094 86807 -139253 20317 334746 -254795 -23251 -209206 -57520
12013 187861 47324 -198111 -225817 -91703 -169673 -381301 -290028 99838 236302 -80229 -257300
12002 -257300 241904 29653 195473 208279 -160196 235384 -50152 -16941 -34971 -49369 -90021
11991i0021d126k48427A45601c6144k97568i212p0149m6410j00180M8482b5397
11979a21221A04876b7840j28705h747B9348L3236d26958c2399C0214c39098A19045
11967C7106a08311k36925O6026e3377A9687b67803e3735o8257D95798I1328J26414
11956B17742F3421j0349a44108A2936N4657l1146c5334p5254A10481b33861i2662
11944B31951C0842a18079c7573r8941A22717d6281H4874G686J56932e8990D6045
11932F0293e2077C7964C886L5195J52517d5585j03820e2835B51335c14285f0878
11920a46414D8436i8198B16941a62911D1696N740K41025h7785j43518i3340J5750
11909g7590j78694A86712J63084G9359Q5916f4726m40773a3967A65323f0902q6140
$$ plain form
11991 -90021 -4126 -252553 145601 -36144 -333712 -9212 -79361 -125771 -225951 -177469 -25397
11979 -121221 104876 -27840 -156545 -8747 29348 62584 -426958 -32399 30214 -339098 119045
11967 37106 -108311 -345236 -279210 -53377 19687 -267803 -53735 -121992 495798 91328 217742
11956 217742 63421 53072 -144108 12936 67593 36447 -35334 -110588 110481 -233861 -92662
11944 231951 30842 -118079 -37573 -136514 122717 -46281 84874 7686 164618 -58990 46045
11932 60293 -52077 37964 3886 39081 191598 -45585 -149405 -52835 251335 -314285 -60878
11920 -146414 48436 -98198 216941 -162911 41696 47436 288461 -87785 -231303 -93340 -77590
11909 -77590 -256284 186712 349796 79359 165275 -64726 -505499 -13967 165323 -60902 -147042
11898a47042n2888I9640D8081b14541n6607A98185a85222D40345A87121J69009
11888C56130a68874C51479e5798l21776A11515P107K30867a57959A75135j4570
11878A60565b27812l6269h9610j15188e8361A26449b08252O9988e8254n2455E8558
11866b52815D2136b2491k8454P713B21865A09706C7362a90658H6137a45944G5796
11854a67366N3649j06814M4200K1908A15160e1353F4350J50343b17442j86841
11844d04283H0915e2711A54627A6963a49531A46941c70080e4372A1112b39743
11833A58451B5567D577Q7345d34549A22566N5521e5764j0905k79442A72543a76554
11821i1307D7624K1938F301O1751a32012C61314b52526d4589j81973B36562h9507
$$ plain form
11898 -147042 -199930 99640 48081 -214541 -271148 198185 -185222 440345 187121 356130
11888 356130 -168874 351479 -55798 -377574 111515 118622 349489 -157959 175135 160565
11878 160565 -227812 -264081 -89610 -204798 -58361 126449 -208252 -138264 -58254 -110709 58558
11866 -252815 42136 -22491 -50945 -43232 221865 109706 37362 -190658 86137 -145944 75796
11854 -167366 -113717 -220531 -176331 -154423 115160 -51353 64350 214693 -217442 -404283
11844 -404283 80915 -52711 154627 16963 -149531 146941 -370080 -54372 11112 -239743
11833 158451 25567 4577 91922 -434549 122566 178087 -55764 -66669 -346111 172543 -176554
11821 -91307 47624 69562 6301 68052 -132012 361314 -252526 -44589 -226562 236562 -89507
11809b78138a8377j0702q0986j05200B61041E0874c07165A13954h3813H2069l446
11798G8623f5482F0496F077J99478j1640M5319d2873l0426j6000p1751f4070J7740
11786d6330j58924C26321k4192h2619a0467B67487i445n6590I5645J53691a48937
11774B78029a61661k12606a78497j25142A51002H532J7046a92395n155A08501
11763d697H7665J8760b49284A4717R635J75386f073l37931G3819L59214i1816
11751C61074G4272J8038d4514C2875a0456k7857I3862b57464a0829A82104a31254
11739H0250b57156D8326J83971C9360h0891C6818j3541C099Q1938b1470k21622
11728b43092J03540f6692L571k2805D8975J21936a95511c9114k4150C7732a91765
$$ plain form
11809 -278138 -18377 -29079 -110065 -215265 261041 50874 -307165 113954 -83813 82069 78623
11798 78623 -65482 60496 6077 205555 193915 239234 -42873 -73299 -89299 -161050 -64070 -46330
11786 -46330 -205254 326321 302129 -82619 -10467 267487 -9445 -66035 95645 249336 -148937
11774 278029 -161661 -374267 -178497 -303639 151002 8532 25578 -192395 -197550 108501
11763 -4697 87665 106425 -249284 14717 24352 199738 -6073 -344004 73819 433033 -91816
11751 361074 74272 92310 -44514 32875 -10456 -38313 93862 -257464 -10829 182104 -131254
11739 80250 -257156 48326 232297 39360 -80891 36818 23277 3099 85037 -21470 -243092
11728 -243092 -139552 -66692 -63121 -85926 48975 170911 -195511 -39114 -63264 37732 -191765
11716a21212B27450a44875k14852h3378k389I1740J79703b86379H3576b3437n8542
11705h1979B38442h947q6994A10066m5674a62971b0717A04808a74215a9324P629
11694a1695M922B4207A265h4133A88519E798P2513b25671E952J57671a64984k44267
11682d09251F1124R8842a80944b9046E1156M5851m3158P4423a24846e8801j36993
11671a95794A52066a1665l24838B8922a92019A08171h0662B20700h168B18353
11660A82561C9408f0937K7097A08959D3189e5818o4619r4076k6945A91098b18739
11648a39464B61274a89909c5042l51750B1302b10697F0655b5231B55071a19547
11637h2874A67869C7339b11565A4942K57744b40371B08270h5892k6766E3836a22063
$$ plain form
11716 -121212 227450 -144875 -359727 -83378 -85767 91740 271443 -286379 83576 -23437 -81979
11705 -81979 238442 -8947 -95941 110066 64392 -162971 -20717 104808 -174215 -19324 -11695
11694 -11695 -6773 24207 1265 -84133 188519 5798 78311 -225671 5952 163623 -164984 -409251
11682 -409251 61124 159966 -180944 -29046 51156 97007 53849 128272 -124846 -58801 -195794
11671 -195794 152066 -11665 -336503 28922 -192019 108171 -80662 220700 -8168 218353
11660 182561 39408 -60937 -33840 108959 43189 -55818 -120437 -214513 -241458 191098 -218739
11648 -139464 261274 -189909 -35042 -386792 21302 -210697 60655 -25231 255071 -119547
11637 -82874 167869 37339 -211565 14942 272686 -240371 208270 -85892 -112658 53836 -122063
11625B47909q2606a29781J2362B0911M7736a42526a6933B0723L97J37720j5045
11614A43795a19930B32902a9724l54549M6672E8669a32913A305b59j80095J3137
11603a67217B6210a0830j53079a1201B48365B2461a44085N4447d3276p0849C4471
11591B7012J08516b3022I934e33445a53953f595p6690k48209F4838a24722b1239
11579b07248A21915J39541a47473B52372c851j21532A28319a72280a966C0715
11568f3295k46555A71620D390K0738E44b31300A00397B7116a42547e9630G4777
11556D0041a03106E3902a31835a8909j26872j49898A36729F2055L1789b35860
11545A19131b22416G8070J30103b94590B38486a75332F8121j5547b44102A10870
$$ plain form
11625 247909 165303 -129781 -117419 20911 68647 -142526 -16933 20723 21120 158840 143795
11614 143795 -119930 232902 -19724 -374273 -327601 58669 -132913 1305 -259 -180354 -167217
11603 -167217 26210 -10830 -163909 -11201 248365 22461 -144085 -89638 -43276 -114125 34471
11591 27012 135528 -23022 9934 -533445 -153953 -6595 -83285 -331494 64838 -124722 -21239
11579 -207248 121915 261456 -147473 252372 -3851 -125383 128319 -172280 -1966 30715
11568 -63295 -309850 171620 4390 25128 544 -231300 100397 27116 -142547 -59630 74777
11556 40041 -103106 53902 -131835 -18909 -145781 -295679 136729 62055 93844 -235860
11545 119131 -222416 78070 208173 -294590 238486 -175332 68121 52574 -244102 110870
11534h310k14400c8485C3410A085a78543d5034B1204K80809A43032N0116k9743
11523A63405m2530N3356a00112A2975J5729J52920a8077A8959a60787A7861J09676
11512A27537e9963n0251C04276a61160A99601l8073P5900h70A5102N6852a42065
11500a35719C80539G1113o110J68712a48197p8582A82059N1370E4302J4934i3706
11488B32024F5785m601a51332B01637q3370J8257Q4803E3200E828L6997K43757
11477B86582b52254C97736a38188A9524J70927l9679f9235A05210A7347O1404
11467G8751K67140B8810L79120L9097a5115C63411b61254A51166Q9172n7610H9108
11455B11811C3924j0293J26525c24244B68218g3048B28945K5890G3981b59017
$$ plain form
11534 -8310 -222710 -38485 33410 1085 -178543 -45034 21204 302013 143032 193148 163405
11523 163405 120875 174231 -100112 12975 28704 181624 -18077 18959 -160787 17861 127537
11512 127537 -59963 -110214 304276 -161160 199601 161528 237428 -870 15102 71954 -142065
11500 -135719 380539 71113 65003 233715 -148197 -226779 182059 233429 54302 69236 -93706
11488 232024 65785 61184 -151332 201637 118267 136524 221327 53200 5828 42825 286582
11477 286582 -252254 397736 -138188 19524 190451 150772 -69235 105210 17347 78751
11467 78751 345891 28810 407930 447027 -15115 363411 -261254 151166 240338 182728 89108
11455 211811 33924 23631 150156 -324244 268218 -73048 228945 254835 73981 -259017
11444A27673P0745E5284K600a64331A34552g9572A90398K5557b00933Q2960C949
11432D19776A49169M084M1208f2654j62010D41K54248k7119C4789J4604J27024
11421A76417b4807A1946a84367F3824L535a34189j04667o0543P9300i9472L8080
11410f1392K1170n953D003J4267K63716j07067K30081a94969L7162G4081N5597
11399A29678a31129J6862j18661a03958D6238b249k79478I0618g9816K6906B18804
11387B80101A2684a05981J8763C20982a13417m2431A15409b35813Q0944j80138
11377c35007e5760j03822N2790n0414B70111A12157f1743A3839J3710J54191b0726
11365C46701a58787e79l6966H8288q780b39312B05316a08298A6944J06403B8972
$$ plain form
11444 127673 198418 55284 57884 -164331 134552 -79572 190398 215955 -200933 -117973 3949
11432 419776 149169 153253 194461 -62654 -224664 441 254689 227570 34789 49393 176417
11421 176417 -24807 11946 -184367 63824 67359 -134189 -238856 -299399 -220099 -99472 -61392
11410 -61392 -40222 -46175 4003 18270 281986 174919 405000 -194969 -157807 74081 129678
11399 129678 -131129 -114267 -232928 -103958 46238 -2249 -281727 90618 -79816 -52910 218804
11387 280101 12684 -105981 -87218 320982 -113417 -155848 115409 -235813 -154869 -335007
11377 -335007 -55760 -159582 -106792 -157206 270111 112157 -61743 13839 27549 181740 -20726
11365 346701 -158787 -579 -37545 88288 79508 -239312 205316 -108298 16944 123347 28972
11353c39846A72908C7288f1235j79306A07303b8795A30951B9833K6819b66901
11342E5247O1604a50142K6774B53680R9116I9424C7448b4011o0019A45222B8450
11330b00727n5127A90562C9303b02271A90625b60973b0023C20003b92639j04c2234
11318G598g1205A30461f3680j74415a17857K8866B8217b69376p669A26416a54872
11306f501I1263B0365d9334j22443A20449J7935E8164R5270N4250a24701b1450
11294B85679n9077M6938c30167F4752J93248j26620f9770m0217r7625F1130J57356
11283B18486g8859A22994B7954b66196A81896A3136K2477J10448e7379k16841
11273b74220a10465m4651n6055H4480O6694a73544F964i9025F7382g532H9970
$$ plain form
11353 -339846 172908 37288 -61235 -240541 107303 -28795 130951 29833 56652 -266901
11342 55247 116851 -150142 -123368 253680 352796 99424 37448 -24011 -84030 145222 28450
11330 -200727 -255854 190562 39303 -202271 190625 -260973 -20023 320003 -292639 -292743 -32234
11318 7598 -71205 130461 -63680 -238095 -117857 -88991 28217 -269376 -277045 126416 -154872
11306 -6501 91263 20365 -49334 -171777 120449 138384 58164 153434 207684 -124701 -21450
11294 285679 226602 273540 -330167 64752 258000 131380 -69770 -109987 -207612 61130 218486
11283 218486 -78859 122994 27954 -266196 181896 13136 35613 146061 -57379 -274220
11273 -274220 -110465 -155116 -211171 84480 151174 -173544 6964 -99025 67382 -7532 89970
11261A94273a64581C1471c29845b4058A98388r547k8884a88320b2411n683A11487
11249i6755D8844b37856J2428k9377h0021E0126f2672A9960E20b52265J18923
11238a33342j3116E3018J15379a51383q945f3533B56572j21595c02553A69506
11227a68731G9419C0327e7364o6006A28886c6862a937A83932e8295B47386f065
11215A36857b7655n8868l24847f7953b2190k1196D5841O8170Q74c7763j90082
11204b27845e3812l5103H3513A883e02362b5233j62916j60055g7821k34571J30498
11193a81894H3329j7073a39136e0304j27888A11006D7159J01420L6489e1073A47954
11181b7097h421B9396L5470c0803b057j79846k2451A97924D053a89077A049d4637
$$ plain form
11261 194273 -164581 31471 -329845 -24058 198388 188841 159957 -188320 -22411 -28094 111487
11249 -96755 48844 -237856 -225428 -254805 -80021 50126 -62672 19960 520 -252265 -133342
11238 -133342 -146458 53018 168397 -151383 -160328 -63533 256572 134977 -302553 169506
11227 -168731 79419 30327 -57364 -123370 128886 -36862 -1937 183932 -58295 247386 -6065
11215 136857 -27655 -86523 -411370 -67953 -22190 -43386 45841 114011 114885 -37763 -227845
11204 -227845 -53812 -88915 83513 1883 -502362 -25233 -188149 -348204 -77821 -312392 -181894
11193 -181894 83329 66256 -139136 -50304 -178192 111006 47159 148579 185068 -51073 147954
11181 -27097 -8421 29396 64866 -30803 -2057 -181903 -204354 197924 4053 -189077 1049 -44637
11168a80026b1249A23120b69794J03241j01164I7386a50397M2979A63618b04494
11157A58943b8804j29934j68240q7771A50123e8702j95786c1043k31037a3916
11146A36437E0605K45143A21445c2610r7262B30159a69437A817a70868F8446A9064
11134b12957e2978k43024a01819K5306b3553B03129I0251M2701f0638A03563l7076
11123F6487c1423C05492a26690j51550I2974L5503O4948c78218B12812B8321e7722
11111A77176d2435B15029K0911H1172h3587H3157B7397b37516E2330O4968A2488
11099a38188e6541k8638D69629D8759A9199O8321R1346E2367Q8031J8562o5377
11088I3583C7659N6275K22026H1327L99310j30046j13160P5189r1392A0649J99428
$$ plain form
11168 -180026 -21249 123120 -269794 -166553 -267717 97386 -150397 -107418 163618 -204494
11157 158943 -28804 -158738 -326978 -414749 150123 -58702 -254488 -31043 -262080 -13916
11146 136437 50605 295748 121445 -32610 -129872 230159 -169437 1817 -170868 68446 19064
11134 -212957 -52978 -296002 -101819 -76513 -23553 203129 90251 132952 -60638 103563 66487
11123 66487 -31423 305492 -126690 -278240 92974 128477 193425 -378218 212812 28321 -57722
11111 177176 -42435 215029 235940 81172 -83587 83157 27397 -237516 52330 117298 12488
11099 -138188 -56541 -85179 469629 48759 19199 87520 178866 52367 140398 158960 93583
11088 93583 37659 93934 315960 81327 480637 350591 237431 312620 221228 10649 210077
11077B10077b29401e4463A9799K19407l5268B1906M30030B12633E696J10184K55598
11066C71478A59580A0063d0139k90869B1781J78982L08686B41671j03228q328
11056A30115J48730J16960j54878c8404A79320f1559C75643o7990M9214K51286
11046F08153B31538K96462Q120j7843A45525O17811o1217l17499K95100Q104k0673
11035F67151j78086J31708B82486J65089B17662K39403R4372L7963K27160l06638
11025E09922J23547B74979J22863Q2943J45271j73147o5114J88483L8984p3818
11015E41444j40811J69691K0087K37365l94165J22249p1150q0206o5154N06299
11005H45649m02020K5305J00880k16287n2990O6109m4756Q1580O0024J48178j21853
$$ plain form
11077 210077 -229401 -54463 19799 239206 203938 21906 451936 212633 5696 115880 371478
11066 371478 159580 10063 -40139 -331008 21781 200763 509449 241671 138443 130115
11056 130115 278845 395805 240927 -38404 179320 -61559 375643 307653 356867 608153
11046 608153 231538 528000 536120 518277 145525 763336 702119 384620 679720 687824 667151
11035 667151 489065 620773 282486 447575 217662 457065 551437 589400 816560 509922
11025 509922 633469 274979 397842 480785 626056 452909 387795 576278 615262 541444
11015 541444 400633 570324 590411 827776 433611 555860 484710 404504 339350 845649
11005 845649 443629 468934 569814 353527 300537 366646 321890 403470 463494 611672 489819
10994D89819r5873n2408j8531k629J70275J25081B69180M81931C70255j61282
10984B08973M82349k43342J11616J06090j90899q203j00137L02578j95102M4849
10974E18772j56729M18086l24926N62079j45641k44283K29682j33999K08699p3097
10964H58643K97400K31686K50998p6706L7840L83345L75875K24130l15029q5863
10954B182319m77742k51908j739N5563k48573l33495J44873m81876J99139j97121
10944E89440M3359M63090k21193B65299K47943J50523B29925J43025J79353A18308
10933A96429b7391j17676f9868C4153R928g9362j04772A86844B5198J03607E8749
10921a0516A72497a9436A43698a85177k3725a03545A06957a66134E769J95850
$$ plain form
10994 489819 393946 341538 323007 320378 490653 615734 269180 751111 370255 208973
10984 208973 691322 447980 559596 665686 474787 466584 366447 669025 473923 518772
10974 518772 362043 780129 455203 1017282 871641 627358 857040 723041 931740 858643
10964 858643 1156043 1387729 1638727 1562021 1599861 1983206 2359081 2583211 2268182 2182319
10954 2182319 1704577 1452669 1450930 1506493 1257920 924425 1069298 587422 786561 589440
10944 589440 632799 1095889 874696 265299 513242 663765 229925 372950 552303 118308
10933 196429 -27391 -145067 -69868 34153 44081 -79362 -184134 186844 25198 128805 58749
10921 -10516 172497 -19436 143698 -185177 -208902 -103545 106957 -166134 5769 201619
10911B01619b64920a06986c5224G6653J78581C6105A3899c9957j03804a6308A66028
10899H2959a89178e6161k01542G4935j5512P6974F227R5663L07619A81523d07709
10887B26510g8369F3453H990i4398E7364a91675k42429A27211L226J62460j42772
10876A50125M1854D7975P9294D8665a16680e4708o5904B42663a42903a2486l19786
10865c32272G8261i143L931n4529j33506g1499k25652j37099b01071A20037B8132
10853a70729l5118B5000a95553Q1888I4337a79831A34371a10771L2866b8560A42581
10841E6546B0999L1709a2983k1594o9930h280j95327B56113B1788Q8770a15048
10829b13232j1649A20901E8256a70330A7169N271f6268k39418B94637c0009A25537
$$ plain form
10911 201619 -264920 -106986 -35224 76653 255234 36105 13899 -39957 -143761 -16308 166028
10899 82959 -189178 -56161 -257703 74935 59423 136397 6227 101890 409509 181523 -407709
10887 226510 -78369 63453 8990 -94398 57364 -191675 -434104 127211 130437 292897 150125
10876 150125 191979 47975 127269 48665 -116680 -54708 -120612 242663 -142903 -12486 -332272
10865 -332272 78261 -9143 -5212 -59741 -193247 -71499 -297151 -434250 -201071 120037 28132
10853 -170729 -205847 25000 -195553 -113665 94337 -179831 134371 -110771 -77905 -28560 142581
10841 56546 20999 52708 -12983 -34577 -104507 -8280 -203607 256113 21788 110558 -115048
10829 -213232 -224881 120901 58256 -170330 17169 22440 -66268 -305686 294637 -30009 125537
10817c016k59405J17192k2912i54A56947c183A61113l7116b90830a1387A34037
10805b72842c4768l45088K7249g7842A44951b2848k1875E2725L0706b66595j05680
10794c72275C6943f1364j99591A11457a21267j58760C9502f4299b1732j37867
10784a59599K180M4836d7348j45174j44061a36918D2058J5107c59824H2216b3815
10772b40911B60682A29256i4736n1728C14999E8553e5838E6366a61832I6013J972
10761I7985b6913F4691k9840J41802a37052j97196J25479M6542B18163g1677j20432
10750a92109F5903C974a36802n3835l241b5136C5959Q3583K9209R239l9845a94486
10737A27664a09043L0296E2358a55920C8751j0542J99082p1860a57314E8709a52486
$$ plain form
10817 -3016 -262421 -145229 -168141 -954 156947 -3183 161113 123997 -290830 -11387 134037
10805 -272842 -34768 -379856 -352607 -77842 144951 -22848 -44723 52725 83431 -266595 -372275
10794 -372275 36943 -61364 -260955 111457 -121267 -280027 39502 -64299 -21732 -159599
10784 -159599 -157419 -112583 -47348 -192522 -336583 -136918 42058 57165 -359824 82216 -23815
10772 -240911 260682 129256 -94736 -146464 314999 58553 -55838 56366 -161832 96013 97985
10761 97985 -26913 64691 34851 176653 -137052 -334248 -208769 -162227 218163 -71677 -192109
10750 -192109 65903 3974 -136802 -190637 -193878 -25136 35959 119542 148751 157990 118145 -194486
10737 127664 -109043 -78747 52358 -155920 38751 28209 227291 155431 -157314 58709 -152486
10725a30392C4820L2261j9900p159K02722B5542j0597a60806e2908C7989R5224
10714A33213H091O2205c4636k34396m087b1823G2456h2592c7554j62340p3824
10703b73718B81312b3705E1027d6039r5213o1297Q6587C2587h3039k7865b6856
10691c43996I5471f3014b1264E4268J25605a28162C4270b56457G9499J05273k2413
10680A62359b24169L4419j12995i9786D5264k0434a0160j38971A15248c60561
10669d6918B62176A05964j5887b98127i9544o370l1380O7799A06983C5453O6669
10658A02122e7597O987A11949c05448C6974d7272k37644B03J00121A2354P4012
10647H6366b4929n0744B01088a43711A74872g9381g340B27214E2110a53113j24715
$$ plain form
10725 -130392 34820 67081 47181 40022 242744 25542 14945 -160806 -52908 37989 133213
10714 133213 8091 70296 -34636 -269032 -273119 -21823 72456 -82592 -37554 -199894 -273718
10703 -273718 281312 -23705 51027 -46039 -141252 -202549 -115962 32587 -83039 -110904 -26856
10691 -343996 95471 -63014 -21264 54268 179873 -128162 34270 -256457 79499 184772 162359
10680 162359 -224169 -189750 -302745 -99786 45264 24830 -10160 -149131 115248 -360561
10669 -46918 262176 105964 90077 -298127 -99544 -105914 -137294 -69495 106983 35453 102122
10658 102122 -57597 -50610 111949 -305448 36974 -47272 -284916 203 100324 12354 86366
10647 86366 -24929 -75673 201088 -143711 174872 -79381 -7340 227214 52110 -153113 -277828
10636b77828a3822A7173b13806j502a07113c7578B9939A2346J17461B5659b92172
10624e8019c233j65940B68718c8565a1779k30833h3520B98372I514L4175L1177
10613G4866b78249a35977K1557D92975b42281g6431j00580C4217h029k72704h4763
10601A77948d8185A41303b80598A39137a50080B7743M9092J71184b62385j94908
10591d57293a39455m7803L3542O594B01152F3456a14424A66923e7204j64654e6926
10579a62734a7055F823g4522p7041j91189c6709A96998C05a25660M2620r7936
10568a80976N6585j30480I7262b94901C1824b03282N2976J2879I0367d525k2560
10557b7085I9075K96943A62483l6368a21803j45748i9811G42M110i9523E6459
$$ plain form
10636 -277828 -13822 17173 -213806 -215308 -107113 -37578 29939 12346 129807 25659 -292172
10624 -58019 -3233 -169173 268718 -38565 -11779 -242612 -83520 298372 9514 43689 74866
10613 74866 -278249 -135977 -114420 492975 -242281 -76431 -177011 34217 -8029 -280733 -84763
10601 177948 -48185 141303 -280598 139137 -150080 27743 76835 248019 -262385 -457293
10591 -457293 -139455 -187258 -153716 -147122 201152 63456 -114424 166923 -57204 -221858 -56926
10579 -162734 -17055 6823 -74522 -151563 -342752 -36709 196998 305 -125660 -83040 -180976
10568 -180976 -124391 -254871 97262 -294901 31824 -203282 -150306 -137427 90367 -4525 -27085
10557 -27085 99075 396018 162483 126115 -121803 -267551 -99811 742 4852 -99523 56459
10545A08932e2896l61848B16949C7434a01506B0219J80143B0961J54189P6342
10535B51492h2109B13165D8767K71054n3421r3429F5294a90861G026L3129J63311
10524B03466b32652F6525A746a05853b7920P079k7210I7797b22525d2625k07036
10513b49661B34951D0133J18594b03391b3981j65776O5769H6363b7718l09205
10503c36923J2333a6779j35012M73J6409j40418R8522O5603l6130D0578c1838
10491g0673C9184N8269A8268b81994A18790A088c1057r5692A83002B2716c13024
10479b52590N9071g2003d143j59856d6396j84214D2723K3474O8907b99251i803
10467A28895g6552k1770p59j83591E1941f296A10150n4966b35962D9272b03872
$$ plain form
10545 108932 -52896 -414744 216949 37434 -101506 20219 200362 20961 175150 251492
10535 251492 -82109 213165 48767 319821 266400 172971 65294 -190861 7026 40155 203466
10524 203466 -232652 66525 1746 -105853 -27920 -20841 -48051 97797 -222525 -42625 -249661
10513 -249661 234951 40133 158727 -203391 -23981 -189757 -123988 86363 -27718 -336923
10503 -336923 -324590 -16779 -151791 -151318 -134909 -275327 -176805 -111202 -147332 40578 -31838
10491 -70673 39184 97453 18268 -281994 118790 1088 -31057 -126749 183002 22716 -313024
10479 -252590 -193519 -72003 -4143 -163999 -46396 -230610 42723 66197 135104 -299251 -9803
10467 128895 -76552 -98322 -99081 -282672 51941 -6296 110150 55184 -235962 49272 -203872
10455A74414d1944K014m1363c8595J7271A33809b02286d0995B12793d25338i4435
10443A17537g5077C00414F229a04998Q912j76929A27758b13337A0928b19066B11433
10431h0350k74081e6743o3857I9977g5883m1082e3816m7532B1032J28139b74990
10419I9724K4936Q0634a6850A41996F9294K2697B1221d5544j99444A71630C9826
10407A16112k1080K1287d7551k50486B07018H3073b20009L2384j06325c5044k36413
10396b71457L4359B36566q4093J18013B1259i5923j15139D0283a53639A9545e3127
10384E5906a32866j9522O3258c5532E0423a3823A04741J32776O4011a1359j80644
10373a92003D92190g6082L7243l6782G6183C0530L04436G2737L2417d9396g918
$$ plain form
10455 174414 -41944 -39930 -81293 -38595 -21324 133809 -202286 -40995 212793 -425338 -94435
10443 117537 -75077 300414 6229 -104998 -96086 -273015 127758 -213337 10928 -219066 211433
10431 -80350 -354431 -56743 -120600 99977 -75883 -116965 -53816 -101348 21032 149171 -274990
10419 99724 124660 205294 -16850 141996 69294 91991 21221 -45544 -244988 171630 39826
10407 116112 95032 116319 -47551 -298037 207018 83073 -220009 -187625 -293950 -35044 -271457
10396 -271457 -237098 236566 152473 270486 21259 -95923 -211062 40283 -153639 19545 -53127
10384 55906 -132866 -152388 -89130 -35532 50423 -13823 104741 237517 301528 -11359 -192003
10373 -192003 492190 -76082 -38839 -75621 76183 30530 334966 72737 105154 -49396 -7918
10361D23860C8344M1975N1808J3068R2966J6615E601J72219N7305L376J38825
10350C77326p0510D0702f5380A95265o9581i7170C81474p4969G9980M9439e3443
10338C55986r3865J84062N5288k21890R1888j11071f8545M013B27955g1371D8557
10326b64893A91407k4627L15876h3434B04117K89458A39284K01248j53328h9347
10315b54280e5306m4815B15667f5162F6203A9141L0761N46443e2420B66549a54970
10303A64154b83070A12296J35187n8985B1275K4064a86869Q7016I0684b26236
10292D7664b65557c8543j44846h0128j03073b6691k8083j21066A629c5486C23940
10280e5791b5802k232I5939i9499E3955c661j11779A53278E8161A6522i6620j01810
$$ plain form
10361 423860 38344 80319 132127 145195 238161 254776 5601 177820 235125 238501 377326
10350 377326 306816 40702 -65380 195265 125684 -97170 381474 306505 79980 129419 -53443
10338 355986 262121 446183 501471 279581 371469 260398 -68545 -64532 227955 -71371 48557
10326 -264893 191407 166780 482656 -83434 204117 493575 139284 340532 187204 -89347
10315 -254280 -55306 -100121 215667 -65162 66203 19141 49902 596345 -52420 266549 -154970
10303 164154 -283070 112296 247483 188498 21275 45339 -186869 -99853 90684 -226236
10292 47664 -265557 -38543 -183389 -80128 -183201 -26691 -54774 -175840 1629 -35486 323940
10280 -55791 -25802 -28034 95939 -99499 53955 -3661 -115440 153278 58161 16522 -96620 -198430
10268a98430G9393b51259C508c21481B24911O3848j27378p9444g4806e09C5317
10256b36295g2132A25555b76774m6117D3241J37910d81683a49307H8900f2522
10245A39174J24918r4780o4697b1434A5667b41378l5439C4024b15281B83938a76046
10233b6997A28421e8632A86718a65898j70576b2150j84530i4106m0596C63502
10222a35788B2136a18076j39674q3183R0966K6185A59717g7261g252k44774k20564
10211d72590h9039j928b6974k4434D3739e2629B13950h7207A03691a23200L9438
10200h3762k26775J36510e2366A74724M5176o3417b4304l45809J8862Q1991H9372
10188A28460e8075o6478j08798G8795A4142d02414F026J4177q268a95986R6254
$$ plain form
10268 -198430 79393 -251259 3508 -321481 224911 288759 161381 81937 -74806 -509 35317
10256 -236295 -72132 125555 -276774 -322891 43241 181151 -481683 -149307 88900 -62522
10245 139174 264092 169312 104615 -21434 15667 -241378 -276817 34024 -215281 283938 -176046
10233 -26997 128421 -58632 186718 -165898 -336474 -22150 -206680 -94106 -134702 363502
10222 -135788 22136 -118076 -257750 -340933 -249967 -223782 159717 -77261 -7252 -252026 -472590
10211 -472590 -89039 -90967 -26974 -51408 43739 -52629 213950 -87207 103691 -123200 -83762
10200 -83762 -310537 -174027 -52366 174724 219900 156483 -24304 -370113 -351251 -269260 89372
10188 128460 -58075 -124553 -233351 78795 14142 -402414 6026 20203 11935 -195986 -99732
10177i9732d5247A96927b5064B29866F1218a86164B0336G905L2598a2595E2009
10165c18736C3086K94766a19888A15577a52142O6194l3584N0311k25556A88e3751
10153F0641h6564E5436k3431a09004B42170A20345b35661f0769o7499p385N125
10142a30528N2686L650k05134B27602b25706F219f2928k59680f3932G4136O9492
10131A43628a09966k9937k95277c5774C87169b96607J10268N497D0004a56144
10120a06474A19324k3128b93080i0712o5498E9460c42848a48397D6252a13200
10109c17882H3746j7253a30373f3514d157E8558d1592A6458g2160l61152a92051
10097i9540B4999b30461g7885b6829j11070O4467J1868P490I7398K89806e9586
$$ plain form
10177 -99732 -45247 196927 -25064 229866 61218 -186164 20336 7905 40503 -12595 52009
10165 -318736 33086 327852 -119888 115577 -152142 -85948 -119532 -69221 -294777 188 -53751
10153 60641 -86564 55436 32005 -109004 242170 120345 -235661 -60769 -128268 -135653 -130528
10142 -130528 -77842 -74192 -279326 227602 -225706 6219 -62928 -322608 -63932 74136 143628
10131 143628 -109966 -139903 -435180 -35774 387169 -296607 -186339 -180842 40004 -156144
10120 -106474 119324 96196 -293080 -90712 -156210 59460 -342848 -148397 46252 -113200
10109 -317882 83746 66493 -130373 -63514 -4157 58558 -41592 16458 -72160 -433312 -192051
10097 -99540 24999 -230461 -77885 -26829 -137899 -73432 -61564 -54074 97398 387204 -59586
10085a66119K1422g0753I5999M0713a72561N2217D522a75760Q3940a290j24243
10074a25533C1946g9198j89964j54260Q1960c2289j40648k5088K7775n3819c9173
10062a49492J2316H434J87052i9176A58339a84234M8700H9299a34970A35113b51032
10050f1058B25973H4425N4938A7798J78881c39383H9132a1961B93531e16445A17574
10038A29526b15785f2311n366A61522r308a9894A88643a27161d1996k57363b616
10026A83823n7825O049O305b25425B6006J01411n8731K8919a76083o8713A98671
10014a19560j56592L9682K4874b5771A12921g8994l94585B30609a15686B24306
10003a78312G2490a01427M9162H1366a56421a1300A89040B4094g0864I1186K90796
$$ plain form
10085 -166119 -144697 -70753 95999 136712 -172561 -120344 4522 -175760 -91820 -1290 -125533
10074 -125533 31946 -79198 -269162 -423422 -341462 -32289 -172937 -198025 -170250 -224069 -39173
10062 -149492 -137176 8434 195486 -99176 158339 -184234 -135534 89299 -134970 135113 -251032
10050 -61058 225973 84425 139363 17798 196679 -339383 89132 -11961 293531 -516445 117574
10038 129526 -215785 -62311 -67677 161522 152214 -19894 188643 -127161 -41996 -299359 -2616
10026 183823 125998 132047 138352 -225425 26006 127417 68686 97605 -176083 -244796 198671
10014 -119560 -276152 -236470 -211596 -25771 112921 -78994 -473579 230609 -115686 224306
10003 -178312 72490 -101427 -52265 81366 -156421 -11300 189040 24094 -70864 91186 381982
9992C81982c2108B11095a47426E0822L45556a87973j12656c4919q3257c5205k1652
9981e6857l89890a7312n2243j26482f8568j13291B81409j0365c86964A62408a43961
9969i9209C069i8928K165a2788k60844h7135A75500j5152e2281r785o7723k4470
9957a54259G7065C4273a69422d3678j95313f1271A6b77268G2125i1801p9556M3024
9945a28333a6373j48012P2037r1011j58198Q8846I0468A0822O633Q4914C7025
9933E8960a98908C5772a6160A64170H0874a42879c4467l65538a58047C5102N2102
9922H7204J14831c9294j91334b9216C5401J34557b01200m5437l66591i5897M0389
9911e5508m9955I6997d2839j19802j0357b5767B05785A9058a48490A18520J93290
$$ plain form
9992 381982 -32108 211095 -147426 50822 396378 -187973 -300629 -34919 -118176 -35205 -56857
9981 -56857 -446747 -17312 -69555 -196037 -68568 -181859 281409 271044 -386964 162408 -143961
9969 -99209 3069 -98928 -96763 -12788 -273632 -87135 175500 160348 -52281 -62066 -129789 -154259
9957 -154259 77065 34273 -169422 -43678 -238991 -61271 16 -277268 72125 -91801 -171357 -128333
9945 -128333 -16373 -164385 -92348 -183359 -341557 -252711 90468 10822 17455 102369 37025
9933 58960 -198908 35772 -16160 164170 80874 -142879 -34467 -400005 -158047 35102 87204
9922 87204 202035 -39294 -230628 -29216 35401 169958 -201200 -246637 -613228 -95897 -55508
9911 -55508 -105463 96997 -42839 -162641 -172998 -25767 205785 19058 -148490 118520 311810
9900C11810c998j56377G4301g6885k5900I220b9442l92493c4001B28584B0096
9888a14724K1682a7867p1246k38412g2680M193j93851A36790H142e8982j40363
9877a99345q4712j2458k32924G2910G423b71584K7877k4327A62342K1566a12120
9865B9480h5880L1460B0602N633N4752j2319N0857c6593a2828E2150b34816A34035
9852a18876C9655a88033b3293j23579G8554k2514i8676o6654C56137d3731F5900
9840F787b5626B04602p3822a9849q2333j76513B55829d5298k11224b5012A1644
9828b69368B95775F7395M2609Q0785l7440c9602A02655a62787P4736b0236K362
9817a7874A01994a12293o6511j93585k3026C9256L1567c9038A44125a09801a5980
$$ plain form
9900 311810 -3998 -160375 74301 -76885 -102785 9220 -29442 -421935 -34001 228584 20096
9888 -114724 -93042 -17867 -89113 -327525 -72680 -68487 -262338 136790 8142 -58982 -199345
9877 -199345 -284057 -296515 -529439 72910 7423 -271584 -243707 -268034 162342 183908 -112120
9865 29480 -85880 -54420 20602 26235 80987 68668 119525 -36593 -12828 52150 -234816 134035
9852 -118876 39655 -188033 -23293 -146872 78554 56040 -98676 -165330 356137 -43731 65900
9840 6787 -25626 204602 130780 -19849 -102182 -278695 255829 -45298 -256522 -25012 11644
9828 -269368 295775 67395 110004 190789 153349 -39602 102655 -162787 -88051 -20236 -17874
9817 -17874 101994 -112293 -178804 -372389 -395415 39256 70823 -39038 144125 -109801 -15980
9805b16310j0909A67521p6492d395F2209M1211a87670q794E2949A5294a37376
9793c58338a54292j92627h1435K5266A41770a48416j54750J27499N9205L3659
9783h2803A15293g8665j29373b1693H6853a18159N4764j9482g812o728I0388a10141
9770f461k7160A99516q3154c94928e9545a1396j16306A6452a36231B52726b97376
9758f4558k0583A76714h3770k8594b4694k87579i5702j43538A3282L03460a00213
9746D38935A1041b74598P9395N1056E6929b44288A36724b16890G5105O5812k0388
9735A20529m3213a70694B82222a75653H2301K4786E0124B1499a38076A07473a54195
9723a84553j9588A3910c17630g0123k45760a23027F8105b15104B53436E6596g1725
$$ plain form
9805 -216310 -227219 167521 91029 -4395 62209 103420 -187670 -196464 52949 15294 -137376
9793 -358338 -154292 -346919 -81435 -56169 141770 -148416 -303166 -175667 -116462 -82803
9783 -82803 115293 -78665 -208038 -21693 86853 -118159 -63395 -82877 -7812 -14540 90388 -110141
9770 -6461 -33621 199516 116362 -394928 -59545 -11396 -127702 16452 -136231 252726 -297376
9758 -64558 -85141 176714 -83770 -112364 -24694 -312273 -95702 -239240 13282 316742 -100213
9746 438935 11041 -274598 -195203 -144147 56929 -244288 136724 -216890 75105 140917 120529
9735 120529 77316 -170694 282222 -175653 82301 107087 50124 21499 -138076 107473 -154195
9723 -184553 -204141 13910 -317630 -70123 -315883 -123027 68105 -215104 253436 56596 -71725
9711B35498A00245A4720a99526n8308A76144h9740E06818B36685A2725a92587
9700I1416a61362C7268a0571C00876c95923d5734a7872q1158C37794A26406a82504
9688A70617a67193A1156b60586C18824a12538m6270j26797A61222K1740d09073
9677h6519j37223D581g333n5012I9998C0891a15076j01744J4900H5988Q3005a14271
9664a47526A51319j9949a32373d0133C24954A02086M3816a67080P6745a4263l9272
9653e3535A89721a62675N1152B00630i7655k1937b448k12818B2785a98847A06921
9641i9048a4617l51730d9437N682A844e1483j68282D7387J17920a06350I9986
9629c63374J76532j52283o061e1018I5115a7627j32343M3185E068J73077d3465
$$ plain form
9711 235498 100245 14720 -199526 -257834 176144 -89740 506818 236685 12725 -192587
9700 91416 -161362 37268 -10571 300876 -395923 -45734 -17872 -99030 337794 126406 -182504
9688 170617 -167193 11156 -260586 318824 -112538 -158808 -285605 161222 182962 -409073
9677 -86519 -223742 4581 -7333 -62345 99998 30891 -115076 -216820 -201920 85988 168993 -114271
9664 -147526 151319 131370 -132373 -40133 324954 102086 145902 -167080 -90335 -14263 -53535
9653 -53535 189721 -162675 -111523 200630 -97655 -119592 -2448 -215266 22785 -198847 106921
9641 -99048 -14617 -366347 -49437 -43755 1844 -51483 -219765 47387 165307 -106350 99986
9629 -363374 -186842 -339125 -345186 -51018 95115 -17627 -149970 -106785 5068 178145 -43465
9617a09998k27790F6579O0905J9332F6665a71012K9881p8587B7671b5699m61959
9606d87658J7255h6131b2932o2171M0991A5393L4004a96789A47112c6809F7289
9594B1034c0010E4031a05295j30200J00057B248i1640A96135h5662A4717c54666
9582A63067d4949j03314L3450j3779M9341P927n4485b5124C40850A9204M2657
9571F1861c08168H2615I065K40450j6604A05685g8345A88066H7723f2093K0522
9560d1571R61q4326A55312b81786E3278a2718r0724j2108M399j60523C1755b079
9547B2278Q2745J43343f3589j71174j13114Q9278J18840B26775d53241a08591
9536d66564b01679J5251B84432b38613P1675j58477B23084d469k07020B51418
$$ plain form
9617 -109998 -337788 66579 127484 146816 66665 -171012 -141131 -219718 27671 -25699 -487658
9606 -487658 -470403 -86131 -22932 -85103 -44112 15393 49397 -196789 147112 -36809 67289
9594 21034 -30010 54031 -105295 -235495 -135438 2248 -91640 196135 -85662 14717 -354666
9582 163067 -44949 -148263 -114813 -128592 -79251 -71324 -125809 -25124 340850 19204 61861
9571 61861 -308168 82615 9065 249515 232911 105685 -78345 188066 87723 -62093 -41571
9560 -41571 -40610 -124936 155312 -281786 53278 -12718 -103442 -115550 -111151 -271674 31755 -2079
9547 22278 105023 248366 -63589 -234763 -347877 -258599 -139759 226775 -453241 -108591
9536 -466564 -201679 -186428 284432 -238613 -166938 -325415 223084 -4469 -211489 251418
9525A65761p5015b8908k18379A78289n0070b5054A03151i9205M7859B390a63774
9513I4032b93293J23547k2444Q1480b9122E5031J08067c9722j1320k28305A7558
9501b6569B1587a4436j87579M917L5610H8739a74669I0838J85006d35428a36206
9489B7486R1486d3154k37494C6678J01952l6247a21760A76282I587d3708C5905
9477C55943h5883A51659g8312m6293n5230A42268i672A37932f6079j11277A019
9465E7039A0733b67489A55300R3478A10322a37380A64936p1434C7526a14540m1527
9454a56067A0300a58450A8320a24053B23429h2868j19651H3247j4209c40203H1188
9442b062l259k6161C0497c9058B664P2491J06928k5595e3836l6397A50829D0067
$$ plain form
9525 165761 90746 -28908 -247287 178289 128219 -25054 103151 -99205 -51346 2390 -163774
9513 94032 -293293 -169746 -192190 -110710 -29122 55031 163098 -39722 -51042 -279347 17558
9501 -26569 21587 -14436 -202015 -197098 -161488 88739 -174669 90838 275844 -435428 -136206
9489 27486 118972 -43154 -280648 36678 138630 102383 -121760 176282 9587 -43708 35905
9477 355943 -85883 151659 -78312 -124605 -179835 142268 -9672 137932 -66079 -177356 1019
9465 57039 10733 -267489 155300 248778 110322 -137380 164936 93502 37526 -114540 -156067
9454 -156067 10300 -158450 18320 -124053 223429 -82868 -202519 83247 69038 -340203 81188
9442 -2062 -5321 -31482 30497 -39058 2664 75155 182083 156488 -53836 -90233 150829 40067
9429f2294D0054c58596A40684n5118a73103C99256a0164A26616a49125O3913M2279
9418d2933K0027j80580p7627J23697F670f4735a5866k53292m24349A992b87592
9406A18644C1641i663A73956m4877i7221E1563f2564A34304c23313J46413a582
9394a00654m5188j51874A00852m2167a8895k01369N6609q2188N6693A38288a00619
9382a47977j80258E09i1522r7593D9763J54764H222K67756a14561G0836a39076
9370a52422d7634I6726l6761D883a6430r6091A40513c6880a7794k7277A70543
9358G0375N7840a43195B7230g8589k31044A02935i3214D93900f3018A30035a71720
9346a17958d2409j97079E7510a98137o7282d0329j51888O3747M0249A87184a51865
$$ plain form
9429 -62294 40054 -358596 140684 85566 -173103 399256 -10164 126616 -149125 -85212 -42933
9418 -42933 -22906 -203486 -281113 -157416 6670 -64735 -15866 -269158 -693507 1992 -287592
9406 118644 31641 -9663 173956 129079 -97221 51563 -62564 134304 -323313 -176900 -1582
9394 -100654 -145842 -297716 100852 58685 -18895 -220264 -163655 -245843 -189150 138288 -100619
9382 -147977 -328235 509 -91522 -189115 49763 204527 8222 275978 -114561 70836 -139076
9370 -152422 -47634 96726 59965 4883 -16430 -112521 140513 -36880 -17794 -45071 170543
9358 70375 128215 -143195 27230 -78589 -309633 102935 -93214 493900 -63018 130035 -171720
9346 -117958 -42409 -239488 57510 -198137 -265419 -40329 -192217 -128470 -88221 187184 -151865
9334C21656a03492e1382j06833E0099a30169A70977F5523a34873f5808n6570F5881
9322A8043e4120C6660h9705l28512A1342a90932L3980f0950A95597a20049A84212
9310a97672g4484A21149J13678f8546n5893B05059a89820j78694A65417e6486
9299C94215b96209J02551q8479j50311C0499c01036a3030k52713A24740b48931
9288a19295j5642j36940I3286b93815a07384j22515C5242Q2057K9893b06825M7131
9277a59694B87626j22209K48867A41393g2287A51015O8842a57745j87361a24793
9266e7198E5331h4415A53572E334J1839J3957d41801a82720e2151A57984b07855
9254A95437e888C4335a54239a3263J041j15257p7184d7349b0111B28127i9712
$$ plain form
9334 321656 -103492 -51382 -158215 50099 -130169 170977 65523 -134873 -65808 -122378 65881
9322 18043 -54120 36660 -89705 -418217 11342 -190932 -156952 -60950 195597 -120049 184212
9310 -197672 -74484 121149 234827 -68546 -124439 205059 -189820 -368514 165417 -56486
9299 394215 -296209 -193658 -282137 -432448 30499 -301036 -13030 -265743 124740 -248931
9288 -119295 -134937 -271877 93286 -293815 -107384 -229899 35242 117299 147192 -206825 -159694
9277 -159694 287626 165417 414284 141393 -72287 151015 219857 -157745 -345106 -124793
9266 -57198 55331 -84415 153572 5334 17173 31130 -441801 -182720 -52151 157984 -207855
9254 195437 -5888 34335 -154239 -13263 -12222 -127479 -204663 -47349 -20111 228127 -99712
9242B3398J32118a57199j67948a52113G5946e4078j17178o2788A95152m7606a50084
9230a78597a3869l54185J41931O4292h0663J2388l24957E5536d12950B31241k330
9219B28911A3668e8000j03011l9065A83655e9368E4732j6899a35504A74782B3255
9207d4246q4680j49746c8828D6310a07257L6178r3135D7841Q787g4571m560B193
9194a67187r2205c0037j38091F9009K30047H2760i4998D2168a7285D2011a55420
9182A07627e0413A8398b31330A8199K37079a37634D7482A3093b19046B41437g1954
9170B66748a89865L3386b5612M65l14236a65501I6405a46683J1341c7867q4980
9159a22847G620a21191A5380g9009k69208i0322H1545b1047D0597A3376K89691
$$ plain form
9242 23398 155516 -157199 -325147 -152113 75946 -54078 -171256 -234044 195152 147546 -150084
9230 -178597 -13869 -368054 -226123 -161831 -80663 -68275 -393232 55536 -412950 231241 228911
9219 228911 13668 -58000 -161011 -200076 183655 -59368 54732 37833 -135504 174782 23255
9207 -44246 -128926 -278672 -38828 46310 -107257 -71079 -164214 47841 56628 -74571 -79131 2193
9194 -167187 -259392 -30037 -168128 69009 299056 82760 -94998 42168 -17285 42011 -155420
9182 107627 -50413 18398 -231330 18199 255278 -137634 47482 13093 -219046 241437 -71954
9170 266748 -189865 -156479 -25612 -25147 -339383 -165501 96405 -146683 -135342 -37867 -122847
9159 -122847 7620 -121191 15380 -79009 -348217 -90322 81545 -21047 40597 13376 303067
9148C03067b7595j75667B0192b80285H4192a56164o6233A42709B4718J05524b69342
9136E7421a04721A53858b67747a09042G8417a22578j6824j33037R7604a6266l20243
9125c36509A18230d6735k11890N3174E3886b88666P821d1763j48353Q6184j9091
9114a23023A35265n3140a18446q2200o0308B0384J3253O9852L5312E9157f9639
9102f8412D02878h3854c5415H5027O7350G106b13601A9808c51589L6130A85023
9090c38225d4560A62278J77771h6751E961f2799L0641n8123A45598B0353J08986
9079A29339O2177D0031e44587A63337C9278e16995A531g5970L1414o7898m792
9068a17246j8519l7377k9652f8872j3918k8464p9263j8786Q6408A25590a935k42537
$$ plain form
9148 303067 -27595 -203262 20192 -280285 84192 -156164 -222397 142709 24718 130242 -269342
9136 57421 -104721 153858 -267747 -109042 78417 -122578 -139402 -272439 -174835 -16266 -336509
9125 -336509 118230 -46735 -258625 -205451 53886 -288666 -280845 -41763 -190116 -103932 -123023
9114 -123023 135265 82125 -118446 -200646 -260954 20384 33637 103489 138801 59157 -69639
9102 -68412 402878 -83854 -35415 85027 152377 7106 -213601 19808 -351589 -315459 185023
9090 -338225 -44560 162278 340049 -86751 5961 -62799 -32158 -90281 145598 20353 129339
9079 129339 191516 40031 -544587 163337 39278 -516995 1531 -75970 -44556 -112454 -117246
9068 -117246 -135765 -173142 -202794 -68872 -82790 -111254 -190517 -209303 -122895 125590 -1935 -244472
9056b44472j277J20660k8107a9758B8090J00061K17470b02501k8313a06674C21364
9044b67195h1751D5899b05175b9519C7189P0318c44752g4282m5283F1705L8931
9033A00636K9167c47348E596K92130A00316c2701q9880K1178M4016n538r0953
9022a53878j51839a1200j20726B303K3251b99237H4583R2042B4906K8219J9339
9011G2464R4787d5917A45017c85993G4725e2081r8296e4463j40185A33067a67058
8999B2915d80970a96298m1158d8454A63475e7863A89211m4612b52281A53769a88524
8987a18879L5963k20641c7497A1624Q4032J34106a6604j2640j0574A43160a35865
8975a78888h8289n9374c3292A69608b48541E05588b79924C61367E4209a30873
$$ plain form
9056 -244472 -245749 -125089 -153196 -19758 28090 128151 345621 -202501 -230814 -106674 321364
9044 -267195 -81751 45899 -205175 -29519 37189 107507 -344752 -74282 -119565 61705 100636
9033 100636 129803 -347348 5596 297726 100316 -32701 -122581 -101403 -57387 -62925 -153878
9022 -153878 -305717 -11200 -131926 2303 25554 -299237 84583 176625 24906 53125 72464
9011 72464 167251 -45917 145017 -385993 74725 -52081 -150377 -54463 -194648 133067 -167058
8999 22915 -480970 -196298 -237456 -48454 163475 -57863 189211 144599 -252281 153769 -188524
8987 -118879 -82916 -303557 -37497 11624 95656 229762 -16604 -29244 -39818 143160 -135865
8975 -178888 -88289 -147663 -33292 169608 -248541 505588 -279924 361367 54209 -130873
8964A67078e5788l09219a74861O2050A95751h7508k79532i506l56184a56038k1132
8953a77170a2805l3989F6772a83873d3522I947a8913A12362a34626m0508p6619
8942b51753A66807a57083B6773J72905b58289F8579k8807J79514b50897L7876
8932b13021f5006k12872M2612R0531A18822J21794a37969N8114E316b7889k97456
8921c25345R2942e7075C43593A22533j2070A1589d3538l0124a7882D9808k116
8910D7692N24581M57925M20273J027595K714543J963761C540255A571715G80686
8900D02828K47410l09044K0310j53613p7941J692r865J3715K17134G738J01518
8889A09256Q4380C7499b65386A80416a20878A82251c40962a2657q9306B47327
$$ plain form
8964 167078 -55788 -365007 -174861 -112811 195751 -87508 -367040 -9506 -365690 -156038 -177170
8953 -177170 -12805 -46794 66772 -183873 -43522 9947 -18913 112362 -134626 -175134 -251753
8942 -251753 166807 -157083 26773 199678 -258289 68579 39772 219286 -250897 -213021
8932 -213021 -65006 -277878 -235266 -144735 118822 240616 -137969 -79855 5316 -27889 -325345
8921 -325345 -232403 -57075 343593 122533 110463 11589 -43538 -73662 -17882 49808 47692
8910 47692 572273 1030198 1450471 2478066 5192609 7156370 3540255 1571715 780686
8900 402828 650238 341194 361504 207891 129950 131642 121777 135492 352626 7738 109256
8889 109256 193636 37499 -265386 180416 -120878 182251 -340962 -12657 -101963 247327
8878b6888j78826A4468a93450c1353P357G7044a51280A0224M8450A0744c5507
8866b5503l5927q3176A31224J04138d3681k94463J51694f5885A50997b56697I8415
8854G5003a32728k13405B12685A03678c39F18J76444m8405n2642c34594H0297
8842c21127J18238a5422m82349a87316C2534D998d86084K15466f2396A92283i6421
$$ plain form
8878 -26888 -205714 14468 -193450 -31353 -23996 77044 -151280 10224 58674 10744 -35507
8866 -25503 -61430 -144606 131224 235362 -43681 -338144 -186450 -65885 150997 -256697 98415
8854 75003 -132728 -346133 212685 103678 -339 618 177062 128657 76015 -334594 80297
8842 -321127 -202889 -15422 -497771 -187316 32534 4998 -486084 -270618 -62396 192283 -96421
$$ [...]
##END NTUPLES=NMR SPECTRUM
##END=
