
##TITLE=AC1105_ROVE100C_5868038_fyY4OHmNFm
##JCAMPDX= 6.0         $$ Bruker NMR JCAMP-DX V2.0
##DATA TYPE= NMR SPECTRUM
##DATA CLASS= NTUPLES
##ORIGIN= BRUKER
##OWNER= Administrator
$$ 1.72 TOPSPIN		Version 2.1
$$ 2012-03-31 02:31:33.218 -0500  Administrator@TOPSPIN
$$ Compression mode = diff/dup
##.OBSERVE FREQUENCY= 400.13188235
##.OBSERVE NUCLEUS= ^1H
##.ACQUISITION MODE= SIMULTANEOUS (DQD)
##.ACQUISITION SCHEME= undefined
##.AVERAGES= 64
##.DIGITISER RES= 22
##SPECTROMETER/DATA SYSTEM= spect
##.PULSE SEQUENCE= noesygpps1d.comp
##.SOLVENT NAME= COFFEE_meoh
##.SHIFT REFERENCE= INTERNAL, COFFEE_meoh, 1, 14.96691
##AUDIT TRAIL= $$ (NUMBER, WHEN, WHO, WHERE, PROCESS, VERSION, WHAT)
$$ ##TITLE= Audit trail, TOPSPIN		Version 2.1
$$ ##JCAMPDX= 5.01
$$ ##ORIGIN= Bruker BioSpin GmbH
$$ ##OWNER= Administrator
$$ $$ C:\Bruker\TOPSPIN/data/COFFEE/nmr/AC1105_ROVE100C_5868038_fyY4OHmNFm/12/pdata/1/auditp.txt
$$ ##AUDIT TRAIL=  $$ (NUMBER, WHEN, WHO, WHERE, PROCESS, VERSION, WHAT)
(   1,<2012-03-31 02:31:28.484 -0500>,<Administrator>,<TOPSPIN>,<go>,<TOPSPIN 2.1>,
      <created by zg
	started at 2012-03-31 02:19:56.828 -0500,
	POWCHK enabled, PULCHK disabled,
       configuration hash MD5:
       1A 1E CE 29 27 FD 77 03 67 4E F0 E3 C4 B2 CB 90
       data hash MD5: 64K
       33 4B C1 0E 58 8F E6 08 4C 14 DB BF BA B4 C3 7C>)
(   2,<2012-03-31 02:31:31.281 -0500>,<Administrator>,<TOPSPIN>,<proc1d>,<TOPSPIN 2.1>,
      <Start of raw data processing
       efp LB = 0.3 FT_mod = 6 PKNL = 1 PHC0 = 0 PHC1 = 0 SI = 128K 
       data hash MD5: 128K
       BA AD C5 32 5F 34 22 12 C6 94 52 3E C8 49 CF 8D>)
(   3,<2012-03-31 02:31:32.453 -0500>,<Administrator>,<TOPSPIN>,<proc1d>,<TOPSPIN 2.1>,
      <pk PHC0 = 32.15698 PHC1 = 0 
       data hash MD5: 128K
       E5 18 33 B7 51 60 50 BD 16 20 B9 04 25 88 A6 EF>)
(   4,<2012-03-31 02:31:32.687 -0500>,<Administrator>,<TOPSPIN>,<proc1d>,<TOPSPIN 2.1>,
      <abs ABSG = 1 
       data hash MD5: 128K
       2C B3 C1 CC 0B C4 EE F6 65 0F 3C ED 4A 97 1D 29>)
(   5,<2012-03-31 02:31:32.796 -0500>,<Administrator>,<TOPSPIN>,<proc1d>,<TOPSPIN 2.1>,
      <abs ABSG = 2 
       data hash MD5: 128K
       D6 58 F7 0D 72 88 9F 27 F7 EB 15 8C B3 4A 1D 25>)
(   6,<2012-03-31 02:31:33.015 -0500>,<Administrator>,<TOPSPIN>,<proc1d>,<TOPSPIN 2.1>,
      <abs ABSG = 3 
       data hash MD5: 128K
       F9 32 F4 0F 74 67 C3 29 A8 CF E4 44 7A 35 51 C3>)
(   7,<2012-03-31 02:31:33.078 -0500>,<Administrator>,<TOPSPIN>,<proc1d>,<TOPSPIN 2.1>,
      <abs ABSG = 4 
       data hash MD5: 128K
       99 47 0C 59 E2 46 FF BB B5 54 34 70 B5 41 FF E9>)
(   8,<2012-03-31 02:31:33.125 -0500>,<Administrator>,<TOPSPIN>,<proc1d>,<TOPSPIN 2.1>,
      <abs ABSG = 5 
       data hash MD5: 128K
       DF 31 D8 99 00 CE 61 1B AC BA 49 8A C4 80 3C B0>)
$$ ##END=
$$ 
$$ $$ hash MD5
$$ $$ DF 5A 81 62 79 A1 CF C0 81 9D F2 F3 08 96 10 F4
##$RELAX= 
##$RELAX= 
##$RELAX= 
##$RELAX= 
##$RELAX= 
##$RELAX= 
##$RELAX= 
##$RELAX= 
$$ Bruker specific parameters
$$ [...]
##$TP07= 0
##$TPNAME0= <>
##$TPNAME1= <>
##$TPNAME2= <>
##$TPNAME3= <>
##$TPNAME4= <>
##$TPNAME5= <>
##$TPNAME6= <>
##$TPNAME7= <>
##$TPOAL= (0..7)
0.5 0.5 0.5 0.5 0.5 0.5 0.5 0.5
##$TPOFFS= (0..7)
0 0 0 0 0 0 0 0
##$TUNHIN= 0
##$TUNHOUT= 0
##$TUNXOUT= 0
##$USERA1= <user>
##$USERA2= <user>
##$USERA3= <user>
##$USERA4= <user>
##$USERA5= <user>
##$V9= 5
##$VALIST= <valist>
##$VCLIST= <CCCCCCCCCCCCCCC>
##$VD= 0
##$VDLIST= <DDDDDDDDDDDDDDD>
##$VPLIST= <PPPPPPPPPPPPPPP>
##$VTLIST= <TTTTTTTTTTTTTTT>
##$WBST= 2048
##$WBSW= 25
##$XGAIN= (0..3)
0 0 0 0
##$XL= 0
##$YL= 0
##$YMAX_a= 8670939
##$YMIN_a= -4957364
##$ZGOPTNS= <>
##$ZL1= 120
##$ZL2= 120
##$ZL3= 120
##$ZL4= 120
##$ABSF1= 14.96691
##$ABSF2= -5.58562
##$ABSG= 5
##$ABSL= 3
##$ALPHA= 0
##$AQORDER= 0
##$ASSFAC= 0
##$ASSFACI= 0
##$ASSFACX= 0
##$ASSWID= 0
##$AUNMP= <proc_prof1d_extract.lims>
##$AXLEFT= 0
##$AXNAME= <>
##$AXNUC= <1H>
##$AXRIGHT= 0
##$AXTYPE= 0
##$AXUNIT= <>
##$AZFE= 0.1
##$AZFW= 0.1
##$BCFW= 0
##$BC_mod= 0
##$BYTORDP= 0
##$COROFFS= 0
##$CY= 15
##$DATMOD= 1
##$DC= 0
##$DFILT= <>
##$DTYPP= 0
##$F1P= 0
##$F2P= 0
##$FCOR= 0.5
##$FTSIZE= 131072
##$FT_mod= 6
##$GAMMA= 0
##$GB= 0
##$INTBC= 1
##$INTSCL= 1
##$ISEN= 128
##$LB= 0.3
##$LEV0= 0
##$LPBIN= 0
##$MAXI= 10000
##$MC2= 0
##$MEAN= 0
##$ME_mod= 0
##$MI= 0
##$NCOEF= 0
##$NC_proc= -3
##$NLEV= 6
##$NOISF1= 0
##$NOISF2= 0
##$NSP= 0
##$NTH_PI= 0
##$NZP= 0
##$OFFSET= 14.96691
##$PC= 1
##$PHC0= 32.15698
##$PHC1= 0
##$PH_mod= 1
##$PKNL= yes
##$PPARMOD= 0
##$PPDIAG= 0
##$PPIPTYP= 0
##$PPMPNUM= 2147483647
##$PPRESOL= 1
##$PSCAL= 4
##$PSIGN= 0
##$PYNMP= <proc.py>
##$REVERSE= no
##$SF= 400.13000548365
##$SI= 131072
##$SIGF1= 0
##$SIGF2= 0
##$SINO= 400
##$SIOLD= 131072
##$SPECTYP= <>
##$SREGLST= <1H.CDCl3>
##$SSB= 0
##$STSI= 131072
##$STSR= 0
##$SW_p= 8223.68421052632
##$SYMM= 0
##$S_DEV= 0
##$TDeff= 65536
##$TDoff= 0
##$TI= <>
##$TILT= no
##$TM1= 0
##$TM2= 0
##$TOPLEV= 0
##$USERP1= <user>
##$USERP2= <user>
##$USERP3= <user>
##$USERP4= <user>
##$USERP5= <user>
##$WDW= 1
##$XDIM= 131072
##$YMAX_p= 413664196
##$YMIN_p= -133401134
##$CURPLOT= <Network HP LaserJet P1505>
##$CURPRIN= <$Network HP LaserJet P1505>
##$DFORMAT= <normdp>
##$LAYOUT= <+/1D_H.xwp>
##$LFORMAT= <normlp>
##$PFORMAT= <normpl>
##$SURQMSG= 1
$$ End of Bruker specific parameters
$$ ---------------------------------
##NTUPLES= NMR SPECTRUM
##VAR_NAME=  FREQUENCY,     SPECTRUM/REAL,   SPECTRUM/IMAG
##SYMBOL=    X,             R,               I
##VAR_TYPE=  INDEPENDENT,   DEPENDENT,       DEPENDENT
##VAR_FORM=  AFFN,          ASDF,            ASDF
##VAR_DIM=   131072,        131072,          131072
##UNITS=     HZ,            ARBITRARY UNITS, ARBITRARY UNITS
##FACTOR=    0.0627417313425165, 1,          1
##FIRST=     8223.62146879498, 2875,         -73954
##LAST=      0,             4730,            -73742
##MIN=       0,             -133401134,      0
##MAX=       8223.62146879498, 413664196,    0
$$ Real data points
##PAGE= N=1
##DATA TABLE= (X++(R..R)), XYDATA
$$ [...]
67623 65081 65185 66046 67082 68606 71106 74609 78269 80509 80310 78463 76696 75611 74647 74002 74836 76979
67607 76979 78177 76847 74326 73123 73937 75622 77138 78116 78177 77163 75810 75126 75401 76593 78972 82338
67591 82338 85349 86921 87713 88942 90326 90671 90028 89537 89299 88177 85999 84473 85360 88727 93250 97259
67575 97259 99408 99472 98775 98848 99535 99408 98062 96704 96263 96246 96042 96131 97260 99299 101549 103476 104637 104636
67557 104636 103627 102229 100653 98611 96313 94593 93730 93193 92960 93929 96363 99026 100724 101751 102774
67542 102774 103201 101887 99032 96273 95060 95626 97197 98505 98514 97447 96790 97555 98957 99561 99216 98898 98924
67525 98924 98466 96856 94430 91911 89617 87425 85052 82394 80042 79239 80599 83015 84591 84705 84411
67510 84411 84781 85670 86345 86562 86604 86771 87240 88010 88636 88437 87413 86628 87146 88665 89672 89116 87507 86113
67492 86113 85345 84549 83431 82949 84126 86394 88108 88690 89100 89841 89694 87417 83867 81180 80187 79860 79205
67475 79205 78449 78130 78170 78338 78739 79218 78920 77199 74647 72662 72128 72892 74349 76177 78507 81541 84941
67458 84941 87636 88566 87726 86241 85314 85352 86094 87126 88092 88751 89075 89144 89021 89073 90207 92956 96246 98012
67440 98012 97559 96490 96611 97604 97666 95961 93385 91134 89591 88696 88450 88737 89401 90802 93618 97734 101871
67423 101871 104652 105581 104787 102577 99764 97771 97541 98516 99309 99261 98824 98660 98954 99557 100152 100279 99755 99080
67405 99080 98799 98398 96657 93494 90696 90053 91203 92117 91676 90919 91508 93668 96198 98158 99798 101686
67389 101686 103538 104453 104191 103637 103746 104389 104624 103966 102948 102518 103308 105511 108879 112583 115572 117429
67373 117429 118548 119215 119003 117575 115588 114019 112922 111713 110477 109867 109582 108247 105477 102946 102289
67358 102289 102695 101989 99787 98009 97972 98431 97355 94620 91855 90295 90027 91086 93844 97919 101748 103978
67342 103978 104802 105440 106740 108686 110721 111978 111607 109613 107112 105155 103654 102235 101722 103458 107067
67327 107067 110212 111149 110494 109774 109369 108908 108770 109692 111240 112138 112172 112526 113988 116010 117868 119601 121255
67310 121255 122177 121967 121472 122025 124013 126722 129104 130174 129309 126977 124769 123867 123782 123388 122786 123088 124524
67293 124524 126049 127065 128388 130952 134323 137117 138336 137804 135898 133513 131918 131937 133391 135714 138769
67278 138769 142581 146578 149802 151732 152332 151468 149066 145904 143421 142253 141468 139727 136924 134278 133004
67263 133004 133262 134363 135591 136705 137836 139143 140748 143028 146525 151036 154967 156397 155169 153225
67249 153225 152275 151681 149625 146074 143362 143507 145982 148764 150770 152408 154270 156456 159056 162192 165229
67234 165229 166809 166253 164404 162620 161415 160662 160566 161502 163052 164189 164653 165268 166436 167111 166046 163689
67218 163689 161971 162237 164078 166174 167653 168404 168683 168754 168607 167896 166606 165803 167012 170475 174632 177808
67202 177808 179783 181169 182020 182037 181664 181729 182081 181736 180505 179418 179258 179727 180442 181765 183968 186387 188094
67185 188094 188859 188910 188378 187505 186718 185906 184414 182466 181654 182905 184740 184938 183541 182745 184027 186850 190232
67168 190232 193998 198019 201613 204382 206575 207965 207549 205312 203322 203820 206636 209529 210780 210432 209297
67153 209297 207996 207261 208140 211115 215289 218935 220809 220815 219647 218123 216875 216334 216666 217699 219132 220902
67137 220902 223080 225319 226885 227623 228522 230688 233996 237369 240156 242356 243660 243455 242101 241121 241526
67122 241526 242796 244087 245504 247342 248948 249593 250003 251690 254771 257524 258348 257393 256062 255618 256450 258065
67106 258065 259535 260406 261234 262730 264511 265503 265783 267066 270795 276361 281814 285833 288298 289378 289092
67091 289092 287872 286742 286446 286722 286797 286423 286220 287132 289694 293558 297488 300057 300804 300712 301174 302539 304098
67074 304098 305489 307339 310074 312726 313791 313113 312140 312205 313257 314480 315546 316775 318494 320755 323639
67059 323639 327406 332156 337336 341763 344474 345735 346834 348659 350890 353074 355764 359552 363374 365236
67045 365236 364810 364047 364776 366892 369463 372313 375565 378673 381040 382896 384545 385519 385535 385558 386658 388412
67029 388412 389774 390912 392664 394688 396022 397252 400097 404531 408376 410502 412563 416379 421194 425078
67015 425078 427878 431055 435220 439578 443591 447617 451705 455090 457307 458797 459933 460421 460362 461113 464078
67000 464078 468912 473923 478303 483004 488879 494804 498661 499932 500206 500944 501858 502258 503059 506219 512379
66985 512379 520070 527354 533487 538846 544039 549394 554748 559392 562588 564342 565471 566986 569766 574433
66971 574433 580753 587193 592024 595055 597613 600780 604621 609163 614819 621288 627285 632279 637490 644034
66957 644034 650971 656566 660999 666307 673660 682024 689731 696206 701700 706393 710507 714732 719785 725739
66943 725739 732246 739160 746483 753991 761439 769162 777887 787713 797653 806664 814931 823610 833160 842568
66929 842568 850614 857483 864501 872546 881461 890823 900436 910002 919321 929112 940589 953576 965993
66916 965993 976182 985143 995433 1008301 1023001 1038609 1055086 1072276 1089136 1104767 1119607 1134830
66904 1134830 1150766 1166497 1181049 1194693 1209014 1225652 1244856 1265315 1285592 1305700 1326952
66893 1326952 1350223 1374662 1398332 1419980 1440113 1460549 1483119 1508702 1537102 1567370 1598088
66882 1598088 1627820 1656049 1683774 1712670 1743437 1775435 1807994 1841315 1875668 1910579 1945610
66871 1945610 1981416 2019067 2058731 2099933 2142673 2187079 2232180 2276546 2320456 2366069 2414783
66860 2414783 2465537 2516473 2567229 2618642 2671115 2724592 2779584 2836784 2895716 2955164 3015150
66849 3015150 3077319 3142769 3210429 3278301 3345619 3413001 3480923 3549129 3617524 3686674 3756945
66838 3756945 3827761 3898373 3969107 4041116 4114716 4188471 4260275 4329155 4395714 4461005 4525440
66827 4525440 4588841 4651111 4712446 4772804 4831280 4886112 4935616 4979331 5018211 5053443 5085141
66816 5085141 5112483 5134901 5152494 5165167 5172172 5173059 5168581 5159896 5147143 5129577 5106986 5080042
66804 5080042 5049036 5013254 4972217 4926859 4878632 4827832 4773601 4715373 4653512 4588595 4521084
66793 4521084 4451855 4382096 4312045 4240548 4166500 4090293 4013239 3936169 3859436 3783857 3710341
66782 3710341 3638423 3566241 3492602 3418434 3345683 3275271 3206655 3138965 3071813 3005107 2938745
66771 2938745 2872754 2807452 2743362 2681162 2621708 2565644 2512597 2460889 2408572 2355162 2302225
66760 2302225 2251833 2204415 2158620 2113325 2069046 2026831 1986553 1947225 1908499 1870570 1832783
66749 1832783 1793924 1754365 1716495 1682026 1649867 1617735 1585059 1553089 1522682 1493415 1464833
66738 1464833 1437186 1410503 1383886 1356291 1327581 1298513 1270054 1242844 1216954 1192078 1168163
66727 1168163 1145758 1125326 1106373 1087738 1068683 1049224 1029570 1009849 990344 971396 953036
66716 953036 935225 918315 902651 887784 872805 857479 842444 828435 816011 805684 797082 788020
66704 788020 776018 761256 746685 734467 723669 712396 700667 689562 678626 666342 652876
66693 652876 640338 629991 620995 612489 605173 599663 594478 587185 577081 565533 553934 542549 531482
66680 531482 521545 513519 507213 501882 497130 492761 488027 481863 474108 465888 458363 451454 444236 436370
66666 436370 428560 421650 415841 410943 406851 403342 399815 395762 391448 387695 384873 382386 379272 375171
66652 375171 370576 366222 362327 358415 353814 348288 342309 336852 332875 330626 329236 327215 323684 319080
66638 319080 314433 310195 306152 302213 298607 295256 291660 287665 283807 280660 278260 276348 274587 272326
66624 272326 268901 264685 261285 260025 260615 261703 262150 261257 258572 254491 250558 247986 246116 243390 239623
66609 239623 236035 233103 229890 225884 222089 219487 217679 216040 215237 216227 218287 219428 218768 217437 216940
66594 216940 217451 218003 217696 216351 214314 211880 208883 204949 200378 196483 194433 193805 192808 190131 186202
66579 186202 182539 180200 179006 178037 176784 175855 176397 178545 180743 181109 179341 176738 174497 172742 171193
66564 171193 169881 168844 167903 167209 167365 168443 169436 169260 167817 165590 162823 159828 157440 156126 155066
66549 155066 153278 151371 150775 151238 150616 147760 144215 142072 141202 139866 137417 135010 133778 133527 133434 133109
66533 133109 132642 132220 132024 132125 132338 132522 132962 133950 135031 135268 134376 132997 131678 130203 128266 126229 124772
66516 124772 124146 124177 124644 125229 125343 124454 122516 119910 117230 115277 114778 115660 116891 117471 117318 116789 115804
66499 115804 114081 111961 110212 109123 108543 108678 109882 111445 111632 109546 106259 103425 101416 99598 97883
66484 97883 96817 96262 95218 93404 92086 92697 95248 98827 103065 108015 112715 115174 114403 111702 109148
66469 109148 107305 105216 102366 99630 98081 97782 98143 98711 98988 98140 95861 93293 92097 92491 92983 92357
66453 92357 91241 91197 92737 94843 96196 96320 95550 94513 93911 94384 96035 97958 98660 97359 94906 93015
66437 93015 92419 92119 90821 88760 87447 87753 89005 90090 90602 90502 89538 87834 86525 86789 88319 89608
66421 89608 89768 89223 88533 87462 85723 83952 83203 83722 84776 85583 86085 86873 88585 91221 93804 94970
66405 94970 94172 92142 89939 87844 85553 83196 81602 81566 83232 86132 89348 91607 91814 89916 87164
66390 87164 85260 85107 86216 87096 86416 84095 81289 79107 77534 76058 75043 75570 77628 79393 79115 77289
66374 77289 76070 76737 78667 80825 83081 85408 86679 85547 82428 79557 78753 79839 81616 83482 85324
66359 85324 86465 86029 84403 83195 83320 83994 84171 84121 84717 85761 86171 85676 85237 85595 86296 86483 85902 84698
66341 84698 82887 80666 78798 78008 78089 78075 77315 76047 74997 74651 74874 75091 74916 74763 75641 78173 81887
66324 81887 85534 87917 88447 87460 86309 86606 88701 90985 91284 89031 85712 83142 81790 80957 80184 79921
66308 79921 80741 82274 83393 83452 82928 82524 82074 80970 79510 78928 79849 81511 82990 84418 86267 87977
66292 87977 88293 86860 84628 82625 80998 79373 77550 75665 74132 73498 73845 74238 73376 71086 68728 67835
66276 67835 68679 70404 72185 73848 75579 77424 79123 80323 80941 81295 81685 81849 81131 79320 77101 75519
66260 75519 75101 75625 76613 77857 79400 81075 82256 82351 81548 80660 80033 79073 77268 75284 74364 74819 75842
66243 75842 76786 77902 79560 81372 82483 82403 81324 79975 79345 80092 81899 83631 84331 83914 82939 82149 82273
66226 82273 83634 85609 86906 86793 85763 84735 83973 83080 81706 79848 77797 76167 75713 76627 78185 79457
66210 79457 80151 80423 80222 79499 78968 79854 82513 85790 88246 89796 91526 93770 94999 93392 89407 85915
66194 85915 85259 86791 88063 88075 88159 89619 91659 92336 90838 88114 85724 84750 85374 86673 86949 85014 81365
66177 81365 77707 75383 74677 75464 77699 80916 83772 84854 84101 83152 83952 86802 89826 90546 88146 84131
66161 84131 80855 79594 80086 81509 83365 85316 86594 86163 83844 81054 79815 80807 82782 84218 85032
66146 85032 86113 87737 89354 90703 92070 93338 93785 93160 92134 91388 91034 91208 92274 93979 95328 95943
66130 95943 96682 98175 99524 99329 97424 94746 92090 89893 88693 88744 89482 90260 91296 93061 95136 96685
66114 96685 97712 98795 99836 100239 100197 100534 101206 101225 100360 99796 100594 102406 104200 105499 106373 106826 106749 106165
66096 106165 105201 104092 103265 102947 102698 101891 100718 100084 100473 101559 102931 104395 105428 105376 104610 104755 107144
66079 107144 111449 116063 119336 120348 119265 117316 115726 114366 112148 109027 106643 106403 107759 109132
66065 109132 109752 109713 108894 107011 104505 102411 101251 100687 100217 99708 99326 99471 100658 102975 105729 108041
66049 108041 109645 110707 111199 111063 110830 111356 112903 115069 117625 120775 124282 126999 127850 127120 126191 125828
66033 125828 125112 122565 118345 114763 114162 116597 120126 123138 125536 127669 129227 129854 130072 130755 132002
66018 132002 133293 134450 135739 137025 137500 136430 133971 131312 130120 131372 134254 136467 136236 133917 131284
66003 131284 129585 128834 128603 128543 128084 126552 123965 121210 119161 118050 117871 118760 120578 122571 123870 124138
65987 124138 123457 121994 120312 119729 121605 126029 131524 136267 139397 141027 141478 140978 140003 139237 138971 138933
65971 138933 138967 139440 140541 141662 142181 142617 144114 146795 149495 151343 152659 153920 154798 154985 155162 156213
65955 156213 157960 159681 161455 163880 166594 168318 168535 168119 167983 168115 168476 169859 172889 176633 179225
65940 179225 179889 179666 180028 181256 182492 183085 183527 184957 187981 192181 196778 201345 205640 209149 211357
65925 211357 212440 213115 213781 214296 214672 215377 216632 217920 218593 218511 217646 215550 211935 207648 204324 202890
65909 202890 202752 202474 200869 197469 192586 187259 182746 179604 177348 175248 173290 172028 171536 170868 168783
65894 168783 165024 160804 157977 157605 159343 162300 166228 171402 177302 182278 185186 187005 189962 195068
65880 195068 201255 207042 212158 217016 221339 224230 225443 225897 226818 228756 231451 234311 236989 239613 242297
65865 242297 244394 244812 243551 242388 243219 245926 248747 250669 252515 255535 259842 264668 269365 273704 277711
65850 277711 281700 285917 289832 292432 293778 295576 299341 304341 308245 309642 309205 308458 308242 308522 308844
65835 308844 308550 307067 304625 302482 301844 302369 302079 299077 293323 286544 280458 275436 270916 266449 261830
65820 261830 256648 250644 244461 239215 235184 231663 228259 225378 223060 220339 216591 212809 210548 209996
65806 209996 209872 208971 207004 204253 201335 199232 198587 198765 198318 196562 194101 191752 189739 188226 187843 188962
65790 188962 190832 192152 192582 193190 195102 197950 200091 200511 200025 200187 201360 202664 203721 205356 208066
65775 208066 210830 212336 212760 213333 214559 215884 216976 218267 220086 222092 223784 224999 225799 226442 227545
65760 227545 229763 233272 237927 243721 250385 256796 261701 265111 268170 271539 274715 277089 278756 279960
65746 279960 280550 280393 279673 278360 276054 272865 269822 267887 266921 266018 264404 261729 258036 253957 250494
65731 250494 248087 246193 244113 241840 239733 237816 235931 234299 233408 233485 234378 235689 236787 237049 236489 235968
65715 235968 236513 238653 242421 247452 252806 257280 260439 262974 265705 268684 271586 274331 276684 277804
65701 277804 277033 274801 271946 268394 263396 257082 250911 246352 243651 242087 240882 239696 238682 238447 239819
65686 239819 243395 249262 257059 266201 276148 286537 296985 306867 315850 324820 335576 348962 363654
65673 363654 377348 388672 397252 402521 403778 401445 397021 391401 384205 375285 365879 357296 348989 338974
65659 338974 326209 311890 298194 286141 274922 263256 251233 240580 232803 227284 221823 215199
65647 215199 208448 203191 199441 196000 192531 190072 189312 189372 188744 186810 183966 180888 178262 176801 176691
65632 176691 177125 177013 176207 175570 175801 176743 177932 179245 180770 182456 184341 186761 189899 193187 195619 196801
65616 196801 197509 199064 202194 206611 211778 217866 225480 234342 242891 249984 256674 265321 276860 289952
65602 289952 303162 316854 332134 348836 365713 382123 398329 414252 429153 442623 454804
65591 454804 465342 473159 477871 480712 483384 486490 489627 492506 495191 497344 498051 496749 494134 491785
65577 491785 490784 490724 490178 488030 483984 477866 469154 457717 444377 429971 414361 397340 380152
65564 380152 364693 350957 336623 319898 301910 285509 272331 261771 252286 242852 233340 224270
65552 224270 216347 209977 205164 201776 199548 197800 195741 193155 190306 187149 183458 179869 177683 177028
65538 177028 176253 174007 171095 169216 168608 168162 167419 167063 167555 168544 169794 171528 173503 174826 175248 175940
65522 175940 178338 182630 187795 192741 197016 200748 204402 208527 213418 218995 225068 231662 238979 247151
65508 247151 256101 265632 275688 286589 298903 312984 328535 344498 359220 371121 379778 386412
65496 386412 392676 398798 403404 405280 404419 401009 394430 384233 371466 357900 344246 330107 315500
65483 315500 301331 288267 276090 264409 253333 243197 234143 226176 219190 212970 207547 203394 200704
65470 200704 198715 196419 193717 191028 188044 184091 179767 176854 176131 176391 176214 175601 175011 173847 171166
65455 171166 167406 164143 162243 161205 160321 159543 159020 158566 157906 156967 155623 153622 151054 148577 146858 145968
65439 145968 145647 145912 147019 148854 150756 152193 153353 154782 156484 157652 157322 155256 152305 150112 150180
65424 150180 152659 156061 158713 160561 162823 165729 167661 167342 166020 166250 168778 171803 173280 172831 171214
65409 171214 169172 167363 166431 166259 165647 163585 160614 158349 157787 158490 159233 159008 157511 155204 153006 151685
65393 151685 151326 151374 151165 150488 149809 149843 150754 151879 152569 153130 154400 156475 158510 159955 161292 163183 165439
65376 165439 167349 168581 169178 168990 167916 166770 167217 170325 175287 179874 182314 182723 182648 183242 184108 184078 182825
65359 182825 181304 180592 180704 180680 179677 177902 176500 176391 177152 177461 176863 176555 177810 180219 182468 184465
65343 184465 187318 191102 194128 195009 194255 192986 191272 188918 186993 186940 188354 189130 188178 186981 187915 191664
65327 191664 196779 201378 204739 207210 208967 209374 207944 205651 204415 204983 206143 206629 206993 208533 210884
65312 210884 212146 211475 210251 210242 211702 213954 216837 220551 224587 227922 230330 232746 236174 240658 245332
65297 245332 249079 251268 252296 253503 256024 259706 263650 267810 273296 280627 288328 294028 296698 297248
65283 297248 297157 297244 297650 298061 297671 295671 292253 288603 285531 282583 278916 274498 269876 265245 260485 255791
65267 255791 251512 247547 243559 239558 235506 230552 223704 215493 208147 203640 202034 201900 201863 201486 201191
65252 201191 201642 202862 203825 203386 201647 199817 198544 197080 194422 190650 186683 183251 180567 178588 177013
65237 177013 175272 173002 170469 168276 166826 166197 166225 166583 167095 168045 169674 171321 171718 170451 168496 166958
65221 166958 165918 164956 164123 163755 163834 164184 164826 165492 165297 163753 161845 161238 162497 164766 167034 168864 169903
65204 169903 169629 168027 165895 163958 162047 159625 156991 155474 156249 159182 163060 166789 169964 172328 173391
65189 173391 173114 172367 171850 170899 168462 165215 163488 164644 167510 169936 171096 171601 172193 173037 173810 173973
65173 173973 173411 173083 174157 176176 177199 176400 175197 174818 174082 171185 166692 162942 161015 160053 159355 159297
65157 159297 160089 161254 162655 164565 166394 166751 165357 163648 162795 162164 160431 157460 154398 152509 152352
65142 152352 153546 154977 155775 156328 157723 160079 162082 162338 160484 156990 152833 149579 148657 149949 151847
65127 151847 153119 154006 155155 156507 157838 159532 162001 164810 167062 168274 168506 168129 167802 168053 168540 168357
65111 168357 167342 166143 164619 161427 156245 151404 149911 152190 155995 159260 161778 164010 165610 165859
65097 165859 164926 163960 164042 165425 167705 170417 173218 175678 177407 178677 180511 183637 187629 191680 195902
65082 195902 200945 206567 211742 216314 221216 226676 231532 235037 238066 241540 244860 247302 249969 254608
65068 254608 260765 265831 268056 268268 268333 269052 270015 270634 270728 270502 270211 269608 267879 264639 260824 257828 255827
65051 255827 253821 251438 249630 249179 249368 248897 247522 245986 244613 242821 240101 236783 233439 229870 225096
65036 225096 218342 209864 200980 193607 189483 188945 190115 190055 187574 184433 182967 183011 182447 180539 178926 178956
65020 178956 179784 180083 180127 180741 181344 180762 179299 178287 177922 177230 176005 175094 174666 173897 172708 172249 173032 174058
65002 174058 174564 175284 176928 178505 178481 176976 175586 175358 175955 176685 177329 177908 178403 178944 179771 180784 181372
64985 181372 180874 179126 176655 174381 172974 172340 171881 171175 170206 169047 167904 167527 168854 171848 175192 177505
64969 177505 178394 177976 176193 173415 171160 171039 172855 174623 174699 173248 171410 169728 167949 165909 163892
64954 163892 162071 160131 157747 155278 153685 153711 155320 158023 161509 165593 169643 172655 174235 175252 177063
64939 177063 180181 184023 187879 191616 195185 197842 198452 196795 194242 192716 192888 193775 194250 194512 195566
64924 195566 197567 199530 200764 201737 203117 204685 205929 207142 208969 211091 212431 212813 213354 214695 215716
64909 215716 214849 212141 209113 206826 205130 203850 203628 204865 206513 206828 205229 202759 200631 198955 197143
64894 197143 195102 193447 192586 192098 191280 190085 189119 188652 188045 186497 184107 181701 179688 177774 175932 174900
64878 174900 175126 175776 175556 174285 172925 172239 172219 172796 174172 176190 178101 179327 179895 179955 179507 178895 178874 179685
64860 179685 180608 180894 180619 180265 180017 179866 179815 179559 178630 177302 176538 176561 176402 175604 175199 175919 176562 175724 174296
64841 174296 174335 175971 177510 178480 180233 183217 185951 187744 190397 195758 203031 210067 216191 222196 228442
64826 228442 234513 240262 245697 250195 253198 255552 258871 263623 268865 273705 277916 281279 283561 285225
64812 285225 286966 288286 287601 284158 279004 273706 268972 264866 261500 258882 256701 254803 253455 252759 252289
64797 252289 251747 251502 251950 252754 253189 252938 252058 250366 247381 242807 236775 229718 222308 215401 209700 205407
64781 205407 202331 200235 199004 198513 198460 198291 197459 195964 194566 193995 193935 193265 191462 189175 187148 185224
64765 185224 183010 181015 180215 180614 181086 180826 180312 180572 182050 184512 187498 190326 192042 192142 191523 192140
64749 192140 195304 200339 205061 207630 207963 207480 207625 208689 210056 211360 213101 215945 219724 223435 226181
64734 226181 227805 228633 229043 229409 230078 231039 231858 232247 232482 232943 233461 233559 233176 232624 231910 230791 229547 228971
64716 228971 229258 229581 229263 228748 228779 229197 229491 230154 232253 235523 238079 238695 238577 240108 244255 249929 255544
64699 255544 260374 264410 267699 270235 272118 273616 275259 277852 281970 287243 292497 296873 300551 304215
64685 304215 308179 312440 317232 322839 328726 333407 335593 335322 333742 331955 330311 328730 327327 326424 325897
64670 325897 324693 321373 315496 308473 302663 299372 297872 296551 294731 292980 291783 290537 288278 285133
64656 285133 282544 281790 282559 283329 283280 283375 285149 288679 292432 295231 297520 300140 302560 303416 302730 302438 304196
64639 304196 307354 309734 310020 308651 306546 303780 299918 295207 290757 287391 284698 281588 277597 273196
64625 273196 268872 264543 260147 256158 252919 249966 246693 243360 240595 238201 235560 233115 232215 233201 234877
64610 234877 236460 238750 242465 246435 248718 248885 248029 247035 246245 246595 249521 255241 262032 267608 270635
64595 270635 270942 269293 267215 266105 265894 265184 263091 260296 257914 256144 254696 253899 254436 256225 258361
64580 258361 260171 261731 263212 264261 264318 263449 262701 263550 266726 271441 276066 279869 283871 289593 297058
64565 297058 304541 310378 314590 318372 322298 325553 327042 326766 325666 324264 321948 317774 311724 304985
64551 304985 299121 294968 292102 289368 286197 283330 281754 281053 279666 277030 274398 272840 271495 268997
64537 268997 265917 264163 264138 264070 262460 259834 257565 256142 255276 254805 254803 255430 257078 259938 263134 265348 266825
64520 266825 269563 274674 280584 284956 287508 289768 292866 296994 302444 309461 317113 323866 329560 335597
64506 335597 342777 349984 355506 358846 360799 362432 364373 366544 368178 368400 366950 364054 359874 354785
64492 354785 349884 346139 342940 338678 333154 328275 325699 324736 323508 321448 319590 318810 318816 318819 318323 317169
64476 317169 315541 314098 313554 313801 313749 312236 309049 305002 301166 297986 295041 291710 288057 284830 282458
64461 282458 280402 277860 274896 272398 271005 270523 270459 270593 270656 269885 267564 264188 261669 261983 265585 271188
64445 271188 276801 280856 282757 283101 283382 284835 287220 289170 289841 289656 289304 288971 289098 290905 295060 300388
64429 300388 304984 308198 310475 311875 312416 313618 317642 324298 330663 334490 336509 338430 340359 341760
64415 341760 343601 347391 352574 356853 359071 360154 361061 361467 360899 359798 358685 357327 355466 353671 352825
64400 352825 353361 355522 359704 365883 373141 380342 387017 393220 399043 404826 411322 418854 426579 433418
64386 433418 439675 446876 455729 465033 473263 480836 490055 502796 518855 536835 555991 576557 598574
64373 598574 621413 644903 670315 699538 733424 771362 812358 856050 902732 952868 1006745
64362 1006745 1064295 1125141 1188863 1255170 1323667 1393670 1464480 1535564 1606115 1674709 1739999
64351 1739999 1801564 1859392 1912370 1957896 1993329 2017460 2030451 2032908 2025463 2008885 1983902 1950666
64339 1950666 1908672 1857582 1798354 1733532 1666019 1597284 1527007 1454706 1381365 1308973 1238768
64328 1238768 1170616 1104102 1039598 978105 920559 867400 818413 773001 731075 693581 661474
64317 661474 634200 609945 587421 566495 546989 528159 510123 494617 483013 474037 464628 452960
64305 452960 439763 426783 414926 404129 394121 384684 375478 366161 356831 348250 341413 336673 333288
64292 333288 330167 326971 323961 320829 316639 311382 306661 303981 302999 302398 301898 302175 303123 303631 303295 303106
64276 303106 303967 305531 307001 308198 309159 309386 308290 306085 303623 301493 299652 297755 295536 293026 290592
64261 290592 288517 286588 284543 282958 282923 284547 286523 287754 288770 290781 293790 296502 297942 298385 298710
64246 298710 299405 300222 300308 298775 295678 292380 290322 289398 288116 285421 281764 278222 275207 272332 269066
64231 269066 265125 260559 255844 251783 249091 248093 248668 250042 250781 249749 247450 245831 246330 248490 250843
64216 250843 252548 253631 254257 254725 255894 258523 262155 265558 268511 272199 277367 282908 287032 289381 291173
64201 291173 293405 295549 296119 294189 290460 287148 286659 289809 295202 300583 304832 308467 312425 316832 320968
64186 320968 324021 325686 326178 325775 324461 322397 320872 322053 326872 333406 338471 341063 343367 348077 355682
64171 355682 365011 375399 387019 399474 411516 422523 433340 445167 458160 471565 484798 497801
64159 497801 510556 522744 533995 544175 553174 560436 564864 565480 562311 556436 548938 539843 528390
64146 528390 514293 498424 482152 466274 450771 435457 420618 406905 394666 383536 372843
64135 372843 362426 352807 344413 336927 329763 323033 317585 313966 311665 309573 307082 304628 303283 303813
64121 303813 306070 309299 313001 317153 321425 324758 326439 327370 329249 332200 334067 332640 328000 322024
64107 322024 316124 310359 304480 298644 292821 286436 279322 272548 267556 264551 262306 259582 256284 253100
64093 253100 250485 248381 246715 245702 245568 246227 247272 248085 247945 246464 244288 243040 244013 246911 250376
64078 250376 253728 257454 261640 264730 264910 262612 260647 261394 264433 267304 268080 266611 263752 260417 257563
64063 257563 256209 256748 258458 260166 261336 262184 262905 263316 263322 263274 263595 264348 265429 266968 269251 272439 276683
64046 276683 282381 289761 298093 305728 311259 314493 316092 316573 316159 315502 315920 318371 322403 326505 329606
64031 329606 332022 334922 339103 344351 349648 353626 355004 353200 348941 344043 340033 336746 332528 326145
64017 326145 318353 311248 306075 302130 297965 293138 288275 283862 279816 276225 273661 272399 271933 271661 271539
64002 271539 271677 271841 271973 272735 274842 278036 281222 283351 283709 282003 279110 277303 278442 281942 285523
63987 285523 287895 289502 290689 290835 289935 289561 291120 294112 297080 299450 301498 303413 305448 308123 311032
63972 311032 312295 310739 308050 307080 308320 309913 311051 313215 317300 321347 322506 320289 316773 314271
63958 314271 313853 315564 318848 322729 326365 329692 333193 336969 340225 341686 340579 337407 333731 330987
63944 330987 329563 329220 329943 331735 333966 335950 338132 341548 345856 349112 350167 350333 351812 355074 358647
63929 358647 361113 362554 364227 367473 372832 379776 387323 395011 402987 411115 418617 424943 430529 436465
63915 436465 444037 454705 469554 488128 508515 529213 550194 571609 592537 612114 631126 651144
63903 651144 672576 694877 718334 744075 772332 802151 833315 867385 906293 950770 1000635
63892 1000635 1055806 1116390 1182500 1254735 1334550 1423636 1523109 1633608 1755801 1890290 2037035
63881 2037035 2195104 2362965 2538926 2721498 2909434 3101385 3295551 3489662 3680908
63872 3680908 3865395 4037936 4193117 4326888 4436948 4521761 4579801 4609881 4611712 4585840
63862 4585840 4533215 4454840 4351603 4224624 4076206 3910374 3731930 3544929 3352504 3157940
63852 3157940 2964901 2776282 2593614 2418204 2252220 2097871 1955693 1824321 1702092
63843 1702092 1588656 1485090 1392759 1311998 1241607 1179457 1123614 1072990 1027113 985612 948039
63832 948039 914034 883535 856680 833249 812044 791296 770317 750649 734876 724042 716767 711014
63820 711014 706058 702296 699827 698173 697373 698582 703097 710979 720870 731307 742187 754934 771166
63807 771166 791267 814228 838632 863456 888165 912639 937178 962090 986990 1010927 1033514
63796 1033514 1055431 1077110 1097211 1113257 1123981 1130342 1133892 1134864 1132684 1127772 1121403 1113434 1101432
63783 1101432 1083216 1059682 1033906 1007699 980337 950771 919580 887991 856253 824198 792621
63772 792621 762699 734327 706369 678602 652324 628725 607529 587506 567596 547292 526686
63761 526686 506580 488075 471746 457497 445178 434682 425334 416018 406324 397070 389278 383158 378326
63748 378326 374371 370758 366746 362087 357497 353840 350983 347906 343878 339133 334391 329940 325235 319457
63734 319457 312697 306423 302254 300100 298080 294603 290109 286366 284348 283274 281559 278399 274508 271438
63720 271438 270103 269930 269601 268450 266627 264163 260766 256783 253469 251788 251656 252819 255567 259674 263350
63705 263350 264573 263382 261763 261205 261305 260999 260177 259459 258947 258014 256236 254056 252360 251613 251508 251395 251013
63688 251013 250782 251381 253057 255392 257751 259926 262333 265463 269035 271893 272999 272555 271915 272404 274483
63673 274483 277985 282655 288142 293733 298475 301811 304211 307108 311788 317969 323808 327792 330368 333158
63659 333158 336967 341467 346560 352640 359105 363928 365662 365151 364465 364751 365852 367396 369208 370876 371776
63644 371776 371556 370139 367558 364336 361555 359762 358097 355312 351555 348387 347120 347777 349532 351426 352783
63629 352783 353713 355286 358467 362866 367249 371240 375587 380540 385010 387996 390157 393184 397879 403441
63615 403441 408461 412007 413720 413524 411788 409706 409066 411115 415465 420289 423783 425437 425962 426367 427322
63600 427322 429014 431090 432765 433337 432687 431185 429227 426970 424323 421015 416884 412319 408220 405393 404235
63585 404235 404997 407740 411747 415661 418856 422208 426858 432636 438496 444228 450837 459205 469132 479836
63571 479836 490752 501603 512074 521735 530337 538413 547626 559970 576099 594852 614763 635567
63559 635567 657777 681599 707143 734988 765454 797838 831564 867577 907118 949456 992536
63548 992536 1035857 1080852 1128113 1176211 1224135 1273090 1324355 1376383 1425295 1467586 1501330
63537 1501330 1525669 1540594 1546992 1546043 1538840 1527105 1513216 1498373 1481446 1460941 1437424 1412407
63525 1412407 1385394 1354196 1318586 1281741 1247083 1214983 1183668 1152348 1122153 1094595 1070440
63514 1070440 1049945 1032941 1018460 1005264 993299 984061 979009 978006 979765 983496 989485 998100 1008841
63501 1008841 1020698 1033159 1046626 1061931 1079606 1099518 1121245 1144910 1171413 1201316 1233536
63490 1233536 1266043 1298345 1332523 1370892 1413152 1457066 1501876 1549549 1601832 1656895 1709765
63479 1709765 1755618 1791881 1817630 1832418 1836434 1831147 1818830 1801313 1779583 1754696 1728432 1702448
63467 1702448 1676882 1650366 1621436 1589397 1553851 1514388 1471416 1426582 1381480 1336253 1290284
63456 1290284 1243933 1198582 1155092 1113289 1073173 1035675 1001712 971104 942799 915782 889690
63445 889690 865086 843144 824428 807941 792138 776908 763585 752799 743392 733914 724225 714998
63433 714998 706582 699049 692451 686081 678296 668236 657383 648399 642550 638996 636322 633825 631427 629171
63419 629171 627120 625346 624098 624126 626323 630452 634639 636865 636777 635544 634280 633284 632398 631244 629247 626230
63403 626230 622913 620057 617248 613364 608252 603133 599279 596956 595728 594991 594095 592762 591705 592200 594730
63388 594730 598613 603233 609038 616900 626959 638523 650909 664132 678966 696415 716828 739479
63376 739479 763402 788667 816447 847731 882472 920084 960072 1001661 1043175 1082411 1117820
63365 1117820 1149389 1178642 1207839 1238750 1271815 1306526 1342654 1380892 1422297 1467570 1517097
63354 1517097 1571293 1630224 1692724 1756125 1817085 1872765 1921248 1961009 1990438 2008371 2015100
63343 2015100 2012398 2002292 1986197 1965333 1941235 1915055 1886650 1855078 1819770 1780616 1737284
63332 1737284 1689615 1638816 1587205 1536348 1486281 1437000 1389880 1346808 1308473 1274307 1243826
63321 1243826 1217260 1194945 1176859 1162783 1152347 1144750 1139060 1135224 1134454 1138134 1146271 1157374 1170004
63308 1170004 1184196 1201028 1220932 1243027 1266411 1291712 1320774 1354840 1393404 1434817 1477641
63297 1477641 1521481 1566988 1615202 1666515 1720076 1774369 1828312 1881382 1932644 1980045 2020792
63286 2020792 2052186 2072272 2080489 2077995 2066863 2048599 2023855 1993712 1960502 1926635 1892868 1858207
63274 1858207 1821285 1781374 1738369 1692472 1643997 1593180 1540231 1485830 1431419 1378656 1328763
63263 1328763 1282671 1241349 1205274 1173731 1145365 1119530 1096453 1076031 1057222 1038892 1020557
63252 1020557 1001783 981556 959041 934682 909749 884929 860095 835550 812631 792571 775179
63241 775179 759120 743274 727399 711688 696229 680984 665998 651494 637932 625828 615231
63230 615231 605389 595347 585004 575283 567097 560413 554492 548693 542692 536153 528734 520544 512266 504522
63216 504522 497198 489662 481785 474558 469298 466155 463802 460928 457697 455147 453433 451512 448624 445205
63202 445205 441884 438376 434027 428877 423477 418109 412932 408495 405227 402681 400249 398452 398451 400065 401388
63187 401388 400803 398650 396433 395074 394485 394202 393707 392506 390615 388826 387974 388026 388241 388012 387143 385567 383403
63170 383403 381294 380177 380537 382087 384138 386059 387420 387999 387772 386866 385667 385071 386169 389036 391970
63155 391970 392734 390985 389000 389443 392648 396682 399940 402844 406645 411362 415884 419851 424234 429620 434830
63140 434830 438204 439861 441776 445624 451371 458127 465571 474032 483570 493548 503146 512155 521426 532432
63126 532432 546021 561468 577040 591543 604957 617747 630271 642982 656330 669983 682877
63115 682877 694629 706201 718407 730420 740834 749780 758715 768158 776840 783341 787357 788870 787165
63102 787165 781593 772629 761391 748607 734750 720521 706133 690535 672614 653238 634989 619566
63090 619566 606383 594083 582470 572317 564010 557275 551748 547023 542332 537092 531760 527528 525011
63077 525011 523621 522224 520083 517278 514649 513260 513480 514612 515776 516894 518390 520401 523135 527684
63063 527684 535228 545234 555561 564715 573093 581623 590386 599302 609108 620463 632657 644341 655279
63050 655279 666485 678864 692531 707261 722673 738034 752630 766543 780638 795811 812513
63039 812513 830576 849021 866417 882069 896543 910454 923298 934182 943093 950470 956003 958914
63027 958914 958991 956184 949672 938865 925118 910781 896418 880533 862355 843311 825182 808278
63015 808278 792144 776715 761964 747597 733953 722122 712284 702989 692998 682845 673659 665473
63003 665473 657776 650807 645088 640422 636557 634169 633962 635323 637060 638973 641485 644249 646417 648046
62989 648046 650003 652785 656610 662229 670166 679181 687057 693192 699247 706925 716106 725408 733604 740202
62975 740202 745598 751015 757574 765251 773298 781476 789865 797690 803776 808450 813600 820249 827134 832286
62961 832286 835054 836042 836234 837007 839966 845482 851888 857056 860500 863276 866370 870110 874791 880916 888892
62946 888892 899130 912294 928652 947195 966050 983939 1000926 1017887 1035654 1054476 1073723
62935 1073723 1092083 1108551 1123311 1137415 1151748 1166672 1182265 1198051 1212362 1222887 1228588
62924 1228588 1230813 1231918 1232697 1231467 1225791 1214796 1199669 1182047 1162371 1140025 1114783 1087561
62912 1087561 1059595 1031271 1002247 972722 944117 918132 895154 873933 853072 832637 813871
62901 813871 797393 782354 767790 754151 742660 733354 724714 715406 705521 695635 685510 674582
62889 674582 663267 652689 643022 633061 621897 610326 599861 590633 581174 570477 559531 550196
62877 550196 542922 536364 529218 521678 514755 508866 503650 498785 494243 489943 485774 481939 478711 475840
62863 475840 472770 469532 466859 465257 464530 464519 465817 469132 474078 479003 482209 483377 483867 485603 489443
62848 489443 494559 499416 503286 506745 510953 516710 523911 531587 538694 545385 553235 563546 575534 586854
62834 586854 595915 602956 608908 614169 618794 622937 626497 628963 630103 630226 629232 625977 619227 608956
62820 608956 596421 583471 572025 563122 555607 546494 533860 519108 505471 494691 486120 478595
62808 478595 471685 465123 458597 452628 448353 445732 442934 438385 432599 427209 422924 419486 416960 415655
62794 415655 414857 413038 409827 406761 405369 405194 404523 402767 401131 400811 401281 400898 398850 395936 393457 391872
62778 391872 390798 389948 389609 390216 391691 393333 394222 393830 392495 391298 391144 391780 392037 391302 390523 391262 393786
62761 393786 396579 397892 397320 395564 393196 390381 387650 385982 385688 385811 385183 383762 382441 381841 381895 382361
62745 382361 382980 383102 382058 380323 379628 381255 384472 387208 388141 387737 387315 387545 387973 387733 386590 385252
62729 385252 384649 384940 385460 385613 385423 385058 384346 383226 382302 382300 383097 383961 384851 386842 390879 396390 401498 404597
62711 404597 405678 406238 407966 411343 415363 418594 420431 421321 422085 423268 424924 426524 427123 426141 424098
62696 424098 422187 420987 420025 418791 417583 416966 416814 416474 415628 414345 412424 409407 405433 401454 398222
62681 398222 395504 392708 390037 388472 388658 390206 392191 394066 395936 398080 400331 401970 402427 402296 403383
62666 403383 407147 412984 418575 422240 424416 426427 428520 430233 432503 437859 447693 460104 471583 480648
62652 480648 488916 498655 510329 522883 535544 548513 562368 577690 595255 615813 639408 665334
62640 665334 692966 722298 753551 786667 821455 857794 895253 932781 969225 1003951 1036545
62629 1036545 1066199 1092071 1114165 1133019 1148280 1158405 1162272 1160481 1154351 1143954 1127934 1105285
62617 1105285 1076800 1044743 1011470 978280 945073 911011 875822 840497 806479 774409 744096
62606 744096 715464 688745 663779 640032 617654 597685 580623 565360 550246 534850 520015
62595 520015 506526 494529 484124 475606 468722 462303 455177 447277 439537 432785 427031 421857 417187
62582 417187 413382 410508 407839 404447 400332 396533 393998 392651 391728 390613 389032 387022 385303 385211 387161
62567 387161 389188 388202 383323 377244 373575 373311 374617 375504 375538 375003 373799 372002 370635 370749 371784 371711
62551 371711 369069 364456 359952 357514 357927 360496 363220 363837 361641 358312 356308 356235 356357 354925 352381
62536 352381 350714 350977 352291 353380 354273 355913 358475 360889 362136 362400 362515 362679 362246 360746 358590 356640
62520 356640 355392 354773 354456 354194 353923 353710 353544 353209 352513 351564 350560 349447 348216 347464 347933 349280 350055
62503 350055 349380 348041 347319 347257 346874 345722 344440 343994 345123 348290 353226 358538 362635 365148 366736 367660
62487 367660 367615 367017 367226 368944 371402 373691 375983 378773 381834 384813 388191 392635 397784 402591 406603
62472 406603 410128 413397 416331 419028 421800 424907 428798 434279 441669 450062 458355 466900 477208 489867
62458 489867 503569 516520 528247 539891 553320 570070 590430 613160 636451 659349 681928
62447 681928 704206 725627 745800 764937 783024 799113 812057 821662 828503 832706 833507 830220 823501
62434 823501 815397 808013 802008 796545 790878 785670 782294 781039 780808 780821 781884 785520 792250 801278 811503
62419 811503 822327 833743 846250 860646 877309 895587 914263 932637 950631 967698 982258
62408 982258 992772 999190 1002813 1004631 1004039 999296 989089 973674 954664 933793 911698 887872 861888
62395 861888 834521 807293 780962 755074 729248 704262 681220 660148 640323 621763 605330
62384 605330 591237 578554 566585 555754 546451 537907 529245 521040 514676 510367 506950 503626 500808
62371 500808 498956 497585 496070 494685 494010 493567 491846 487917 482651 478060 475401 474064 472346 469231 465185
62356 465185 461295 458085 455396 453031 451120 449994 449926 450789 451766 451940 451632 452604 456139 461179 465229 467012
62340 467012 467449 468166 469986 472967 476805 480708 483806 486330 489777 495290 502422 510045 517888 526327 535082
62325 535082 543243 550778 559231 570398 584531 600140 615516 630311 645654 662905 682460 703746
62313 703746 726095 749367 773887 800183 828809 860120 894127 930748 970100 1012345 1057503
62302 1057503 1105898 1158681 1217303 1282364 1353377 1429632 1510735 1596392 1686334 1780568 1878861
62291 1878861 1979626 2079863 2176445 2266768 2347974 2416573 2469682 2506264 2526683 2531613 2521920
62280 2521920 2498950 2464110 2418439 2363027 2299303 2228306 2150454 2066977 1980994 1896026 1813805
62269 1813805 1734624 1659454 1590162 1527477 1470145 1416604 1366479 1319978 1276873 1236748 1199361
62258 1199361 1163999 1129261 1094406 1060410 1028753 999531 971625 944512 918920 895731 875103
62247 875103 856786 840394 824956 809018 791935 774808 759569 747185 737200 728894 722268 717624
62235 717624 714570 711933 708684 704790 701215 699257 699740 702358 705581 707602 707938 708177 710760 716826 725497
62220 725497 735314 745962 758124 771957 786470 800666 814778 829932 846881 865616 886105 908689
62208 908689 933561 960515 989676 1022018 1058462 1098755 1142128 1189143 1241981 1302287 1369195
62197 1369195 1440128 1513495 1590197 1672547 1761996 1857712 1956857 2056045 2152628 2244548 2328966
62186 2328966 2401647 2458525 2498067 2521602 2531143 2527274 2509333 2477075 2431489 2374235 2306974 2231493
62174 2231493 2150018 2064867 1977744 1889476 1800553 1711961 1625595 1543736 1467917 1398175 1333517
62163 1333517 1273171 1217286 1166496 1121141 1081087 1045917 1014873 986809 960739 936481 914326
62152 914326 894053 874745 855746 837343 820188 804512 790216 777356 766090 756492 748899 744010
62140 744010 741923 741323 740528 739432 739641 742502 747696 754071 761078 768863 777532 787056 797607 809367
62126 809367 822183 836033 851702 870336 892217 916420 941717 967291 992522 1016769 1039925
62115 1039925 1062793 1086449 1111399 1137816 1166310 1197836 1232818 1271155 1313304 1360589 1413751
62104 1413751 1471739 1532786 1596457 1663698 1734816 1808181 1880916 1949845 2011461 2062215 2099910
62093 2099910 2124420 2136443 2136191 2123947 2101102 2069433 2029717 1982103 1927583 1867931 1804362 1737514
62081 1737514 1668870 1600945 1535647 1473332 1413725 1356904 1303248 1253462 1208913 1170808 1138573
62070 1138573 1110146 1084442 1062430 1045114 1031637 1020402 1011112 1004603 1001368 1001417 1004991 1012148 1021794
62057 1021794 1031978 1040900 1047056 1049283 1047881 1045248 1044056 1044992 1047256 1050697 1055659 1060738 1062637 1059163
62043 1059163 1051337 1041851 1032395 1023233 1014546 1007104 1001835 999297 999464 1001709 1005280 1009950 1015946 1023183
62029 1023183 1031197 1040097 1050878 1064234 1079453 1095093 1110560 1126536 1143997 1163348 1184563 1207736
62017 1207736 1233159 1260952 1290861 1322648 1356616 1393522 1433777 1476956 1522288 1569476 1618853
62006 1618853 1670966 1726280 1784948 1846315 1908791 1970830 2032117 2093316 2154379 2213290 2266514
61995 2266514 2310593 2343472 2364690 2374491 2372951 2360318 2337949 2307806 2270374 2224034 2167641 2103156
61983 2103156 2034476 1964039 1892118 1819269 1747486 1678225 1611066 1545657 1483866 1428340 1379398
61972 1379398 1334760 1292357 1252259 1215674 1183081 1153811 1126837 1101390 1076994 1053437 1030984
61961 1030984 1010521 993127 979129 967591 957024 946559 936061 925290 913713 901353 889051
61950 889051 877464 866358 855423 845233 836724 830117 825114 821961 821459 823752 827596 831102 833064
61937 833064 833705 834400 836526 840143 843871 846273 847158 847270 847077 846456 845291 843559 840772 836080 829219 820856
61921 820856 811773 802182 792096 781834 771734 761769 751988 743169 736457 732232 729487 726400 721530
61908 721530 714813 707660 701866 698055 695297 692463 689592 687326 685299 682112 677269 672298 669304 668813
61894 668813 669719 671023 672903 676103 680878 686668 692482 697781 703427 711430 723002 736905 750574 762954
61880 762954 775442 789949 807118 826812 849166 874170 900798 927536 953567 978918 1003785
61869 1003785 1028276 1052383 1075686 1097523 1117904 1137598 1156694 1173807 1187513 1197740 1204754
61858 1204754 1207688 1205759 1200473 1194792 1189959 1184699 1177851 1170349 1164077 1160001 1158077 1158041 1159779 1163738
61844 1163738 1171258 1183409 1199090 1215366 1230173 1243545 1255634 1264993 1269945 1270624 1268290 1263198 1254405
61831 1254405 1241344 1224486 1204545 1181963 1157255 1131212 1104636 1078152 1052147 1026800 1002516
61820 1002516 980309 960959 943539 925771 906501 887006 869166 853186 837985 823060 808845
61809 808845 795758 784048 774287 766971 761783 758068 755847 755643 757687 762078 769281 779480 791853
61796 791853 805536 821021 839481 860982 884626 910344 939125 971300 1005950 1042465 1081408
61785 1081408 1123126 1166481 1209757 1252116 1293390 1332987 1369903 1403455 1433118 1457631 1475076
61774 1475076 1484366 1486506 1484030 1479087 1472223 1463134 1452280 1441206 1431377 1423421 1417850 1415797 1418409
61761 1418409 1425856 1437252 1451032 1465024 1476971 1485863 1492192 1496057 1495529 1487871 1471922 1448329 1417984
61748 1417984 1381627 1340677 1296954 1251357 1204106 1156419 1110627 1068215 1028873 991835 957046
61737 957046 924563 893962 865087 838547 814802 793420 773746 755697 739466 725119 712833
61726 712833 702847 694737 687460 680409 673724 667404 661174 655633 652299 651680 652240 652050 650666 648612 646013
61711 646013 642791 639459 636645 634344 632546 631902 632703 633795 633709 632491 631310 630634 630035 629442 629193 628948
61695 628948 627951 626605 626461 628259 631097 633977 637038 640593 643943 646177 647608 649365 651599 652973 652183
61680 652183 649609 647124 646341 647252 648530 648936 648208 646790 645309 644397 644410 644894 644792 643693 642547 642714 644676
61663 644676 648166 652927 658490 663601 666966 668562 669380 669953 670145 670375 671850 675105 679224 683030 686327
61648 686327 689437 692264 694472 696041 696978 696780 694784 690775 684999 678073 671305 666377 663874 662482 660438
61633 660438 657512 654719 652397 649759 646529 643906 643241 644424 646289 648127 649971 651605 652226 651430 649967
61618 649967 649115 649567 651268 654052 657814 661978 665378 667068 667050 665888 663843 660879 657463 654773 653737
61603 653737 654091 654708 654927 655361 657263 660959 664972 667023 666195 663934 662541 662826 663780 664404 665035 666507
61587 666507 668711 670644 671638 672087 673129 675948 680985 687367 693429 698307 702715 707535 712142 715081 716210
61572 716210 716937 718082 718686 717550 715029 712391 710071 707473 704118 700022 695139 689417 683457 678269 674133
61557 674133 670359 666426 662799 660239 658722 657362 655158 651656 647117 642237 637496 632762 627729 622602
61543 622602 617834 613212 607880 601481 594710 588351 582295 575919 569016 561861 554694 547603 540681 533897
61529 533897 527090 520429 514584 510030 506503 503594 501390 499878 498135 495059 490861 486980 484387 482657
61515 482657 480839 478522 475886 473395 471764 471516 472169 472451 471835 471276 471758 472583 472092 470084 468537 469382
61499 469382 472088 474210 474299 473503 473909 475852 477692 478057 477268 476185 474711 472387 469828 468306 468064 468160
61483 468160 468045 468211 468966 469680 469848 469979 470672 471463 471425 470468 469324 468533 468138 468103 468307 468310 467777 467043 466598 466106
61463 466106 464591 461765 458597 456313 455186 454493 453455 451966 450341 448349 444691 438023 428755 419462
61449 419462 412938 409913 408797 407324 404224 399891 396061 394479 395176 396288 396169 395293 395244 396229 396802 396042
61433 396042 394744 394092 394266 394915 395880 396684 396266 394294 392115 391251 391378 390935 389463 387994 387027 385567 382847
61416 382847 379992 378991 380525 383583 386849 389639 391675 392883 393618 394449 395409 395882 395456 394453 393417
61401 393417 392536 391943 392072 393054 394003 393731 392334 391391 392179 394115 395445 395246 394203 393511 393578 394020 394476 394986
61383 394986 395730 396774 398088 399496 400575 400953 400925 401450 403224 406022 409384 413650 419497 426326 432009
61368 432009 434891 435591 436211 438104 441033 444142 446790 448526 449226 449628 450982 453731 457051 459959 462335
61353 462335 464440 466073 466854 467003 467169 467520 467431 466074 463141 459198 455595 453739 454020 455458 456536 456313
61337 456313 454810 452783 451247 450690 450436 449221 446647 443475 440276 436766 433143 431049 431943 435060 438285
61322 438285 440679 442746 444384 444377 442408 440119 439354 440413 442765 446363 451130 455987 459619 461882 463446
61307 463446 464414 464383 463723 463676 465007 467325 469856 472169 474096 475754 477854 481187 485576 490048 494342 499321
61291 499321 505361 511307 516068 520665 527416 537136 548206 558512 567299 574806 581168 586468 591196 595824
61277 595824 600257 604401 608856 614186 619712 623963 626416 627937 629274 629910 628951 626599 624231 623191 623779
61262 623779 625199 626308 626746 627381 629206 631717 633030 631954 629331 626883 625382 624574 624339 625023 626771
61247 626771 629275 632152 635189 638447 642570 648504 656256 664319 671179 677007 682848 688426 692120 693216
61233 693216 692767 691691 689351 684979 679577 675152 672405 670201 667210 663277 659130 655462 652437 649707
61219 649707 646803 643839 641770 641599 643323 646090 649432 653912 660319 668558 677681 686920 696248 705870
61205 705870 715507 724613 733125 741440 749553 756843 763139 769522 777352 786657 796189 805047 813515 822121
61191 822121 830553 837978 844115 849587 855318 861616 867620 871708 872863 871701 869766 867924 866031 864062
61177 864062 862568 861705 860817 859625 858908 859084 858858 856510 852199 847731 844054 840337 836003 832398 831359
61162 831359 832726 834467 835228 835666 836874 838379 838679 837466 836291 836719 838648 841008 843424 846232 849182
61147 849182 851306 852338 853294 855109 857351 858879 859308 859178 858972 858645 858135 857903 858865 861976 867732 875941
61131 875941 886126 898227 912500 928460 944366 958287 969598 979183 988385 998077 1008469 1019329
61119 1019329 1030308 1041250 1052022 1061962 1069892 1075102 1078113 1080191 1082384 1085294 1089307 1094352 1099602
61106 1099602 1103995 1107058 1108797 1108973 1107126 1103363 1098598 1093820 1089436 1085351 1081188 1076247 1069671 1061199
61092 1061199 1051777 1043127 1036378 1031035 1025538 1019198 1013432 1010491 1010779 1011943 1010965 1006769 1000435 993401
61078 993401 986291 979249 972452 965752 958276 949070 938368 927983 919951 914663 910680 906674 903063 901092
61064 901092 900856 901328 902236 904532 908706 913993 919913 927310 936854 947641 958645 970833 986458 1006480
61050 1006480 1029717 1054198 1078385 1101568 1124279 1148139 1174285 1202111 1230376 1258889 1287851
61039 1287851 1316000 1340986 1361565 1378243 1391956 1403495 1413993 1424256 1433332 1439197 1441137 1440217
61027 1440217 1437345 1432506 1426152 1419533 1412916 1405056 1395322 1385042 1375841 1367758 1359882 1351816 1343653 1335392
61013 1335392 1327102 1318888 1310333 1301163 1292845 1288006 1287461 1289247 1291537 1294978 1300976 1309237 1318596 1329194
60999 1329194 1342069 1357394 1374746 1394589 1417982 1445141 1475526 1508924 1545338 1584286 1625314
60988 1625314 1668734 1714942 1763713 1815243 1871031 1932438 1999124 2070307 2146956 2231237 2324157
60977 2324157 2424974 2532547 2646271 2766516 2895362 3036042 3190244 3356642 3533228
60968 3533228 3719915 3917467 4125521 4343920 4574847 4821409 5085296 5368400 5675440
60959 5675440 6011878 6380195 6781597 7220750 7705531 8243256 8841757 9514034 10277166
60950 10277166 11146370 12134708 13258340 14536035 15983709 17617991 19467601 21572869
60942 21572869 23972597 26703833 29811199 33309687 37076489 40767228 43896762 46081410
60934 46081410 47248816 47630939 47577327 47392002 47306435 47493498 47992438 48592879 48855264
60925 48855264 48328203 46799740 44373814 41344872 38022439 34642343 31365080 28292152
60917 28292152 25472127 22913918 20610800 18554168 16730692 15119871 13700549 12455146
60909 12455146 11365269 10408685 9564296 8816614 8152855 7559228 7023249 6537115 6095935
60900 6095935 5694574 5328627 4996414 4697112 4427918 4185028 3965979 3768676 3589127
60891 3589127 3422431 3265528 3117230 2976332 2841813 2714481 2596354 2488062 2388113 2294685
60881 2294685 2206929 2124578 2047426 1975293 1907637 1843328 1781619 1723051 1668362 1616682 1565942
60870 1565942 1515136 1465119 1416844 1369706 1322292 1274391 1227725 1184623 1146082 1111147 1078088
60859 1078088 1045935 1014693 984526 955496 927989 902453 878467 854998 831992 810947 793269
60848 793269 778650 765566 752850 740232 727811 715634 703655 692065 681931 675093 672296 671527
60836 671527 669700 666404 664438 665907 669501 672765 675300 677944 680126 680371 678833 677132 675829 674035
60822 674035 671514 669115 666767 662982 657187 651011 646244 642676 639012 635048 631865 630181 629372 628012
60808 628012 625098 620894 616694 613406 610378 606230 600860 595878 592811 591534 590734 589211 586364 582155
60794 582155 577219 572564 568686 565286 562219 560235 560176 561743 563669 565038 565926 566594 566598 565162 562493 560203
60778 560203 559928 561599 563613 564855 565848 567534 569689 571370 572473 573817 575929 578683 582012 585808 589005
60763 589005 589951 588272 585482 583167 581303 579069 576671 575411 576124 578241 580361 581282 580529 578380 575638
60748 575638 573168 571393 570020 568091 564510 558961 552436 546538 542047 538266 533842 528002 521023 513736
60734 513736 506712 499840 492761 485801 480179 476890 475518 474614 473190 471398 469798 468486 467031 464899
60720 464899 461915 458687 456422 455847 456433 457245 458363 460647 464099 467484 469930 472047 474857 478258 481166
60705 481166 482854 483646 484533 486539 490124 494789 499440 503495 507510 512517 518976 526633 535100 544182 553640
60690 553640 562872 570936 577072 581457 585364 590161 596082 602209 607524 611567 614177 615174 614446 611994 607914
60675 607914 602788 597831 593937 590651 586893 582596 578560 574580 569115 561487 553304 546698 541889 537477
60661 537477 532529 527241 521886 516260 510251 504152 498261 492778 488108 484712 482478 480636 478447 475868
60647 475868 473650 472925 474429 477780 481679 485010 487489 489195 490161 490947 492884 496786 501649 505606 508233
60632 508233 511058 515623 521844 528666 535514 542344 548647 553385 556183 557995 560139 562987 566124 569606
60618 569606 574213 580043 585517 588602 588916 587941 587135 586498 585216 583187 581524 581716 584446 589018 593878
60603 593878 597849 600807 603115 604963 606782 609773 614974 621932 629270 636637 645115 655564 667638 680746
60589 680746 694934 710222 725955 741589 757615 775134 794792 816255 838165 858633 876691
60578 876691 893497 911121 929787 947305 961532 972330 980760 987705 993820 999330 1002813 1001537 994264
60565 994264 982749 969522 955411 940385 925288 910938 896625 881578 867158 855552 846745 838798
60553 838798 830820 823631 817504 811340 804464 797492 790886 784124 776829 769455 762375 755322 748009 740367
60539 740367 732134 723286 714754 707389 700377 692237 683366 675872 670685 666651 662908 660187 659040 658599
60525 658599 658150 658324 659602 661152 662447 664727 669438 676190 683601 691298 699887 709806 721492 735882
60511 735882 753313 772591 792584 814251 839632 869042 900549 932072 962719 991989 1018705
60500 1018705 1040959 1056516 1063632 1062479 1055652 1046281 1035661 1023611 1010946 1000256 993949 992552
60488 992552 995466 1002567 1014426 1031517 1053845 1081073 1112574 1147560 1185467 1225834 1267295 1306915
60476 1306915 1341242 1368321 1388185 1401088 1405933 1401460 1388976 1372665 1356488 1341523 1327140 1313814
60464 1313814 1303168 1295532 1289324 1283288 1277908 1273873 1270592 1267384 1265120 1265314 1268154 1272750 1279108 1288694
60450 1288694 1302948 1322123 1345650 1372893 1403485 1437660 1476671 1522455 1576661 1640089 1712975
60439 1712975 1795429 1887453 1988629 2097853 2213444 2333721 2457243 2581885 2703581 2816647
60429 2816647 2915633 2996170 3053845 3083576 3081554 3047568 2984481 2895617 2783830 2653233 2510606
60418 2510606 2364002 2219805 2081235 1949346 1824930 1709183 1602814 1505296 1415706 1334061
60408 1334061 1261013 1196141 1137468 1083122 1032830 987279 946704 910709 878935 851014 826171
60397 826171 803511 782601 763335 745478 728779 713313 699356 687169 677000 668682 660963 652148
60385 652148 642047 632498 625185 619700 614632 609736 605763 602757 600062 597771 596630 596309 595095 591727
60371 591727 586544 580518 574153 567683 561433 555388 549096 542463 536139 530789 526449 522853 519830 517113
60357 517113 514370 511715 509651 508123 506200 503129 499353 496048 493979 493112 493042 493309 493469 493289 493002 493209
60341 493209 494386 496285 497785 497532 495082 491375 487937 485726 484888 485237 486499 488283 490272 492312 493859
60326 493859 493656 490842 486538 483667 484651 489351 495247 499401 500382 498760 496110 493667 491991 491541 492654
60311 492654 494677 496056 496122 496178 497874 500972 503744 505227 505912 506480 507189 508482 510715 512908 513258 511616
60295 511616 510206 510847 512388 512123 509298 506084 505124 506954 509877 511769 511827 510989 510853 512144 514236 516106
60279 516106 517455 518802 520781 523650 527335 531691 536587 541608 545799 548167 548808 549164 550687 553556 557157
60264 557157 561309 566053 570675 574262 577384 581943 588885 597098 605131 613020 621699 631472 642022 653394
60250 653394 665981 679800 694670 711105 730452 754091 782721 816089 852804 890440 926294
60239 926294 958192 984535 1003807 1014332 1014606 1003967 983339 955397 923584 890575 857625 825197
60227 825197 793841 764559 738744 717623 701113 687362 674269 661538 650396 641282 632991 624553
60215 624553 616728 610847 607033 604357 601968 599151 595050 589440 583387 578202 574110 570766 568471 567668
60201 567668 567564 566584 564262 561567 559258 556986 554396 552057 550712 550182 549620 548488 546860 545037 543224
60186 543224 541505 540008 539199 539926 542814 547447 552367 556105 558239 559506 560905 562576 563574 562980 561221
60171 561221 559923 560470 563164 567781 573945 580445 585149 586682 585864 584641 583988 583682 583699 584557 586276 588091
60155 588091 589432 590414 591240 591970 592979 594710 596787 598336 599524 601779 605921 610962 615473 619435 623851
60140 623851 628970 633795 637278 639400 641109 643544 647133 651092 653972 654988 654579 653560 652306 651200
60126 651200 651201 652976 655708 657713 658361 658635 659592 660984 661826 661770 661362 661185 661227 660988 659908 657728 654841 652370
60108 652370 651638 653344 657128 661792 665879 668298 668927 668787 669391 671554 674811 678077 680748 682932 684694
60093 684694 685443 684290 680996 676599 673115 672377 674665 678332 681096 681944 681719 681894 683173 685357 687982
60078 687982 690600 692769 694355 695784 697600 699885 702477 705566 709458 713719 717126 718705 718578 717794 717680
60063 717680 719204 722256 725414 727095 727350 727962 730322 733698 736207 737158 737740 739542 743017 747488 752077
60048 752077 756422 760749 765335 769785 773102 774856 776060 778130 780891 782333 780730 776530 771724 767829
60034 767829 765015 762779 760640 758141 754934 751248 747986 746046 745663 746440 747764 749010 749700 749791 749786 750239
60018 750239 751034 751246 749795 746285 741232 735624 730337 726010 723210 722323 723066 724334 724812 723686 720744
60003 720744 716176 710634 705135 700214 695208 689057 681881 675011 669134 663187 655806 647418 640062 635202
59989 635202 632398 630205 627832 625623 624249 623771 623550 623015 622379 622425 623543 625234 626604 627069 626529 625346
59973 625346 624373 624574 626219 628697 631337 633924 636135 637223 636865 635773 634706 633343 630945 627725 624552
59958 624552 621597 618295 614536 610879 607584 604405 601342 598584 595740 592372 589443 588905 591212 594300
59944 594300 595671 594702 592467 590326 589319 589895 591281 591863 591022 589977 590045 590791 590798 589640 588147 587258 587555
59927 587555 589437 592672 596060 598455 599852 600708 600742 599556 598067 598006 599981 603120 606618 610410 614152
59912 614152 616791 617785 617998 618883 621232 624930 629237 633025 635432 636669 637743 639126 640228 640428 639996
59897 639996 639646 639687 639974 640238 640124 639363 638226 637318 636500 634594 630889 626615 624140 624640 627143 629845 631769
59880 631769 632852 633118 632389 630597 627764 623731 618613 613604 610460 609559 609174 607540 605133 603826 604155
59865 604155 604900 605442 606803 609628 612732 614809 616306 618190 620003 620992 622361 626094 631599 635758 636948
59850 636948 637150 639024 642403 644988 645556 645189 645744 648258 652590 657717 662293 665460 667210 667901 667732 666890
59834 666890 665688 664256 662573 661201 661372 663748 667504 671283 674863 679237 685132 691947 698223 702867
59820 702867 705947 708558 711927 716517 721982 727780 733413 738138 741174 742525 743103 743619 743850 743439 742876
59805 742876 743000 743919 745168 746661 748595 750538 751744 752628 754947 759769 765988 771786 777240 784426 794904
59790 794904 808102 822552 837590 852828 866506 875789 878981 876737 871085 864233 858480 855800 856239
59777 856239 857254 855645 849962 840492 827697 811957 794529 777261 761072 745638 730755 717015
59765 717015 704879 694072 684276 675539 667546 659352 650426 641360 633101 626188 621028 617879 615761 612399
59751 612399 606420 599189 593331 589725 586978 583732 580258 577523 575711 574376 573551 573852 575375 576839 576245
59736 576245 572616 567021 561584 557411 553819 549745 545497 542676 542477 544321 546135 545973 543635 540792 539278
59721 539278 539182 538983 537502 535066 532570 530231 527884 525880 524840 524747 524947 524888 524300 522904 520693 518374
59705 518374 516821 515946 514733 512570 510118 508664 508876 510294 511764 512415 512511 513333 515890 519799 523735 526878
59689 526878 529398 531645 533589 535348 537562 540631 543906 546277 547528 548517 549852 551008 551242 550942 551261
59674 551261 552413 553326 553491 554277 557266 561650 564607 564499 562500 560571 559012 557036 554865 553744 554066
59659 554066 554781 554995 555142 556102 557830 559458 560324 560415 559930 558839 556897 554034 550854 548724 548972 551716
59643 551716 555650 559228 562012 564731 568228 572694 577906 583837 590680 598297 605904 612463 617387 620845
59629 620845 623463 625780 627882 629459 630215 630254 629962 629568 629098 628845 629411 630805 631875 631277 629011 626467
59613 626467 624911 624378 624071 623306 621950 620472 619644 619651 619399 617409 613692 610060 608163 607804 607641 606899 605678
59596 605678 604067 601872 599128 596256 593718 591976 591690 593290 596294 599525 602237 604749 607776 611318
59582 611318 614442 616216 616701 616732 616561 615226 611782 606902 602414 599314 597087 595121 593768 593513 593984 594425
59566 594425 594535 594263 593569 593012 593747 596064 598580 599874 600324 601280 602922 604097 603948 602472 599631 595219
59550 595219 589784 584599 580449 577313 575272 574733 575454 576271 576205 575199 573608 571700 569857 568501 567493
59535 567493 566270 564820 563927 564230 565652 567797 570132 571689 571550 569972 568132 566445 564112 560833 557839
59520 557839 556392 556094 555594 554278 552322 549772 546755 544242 543196 542903 541343 537616 533119 529833 528140
59505 528140 527000 525751 524847 524769 524950 524349 522886 521803 522386 524632 527426 529787 531583 533188 534935 536992
59489 536992 539358 541817 544181 546704 549996 554494 560346 567808 577239 588453 600581 612942 625759
59476 625759 639742 655268 672289 690552 709136 725778 737489 742413 741074 735503 727299 716935
59464 716935 705074 693856 685930 682129 680833 679991 679075 678531 678226 677594 676918 677144 678407 679920 681392
59449 681392 683245 685067 685210 682812 679126 675890 673199 670029 665998 661360 655787 648681 640686 633596
59435 633596 628536 625146 622699 621010 619948 618973 617677 616207 614880 613969 614076 615903 619143 622305 624322
59420 624322 625855 628362 632276 636872 641656 647052 653587 661119 669111 677192 685014 691810 696508 698505
59406 698505 698350 697533 697324 697653 697357 695760 693834 693457 695758 700555 707152 714927 723069 730646 737515 744743
59390 744743 753592 764364 776705 790575 806143 822877 839561 855311 869830 882408 891452 895564
59378 895564 894767 890294 883469 875096 865488 854580 842291 829304 817171 806938 797727 787485 775456
59365 775456 763419 754055 748420 745483 743967 743998 746569 751736 758061 764218 770796 779866 792735 808811
59351 808811 827127 848462 874974 907224 941705 971613 990469 995718 989611 977129 963034 950411
59339 950411 941050 936191 936514 941690 950101 958680 963084 958878 943645 918391 886935 853821 822350
59326 822350 793787 767930 744506 724042 707092 692848 679453 665930 653093 642195 633614 627422
59314 627422 624123 623598 623969 622925 620138 617353 616184 616754 618283 619879 620681 620349 619635 619583 619929 619340 617465
59297 617465 615767 615828 617753 620809 624798 629983 636119 642289 647624 651962 656111 661629 669759 680304
59283 680304 691935 703794 716164 729344 742699 755450 767802 780505 793543 805947 816886
59272 816886 826551 835972 846082 856800 866860 874714 879710 882230 882864 881938 879774 876726 872772 867693
59258 867693 861892 856356 851513 846723 841326 835656 830667 827123 825477 825931 828099 831183 835049 840715
59244 840715 849296 860938 875195 891981 911648 934580 960897 989539 1016739 1036392 1043618 1038227
59232 1038227 1024013 1004939 983000 959497 936652 916948 901409 889279 879198 870320 862490 855726
59220 855726 849729 844001 838565 834334 832290 832227 832738 832709 832598 833904 837445 842442 847422 851855 856660 863117
59204 863117 871493 880859 889994 898214 905530 912328 918872 924849 929466 932202 933290 933261 932260 930167 926975
59189 926975 922539 916391 908626 900721 894494 890242 886712 882848 878540 873712 867986 861761 856517 853347
59175 853347 851880 851082 850311 849188 847405 845272 843694 843037 842770 842565 842690 842715 841079 836909 831353 826079
59159 826079 821297 816092 809720 801563 791052 779057 768364 760982 755627 749509 742044 734894 728726
59146 728726 722131 714042 705370 697647 691427 686541 682676 679250 675873 673244 672479 673199 673535 672375 670357
59131 670357 668242 665793 663029 661219 661507 663420 665748 668152 671028 674483 678280 682178 685542 687397
59117 687397 687837 688683 691610 696113 700420 703962 707659 712011 716403 720599 725597 732329 740402 748872 757623
59102 757623 767157 777298 786913 794923 801180 806377 811577 817826 825548 833939 841299 846466 849846 852760
59088 852760 855928 858974 861307 862908 864056 864665 864289 862770 860800 859743 860458 861928 861539 857529 851106
59073 851106 845254 841487 838826 836133 833928 833059 832955 832667 832862 835181 839853 845347 850458 855499 861264
59058 861264 867897 875101 882653 890429 898547 907615 918219 930081 942291 954298 966032 977326 987992
59045 987992 998224 1007915 1015945 1021508 1026072 1032368 1040909 1048903 1053349 1054045 1052978 1052098 1052672 1055518 1060164
59030 1060164 1064257 1065215 1062512 1057619 1052102 1046758 1042309 1039549 1038376 1037381 1034822 1029680 1021719 1011083
59016 1011083 998249 984189 970185 957156 944953 932412 918560 903980 890607 879890 871431
59005 871431 863653 855430 846688 837778 828847 819824 810654 801441 792512 784302 777106 771091 766558 763816
58991 763816 762510 761381 759096 755217 750176 744540 738773 733576 729761 727357 725186 721966 718035 715382
58977 715382 715538 717773 720054 721589 723436 726494 730080 733241 736480 741079 747305 754411 761935 769725
58963 769725 777037 783103 788615 795191 803080 810865 817887 825521 835189 846366 857587 868391 879058
58950 879058 889105 897425 903698 908639 912861 916303 918808 920615 922174 923741 925098 925503 924383 922412
58936 922412 921350 922236 924144 925390 925692 926334 928292 930890 932517 932331 930999 929888 929598 929423 928363 926390
58920 926390 924209 921959 918921 914618 909365 903613 897761 893024 891237 892783 895646 897711 899450 903035
58906 903035 909167 916211 922510 928176 934101 940250 945712 949982 953560 957380 961878 966538 970326 972699
58892 972699 974057 974987 975348 974588 972770 970578 968198 964805 959464 952214 944027 936000 928735 922215 915935
58877 915935 909229 901690 893468 885269 878093 872691 868958 865863 862160 857235 851257 844770 838474 833236
58863 833236 829736 827763 826091 823441 819684 815877 813041 811114 809366 807620 806460 806177 806210 806131 806692 809139
58847 809139 813732 819596 825888 832364 838903 845348 851964 859319 867545 876448 886381 898090 911263 924198
58833 924198 935518 945525 955276 965039 974444 983609 993249 1003781 1014940 1026100 1036607 1046181 1055447
58820 1055447 1065619 1076995 1088108 1097046 1103415 1108399 1112984 1116814 1118817 1118428 1115933 1111765 1105653
58807 1105653 1096749 1085035 1072438 1061656 1053435 1045664 1035810 1023756 1011529 1000688 990803 980407
58795 980407 968633 955748 942596 929811 917455 905368 893707 882794 872448 862029 851291
58784 851291 840589 830046 819252 808220 797845 788804 780691 772952 766034 760648 756344 751878 746837
58771 746837 742023 738232 735351 732624 729168 724383 718527 712918 708978 707054 706544 706883 707762 708572 708408
58756 708408 706856 704351 701712 699679 698768 699140 700508 702377 704246 705532 705779 705291 705098 705761 706555 706302
58740 706302 704566 701607 697728 693513 690363 689773 691850 694975 697018 696867 695153 693742 694022 695359 695855
58725 695855 694862 693823 694092 695120 695877 697029 700129 705193 710592 715164 719041 722517 725446 727851 729878
58710 729878 731082 730900 729805 728814 727832 725905 723282 721666 721826 722273 721110 718147 714466 710878 707794
58695 707794 705839 705476 706205 706924 707097 707180 708040 710194 713415 716947 720423 724594 730634 738442 746121 751552
58679 751552 754288 755805 758219 762921 770043 778858 788626 799054 809965 820974 831777 842365 852439
58666 852439 861147 868226 875165 884148 895609 907538 917438 924457 929553 934148 938867 943256 946637 949376
58652 949376 952917 958117 964114 969566 974438 979516 984562 988317 990271 991010 990556 987796 982240 975216 968426
58637 968426 961884 953916 942840 928321 911587 894606 878615 863270 847624 831737 816552 802341
58625 802341 788502 775132 763543 754572 747325 740352 733330 726807 720884 715022 708982 703335 699007
58612 699007 696423 694920 693139 690547 688530 689146 692718 697507 701941 706202 711229 717263 724076 731607
58598 731607 739222 744981 746989 745511 742852 740986 740000 739022 737973 737661 738268 738423 736407 732289 728263
58583 728263 726571 727466 729451 730911 730957 729388 726832 724641 723623 722883 720786 716915 712345 708263 705262
58568 705262 703651 703149 702403 700259 697704 697205 699736 703695 707029 709061 709896 709697 709426 710981 715417 721838
58552 721838 728761 735560 741875 746905 750532 754098 758623 762883 764662 763578 761538 760687 761936 765108
58538 765108 769208 772584 774083 774546 776314 780787 786834 791919 794514 795185 795611 796888 798923 801205 803652
58523 803652 806452 809598 813198 817895 824219 831681 839383 847444 856763 867240 877292 885666 892980 900995
58509 900995 910849 922234 933637 943245 950351 956219 962996 971830 982768 996249 1013208 1033310 1054352
58496 1054352 1074194 1092461 1109878 1126909 1143627 1160004 1175628 1189650 1201359 1210180 1215121 1215387
58484 1215387 1211747 1206122 1199551 1191770 1182980 1174291 1165861 1156386 1145346 1134043 1123206 1111323 1096897
58471 1096897 1080998 1065885 1052124 1038716 1025190 1011887 998850 986098 974582 965415 958512 953156
58459 953156 949382 947525 946961 946652 946597 947461 949132 950783 951949 952470 951866 949966 947719 946295 945839 946093
58443 946093 947436 949973 952445 953703 954761 957550 961891 965524 967219 968131 969710 971769 973290 974064 974890
58428 974890 976701 979726 983117 985626 987117 988984 992414 996941 1001696 1007255 1014757 1023717 1032467 1040634
58414 1040634 1049433 1059288 1068890 1077188 1084876 1093011 1101298 1108660 1114797 1120186 1124800 1127654 1127864 1125834
58400 1125834 1123052 1120576 1118041 1114718 1111369 1110062 1111899 1115898 1120565 1125355 1129823 1132615 1132744 1131171
58386 1131171 1129834 1129566 1130086 1131382 1133713 1136522 1138556 1139004 1137816 1135482 1133370 1133426 1136237 1140089 1143167
58371 1143167 1145980 1150131 1155575 1161037 1166622 1173873 1183216 1193298 1203104 1212896 1222751 1231944 1240491 1249787
58357 1249787 1260831 1272790 1283955 1293241 1300322 1305167 1308074 1309653 1310510 1311290 1312840 1315607 1318971 1321887
58343 1321887 1324055 1325791 1327122 1327935 1328713 1330254 1332990 1337417 1344448 1354022 1363925 1371583 1376876 1381756
58329 1381756 1387402 1393320 1399080 1405001 1410820 1415451 1418666 1421603 1424952 1427911 1429704 1431140 1433933 1439173
58315 1439173 1446979 1456882 1467901 1478737 1488606 1497947 1508071 1519973 1533278 1546519 1558899 1571579
58303 1571579 1586187 1602168 1617202 1630742 1645229 1662618 1681466 1699153 1715456 1731857 1748567
58292 1748567 1764660 1780444 1797309 1815461 1833844 1852124 1870809 1889624 1907582 1924570 1941224
58281 1941224 1957502 1973112 1989065 2007103 2027858 2051060 2076838 2104962 2133552 2160798 2187578
58270 2187578 2216262 2247265 2278879 2309981 2340569 2370136 2398072 2425481 2454023 2483103 2510667
58259 2510667 2536598 2562608 2588948 2614152 2638287 2663476 2690668 2718664 2746993 2777037 2809436
58248 2809436 2842892 2876506 2911132 2947504 2985028 3023190 3062441 3103228 3145779 3190879 3238989
58237 3238989 3288870 3339238 3391349 3447286 3506002 3564125 3620716 3678136 3738111 3800198 3864538
58226 3864538 3932653 4004765 4079416 4156555 4237932 4323637 4411252 4499318 4588932 4681470 4777759
58215 4777759 4879699 4989205 5104914 5223487 5344718 5471606 5604882 5741790 5881384
58206 5881384 6026664 6179834 6339574 6504705 6676545 6855748 7040823 7231846 7431848
58197 7431848 7642510 7862189 8090118 8328588 8578909 8839295 9109024 9390600 9685375
58188 9685375 9991311 10307926 10639497 10990209 11359854 11747389 12155258 12586904 13043146
58179 13043146 13524093 14031957 14569541 15138669 15741830 16381985 17059227 17771812 18522278
58170 18522278 19318133 20164775 21062978 22015716 23031962 24120625 25285986 26532248 27867223
58161 27867223 29298085 30828762 32465058 34217459 36095927 38107543 40262150 42574263
58153 42574263 45056690 47719420 50578118 53656589 56978321 60565362 64450732 68683639
58145 68683639 73318298 78407505 84011883 90204326 97059853 104654141 113080018 122452819
58137 122452819 132891176 144505411 157411520 171736989 187596754 205073278 224221399
58130 224221399 245056231 267495179 291288882 315952816 340651778 364081909 384554131
58123 384554131 400379649 410307977 413664196 410203342 400046101 383858095 362976589
58116 362976589 339165004 314121965 289139723 265070348 242429219 221469646 202246033
58109 202246033 184709002 168780098 154362310 141333504 129568626 118960633 109408376
58102 109408376 100801908 93035865 86025083 79694502 73965147 68762053 64026691 59711245
58094 59711245 55768549 52155881 48840316 45792157 42980206 40380116 37979555 35768025
58086 35768025 33728152 31842465 30100563 28492604 27002756 25616205 24326480 23128997
58078 23128997 22012718 20964550 19976942 19045179 18162192 17322289 16525738 15773696 15062190
58069 15062190 14386195 13745660 13142191 12573219 12034357 11524106 11041464 10582265 10142714
58060 10142714 9723561 9326222 8947631 8583243 8232340 7896149 7573492 7262486 6963977
58051 6963977 6679215 6406527 6144069 5893261 5655656 5429031 5210581 5001547 4804625
58042 4804625 4619014 4442045 4273705 4115569 3967027 3826311 3693465 3568724 3449924
58033 3449924 3335283 3226918 3127711 3036376 2949566 2867237 2791741 2722803 2657598 2595023 2535823
58022 2535823 2479119 2422709 2366715 2313329 2262984 2214030 2166125 2120775 2078433 2038007 1999318
58011 1999318 1963193 1928987 1894719 1859953 1826077 1793525 1761148 1728599 1697024 1666997 1637811
58000 1637811 1609229 1582086 1556693 1532218 1507847 1483219 1457782 1431166 1404160 1377945 1352611
57989 1352611 1327690 1303621 1281069 1259322 1237170 1215075 1194678 1176390 1159237 1142878 1127878
57978 1127878 1114007 1100189 1086350 1073526 1061728 1049344 1035243 1020207 1005709 992323 979804
57967 979804 967805 955935 943661 930580 916598 901896 886923 872078 857157 841764 826638
57956 826638 813624 803615 795437 787626 780312 774202 768632 762027 753720 744128 733733 723197 713828
57943 713828 706457 700208 693706 687086 681529 677211 673204 669233 666037 663830 661674 658648 654786 650783
57929 650783 647442 645290 644006 642400 639595 636014 632591 629471 626130 622340 618180 613586 608701 604265
57915 604265 600857 598079 595143 591751 587887 583389 578463 573958 570461 567729 565383 563011 559100 551623
57901 551623 541026 531223 525831 524303 523272 520682 516866 512575 508140 504227 501398 498984 495951 492634
57887 492634 490119 488350 486539 485073 485028 485939 486056 485062 484674 486073 488374 490354 492329 495519 500385 506187
57871 506187 511633 515777 518702 521258 523739 525354 525566 525031 524178 521849 516909 510403 504352 498992 493143
57856 493143 486885 481623 477479 472891 467204 461625 456924 451975 445432 437269 427893 417160 405290 393651
57842 393651 383671 375626 368994 363231 357854 352694 348367 345655 344226 342966 341596 340760 340397 339434 337495
57827 337495 335627 334888 335379 336914 339243 341217 341304 339683 338499 339235 341043 342472 343507 344894 346527
57812 346527 347623 347725 346649 344185 340678 337193 334444 332287 330782 330695 332144 333755 334120 333322 332143
57797 332143 330661 328683 326806 325895 325952 326547 327956 330957 335730 341635 347740 353032 356664 358655 359891
57782 359891 360925 361404 361139 360744 360448 359256 356367 352580 349227 346491 344053 342482 342269 342077 339919 336021
57766 336021 332663 330965 329616 327318 324687 322792 321343 319670 318418 318770 320529 322386 323864 325800
57752 325800 328832 332372 335206 336330 335132 331683 327079 322705 318746 314136 308399 302670 298162 294327
57738 294327 289725 284507 280807 280325 282308 284285 284184 281458 276871 271843 267656 264700 262481 260469 258684
57723 258684 257349 256442 255767 255075 253976 252328 250878 250761 252042 253591 254917 257133 261208 266078 269722
57708 269722 271696 273477 276492 280838 285791 290512 294107 295909 295998 295001 293379 291281 288767 285685 281792
57693 281792 277683 274914 274257 274353 273321 271211 269523 268621 267235 264570 261344 258473 256109 254319 253319
57678 253319 252597 251081 248693 246565 245276 244158 242886 242290 242735 242927 241535 239153 237677 238283 240727
57663 240727 243852 246009 245826 243544 241138 240382 241222 242536 243714 244781 245773 246814 248227 249765 250366
57648 250366 249489 248127 247742 248771 250910 254063 257886 261002 261941 260760 258872 257488 257029 257692 259505
57633 259505 261863 263903 265389 266587 267406 267465 266982 266831 267547 268783 269905 270760 271877 274152 278248 284089
57617 284089 291221 299860 311113 325767 343321 362661 383270 405347 429433 456665 488796 526799
57605 526799 569365 613291 654971 690742 716283 727345 722024 702080 671854 636104 598650 562049
57593 562049 527694 496068 467163 440943 417591 397340 380041 365113 352243 341801 333924 327401
57581 327401 320542 313350 307767 305185 304631 304146 303207 302824 303744 305425 306629 306434 304899 303150 302460 302971
57565 302971 303806 304543 305592 306753 306658 304526 301343 298294 295115 291364 288222 287230 287826 287977 287062 286415
57549 286415 287046 288505 290149 291947 293639 294570 294833 295380 296422 296798 295419 292467 288877 285596 283624
57534 283624 283594 284736 285303 284643 283941 284379 285502 286125 285971 285499 284745 283295 281156 278879 276917 275343 274071
57517 274071 273002 272072 271377 271116 271342 272011 273147 274551 275438 274959 273151 270866 268921 267870 268365 270647
57501 270647 273625 275649 276555 277962 281006 284753 287497 288763 289292 289755 290367 291348 292978 295378 298690
57486 298690 303017 307751 311480 313232 313546 313788 314833 316814 319590 322754 325636 328143 331330 336332 342792
57471 342792 349039 353812 357227 360135 363173 366523 370010 373258 376161 379349 383817 389951 397170 404659
57457 404659 412143 419742 427386 434662 441205 446918 451746 455449 457877 459416 460891 462952 465627 468401
57443 468401 470397 470552 468303 464456 460929 459215 459440 461111 463923 467154 469178 468869 467071 465442 464153
57428 464153 462051 458987 456327 454968 454439 454441 455648 458100 460303 461188 461894 464281 468406 472682 475940 478228
57412 478228 480044 481873 484064 486205 487140 486663 486616 488999 493343 497325 499859 502206 505941 511157 517071
57397 517071 523241 529513 535462 540496 544244 546803 549031 552480 558263 565873 573684 580621 586677 591954
57383 591954 596287 600016 604144 609299 615308 622120 630172 639261 647876 654509 659192 663099 667148 671747
57369 671747 677470 684961 693994 703308 711657 718845 725687 733179 741641 750374 758222 764792 771140 778982
57355 778982 789169 801063 813222 824362 833678 840912 846607 852041 858310 865377 872468 879581 888024
57342 888024 899002 912006 925253 937512 948831 959611 969922 979896 989863 999586 1008225 1015740
57330 1015740 1023600 1033247 1044369 1055535 1066102 1076562 1087395 1098649 1110508 1123167 1136107 1148376
57318 1148376 1159721 1170607 1181196 1191269 1201170 1211712 1222924 1233941 1244467 1255260 1266732
57307 1266732 1278118 1288651 1298630 1308697 1318952 1329462 1340780 1353052 1365392 1376999 1388292
57296 1388292 1400080 1412233 1424073 1435524 1446965 1458447 1470020 1482310 1495678 1509238 1521826
57285 1521826 1533663 1545999 1559447 1573833 1589272 1605903 1622691 1638166 1652703 1668566 1687044
57274 1687044 1706695 1725035 1741009 1755289 1769275 1784510 1802078 1821603 1841370 1860070 1877854
57263 1877854 1895386 1912835 1930397 1948646 1967376 1985000 2000325 2014339 2029114 2045450 2062668
57252 2062668 2080168 2097892 2115532 2132607 2149336 2166390 2183782 2200991 2218082 2235653 2253696
57241 2253696 2271541 2288886 2305879 2322267 2337767 2353333 2370701 2390344 2411111 2432109 2453530
57230 2453530 2475169 2495832 2515236 2535048 2556763 2579635 2602170 2624689 2648770 2674638 2700749
57219 2700749 2725893 2750376 2775026 2800113 2825242 2849311 2870758 2889092 2906251 2925268 2947221
57208 2947221 2970441 2992885 3014250 3035392 3056824 3078535 3100537 3122865 3145441 3168264 3191182
57197 3191182 3213220 3233001 3250371 3266820 3283496 3299403 3312509 3322336 3330618 3339519 3349978 3361831
57185 3361831 3374787 3388880 3404251 3420760 3437847 3454916 3472033 3490021 3509612 3530556 3551809
57174 3551809 3572442 3592120 3610816 3628364 3644304 3657992 3669023 3677746 3685196 3692098 3697962 3701527
57162 3701527 3702325 3701573 3701247 3702159 3703044 3701722 3697281 3691034 3685244 3681066 3677874 3674281 3669278 3662530 3654371
57147 3654371 3645911 3638583 3632945 3628073 3622643 3616671 3611777 3609507 3609452 3609249 3606710 3602074 3597911 3596501 3597587
57132 3597587 3599163 3600287 3602216 3606655 3613683 3621867 3629887 3637544 3645634 3655354 3667476 3681532 3695925
57119 3695925 3709166 3720821 3731211 3740796 3750234 3760386 3771555 3783049 3793940 3803779 3812062 3817745
57107 3817745 3820228 3820269 3818790 3815127 3807732 3796488 3782949 3768098 3751175 3731221 3708570 3684055 3657661
57094 3657661 3628782 3597164 3562739 3525082 3483790 3439036 3391087 3339681 3284558 3226184 3165092
57083 3165092 3100714 3031658 2956995 2876535 2789995 2696822 2596943 2490782 2378218 2258272 2130195
57072 2130195 1994142 1850193 1697158 1532948 1355932 1165542 961905 745397 516298
57063 516298 274250 18142 -253020 -539404 -841223 -1160474 -1500986 -1866506 -2259409 -2681792
57053 -2681792 -3137236 -3630754 -4167483 -4752631 -5393133 -6098688 -6880446 -7748813 -8713212
57044 -8713212 -9784510 -10977845 -12313059 -13812672 -15500034 -17399944 -19540633 -21954297
57036 -21954297 -24675708 -27741175 -31188728 -35057019 -39381074 -44187165 -49489792 -55289732
57028 -55289732 -61569790 -68288190 -75373203 -82721705 -90201736 -97658330 -104920293 -111802895
57020 -111802895 -118104270 -123603106 -128069754 -131292221 -133104036 -133401134 -132148351 -129383148
57012 -129383148 -125217626 -119832713 -113461480 -106365283 -98807925 -91031920 -83241944 -75599584
57004 -75599584 -68227214 -61214118 -54620867 -48483482 -42818907 -37630257 -32910364 -28644406
56996 -28644406 -24812239 -21389590 -18348275 -15657015 -13283210 -11194370 -9359026 -7747950
56988 -7747950 -6334946 -5095955 -4007916 -3049788 -2204370 -1457472 -795411 -205121 323222
56978 796069 1219849 1602628 1951522 2270471 2562058 2829915 3078084 3309810 3528669 3739232
56968 3739232 3944929 4147130 4348190 4552008 4756174 4943754 5088202 5169813 5186797 5151135
56958 5151135 5077856 4979978 4869137 4755029 4642881 4533244 4424513 4314463 4200098 4078351
56948 4078351 3947930 3809846 3666057 3518304 3368053 3216292 3063033 2907783 2750774
56939 2750774 2593192 2436084 2279803 2124856 1972719 1825392 1684499 1551097 1426066
56930 1426066 1310253 1204211 1107826 1020059 939211 863985 794539 732161 677527 629453 585671
56919 585671 544629 506089 470100 436135 403690 373306 346249 323064 302920 284661 268182
56908 268182 254456 244303 237393 232432 228177 224309 221445 220289 220834 222557 225259 229196 234164 239003
56894 239003 242386 243817 243479 241574 238399 234656 230827 226358 220298 212776 205159 198747 194113 191755
56880 191755 192235 195169 199060 203034 208081 215789 226248 238046 249957 261739 273452 284874 295498
56867 295498 304219 309095 308504 302855 294286 284290 272570 258773 244271 231073 219573 208732 198213
56854 198213 188817 180512 171657 161255 150973 143481 139127 135628 131044 125741 121013 117011 112912 108459
56840 108459 104319 101218 99393 98668 98463 98068 97651 98719 102711 109197 116351 123232 130675 139659 149804
56825 149804 160058 170106 180299 190661 200637 209678 217434 223616 228281 232274 236877 242871 250148
56812 250148 258178 266535 275026 283716 293011 303585 316135 331045 348046 366261 385084 405233
56800 405233 428358 454961 482890 508428 528782 543137 551680 554598 552310 545961 537119 527203 517494
56787 517494 509379 504122 502417 504264 509190 516561 526051 538106 553698 573296 596224 621386 648447
56774 648447 677777 709157 740942 770679 796035 814769 824406 823131 811504 792758 770663 747210
56762 747210 722771 698223 675813 657516 643190 631238 620861 612890 608377 607189 608441 611781
56750 611781 617618 626245 637292 650040 663687 677017 688180 695220 696857 692614 682434 666680
56738 666680 646594 624296 601806 579965 558528 537361 517375 500123 486579 476405 468393 461538
56726 461538 455763 451832 450757 453129 458599 465710 472342 476702 478113 476905 473609 468405 461134 451480
56712 451480 439078 423902 406727 388849 371088 353418 335855 319296 304922 292998 282751
56701 282751 273306 264280 255712 248004 241704 236706 231781 225696 218778 212542 207833 204350 202000 201250
56687 201250 201439 200180 195794 189669 184912 183075 183306 184245 185268 185914 185670 184861 184640 185357 185757 184479
56671 184479 181846 179524 178692 179012 179144 177918 175361 172946 172562 174775 178150 180631 181482 181711 182649 184385
56655 184385 185659 185265 183461 181801 181533 182513 183917 185395 186867 187693 187187 185944 185557 186700 188431 189725
56639 189725 190644 191454 191693 191077 190443 190551 190523 188835 185714 183256 182904 183803 183923 182123 178868 175693 174318
56622 174318 175707 179380 183703 186931 187983 186717 184141 182152 182116 183578 184984 185757 186818 188927 191535
56607 191535 193743 195426 196692 196982 195690 193315 191133 189875 189372 189339 189797 190734 191879 192897 193558 193948
56591 193948 194756 196849 199966 202263 202045 199853 198023 198168 199771 201204 201300 199890 197717 196143 196095 196930
56575 196930 197037 195829 194371 193713 193737 194287 196282 200379 205245 208654 210143 211245 213098 215176 216664
56560 216664 217746 218823 219521 219342 218614 217946 217313 216511 216036 216486 217309 217220 215962 214778 214846 215987 217323
56543 217323 218599 220258 222493 224863 226892 228628 230421 232264 233609 234002 233800 234019 235286 237081 238170
56528 238170 237608 235317 232052 229127 227740 227943 228506 228443 228502 230288 233822 237031 238084 237370 236434 235745 234565
56511 234565 232685 231129 230991 232349 234592 237197 239941 242851 246298 250791 256451 262963 270132 278066
56497 278066 286566 294702 301430 306454 310246 313351 315895 317667 318423 318174 317379 316792 316984 317881 318741 318573
56481 318573 316754 313504 309797 306666 304548 303339 302786 302462 301562 299463 296573 294088 292610 291583 290323
56466 290323 288961 287777 286201 283377 279542 276006 273661 272173 270809 269434 268391 267876 267761 267744 267378
56451 267378 266272 264558 263037 262520 263057 263964 264505 264455 264117 264011 264495 265591 267075 268680 270129 271095 271329
56434 271329 270825 269736 268268 266902 266515 267716 270030 272247 273792 275133 276517 276904 275056 271552 268868
56419 268868 269027 271591 274381 275902 276647 277980 280215 282148 282388 280815 278599 277089 276999 278491 281488
56404 281488 285618 290068 293765 295830 296056 295210 294757 295727 297700 299375 300358 301851 304992 309001 311767
56389 311767 312241 311533 311501 312866 314938 316604 317098 316135 313903 311038 308352 306482 305749 306147 307339 308746
56373 308746 309828 310248 309844 308645 307022 305550 304538 303796 303040 302334 301937 301873 301996 302430 303619 305792 308555
56356 308555 311071 312585 312896 312614 312939 314780 317846 320877 322992 324414 325530 325685 323792 320141 316711
56341 316711 315268 315798 317306 319358 321857 323837 323900 322220 320946 321960 324921 328110 330443 331840 332229
56326 332229 331456 330137 329481 329846 330114 328967 326415 323882 323092 325000 329252 334324 338547 341366 343471
56311 343471 345573 347427 348385 348557 348904 350193 352251 354280 355588 355947 355536 354839 354488 354969 356290 358027
56295 358027 359876 362059 364985 368492 371812 374430 376548 378417 379637 379701 378957 378349 378350 378815 379795 381610
56279 381610 384018 386240 388184 390779 394547 398675 402153 405160 408409 411731 414487 417091 420870 426162
56265 426162 431585 435694 438682 441965 446487 451813 456606 459663 460830 461192 462141 464028 465909 466786 466743
56250 466743 466573 466582 466234 465037 463445 462671 463616 466105 469240 472440 475892 479890 484117 488007 491639 495745
56234 495745 500669 505778 510087 513216 515561 517782 520242 522640 524052 523755 522420 522208 525089 530950 537732
56219 537732 543582 548546 553767 559310 563554 565255 565717 568001 573756 581662 589468 596798 604991 614684
56205 614684 624947 634861 644664 654686 664284 672809 681073 690858 703241 718049 734605 752137 769797
56192 769797 787302 805593 825988 848659 872920 899028 928459 961803 997418 1033183 1068907
56181 1068907 1106051 1145525 1186776 1228780 1270703 1311326 1348872 1382099 1411196 1437118 1460188
56170 1460188 1479475 1493300 1500266 1500212 1494350 1484233 1470534 1453146 1432406 1409509 1385535 1360699
56158 1360699 1334931 1308563 1281921 1254873 1227484 1200628 1175154 1150831 1127120 1104769 1085418
56147 1085418 1069320 1054470 1038582 1021348 1004246 988625 974602 961597 949413 938607 929900
56136 929900 923218 917613 912415 908192 906001 905904 907000 908740 911088 913358 914304 914081 914813 918113 922857
56121 922857 926591 928540 930010 932319 935827 940878 948062 956938 965475 971623 975152 977749 981602 987959
56107 987959 996590 1006493 1017213 1029149 1042165 1054628 1064907 1073682 1083641 1096679 1112249 1128571
56095 1128571 1144454 1159677 1174697 1190635 1208781 1229441 1251676 1274597 1298546 1324693 1354037
56084 1354037 1387004 1423474 1462908 1505000 1550441 1600425 1655350 1714882 1779495 1850816 1929798
56073 1929798 2015403 2105605 2198601 2292194 2383107 2468256 2546298 2617191 2681114 2739004 2793096
56062 2793096 2844873 2892329 2930846 2957203 2971780 2976868 2974231 2964804 2949443 2928987 2904033 2875131
56050 2875131 2842563 2805464 2761836 2710197 2651090 2586763 2519924 2453326 2390003 2332855 2283532
56039 2283532 2241851 2206385 2175667 2149055 2126732 2108982 2095532 2085717 2079269 2076733 2078973 2086127
56027 2086127 2096844 2108533 2118802 2127183 2135482 2146137 2160240 2177165 2195663 2214780 2233919 2252881
56015 2252881 2272213 2293104 2316475 2342161 2369166 2396765 2425311 2455895 2489166 2524641 2561335
56004 2561335 2598828 2637142 2675735 2713605 2750797 2788956 2829672 2872931 2918046 2965333 3015640
55993 3015640 3068570 3122681 3177671 3235089 3296324 3360837 3427080 3494452 3563526 3634721 3707619
55982 3707619 3781689 3857196 3935040 4015803 4099225 4184857 4273110 4365212 4461987 4563160 4668090
55971 4668090 4776626 4888872 5004885 5125356 5251920 5385680 5525788 5670536 5819669
55962 5819669 5974519 6136007 6303723 6477127 6656584 6843016 7037469 7241070 7454409
55953 7454409 7676869 7907759 8148217 8400748 8666662 8945416 9236923 9542983 9865654
55944 9865654 10205731 10563939 10942331 11343074 11766798 12213628 12685307 13184861 13714412
55935 13714412 14274506 14865501 15488677 16146149 16840603 17575133 18352657 19175788 20048038
55926 20048038 20975062 21964053 23021920 24154405 25366510 26663064 28049089 29530404
55918 29530404 31114101 32808358 34622163 36565575 38649934 40887587 43291889 45877965
55910 45877965 48663448 51669140 54920739 58451389 62302796 66524164 71171128 76305934
55902 76305934 81997592 88321453 95359567 103201583 111943906 121687650 132538611 144608905
55894 144608905 158016114 172878880 189310324 207403276 227195646 248611733 271381347
55887 271381347 294932276 318266440 339895852 357968826 370647481 376609152 375410584
55880 375410584 367528323 354107010 336600409 316470223 294999543 273206735 251833301
55873 251833301 231378808 212151889 194316077 177928267 162973140 149390088 137089847
55866 137089847 125966599 115910717 106818523 98594357 91148784 84399134 78271701 72701481
55858 72701481 67630078 63005136 58780855 54916933 51376744 48127428 45141126 42394565
55850 42394565 39867120 37539811 35395490 33418413 31593222 29905076 28340756 26888907
55842 26888907 25539178 24281994 23109240 22014285 20990896 20032680 19133922 18290379
55834 18290379 17498743 16755676 16058041 15403937 14792766 14223874 13695402 13204824 12750384
55825 12750384 12331583 11948375 11600379 11286726 11005617 10753123 10522723 10306695 10097820
55816 10097820 9889106 9672220 9437709 9178075 8890998 8579599 8249864 7907961 7559386
55807 7559386 7209499 6863825 6527316 6203449 5894309 5601482 5326474 5070292 4833200
55798 4833200 4614969 4414677 4229941 4057238 3893927 3739694 3595514 3461804 3338332
55789 3338332 3225127 3121991 3027276 2938464 2854067 2773878 2697492 2624070 2553798 2487964 2426766
55778 2426766 2368378 2311087 2255312 2202491 2152925 2105796 2060488 2016738 1974073 1932326 1892309
55767 1892309 1854896 1819813 1786275 1754301 1724154 1694884 1664845 1633634 1602200 1571026 1539547
55756 1539547 1507697 1476735 1447969 1421569 1397073 1374081 1351945 1329723 1307146 1285049 1264277
55745 1264277 1244840 1226585 1209871 1194868 1180930 1167555 1155406 1145396 1137047 1128719 1119435 1109778
55733 1109778 1100923 1093389 1086661 1079539 1071068 1061807 1054104 1050294 1050382 1052080 1053265 1053703 1054002 1053603 1050625
55718 1050625 1043562 1032526 1018628 1002659 984744 965176 945026 925611 907646 891436 877777
55707 877777 867739 860890 854266 844193 829413 811971 794843 779223 764353 749371 734647 721409
55695 721409 710632 702335 695552 688832 681133 672531 663916 655712 647029 636484 623874 610563 597955
55682 597955 586080 574226 562599 552487 544601 538060 531437 524320 517404 511467 506791 503183 499895
55669 499895 495608 489204 480665 470915 460888 451163 442319 434859 428571 422506 415904 408904 402156 396046
55655 396046 390438 384974 379515 374462 370675 368827 368880 370387 373118 376809 380399 382234 381454 378849 376056
55640 376056 374121 372906 371517 369081 365332 360656 355478 349752 343288 336335 329311 322167 314811 308186
55626 308186 303957 302800 303639 304839 305461 305075 303388 300756 298259 296544 295044 292963 290337 287464 284070
55611 284070 279991 276035 273083 270816 268404 266029 264423 263202 261020 257336 252783 247788 242335 237397
55597 237397 235102 236531 240223 243626 245427 245980 246227 246861 248022 249095 249087 247517 244683 241120 237519 235240
55581 235240 235778 239080 243253 246565 249103 251911 255319 258858 262040 264268 264588 262579 259161 255670 252444
55566 252444 249127 245895 243252 240777 237274 232406 227308 223313 220672 218771 216979 215003 212786 210371
55552 210371 207781 205039 202360 200005 197819 195368 192854 191219 190754 190192 188108 184812 181985 180747 180996
55537 180996 182256 183902 184703 183534 180820 178202 176487 174968 173000 171002 169420 167859 166003 164493
55523 164493 164080 164654 165756 167234 168678 169081 168125 167218 168195 171211 174717 177139 177883 177222 176290 176916 180372
55506 180372 186128 192435 197943 202028 204086 203709 201653 199407 197534 195347 192471 189645 187434 185116
55492 185116 181719 177619 174224 172204 170715 168459 165059 161219 157669 154185 149945 144898 140278 137238
55478 137238 135307 133081 130335 128407 128143 128410 127354 124495 120934 117970 116218 115730 116244 117343 118742
55463 118742 120196 120962 120048 117661 115704 115852 117509 118770 119101 119762 121492 123165 123348 122051 120198 118185
55447 118185 115877 113461 111363 109623 108102 107109 107121 107950 108778 108994 108642 108145 107953 108157 108033 106385 103017
55430 103017 99530 97822 97964 98494 98768 99913 103095 107728 111959 114300 114388 112864 111132 110639 111530 112273
55414 112273 111236 108510 105699 104150 103950 104401 104808 104783 104322 103691 102997 102052 100970 100503 101148 102223 102636
55397 102636 102408 102564 103499 104490 105077 105817 107041 107875 107417 106268 105836 106433 107170 107621 108453 110044 111376
55380 111376 110959 108561 105552 103634 103344 103640 102940 100794 98391 97007 96252 94708 92308 90814 91278 92149
55364 92149 91208 88883 88073 90502 94536 97219 97568 97060 97427 98884 100445 101296 101593 102059 102921 103488 103083
55347 103083 102211 102211 103639 105680 107319 108310 108634 107973 106523 105406 105176 104516 101787 97635 94577 93993 94939
55330 94939 96201 97993 100803 103725 105090 104152 101399 97751 94274 92196 92291 94288 97267 100348 102778
55315 102778 104083 104670 105532 106648 106489 104060 100711 98722 98541 98749 98464 98231 98426 98335 97521 96979 97980
55298 97980 100341 102505 103083 101937 100129 99133 99752 101481 103126 104000 104137 103436 101447 98283 95082 93076
55282 93076 92545 92967 93740 94365 94347 93451 91969 90473 89303 88364 87332 86145 85473 86399 89174 92454 94438
55265 94438 94727 94571 95365 97503 100462 103118 104038 102499 99447 96595 94523 92640 90983 90551 91451 92261
55249 92261 92089 91900 92701 93674 93448 92220 91130 90384 89626 89536 91172 93882 95634 95668 95379 96271 98287 100431
55231 100431 101892 102218 101547 100978 101609 102889 103105 101938 101241 102524 104857 106279 106404 106439 107255 108530 109567
55214 109567 109954 109539 108616 108053 108435 109000 108186 105455 102102 99978 99736 100504 100944 100366 98970 97425 96338
55197 96338 95956 96032 95921 95164 94210 94246 95952 98657 101132 103018 104815 106644 107832 107953 107582 107684 108717
55180 108717 110500 112419 113545 113216 111860 110728 110429 110364 109976 109785 110499 111724 112509 112817 113512 114891 116148
55163 116148 116475 116109 115984 116697 117934 118604 117535 114413 110192 106411 104127 103555 104429 106346 108933 111995
55147 111995 115344 118256 119510 118538 116274 114264 113134 112571 112521 113368 114889 116015 116004 115061 113577 111654
55131 111654 109857 109408 110755 112621 113495 113545 114008 115019 115338 114286 112693 111513 110583 109480 108702 109028
55115 109028 110141 110865 110686 110243 110255 110622 110759 110309 109324 108172 107423 107499 108204 108854 108974 108659 108244 108050 108450
55096 108450 109692 111318 112192 111471 109405 106991 105152 104339 104455 104916 105252 105966 108134 111627 114458 114744
55080 114744 112892 110863 109661 108747 107808 107659 108918 110875 112354 112910 112629 111561 110106 109330 109962 111363
55064 111363 112154 111738 110672 109843 109749 110332 110956 110762 109544 108058 107066 106484 106010 106108 107471 109747 111786
55047 111786 113131 114403 115970 117120 117031 116056 115574 116765 119705 123336 126140 127117 126392 124851 123223 121721
55031 121721 120439 119728 120105 121932 124997 128161 129835 129418 128055 127369 127668 128061 128010 127710 126966 125032 122029
55014 122029 119467 118639 119258 120200 120810 120773 119608 117307 114945 113675 113526 114021 115468 118434 122215 125076
54998 125076 126145 126124 125988 125947 125756 125102 123441 120453 117083 115200 115663 117340 118499 118532 117915 117207 116700
54981 116700 116489 116307 115798 115460 116698 120213 124895 129006 131962 134177 135704 136072 135199 133494 131232 128813
54965 128813 127419 128246 131015 134252 136992 139068 139764 137902 133990 130812 130616 132590 134252 134570 134512 135080
54949 135080 136234 137622 139035 139957 139683 138178 136058 133646 130915 128589 128222 130513 134043 136383 136340
54934 136340 134833 133739 134136 135561 136855 137575 138282 139271 139742 138958 137741 137671 138884 139801 139294 137983 137006
54917 137006 136597 136532 136917 137707 138235 138130 138082 138859 140258 141871 143980 146553 148163 147551 145842 145465 146852
54900 146852 147837 146620 143700 140457 137532 135497 135477 137651 140173 141118 140950 141661 143846 146007 146646 145751
54884 145751 144119 142422 141278 141166 141731 141909 141209 140270 139774 139457 138787 138060 138133 139310 141105 142957 144635
54867 144635 145939 146540 146390 146058 146483 148335 151489 154990 157626 158811 159049 159571 161434 164812 168966 172979
54851 172979 176773 181277 187319 194400 201137 206968 212703 218965 224749 228342 229329 228848 227887 226180 222935
54836 222935 217981 211916 205684 200271 196215 192976 189236 184342 179243 175649 174430 175000 175848 175417 173095
54821 173095 169970 168249 169174 171581 173058 172395 170438 168847 168866 171166 175779 181675 187081 190866 193456
54806 193456 196143 199805 204547 210218 216768 224076 231546 238003 242182 243594 242711 240080 235551 228994
54792 228994 221403 214354 208299 202309 195708 189004 182842 177133 171814 167535 164659 162348 159699 157169
54778 157169 155770 155277 154459 152872 151179 149668 147692 144882 141923 139716 138571 138561 139809 141936 143872
54763 143872 144807 144884 144619 144173 143596 143280 143599 144413 145263 145771 145642 144731 143497 142946 143644 145076 146389 147392
54745 147392 148436 149596 150482 150552 149193 145912 141125 136621 134483 135377 138262 141691 144856 147421 149155
54730 149155 150181 151135 152463 153691 153852 152693 151064 149950 149451 149030 148582 148743 150081 152380 154999 157590
54714 157590 160029 161942 162854 162925 163054 164052 165965 168250 170415 172470 174951 178481 183029 187661 191348
54699 191348 193923 195932 197767 199581 201907 205575 210751 216636 222230 226895 230190 232016 233075 234240
54685 234240 235078 234091 231036 227909 226599 226408 225121 221957 218074 214493 211039 207484 204313 201776 199229
54670 199229 196118 192982 190882 190257 190762 191784 192670 192780 191805 190019 188073 186689 186474 187563 189316 190743
54654 190743 191481 192138 193602 196350 200452 205747 211705 217468 222387 226424 229923 233121 235855 237463 236930
54639 236930 233552 227709 220802 214369 209375 206081 204064 202245 199408 194999 189382 183559 178944 176924
54625 176924 177666 179249 178908 175494 170128 164462 159364 155611 154442 156229 159313 161302 161260 160019 158975
54610 158975 159481 162489 167239 170675 169970 165928 162322 161476 162009 161636 160495 160188 160711 160315 158238 155862
54594 155862 154788 155073 155821 156407 156459 155568 153951 152847 153337 155040 156771 158204 159838 161362 161316 159072
54578 159072 156283 155384 156973 159449 161074 161520 161313 160706 159662 158387 157228 156215 155190 154224 153415 152387
54562 152387 150630 148521 147474 148539 151034 153076 153584 153364 153989 155791 157360 157001 154358 150526 147045
54547 147045 145128 145459 147935 151381 154133 155391 155850 156637 157858 158530 157951 156673 156031 156934 159208 161865
54531 161865 163869 164782 164901 164746 164399 163442 161586 159238 157271 156380 156796 158434 160913 163451 165311 166725
54515 166725 168992 173035 177932 181485 182435 181568 180409 179434 178139 176399 174826 173792 172953 172063 171584 171968
54499 171968 172765 173094 172819 172648 173037 173569 173705 173652 174041 174973 175865 176263 176260 175943 174965 173250 171880 172510 175646
54480 175646 179994 183804 186546 188960 191851 195349 199166 203091 207128 211374 215663 219199 220858 220293
54466 220293 218654 217817 218914 221665 224763 226538 225788 222740 219060 216290 214471 212841 211401 210768 210761 210396
54450 210396 209347 208202 207128 205683 204237 204011 204940 205083 203352 201416 201355 202481 202378 200512 198868 199154
54434 199154 201147 203929 206932 209274 209684 207984 205638 204079 203461 203624 205193 208670 213185 217259 220503
54419 220503 223657 227065 229971 231512 231949 232631 234729 237969 240772 241921 241983 242608 244453 246421 247143 246619
54403 246619 246144 247061 249773 253469 256635 258347 259155 260159 261297 261563 261066 261512 263917 267025 269086 270249
54387 270249 271878 274177 276019 276717 276458 275038 271818 267325 263431 261210 259710 257660 255429 254229 254012
54372 254012 253443 251916 250532 250695 252314 253922 254315 253562 252390 251121 249732 248703 248848 249887 249973 247649
54356 247649 243923 241328 240889 241246 241099 241189 242828 245408 246870 246463 245579 245546 245830 245219 244002 243845 245606
54339 245606 248146 249591 249328 248434 248353 249481 251049 252200 252941 253870 255128 256093 256403 256849 258489 260878
54323 260878 261898 259749 254743 248894 244235 241831 241727 243050 244407 244976 245095 245304 245205 244147 242693 242140
54307 242140 242611 242979 242973 243835 246122 248301 248764 248163 248205 248884 248615 246886 245064 244414 244700 245124 245349 245142
54289 245142 244045 241982 239415 236532 233216 230073 228362 228220 228048 226595 224774 224268 224932 224785 222341
54274 222341 217993 213231 209453 207490 207319 207966 208334 208389 209120 211222 214243 217021 218532 218368 216918 215202
54258 215202 214163 214040 214669 216113 218358 220526 221184 219644 216424 212354 208101 204848 204317 207048 211071
54243 211071 213344 212619 210256 208252 207270 206786 206351 206123 206570 208224 211291 214922 217236 216963 215143 214253
54227 214253 215381 217104 217669 217354 217659 218766 219183 217925 215755 213869 212382 210814 209301 208400 208083 207552
54211 207552 205893 202634 198173 194175 192888 195164 199371 202931 204688 205139 204893 204076 203100 202705 202868 202631
54195 202631 201444 199880 198546 197105 195018 192705 191267 191307 192448 193636 193587 191487 187981 185145 184755
54180 184755 186551 188581 189167 188146 186497 185296 185046 185520 186172 186827 187843 189406 191087 192455 193709
54165 193709 195037 195663 194438 191459 188315 186498 186051 185949 185203 183395 180744 177981 175753 173972 172245
54150 172245 171071 171694 174270 176973 177782 176623 174950 173750 173043 173032 174346 176957 179992 182920 185886
54135 185886 188492 189499 188546 187044 186284 185492 183119 179486 176610 175552 175579 176224 178500 183065 188269 191264
54119 191264 190685 187438 183282 179502 176774 175436 175562 176905 178708 179658 178781 176837 176030 177529 179786
54104 179786 180354 178963 177662 177972 179233 180042 180159 180337 181124 182534 184320 185949 186764 186746 186678 187077 187463
54087 187463 187271 186945 187335 188335 188940 188489 187066 184868 182104 179652 178855 180146 182429 184258 185216 185786
54071 185786 186319 186742 187063 187554 188286 188814 188583 187613 186699 186821 188199 189923 190720 190217 189218 188650 188515 188178
54053 188178 187445 186876 186991 187569 187946 187691 186786 185382 183753 182379 181735 181884 182472 183074 183309 182728 181081
54036 181081 178939 177631 178099 179908 181709 182596 182741 182779 182979 183120 182910 182321 181567 180895 180500 180766 182373
54019 182373 185674 189827 193182 195044 196575 199258 202822 205550 206500 206500 206855 208061 210028 212488 214602
54004 214602 214990 213033 209773 207020 205961 206957 209777 213232 215340 215031 213537 213111 214613 217174 219908
53989 219908 222785 225878 228960 232072 235477 238718 240759 241536 242457 244753 248141 251784 255792 260779 266346
53974 266346 271107 274360 277045 280819 286512 293531 300375 305620 308689 309982 310404 310804 311707 313253 315265
53959 315265 317520 319990 322646 325127 327007 328422 329947 331702 332981 332914 331174 327902 323531 318942 315186
53944 315186 312561 310303 307565 304320 300912 297285 293240 289066 285189 281498 277681 273994 270930 268319
53930 268319 265574 262772 260646 259394 258336 256917 255329 253813 252148 250213 248346 246635 244502 241679
53916 241679 239059 237830 238056 238831 239571 240389 241355 242298 243351 244782 246029 245892 244270 242910 243537 245715
53900 245715 247612 248709 250552 254431 259275 262645 263404 262681 262378 263402 265345 267286 268663 269654 270900
53885 270900 272709 274646 276147 277485 279647 283237 287895 292848 297526 301538 304680 307369 310605 315009
53871 315009 320212 325568 331058 336948 342889 348131 352568 356934 361922 367661 374069 381092 388417 395611
53857 395611 402838 410845 419749 428396 435673 442282 450442 461582 474803 487944 499857 511268 523447
53844 523447 536423 548657 558281 564485 567812 569312 569311 566762 559910 548045 532782 517298 504065
53831 504065 493475 484544 476151 467247 456859 445118 433995 425724 420157 414665 407058 397710 388344
53818 388344 379814 372086 365574 360988 357915 354839 350973 347148 344461 342768 341038 338579 335276 331143
53804 331143 326344 321407 316738 312094 307226 302874 300169 298898 297267 293914 289439 285388 282424 280320
53790 280320 279154 279202 279773 279425 277750 275895 274822 274022 272728 271532 271693 273236 274814 275327 274746 273455
53774 273455 271830 270551 270293 270697 270496 269070 267167 265641 264208 262067 259193 256400 254533 254236 256005
53759 256005 259619 263634 266239 266774 266037 265135 264529 264197 264202 264904 266846 270421 275372 280657 285095 288252
53743 288252 290610 293043 296236 300300 304591 308316 311683 316008 321971 328090 331941 332948 333026 334213 336533
53728 336533 338717 340171 341334 342516 343317 343357 343047 343407 345269 348605 352393 355132 355729 354060 350816 346981
53712 346981 343375 340330 337623 334900 332122 329280 325855 321281 316131 312060 309992 308927 307144 304126
53698 304126 300641 297423 294689 292675 291518 290570 288804 286186 283831 282550 282074 281985 282343 282728 281674 278216
53682 278216 273668 270828 271413 274894 279594 284049 287423 289618 291406 293865 297365 301503 306040 311270
53668 311270 317308 323848 331007 339557 349442 358509 363664 363426 358869 352282 345575 339897 335776 333008
53654 333008 330748 328279 325585 323073 321036 319681 319337 320096 321233 321541 320535 319161 319081 321145 324554
53639 324554 327457 328463 327763 326793 326711 327286 327525 327221 327245 328054 328630 327769 326170 326149 328943 333210 336846 339453
53621 339453 341953 344244 344717 342439 338659 335416 333339 331601 329533 327406 325739 324678 324171 324220 324777
53606 324777 325711 327001 328616 330138 330783 329925 327543 324252 321007 318527 316677 314617 311937 309400 308026
53591 308026 307668 307282 306680 307180 310039 314731 319287 322126 323300 324093 325602 327515 328286 326917 324546 323656
53575 323656 325486 328879 332047 334695 337711 341307 344512 346402 347019 346953 346704 346649 347147 348401 350495 353584
53559 353584 357658 362130 366128 369404 372614 376469 380879 385091 388467 390993 393225 395848 399064 402396
53545 402396 405287 407922 411076 414929 418315 419615 418516 416720 416635 419178 422825 424984 424420 422273 420707
53530 420707 420850 422170 423400 423649 422819 421478 420403 419881 419549 419190 419435 421106 423890 426368 427583 428127
53514 428127 429367 431878 434818 436603 436134 433689 430759 428779 427956 427556 427127 426887 426967 427015 426814 426719 427179
53497 427179 428343 430359 433418 437070 440077 441547 441866 442136 443205 445675 450232 457079 465290 473518 481232
53482 481232 488712 496135 503435 510967 519396 528749 538296 547712 557893 570346 585945 604294 623939
53469 623939 643322 661986 680917 701335 723152 745116 766455 787841 810666 835899 863785
53458 863785 894011 925742 957880 989693 1021122 1052445 1083914 1115766 1148191 1181175 1214689
53447 1214689 1249055 1284614 1320939 1356964 1392078 1426495 1460296 1492910 1524171 1555224 1587423
53436 1587423 1620466 1652563 1682643 1711750 1741868 1773744 1806255 1837649 1866895 1893672 1917592
53425 1917592 1938204 1955976 1972592 1989521 2006412 2021602 2034155 2044596 2053419 2059785 2062389 2061071
53413 2061071 2056819 2050522 2042407 2032432 2020416 2005751 1987773 1966725 1943906 1920526 1896666 1871542
53401 1871542 1844604 1816190 1787122 1757724 1727326 1694924 1660376 1624683 1589039 1554082 1520346
53390 1520346 1488765 1459905 1432917 1406207 1379426 1354230 1332788 1315881 1302651 1291732 1282300
53379 1282300 1274214 1267616 1262633 1259584 1259345 1262996 1270624 1280647 1290841 1300127 1309182 1319651 1333272
53366 1333272 1351467 1374780 1402448 1433060 1465839 1500698 1537126 1574043 1611258 1650184 1692325
53355 1692325 1737650 1785315 1835434 1888989 1946012 2004948 2064274 2124138 2185993 2251007 2319181
53344 2319181 2389730 2461838 2535058 2609337 2685046 2763029 2844259 2928806 3014956 3099968 3182239
53333 3182239 3262458 3342019 3420492 3495585 3565847 3632593 3698406 3764016 3827313 3885299 3936271
53322 3936271 3979929 4016267 4045419 4068446 4087041 4101597 4110027 4109469 4099145 4080803 4056318 4025849
53310 4025849 3988736 3945149 3895832 3840695 3778757 3709384 3632870 3550027 3462269 3372085 3282133
53299 3282133 3193237 3104038 3013194 2921333 2830353 2741511 2654981 2570676 2488570 2408478 2330397
53288 2330397 2254900 2182346 2111875 2042283 1974068 1909573 1850496 1796053 1744193 1693909 1645482
53277 1645482 1599037 1554144 1510999 1470997 1435580 1405039 1378807 1356380 1337348 1320798 1305517
53266 1305517 1291041 1278151 1268141 1261722 1258583 1257659 1257681 1257909 1258829 1261970 1268557 1278263 1289692 1302241
53252 1302241 1317009 1335477 1357555 1381530 1405852 1430413 1455868 1482326 1509335 1537045 1566837
53241 1566837 1600513 1638821 1680749 1724167 1767302 1809751 1852118 1894768 1937253 1979021 2020072
53230 2020072 2060415 2099193 2135007 2166999 2194978 2218693 2237980 2253796 2267867 2280490 2289528
53219 2289528 2292657 2290095 2283936 2274931 2261376 2241589 2216443 2188710 2160429 2131527 2100577 2066291
53207 2066291 2028465 1988118 1946776 1905351 1863579 1820434 1774871 1726340 1675200 1622938 1571387
53196 1571387 1521189 1471329 1420586 1369139 1318311 1269126 1221738 1176002 1131913 1089463 1048626
53185 1048626 1009499 971979 935314 898553 861571 825265 790701 758491 728894 701877 676877
53174 676877 653084 630234 608767 589096 571361 556040 543987 535169 527845 519751 510043 499649
53162 499649 489981 481779 474912 468575 461582 453029 442983 432423 422534 414170 407580 402146 396601 390219
53148 390219 383848 379143 376623 374986 372537 368668 363672 357833 351360 344891 339310 335051 331911 329476
53134 329476 327361 325197 322841 320553 318625 316850 314692 311857 308378 304369 300297 297308 296457 297434 298770
53119 298770 299491 299854 300170 299935 298828 297673 297276 296900 295219 292689 291554 293177 296509 299695 302132 304234
53103 304234 306105 307488 308562 309734 310756 310893 309996 308737 307743 307109 306923 307692 309927 313533 317759 321500
53087 321500 323656 323568 321388 317948 314146 310503 307176 304269 302025 300716 300254 299997 299313 298333 297795 298073
53071 298073 298952 300460 302979 305855 306841 304248 299368 295516 294515 295160 295296 294273 292933 292236 292589 293872
53055 293872 295477 296697 297505 298478 299641 300121 299452 298504 298471 299519 301081 302872 304629 305370 304030 300848
53039 300848 297286 294518 292690 291566 291003 290631 289783 288071 285567 282300 278161 273501 269243 266060 263776
53024 263776 261788 259804 258037 257059 257524 259472 261738 262594 261433 259429 258100 257562 256707 254867 252706
53009 252706 251335 250982 250816 249909 248167 246284 244918 244057 243233 242143 240894 239703 238638 237610 236353
52994 236353 234478 231943 229606 228835 230114 232308 233698 233619 232701 231693 230694 229688 229127 229381 229933 229813
52978 229813 228939 228462 229541 232124 235153 237600 238971 239170 238441 237373 236525 236067 236058 236754 238030 238669 237105
52961 237105 233182 228604 225350 224129 224403 225125 225091 223514 221015 219444 219890 221358 222233 222571 223775 226202
52945 226202 228319 228552 227032 225089 223778 223388 223808 224745 225794 226664 227278 227512 227126 226116 224940 224227
52929 224227 224355 225271 226551 227784 229026 230604 232166 232357 230159 226311 222655 220156 218404 217065 216733
52914 216733 217977 220379 223002 225185 226491 226573 225688 224829 224756 225241 225657 225832 225857 225552 224730 223715 222991 222553
52896 222553 222044 221378 220843 220726 221128 221999 223160 224483 225985 227330 227379 225167 221547 218884 218513 219371 219823
52879 219823 219850 220403 221376 221642 220847 219907 219656 219955 220170 219753 218404 216391 214605 213586 212769 211495 210375
52862 210375 210439 211259 211358 210560 210390 211696 213300 213779 213383 213239 213618 214053 214582 215738 217529 219169 219748 218866
52844 218866 216966 215351 215210 216198 216673 215914 215374 216886 220277 223724 226024 227436 228549 229461 230123 230500
52828 230500 230215 228829 226663 224703 223540 223000 222815 222792 222157 219656 215016 209829 206417 205850 207298 209064
52812 209064 210105 210785 212299 215104 218037 219390 218857 217769 217257 216944 215962 214599 214149 215420 218143 221749
52796 221749 225928 230176 233439 234810 234509 233858 234108 235321 236398 236186 234444 231770 228838 226044 223754
52781 223754 222296 221444 220344 218314 215466 212257 208834 205387 202911 202765 205177 208693 211440 212763 213437
52766 213437 214558 216504 218873 221117 223129 225139 227097 228314 228033 226217 223580 220922 218832 217843 218205
52751 218205 219279 219842 219460 219115 219954 221804 223585 224914 226483 228794 231343 233351 234648 235378 235309 234087
52735 234087 232045 230157 229016 228158 226624 224120 221429 219570 218607 217530 215418 212543 210000 208416 207352
52720 207352 206026 204276 202760 202477 204061 207004 209541 209917 208175 206261 205980 207257 208777 209699 209994
52705 209994 209572 208235 206572 205860 206571 207681 207969 207463 207040 207012 206859 206323 206014 206633 207945 208942 209050 208937
52687 208937 209868 212159 214506 215187 213961 212407 212169 213169 213824 212860 210560 208314 207345 207941 209618 211727
52671 211727 213944 216244 218488 220141 220627 220032 219332 219730 221648 224313 226359 226883 226045 224704 223560 222701
52655 222701 221877 220954 219850 218174 215296 211004 206034 201778 199374 199021 200037 201384 202200 202096 201228 200149
52639 200149 199415 199231 199371 199440 199189 198706 198385 198712 199949 201988 204464 206910 208737 209354 208668 207405 206611
52622 206611 206739 207455 208285 209044 209621 209943 210454 212046 214872 217590 218516 217380 215383 213690 212642 212382
52606 212382 213204 214793 216024 216263 216357 217410 218850 218806 216650 214296 214335 217241 221115 223990 225649 227033
52590 227033 228651 230312 232079 234493 237605 240583 242798 244710 246968 249117 250068 249638 248574 247113 244774
52575 244774 241927 240265 240648 241373 239844 235619 230688 226971 224827 224051 224896 227342 230312 232548 233824
52560 233824 234638 235181 235386 235592 236165 236475 235168 231762 227383 223723 221831 222101 224471 227876 230107 229449
52544 229449 226566 223920 223074 223272 222975 221959 221182 221104 221109 220537 219513 218655 218587 219929 223094 227655 232320
52527 232320 235925 238190 239252 238980 237345 235290 234486 235968 239219 242659 244926 245768 246005 246683 248087
52512 248087 249575 250406 250536 250389 250103 249465 248507 247659 247172 246805 246252 245542 244851 244230 243795 243746 243843 243232 241450
52493 241450 239489 239122 240860 243053 243478 241596 238822 236769 235699 234780 233368 231751 230895 231702 234250
52478 234250 237405 239400 239293 237992 237490 238873 241244 242705 242259 240664 239571 239913 240952 240891 238627 234962
52462 234962 231852 230438 230302 230722 231943 234500 237744 239985 240207 238852 236780 234349 232016 231059 232621
52447 232621 236147 239636 241717 243006 245172 249045 253868 258089 260583 261306 261083 260792 260722 260761 261074 262118
52431 262118 263852 265418 266029 265851 265530 265195 264550 263717 263152 262679 261475 259313 257002 255232 253870 253086
52415 253086 254250 258360 263912 267628 267623 264998 262157 260502 260154 260824 261966 262561 261909 260833 261341 264521
52399 264521 268908 271372 269992 266044 262889 262819 265312 268467 271341 274106 276467 277307 276147 273887 271677
52384 271677 269856 268457 267841 268074 268351 267815 266505 264864 262921 260757 259273 259406 260745 261756 261303 259384
52368 259384 256672 254166 253017 253642 255028 255772 255770 255906 256220 255684 254141 253138 254048 256309 258426 260017
52352 260017 261831 264197 266586 268752 271389 275191 279686 283478 285634 286610 287674 289490 291618 293540
52338 293540 295663 298670 302079 304324 304423 302881 300715 298312 295685 293169 291214 289906 289265 289626 291022
52323 291022 292486 292779 291900 291212 291866 293501 294813 295233 295794 298186 302791 307715 310115 308830 305559 303254
52307 303254 303475 305440 307337 308061 307700 306773 305489 303947 302915 303777 307052 311204 313775 313956 313341 313762
52291 313762 315230 316626 317719 319346 321875 324576 326649 328020 328896 329365 329836 331138 333448 335561 336024
52276 336024 335061 334741 336970 341670 347313 352954 359080 366226 373457 378982 382231 384647 388298 394186 401967
52261 401967 410626 419050 426548 433302 439906 446157 451044 454450 457988 463082 468791 472836 474556 475497
52247 475497 476926 478149 477813 475744 472792 469872 468069 468854 472844 478495 483083 485277 486182 487739 490696
52232 490696 494374 497952 501465 505545 510443 515534 519906 523318 526323 529438 532518 535095 536991 538297
52218 538297 538964 538879 538326 538131 539236 542188 546872 552559 558249 563225 567336 570816 573937 576892 579858
52203 579858 583051 586736 591105 595862 599981 602335 602941 603357 605571 610501 617646 625728 633300 639108 642659
52188 642659 644696 646737 649944 654620 660808 668853 678935 690208 700864 709264 714979 718726 721561
52175 721561 724241 727130 730276 733402 736159 738726 742024 746875 752992 759258 765172 771461 778917 787103
52161 787103 794822 801626 808125 814672 820434 824216 825921 826840 828675 832594 838963 847306 856236 863869
52147 863869 869031 872346 875863 881205 888020 894413 898881 901577 903648 905781 907812 909505 911044 912564
52133 912564 913657 913837 913310 912892 913104 913735 914506 915875 918724 923138 927744 930585 930716 928909 926866 925850
52117 925850 926013 926694 927058 926456 924464 920844 915639 909292 902645 896711 892355 890083 889868 890958 891902 891212
52101 891212 888382 884210 879927 876085 872587 869656 868184 868806 871020 873639 875868 877536 878579 879064 879719
52086 879719 881529 884386 886832 887763 887803 888241 889118 889511 889524 890620 893587 897317 900285 902338 904166 905825
52070 905825 906913 907787 909404 912005 914929 917859 921362 926000 931708 938287 945860 954613 964609 976042
52056 976042 989104 1003565 1019020 1035464 1052726 1069385 1083411 1094290 1103342 1111399 1117469 1120550
52044 1120550 1121534 1121920 1121554 1119281 1115259 1110887 1106587 1101482 1095600 1090622 1087698 1085840 1083463 1080496 1077923
52029 1077923 1076014 1074207 1072326 1070875 1070313 1070895 1073094 1077167 1082070 1085643 1086382 1084715 1082261 1080070 1077911
52014 1077911 1075050 1071337 1067467 1064474 1063130 1063649 1065528 1067568 1068418 1067426 1064790 1060729 1054984 1047708 1040433
51999 1040433 1035241 1032753 1031600 1029919 1026720 1021726 1014962 1007075 999236 992039 985088 978198 972174 967508
51985 967508 963068 957341 950580 944444 939734 935857 932579 930672 930313 930252 929415 928273 927693 927446 927053 927271
51969 927271 929231 932534 935792 939032 943895 950947 958288 963803 967704 971583 975612 978214 978440 977374
51955 977374 976631 976313 975123 972074 967525 962732 958855 956267 954242 951171 945343 935881 923140 908367
51941 908367 892964 877767 862783 847612 832180 816937 802246 787873 773304 758387 743357
51930 743357 728517 714337 701670 691221 682654 674782 666870 659265 652465 646186 639957 634229 630141
51917 630141 628137 627341 626346 624133 620185 614382 607298 600235 594373 589740 585271 579960 573817 567747 562715
51902 562715 559159 557002 555926 555624 556041 557583 561027 566930 575090 584694 594938 605311 615385 624819
51888 624819 633803 643081 653000 662535 669643 672800 672249 669878 667953 667762 669191 671520 674530 678636 684044
51873 684044 690406 697698 706893 718914 732985 746728 758125 766946 774076 779913 783722 784274 780837
51860 780837 773751 764190 753261 741318 728236 714153 699430 684017 667533 650199 633102 617258
51848 617258 602925 590107 579082 569841 561541 553277 545218 538289 532864 528365 524174 520427 517783
51835 517783 516741 517168 518284 519384 520948 524702 531842 541236 550039 556138 559478 561130 561914 562113 561675
51820 561675 560224 557457 553933 550965 549334 548642 548289 548501 549878 552573 556574 562161 569090 575760 580382
51805 580382 583081 585923 590628 596878 602985 607415 609542 609762 609269 609042 608598 606323 601405 594773 587723
51790 587723 580499 572997 566158 561496 559524 559666 561513 565076 569802 574538 578968 584146 591001 598951
51776 598951 606429 612118 615048 614235 609328 601518 592896 584591 575937 565659 553692 541758 532300 526692
51762 526692 524288 523195 521983 520470 518929 517207 515007 512441 509645 506204 501731 496902 493101 490951
51748 490951 489702 488176 485803 482787 479897 478276 478859 481697 486149 491622 497514 502397 504194 501743
51734 501743 495801 488338 481286 476039 473198 472132 471326 469751 467505 464806 461189 456474 451836 448803
51720 448803 447462 446573 445290 443841 442678 442072 442657 445261 449601 453892 456324 456638 455964 455492 455658 456257
51704 456257 457037 458319 461027 465698 471448 476552 480334 483955 489043 495971 503843 511601 518559 524256
51690 524256 528400 530859 531274 528963 523774 516960 510557 505773 502347 499499 497020 495235 494290 493835 493336
51675 493336 492587 492013 492474 494633 498475 503609 509935 517591 526184 534581 541885 548352 554887 561765 568405
51660 568405 574383 579921 584986 588464 588937 586188 581352 575565 568983 561298 552792 544572 537968 533696
51646 533696 531246 528997 525444 520566 515560 511084 506502 501436 497434 496976 500744 506577 511342 513420
51632 513420 513322 512444 511628 510813 509848 509362 510348 512702 514735 514758 512830 510295 507872 505083 501541 497896 495182
51615 495182 493775 493185 492456 490878 489006 488986 492955 500849 510560 520460 530808 542313 554434 566097
51601 566097 577261 588542 599493 608294 613144 613295 608845 600467 589658 578540 568797 560708 553401
51588 553401 546027 538784 532810 529009 527039 525669 523965 521753 519031 515678 511849 507934 503751 498501
51574 498501 491988 485178 478989 473145 466948 460577 454728 449403 444050 438667 433808 429542 425241 420549
51560 420549 415827 411540 407754 404402 401580 399491 398341 398165 398477 398449 397974 398132 399912 402727 404988 405879
51544 405879 405801 405346 404861 404955 406253 408417 410335 411615 413090 415596 419066 423108 427583 432199 436441 440444
51528 440444 445180 451092 457210 462333 466614 471247 476863 482889 488253 492206 494716 496658 499599 504818
51514 504818 512287 520800 529200 537562 547213 559512 574390 590249 605697 621210 638575 658741
51502 658741 680821 703156 724615 744770 763827 782921 803819 827716 854712 884768 918464
51491 918464 956230 997319 1040099 1082865 1123778 1160482 1190680 1213042 1227133 1232628 1229205 1217091
51479 1217091 1197293 1171231 1140239 1105152 1066246 1023949 979774 936082 894668 856144 820919
51468 820919 789929 763694 741350 721381 702923 685801 669956 655681 643793 634473 626306 617601
51456 617601 608433 600182 593109 585699 576663 566548 556931 548872 542551 537522 532734 526943 519764 512077
51442 512077 505004 498803 493023 487303 481585 475823 469918 464007 458639 454542 451967 450061 447277 442949
51428 442949 438249 434960 433532 433136 433365 434644 436703 438030 437733 437056 437908 440367 442647 443312 442486 440846
51412 440846 438469 435150 431250 427685 425255 424205 424198 424460 424139 422874 421058 419374 418029 416616 414755
51397 414755 412625 410651 408796 406662 404409 403184 404226 407703 412699 418189 423706 429280 435211 441876
51383 441876 449345 457244 465385 474398 485125 497349 509786 521496 532583 543101 551955 557616 559768
51370 559768 559705 559129 558901 558846 558320 556756 553821 549345 543450 536900 530878 525843 520796 514426 507019 500396
51354 500396 495740 492381 489227 486452 484920 484690 485221 486639 489566 493757 498075 501964 505937 510247 513976
51339 513976 516083 516751 517198 518576 521429 525694 530650 535254 539166 543277 548775 555832 563610 571381 579157
51324 579157 587340 596237 606026 616932 629355 644027 661814 683095 707418 734208 763815 797496
51312 797496 836274 880057 927718 977556 1027585 1075959 1121569 1164046 1202901 1236757 1263603
51301 1263603 1281565 1289368 1286513 1273559 1252093 1223860 1189659 1149368 1103163 1052551 1000070 948170
51289 948170 898515 852074 809391 770503 734929 702249 672821 647453 625961 606371 586306
51278 586306 565333 545367 528530 515163 504282 495218 487923 481952 476130 469497 462023 454251 446725
51265 446725 439925 434231 429714 426239 423755 422040 420268 417624 414571 412693 412741 413510 413291 411949 410823
51250 410823 410892 411774 412474 412504 412237 412504 413792 415531 416517 416432 416471 417730 419356 419293 416860 413638 411593 411150
51232 411150 411400 411379 410629 409148 407468 406405 406186 406082 405384 404462 404350 405432 407032 408206 408458 407700 406098
51215 406098 404246 403158 403595 405287 406921 407091 405433 402906 401016 400756 402145 404464 406782 408530 409927
51200 409927 411712 414144 416396 417443 417383 417287 417705 418082 418025 418387 420417 424176 428470 432188 435063 437228
51184 437228 438688 439391 439283 438070 435317 431074 426079 421079 416197 411277 406570 402598 399419 396593 393961
51169 393961 391922 390598 389240 387189 385220 384985 386807 388783 388732 386616 384389 383818 385195 387897 391114
51154 391114 393862 395297 395594 395865 396716 397524 397688 397979 399806 403580 408587 414142 419864 424907 428062 429034
51138 429034 428930 429096 429985 431414 433226 435242 437164 439040 441352 444100 446369 447621 448966 452081 456852
51123 456852 460991 462289 460589 457452 454793 454168 456316 460345 463685 463867 460566 455649 451362 448807 447784
51108 447784 447394 446845 446169 446043 446558 446564 445015 442591 440928 440295 439263 436969 434495 433298 433326 433558 433685
51091 433685 434276 435716 437877 440465 442851 443899 442848 440238 437228 434260 431230 428611 427258 427064 426849
51076 426849 425870 424536 423392 422238 420706 418979 417371 415690 413593 411282 409429 408437 407956 407089 405247
51061 405247 403030 402069 403555 407074 411349 415845 420946 426718 432448 437493 441827 445558 448601 451017
51047 451017 453044 454776 456523 459373 464356 470877 477065 481967 486346 490940 495289 498901 502283 505780
51033 505780 508502 509694 510382 512301 515606 518840 520850 521619 521433 520402 518795 516876 514301 510450 505452
51018 505452 500278 495849 492542 490335 488781 487064 484820 482816 482236 483469 486138 489881 494264 498281
51004 498281 500932 502300 503343 504856 507401 511811 518597 526981 535585 543984 552365 559887 564947 567338
50990 567338 568716 570459 572477 574698 578149 583384 589075 593599 597287 601738 607380 613128 618285 623459
50976 623459 629403 636058 643043 650187 657059 662708 666539 669155 671602 673741 673892 670335 662940 653032
50962 653032 641904 630137 618466 608335 600664 594337 587102 578263 569779 564278 562592 563624 566039
50949 566039 569421 574019 579824 585965 591054 594591 598086 604014 613142 623446 632258 638924 644636 650180
50935 650180 655054 658840 662387 667091 673420 680492 686795 691215 693745 695469 697694 701027 705558 711754
50921 711754 720431 731451 743014 752951 760678 767353 774058 780342 784883 787262 788511 789864 791412 792400
50907 792400 792524 792262 791747 790017 786123 780783 776030 772881 769983 765188 758116 750420 743750 738414 734335
50892 734335 732327 733491 737773 744098 751914 761789 774384 789620 807161 827025 849198 873194 898505
50879 898505 925198 953608 983736 1015328 1048031 1080835 1111651 1138167 1159214 1174979 1186234
50868 1186234 1193928 1199189 1202760 1204292 1202893 1198544 1192317 1184970 1175928 1164077 1149122 1131808 1113123
50855 1113123 1093657 1073575 1052900 1031860 1011094 991485 973751 958185 944515 931711 918192
50844 918192 902911 886515 871127 858730 849780 843218 837457 831329 824458 816977 808932 800143 790786
50831 790786 781747 773942 767485 761878 756750 751875 746766 741072 735359 730670 727063 723220 717823 711001
50817 711001 704292 699528 697594 697678 697757 696477 694643 694253 696007 698493 699950 700057 699690 699580 699648 699347 698568
50800 698568 698514 701338 708006 716648 724151 729542 734682 741373 749119 756356 762596 768479 774757 782278 792117
50785 792117 804548 818365 832148 845708 859476 873224 886560 900286 916044 934624 955341
50774 955341 976873 998144 1018890 1040234 1064304 1092383 1123757 1157083 1192248 1229882 1269792
50763 1269792 1311436 1355645 1404103 1456860 1511858 1567451 1624100 1682861 1743213 1803238 1861226
50752 1861226 1916167 1967077 2012794 2052493 2085923 2112868 2132462 2143216 2143950 2134901 2117859 2095136
50740 2095136 2068548 2039262 2008003 1975140 1941285 1908237 1878536 1853273 1830960 1809425 1788281
50729 1788281 1768568 1750679 1734091 1718908 1706204 1696657 1689959 1685635 1683365 1682416 1681930 1681837 1682241 1681917
50715 1681917 1678896 1672917 1665875 1659284 1652631 1644761 1635343 1623985 1609297 1590142 1567034 1541195 1513082
50702 1513082 1482864 1451434 1419635 1387106 1353243 1318879 1285684 1254126 1223369 1193245 1165130
50691 1165130 1140551 1119804 1102180 1086860 1073238 1060828 1049289 1038560 1029153 1022288 1019199 1019857
50679 1019857 1022785 1026467 1030479 1034952 1039864 1045659 1053646 1064552 1077138 1089569 1101878 1115806 1132270
50666 1132270 1150310 1168669 1187065 1205475 1223316 1240000 1255553 1270266 1284425 1298632 1313471
50655 1313471 1328556 1342880 1356532 1370998 1386989 1403037 1417312 1430202 1443978 1460286 1479045
50644 1479045 1499630 1522089 1547147 1575750 1608647 1645766 1685976 1728078 1771950 1817965 1865288
50633 1865288 1911545 1954468 1993335 2028754 2061769 2093401 2124302 2154245 2182417 2208653 2233959
50622 2233959 2259411 2284914 2309588 2332954 2355110 2375992 2395191 2412621 2428906 2445105 2462412
50611 2462412 2482015 2504719 2530658 2559707 2592149 2628398 2668218 2710850 2755980 2803778 2853701
50600 2853701 2904062 2953364 3001511 3049063 3095903 3141555 3186554 3232542 3280714 3330774 3381510
50589 3381510 3431917 3481705 3531377 3582116 3635170 3691031 3749442 3810347 3874502 3943028 4016683
50578 4016683 4095541 4178837 4264821 4351268 4436541 4519813 4599885 4674261 4740058 4795780 4841733
50567 4841733 4878672 4906363 4923511 4928868 4922443 4905615 4879620 4843585 4794513 4729974 4651090 4562754
50555 4562754 4471275 4382290 4300299 4228650 4169058 4121556 4085533 4060522 4045622 4038551 4035777 4033372
50543 4033372 4027362 4013851 3989853 3954161 3906823 3847750 3776625 3694318 3603578 3507704 3408927
50532 3408927 3308396 3207069 3105940 3005781 2907468 2812394 2721966 2636936 2557952 2486470
50522 2486470 2423987 2370205 2322993 2280620 2243247 2211840 2186631 2167467 2154885 2149675 2151540 2159025
50510 2159025 2170615 2185268 2202214 2221264 2243261 2269130 2298057 2327273 2354039 2377465 2398282
50499 2398282 2417617 2436475 2455936 2477208 2501451 2529761 2563142 2602319 2647613 2698933 2755704
50488 2755704 2816996 2882310 2952298 3028177 3110166 3196921 3286686 3378679 3473222 3571114 3673357
50477 3673357 3781143 3895590 4017461 4147301 4285720 4433441 4591201 4759547 4938433
50468 4938433 5127190 5325412 5533897 5753898 5985101 6224958 6470352 6719312 6970612
50459 6970612 7222360 7471617 7714806 7947501 8164060 8358379 8525115 8659781 8758060 8816203
50449 8816203 8832355 8806855 8741097 8637009 8498195 8330930 8143101 7941954 7733088 7521494
50439 7521494 7313119 7115184 6934904 6777799 6646940 6543444 6467239 6417202 6390842 6384246
50429 6384246 6392365 6409156 6427500 6439333 6436234 6410413 6356043 6270589 6155267 6014102 5852251
50418 5852251 5674711 5485688 5288317 5084939 4878123 4671520 4469256 4274219 4087230
50409 4087230 3908035 3736857 3574669 3422234 3279401 3145539 3020404 2904260 2797142
50400 2797142 2698283 2606524 2521190 2442245 2369625 2302821 2241422 2185720 2136335 2093228 2055365
50389 2055365 2021413 1990598 1962888 1938591 1917854 1900429 1885834 1873791 1864456 1858151 1854840 1853933
50377 1853933 1854682 1856890 1861244 1868773 1879845 1893912 1910551 1930423 1954618 1983173 2015015 2049474
50365 2049474 2086997 2128037 2172204 2219269 2270199 2326233 2387461 2453401 2524606 2602358 2686776
50354 2686776 2776650 2871569 2973082 3083011 3201474 3327273 3459351 3596846 3738115 3880844
50344 3880844 4023201 4164261 4303253 4438949 4569718 4693540 4807874 4910034 4997724 5068634
50334 5068634 5119429 5146009 5145549 5118149 5066201 4992621 4900326 4793045 4675497 4552329 4427468
50323 4427468 4304826 4188717 4082557 3987404 3902716 3828609 3766638 3718295 3683584 3661277 3649406
50312 3649406 3644717 3642409 3637580 3626775 3607607 3577450 3533763 3475706 3404530 3322286 3230959 3132743
50300 3132743 3029964 2924297 2816883 2709480 2604384 2502666 2403678 2307235 2215309 2130252
50290 2130252 2051935 1978062 1907124 1839632 1776452 1717464 1662450 1611959 1566300 1524469 1485230
50279 1485230 1448868 1416868 1389825 1366477 1344936 1324298 1304818 1286971 1270717 1255588 1241319
50268 1241319 1228304 1217284 1208437 1200930 1193619 1186048 1178493 1171147 1163788 1156355 1149401 1143747 1139882
50255 1139882 1137783 1136944 1136363 1135004 1132855 1131402 1132434 1136195 1141052 1145194 1148452 1152229 1157828 1165150
50241 1165150 1173009 1180286 1186433 1191147 1194292 1196527 1199522 1204728 1211832 1218987 1224802 1229593 1234316 1238806
50227 1238806 1241738 1242224 1240967 1239781 1240274 1242864 1246631 1250034 1252111 1253243 1254782 1258019 1263455 1270709
50213 1270709 1278789 1286716 1294296 1302399 1312539 1326447 1345826 1371280 1400411 1427466 1446133 1453249
50201 1453249 1449731 1438524 1422383 1403087 1381389 1357375 1331539 1305525 1281082 1258547 1237360
50190 1237360 1217865 1201143 1187034 1173909 1160955 1149272 1140039 1132972 1127421 1123592 1121584 1120498
50178 1120498 1119754 1120180 1122454 1125470 1127722 1129304 1130830 1131344 1129352 1125398 1121353 1117273 1111248 1102716 1093769
50163 1093769 1086317 1079681 1071954 1062335 1051154 1038800 1025692 1012451 999287 986011 973214 962408
50151 962408 954231 947600 941548 936829 934547 934050 933624 932782 932518 933458 934963 936092 936485 936332 936418 938270
50135 938270 943200 950806 959112 966648 973939 982570 993226 1005098 1017047 1028909 1041649 1056477 1074018
50122 1074018 1094195 1116638 1141089 1167534 1196074 1226520 1257956 1288966 1318602 1346956 1374361
50111 1374361 1400299 1423682 1444123 1462208 1478476 1493016 1506322 1519619 1533481 1546436 1555662
50100 1555662 1559155 1556968 1550432 1540547 1527180 1509654 1487901 1462820 1435663 1407729 1380998 1358240
50088 1358240 1341296 1329259 1319254 1309109 1298607 1288416 1279103 1271383 1265922 1262040 1257396 1249666
50076 1249666 1238070 1223035 1205320 1186022 1166531 1147715 1129744 1113180 1099298 1088700 1080515
50065 1080515 1073847 1069034 1066503 1065182 1063311 1060353 1057102 1054417 1052830 1052839 1054366 1056345 1057919 1059533 1061727
50050 1061727 1063458 1063250 1061767 1061634 1064505 1069627 1075351 1080640 1084913 1087973 1090680 1094437 1099295 1103623
50036 1103623 1106225 1107840 1109801 1112207 1114269 1115777 1117332 1119529 1122711 1127247 1133430 1141230 1150479 1161011
50022 1161011 1172297 1183354 1193575 1203588 1214969 1229064 1246006 1264596 1283216 1301260 1319707
50011 1319707 1339991 1362485 1386632 1412325 1440301 1471171 1504977 1541889 1582389 1626421 1673337
50000 1673337 1723108 1776531 1833344 1890926 1945839 1996239 2042068 2083567 2120906 2155125 2188138
49989 2188138 2221174 2253735 2284355 2311882 2335642 2354615 2366917 2370225 2362793 2344248 2315693 2279104
49977 2279104 2236463 2189117 2137676 2082569 2024778 1965967 1907797 1851305 1796938 1744707 1694094
49966 1694094 1644530 1596684 1552810 1514935 1482927 1455111 1430296 1408039 1387252 1366249 1344589
49955 1344589 1323412 1303345 1283333 1262312 1240857 1220210 1200680 1182039 1164568 1148497 1133037
49944 1133037 1117133 1100632 1083673 1065586 1045852 1025751 1007539 991937 977727 963882 950930
49933 950930 940034 931903 926945 925370 926530 928866 931112 933182 935723 939290 943920 948917 953029 955561
49919 955561 957235 959135 960898 961132 959727 958284 957642 956314 952353 945688 937490 928239 918020 908178
49905 908178 900845 896457 893100 888871 883976 879935 877600 876785 877368 879808 884490 891150 899211 908485 919427
49890 919427 932740 948756 967207 987638 1010089 1035355 1064535 1098444 1137420 1181391 1229696
49879 1229696 1280850 1332936 1384609 1435549 1485511 1533001 1575436 1610971 1639769 1663072 1681409
49868 1681409 1694424 1702300 1706399 1707952 1706637 1700802 1688590 1668342 1638591 1598982 1551485 1499874
49856 1499874 1447384 1395180 1343335 1292635 1244689 1200631 1160590 1124444 1092244 1063596 1037414
49845 1037414 1012973 990830 972051 956808 944435 934608 927457 922374 917804 912955 909072 908072 910147
49832 910147 913529 916658 919840 924592 931870 941172 950899 959283 965315 969175 971680 973192 973277 971460 967912
49817 967912 963132 957279 950170 941577 931040 917680 900992 881972 862904 845660 830517 816875
49805 816875 804611 794095 785055 776260 766826 757551 750479 747043 746794 748007 749407 751124 753985 758036
49791 758036 762236 765813 769485 774716 781796 789516 797102 805634 816694 830108 844061 857282 869925
49778 869925 882094 892799 901142 907664 913490 918643 922209 923907 924538 924816 924473 922587 918180 910646
49764 910646 900431 889471 880059 872830 866399 859343 852065 846375 843652 843730 845149 846163 845995 845666 847354
49749 847354 852496 860621 870199 880255 890850 902436 915295 929335 943878 957797 970354 981804
49737 981804 992693 1002759 1011071 1017173 1021450 1024307 1025526 1024540 1020769 1013576 1002600 988656 973814
49724 973814 959913 947010 933698 918982 903505 888826 875793 863953 852551 841789 832660 825496
49712 825496 819118 811885 803547 795627 789874 786648 784994 784055 784070 785887 789683 794454 799042 803483 808849
49697 808849 815712 823511 831808 841254 852225 863050 871105 875885 879693 884834 891296 897724 903173 906713
49683 906713 906534 901473 893117 884705 877741 871121 863705 856147 849568 843864 838428 833438 829271 825389
49669 825389 821197 817696 816964 819786 824689 829431 832775 834728 835927 837230 839396 842742 847279 853095
49655 853095 860236 868310 876895 886512 898481 913347 929942 946349 961293 974146 984208 991018
49643 991018 995298 998721 1002353 1005783 1007971 1008520 1007832 1006406 1004550 1002697 1001499 1001380 1002112 1002959 1003169 1002279
49627 1002279 1000192 997192 993952 991317 989876 989614 990045 990774 991974 994355 998575 1004567 1011405 1017951 1023874
49612 1023874 1030119 1038334 1049680 1064023 1080049 1095906 1109757 1120065 1125914 1127380 1125586 1122183
49600 1122183 1118620 1115772 1113991 1113171 1112791 1112425 1112514 1114287 1118156 1122192 1122912 1117989 1107797 1094010 1077404
49585 1077404 1057848 1036047 1014091 993902 975836 959138 943129 927563 912467 898354 886228
49574 886228 876727 869471 863735 859376 856236 852985 847784 840487 833141 827736 824183 821200 818348 816065
49560 816065 814000 810715 805391 798926 792846 787724 783182 778963 775316 772530 770617 769456 768889 768761 769251
49545 769251 771101 775118 781252 788257 794307 797966 798938 798316 798033 799592 803049 807223 810771 812904 813399
49530 813399 812517 811033 809946 809847 810744 812515 815228 818895 823217 827710 831858 835051 836783 837272 837678 839379
49514 839379 842949 847781 852580 856308 859023 861895 866082 871565 877486 883637 890963 900258 910977 921922
49500 921922 932654 943575 954994 966890 979434 992811 1006244 1017821 1025801 1029943 1031448 1031827
49488 1031827 1031900 1031556 1030154 1027076 1022000 1014896 1006216 997194 989462 983931 980284 977885 976728 976891 977455
49473 977455 976880 974525 971063 967300 963374 959456 956612 956395 959781 966723 976381 987492 998872 1009936
49459 1009936 1020718 1031306 1041435 1050727 1058999 1066264 1072747 1079109 1086334 1095071 1105061 1115327 1124937
49446 1124937 1133717 1142298 1151290 1160354 1168498 1175434 1181915 1188049 1191975 1191350 1185894 1177332 1166975 1154727
49432 1154727 1140577 1125476 1110096 1094085 1077461 1061628 1047954 1036298 1025999 1017441 1011269 1006736
49420 1006736 1002353 997973 994822 993428 992753 991636 990003 988360 986918 985556 983983 981667 978268 974322
49406 974322 971016 969100 968452 968580 968886 968508 966822 964350 962453 961812 961806 961610 961231 961204 961816 962920 963980
49389 963980 964097 962650 960212 958157 957011 955792 953381 949859 945922 941657 936698 931270 926270 922440
49375 922440 920007 918981 919236 920361 921988 924239 927472 931644 936385 941676 948015 955908 965513 976844
49361 976844 989962 1004988 1022145 1041708 1063729 1088228 1116264 1150389 1192424 1239641 1283640
49350 1283640 1314286 1325706 1319011 1300105 1275677 1250819 1228574 1210118 1195190 1183128 1173860 1167721
49338 1167721 1164471 1163130 1162999 1164392 1168057 1174245 1182682 1192985 1204546 1216240 1226924 1236312 1244835
49325 1244835 1252554 1258706 1262503 1264012 1263851 1262276 1258973 1253756 1247171 1240172 1233301 1226513 1219943 1214587
49311 1214587 1211631 1210954 1210791 1209348 1206634 1204383 1204348 1206989 1211558 1216939 1222364 1227638 1232679 1236704 1238202
49296 1238202 1236334 1232261 1228406 1226150 1224647 1222045 1217522 1212037 1207519 1205611 1206811 1210442 1215316 1220397
49282 1220397 1224854 1227913 1229224 1229247 1228735 1227847 1226314 1224404 1222866 1221659 1219567 1215678 1210682 1205900 1201390
49267 1201390 1195967 1189185 1182463 1177643 1174801 1172167 1168197 1163082 1157909 1153009 1148000 1143109 1139234 1136466
49253 1136466 1133775 1130881 1129216 1129853 1131361 1131290 1129313 1127217 1126031 1125087 1124220 1124840 1127704 1131139 1132844
49238 1132844 1132579 1131914 1132056 1133076 1134714 1136748 1138810 1140830 1143586 1148147 1154869 1163240 1172253 1180537 1186949
49223 1186949 1191822 1197003 1203927 1212211 1220782 1229417 1238120 1245961 1252039 1257029 1262249 1267628 1272212 1276380
49209 1276380 1281622 1287989 1293632 1297366 1300044 1302755 1305306 1307439 1310001 1313502 1316584 1317581 1317151 1317925 1321587
49194 1321587 1327477 1334209 1341638 1350691 1361901 1374856 1389174 1405474 1424834 1447311 1471592 1496333
49182 1496333 1521085 1545245 1566822 1583394 1593968 1598745 1597476 1589718 1576781 1561558 1545712 1528575
49170 1528575 1509685 1490839 1474368 1460643 1448711 1438347 1429896 1422942 1416878 1412314 1410227 1409979 1409830
49157 1409830 1409159 1408433 1407007 1402917 1395354 1385616 1375012 1363570 1351709 1341424 1334177 1328762 1322961
49144 1322961 1316710 1312017 1310062 1310068 1311221 1314140 1319745 1327670 1336705 1346350 1357098 1369215 1381666 1392392
49130 1392392 1399614 1403063 1404209 1405232 1407540 1411081 1414913 1418240 1420932 1423271 1425444 1427354 1428919 1430541
49116 1430541 1433152 1437667 1444341 1452702 1462101 1472261 1483283 1495267 1508059 1521401 1535359 1550650
49104 1550650 1568533 1590100 1615176 1641495 1665005 1681471 1688371 1685731 1675610 1661042 1645229 1630861
49092 1630861 1619541 1611750 1607471 1606607 1608662 1612444 1616691 1620933 1625328 1629739 1633500 1636226 1638317 1640342
49078 1640342 1642230 1643377 1643439 1642784 1642236 1642401 1643081 1643342 1642370 1640438 1638925 1639412 1642855 1649373 1658310 1668442
49062 1668442 1678675 1688823 1699486 1711078 1723370 1735920 1748482 1760926 1773539 1787657 1805185
49051 1805185 1826930 1852011 1879353 1908947 1941038 1975176 2011523 2052448 2101196 2159027 2225048
49040 2225048 2298619 2379673 2465777 2550879 2629261 2700580 2769702 2840997 2912644 2975484 3017008
49029 3017008 3028302 3009871 2971458 2924786 2875196 2820028 2754480 2677873 2594282 2508992 2425956
49018 2425956 2347998 2277564 2216262 2164209 2120531 2084400 2055110 2031349 2011207 1993539 1978981
49007 1978981 1968961 1963774 1962175 1962794 1965057 1968462 1972027 1975298 1979120 1984391 1990555 1996606 2003289 2012781
48993 2012781 2025792 2040283 2053792 2066126 2078964 2093532 2109550 2126038 2142266 2157990 2173350
48982 2173350 2188610 2203820 2219046 2235018 2252758 2271961 2290446 2306203 2319767 2333662 2349632
48971 2349632 2367229 2385094 2402706 2420702 2440232 2462321 2487348 2514859 2544141 2574821 2606387
48960 2606387 2637362 2665918 2691466 2714856 2736802 2757107 2775729 2793533 2811297 2828907 2846458
48949 2846458 2865279 2886698 2910199 2933996 2957160 2980052 3002917 3025418 3047733 3070681 3094119
48938 3094119 3116319 3135752 3152773 3168776 3184263 3198452 3210280 3219007 3224350 3226926 3228418 3230446
48926 3230446 3233199 3235671 3236992 3236851 3234977 3231283 3226667 3222668 3219950 3217814 3215559 3213578 3212740 3213422 3215708
48911 3215708 3219860 3225881 3233144 3241278 3250999 3263100 3276775 3289966 3301538 3312294 3323547 3335481
48899 3335481 3347426 3359161 3371177 3383808 3396734 3409577 3422721 3437378 3454882 3475939 3500521
48888 3500521 3528453 3559954 3595433 3634741 3676826 3720304 3764525 3810092 3858270 3909689 3963616
48877 3963616 4018722 4074595 4132148 4192379 4255179 4319671 4385250 4451597 4518066 4583900 4649196
48866 4649196 4714923 4781783 4849594 4917884 4986385 5054610 5121672 5187079 5251415 5315761 5380759
48855 5380759 5446593 5513387 5580981 5648461 5714480 5778141 5839314 5898181 5954699 6008380 6058402
$$ [...]
##END NTUPLES=NMR SPECTRUM
##END=
