
##TITLE=AC1106_ROVE100D_5868126_5qzzNgtZPV
##JCAMPDX= 6.0         $$ Bruker NMR JCAMP-DX V2.0
##DATA TYPE= NMR SPECTRUM
##DATA CLASS= NTUPLES
##ORIGIN= BRUKER
##OWNER= Administrator
$$ 1.72 TOPSPIN		Version 2.1
$$ 2012-03-31 00:59:45.734 -0500  Administrator@TOPSPIN
$$ Compression mode = diff/dup
##.OBSERVE FREQUENCY= 400.13188235
##.OBSERVE NUCLEUS= ^1H
##.ACQUISITION MODE= SIMULTANEOUS (DQD)
##.ACQUISITION SCHEME= undefined
##.AVERAGES= 8
##.DIGITISER RES= 22
##SPECTROMETER/DATA SYSTEM= spect
##.PULSE SEQUENCE= zg30
##.SOLVENT NAME= COFFEE_meoh
##.SHIFT REFERENCE= INTERNAL, COFFEE_meoh, 1, 14.98061
##AUDIT TRAIL= $$ (NUMBER, WHEN, WHO, WHERE, PROCESS, VERSION, WHAT)
$$ ##TITLE= Audit trail, TOPSPIN		Version 2.1
$$ ##JCAMPDX= 5.01
$$ ##ORIGIN= Bruker BioSpin GmbH
$$ ##OWNER= Administrator
$$ $$ C:\Bruker\TOPSPIN/data/COFFEE/nmr/AC1106_ROVE100D_5868126_5qzzNgtZPV/10/pdata/1/auditp.txt
$$ ##AUDIT TRAIL=  $$ (NUMBER, WHEN, WHO, WHERE, PROCESS, VERSION, WHAT)
(   1,<2012-03-31 00:59:38.734 -0500>,<Administrator>,<TOPSPIN>,<go>,<TOPSPIN 2.1>,
      <created by zg
	started at 2012-03-31 00:58:31.890 -0500,
	POWCHK enabled, PULCHK disabled,
       configuration hash MD5:
       1A 1E CE 29 27 FD 77 03 67 4E F0 E3 C4 B2 CB 90
       data hash MD5: 64K
       B4 E9 F8 49 4B EA 21 6D F6 31 95 1A 5D F3 73 12>)
(   2,<2012-03-31 00:59:41.343 -0500>,<Administrator>,<TOPSPIN>,<proc1d>,<TOPSPIN 2.1>,
      <Start of raw data processing
       efp LB = 0 FT_mod = 6 PKNL = 1 PHC0 = 0 PHC1 = 0 SI = 32K 
       data hash MD5: 32K
       FE BF AB 1C E7 14 A6 79 26 3F C4 15 38 08 1C 3C>)
(   3,<2012-03-31 00:59:41.765 -0500>,<Administrator>,<TOPSPIN>,<proc1d>,<TOPSPIN 2.1>,
      <pk PHC0 = 208.7787 PHC1 = 0 
       data hash MD5: 32K
       E1 D6 7D CA 24 4D 63 1B 39 1E 2F F4 57 99 2C 1A>)
(   4,<2012-03-31 00:59:41.859 -0500>,<Administrator>,<TOPSPIN>,<proc1d>,<TOPSPIN 2.1>,
      <abs ABSG = 1 
       data hash MD5: 32K
       6C A8 A9 8A F4 99 8A 5C AB 9B 96 F5 96 95 58 78>)
(   5,<2012-03-31 00:59:41.890 -0500>,<Administrator>,<TOPSPIN>,<proc1d>,<TOPSPIN 2.1>,
      <abs ABSG = 2 
       data hash MD5: 32K
       6F 94 D8 D6 65 7F D8 45 41 CC 4D F6 3C C9 0D 11>)
(   6,<2012-03-31 00:59:41.921 -0500>,<Administrator>,<TOPSPIN>,<proc1d>,<TOPSPIN 2.1>,
      <abs ABSG = 3 
       data hash MD5: 32K
       F4 36 C7 69 A3 46 CB 2A 7F 68 FB 7A 80 8E E0 A3>)
(   7,<2012-03-31 00:59:41.953 -0500>,<Administrator>,<TOPSPIN>,<proc1d>,<TOPSPIN 2.1>,
      <abs ABSG = 4 
       data hash MD5: 32K
       A3 19 D1 37 39 14 F7 49 08 99 45 D1 3F B0 BD 5C>)
(   8,<2012-03-31 00:59:41.984 -0500>,<Administrator>,<TOPSPIN>,<proc1d>,<TOPSPIN 2.1>,
      <abs ABSG = 5 
       data hash MD5: 32K
       C4 15 76 E0 5D 17 D2 8E 02 DB F8 23 30 CD 3E C8>)
$$ ##END=
$$ 
$$ $$ hash MD5
$$ $$ C5 F8 39 8F F1 26 7D 65 50 76 18 97 20 B0 37 85
##$RELAX= 
##$RELAX= 
##$RELAX= 
##$RELAX= 
##$RELAX= 
##$RELAX= 
##$RELAX= 
$$ Bruker specific parameters
$$ --------------------------
$$ [...]
150 150 150 150 150 150 150 150
##$TP07= 0
##$TPNAME0= <>
##$TPNAME1= <>
##$TPNAME2= <>
##$TPNAME3= <>
##$TPNAME4= <>
##$TPNAME5= <>
##$TPNAME6= <>
##$TPNAME7= <>
##$TPOAL= (0..7)
0.5 0.5 0.5 0.5 0.5 0.5 0.5 0.5
##$TPOFFS= (0..7)
0 0 0 0 0 0 0 0
##$TUNHIN= 0
##$TUNHOUT= 0
##$TUNXOUT= 0
##$USERA1= <user>
##$USERA2= <user>
##$USERA3= <user>
##$USERA4= <user>
##$USERA5= <user>
##$V9= 5
##$VALIST= <valist>
##$VCLIST= <CCCCCCCCCCCCCCC>
##$VD= 0
##$VDLIST= <DDDDDDDDDDDDDDD>
##$VPLIST= <PPPPPPPPPPPPPPP>
##$VTLIST= <TTTTTTTTTTTTTTT>
##$WBST= 2048
##$WBSW= 25
##$XGAIN= (0..3)
0 0 0 0
##$XL= 0
##$YL= 0
##$YMAX_a= 545130
##$YMIN_a= -664947
##$ZGOPTNS= <>
##$ZL1= 120
##$ZL2= 120
##$ZL3= 120
##$ZL4= 120
##$ABSF1= 14.98061
##$ABSF2= -5.57192
##$ABSG= 5
##$ABSL= 3
##$ALPHA= 0
##$AQORDER= 0
##$ASSFAC= 0
##$ASSFACI= 0
##$ASSFACX= 0
##$ASSWID= 0
##$AUNMP= <proc_prof1d_extract_pilot.lims>
##$AXLEFT= 0
##$AXNAME= <>
##$AXNUC= <1H>
##$AXRIGHT= 0
##$AXTYPE= 0
##$AXUNIT= <>
##$AZFE= 0.1
##$AZFW= 0.1
##$BCFW= 0
##$BC_mod= 0
##$BYTORDP= 0
##$COROFFS= 0
##$CY= 15
##$DATMOD= 1
##$DC= 0
##$DFILT= <>
##$DTYPP= 0
##$F1P= 0
##$F2P= 0
##$FCOR= 0.5
##$FTSIZE= 32768
##$FT_mod= 6
##$GAMMA= 0
##$GB= 0
##$INTBC= 1
##$INTSCL= 1
##$ISEN= 128
##$LB= 0
##$LEV0= 0
##$LPBIN= 0
##$MAXI= 10000
##$MC2= 0
##$MEAN= 0
##$ME_mod= 0
##$MI= 0
##$NCOEF= 0
##$NC_proc= -8
##$NLEV= 6
##$NOISF1= 0
##$NOISF2= 0
##$NSP= 0
##$NTH_PI= 0
##$NZP= 0
##$OFFSET= 14.98061
##$PC= 1
##$PHC0= 208.7787
##$PHC1= 0
##$PH_mod= 1
##$PKNL= yes
##$PPARMOD= 0
##$PPDIAG= 0
##$PPIPTYP= 0
##$PPMPNUM= 2147483647
##$PPRESOL= 1
##$PSCAL= 4
##$PSIGN= 0
##$PYNMP= <proc.py>
##$REVERSE= no
##$SF= 400.13
##$SI= 32768
##$SIGF1= 0
##$SIGF2= 0
##$SINO= 400
##$SIOLD= 32768
##$SPECTYP= <>
##$SREGLST= <1H.CDCl3>
##$SSB= 0
##$STSI= 32768
##$STSR= 0
##$SW_p= 8223.68421052632
##$SYMM= 0
##$S_DEV= 0
##$TDeff= 65536
##$TDoff= 0
##$TI= <>
##$TILT= no
##$TM1= 0
##$TM2= 0
##$TOPLEV= 0
##$USERP1= <user>
##$USERP2= <user>
##$USERP3= <user>
##$USERP4= <user>
##$USERP5= <user>
##$WDW= 1
##$XDIM= 32768
##$YMAX_p= 468108994
##$YMIN_p= -657835
##$CURPLOT= <Network HP LaserJet P1505>
##$CURPRIN= <$Network HP LaserJet P1505>
##$DFORMAT= <normdp>
##$LAYOUT= <+/1D_H.xwp>
##$LFORMAT= <normlp>
##$PFORMAT= <normpl>
##$SURQMSG= 1
$$ End of Bruker specific parameters
$$ ---------------------------------
##NTUPLES= NMR SPECTRUM
##VAR_NAME=  FREQUENCY,     SPECTRUM/REAL,   SPECTRUM/IMAG
##SYMBOL=    X,             R,               I
##VAR_TYPE=  INDEPENDENT,   DEPENDENT,       DEPENDENT
##VAR_FORM=  AFFN,          ASDF,            ASDF
##VAR_DIM=   32768,         32768,           32768
##UNITS=     HZ,            ARBITRARY UNITS, ARBITRARY UNITS
##FACTOR=    0.250966925370066, 1,           1
##FIRST=     8223.43324360095, -133069,      -196089
##LAST=      0,             -69751,          -270201
##MIN=       0,             -657835,         0
##MAX=       8223.43324360095, 468108994,    0
$$ Real data points
##PAGE= N=1
##DATA TABLE= (X++(R..R)), XYDATA
$$ [...]
19526d14681D2986J72957e9509H9748L0776a65656J5815C77379j51850A1167d11291
$$ -414681 42986 215943 -59509 89748 120524 -165656 -149841 377379 225529 11167 -411291
19514b61325p0069I6234a61603L6254c3748A26053f7673F1980i0293a8089B12140
$$ -261325 -331394 96234 -161603 -125349 -33748 126053 -67673 61980 -90293 -18089 212140
19502a81644B89160a45596d7427o7487C7304b23328n688R9646e1225K2623q1127
$$ -181644 289160 -145596 -47427 -114914 37304 -223328 -229016 -129370 -51225 -28602 -109729
19491a09729o1214l217B39266H3555J1450k4525c8168o4127F5209P8614K0394
$$ -109729 -170943 -174160 239266 83555 95005 70480 -38168 -102295 65209 143823 164217
19480A64217f7818A80529G0343Q7794o5531d7023j76758C40159A25236E5443K10595
$$ 164217 -67818 180529 70343 158137 92606 -47023 -223781 340159 125236 55443 266038
19469B66038r1810e5711j55014c5767j69749c4766k7266l9728c7687A87619b07706
$$ 266038 174228 -55711 -210725 -35767 -205516 -34766 -62032 -101760 -37687 187619 -207706
19457D8192J51499b30234B7697b10350h6386A95441c7479k59049C2669c63911
$$ 48192 199691 -230234 27697 -210350 -86386 195441 -37479 -296528 32669 -363911
19446a80053D5246a11011R840F2901a5522j35845D3075a5399j0685k35420B01799
$$ -180053 45246 -111011 -101171 62901 -15522 -151367 43075 -15399 -26084 -261504 201799
19434A64639l267b79965k9167O589L5188n4103b2632A08258h0578j75301e6621
$$ 164639 161372 -279965 -309132 -302543 -267355 -321458 -22632 108258 -80578 -255879 -56621
19422b82335b6364B43074A15070D4366O1849a23254j2899N6227n6041k4095n7556
$$ -282335 -26364 243074 115070 44366 106215 -123254 -136153 -79926 -135967 -160062 -217618
19411b17618A8333b53874J13716A3197a61386B7484a70945B55692j08231a3259
$$ -217618 18333 -253874 -140158 13197 -161386 27484 -170945 255692 147461 -13259
19400I2855e1688k79566C8071b75520n6543a07947A71308d3833A8272m110b61596
$$ 92855 -51688 -331254 38071 -275520 -332063 -107947 171308 -43833 18272 14162 -261596
19388c7440l0447j15903r1671P5976c7206G9868h0921q6665A50750o3992O0019
$$ -37440 -67887 -183790 -275461 -199485 -37206 79868 -80921 -167586 150750 86758 146777
19377A46777a27968A54916a98285F7409a70192A96908c17579j82866B3270K095
$$ 146777 -127968 154916 -198285 67409 -170192 196908 -317579 -500445 23270 25365
19367B5365b4900k46206A21293a67409A25465a7371k4888A62459Q5201H6476P8931
$$ 25365 -24900 -271106 121293 -167409 125465 -17371 -42259 162459 247660 86476 165407
19356A65407J6224c8837j69837H046b04208R3595B9257f1740A9549a6266l50538
$$ 165407 181631 -38837 -208674 8046 -204208 -110613 29257 -61740 19549 -16266 -366804
19345c66804F8979j6197Q9694K13395g0926j30804M5887B06081G1157P8373n6468
$$ -366804 68979 52782 142476 355871 -70926 -201730 -155843 206081 71157 149530 93062
19334I3062N7062b83315q8238J09860j47341a21760J8505A65848e09950d8850
$$ 93062 150124 -283315 -371553 -261693 -409034 -121760 -103255 165848 -509950 -48850
19323D4915a25034M3084k74592E0208N8679e1656B6696P8061a00783o9705L079
$$ 44915 -125034 -81950 -356542 50208 108887 -51656 26696 104757 -100783 -170488 -167409
19312a67409A44269N8353q8697A4894b24604K1497e5200G078a22068H8727k1217
$$ -167409 144269 202622 113925 14894 -224604 -203107 -55200 7078 -122068 88727 67510
19301F7510f5933G9996J32013K4798I5081c1779o3236A94509i2845k95923A75933
$$ 67510 -65933 79996 212009 236807 95081 -31779 -95015 194509 -92845 -388768 175933
19289A44697B9331c82878B55216a41106C9702c08717J02155B4577J43119a46302
$$ 144697 29331 -382878 255216 -141106 39702 -308717 -206562 24577 167696 -146302
19278a64336M0278q9434F6418c0019C4036Q5470a01157k5853o1279a3623j12261
$$ -164336 -124058 -213492 66418 -30019 34036 119506 -101157 -127010 -188289 -13623 -125884
19267a25884C71526a4528n7482A12923i1562k393A91156i0459A5223g6408j8749
$$ -125884 371526 -14528 -72010 112923 -91562 -93955 191156 -90459 15223 -76408 -95157
19256i5157A48581g5694j88840A32851b2008j07602L1659J1594I4153i9888J1635
$$ -95157 148581 -75694 -264534 132851 -22008 -129610 -97951 -86357 94153 -99888 -88253
19245h8253A46590b12042o8832l9101i7659L1359A79124c6j78704f2437j18185
$$ -88253 146590 -212042 -280874 -319975 -97659 -66300 179124 -36 -178740 -62437 -180622
19234a80622E952b79686d7246j133G9444a05829A65069a16083D6669J16632b61988
$$ -180622 5952 -279686 -47246 -48379 79444 -105829 165069 -116083 46669 163301 -261988
19222i3791H2517e6940A37313b44126j1849A26638f7336m7989A52902a84083P1822
$$ -93791 82517 -56940 137313 -244126 -255975 126638 -67336 -115325 152902 -184083 -112261
19211a12261l075G8357e9695j99794C7295g7308L5442H8770a97173Q7755b1761
$$ -112261 -115336 78357 -59695 -259489 37295 -77308 -41866 88770 -197173 -109418 -21761
19199a12298G8575N6316F5347J98207C8240a84590C2211b38065f0523G8363b08476
$$ -112298 78575 134891 65347 263554 38240 -184590 32211 -238065 -60523 78363 -208476
19187a99957A19462e1551j00633B4301c4086A95759H1157a02304q1237B09916
$$ -199957 119462 -51551 -152184 24301 -34086 195759 81157 -102304 -183541 209916
19176h956B2289c91136b1982j97477p29B8433K08028H799a87650A23417b91271
$$ -8956 22289 -391136 -21982 -219459 -220188 28433 236461 8799 -187650 123417 -291271
19164B34343A468R8357A316J03598B6877M5806a2456I4282a16750B26512i5546
$$ 234343 1468 99825 1316 104914 26877 72683 -12456 94282 -116750 226512 -95546
19152b54164N5410D9655b87190A35733a6715F9575e6901B48024c11680L7382B00157
$$ -254164 -198754 49655 -287190 135733 -16715 69575 -56901 248024 -311680 -274298 200157
19140a16331A5465b66307Q648L0445e0666j77135a1703n2983P48A61537J9524
$$ -116331 15465 -266307 -257659 -227214 -50666 -227801 -11703 -64686 -63938 161537 181061
19129A81061b60249g610k5742l3024a0001I0160b68615B41699f23286c6347e759
$$ 181061 -260249 -7610 -33352 -66376 -10001 90160 -268615 241699 -623286 -36347 -5759
19117a781k91515j29828a64086B38008F9842m649K21847b55783A26951c1843o1215
$$ -1781 -293296 -423124 -164086 238008 69842 65193 287040 -255783 126951 -31843 -93058
19106i3058C119P0881i0666C56592a08335B764b92331F0681a94814n134k06992
$$ -93058 3119 74000 -90666 356592 -108335 2764 -292331 60681 -194814 -199948 -406940
19095d06940B8946f6783A84644b56688F3187K3693G647J78404B093L6305N0939
$$ -406940 28946 -66783 184644 -256688 63187 86880 7647 186051 2093 38398 89337
19084H9337d09026a21812A25562b06861K8550C05014b04809Q1335o5378c1161
$$ 89337 -409026 -121812 125562 -206861 -178311 305014 -204809 -123474 -188852 -31161
19073e26067c1901H9404b54875B06504B6231b57336A53278c1656j6651J5910B8370
$$ -526067 -31901 89404 -254875 206504 26231 -257336 153278 -31656 -48307 -32397 28370
19061B97685g322I6686J25351b67558h8885r9423e2769C5985a30982A15709a42777
$$ 297685 -7322 96686 222037 -267558 -88885 -188308 -52769 35985 -130982 115709 -142777
19049a57756n4380A59769a90433h5603l05661a33870j2084H1985Q6616a40942
$$ -157756 -212136 159769 -190433 -85603 -391264 -133870 -145954 81985 168601 -140942
19038h4633O842E4882b32539B04260c450j33019q949l99239F5873a6011j4151
$$ -84633 -77791 54882 -232539 204260 -3450 -136469 -145418 -544657 65873 -16011 -30162
19027c0162r0683A26282J54806C2167c0478j39671B36849e5832m480A8485o602
$$ -30162 -120845 126282 281088 32167 -30478 -170149 236849 -55832 -60312 18485 11883
19016A1883J58076a81689J0501I1007c8141j04300C2010R2714l4380m2370i9859
$$ 11883 169959 -181689 -171188 91007 -38141 -142441 32010 124724 90344 47974 -99859
19004c10874G4474l6002b70544A46354F7927O6412J77080c40650h4879j04586
$$ -310874 74474 38472 -270544 146354 67927 134339 311419 -340650 -84879 -189465
18994a89465k3744Q3884A0969N8133d8362A95271a06931k5209L9341B9972L54067
$$ -189465 -213209 -129325 10969 69102 -48362 195271 -106931 -132140 -92799 29972 384039
18983C84039E4969a86198l2331j96964c2099m5740A10263b23928a5224n123o8071
$$ 384039 54969 -186198 -218529 -415493 -32099 -77839 110263 -223928 -15224 -20347 -88418
18972h8418j37433A04679a10915d3755k06390j35749d8368k5802a3790j15621
$$ -88418 -225851 104679 -110915 -43755 -250145 -385894 -48368 -74170 -13790 -129411
18962a29411l6039I0764a00500a1693p0899c1889j09613k44267h5876B06121F5142
$$ -129411 -165450 90764 -100500 -11693 -82592 -31889 -141502 -385769 -85876 206121 65142
18950f0117n9018A17887K1947M0404E3205b4077A2620b05406A72585J54905d21513
$$ -60117 -119135 117887 139834 180238 53205 -24077 12620 -205406 172585 327490 -421513
18938e1438H2615J71696b56035A29903J01561a33416I2823a82169n8817m220A77597
$$ -51438 82615 254311 -256035 129903 231464 -133416 92823 -182169 -240986 -245206 177597
18926a74317K4044O2035l0857l7798f835k06206g6231F1397c3603H4560a97773
$$ -174317 -150273 -88238 -119095 -156893 -6835 -213041 -76231 61397 -33603 84560 -197773
18914f1456j95578A06600a34113A0036K2526N2487j9993d9851l44916a27483L7569
$$ -61456 -257034 106600 -134113 10036 32562 85049 65056 -49851 -394767 -127483 -89914
18903h9914l13133F2149g9113k08452J22271n7960J2693D5965M11682A58352b11792
$$ -89914 -403047 62149 -79113 -287565 -165294 -223254 -210561 45965 457647 158352 -211792
18891A03454k8706d5833j73041A0769J37621e1046j38734A95039b01775H778J20437
$$ 103454 74748 -45833 -218874 10769 148390 -51046 -189780 195039 -201775 8778 129215
18880A29215d40k23239b5339j68537A28402h6219m2474A05309G719a64778B4694
$$ 129215 -440 -223679 -25339 -193876 128402 -86219 -128693 105309 7719 -164778 24694
18868c04796a12199a8514l6689J0329j96845M7865C7940a17308a1936k43222d0075
$$ -304796 -112199 -18514 -55203 -44874 -241719 -193854 37940 -117308 -11936 -255158 -40075
18856b75668R0870e5653k9498K6126j03503a8856C54279p2609D9652a92838A68231
$$ -275668 -184798 -55653 -85151 -59025 -162528 -18856 354279 281670 49652 -192838 168231
18844B3132K24233a44533Q430e6821j2191k23901f6542r0469m6406B21500i6760
$$ 23132 247365 -144533 -136103 -56821 -69012 -292913 -66542 -157011 -203417 221500 -96760
18832B17765b99867m6017I2680a57299l1164B5221c6949j11306C1239a12242l67653
$$ 217765 -299867 -345884 92680 -157299 -188463 25221 -36949 -148255 31239 -112242 -479895
18821d79895K38282A30318D7354b26986E850a98842A83959d9148e557n1626B66398
$$ -479895 -241613 130318 47354 -226986 5850 -198842 183959 -49148 -5557 -57183 266398
18809e2640E1702Q0869b02902j3220A22389c8462A06263R1913f7729A53791J63810
$$ -52640 51702 132571 -202902 -216122 122389 -38462 106263 198176 -67729 153791 317601
18798C17601b01956B20331a67574C4768J55984c86351J38170J10781A01842b48604
$$ 317601 -201956 220331 -167574 34768 190752 -386351 -248181 -137400 101842 -248604
18787b81750a9955k0177j26573o5145P1573C693O540h4687c1750A506a77604A97799
$$ -281750 -19955 -40132 -166705 -231850 -160277 3693 10233 -84687 -31750 1506 -177604 197799
18774b74842A48238a4398B42342a21614r0272I2035a3790j24635j40656B15539
$$ -274842 148238 -14398 242342 -121614 -211886 92035 -13790 -138425 -279081 215539
18763E0673D647c5502n7007F8484f5097k2284j26535i400k76870J7378D3489a4071
$$ 50673 4647 -35502 -92509 68484 -65097 -87381 -213916 -9400 -286270 -268892 43489 -14071
18750B47a39103A03406b92470C1360Q9667D274a37178a6474j85300L4059A4877
$$ 247 -139103 103406 -292470 31360 121027 4274 -137178 -16474 -201774 -167715 14877
18738A92667b3922A53836c22652a0123A85467H4250b01390B40281h0694k33007
$$ 192667 -23922 153836 -322652 -10123 185467 84250 -201390 240281 -80694 -313701
18728c13701B5863c148m19715a52950B27833d512H4982b9658C03923A34853a75107
$$ -313701 25863 -3148 -422863 -152950 227833 -4512 84982 -29658 303923 134853 -175107
18716i5268k23463A79707h0226a7078B51136b87016N9529g139j26508r2590D4496
$$ -95268 -318731 179707 -80226 -17078 251136 -287016 -227487 -7139 -133647 -226237 44496
18704e1630j49731q1443o9761J58370A96238a58660j21438A13353L5708M3623
$$ -51630 -201361 -282804 -352565 -194195 196238 -158660 -280098 113353 149061 192684
18694A92684b3382j34306e5034A89827i7011k12135a20568A97594d5029j44435
$$ 192684 -23382 -157688 -55034 189827 -97011 -309146 -120568 197594 -45029 -189464
18684a89464k08i1177M4840l1247J4796o0059A24090a71321A80707a77825A79177
$$ -189464 -189672 -91177 -46337 -77584 -62788 -122847 124090 -171321 180707 -177825 179177
18672b6864k69996B19208I8624J74555a03142r3737c5092m6134B17333c54751
$$ -26864 -296860 219208 98624 273179 -103142 -196879 -35092 -81226 217333 -354751
18661c11323G9818a16074a3027I8574g7639B34140f5449k63749j10197A41795
$$ -311323 79818 -116074 -13027 98574 -77639 234140 -65449 -329198 -439395 141795
18650a67215j7399k08577g6679B2541J79331f461A78420a63305M6137A1945a43429
$$ -167215 -184614 -393191 -76679 22541 201872 -6461 178420 -163305 -117168 11945 -143429
18638B3045J68716i7600K6123l5472C3991a21888H0387c49972A65973C1294b59933
$$ 23045 191761 -97600 -71477 -106949 33991 -121888 80387 -349972 165973 31294 -259933
18626I7789a30791j11475h5075j68386c7714p425G6468J58243D0650b4641j98137
$$ 97789 -130791 -242266 -85075 -253461 -37714 -45139 76468 234711 40650 -24641 -222778
18615b22778L4786i852C1594J12693J2772a55117c0024j06895A75017F231g6833
$$ -222778 -187992 -9852 31594 144287 157059 -155117 -30024 -136919 175017 6231 -76833
18603A27562F0184a20377j47460A3823a02643c6761i684j28012p2928L4195A90654
$$ 127562 60184 -120377 -267837 13823 -102643 -36761 -9684 -137696 -210624 -176429 190654
18591I522h2116A62776i5709a3532o0208j21853O932A95391i4210K9140L275G8826
$$ 9522 -82116 162776 -95709 -13532 -73740 -195593 -188661 195391 -94210 -65070 -61795 78826
18578a72005b3553m38859a89578E632K49857b04823c6764B89454c9004G0550b28683
$$ -172005 -23553 -462412 -189578 5632 255489 -204823 -36764 289454 -39004 70550 -228683
18566H1572c6703A79565j7276b56367e0715N740j27973G0828j7796d762k744m86853
$$ 81572 -36703 179565 162289 -256367 -50715 -44975 -172948 70828 53032 -4762 -7506 -494359
18554d94359d7387A31118a26091p995k9066B17103b22992C7158b73814e7498H3450
$$ -494359 -47387 131118 -126091 -134086 -163152 217103 -222992 37158 -273814 -57498 83450
18542A65148k2233F4560J9169N3035a40621M7992A17737j4913b69557D7430L8186
$$ 165148 142915 64560 83729 136764 -140621 -92629 117737 102824 -269557 47430 85616
18531H5616E346P7426c05128J39633I1517M2477J08708I6769b06029I8601A8958
$$ 85616 5346 82772 -305128 -165495 91517 133994 242702 96769 -206029 98601 18958
18519D55712c1335j23291l65576g1143b6395A43482a7941A82590e4884p3397B04189
$$ 455712 -31335 -154626 -520202 -71143 -26395 143482 -17941 182590 -54884 -128281 204189
18507H6398e5094C7832b47390a09316J7562Q249B14068b51945b2499F4863j2035
$$ 86398 -55094 37832 -247390 -109316 -91754 -83505 214068 -251945 -22499 64863 52828
18496E2828J66635I3975d62712K7843I5384B5507A0492Q9445D5125J82546c18663
$$ 52828 219463 93975 -462712 -434869 95384 25507 10492 99937 45125 227671 -318663
18484F8111b10089P992L5049d7323C04932j13284n7844a93887a5455A26759a78471
$$ 68111 -210089 -202097 -167048 -47323 304932 191648 133804 -193887 -15455 126759 -178471
18472a42083L2535m0936N8877o210k79642F1452h9088r2292d8718G626C279g5108
$$ -142083 -109548 -150484 -91607 -97817 -377459 61452 -89088 -181380 -48718 7626 3279 -75108
18459B6215O5308B3338b19157P6026A27118b12492e1772C31045G6775a7150p330
$$ 26215 91523 23338 -219157 -143131 127118 -212492 -51772 331045 76775 -17150 -24480
18448b4480j32741a8076k5708B63224j06384j4681m2506f308A9012M3753b01402
$$ -24480 -157221 -18076 -43784 263224 156840 142159 99653 -6308 19012 62765 -201402
18436F7294p756K8945c9714l35250e1426k85492K0945H7255K03516a73101c4813
$$ 67294 59538 88483 -39714 -374964 -51426 -336918 -315973 87255 290771 -173101 -34813
18424A77159f7273j28252n0454g0826O631A8584a3943j66094B95141c46079h2814
$$ 177159 -67273 -195525 -245979 -70826 -64195 18584 -13943 -180037 295141 -346079 -82814
18412a89985B1138a13938j14925A44070c6894a2099A54554c2659j09652j64216
$$ -189985 21138 -113938 -228863 144070 -36894 -12099 154554 -32659 -142311 -306527
18402c06527l1887H1020a72078B18188D4815a47702B18751G6076a62472l31937
$$ -306527 -338414 81020 -172078 218188 44815 -147702 218751 76076 -162472 -494409
18392d94409a13153d7162j53414H8100b78196A03589N20288a33514k9632B81130
$$ -494409 -113153 -47162 -200576 88100 -278196 103589 623877 -133514 -163146 281130
18381e9376n7792k28060g1332I0024k421c38207d510k12699G2654l0172f9807
$$ -59376 -117168 -345228 -71332 90024 87603 -338207 -4510 -217209 72654 42482 -69807
18369a63610l06555I3311P7170b01941m3623J02999J2187B11841p2371a16122
$$ -163610 -470165 93311 170481 -201941 -245564 -142565 -130378 211841 139470 -116122
18358b21455c4817A20906b7241A08825i503B98084b51028J25218B89630A8988
$$ -221455 -34817 120906 -27241 108825 -9503 298084 -251028 -125810 289630 18988
18347a48138P2454B7828O1362a35534D0711b9504j0018B3460a70193j5113f5922
$$ -148138 -75684 27828 89190 -135534 40711 -29504 -39522 23460 -170193 -185306 -65922
18335A63552a30371G2176b6961q514C40383j21944d8302B8536K7839J70245J5838
$$ 163552 -130371 72176 -26961 -35475 340383 218439 -48302 28536 56375 226620 242458
18324B42458b57644C6962a16578j91880D34506A73911F0840a12855d767k7078
$$ 242458 -257644 36962 -116578 -308458 434506 173911 60840 -112855 -4767 -31845
18314c1845j54902G1682L6069e2531r2833P2103k3635c4905l42395A07843c21221
$$ -31845 -186747 71682 107751 -52531 -145364 -73261 -96896 -34905 -377300 107843 -321221
18302a01939l84292h6867A40882a51665q3540N0932a4371G8887a04675l64483
$$ -101939 -486231 -86867 140882 -151665 -235205 -184273 -14371 78887 -104675 -469158
18292d69158a47590M0677r8515I391a37185a2088n9422k61688f4478a0308B37852
$$ -469158 -147590 -106913 -205428 9391 -137185 -12088 -71510 -333198 -64478 -10308 237852
18280C1659K5756L07673a04302j5244n5454j23320B02609b98406Q1737f5558G3610
$$ 31659 57415 365088 -104302 -119546 -175000 -298320 202609 -298406 -216669 -65558 73610
18268a07877C36313d3077j33562E4929P8792B0971R7941A4151a19873c527l7776
$$ -107877 336313 -43077 -176639 54929 133721 20971 118912 14151 -119873 -3527 -41303
18257d1303B00078C6289b00642k57581a39979e2991p1598I383P8305b47326A6076
$$ -41303 200078 36289 -200642 -458223 -139979 -52991 -124589 9383 87688 -247326 16076
18245F9233a49781O7904E0058a55421C4577a70768o423l3618d2897a3982j55726
$$ 69233 -149781 -81877 50058 -155421 34577 -170768 -177191 -210809 -42897 -13982 -169708
18234a69708A14147a3686p4787k05720e134F6029k9537a03793B55359f0388l54494
$$ -169708 114147 -13686 -88473 -294193 -5134 66029 36492 -103793 255359 -60388 -414882
18223d14882H2712k4736c93821E0835a42057c1450j49382C06219c10933h0836
$$ -414882 82712 57976 -393821 50835 -142057 -31450 -180832 306219 -310933 -80836
18212b43108C886J69872o5010R8637h0911B43217a41847a2391A0981h6213l359
$$ -243108 3886 173758 108748 207385 -80911 243217 -141847 -12391 10981 -86213 -89572
18201h9572j62833g6387C2900i2601C0837M68057a91023A36076b81966F8801A3233
$$ -89572 -252405 -76387 32900 -92601 30837 498894 -191023 136076 -281966 68801 13233
18189i8109p9494k3538B63653n0608A2725a13018M1505C66803b25660G4546c50087
$$ -98109 -177603 -201141 263653 213045 12725 -113018 -71513 366803 -225660 74546 -350087
18177c37929A55851J20695i9435p0670K082I7175k9733J42600K02345h5005L9770
$$ -337929 155851 276546 -99435 -170105 -168023 97175 67442 210042 412387 -85005 -45235
18166d5235l16172A07318M2176a57605n6365A14099a31219A8654q82J16677J1447
$$ -45235 -361407 107318 149494 -157605 -213970 114099 -131219 18654 17772 134449 145896
18155A45896O7219a00714d3347C924b38210F682J02975K49084A40913F4597K5369
$$ 145896 213115 -100714 -43347 3924 -238210 6682 109657 358741 140913 64597 89966
18144H9966a18958A697R2747a62619P896B38708i8877n3125c2554A37443b8804
$$ 89966 -118958 1697 94444 -162619 -154723 238708 -98877 -152002 -32554 137443 -28804
18132b6752r3371A92592b71651B36657a65456O7235n8918J2496j69020J04767
$$ -26752 -120123 192592 -271651 236657 -165456 -98221 -157139 -144643 -313663 -208896
18122b08896Q5823G9764a1606D55157b79457E1043J3540c14072a05222B14218
$$ -208896 -123073 79764 -11606 455157 -279457 51043 64583 -314072 -105222 214218
18111b02314i3097r8175i3313A26460a20752k59680J47154J14928j05260J3541
$$ -202314 -93097 -191272 -93313 126460 -120752 -380432 -233278 -118350 -223610 -210069
18101b10069a4771B2588L44522C3364M1258f8919k49301J260c7347H5296b8231
$$ -210069 -14771 22588 367110 33364 74622 -68919 -318220 -316960 -37347 85296 -28231
18089A03652A4357K46807a98427H8914b63053B63878j23153n5879Q9236N1022
$$ 103652 14357 261164 -198427 88914 -263053 263878 140725 84846 174082 225104
18079B25104A4984d48748D4574p07a9288m7774m2156l3035G815a53748f1026A53355
$$ 225104 14984 -448748 44574 43867 -19288 -67062 -109218 -142253 7815 -153748 -61026 153355
18066b92924A36886k8763b7464A61643b04994H987K1683h3906k17404A28759a02120
$$ -292924 136886 108123 -27464 161643 -204994 8987 30670 -83906 -301310 128759 -102120
18054a5717j38772M9119C4329J32527k8967c6592j01943M8777l49956B36711c571
$$ -15717 -154489 -105370 34329 166856 137889 -36592 -138535 -89758 -439714 236711 -3571
18042B642b40410C161J24060G286b08638B0725c4991C4495J64862c32933O3019
$$ 2642 -240410 3161 127221 7286 -208638 20725 -34991 34495 199357 -332933 -269914
18031b69914L4678J7994b8340C30826e7729j22164j59734A66189a03935M7315
$$ -269914 -235236 -217242 -28340 330826 -57729 -179893 -339627 166189 -103935 -56620
18021e6620A53332K6757f1012o8380M2176k0383c5141A2252P8685L1428R9532
$$ -56620 153332 180089 -61012 -129392 -87216 -107599 -35141 12252 90937 122365 221897
18010B21897b67719A08572C6371G834J4266b24145C38129a84804b7054E75c08240
$$ 221897 -267719 108572 36371 7834 22100 -224145 338129 -184804 -27054 575 -308240
17998I5966f1856G3820K26049a24624d7013A55819a0034A38360c41836E7548e785
$$ 95966 -61856 73820 299869 -124624 -47013 155819 -10034 138360 -341836 57548 -5785
17986b0963j6102d970n6388r4246I931c2218I3082a38672O5336C06254A0422J85922
$$ -20963 -37065 -4970 -61358 -155604 9931 -32218 93082 -138672 -73336 306254 10422 196344
17974A96344A3162g5232A14124J09795o7667b95665a40463B3303K96431n7321
$$ 196344 13162 -75232 114124 223919 156252 -295665 -140463 23303 319734 262413
17964B62413C9043c5351n05A28926i9444B23461b41973B76022a54591j23012b0593
$$ 262413 39043 -35351 -35856 128926 -99444 223461 -241973 276022 -154591 -277603 -20593
17952i3814j01950I4864a74812g8237B50638k6348n7837g6996c0271j25614B8463
$$ -93814 -195764 94864 -174812 -78237 250638 224290 166453 -76996 -30271 -155885 28463
17940b36387A92457J14604G0382a79897B7083a23103B45556I4483a90207H0524
$$ -236387 192457 307061 70382 -179897 27083 -123103 245556 94483 -190207 80524
17929A91206G0049L1682B4793a14176r3791D0565g046j7495k93626C40921c8611
$$ 191206 70049 101731 24793 -114176 -207967 40565 -7046 -24541 -318167 340921 -38611
17917F1003M8233J56385R254M6196e229j82894l5963G6016a75841b9877j62798
$$ 61003 109236 265621 274875 321071 -5229 -188123 -224086 76016 -175841 -29877 -192675
17906a92675k16054J89656d4053k45191a1600m78357a01577p994k11447J49113
$$ -192675 -408729 -219073 -44053 -289244 -11600 -489957 -101577 -109571 -321018 -171905
17896a71905A39819g1868A54768l9410a15950E854d7662j81288c0781E1076f0683
$$ -171905 139819 -71868 154768 115358 -115950 5854 -47662 -228950 -30781 51076 -60683
17884B46854a75157j47652g6034J3522a096j3776k37885B07653G8676P3970G4435
$$ 246854 -175157 -322809 -76034 -62512 -1096 -14872 -252757 207653 78676 152646 74435
17872A48263K03807H1951J40418A1099a12278B48235b7090A09438e1470J1551
$$ 148263 352070 81951 222369 11099 -112278 248235 -27090 109438 -51470 -39919
17862c9919A05635b13803N2664B26354g7947I300c8254k35727P4923a9550o7478
$$ -39919 105635 -213803 -161139 226354 -77947 9300 -38254 -273981 -199058 -19550 -87028
17851h7028r096o9518F2317J25716g3686A28299Q667A64e52514K24757I0288b4539
$$ -87028 -96124 -165642 62317 188033 -73686 128299 136966 164 -552514 -327757 90288 -24539
17838B58697a20851j05554Q3023F9669B3884J44656b77458C3399J11546o9303
$$ 258697 -120851 -226405 -143382 69669 23884 168540 -277458 33399 144945 75642
17828G5642c49647E9179K5295d8747J08j98129b1246A77119e79046d7675k7567
$$ 75642 -349647 59179 84474 -48747 -48639 -246768 -21246 177119 -579046 -47675 -75242
17817g5242B16285B6919Q1985h9677C12285I3328b0209B491Q3243a02691j00659
$$ -75242 216285 26919 108904 -89677 312285 93328 -20209 2491 85734 -102691 -203350
17806b03350D1836b2509l84A36822b40086G086P1395b92744E8106J56110h5714
$$ -203350 41836 -22509 -22893 136822 -240086 7086 78481 -292744 58106 214216 -85714
17794B0594M0807Q2087K6190R6889A26442B3995J9815a32325L4650A3748J62236
$$ 20594 61401 143488 169678 266567 126442 23995 43810 -132325 -97675 13748 175984
17783A75984D8409L1642i5537k8983N8207p3013A12051B5050c46900A91988q9181
$$ 175984 48409 80051 -95537 -124520 -66313 -139326 112051 25050 -346900 191988 102807
17772A02807m9644J04773j9026R6293H0176a88555B14623c67899i0234a2508B02756
$$ 102807 53163 157936 138910 235203 80176 -188555 214623 -367899 -90234 -12508 202756
17760a41827A83137a09141E3498a29945q362m8237B8999J3374a27344e7845A04728
$$ -141827 183137 -109141 53498 -129945 -138307 -186544 28999 42373 -127344 -57845 104728
17748a08115A633a4924A35203o3264R1564a93844j0298g6384c3011B01860l4094
$$ -108115 1633 -14924 135203 71939 163503 -193844 -204142 -76384 -33011 201860 167766
17737A67766a7354l0984L601B17460J7067j03219b00743N2419a7328D0594L0313
$$ 167766 -17354 -48338 -44737 217460 234527 131308 -200743 -148324 -17328 40594 70907
17726G0907f1996F3124a07925D9336M4514J1555M8064J73452a07435A1787c41601
$$ 70907 -61996 63124 -107925 49336 93850 105405 153469 326921 -107435 11787 -341601
17714A9629J57018c3062p2624K5864F059K05530b9547B67732H1399J97499H3216
$$ 19629 176647 -33062 -105686 -79822 6059 211589 -29547 267732 81399 278898 83216
17702d4161p034D649f1505m1601n2891E0963L84275b8393j1594j47417B11696
$$ -44161 -51195 4649 -61505 -103106 -155997 50963 435238 -28393 -39987 -187404 211696
17690G1012J15364b17387M8214K8709b9396o3684I886L5447a969r2762g487o7336
$$ 71012 186376 -217387 -169173 -140464 -29396 -93080 9886 45333 -1969 -94731 -7487 -74823
17678g4823l7232B54787a91431B03107K1782A6644M6060h6460A72920G0702K73887
$$ -74823 -112055 254787 -191431 203107 224889 16644 62704 -86460 172920 70702 344589
17667C44589a21495A5773h3096G6198R7793q4692k4953J86587a5904o1084D3266
$$ 344589 -121495 15773 -83096 76198 173991 89299 64346 250933 -15904 -76988 43266
17655B92K7111a16724A54246D5760i4921D62098B4284a76615A55712g0440D8659
$$ 292 27403 -116724 154246 45760 -94921 462098 24284 -176615 155712 -70440 48659
17643a07703A48623a3089B25323A2254b16336i7916B82342A5149E37K7325J27386
$$ -107703 148623 -13089 225323 12254 -216336 -97916 282342 15149 537 27862 155248
17632A55248K11979e2757k3378B49459a88068A53177r746a08318k7352C94500
$$ 155248 367227 -52757 -76135 249459 -188068 153177 143431 -108318 -135670 394500
17621b051A0638L26947b97844a06211I9154J27401n144A07566A4339b12818P2926
$$ -2051 10638 337585 -297844 -106211 99154 226555 221411 107566 14339 -212818 -139892
17610a39892E91617A62690b04632D3623J62898C934N2522K0322A4154K47988f4504
$$ -139892 591617 162690 -204632 43623 206521 3934 56456 76778 14154 262142 -64504
17598a49961D77996f9414A03268k7409l1620b97519A57673B3061P1630J70579
$$ -149961 477996 -69414 103268 75859 44239 -297519 157673 23061 94691 265270
17588B65270A1686L01002F7800d3408A05342L8918a53325C9428b71200A12561
$$ 265270 11686 312688 67800 -43408 105342 144260 -153325 39428 -271200 112561
17577g1665A41187C1100g0687C34206A37296b83980B13540j4234J45130b41009
$$ -71665 141187 31100 -70687 334206 137296 -283980 213540 199306 344436 -241009
17566a2337B08316b06520I9953J94368H6732j8573L5236J78893a49726A43132
$$ -12337 208316 -206520 99953 294321 86732 68159 103395 282288 -149726 143132
17555B34112J47580j32397b25932H6724B9143a9650H9175h3581l6373n7025A09581
$$ 234112 381692 249295 -225932 86724 29143 -19650 89175 -83581 -119954 -176979 109581
17543E44780A64931J50318a36412l0797k5365d5099G3888b6027R967B65811a34155
$$ 544780 164931 315249 -136412 -167209 -192574 -45099 73888 -26027 -16060 265811 -134155
17531C22724A33498A8084a21990L7971a4295B59012a50557I0412J22367a17905
$$ 322724 133498 18084 -121990 -84019 -14295 259012 -150557 90412 212779 -117905
17520B50462e2367A35496E7356f108F5339a61147I6022b57861C53135A35274J69399
$$ 250462 -52367 135496 57356 -6108 65339 -161147 96022 -257861 353135 135274 304673
17509C04673e9073A27269L87658A16889a39828d6698D61922c6412A20506h6102
$$ 304673 -59073 127269 514927 116889 -139828 -46698 461922 -36412 120506 -86102
17498H4226b058D34172a23305I1399f4544J0719A58659K0750n1505k5258m954
$$ 84226 -2058 434172 -123305 91399 -64544 -53825 158659 179409 127904 102646 97692
17487I7692a08862K1398G405a07833F9870a56119B40604J75554p3127G874M73001
$$ 97692 -108862 -87464 7405 -107833 69870 -156119 240604 416158 343031 7874 480875
17476D80875a77837A62457N8162l6456n5127N0777n2669J02988i9290H4811L2156
$$ 480875 -177837 162457 220619 184163 129036 179813 127144 230132 -99290 84811 116967
17465A16967J8035o2556l5661d57056A78248M9404m7019q8235l9013K67839p7351
$$ 116967 135002 72446 36785 -457056 178248 227652 180633 92398 53385 321224 243873
17454B43873K8406A05509a14354B69560b31979C20404a76193B8910K10874I2058
$$ 243873 272279 105509 -114354 269560 -231979 320404 -176193 28910 239784 92058
17443H9744O8361B2843J0725L68127o1282M2526P9669A18949Q1348E8110L30224
$$ 89744 158105 22843 33568 401695 340413 382939 462608 118949 200297 58110 388334
17432C88334A73635K0240d5725D5788K8218L59j6205b45666F9757R6904M8582
$$ 388334 173635 193875 -45725 45788 74006 74365 58160 -245666 69757 166661 215243
17421B15243K1118C8816L57514o7826N3811o3566A01065P5778J90596I0242K85955
$$ 215243 236361 38816 396330 328504 382315 318749 101065 176843 367439 90242 376197
17410C76197H596R0344J9517K01752G6787J5174K10704P623m1179m5849A01275
$$ 376197 8596 98940 118457 320209 76787 91961 302665 310288 269109 223260 101275
17398D07616f1152E06681k34740a18243B60857K67382A2769L20327b81773A74107
$$ 407616 -61152 506681 271941 -118243 260857 528239 12769 333096 -281773 174107
17387C19617H3218a64363c9135k27318B96177E9143c1809D28204B9768d974D79637
$$ 319617 83218 -164363 -39135 -266453 296177 59143 -31809 428204 29768 -4974 479637
17375G94169B64354n7779e2414A2957a53295A12928J90263a18310F9081C2842
$$ 794169 264354 206575 -52414 12957 -153295 112928 303191 -118310 69081 32842
17364b90992B29854M2244R5266J9531A61427p3397Q3451K36871f1231m9148C73489
$$ -290992 229854 272098 367364 386895 161427 88030 171481 408352 -61231 -110379 373489
17352A98267B4511J55801J0758J21102l1761E4219J3163J87529d281q0323A87811
$$ 198267 24511 180312 191070 312172 280411 54219 67382 254911 -4281 -84604 187811
17340C7342g7247a7418A40831J26346l4049R8007m190q8756j7569C467K62756
$$ 37342 -77247 -17418 140831 267177 233128 331135 326945 238189 220620 3467 266223
17329B66223g6960A89556o8507J89920m5920b27141f6212B69935j21908K52413
$$ 266223 -76960 189556 121049 310969 265049 -227141 -66212 269935 148027 400440
17319D00440a13195A10689d1710J918B93909L24372G0182d7964B49947q9085K4107
$$ 400440 -113195 110689 -41710 -39792 293909 618281 70182 -47964 249947 160862 184969
17308A84969q2558I735M29138j65635p7644l8390K70439r0304G6557N7831P500
$$ 184969 102411 9735 438873 273238 195594 157204 427643 337339 76557 134388 141888
17297A41888j7950C0316N3569J6341J24903E3303K29910c2485B97195A35120J16171
$$ 141888 123938 30316 83885 100226 225129 53303 283213 -32485 297195 135120 251291
17286B51291k1581a63860A47450J06862I8397D6494J16468D3805J22571P8975
$$ 251291 229710 -163860 147450 254312 98397 46494 162962 43805 166376 245351
17276B45351D0596K64006E8332J25475J94197m8550r9630K7866n5076L61444k57857
$$ 245351 40596 304602 58332 183807 378004 329454 229824 257690 202614 564058 306201
17265C06201E8909O4014A7328K06127J2143r8500N3644Q3861l1470l9976J40374
$$ 306201 58909 122923 17328 223455 235598 137098 190742 274603 243133 203157 343531
17254C43531G7285b4436D51717C4888a1719B87407A21394K16307G2451J9716c6911
$$ 343531 77285 -24436 451717 34888 -11719 287407 121394 337701 72451 92167 -36911
17242F8990L44380D2335K73165K4100j69735l6457r84J69422A20098K66789j51021
$$ 68990 413370 42335 315500 339600 169865 133408 132424 301846 120098 386887 235866
17231B35866h2318C7667J97786b1249D24759p4949J651a02394C08703A05385m2560
$$ 235866 -82318 37667 235453 -21249 424759 349810 351461 -102394 308703 105385 62825
17220F2825j2182J67616H923L42921j42948f9225D07399a02097C01290A06240
$$ 62825 50643 218259 8923 351844 208896 -69225 407399 -102097 301290 106240
17209A29860A7880Q454a69017B33459F5778M38310B14609q2122e3348C0760H061
$$ 129860 17880 26334 -169017 233459 65778 504088 214609 132487 -53348 30760 8061
17197B26741D9541N5537J85878H596L85298E217i1341A42367K21210D0666L07216
$$ 226741 49541 105078 290956 8596 393894 5217 -91341 142367 363577 40666 347882
17186C47882H4261j0270l0952M61536A54486A5286J45801M21801A59955m1706
$$ 347882 84261 73991 43039 504575 154486 15286 161087 582888 159955 118249
17176A18249K37017A11752K18192G1522H651M31283B05385j02330L44336J78781
$$ 118249 355266 111752 329944 71522 8651 439934 205385 103055 447391 626172
17166F26172A38730R3761J64247p0649I7547J86769J91790q5026J201B5912R3372
$$ 626172 138730 232491 396738 326089 97547 284316 476106 391080 392281 25912 119284
17155A19284O1406J44911J23849o2307j65899c4035B32433P6695H4394K03653
$$ 119284 180690 325601 449450 387143 221244 -34035 232433 309128 84394 288047
17145B88047A20418K77968l7973p9766J66084J45079M4561A89951O9548F4162
$$ 288047 120418 398386 360413 280647 446731 591810 636371 189951 259499 64162
17134B64501n394L370m8258B9960L02605f1841C01760R2807l1304A24390J73520
$$ 264501 259107 262477 214219 29960 332565 -61841 301760 394567 363263 124390 297910
17123B97910A39347L46280p3984q7338l7162K19387H5778L02110J4021j1916n3186
$$ 297910 139347 485627 411643 324305 287143 506530 85778 387888 401909 389993 336807
17112C36807A19280K79924j10995k8683M9990m9073L7860N3992A46815K33967
$$ 336807 119280 399204 288209 259526 309516 260443 298303 352295 146815 380782
17102C80782o7886Q1352j56184l6614K07975j46882J50445n4605o5237R0514H4681
$$ 380782 312896 394248 238064 201450 409425 262543 412988 358383 293146 383660 84681
17090F11923I2741J46696L06843m8687l167O4343A27683M23179q9227j6293M4387
$$ 611923 92741 239437 546280 497593 494426 558769 127683 550862 461635 445342 489729
17079D89729n2865F2192J87197K37856q0558q6852n6613J0714M5579m2020K75968
$$ 489729 436864 62192 249389 487245 406687 319835 263222 273936 319515 277495 553463
17068E53463B49044K27277i4460A62191K20783J68327A37608J11425P3980R8551
$$ 553463 249044 476321 -94460 162191 382974 551301 137608 249033 323013 421564
17058D21564A44216m2573K25958j48949M19547A10454J15972J92571K65512j69004
$$ 421564 144216 101643 327601 178652 598199 110454 226426 418997 684509 515505
17048E15505j72745j33097J34603J71661q3205K66458k24466J69406C00619L68695
$$ 515505 342760 209663 344266 515927 432722 699180 474714 644120 300619 669314
17038F69314j44809K36093C12869n1045L70818L9256j11279j90984K14675k22461
$$ 669314 524505 760598 312869 261824 632642 671898 560619 369635 584310 361849
17028C61849L74480C25717q3941M82858k53167A17957Q7832J07601K41070P5997
$$ 361849 736329 325717 241776 724634 471467 117957 205789 313390 554460 630457
17018F30457k74198N4505J52050r929n2731J02326k04289J7120J72554k61069
$$ 630457 356259 410764 562814 552885 500154 602480 398191 415311 587865 326796
17008C26796K60151I2777N11494o1368M38646l23863r5966J92494l14012J10014
$$ 326796 586947 92777 604271 542903 981549 657686 561720 754214 440202 550216
16998E50216N11217C88064K0674L846K5107J67993n6259B54840L03405O9438M9671
$$ 550216 1061433 388064 408738 412584 437691 605684 549425 254840 558245 627683 677354
16987F77354J67876j58338O5837k89199J58607j95238M09274k09347K57152k18840
$$ 677354 845230 686892 752729 463530 622137 426899 836173 626826 883978 665138
16977F65138n9528K38681M0561l75872l7301M36994k87536Q5929M89656n53970
$$ 665138 605610 844291 884852 508980 471679 908673 621137 707066 1196722 642752
16967F42752j13223L32451J25621D64473O3632K10220j89043O78158D35094M01306
$$ 642752 529529 861980 987601 464473 528105 738325 549282 1227440 435094 836400
16957H36400N3517l0360j43537K45820k56095N1569j51054M05905k96097J68380
$$ 836400 889917 859557 716020 961840 705745 757314 606260 1012165 716068 884448
16947H84448j06634J78940M2585j91137K35265l84561N09915j09128m6192K46216
$$ 884448 777814 956754 999339 808202 1043467 658906 1168821 1059693 1013501 1259717
16937A259717j46739k92298L5948j85083J1177L77830j17432R8455l73464L66522
$$ 1259717 1112978 820680 856628 671545 682722 1060552 943120 1041575 668111 1034633
16927A034633k0725p6786P2127j50254q4959P80580n36968N3092J33760j47358
$$ 1034633 1013908 937122 1009249 858995 774036 1554616 1017648 1070740 1204500 1057142
16917A057142j80725o6081N39958J04109j52134j7088K99676n90501N00210k72837
$$ 1057142 876417 810336 1350294 1454403 1302269 1285181 1584857 994356 1494566 1221729
16907A221729j46684J6223L58118l09696k19136N51169N8288J19551l29799M670
$$ 1221729 1075045 1091268 1449386 1139690 920554 1471723 1530011 1649562 1319763 1324433
16897A324433K15931l15798L07895j46626J20189l01847J20810P0935l3796k42607
$$ 1324433 1540364 1224566 1532461 1385835 1506024 1204177 1324987 1395922 1362126 1119519
16887A119519N12813j53427j04195R6185K10606p0958o14J68650k61283K27270
$$ 1119519 1632332 1478905 1374710 1470895 1681501 1610543 1609929 1778579 1517296 1744566
16877A744566K73832n31780K30678J49862P5715j37313j35020K19509k49737K17289
$$ 1744566 2018398 1486618 1717296 1867158 1942873 1805560 1670540 1890049 1640312 1857601
16867A857601M7183j2997M04r8925Q6991J65897R900L93336k80775J352L2728
$$ 1857601 1904784 1891787 1892191 1793266 1880257 2046154 2056054 2449390 2168615 2169967 2202695
16856B202695j65701N00266k52286J55420l38255L50506L0136l1430l30895K94698
$$ 2202695 2036994 2537260 2284974 2440394 2102139 2452645 2482781 2451351 2120456 2415154
16846B415154j4184L0000Q9581O1881Q230K9789j56097p272P05430n85892M64757
$$ 2415154 2400970 2430970 2520551 2582432 2590662 2620451 2464354 2457082 3162512 2576620 3041377
16835C041377k2841j32801K51952k22059j45024O52298K12349o16410J12644K70240
$$ 3041377 3018536 2885735 3137687 2915628 2770604 3422902 3635251 3018841 3131485 3401725
16825C401725M90266l89170K33093J2592L63857k52885n7182J35387N2702q6206
$$ 3401725 3891991 3502821 3735914 3748506 4112363 3859478 3802296 3937683 3990385 3904179
16815C904179L12806k8199O9124K06700K7100J43904l32044L80216l34113M69623
$$ 3904179 4216985 4188786 4257910 4464610 4491710 4635614 4303570 4683786 4349673 4819296
16805D819296J31244J45640j23467K40866K23003K02335J40964J01505O7771L93501
$$ 4819296 4950540 5096180 4972713 5213579 5436582 5638917 5779881 5881386 5949157 6342658
16795F342658r4177k3647M86628l96719J91665L10102l4909L40412N3696L22431
$$ 6342658 6248481 6224834 6711462 6314743 6506408 6816510 6781601 7122013 7175709 7498140
16785G498140K51558J10237N36814r5673J04515J23012N79994K91982l52279O54072
$$ 7498140 7749698 7859935 8396749 8301076 8405591 8528603 9108597 9400579 9048300 9702372
16775I702372L3883M72437L40644K19728N28037K14614o9044O52128K82404O32723
$$ 9702372 9736255 10208692 10549336 10769064 11297101 11511715 11442671 12094799 12377203 13009926
16765A3009926K48773M46766N61757K82991P37315K02807N29947R16276M44981
$$ 13009926 13258699 13705465 14267222 14550213 15287528 15490335 16020282 16936558 17381539
16756A7381539L29457R25924L71714R71108N97176Q92176N59676J053905R90654
$$ 17381539 17710996 18636920 19008634 19979742 20576918 21469094 22028770 23082675 24073329
16747B4073329J098568P22227J065787J427336J140755J350901J339953J484822
$$ 24073329 25171897 25894124 26959911 28387247 29528002 30878903 32218856 33703678
16739C3703678J588750J841873K086575J493995J921325K388976K244848K301042
$$ 33703678 35292428 37134301 39220876 40714871 42636196 45025172 47270020 49571062
16731D9571062K905344K845063L148469L565380L270824L935206L962598M618589
$$ 49571062 52476406 55321469 58469938 62035318 65306142 69241348 73203946 77822535
16723G7822535M714850N344876N478757O186349O141113O515046P432947O834595
$$ 77822535 82537385 87882261 93361018 99547367 105688480 112203526 119636473 126471068
16715A26471068P657300Q277033Q014578P947482Q254504Q184195P688101O993096
$$ 126471068 134128368 142405401 150419979 158367461 166621965 174806160 182494261 189487357
16707A89487357O441431N665536M253517K946026K062754j64160j128978k449788
$$ 189487357 195928788 201594324 205847841 208793867 210856621 210692461 209563483 207113695
16699B07113695l669402n412608n734884p086482p616313p936801p908632q373723
$$ 207113695 203444293 198031685 192296801 185210319 177594006 169657205 161748573 153374850
16691A53374850p943683q262448p605438p969444p080492o881628o494514n950736
$$ 153374850 145431167 137168719 129563281 121593837 114513345 107631717 101137203 95186467
16683I5186467n948362n141525n422789m702939l486088m641546l625969l620452
$$ 95186467 89238105 84096580 78673791 73970852 70484764 65843218 62217249 58596797
16675E8596797l121219l199689k792921k562070k525838k555206k015718k191974
$$ 58596797 55475578 52275889 49482968 46920898 44395060 41839854 39824136 37632162
16667C7632162j790877j328498j800444j027663k049066j257906r07937j699670
$$ 37632162 35841285 34512787 32712343 31684680 29635614 28377708 27469771 25770101
16659B5770101p67519q64800j026071j176656r76722r17596o02675q36230n51069
$$ 25770101 25002582 24137782 23111711 21935055 20958333 20040737 19438062 18601832 18050763
16650A8050763n79939k76511j236257j15219p58136l97527l01751p11765n69377
$$ 18050763 17470824 17194313 15958056 15842837 15084701 14687174 14385423 13673658 13104281
16641A3104281n12308k72441k78172l04342m35304m92860j59090o64223Q0259
$$ 13104281 12591973 12319532 12041360 11737018 11301714 10808854 10649764 9985541 10065800
16632A0065800m45216m81183j04820k52095j89044l13905K4858Q9321l56695p47771
$$ 10065800 9620584 9139401 9034581 8782486 8593442 8279537 8304395 8393716 8037021 7289250
16622G289250J38431l28320l44187j16679J25781n34458q3294J15948k71784k83471
$$ 7289250 7427681 7099361 6755174 6638495 6764276 6229818 6146524 6262472 5990688 5707217
16612E707217L1563M20m75792k1541q3764J1040k99427q7055K61237n05407J54409
$$ 5707217 5738780 5739200 5263408 5241867 5158103 5169143 4869716 4782661 5043898 4538491 4692900
16601D692900k84535l1858r4866k33046K81603k32231k8189j87003m19201K64453
$$ 4692900 4408365 4376507 4281641 4048595 4330198 4097967 4069778 3882775 3463574 3728027
16591C728027j26308j98773j09816J55022j89230J34969j18098k13541k11743
$$ 3728027 3601719 3402946 3293130 3448152 3258922 3393891 3275793 3062252 2850509
16582B850509J05487K55325m62272P3018j81529J58577l124k67730j38827J28256
$$ 2850509 2955996 3211321 2749049 2822067 2640538 2799115 2795991 2528261 2389434 2517690
16572B517690J75716j54464n89447L08578K54808j69269k5181j79532J73523j92562
$$ 2517690 2693406 2538942 1949495 2258073 2512881 2343612 2318431 2138899 2312422 2119860
16562B119860q1988L33960l57562j38142k24258M66663M4425m13616j17156M03999
$$ 2119860 2037872 2371832 2014270 1876128 1651870 2118533 2162958 1749342 1632186 2036185
16552B036185l86715K76950M6870p836k80029J58465k07906k0792j34320P1633
$$ 2036185 1649470 1926420 1973290 1965454 1685425 1843890 1635984 1615192 1480872 1552505
16542A552505Q3512l14886K79119l87144L17662J71946m91168L36642j24333P9409
$$ 1552505 1636017 1321131 1600250 1213106 1530768 1702714 1211546 1548188 1423855 1503264
16532A503264k40006P505L49494m71400K26186m59153K78789k14094L99520k24714
$$ 1503264 1263258 1270763 1620257 1148857 1375043 915890 1194679 980585 1380105 1155391
16522A155391j2176l66345M65827j98372K82509j54389R4095k74832N2738k27436
$$ 1155391 1143215 776870 1242697 1044325 1326834 1172445 1266540 991708 1044446 817010
16512H17010j78487K93532J00428l89682J95925K03731R138J27666K69397m74488
$$ 817010 638523 932055 1032483 642801 838726 1042457 1051595 1179261 1448658 974170
16502I74170j33708j20519M26459n42054J27012j1144K46212J46990l06838J45986
$$ 974170 840462 719943 1146402 604348 731360 720216 966428 1113418 806580 952566
16492I52566n5519l89021K49885M61463m67124j6339L87334j75370o7993J37804
$$ 952566 897047 508026 757911 1219374 752250 735911 1123245 947875 879882 1017686
16482A017686j60212J27807j86400k42323K2597J96800J60747k09940K70113j27134
$$ 1017686 857474 985281 798881 556558 579155 775955 936702 726762 996875 869741
16472H69741k11457j6812j91110J58239N2500M8365j78595n7522N5489M1695m8714
$$ 869741 658284 641472 450362 608601 661101 709466 530871 473349 528838 570533 521819
16461E21819J12845m2603j31866K97169j76570L7143J91384j72894k70487K9462
$$ 521819 634664 592061 460195 757364 580794 617937 809321 636427 365940 395402
16451C95402K97129k08646A88992M26743R3305j4529k44908J89658q8356L9529
$$ 395402 692531 483885 188992 615735 709040 694511 449603 639261 550905 590434
16441E90434K14595j38435j00525k07286r4315o1383J36311L4574J93558L8513
$$ 590434 805029 666594 566069 358783 264468 203085 339396 373970 567528 606041
16431F06041o1007J63657l02442L29531k41463j0779J07695A99201L91382l0569
$$ 606041 545034 708691 406249 735780 494317 483538 591233 199201 590583 560014
16421E60014q5195B14318L62249j91476J36507k5508l9558k13924K23023l0401
$$ 560014 474819 214318 576567 385091 521598 496090 456532 242608 465631 435230
16411D35230Q3172J45781j19054B12177P3960L02872j97962J73466n7096J21097
$$ 435230 518402 664183 545129 212177 286137 589009 391047 564513 507417 628514
16401F28514n7646r3852j56960n6125J71914Q8000Q8605r9809j10280n4069K109
$$ 628514 570868 477016 320056 263931 435845 523845 612450 512641 402361 348292 350401
16390C50401k1970K49490G4490K60133r0085L02218r0974l2599q2140N1983A20891
$$ 350401 328431 577921 74490 334623 244538 546756 455782 423183 341043 393026 120891
16378G75405k55008L3528f0163E21352B40585J50521P1307k10704M6881j33459
$$ 775405 520397 553925 -60163 521352 240585 391106 462413 251709 298590 165131
16368A65131J9006J67188O607p0756l1279N3306c2157B46856J30041P8993A28610
$$ 165131 184137 351325 357932 287176 255897 309203 -32157 246856 376897 455890 128610
16356D7298I404J54763J73220A16960K33624J6239A48070R6674j22207c7801F19074
$$ 47298 9404 164167 337387 116960 350584 366823 148070 244744 122537 -37801 619074
16344C49359I9031K38337j52128Q0628J1587K07018B40780H3384k3031Q1829K79183
$$ 349359 99031 337368 185240 265868 277455 484473 240780 83384 60353 142182 421365
16333D21365A10187j5037J40325K19985n1051j78563N3406K6989p779G9181L02140
$$ 421365 110187 95150 235475 455460 404409 225846 279252 306241 298462 79181 381321
16322C81321r6341O3994m4538k7499n1821K09763j20810j03826j03057P172K82881
$$ 381321 284980 348974 304436 276937 225116 434879 314069 210243 107186 114358 397239
16311C97239l2848F8499N0772J78044A30289A5391L35107F5480K09061j35763
$$ 397239 364391 68499 119271 297315 130289 15391 350498 65480 274541 138778
16301A38778J6443J51083a24972B58165J99685A65308m0121L34771j50517J30536
$$ 138778 155221 306304 -124972 258165 457850 165308 125187 459958 309441 439977
16291D39977j89002I9147N07695i2413E32780R6633B82926R4531a23596m0965
$$ 439977 250975 99147 606842 -92413 532780 629413 282926 377457 -123596 -164561
16281a64561D36084B10254J32585j44475P7013j29319J81839N0430A24041K6162
$$ -164561 436084 210254 342839 198364 275377 146058 327897 378327 124041 150203
16271A50203O0513N5683A24745M18164a50782B96574R5498q019A76824j3755n7808
$$ 150203 210716 266399 124745 542909 -150782 296574 392072 384053 176824 163069 105261
16260A05261J79583J13888j85905K29606A61774K71347A60877J19051D2310K53008
$$ 105261 284844 398732 212827 442433 161774 433121 160877 279928 42310 295318
16250B95318E1127K58645j20703H9133a92790C11228B9706h3555B46650G3153
$$ 295318 51127 309772 189069 89133 -192790 311228 29706 -83555 246650 73153
16239F0708a850A98106F7753i6085j0552B56469J91175a09560d0508A37439B5448
$$ 60708 -1850 198106 67753 -96085 -106637 256469 447644 -109560 -40508 137439 25448
16227H5722J7004L0213a4269B80481J17655b1268C52644G39K34403D6985M5547
$$ 85722 102726 132939 -14269 280481 398136 -21268 352644 739 235142 46985 92532
16216I2532J68404m7609J75514A73669M0281J85041J23222A60273j7483F3748
$$ 92532 260936 213327 388841 173669 213950 398991 522213 160273 142790 63748
16205C73499b47851C24082D3193J08318l2151D4561P5460J4855A3961L23842A42397
$$ 373499 -247851 324082 43193 151511 119360 44561 120021 134876 13961 337803 142397
16193B88419B1438a80638Q7290A65612J62427A45380M8286J36288A8988l401L20719
$$ 288419 21438 -180638 -93348 165612 328039 145380 193666 329954 18988 15587 336306
16182C36306G1424a34952A12801n2427K29886R205a4501A85133J32507j23003
$$ 336306 71424 -134952 112801 60374 290260 299465 -14501 185133 317640 194637
16172A94637b70400f2135B42705r7676J21855H8178Q8905J57354A42917J14430
$$ 194637 -270400 -62135 242705 145029 266884 88178 177083 334437 142917 257347
16162B57347A04400l7082M03738b25515C08198k9288H0411e2975k9217c7132k9161
$$ 257347 104400 67318 471056 -225515 308198 278910 80411 -52975 -82192 -37132 -66293
16151f6293a4241A49211J7859a34625A51715e7796A68977o6354K88369a46794
$$ -66293 -14241 149211 167070 -134625 151715 -57796 168977 102623 390992 -146794
16140B38493G9178f5220b3692j9226l6017b2419n5692k8795A50771c73777C24375
$$ 238493 79178 -65220 -23692 -42918 -78935 -22419 -78111 -106906 150771 -373777 324375
16128c3828B26580J12304J01795a38496B62451J66837a5063B77871j38635c540
$$ -33828 226580 338884 440679 -138496 262451 429288 -15063 277871 139236 -3540
16117A0505b3935J707j52041j53799B36559J86415g8205j78347A34810e3085B4053
$$ 10505 -23935 -22228 -174269 -328068 236559 422974 -78205 -256552 134810 -53085 24053
16105a8733A20202J12669e936A86474K8106c94564i3524M0416j50442A77749k9892
$$ -18733 120202 232871 -5936 186474 214580 -394564 -93524 -53108 -203550 177749 147857
16094A47857a77786E4108b07588k06493b06797A06438d4035B5915c6169A58172
$$ 147857 -177786 54108 -207588 -414081 -206797 106438 -44035 25915 -36169 158172
16083a01676A32323P4692P3925i8496m3597A10093d6719B71963a5112D578K46456
$$ -101676 132323 207015 280940 -98496 -142093 110093 -46719 271963 -15112 4578 251034
16072B51034i814j1380j05874j65041A58853c13590J29190j18273B40062b48673
$$ 251034 -9814 -21194 -127068 -292109 158853 -313590 -184400 -302673 240062 -248673
16061B80221n6347M7426i9184C55295A54284e5814K6714C8565K83617A29279N0227
$$ 280221 223874 271300 -99184 355295 154284 -55814 -29100 38565 322182 129279 179506
16050A79506l2813l6482a0370B13899C313K50321O500d5381B61017E7273J44099
$$ 179506 146693 110211 -10370 213899 3313 253634 260134 -45381 261017 57273 201372
16039B01372G5879M9616k4689i5569q1048A06349d3172A91799a47747G5254b20029
$$ 201372 75879 125495 100806 -95569 -176617 106349 -43172 191799 -147747 75254 -220029
16027a59903A85563G3799g513A12884g1010F8016e4024l3126B11679g2231A91121
$$ -159903 185563 73799 -7513 112884 -71010 68016 -54024 -87150 211679 -72231 191121
16015f5135F526a61892B99322b00507B71886o7896i2481r2093F428b37233F2205
$$ -65135 6526 -161892 299322 -200507 271886 203990 -92481 -184574 6428 -237233 62205
16003g6670b2148H5607c3343B26763a40635j82576J14251A65380q0199g7240j39928
$$ -76670 -22148 85607 -33343 226763 -140635 -323211 -208960 165380 85181 -77240 -217168
15992b17168B236K9090f6379A39036a03340G9007b69822I9983d3646n0090b1808
$$ -217168 2236 31326 -66379 139036 -103340 79007 -269822 99983 -43646 -93736 -21808
15980b38647B00377a94150j00559g0820k81284Q4516j56064g3051k72l67062H7250
$$ -238647 200377 -194150 -294709 -70820 -352104 -267588 -423652 -73051 -73323 -440385 87250
15968a55877E7839J24473C1895P5486K67367A09632n2824N8554J73730c38416
$$ -155877 57839 182312 31895 107381 374748 109632 56808 115362 289092 -338416
15957b12754J6543q9490m2743L1170G2c13606e9368G4213g0104L1997D7157O7215
$$ -212754 -196211 -285701 -328444 -297274 72 -313606 -59368 74213 -70104 -38107 47157 114372
15945A14372d63233J01206h4712i648p6693L4100l61468f7516E1227J38213K516
$$ 114372 -463233 -362027 -84712 -9648 -86341 -52241 -413709 -67516 51227 189440 191956
15934A91956B2224b36678a01205E367b0060B43751b32795A30980i1897j10418
$$ 191956 22224 -236678 -101205 5367 -20060 243751 -232795 130980 -91897 -202315
15924b02315C26353c15833g7005j25049m0398b5083A72050D2856K20854H733K21535
$$ -202315 326353 -315833 -77005 -202054 -242452 -25083 172050 42856 263710 8733 230268
15913B30268A10200g0367m9814l2294d3881B6316a00711B7221Q5120N6990a73364
$$ 230268 110200 -70367 -120181 -152475 -43881 26316 -100711 27221 112341 169331 -173364
15901b06813b5900A90385q9305c7438A37663c12029a30464c5035k31421j99488
$$ -206813 -25900 190385 101080 -37438 137663 -312029 -130464 -35035 -266456 -465944
15891d65944f6195k03761C1025i9101j53379F2294a08724j79896a39923G6695
$$ -465944 -66195 -269956 31025 -99101 -252480 62294 -108724 -288620 -139923 76695
15880I9654J16062e5693k56801J11432h2719E5010d6324Q030p3080m2295e0606
$$ 99654 215716 -55693 -312494 -201062 -82719 55010 -46324 -38294 -111374 -153669 -50606
15868B35867c9736k54707N2339o0755R4269C4317a21813H5196b71051M3870h2586
$$ 235867 -39736 -294443 -242104 -302859 -208590 34317 -121813 85196 -271051 -227181 -82586
15856G9931K06399e6910j6063k52893A1388a84839o2746l42773C92573b34964
$$ 79931 286330 -56910 -72973 -325866 11388 -184839 -247585 -590358 392573 -234964
15845A47738N9504a01642H9946K0556g6321b9492B7423j601a21981A5136i5484
$$ 147738 207242 -101642 89946 110502 -76321 -29492 27423 25822 -121981 15136 -95484
15833a27146k1708c4941G0261F089J82148a30450B6146a22525R63j52420R1370
$$ -127146 -148854 -34941 70261 6089 188237 -130450 26146 -122525 -121562 -273982 -182612
15822a82612I0792O1281a39066C9381Q9612c46354a23029G2469g4200L5692B7725
$$ -182612 90792 152073 -139066 39381 128993 -346354 -123029 72469 -74200 -38508 27725
15810e9418C2040b0562A18632A9506J5558R2214b440A20231b14172j53163a74834
$$ -59418 32040 -20562 118632 19506 35064 127278 -2440 120231 -214172 -367335 -174834
15798a93717l5705d596m314m03900C8538i2291j47957a04292l109M1783j34612
$$ -193717 -229422 -4596 -8910 -412810 38538 -92291 -240248 -104292 -107401 -65618 -200230
15787b00230q3780K4959h3915K3305B64895E3199Q8835a32896e1814A74044m9362
$$ -200230 -284010 -259051 -83915 -60610 264895 53199 142034 -132896 -51814 174044 124682
15776A24682b9032D5435b12117Q8466A9582b27935B4788K39836j21680a88178
$$ 124682 -29032 45435 -212117 -123651 19582 -227935 24788 264624 142944 -188178
15765f8339J8785A21034n4257J88085a49687j72123c8989k52463P9007j03247
$$ -68339 -49554 121034 66777 254862 -149687 -321810 -38989 -291452 -212445 -315692
15755c15692a2160j15186d9126j8705G8309b10300p1960P4812A18449b57816K7448
$$ -315692 -12160 -127346 -49126 -67831 78309 -210300 -282260 -207448 118449 -257816 -230368
15744b30368I1915J27088b50745h825k00061B301h3730n6890B2769J85563n6641
$$ -230368 91915 219003 -250745 -8825 -208886 2301 -83730 -140620 22769 208332 151691
15733A51691i1025k11678J30396e6964B13144F1628a57885C32367A18946F485
$$ 151691 -91025 -302703 -172307 -56964 213144 61628 -157885 332367 118946 6485
15722g881j16095A32439b30600L7425C0789M4053C4827g2625D7258c73684a37828
$$ -7881 -123976 132439 -230600 -193175 30789 74842 34827 -72625 47258 -373684 -137828
15710a67798G6491b74392H6688a20768A67486g6038D1664J58691j386R8962h0765
$$ -167798 76491 -274392 86688 -120768 167486 -76038 41664 200355 198969 297931 -80765
15698e8005j1466r1956K1416B76469A09536m6160a36228k29508a27793B41571
$$ -58005 -69471 -161427 -140011 276469 109536 63376 -136228 -365736 -127793 241571
15687c50965a41250m00333f0928j602j748B2542b91480E1059J17749a53040C8083
$$ -350965 -141250 -541583 -60928 -62530 -64278 22542 -291480 51059 168808 -153040 38083
15675C5719d4141B30455a55832c6735Q20k18577J0674I1457a21682B18110G0668
$$ 35719 -44141 230455 -155832 -36735 -35915 -254492 -243818 91457 -121682 218110 70668
15663c68263A18475b29940l4808G0084i9527j48974A50698J67740A32678a17675
$$ -368263 118475 -229940 -264748 70084 -99527 -248501 150698 318438 132678 -117675
15652B26654H0140b63496A03799b20080E7965a53023f3322H8903j8828b64677
$$ 226654 80140 -263496 103799 -220080 57965 -153023 -63322 88903 70075 -264677
15641b77500R2281B63929d17024f9996o6448o6146f500A36643i6267A74943P1775
$$ -277500 -185219 263929 -417024 -69996 -136444 -202590 -6500 136643 -96267 174943 246718
15630B46718b04846j82892A27294a91760N4576C36262A29523F473c27616A30935
$$ 246718 -204846 -387738 127294 -191760 -137184 336262 129523 6473 -327616 130935
15619E7217a05944c6665k29534P3515d4102j8023j61586C15862E6734O7235a708
$$ 57217 -105944 -36665 -266199 -192684 -44102 -62125 -223711 315862 56734 123969 -1708
15607B9341Q6093d8812A63436G3333J27019b97798a07515B8734f9096k9340j07397
$$ 29341 115434 -48812 163436 73333 200352 -297798 -107515 28734 -69096 -98436 -205833
15596b05833r9047H8015b8930I1129E998L00791A8175K5785l83b74646a24941
$$ -205833 -304880 88015 -28930 91129 5998 306789 18175 43960 43577 -274646 -124941
15584B13112d01882e488B33814b10444P02Q2173k34694e1300A07816L1720R182
$$ 213112 -401882 -5488 233814 -210444 -209742 -127569 -362263 -51300 107816 139536 148718
15573A48718a19431L1859j21157a109F5280J01484a43295D6609l400J28519G7485
$$ 148718 -119431 -87572 -208729 -1109 65280 166764 -143295 46609 43209 171728 77485
15561A42170d5620k04654E4588c0909A8097J35037a57410D8479a96185o7909A73033
$$ 142170 -45620 -250274 54588 -30909 18097 153134 -157410 48479 -196185 -264094 173033
15549A57807k1040a57725A92771c33593A04494g8746F9901A2232a87489B5894
$$ 157807 136767 -157725 192771 -333593 104494 -78746 69901 12232 -187489 25894
15538A0514J03942a28067o4689a7508A14130h0663l2591m0652A56568B2083c87243
$$ 10514 114456 -128067 -192756 -17508 114130 -80663 -113254 -153906 156568 22083 -387243
15526B85452c27639J42357N2833A70321O3455a19952C20090h5832j16329B33079
$$ 285452 -327639 -185282 -132449 170321 233776 -119952 320090 -85832 -202161 233079
15515c21537J41467B50396q3265a36634B46976h3796o1920r7224n2242J30795
$$ -321537 -180070 250396 167131 -136634 246976 -83796 -145716 -242940 -295182 -164387
15505a64387B1822J12533b32207B68222c3816A68764a23859J1877A57861e2967
$$ -164387 21822 134355 -232207 268222 -33816 168764 -123859 -111982 157861 -52967
15494b04279D2253J04664b06556c1732j26751H679c53321B4530d4640D084a44235
$$ -204279 42253 146917 -206556 -31732 -158483 8679 -353321 24530 -44640 4084 -144235
15482b38279A20952D2645a41999A5177J03554O0028c4540j1453E3152L5211a98064
$$ -238279 120952 42645 -141999 15177 118731 178759 -34540 -45993 53152 88363 -198064
15470B08491j4383R4101b57389a06425p1001L8522j05196A56436Q0617A09334
$$ 208491 194108 288209 -257389 -106425 -177426 -138904 -244100 156436 237053 109334
15459e3121A58788a3966C1224J11292a51142A95438b41209a6231A26200a36993
$$ -53121 158788 -13966 31224 142516 -151142 195438 -241209 -16231 126200 -136993
15448C00160r8243C6508Q2588a53898B70724J25338a08596A17972a99936j67672
$$ 300160 201917 36508 119096 -153898 270724 396062 -108596 117972 -199936 -367608
15438c67608d4207H5940J7062b10002h5965A4558K8283c9409B10876D3060J76209
$$ -367608 -44207 85940 103002 -210002 -85965 14558 42841 -39409 210876 43060 219269
15427B19269n8068a36143B18976E9257B7829a50179P4635a069j33719C5864a35679
$$ 219269 161201 -136143 218976 59257 27829 -150179 -75544 -1069 -134788 35864 -135679
15415A33713E2539R6110a97659B82398q1825p6263j0818J42680a39736B9868a83732
$$ 133713 52539 148649 -197659 282398 200573 124310 113492 256172 -139736 29868 -183732
15403a21254A29198O5303f9421B4925a9471A88938a3609j3251B0239c1013l3965
$$ -121254 129198 194501 -69421 24925 -19471 188938 -13609 -26860 20239 -31013 -64978
15392f4978l87969e7418B36929c74628f7257D178a7087B40736J8992a08789B43175
$$ -64978 -452947 -57418 236929 -374628 -67257 4178 -17087 240736 259728 -108789 243175
15380c39344E19237b8932D0614K4762k0777a44058E9339O301a4969l14903D04007
$$ -339344 519237 -28932 40614 65376 44599 -144058 59339 65640 -14969 -329872 404007
15368a28010B90350G0857c14049A6681g6983A57527b48162C7846e1054B75306
$$ -128010 290350 70857 -314049 16681 -76983 157527 -248162 37846 -51054 275306
15357A4204g4023G1476d9909j17260C0904c43591A8612J63781O3618b11292B2984
$$ 14204 -74023 71476 -49909 -167169 30904 -343591 18612 182393 246011 -211292 22984
15345D25813a82431A8510E3O451L3082L20688H6087K56379Q8748D0938b24837
$$ 425813 -182431 18510 53 6504 39586 360274 86087 342466 431214 40938 -224837
15333E3855J13354N575b70961B3020K2196R0479c6365A36357c82212B0780f0793
$$ 53855 167209 172784 -270961 23020 45216 135695 -36365 136357 -382212 20780 -60793
15321C41098A49604h1574c7688A67093A0888J99181o4966l0637i3110K6356E9200
$$ 341098 149604 -81574 -37688 167093 10888 210069 145103 114466 -93110 -66754 59200
15309A4830a65490A99935h6560k43647b4290A15223J38468i8297J555B02955I4040
$$ 14830 -165490 199935 -86560 -330207 -24290 115223 253691 -98297 -96742 202955 94040
15297C89339a03856C05091P7440D0662c45953A70999e2277A12020K16262D8594
$$ 389339 -103856 305091 382531 40662 -345953 170999 -52277 112020 328282 48594
15286h7765H8427K1086b76329O2294k43853d8580A75045F6064d0227G3873a10148
$$ -87765 88427 109513 -276329 -214035 -457888 -48580 175045 66064 -40227 73873 -110148
15274A10232C9597J22239J721b08446p047c3666D3757b53395A31376b51980D93428
$$ 110232 39597 161836 163557 -208446 -215493 -33666 43757 -253395 131376 -251980 493428
15262H5806b20300B97790b33026h8273C39721K6576A67479f7954K4855P256B0896
$$ 85806 -220300 297790 -233026 -88273 339721 366297 167479 -67954 -43099 -35843 20896
15250A55277L08394E7998h872I4015j1449P8892C2121K15553g7898B47602J2784
$$ 155277 463671 57998 -8872 94015 82566 161458 32121 247674 -77898 247602 260386
15239B60386r8411E6818M29186L96740J02494M88662l676j10928K78242F55531
$$ 260386 161975 56818 486004 882744 985238 1473900 1470224 1359296 1637538 655531
15228D17512j09501j22508G0956a84140E40672i6795F4390k1559O5303j4885K68347
$$ 417512 308011 185503 70956 -184140 540672 -96795 64390 42831 108134 93249 361596
15217C61596r3438a72515C5017K25022j28223M2015J84242k5483K3531a640A91648
$$ 361596 268158 -172515 35017 260039 131816 173831 358073 332590 356121 -1640 191648
15205b32429c5467r765I4337k2770a997Q63k76700R7762A48234B1681r730a76789
$$ -232429 -35467 -45232 94337 71567 -1997 -1134 -277834 -180072 148234 21681 11951 -176789
15192f1716p2388D3066c6385k07256B83518b09001C06644D4632J67693o1370m6603
$$ -61716 -134104 43066 -36385 -243641 283518 -209001 306644 44632 212325 150955 104352
15181A04352A6517e0268J8868C2847J08628j4602O592n8877b3188j68904c148
$$ 104352 16517 -50268 -31400 32847 141475 126873 133465 74588 -23188 -192092 -3148
15169B05152J93330a1655A58881Q3712n1767K22348d2531B35911J65803d0245
$$ 205152 398482 -11655 158881 242593 190826 413174 -42531 235911 401714 -40245
15158B49002L5570a75763B64749j22973d607B92898g8349A95362h6234b1943C51335
$$ 249002 284572 -175763 264749 141776 -4607 292898 -78349 195362 -86234 -21943 351335
15146E2504p391a89109C0058e5543H9854k6511K86770q3913m1994b6470F1732
$$ 52504 45113 -189109 30058 -55543 89854 63343 350113 266200 224206 -26470 61732
15134b76488A43814J5201m4000R888Q1837G6645K04737A8500K47903n5893J74525
$$ -276488 143814 159015 115015 124903 206740 76645 281382 18500 266403 210510 385035
15123C85035G1012R9898Q0557r124J26957n7212j03470R8461q5811I1608J71159
$$ 385035 71012 170910 251467 242343 369300 312088 208618 307079 221268 91608 262767
15112B62767A16063J14675O8529C6346J53889R2077E275P8230J69976A20744O5645
$$ 262767 116063 230738 299267 36346 190235 282312 5275 83505 253481 120744 186389
15101A86389a80587B23763A02748Q1285J24170m6045p7334J12707b1883F2315
$$ 186389 -180587 223763 102748 184033 308203 262158 184824 297531 -21883 62315
15090a22484C5148K689a18792d2175k4034A44331J79330j0126I2093a095D286
$$ -122484 35148 37837 -118792 -42175 -66209 144331 323661 313535 92093 -1095 4286
15078f5224A24288J61691k9990I9645K63824p9874K3083O1127G4216K0631J98885
$$ -65224 124288 285979 255989 99645 363469 283595 306678 367805 74216 94847 293732
15067B93732A11476j1697K32950j08231g4662A68888J25580e9913C03197A23179
$$ 293732 111476 99779 332729 224498 -74662 168888 294468 -59913 303197 123179
15056B03373b07834C89508g3080B66761N7325e4845A96482B985J7994K53022B0330
$$ 203373 -207834 389508 -73080 266761 324086 -54845 196482 2985 20979 274001 20330
15044g9627b8807A97509J86607A19372L44338A78256A532J46239L2091L9132L2258
$$ -79627 -28807 197509 384116 119372 463710 178256 1532 147771 179862 218994 251252
15033B51252K00699f245A30267i4070k09580a32224C19998A18268n2546L22779
$$ 251252 451951 -6245 130267 -94070 -303650 -132224 319998 118268 65722 388501
15023C88501j0298G8676K68841A04300J9795F1717c7322q802A74107J3534Q3983
$$ 388501 378203 78676 347517 104300 124095 61717 -37322 -46124 174107 187641 271624
15012B71624l3964j09755K16249j19358G4311N9745C7923K64730H1760J53845
$$ 271624 237660 127905 344154 224796 74311 134056 37923 302653 81760 235605
15002B35605r0566P0290P5784d2780B33852j14257L5310J13291l9715J10651c0166
$$ 235605 145039 215329 291113 -42780 233852 119595 154905 268196 228481 339132 -30166
14990A61445L06372A37556J1801q017K85038j93512a62449B67854K1722J36678
$$ 161445 467817 137556 149357 141340 426378 232866 -162449 267854 289576 426254
14980D26254j06003K1154A7379J17379J38567K92409A9521K20138k4764K9649
$$ 426254 320251 341405 17379 134758 273325 565734 19521 239659 214895 244544
14970B44544D3244J56593J31132M8875j52893N8785q2473j2206p4910J57223J44831
$$ 244544 43244 199837 330969 379844 226951 285736 203263 191057 116147 273370 418201
14959D18201j15240D6729M08951l9177H6845J51351J09914L4020A42600J44719
$$ 418201 302961 46729 455680 416503 86845 238196 348110 382130 142600 287319
14949B87319J44606r5008I8124O4621j6007P6979L882O1333p2731H5722J46412
$$ 287319 431925 336917 98124 162745 146738 223717 227599 288932 216201 85722 232134
14938B32134J08929j53980N0280q6596n0609o365Q3499L292J35335G8674a0475
$$ 232134 341063 187083 237363 150767 100158 93793 177292 180584 315919 78674 -10475
14926B24766a1784G2347K6620K23582m9750K405J79374C3032K66209J35267P8916
$$ 224766 -11784 72347 98967 322549 272799 275204 454578 33032 299241 434508 513424
14915E13424B17043N05331k46746M3103B57544K04528j84046g550E64972j80696
$$ 513424 217043 722374 475628 518731 257544 462072 278026 -7550 564972 384276
14905C84276j44928J79958k1824q0812G2672M80920A47396M16636j2485J24666
$$ 384276 239348 419306 397482 316670 72672 553592 147396 564032 551547 676213
14895F76213l18569A70371K92594A07535J46132K67440m0503j40028K39775r8008
$$ 676213 357644 170371 462965 107535 253667 521107 480604 340576 580351 482343
14885D82343C2523M61042Q6675j50271A04908M59935k82393o2922K97148k43287
$$ 482343 32523 493565 580240 429969 104908 564843 282450 219528 516676 273389
14875B73389M2392J56243A50460K36498R828q1785o6795J42617J03683A31472
$$ 273389 315781 472024 150460 386958 396786 315001 248206 390823 494506 131472
14864B55210r0115K30779R0384m1780J9436J66056j95120J74854G3567j0850K41390
$$ 255210 165095 395874 486258 444478 463914 629970 434850 609704 73567 62717 304107
14853C04107j5546J63328j98208J87079L470l2072J21615R097j45871R5363A94492
$$ 304107 288561 451889 253681 440760 444230 412158 533773 542870 396999 492362 194492
14841D91828Q9095j30142R4517B70436O3028J39221o6714K28429l07512r641K30260
$$ 491828 580923 450781 545298 270436 333464 472685 405971 634400 326888 317247 547507
14830E47507L35153l69785p8719P131P8433R3088j54132J44371k88937K9301j48478
$$ 547507 882660 512875 434156 441287 519720 612808 458676 603047 314110 343411 194933
14819A94933L01793j74266J87037J74736p8707R9514C26944r1888K97343M657
$$ 194933 496726 322460 509497 684233 605526 705040 326944 235056 532399 537056
14809E37056A48999M29907n9803m5956K985p1724K69796j94878R3064j03037j44706
$$ 537056 148999 578906 519103 473147 476132 404408 674204 479326 572390 469353 324647
14798C24647N02767C22413J21283J1409J49236J18812A01288L5471N34194B38275
$$ 324647 827414 322413 443696 455105 604341 723153 101288 136759 670953 238275
14787E62193L18347l13388L30579j71804k70372o8752N10008D27137K26509K1183
$$ 562193 880540 567152 897731 725927 455555 386803 896811 427137 653646 674829
14777F74829l4886q7562J48748k01202J14024n7820n1883L07837j30704m9583
$$ 674829 639943 552381 701129 499927 613951 556131 504248 812085 681381 631798
14767F31798j80311r7968M91234m7222l44238J69731K8043p9470J13163l37666
$$ 631798 451487 353519 844753 797531 453293 623024 651067 571597 684760 347094
14757C47094L32486O5011K9053j08994j53519K76899C02618L41917j17452L41535
$$ 347094 679580 744591 773644 664650 511131 788030 302618 644535 527083 868618
14747H68618l18855L5669j60787M88723l20293j38538M40299l56324J75673l5567
$$ 868618 549763 585432 424645 913368 593075 454537 894836 538512 714185 678618
14737F78618k17315K71823m4587P228J33560k26857j12911L15043j70933K58819
$$ 678618 461303 733126 688539 695767 829327 602470 489559 804602 633669 892488
14727H92488k5366j69349J1954j12786K57380j79561j6893J32485K16400l10941
$$ 892488 867122 697773 709727 596941 854321 674760 657867 790352 1006752 695811
14717F95811m9929j35084M44199m2241m02985M34691k87248Q6298j23704K62072
$$ 695811 645882 510798 954997 912756 509771 944462 657214 743512 619808 881880
14707H81880k72311N74893l72709L69632j86471N7476n23140L52216k15250j3728
$$ 881880 609569 1184462 811753 1181385 994914 1052390 529250 881466 666216 652488
14697F52488K4223L03747M474j17512L4888K58619j79714J6830l30497K66762
$$ 652488 676711 980458 984932 867420 902308 1160927 981213 998043 667546 934308
14687I34308O4555K30770m90125K76305K28672k18846N1720q4862k156p0314P5548
$$ 934308 998863 1229633 739508 1015813 1244485 1025639 1077359 992497 990341 920027 995575
14676I95575k13995J20174K0759J14985n5964J12123q2412P8683k9340k15707
$$ 995575 781580 901754 922513 1037498 981534 1093657 1011245 1089928 1060588 844881
14666H44881K06651r6105k01836L75984k340n1922K78182k14338k68594K38071
$$ 844881 1051532 955427 753591 1129575 1127235 1075313 1353495 1139157 870563 1108634
14656A108634J04084l52937Q3228j73121M50578k52629J6528J89114j09730O7681
$$ 1108634 1212718 859781 943009 769888 1220466 967837 984365 1173479 1063749 1131430
14646A131430R5221j68073l16351J81783J98129K99897j56997p2722P321J48539
$$ 1131430 1226651 1058578 742227 924010 1122139 1422036 1265039 1192317 1199638 1348177
14636A348177j03925n5815L0130K95322l01151M59120o18592j68339N84959j29835
$$ 1348177 1244252 1188437 1218567 1513889 1212738 1671858 1053266 884927 1469886 1340051
14626A340051J30958j10720M4141j46220L08121k73507J23433K91467m49155K61029
$$ 1340051 1471009 1360289 1404430 1258210 1566331 1292824 1416257 1707724 1258569 1519598
14616A519598J12092q4641l1479k81672L747J71785J28754k09450J42319n2554
$$ 1519598 1631690 1547049 1515570 1233898 1237645 1409430 1538184 1328734 1471053 1418499
14606A418499Q534K66054r1317j63314K04455j69982k8098J4511M56561n45521
$$ 1418499 1427033 1693087 1601770 1438456 1642911 1472929 1444831 1459342 1915903 1370382
14596A370382O74260m44918j12127q6721L8032M32946k3036J52951o07492N14486
$$ 1370382 2044642 1599724 1487597 1400876 1438908 1871854 1848818 2001769 1394277 1908763
14586A908763m26279L33381L65880k74733K1597j34972K32792k63622J27888L45448
$$ 1908763 1482484 1815865 2181745 1907012 1928609 1793637 2026429 1762807 1890695 2236143
14576B236143j97521k14627j3037N79724m13906l7901J15693p4230L8951K2360
$$ 2236143 2038622 1823995 1810958 2390682 1976776 1938875 2054568 1980338 2019289 2041649
14566B041649L94586l53420J32623m0129J07873r1194j53068N06690j80909J58495
$$ 2041649 2436235 2082815 2215438 2175309 2283182 2191988 2038920 2545610 2364701 2523196
14556B523196n6148q3412L03493k26566l2318K82174j13322L69463J6470j10931
$$ 2523196 2467048 2383636 2687129 2460563 2428245 2710419 2597097 2966560 2983030 2872099
14546B872099J38003O7309J17681M61955J04767P6291N24618M9791M64926R36762
$$ 2872099 3010102 3077411 3195092 3657047 3761814 3838105 4362723 4412514 4877440 5814202
14536E814202J078559J660853K350405M401676O047873P333229l03992q459403
$$ 5814202 6892761 8553614 10904019 15305695 21353568 28686797 28382805 19923402
14528A9923402o494042m268440k023475j993602j177657l81176l43231m29787
$$ 19923402 13429360 9160920 7137445 5143843 3966186 3585010 3241779 2811992
14520B811992M2611J44850m10076n5979o3638m3204M98738k27412j30251J38410
$$ 2811992 2854603 2999453 2589377 2533398 2469760 2426556 2925294 2697882 2567631 2706041
14510B706041j45846k7349o3934K39341j81112L95076j02272K03725j82509j66220
$$ 2706041 2560195 2532846 2468912 2708253 2527141 2922217 2819945 3023670 2841161 2674941
14500B674941M72198j10871k11888J99076O2717j6457k21018j9502L60358L4262
$$ 2674941 3147139 3036268 2824380 3023456 3086173 3069716 2848698 2829196 3189554 3223816
14490C223816J73897k85065p1719M25342M6169j51457J64123P1417M2509k64223
$$ 3223816 3397713 3112648 3040929 3466271 3512440 3360983 3525106 3596523 3639032 3374809
14480C374809L65628j73466Q3231K12508m6246n029l44643L40137K68434K57315
$$ 3374809 3740437 3566971 3650202 3862710 3816464 3811435 3466792 3806929 4075363 4332678
14470D332678n44304K3075N0718J33865L22414k58537K92937j70710J67507N290
$$ 4332678 3788374 3811449 3862167 3996032 4318446 4059909 4352846 4182136 4349643 4354933
14460D354933K0957J1247k72132N76798m5014J73973k28959J98974K57550J5665
$$ 4354933 4375890 4387137 4115005 4691803 4646789 4820762 4591803 4790777 5048327 5063992
14450E063992n6180P7233l3637J0583r7876K90572j02703M14988k68256N42352
$$ 5063992 5007812 5085045 5051408 5061991 4964115 5254687 5151984 5566972 5298716 5841068
14440E841068l02617k18540M92834q7658j21146J24949L16544N850j73808J40610
$$ 5841068 5538451 5319911 5812745 5725087 5603941 5728890 6045434 6051284 5877476 6018086
14430F018086P7563J46463K75939J68997k54011o3297L23575m34501Q05781j50527
$$ 6018086 6095649 6242112 6518051 6687048 6433037 6369740 6693315 6258814 7064595 6914068
14420F914068M4298O03215o9467k18305M34959l1281J53187n00575Q41499k50281
$$ 6914068 6958366 7561581 7492114 7273809 7708768 7677487 7830674 7330099 8171598 7921317
14410G921317K45749J08650L55077j78087M38941L6548k7688r4523K80776p9041
$$ 7921317 8167066 8275716 8630793 8452706 8891647 8928195 8900507 8805984 9086760 9007719
14400I007719L26280L36567j62141K99930k58141M20422K73821L62712l2236k04526
$$ 9007719 9333999 9670566 9508425 9808355 9550214 9970636 10244457 10607169 10574933 10370407
14390A0370407M87820L98561j49086L35183P728K03937N9059K67582K78236J51026
$$ 10370407 10858227 11256788 11107702 11442885 11450613 11654550 11713609 11981191 12259427 12410453
14380A2410453M67406j3451J55246p2260O67917K87651l45106P29334L56760J99783
$$ 12410453 12877859 12864408 13019654 12947394 13615311 13902962 13557856 14287190 14643950 14843733
14370A4843733J59580L33358M46545K55338K06720K15041J14374P49805l2535
$$ 14843733 15003313 15336671 15783216 16038554 16245274 16460315 16574689 17324494 17291959
14361A7291959L52426N50156L16290K36522N61212K05708N48342J68044L25265
$$ 17291959 17644385 18194541 18510831 18747353 19308565 19514273 20062615 20230659 20555924
14352B0555924L70803J009749M10215L40256J04406Q87298M11525O27519J68173
$$ 20555924 20926727 21936476 22346691 22686947 22791353 23678651 24090176 24717695 24885868
14343B4885868P53948R14513L74955P39525N48005P62100P07352Q10734O61911
$$ 24885868 25639816 26554329 26929284 27668809 28216814 28978914 29686266 30497000 31158911
14334C1158911P21241Q92116J104643Q86471R81567L93711J354393P14889R76790
$$ 31158911 31880152 32772268 33876911 34763382 35744949 36138660 37493053 38207942 39184732
14325C9184732J320836J187513J072023J331846J198915J460595J296705J436104
$$ 39184732 40505568 41693081 42765104 44096950 45295865 46756460 48053165 49489269
14317D9489269J511238J800849J535615J801752J636526K290451J606547K151127
$$ 49489269 51000507 52801356 54336971 56138723 57775249 60065700 61672247 63823374
14309F3823374K450352K418054K039664K901150K470615K638450L194963L053294
$$ 63823374 66273726 68691780 70731444 73632594 76103209 78741659 81936622 84989916
14301H4989916L023830L461432L620645M103905L697005M590355L882957N081017
$$ 84989916 88013746 91475178 95095823 99199728 102896733 107487088 111370045 116451062
14293A16451062M678359N393596N646424N996879N921032O933580O541917P591941
$$ 116451062 121129421 126523017 132169441 138166320 144087352 151020932 157562849 165154790
14285A65154790P995683Q339298Q580976R236326R916097R923826J0840794J1517393
$$ 165154790 173150473 181489771 190070747 199307073 209223170 219146996 229987790 241505183
14277B41505183J1947681J2344396J2714990J3725551J4165251J4532079J4888853
$$ 241505183 253452864 265797260 278512250 292237801 306403052 320935131 335823984
14270C35823984J5159781J4638986J4189875J3513624J2711036J0876037J0980732
$$ 335823984 350983765 365622751 379812626 393326250 406037286 416913323 427894055
14263D27894055R890153Q994008P803056O963154M693644J870924j047733j684081
$$ 427894055 437784208 446778216 454581272 461544426 466238070 468108994 467061261 465377180
14255D65377180k493489n595548q092556p419315p747480q894644j0330260j2843935
$$ 465377180 462883691 457288143 449195587 441776272 434028792 425134148 414803888 401959953
14247D01959953j3762391j4118705j4253770j4385511j4153284j3747332j3637006
$$ 401959953 388197562 374078857 359825087 345439576 331286292 317538960 303901954
14240C03901954j2805400j2973256j2233917j2241074j1457334j1484232j0991912
$$ 303901954 291096554 278123298 265889381 253648307 242190973 230706741 219714829
14233B19714829j0601965r733841r799512r138479q661431q683732p574822p543823
$$ 219714829 209112864 199379023 189579511 180441032 171779601 163095869 155521047 147977224
14225A47977224o754170o199527o025934n979875m977190n454949m240367m597649
$$ 147977224 141223054 135023527 128997593 123017718 118040528 112585579 108345212 103747563
14217A03747563l891814m320522l591957l532845l525777l147839k793503k851768
$$ 103747563 99855749 95535227 91943270 88410425 84884648 81736809 78943306 76091538
14209G6091538l047549k671856k476089k106804k399762k022737j972333j749981
$$ 76091538 73043989 70372133 67896044 65789240 63389478 61366741 59394408 57644427
14201E7644427j704637k289396j069931j661491j579025j523212j710143r09375
$$ 57644427 55939790 53650394 52580463 50918972 49339947 47816735 46106592 45197217
14193D5197217j266340q77517j575315r76052j055361j249032r40715j084419
$$ 45197217 43930877 43053360 41478045 40501993 39446632 38197600 37256885 36172466
14185C6172466q85062r83565o54534j126093n22637q83476m73390r03848r50937
$$ 36172466 35287404 34303839 33649305 32523212 32000575 31117099 30643709 29739861 28788924
14176B8788924q70761o70419o12103m81725n67054n91872p51244l81636n31714
$$ 28788924 27918163 27247744 26635641 26153916 25586862 24994990 24243746 23862110 23330396
14167B3330396o25211l74843o36950n19461l82922m19420k13791p6487p13707
$$ 23330396 22705185 22330342 21693392 21173931 20791009 20371589 20157798 20081311 19367604
14158A9367604r16806N9541n48052j72992P3363p29039l1291m07785m30126m70851
$$ 19367604 18450798 18510339 17962287 17789295 17862658 17133619 17102328 16694543 16264417 15793566
14148A5793566j32746n93219j01849m57661M7263j08998m87227k37287m4139n04551
$$ 15793566 15660820 15067601 14965752 14508091 14555354 14446356 13959129 13721842 13677703 13173152
14138A3173152k8452q1945l77491j01707j77436j91258k50241j24378l67482J30457
$$ 13173152 13144700 13062755 12685264 12583557 12406121 12214863 11964622 11840244 11472762 11603219
14128A1603219r2815k23039n02976k47280M24817p42897J44101k21507k47459
$$ 11603219 11510404 11287365 10784389 10537109 10961926 10219029 10363130 10141623 9894164
14119I894164M0235k23980j24764k58676j05368k36816J43851j52191l21734j97040
$$ 9894164 9934399 9710419 9585655 9326979 9221611 8984795 9128646 8976455 8654721 8457681
14109H457681o5667J15778l15434k61399K06693m62327N7783K14415k05814K70454
$$ 8457681 8392014 8507792 8192358 7930959 8137652 7675325 7733108 7947523 7741709 8012163
14099H012163m10583j30969q7258k12288M588j97443j55251l02051J67975k06408
$$ 8012163 7601580 7470611 7383353 7171065 7175653 6978210 6822959 6520908 6688883 6482475
14089F482475k07246K61974j55545l59919Q4389J65986k06925k014J26309l75523
$$ 6482475 6275229 6537203 6381658 6021739 6106128 6272114 6065189 6063175 6189484 5813961
14079E813961K17065l33513m02206N16472l10145Q4528j88348M33026l76701k43858
$$ 5813961 6031026 5697513 5295307 5811779 5501634 5586162 5397814 5830840 5454139 5210281
14069E210281K11493m96916j29489Q0991J58723Q3403m2888O6693k94636k28064
$$ 5210281 5421774 4924858 4795369 4876360 5035083 5118486 5075598 5142291 4847655 4619591
14059D619591J66332m08019K37653k5242j10924J3301k43009n9210O4645j11500
$$ 4619591 4785923 4377904 4615557 4590315 4479391 4492692 4249683 4190473 4255118 4143618
14049D143618j99225J64217K52735j43974P3209N2372p97371K10164L65591l26967
$$ 4143618 3944393 4108610 4361345 4217371 4290580 4342952 3545581 3755745 4121336 3794369
14039C794369q6869K42724j48973K12437k10766n3276j70667J11829Q2556J20586
$$ 3794369 3707500 3950224 3801251 4013688 3802922 3749646 3578979 3690808 3773364 3893950
14029C893950l50660o76383O43309k46184R1584M9318j79250N3551k19136j29870
$$ 3893950 3543290 2866907 3510216 3264032 3355616 3404934 3225684 3279235 3060099 2930229
14019B930229J59604J83348k77619J38592P7090J6968M5776r2918k8327j31862
$$ 2930229 3089833 3273181 2995562 3134154 3211244 3228212 3273988 3181070 3152743 3020881
14009C020881j72723l82327M73894o25484P30001p9250k50534J83604l24824k3046
$$ 3020881 2848158 2465831 2939725 2314241 3044242 2964992 2714458 2898062 2573238 2550192
13999B550192j40777K85472J53201j85544L96494j85090m78037K34743l90608
$$ 2550192 2409415 2694887 2848088 2662544 3059038 2873948 2395911 2630654 2240046
13990B240046K35114J10626k6710l02261r7769q405L84991Q1603K1418j25524
$$ 2240046 2475160 2585786 2559076 2256815 2159046 2150641 2535632 2617235 2638653 2513129
13980B513129K47478M599L72277M69302M74572R73171K191461L851814N777294
$$ 2513129 2760607 2765206 3137483 3606785 4081357 5054528 7245989 11097803 16875097
13971A6875097P502137K098439o215883m816107m010804k853619j580522j286477
$$ 16875097 24377234 26475673 20259790 15443683 11432879 8579260 6998738 5712261
13963E712261j062345o65414k16606j79342m06292r6912q1413k11254L48714m94712
$$ 5712261 4649916 3984502 3767896 3588554 3182262 3085350 3003937 2792683 3141397 2646685
13953B646685M08J3766n3424l56685J33414J41845l73040N473J68304k44301J82480
$$ 2646685 2647093 2660859 2607435 2250750 2384164 2526009 2152969 2158442 2326746 2082445 2264925
13942B264925M3469J1248l78832N49700m04020K15507j58285j77983J71083r8430
$$ 2264925 2308394 2319642 1940810 2490510 2086490 2301997 2143712 1965729 2136812 2038382
13932B038382j92536K36142R2531k32852J03442J69005k78579J06515j39093j7436
$$ 2038382 1845846 2081988 2174519 1941667 2045109 2214114 1935535 2042050 1902957 1885521
13922A885521l43693K30746q36n3691n6563J09141j3485J6324p3244o0699N1466
$$ 1885521 1541828 1772574 1771738 1718047 1661484 1770625 1757140 1773464 1700220 1639521 1690987
13911A690987K0236Q9070j50600K6350K21279j0874l12824j80008M3187k409M4235
$$ 1690987 1711223 1800293 1649693 1676043 1897322 1886448 1573624 1393616 1436803 1434394 1478629
13900A478629K32648k65487N4202r6822n6775M53954n87095M46338k80939l3664
$$ 1478629 1711277 1445790 1499992 1403170 1346395 1800349 1213254 1659592 1378653 1344989
13890A344989L0317J5796J31867k34394J14370J64216k40146k8683J457R0045
$$ 1344989 1375306 1391102 1522969 1288575 1402945 1567161 1327015 1298332 1299789 1389834
13880A389834k37657L16391M3647k25516k2384J01170k29759M28260m91591Q7723
$$ 1389834 1152177 1468568 1512215 1286699 1264315 1365485 1135726 1563986 1072395 1160118
13870A160118N0807J02987J12075l06799J695Q7255j94590K35104K92892m26252
$$ 1160118 1210925 1313912 1425987 1119188 1120883 1208138 1013548 1248652 1541544 1115292
13860A115292J40390j14211j51959m7621L36963J57730m52474J21852J25046O9211
$$ 1115292 1255682 1141471 989512 941891 1278854 1436584 984110 1105962 1231008 1300219
13850A300219p3559j8063o5577J99588Q7345o24516N49361k83951k77570L52739
$$ 1300219 1226660 1208597 1143020 1342608 1429953 805437 1354798 1070847 793277 1146016
13840A146016J15220k86620J04705L88357m19280O4456K0362k01818L2241K51800
$$ 1146016 1261236 974616 1079321 1467678 1048398 1112854 1133216 931398 963639 1215439
13830A215439l75912k9210N71622l85556l637j01317K64681k64596K65260m497
$$ 1215439 839527 810317 1381939 996383 992746 891429 1156110 891514 1156774 1152277
13820A152277j41564l17062L38131K8225p5162m76052K05683O2727K13144q7839
$$ 1152277 1010713 693651 1031782 1060007 984845 508793 714476 777203 990347 902508
13810I02508J2742j13634J13045k48104M35944J96337m70381p8710K42138K53597
$$ 902508 915250 801616 914661 666557 1102501 1298838 828457 749747 991885 1245482
13800A245482l30235k8005j1097J2582k2044N8218k8145K17779n44290K64768
$$ 1245482 915247 887242 876145 888727 866683 924901 896756 1114535 570245 835013
13790H35013k6760m7838L17891n7138J38666E53869M9948J48534j39631C04593
$$ 835013 808253 760415 1078306 1021168 1159834 553869 603817 752351 612720 304593
13779I19920k36338K61059j04356k69302K98880n9870o5049M912L4536K00686
$$ 919920 683582 944641 840285 570983 869863 809993 744944 749856 784392 985078
13769I85078r6546k12273L01261L5895j06548j11256k10768P8247m6662J40202
$$ 985078 888532 676259 977520 1013415 906867 795611 584843 663090 616428 756630
13759G56630J13750o5116k42359J11581J25628P1641C74573M56691J15836k54700
$$ 756630 870380 805264 562905 674486 800114 871755 374573 831264 947100 692400
13749F92400N4446J05524K57141n25338R2555k14005L10032k76826K71182l75298
$$ 692400 746846 852370 1109511 584173 676728 462723 772755 495929 767111 391813
13739C91813O07550k98648k3370J3297B55953M78831C57408K62472p4478J5036
$$ 391813 999363 700715 677345 690642 255953 734784 357408 619880 545402 560438
13729E60438K9234j51815K04904k65871L40363k0564k13489R3543o7937L62934
$$ 560438 589672 437857 642761 376890 717253 696689 483200 576743 508806 871740
13719H71740l1106l2962k40351m5964k37929O0874K35352K43115l53494L06452
$$ 871740 840634 807672 567321 521357 283428 344302 579654 822769 469275 775727
13709G75727l14643K64922j76235j00857K06835k59432K08317p9838J69217k73193
$$ 775727 461084 726006 549771 448914 655749 396317 604634 524796 694013 420820
13699D20820j02291M00910k36890K1414j76639K8128K87346k48547J88746J85975
$$ 420820 318529 719439 482549 503963 327324 355452 642798 394251 582997 768972
13689G68972j52758j89993L17103l42344L66695j77396l1624O3365B63698j761
$$ 768972 616214 426221 743324 400980 767675 590279 558655 622020 263698 261937
13679B61937K67533k10471q658N30089l78200J18667R6626r5949k18446R8705
$$ 261937 529470 318999 310341 840430 462230 580897 677523 581574 363128 461833
13669D61833j94818N67877k44236P362n5576P9975l10839J22086K28984B80523
$$ 461833 267015 834892 590656 598018 542442 622417 311578 433664 662648 280523
13658C34361K93953j96247O3206j7684M4978G8717P17438j59429q6401q0372k32757
$$ 334361 628314 432067 495273 477589 522567 78717 796155 636726 550325 469953 237196
13647B37196J17409M3879K49876J8622k85043J10595n1687n5953j05031J96792
$$ 237196 354605 398484 648360 666982 381939 492534 440847 384894 279863 476655
13637D76655N2174j71229A22077Q7296K91762n4834q6007L13619B68991K2941
$$ 476655 528829 357600 122077 209373 501135 446301 360294 673913 268991 291932
13627B91932R9015J81450j31801K01569O849N9573k38867l1636k970A05428M41196
$$ 291932 390947 572397 440596 642165 649014 708587 469720 438084 435114 105428 546624
13616E46624j49402j08919m3996R7465j11495J95821A98265K26225A60282M24302
$$ 546624 397222 288303 244307 341772 230277 426098 198265 424490 160282 584584
13606E84584j44191R1474m0356o3101A42296M27079B37778L01786J09461j53785
$$ 584584 440393 531867 491511 428410 142296 569375 237778 539564 649025 495240
13596D95240p7700j35421K6348j50183J23363J2992K4039J00592P0803m0161O6987
$$ 495240 417540 282119 308467 158284 281647 294639 318678 419270 490073 449912 516899
13585E16899k5398B00514J28918m7888K36732J44272B57173K0598J56351o7228
$$ 516899 491501 200514 329432 281544 518276 662548 257173 277771 434122 366894
13575C66894J46201j76754J53206D2136J77440j7591K95633P3069k28669j42125
$$ 366894 513095 336341 489547 42136 219576 201985 497618 570687 342018 199893
13565A99893L88761k71213O8557M1895J61224C907L57229R662J51490j30352O9071
$$ 199893 588654 317441 385998 427893 589117 3907 361136 370798 522288 391936 461007
13554D61007F2970N31670h7008D93374R1323k15788j11257K88491A95991L49107
$$ 461007 62970 594640 -87008 493374 584697 368909 257652 546143 195991 545098
13544E45098n6504J0347q2337o62J27811j63918L72437B75509O9492A54892l3211
$$ 545098 488594 498941 416604 415942 543753 379835 752272 275509 345001 154892 121681
13533A21681J62080L28411n2038G5143K28462n6533O8351j46138L00592R5700
$$ 121681 283761 612172 560134 75143 303605 247072 315423 169285 469877 565577
13523E65577k29237j31458K30319A09340J65146l9972l4326F7112L28389N3833
$$ 565577 336340 204882 435201 109340 274486 234514 200188 67112 395501 449334
13513D49334A86659Q3918H4937J20186J93502K4288A54225J16873N1907J85407
$$ 449334 186659 270577 84937 205123 398625 422913 154225 271098 323005 508412
13503E08412e7467A40379K48180j45777J47696A92155L70975D6319K71921J55742
$$ 508412 -57467 140379 388559 242782 390478 192155 563130 46319 318240 473982
13493D73982A10684K0215K58836j13320K54228k32785L01164A60553A6525L47118
$$ 473982 110684 130899 389735 276415 530643 297858 599022 160553 16525 363643
13483C63643K56836F2711K09489J46318A2096N40757B55690o2204J13675r208
$$ 363643 620479 62711 272200 418518 12096 552853 255690 193486 307161 297953
13473B97953a9398j0317E78013m7973E8405K8929Q5064H0135R5470m4852b28654
$$ 297953 -19398 -29715 578013 530040 58405 87334 172398 80135 175605 130753 -228654
13461A0115J68749L20802p0283j12055a7668D70033j65197A9175N3684K69675
$$ 10115 178864 499666 429383 317328 -17668 470033 304836 19175 72859 342534
13451C42534j25910J7926I6308m6496L00845j14206A01756B8879J08721L80174
$$ 342534 216624 234550 96308 49812 350657 236451 101756 28879 137600 517774
13441E17774A20365J48370K7353l2161L4457J29574j37908f8993K1461C69289
$$ 517774 120365 268735 296088 263927 298384 427958 290050 -68993 -47532 369289
13430E6667k964L02544o5376G5679K48828j58940C0671L12343C1245J15431L79858
$$ 56667 53703 356247 290871 75679 324507 165567 30671 343014 31245 146676 526534
13419E26534k47324J8380O4695A52210J86082H5438f4578D01974J37512G0705
$$ 526534 279210 297590 362285 152210 338292 85438 -64578 401974 539486 70705
13408H021J96126L34594k03865k4868n7784A2958a21247A98369R8814g2159C16158
$$ 8021 204147 538741 334876 310008 252224 12958 -121247 198369 297183 -72159 316158
13396A59690M5601J32594D8981K41109a426A37119K41126l8889A06171J31087
$$ 159690 205291 337885 48981 290090 -1426 137119 378245 339356 106171 237258
13386B37258o882k0346a8981k3582r9841A08466J43479J17275j36246J04833p5990
$$ 237258 230376 210030 -18981 -42563 -142404 108466 251945 369220 232974 337807 261817
13375B61817r1446b7994B13319G7703a13849B56421q0743Q2013a33192A07663
$$ 261817 170371 -27994 213319 77703 -113849 256421 175678 257691 -133192 107663
13364C03612k6837a62018C69154N4587E5021b2562B48601l8056P6211A16539K23036
$$ 303612 276775 -162018 369154 423741 55021 -22562 248601 210545 286756 116539 339575
13353C39575J19358j49026A37944K66079A83963N9280A0580O5148K69130L3761
$$ 339575 458933 309907 137944 404023 183963 243243 10580 75728 344858 378619
13343C78619a24484A83012K7651c2491C42498A62726G2286C3697P6196K04389
$$ 378619 -124484 183012 210663 -32491 342498 162726 72286 33697 109893 314282
13333C14282a60546C35941J79230B18357J29578K7186m5676A54430J04488J64075
$$ 314282 -160546 335941 515171 218357 347935 375121 329445 154430 258918 422993
13323D22993j74917N2843O698l7189k9388l343F0575K50946j36681R2223H4554
$$ 422993 248076 300919 307617 270428 241040 237697 60575 311521 174840 267063 84554
13311I5957k498L59143I8427J21424K8156K96950B07435I2645J68268m9045I32
$$ 95957 93459 452602 98427 219851 248007 544957 207435 92645 260913 211868 932
13299F3842L95296b4609D00502J27131f6202A69497J12344P8054A60445J89941
$$ 63842 459138 -24609 400502 527633 -66202 169497 281841 359895 160445 350386
13289C50386j11738N0482g2639B84825K44116j17269m4886A82970N6400F391J17178
$$ 350386 238648 289130 -72639 284825 528941 411672 366786 182970 239370 6391 123569
13278A23569A9537K21737o2530p7163J02703a01733A17995d26698A60416e349
$$ 123569 19537 241274 178744 101581 204284 -101733 117995 -426698 160416 -5349
13267H6823L05684A19696e048C20449J62232k27370g4804B66975j01553b3611
$$ 86823 392507 119696 -5048 320449 482681 255311 -74804 266975 165422 -23611
13256a7328C26356a4203B33919Q4302h0779j24793C11215l5439A06060j0864J55621
$$ -17328 326356 -14203 233919 318221 -80779 -205572 311215 275776 106060 95196 250817
13245B50817d9832B58510A13133K4599j4316k7565l5375L0355P609a57330N2799
$$ 250817 -49832 258510 113133 137732 123416 95851 60476 90831 98440 -157330 -104531
13234a04531A12022J89991J49196A39819F4520J91731B8430K44137o7186q2241
$$ -104531 112022 302013 451209 139819 64520 256251 28430 272567 205381 123140
13224A23140e3125f243G7632L85776b26787E09628A8017q655a1359k5758n5390
$$ 123140 -53125 -6243 77632 463408 -226787 509628 18017 9362 -11359 -37117 -92507
13213i2507j25807l5766B52547F6470e3962B5934M76785J06011A26205A7085K99695
$$ -92507 -218314 -254080 252547 66470 -53962 25934 502719 608730 126205 17085 316780
13202C16780a95621B02573K01291D8433K95374E5059b07195O7328B61672j16580
$$ 316780 -195621 202573 403864 48433 343807 55059 -207195 -139867 261672 145092
13192A45092c0908B03649R7992j15968M5724r6334k0960P7522F3259O3764b9647
$$ 145092 -30908 203649 301641 185673 231397 135063 114103 191625 63259 127023 -29647
13180a43869D5770P5904K72599q5999j39363e1847A58641Q4985c6261j46573E3771
$$ -143869 45770 121674 394273 308274 168911 -51847 158641 243626 -36261 -182834 53771
13168a2737B66538J33196B1232M3366a15145B2951J77283b70802F0684d0978o5813
$$ -12737 266538 399734 21232 64598 -115145 22951 200234 -270802 60684 -40978 -106791
13157a06791e2219r3016B83814a5987B15539o3161K25981n2972A25135J21606
$$ -106791 -52219 -145235 283814 -15987 215539 152378 378359 325387 125135 246741
13147B46741M2199q2973b46907d8806c092j00239A46189Q7573j3331b8845B75558
$$ 246741 288940 205967 -246907 -48806 -3092 -103331 146189 233762 220431 -28845 275558
13135B66219D7787J08343J76658C3884N694K66763j23940D0102a11855c1966E1983
$$ 266219 47787 156130 332788 33884 39578 306341 182401 40102 -111855 -31966 51983
13123G49J65241J53581j51281R7799K1972G922J09518b17743C42257e9836B06233
$$ 749 165990 319571 168290 266089 288061 7922 117440 -217743 342257 -59836 206233
13111C07317i3273D76058d2505k5482A65752E9273k6322b446B15878i1268a3744
$$ 307317 -93273 476058 -42505 -67987 165752 59273 32951 -2446 215878 -91268 -13744
13099D76335B00933a6530A8447J97257E3585O7496K08860A39785K38458A15356
$$ 476335 200933 -16530 18447 215704 53585 121081 329941 139785 378243 115356
13088G5418c3867m2553j79619G2103K78423d6863q9640F3559b6376B70812e9898
$$ 75418 -33867 -76420 -256039 72103 350526 -46863 -136503 63559 -26376 270812 -59898
13076C0029N8887a69405b0330l609D997h9651D6032N4967M1505m3492h9633C25275
$$ 30029 88916 -169405 -20330 -23939 4997 -89651 46032 100999 142504 99012 -89633 325275
13063B504i7012A08603k8328J21911a80648A36898A4453L65942D1357K1303K9465
$$ 2504 -97012 108603 80275 202186 -180648 136898 14453 380395 41357 62660 92125
13052I2125c83B36104A03240b7571A57728C1191h408A08343K6037E4608J3252
$$ 92125 -383 236104 103240 -27571 157728 31191 -8408 108343 134380 54608 67860
13041F7860J32038a64935A81907o7751P4002J23662b6817A27859D4320K1144O1967
$$ 67860 199898 -164935 181907 114156 188158 311820 -26817 127859 44320 65464 127431
13030A27431c3352A18669a66229C34064A25902a89977d0271B416c830B65606q2379
$$ 127431 -33352 118669 -166229 334064 125902 -189977 -40271 2416 -3830 265606 183227
13019A83227j9528f9441a7423A02916K68843b45618C5120L91556A37001R2768
$$ 183227 163699 -69441 -17423 102916 371759 -245618 35120 426676 137001 229769
13009B29769h0896k42535h5798Q751I286L69560G013i749j98090A19913a27617
$$ 229769 -80896 -323431 -85798 -77047 9286 378846 7013 -9749 -207839 119913 -127617
12997b0481A97487J8843l3074m5033m210K03656i8210D67232h5497j18226A03906
$$ -20481 197487 216330 183256 138223 134013 337669 -98210 467232 -85497 -203723 103906
12985A66697a7713A2928i5557E3407d393B69279a01356A90655i242B00673L8327
$$ 166697 -17713 12928 -95557 53407 -4393 269279 -101356 190655 -9242 200673 239000
12974B39000A09035K38310A14966M9713B0488N647a08346C20783A0778N4691N5194
$$ 239000 109035 347345 114966 164679 20488 26135 -108346 320783 10778 65469 120663
12963A20663J74665A03907N7878Q6150e3369a2428j74921b6406o5236B43186K178
$$ 120663 295328 103907 161785 247935 -53369 -12428 -187349 -26406 -91642 243186 245364
12952B45364g0073n0184b5053N146o8696A90671J90422i4157j13859G8421f8375
$$ 245364 -70073 -120257 -25053 -19907 -88603 190671 381093 -94157 -208016 78421 -68375
12940a11095a2186j90105F8449J93260g2558A83581a20300A53187H700N563f6713
$$ -111095 -12186 -202291 68449 261709 -72558 183581 -120300 153187 8700 14263 -66713
12928a2199A80765d5792A3070J22405f7192a2010I7112C3651b5436j04378K3008
$$ -12199 180765 -45792 13070 135475 -67192 -12010 97112 33651 -25436 -129814 -106806
12917a06806G1002P1790c4743C12052b42892h0302F6553J1366J05494e2523A49452
$$ -106806 71002 142792 -34743 312052 -242892 -80302 66553 77919 183413 -52523 149452
12905C4195i292I2047c3769k4159H6644a23081B33642H2481K05771H0642a58537
$$ 34195 -9292 92047 -33769 -57928 86644 -123081 233642 82481 288252 80642 -158537
12893I857c6266C8927K41091D0407j9246j163b5884k80312i4340A16948J41380
$$ 9857 -36266 38927 280018 40407 21161 19998 -25884 -306196 -94340 116948 258328
12882B58328d2057k17479R8609F2136K4106c0228I6252i0831B4914J49255a25176
$$ 258328 -42057 -259536 -160927 62136 86242 -30228 96252 -90831 24914 174169 -125176
12870A31900R5627b28990j51309B39168A91h1113A50875b18423C1768K58887A26188
$$ 131900 227527 -228990 -380299 239168 191 -81113 150875 -218423 31768 290655 126188
12858e9494d137j01547l4231I4865c7420j82310j32582A22302a58529B52274g6376
$$ -59494 -4137 -105684 -139915 94865 -37420 -219730 -352312 122302 -158529 252274 -76376
12846B36369e5817J773j40166A52688M789F7997K29002c3290A49287o0656a09817
$$ 236369 -55817 -54044 -194210 152688 157477 67997 296999 -33290 149287 88631 -109817
12834I9098b55732a18028A2834K20897l9952a54051B03462G1216J16898G4197
$$ 99098 -255732 -118028 12834 233731 193779 -154051 203462 71216 188114 74197
12823D10990G2356p346K27786c6626C02015C5169i1138n4651A18553l7342J41432
$$ 410990 72356 65010 292796 -36626 302015 35169 -91138 -145789 118553 81211 222643
12812B22643b12044E9356o008n689a42587E1157a10868H9992A8085a34743D8538
$$ 222643 -212044 59356 53348 47659 -142587 51157 -110868 89992 18085 -134743 48538
12800H5823F52J73973h1532j07246D379b25416R2966j60590G8741L59504k17141
$$ 85823 652 174625 -81532 -188778 4379 -225416 -132450 -293040 78741 438245 221104
12789B21104a30323B29260a20123e1767E602b9851l8283k58428B26537n9003a72914
$$ 221104 -130323 229260 -120123 -51767 5602 -29851 -68134 -326562 226537 167534 -172914
12777d6753F6812a28475j8664G3922B8267b3444C8749a75975A05111B1371i5564
$$ -46753 66812 -128475 -147139 73922 28267 -23444 38749 -175975 105111 21371 -95564
12765H1397A3655J94609q1888m3534a46721l341f3295A81025g066A09920c105
$$ 81397 13655 208264 126376 82842 -146721 -150062 -63295 181025 -7066 109920 -3105
12753A08718Q7786m5371a06095g665A44152J7439C7476m432P3980J04696E4246
$$ 108718 196504 151133 -106095 -7665 144152 161591 37476 33044 107024 211720 54246
12741B44600F573c07040L7271Q3250k5674d2238D2003a47845f6170A26981b38460
$$ 244600 6573 -307040 -269769 -186519 -212193 -42238 42003 -147845 -66170 126981 -238460
12729A17042a66271O3618A54606c32175I8742M0845R4847P7262A05701a425l2046
$$ 117042 -166271 -102653 154606 -332175 98742 139587 234434 311696 105701 -1425 -33471
12718c3471B38469k5697D9528a8188j40688H148O5676i410A4244K19506l1444
$$ -33471 238469 212772 49528 -18188 -158876 8148 73824 -9410 14244 233750 202306
12707B02306H7117a04331D7884a67191c6365A13805l6447a72422j12809A04741
$$ 202306 87117 -104331 47884 -167191 -36365 113805 77358 -172422 -285231 104741
12696A4253R7769K87445b54901e0827A43431m4613a2115B69758A12706m3232g716
$$ 14253 112022 399467 -254901 -50827 143431 98818 -12115 269758 112706 69474 -7716
12684c10314B1705J13171D7937J26071O2126E0339J14829i1934B86413a30178
$$ -310314 21705 134876 47937 174008 236134 50339 165168 -91934 286413 -130178
12673a68655j6672b5315j204A05291a05528r4440A66142a94130Q7253A64463a24879
$$ -168655 -185327 -25315 -26519 105291 -105528 -199968 166142 -194130 -106877 164463 -124879
12661A39223Q5100C8422J3607B2285a82067M5950c3912B36128A15605b38180c8360
$$ 139223 224323 38422 52029 22285 -182067 -136117 -33912 236128 115605 -238180 -38360
12649F5908J99102C2066L5113g0358A48728B0886a10319K4482C16624e8976D7869
$$ 65908 265010 32066 67179 -70358 148728 20886 -110319 -85837 316624 -58976 47869
12637A40456k1669n5736P5491K9700g8986I8076b7982n4716A52426f3224A7089
$$ 140456 118787 63051 138542 168242 -78986 98076 -27982 -82698 152426 -63224 17089
12625B52023p424E7188K51962G7543b60271a23682p5353A78417D0443b0112B77482
$$ 252023 244599 57188 309150 77543 -260271 -123682 -199035 178417 40443 -20112 277482
12613a6408B45910N0485f3340A61516J07975a63962d4458k0839l585C05938a10919
$$ -16408 245910 296395 -63340 161516 269491 -163962 -44458 -65297 -68882 305938 -110919
12601a7610j626k21585A95843D7549N1532N7342h0534H2007R8086a53965F4740
$$ -17610 -19236 -240821 195843 47549 99081 156423 -80534 82007 180093 -153965 64740
12589b2903D99522k17495H3253J6018N6984f7781H9264C74J91128D5423O177d8892
$$ -22903 499522 282027 83253 99271 156255 -67781 89264 374 191502 45423 51600 -48892
12576a45311O9412B80651a4121C5183f7019D7944a15932j01917H0637J00637n2450
$$ -145311 -75899 280651 -14121 35183 -67019 47944 -115932 -217849 80637 181274 128824
12565A28824a51343F6280e7474E6463J27646n8480k3173e925l8455J8238B79601
$$ 128824 -151343 66280 -57474 56463 184109 125629 102456 -5925 -44380 -26142 279601
12553a9537r875A71202J02617A12035J66962f2501I5735b07053i3986A98733a62281
$$ -19537 -29412 171202 273819 112035 278997 -62501 95735 -207053 -93986 198733 -162281
12541A78045d1963B59398a8372A27251a99642e9141D6762K01038G2212K06884
$$ 178045 -41963 259398 -18372 127251 -199642 -59141 46762 247800 72212 279096
12531B79096k6680g1868A95907C5709b24306e5529m5476a6276j09272q1697P5872
$$ 279096 252416 -71868 195907 35709 -224306 -55529 -101005 -16276 -125548 -207245 -131373
12520a31373J824I4392O7824a99265H1616a34819A15380b1120C0911f5280A81056
$$ -131373 -129549 94392 162216 -199265 81616 -134819 115380 -21120 30911 -65280 181056
12508E5546a0064B13000C1755c648C72206a6651I9060J59000a3401q4864b0856
$$ 55546 -10064 213000 31755 -3648 372206 -16651 99060 258060 -13401 -98265 -20856
12496d0968a6667m1785A08409b3189I6870h3973B30526i5447j75378F5699p581
$$ -40968 -16667 -58452 108409 -23189 96870 -83973 230526 -95447 -270825 65699 58118
12485E8118a56221A55671o6938N1642n8438b06679B87899a24823j73467f9807
$$ 58118 -156221 155671 88733 140375 81937 -206679 287899 -124823 -298290 -69807
12474b46913P1166A52308K1877a68683B921Q5284B9663J21945a88616M2403K5190
$$ -246913 -175747 152308 174185 -168683 2921 88205 29663 151608 -188616 -146213 -121023
12463a21023O553c6100m0074P87R53H1984J39839d9463B97036a46603d7658a0869
$$ -121023 -114470 -36100 -76174 -75387 -74434 81984 221823 -49463 297036 -146603 -47658 -10869
12450B93482H1392a83815E7101a8070A41924b27950J6805C86953G2843c56609
$$ 293482 81392 -183815 57101 -18070 141924 -227950 -211145 386953 72843 -356609
12439b7482A69517H728J52530a74682c0701A21479a03927H628c2832j20535o5025
$$ -27482 169517 8728 161258 -174682 -30701 121479 -103927 8628 -32832 -153367 -218392
12428b18392P7148A11186l8848a21022K2439B3241K58570N9817A33981k84c24523
$$ -218392 -141244 111186 72338 -121022 -98583 23241 281811 341628 133981 133697 -324523
12416E4088a45041b8703B98521a99961E9675c4064A66500a95248A49677b47534
$$ 54088 -145041 -28703 298521 -199961 59675 -34064 166500 -195248 149677 -247534
12405A66737c03742A29132a99560j5582m4469A57556i3588l01L8296a6501A02802
$$ 166737 -303742 129132 -199560 -215142 -259611 157556 -93588 -93889 -55593 -16501 102802
12393H7401J13626n9792C7898J85810b32563D3498b81286J11740J2126A07252
$$ 87401 201027 141235 37898 223708 -232563 43498 -281286 -169546 -157420 107252
12382a71611k2860l3730i1660B54432d8321j31375F8862B4221P6300J37715q4047
$$ -171611 -194471 -228201 -91660 254432 -48321 -179696 68862 24221 100521 238236 154189
12371A54189a39114M8976K8789k42042d8648A41135a7184D9736O3957Q5372a9621
$$ 154189 -139114 -90138 -61349 -303391 -48648 141135 -17184 49736 113693 199065 -19621
12359A93563b89050i6401j82285C3070J1512J1660e029B994P3334a65227B49423
$$ 193563 -289050 -96401 -278686 33070 44582 56242 -5029 2994 76328 -165227 249423
12347A72163A4983J55627J19436f039D651d32517a82675J72m8209N2333A23483
$$ 172163 14983 170610 290046 -6039 4651 -432517 -182675 -182503 -230712 -178379 123483
12335A19606C746L28981m4544a05129h468m2165J0361l3433A04979a04716d121
$$ 119606 3746 332727 288183 -105129 -8468 -50633 -40272 -73705 104979 -104716 -4121
12323G7896A3573M5391P3121a71112L5510F6116i7076C2333K79815h7078j3000
$$ 77896 13573 58964 132085 -171112 -135602 66116 -97076 32333 312148 -87078 -100078
12312a00078A2579a470j87113A2320c9416j27033J6450D084K33178H4362b83021
$$ -100078 12579 -1470 -188583 12320 -39416 -166449 -149999 4084 237262 84362 -283021
12300A75792a85334B7289J38335A1448K70817a34203A76714f8909C6797d27429
$$ 175792 -185334 27289 165624 11448 282265 -134203 176714 -68909 36797 -427429
12289C950i1841J4651D9117a9250A05977f2494r5342f0633a7395l51092A47265
$$ 3950 -91841 -77190 49117 -19250 105977 -62494 -157836 -60633 -17395 -368487 147265
12277a88523H2914h1342q5784q3736f6150k44871G0708c9614j17173J0469I6972
$$ -188523 82914 -81342 -167126 -250862 -66150 -311021 70708 -39614 -156787 -146318 96972
12265A00794a1374k29172C48366B1521K66904E876K59270r1576b80137O7754O8028
$$ 100794 -11374 -240546 348366 21521 288425 5876 265146 173570 -280137 -212383 -144355
12254a44355A69992G8858D170J48320b32118g4182d277k15633g3025k12611b4212
$$ -144355 169992 78858 4170 152490 -232118 -74182 -4277 -219910 -73025 -285636 -24212
12242a97765A2714J10354J69784A01051j8468J8320c5792B24861H3633j4352O1874
$$ -197765 12714 123068 292852 101051 82583 100903 -35792 224861 83633 69281 131155
12231A31155o2537d2383k6078j3174C36636A8373L90819j37683E7392f7700A51954
$$ 131155 68618 -42383 -68461 -81635 336636 18373 409192 271509 57392 -67700 151954
12219b1947C83032C8030G566h7166o513A15470R6075C1103J19813J64641a21429
$$ -21947 383032 38030 7566 -87166 -93679 115470 211545 31103 150916 315557 -121429
12207A36428R3662n959J07241r6226j06779L0912K06721A7151J58061a80504G7482
$$ 136428 230090 224131 331372 235146 128367 159279 366000 17151 175212 -180504 77482
12195H8744i3061B76726h596A31322f6005F0550J83158a0239E3787J59390k4577
$$ 88744 -93061 276726 -8596 131322 -66005 60550 243708 -10239 53787 213177 188600
12184A88600K6852Q8639J8245r8382f87B03514j4218a49755A50944f9147F0200
$$ 188600 215452 304091 322336 223954 -687 203514 189296 -149755 150944 -69147 60200
12172A72248J2071H4730J86657b06D7663J2799h7656A68576a12788A13297m8867
$$ 172248 184319 84730 271387 -206 47663 60462 -87656 168576 -112788 113297 64430
12161F4430J4672M1425b0888d174I9759D1442i4457k5946A50054e7676A91122
$$ 64430 79102 120527 -20888 -4174 99759 41442 -94457 -120403 150054 -57676 191122
12149F5643K70768G9623B4746b62414C49750O5114j38474a1966k55580c8350C3392
$$ 65643 336411 79623 24746 -262414 349750 414864 276390 -11966 -267546 -38350 33392
12137a22860A54884M4062A1779P7076N987J10311j1092f3275A94704D1516b47950
$$ -122860 154884 198946 11779 88855 94842 205153 194061 -63275 194704 41516 -247950
12125B15896b04765A74457b27595g1272B14359f1213k977A17024h3536B8961a5275
$$ 215896 -204765 174457 -227595 -71272 214359 -61213 -64190 117024 -83536 28961 -15275
12113B93315a62130C50097j39665f413A859J49287b42382N0349f9505m2703m61929
$$ 293315 -162130 350097 210432 -6413 1859 151146 -242382 -192033 -69505 -112208 -574137
12102e74137a72924I5499b07782C372L00864A51991f6829n9945L8883D4028A6190
$$ -574137 -172924 95499 -207782 3372 304236 151991 -66829 -126774 -87891 44028 16190
12090a35871A4300a41934o3462B19624d1661j77333D4447M211d2989A24740D5809
$$ -135871 14300 -141934 -205396 219624 -41661 -218994 44447 48658 -42989 124740 45809
12078F744J77869J99778e4574N598k19007J32209j37567A12104c46699e8183j31517
$$ 6744 184613 384391 -54574 -48976 -267983 -135774 -273341 112104 -346699 -58183 -189700
12067a89700B80571A11947d9363b2139B0658c2980k45592A05595n0634e6019E9061
$$ -189700 280571 111947 -49363 -22139 20658 -32980 -278572 105595 54961 -56019 59061
12055a24394e9882A17289B5982J9243i4218A31195c8034D0823a43473J934c5210
$$ -124394 -59882 117289 25982 45225 -94218 131195 -38034 40823 -143473 -141539 -35210
12043C04462A13717J57860D4183J54052J31785j0455G3080J48825m4968q3701
$$ 304462 113717 271577 44183 198235 330020 319565 73080 221905 176937 93236
12033I3236J26063F8510a69724G7540b6908A5939Q6224a33441A91370e5077C95969
$$ 93236 219299 68510 -169724 77540 -26908 15939 102163 -133441 191370 -55077 395969
12021e3395B1056b09424i9632J5187M0141j92516A86472a2471A66953a18773j0451
$$ -53395 21056 -209424 -99632 -84445 -44304 -236820 186472 -12471 166953 -118773 -129224
12010a29224C8160N660h4031A50380F8867K30985I3276b87164H3180e10311g2923
$$ -129224 38160 43820 -84031 150380 68867 299852 93276 -287164 83180 -510311 -72923
11998e1805B31945r3977a2323D2343K06263A02367K8893a80270F416b68337e9086
$$ -51805 231945 137968 -12323 42343 248606 102367 131260 -180270 6416 -268337 -59086
11986F0687b8776k54695B01732p4187r400J65476a01538j84346g0817j03199j76316
$$ 60687 -28776 -283471 201732 127545 118145 283621 -101538 -285884 -70817 -174016 -350332
11975c50332A07671i0447m8430B77814j30138c44667C8954K33079I1683f48299
$$ -350332 107671 -90447 -138877 277814 147676 -344667 38954 272033 91683 -648299
11964c23687i6367k19260R9240r8078c5168B3652c8911m3231a2879k4881j30945
$$ -323687 -96367 -315627 -216387 -314465 -35168 23652 -38911 -82142 -12879 -37760 -168705
11953a68705j63246P7869M1250O1293a825j61680j40922A22301l789i2275L6892
$$ -168705 -331951 -254082 -212832 -151539 -1825 -163505 -304427 122301 118512 -92275 -55383
11942e5383o4569A46793a6962A62310d1119B79749A20471h5434B46152g5403B15763
$$ -55383 -119952 146793 -16962 162310 -41119 279749 120471 -85434 246152 -75403 215763
11930b5445A19950n4631a06410A22502a98325A62874d1011A98004h9943L3833
$$ -25445 119950 65319 -106410 122502 -198325 162874 -41011 198004 -89943 -56110
11920e6110b1129k75472J33415C4248B35M7406d6591p3268D6376c6036l24685
$$ -56110 -21129 -296601 -163186 34248 235 47641 -46591 -119859 46376 -36036 -360721
11909c60721A49634b11937f3714j34623A77827p1262a44900b8890D2487f6253
$$ -360721 149634 -211937 -63714 -198337 177827 106565 -144900 -28890 42487 -66253
11898a54643o7316J4652i0725K1756j8803B2806h5977n3230B3444K35406D2922
$$ -154643 -221959 -207307 -90725 -68969 -87772 22806 -85977 -139207 23444 258850 42922
11886a43340D208i6002K7316A33821N6580p0344f5696E7041b00736A94496c71815
$$ -143340 4208 -96002 -68686 133821 190401 120057 -65696 57041 -200736 194496 -371815
11874C5891a91882a9650j6729F2829P5652m1006l5022a24277J3337A87521a08318
$$ 35891 -191882 -19650 -36379 62829 138481 97475 62453 -124277 -110940 187521 -108318
11862B4366a02184j3274C0193J5990f1981A02375h6622k02469D7539a74059k5184
$$ 24366 -102184 -115458 30193 46183 -61981 102375 -86622 -289091 47539 -174059 -199243
11851a99243A72472B9261a95138p6801b2597A7900J37461a92329M8398B58088
$$ -199243 172472 29261 -195138 -271939 -22597 17900 155361 -192329 -143931 258088
11840F324P7194d4089C6656h6658A53062A1700b1121A49000j2451J19943e0906
$$ 6324 83518 -44089 36656 -86658 153062 11700 -21121 149000 136549 256492 -50906
11828B8266J43555R6167E3263g6368D1577K46443a22544j44387K9438d7936j46252
$$ 28266 171821 267988 53263 -76368 41577 288020 -122544 -266931 -237493 -47936 -194188
11817a94188g3270B7312a6682f233l9009F0989a62187A35425n9561b57880J28126
$$ -194188 -73270 27312 -16682 -6233 -45242 60989 -162187 135425 75864 -257880 -129754
11806a29754G3258B7260c0060j05952j8825j6899B95861i7394M643A335a10742
$$ -129754 73258 27260 -30060 -136012 -154837 -171736 295861 -97394 -92751 1335 -110742
11794c08806f2642D3345b38467G6618i3578l30989B4997b7817A21265b22378M7675
$$ -308806 -62642 43345 -238467 76618 -93578 -424567 24997 -27817 121265 -222378 -174703
11783a74703d9419B0112b63936F8091a44638j9434j44768M3487a10104A6056J4579
$$ -174703 -49419 20112 -263936 68091 -144638 -164072 -308840 -265353 -110104 16056 30635
11772C0635b10479A38278b26764H4008a74017j3545d2391k40274i578C41242j56531
$$ 30635 -210479 138278 -226764 84008 -174017 -187562 -42391 -282665 -9578 341242 184711
11761A84711c9085l1812j04409h3662k12215J01687B22955b25294Q2132q5427
$$ 184711 -39085 -70897 -175306 -83662 -295877 -194190 222955 -225294 -143162 -228589
11751b28589L8878j31453D1132i0218i015l63789A12794R3628c37491j0883a17005
$$ -228589 -189711 -321164 41132 -90218 -9015 -372804 112794 206422 -337491 -348374 -117005
11739C04734F581a97298A60351b2813k23547A91641D2574a96756P9127B36855
$$ 304734 6581 -197298 160351 -22813 -246360 191641 42574 -196756 -117629 236855
11728h4873D0090M2190J44000a85136M8252k39216J78997A85349J10966G8528
$$ -84873 40090 82280 226280 -185136 -136884 -376100 -197103 185349 296315 78528
11717B59372c586k36375L967M5750B4139M7136J19941J33672b6915j59701b6532
$$ 259372 -3586 -239961 -235994 -190244 24139 71275 191216 324888 -26915 -186616 -26532
11705B4786b94299C0045a24294A689g1535B82196A16408E1169b37651g516g72
$$ 24786 -294299 30045 -124294 1689 -71535 282196 116408 51169 -237651 -7516 -772
11693E8665a3098k11484B0018d0773j72916j00578D0757b69755B0027d08475a78899
$$ 58665 -13098 -224582 20018 -40773 -213689 -314267 40757 -269755 20027 -408475 -178899
11681e9636q7433c9829j53473e4628H2346g9159j29398P1802j32790A03053b1606
$$ -59636 -147069 -39829 -193302 -54628 82346 -79159 -208557 -136755 -269545 103053 -21606
11669a50262A24950M5817a06819I9436f8674J860j0818k0711B38413f5573C0627
$$ -150262 124950 170767 -106819 99436 -68674 -66814 -77632 -98343 238413 -65573 30627
11657A05280a99390B36615f2906E6268a92659B06550i4109B10263N2509j11123
$$ 105280 -199390 236615 -62906 56268 -192659 206550 -94109 210263 262772 151649
11647A51649D15b12586c6314k15765A19874b2195A30048a40671C03457c23946
$$ 151649 415 -212586 -36314 -252079 119874 -22195 130048 -140671 303457 -323946
11636D2060A8934J10075a35518C8628d01006O2887h5982n189j89139B26222d3214
$$ 42060 18934 129009 -135518 38628 -401006 -338119 -85982 -91171 -280310 226222 -43214
11624A12452c7797D9644a14568A09357f6238b3909n3949C06932D6972c5257o319
$$ 112452 -37797 49644 -114568 109357 -66238 -23909 -77858 306932 46972 -35257 -41576
11613d1576p9319N8464A57908i4062A3895c553B9403L56370i1558L1118A38617
$$ -41576 -120895 -62431 157908 -94062 13895 -3553 29403 385773 -91558 -60440 138617
11601c73499J76392l7820N9622e3622A67699p8616a99058B17115d7240C04043
$$ -373499 -197107 -234927 -175305 -53622 167699 89083 -199058 217115 -47240 304043
11590a31246O2035A20887a51263d7483B03171o9793J0473d63075A24238b1359
$$ -131246 -69211 120887 -151263 -47483 203171 133378 143851 -463075 124238 -21359
11579c040k08419B30561E832J75873c28394A47908N958a45210l3942B09356a27291
$$ -3040 -211459 230561 5832 181705 -328394 147908 153866 -145210 -179152 209356 -127291
11567E5921e2293G3341J44160o2158R8536a37816N6954A17763E6572c10262e0954
$$ 55921 -52293 73341 217501 155343 253879 -137816 -80862 117763 56572 -310262 -50954
11555b30280B7958c61483B29166a37641m894B58442i5179B1936a36745a7598j35186
$$ -230280 27958 -361483 229166 -137641 -142535 258442 -95179 21936 -136745 -17598 -152784
11544a52784B14563n584o3196b11304L7218b5346B16373l8689a62277A4013b4473
$$ -152784 214563 208979 145783 -211304 -174086 -25346 216373 177684 -162277 14013 -24473
11532B27444a31649j65407a5154A43311a3290C52840a13368C13826g5913K9492
$$ 227444 -131649 -297056 -15154 143311 -13290 352840 -113368 313826 -75913 -46421
11522d6421j73266j34805a67349j12307R5428A43078b2913K229B07431a99849
$$ -46421 -219687 -354492 -167349 -279656 -184228 143078 -22913 -20684 207431 -199849
11511I9621Q9701g1000A83308F8895i5583J4408l88719F9488J1503G69R0306J07019
$$ 99621 189322 -71000 183308 68895 -95583 -81175 -469894 69488 80991 769 91075 198094
11499A98094i0112n2335A43041N4730r8154K27033B1475R2999K6755A103K87462
$$ 198094 -90112 -142447 143041 197771 99617 326650 21475 114474 141229 1103 288565
11488B88565g5630E4869J97286C0980J10956m9586h4205c1873J50F8162P1180
$$ 288565 -75630 54869 252155 30980 141936 92350 -84205 -31873 -31723 68162 139342
11477A39342j0052A2811a8225A51467a1310A81608j6537q153a17677B49135r6391
$$ 139342 129290 12811 -18225 151467 -11310 181608 165071 156918 -117677 249135 152744
11466A52744a91911A14150b2273B87411a4094H8311c08036K9852B77952c1493
$$ 152744 -191911 114150 -22273 287411 -14094 88311 -308036 -278184 277952 -31493
11455C56331N5427c36948C84069A70869O2385l4553q9702J56276h8729r9596A3688
$$ 356331 411758 -336948 384069 170869 233254 198701 108999 265275 -88729 -188325 13688
11443g9456k38055B83076A32089n2372M149A2617a93740A34637B8229a35358D4078
$$ -79456 -317511 283076 132089 79717 83866 12617 -193740 134637 28229 -135358 44078
11431a54347p5930I821N3681A9001a30507A48123J06762j4439a12599A16637i1667
$$ -154347 -230277 9821 63502 19001 -130507 148123 254885 240446 -112599 116637 -91667
11419B00799q3875a39452A754K07234e2250D856M18272B8869b76315R9670C5802
$$ 200799 116924 -139452 1754 208988 -52250 4856 423128 28869 -276315 -176645 35802
11407a92739A63270q77n3204a77283N5622A6435L02880e86121D6336b0315A96467
$$ -192739 163270 162393 109189 -177283 -121661 16435 319315 -586121 46336 -20315 196467
11395h6190B08295a16H1142J1570k948c75442O2336A00802f7849k45456h9430
$$ -86190 208295 -116 81142 92712 89764 -375442 -313106 100802 -67849 -313305 -89430
11383D5126e8537j39118o2569b0063E3458M3874J32129I6359g1564C6500O4172
$$ 45126 -58537 -197655 -260224 -20063 53458 97332 229461 96359 -71564 36500 100672
11372A00672M2542a31820H2211g3871l4335c0402j59995Q1510B0665M78758g0206
$$ 100672 143214 -131820 82211 -73871 -108206 -30402 -190397 -108887 20665 499423 -70206
11360a04765A57350i4766G4075d6455k68570d1201A92055a3542m2748B4247L44839
$$ -104765 157350 -94766 74075 -46455 -315025 -41201 192055 -13542 -56290 24247 369086
11349C69086a49709B6039L04850a47851e4874A05339c8174r4074j71061d2651
$$ 369086 -149709 26039 330889 -147851 -54874 105339 -38174 -132248 -303309 -42651
11338a55236c7860j23389j02615G7843e31365J79118B17517b8661A20359d29033
$$ -155236 -37860 -161249 -263864 77843 -531365 -352247 217517 -28661 120359 -429033
11327A71455E9001a26353e9511A69503d2127B5750O3985B4398M3575N4728L6169
$$ 171455 59001 -126353 -59511 169503 -42127 25750 89735 24398 67973 122701 158870
11316A58870I331L07037b77966F7100J21319j5176f6909B74528H973h1741L6894
$$ 158870 9331 316368 -277966 67100 188419 173243 -66909 274528 8973 -81741 -44847
11305d4847j56731i7889J9925A02295R1766c62604a8669E2889a08935M4632E2361
$$ -44847 -201578 -97889 -77964 102295 194061 -362604 -18669 52889 -108935 -64303 52361
11293c90397a35625k67630L1637H0624a68650B44577q9558J04480I8051h0634
$$ -390397 -135625 -403255 -371618 80624 -168650 244577 155019 259499 98051 -80634
11282a98163P712A82708c11029O8556c6421C7842P3254J33611A3540P5083e0998
$$ -198163 -190451 182708 -311029 -242473 -36421 37842 111096 244707 13540 88623 -50998
11270a46519A256g7960N183c1214H7497c73930A35938Q2970a98629k690R5650
$$ -146519 1256 -77960 -72777 -31214 87497 -373930 135938 218908 -198629 -201319 -105669
11259a05669C02851D9613O1804f6800D8150b63636H1575b81434b9217A68692e3448
$$ -105669 302851 49613 111417 -66800 48150 -263636 81575 -281434 -29217 168692 -53448
11247b92318A4392c29005a43228j19334j93050A71267d49877a86961N8998k27301
$$ -292318 14392 -329005 -143228 -262562 -455612 171267 -449877 -186961 -127963 -355264
11237c55264A13233g4255B6263i1529I8469a295m7849n4097k27570E979a67657
$$ -355264 113233 -74255 26263 -91529 98469 -1295 -49144 -103241 -330811 5979 -167657
11225c52520B32448b44331E4537b48716i0842M4399A08687b85448a01493g23j66227
$$ -352520 232448 -244331 54537 -248716 -90842 -46443 108687 -285448 -101493 -723 -166950
11214a66950C26707b58461H112K34317b44168b5845j66979A76356b73785B43187
$$ -166950 326707 -258461 8112 242429 -244168 -25845 -192824 176356 -273785 243187
11203F8876J12299b5098j85390A64534B1283L30065f4628n0744A96049H7501Q5317
$$ 68876 181175 -25098 -210488 164534 21283 351348 -64628 -115372 196049 87501 172818
11192A72818a35365L4101G6136O6551n5659J15696J15303g3030D5788J17892a29907
$$ 172818 -135365 -101264 76136 142687 87028 202724 318027 -73030 45788 163680 -129907
11180a28305j0241k5013A3770b27339a04850d8066k3351l1899A45027K9012L8636
$$ -128305 -138546 -163559 13770 -227339 -104850 -48066 -71417 -103316 145027 174039 212675
11169B12675C0496a36818j5987b1348C9045L22012j75300F0816d87826B95313
$$ 212675 30496 -136818 -152805 -21348 39045 361057 185757 60816 -487826 295313
11158I6162J78917A23968b01897P4934j42738J23972E087b45597a08874A09559
$$ 96162 275079 123968 -201897 -126963 -269701 -145729 5087 -245597 -108874 109559
11147A11458a05600j95281e6894J2340A0764N0403J05603h4486A89600K96838
$$ 111458 -105600 -300881 -56894 -44554 10764 61167 166770 -84486 189600 486438
11137D86438A30167a30329j20234d8103p857a1428q1918d3895Q757j76603A29643
$$ 486438 130167 -130329 -250563 -48103 -55960 -11428 -93346 -43895 -35138 -211741 129643
11125B53340D3949e2721j42739B56854a75213g811B91273a07297A39742K13710
$$ 253340 43949 -52721 -195460 256854 -175213 -7811 291273 -107297 139742 353452
11115C53452e4051A91672J26504A11546m0395d1200D3738b34858B39451b5286
$$ 353452 -54051 191672 318176 111546 71151 -41200 43738 -234858 239451 -25286
11104b0777E4848e5840A7476J82180b53398A53592i0699r3813k0570E76308c419
$$ -20777 54848 -55840 17476 199656 -253398 153592 -90699 -184512 -205082 576308 -3419
11092A37391a33634N4724I6377l4637j7914M47894A5398J11268a66826B58904
$$ 137391 -133634 -78910 96377 61740 43826 491720 15398 126666 -166826 258904
11081a20692K9658D5067L6197h1200D92768f2671A79091G0887d4965j15049A03114
$$ -120692 -91034 45067 81264 -81200 492768 -62671 179091 70887 -44965 -160014 103114
11069B05425A0901M0464J23848J15119A33987J39567D8029P3157J70801j5431
$$ 205425 10901 51365 175213 290332 133987 273554 48029 121186 291987 276556
11059B76556b6159D70224k5845j02839j59745R1085C6906L76998K4878j38425
$$ 276556 -26159 470224 444379 341540 181795 272880 36906 413904 438782 300357
11049C00357R7775o6624D5093O19820d6960D35871J98194k81386L83238p1684
$$ 300357 398132 331508 45093 664913 -46960 435871 634065 352679 735917 664233
11039F64233k60506R5420j27717n7148O2433L6119l7644K93997k58459N14741
$$ 664233 403727 499147 371430 314282 376715 412834 375190 669187 410728 925469
11029I25469m15691K41943M4852j84740o391K01619k87047L1676K0035B63881
$$ 925469 509778 751721 796573 611833 605442 807061 520014 551690 571725 263881
11018F06349j52787J16883j38402K00555A30695M31883N7262K0720j75140K3087
$$ 606349 453562 570445 432043 632598 130695 562578 619840 640560 465420 488507
11008D88507R0091r1772j05795M5200j30991J62085B27358J30476k6989R6789
$$ 488507 578598 486826 381031 426231 295240 457325 227358 357834 330845 427634
10998D27634J97192j66799A01559J94980L61773K142r8446p8192K76430k01848
$$ 427634 624826 458027 101559 296539 658312 660454 562008 483816 760246 558398
10988E58398k43102L68146C02338K47423m1963o4865j59746M77857k40654J00916
$$ 558398 315296 683442 302338 549761 507798 442933 283187 761044 520390 621306
10978F21306J66308C62752L47452l46042M65049l10388M5896J77421J15457j08873
$$ 621306 787614 362752 710204 364162 829211 518823 564719 742140 857597 748724
10968G48724J44083o3356L29437k07197R4733L89876R6754J74225k45372P50212
$$ 748724 892807 829451 1158888 951691 1046424 1436300 1533054 1707279 1461907 2212119
10958B212119J05138n1061K97909n74018J57426p8352m88073n0070l95187j05598
$$ 2212119 2317257 2266196 2564105 1990087 2147513 2069161 1581088 1531018 1135831 1030233
10948A030233L22447m42303j0906l48576O9766K16662j47098r6567j48389Q0926
$$ 1030233 1352680 910377 899471 550895 620661 837323 690225 593658 445269 526195
10938E26195o2016p7573A22512J30761J47388j20029j36405n5338K22909a6655
$$ 526195 464179 386606 122512 253273 400661 280632 144227 88889 311798 -16655
10927h6456E8632g250j30620L9783G071J08836C5615g5260B11151A04312G281
$$ -86456 58632 -7250 -137870 -98087 7071 115907 35615 -75260 211151 104312 7281
10915H7243a07903G2562q109P8535K06751A51174b25012Q2662j3733B48867d0877
$$ 87243 -107903 72562 64453 142988 349739 151174 -225012 -142350 -156083 248867 -40877
10903G6758K24660H5213i9162B89097B1879a99345a9522A00976f635B7348d0820
$$ 76758 301418 85213 -99162 289097 21879 -199345 -19522 100976 -6635 27348 -40820
10891A44495f3315B48898A619h2203G6896D919J6492N8622c00888a25275C4680
$$ 144495 -63315 248898 1619 -82203 76896 4919 21411 80033 -300888 -125275 34680
10879b05687o1325j43603J11373d9068k47892d2592E078P5510f7406A87411k2636
$$ -205687 -267012 -410615 -299242 -49068 -296960 -42592 5078 80588 -67406 187411 164775
10868A64775b50313b5711B01889H8776N5856a0478j51156P316n4713C60M10471
$$ 164775 -250313 -25711 201889 88776 144632 -10478 -161634 -154318 -209031 360 410831
10857D10831b30947g7784r5866r8866B0847J13895n2947L9740d6459l3982L7752
$$ 410831 -230947 -77784 -173650 -272516 20847 134742 81795 121535 -46459 -80441 -42689
10846d2689A10667f6159b1468k05166A11310P0831b92183F8721K283l209a43631
$$ -42689 110667 -66159 -21468 -226634 111310 182141 -292183 68721 71004 67795 -143631
10834B73782l7592A09296d0915j97742A7658b23563F4296K100R4519j6664a24110
$$ 273782 236190 109296 -40915 -238657 17658 -223563 64296 66396 160915 144251 -124110
10822A68333A5322h5198A46408a41554B1764e4882j25247h9759m2556B5588c34870
$$ 168333 15322 -85198 146408 -141554 21764 -54882 -180129 -89759 -132315 25588 -334870
10810d03458B84338b15756A5969a34068b9147k29843a2704j58147D3440J04077
$$ -403458 284338 -215756 15969 -134068 -29147 -258990 -12704 -170851 43440 147517
10800A47517a8123a031A78385E0371c19700F1135k2133b49214h8894n2257O6502
$$ 147517 -18123 -1031 178385 50371 -319700 61135 39002 -249214 -88894 -141151 -74649
10789g4649D6165a43694G8481d0549k88141d4022a6760C30660a18327c0975B56017
$$ -74649 46165 -143694 78481 -40549 -328690 -44022 -16760 330660 -118327 -30975 256017
10777A205a67740k8930A90831i8020j43614C13558b11390C8303L25690b4918n056
$$ 1205 -167740 -196670 190831 -98020 -241634 313558 -211390 38303 363993 -24918 -29974
10766b9974B80589b5992G5996J36569a35093j03034h8023G7361a46651A65256
$$ -29974 280589 -25992 75996 212565 -135093 -238127 -88023 77361 -146651 165256
10755B23195a23830l2350j2307C43961b43650g1998B7283e2499C2334J27397b2580
$$ 223195 -123830 -156180 -168487 343961 -243650 -71998 27283 -52499 32334 159731 -22580
10743d1959j75599n4359Q7272O0564a102G9606J9538M6034N3037H0752b44491
$$ -41959 -217558 -271917 -184645 -124081 -1102 79606 99144 145178 198215 80752 -244491
10731b21225B28237h0083C62676H7133i4628a0009E1575g0951B72622a12489l0573
$$ -221225 228237 -80083 362676 87133 -94628 -10009 51575 -70951 272622 -112489 -143062
10720a43062L9542j57443A3295a58930C5023a25426B08950e6960G3472k0915c53163
$$ -143062 -103520 -260963 13295 -158930 35023 -125426 208950 -56960 73472 52557 -353163
10708C949g046r510l35055a49085B94147b83502L3309D8759b50695p400H8650
$$ 3949 -7046 -16556 -351611 -149085 294147 -283502 -250193 48759 -250695 -258095 88650
10696i2861b392A73404c8291k58716d1320m03739B55424F7791a71496P3889L5305
$$ -92861 -2392 173404 -38291 -297007 -41320 -445059 255424 67791 -171496 -97607 -62302
10685f2302C0201f7174a6273G0544N3133a72057e0044p880B2148J0865b9153G922
$$ -62302 30201 -67174 -16273 70544 123677 -172057 -50044 -57924 22148 33013 -29153 7922
10672B93149a80714h2044M421C1393b02533h0991A24823b67647j63789a27049
$$ 293149 -180714 -82044 -77623 31393 -202533 -80991 124823 -267647 -431436 -127049
10661g1990G5024c77811J62420N4481j99827h792A74923b27963d3681A15274a59458
$$ -71990 75024 -377811 -215391 -160910 -360737 -8792 174923 -227963 -43681 115274 -159458
10649I5342J47578F5206B1858a50948O7956F2259a3238q3480A84191b78454a0719
$$ 95342 242920 65206 21858 -150948 -82992 62259 -13238 -96718 184191 -278454 -10719
10637A45654c8235j14374A29572J24778i3084j07250C9369M5940a33662b4681
$$ 145654 -38235 -152609 129572 254350 -93084 -200334 39369 85309 -133662 -24681
10626B20030p0359C051J66449K65003j97793b35360d5523C76941I3897c48104
$$ 220030 149671 3051 169500 434503 236710 -235360 -45523 376941 93897 -348104
10615f402l29742f726C39567i0171l29729d5471A69857q1166b7437r5110H5896
$$ -6402 -336144 -6726 339567 -90171 -419900 -45471 169857 88691 -27437 -122547 85896
10603a46323d0989j27140e4772j03133k37515a91457K6078M3109C6217c45479
$$ -146323 -40989 -168129 -54772 -157905 -395420 -191457 -165379 -122270 36217 -345479
10592E6157J10715b64680k2317A58852c0116k7936n9105D3920Q8650m1053b48527
$$ 56157 166872 -264680 -286997 158852 -30116 -58052 -117157 43920 132570 91517 -248527
10580a62465a4042A09730a80630K1507n1750F9940J30053A6015b1544l20941A7458
$$ -162465 -14042 109730 -180630 -159123 -210873 69940 199993 16015 -21544 -342485 17458
10568A12235a44604O8224B7641a04093o8152p9454H8358b46656j1539E9394l456
$$ 112235 -144604 -76380 27641 -104093 -172245 -251699 88358 -246656 -258195 59394 55938
10557E5938a43041a3164r844D3706Q9127l3355M7203g0483h816A54875a12853
$$ 55938 -143041 -13164 -23008 43706 132833 99478 146681 -70483 -8816 154875 -112853
10545b33136N1674A22565d1298G8858J28842b60594b3158j04548A02701F127g6549
$$ -233136 -181462 122565 -41298 78858 207700 -260594 -23158 -127706 102701 6127 -76549
10533i3569j54806F9086j0303A2384J67272c14920c1317A38873d03141E54433
$$ -93569 -248375 69086 58783 12384 179656 -314920 -31317 138873 -403141 554433
10522a54416n8145j34989e8018j41068B04677a25647A5699A846a01076A09515
$$ -154416 -212561 -347550 -58018 -199086 204677 -125647 15699 1846 -101076 109515
10511b17834b3870D40380a03869D1464J09827A493J08930m3938d30942B30755
$$ -217834 -23870 440380 -103869 41464 151291 1493 110423 66485 -430942 230755
10500C5090L36014b29474K1480G8252e32342J00622e9150B5768k759a47855K0681
$$ 35090 371104 -229474 -207994 78252 -532342 -431720 -59150 25768 23009 -147855 -127174
10489a27174q489p7283i3167k3307f602j40154b592D9751o050d62438a9195B39408
$$ -127174 -135663 -212946 -93167 -116474 -6602 -146756 -2592 49751 43701 -462438 -19195 239408
10476A81806d4335A46244h3560E9300J7722i9290n2877B44882k5526A3835J21816
$$ 181806 -44335 146244 -83560 59300 77022 -99290 -152167 244882 219356 13835 135651
10465A35651E0736b24918C03382b5125p2987p9534C36915a66787A75487b3768
$$ 135651 50736 -224918 303382 -25125 -98112 -177646 336915 -166787 175487 -23768
10454B7638b19508J1396B73383b86629Q2222e8682k8814b6011p9012J4899A72790
$$ 27638 -219508 -208112 273383 -286629 -204407 -58682 -87496 -26011 -105023 -90124 172790
10442b34163a10767A46133C3755b46060J715f6503K214A47564p307b6144b729
$$ -234163 -110767 146133 33755 -246060 -244345 -66503 -64289 147564 140257 -26144 -2729
10430g5105k22276N6427B51905a85438K1424H3842b96295a06995p1740b7291r1663
$$ -75105 -297381 -240954 251905 -185438 -164014 83842 -296295 -106995 -178735 -27291 -118954
10419a18954c3996E6280b91238a18380a1286H8831i598A48427c02484c1618A76774
$$ -118954 -33996 56280 -291238 -118380 -11286 88831 -9598 148427 -302484 -31618 176774
10407H1493a12601K0369J7251k24206A31026e22n6195p8630o1007F8891J08114
$$ 81493 -112601 -92232 -74981 -299187 131026 -522 -56717 -135347 -196354 68891 177005
10396A77005J02671j0354F5024p536g2966g276l20592A18987a61891A42556A3474
$$ 177005 279676 269322 65024 57488 -72966 -7276 -327868 118987 -161891 142556 13474
10384c40054J60330j3233B2571K50687B0324J18271K02151j61444B2305L28055
$$ -340054 -179724 -192957 22571 273258 20324 138595 340746 179302 22305 350360
10374C50360i1604A9307J88356a62834A32334d9727E9822Q932d7689I2202m0228
$$ 350360 -91604 19307 207663 -162834 132334 -49727 59822 68754 -47689 92202 51974
10363E1974H385i5363D85589A66399e343B24120n6709J78835b2099o9412D25247
$$ 51974 8385 -95363 485589 166399 -5343 224120 167411 346246 -22099 -91511 425247
10351A47383J79930Q7294q8412j49131h8693l4482b6326A89022m3206E8942M578
$$ 147383 327313 414607 326195 177064 -88693 -123175 -26326 189022 145816 58942 63520
10340F3520O1327p742Q5912K37588J19627k48269K9015P6813j95641p1862J41773
$$ 63520 124847 117105 203017 440605 560232 311963 340978 417791 222150 150288 292061
10329B92061D4726J51260J53628P335n4001b59594g017j31477I2456N8210m3520
$$ 292061 44726 195986 349614 356949 302948 -259594 -7017 -138494 92456 150666 107146
10318A07146J46810J77225a11262a8401q9598D3994a28449H634K15561m5938D0839
$$ 107146 253956 431181 -111262 -18401 -107999 43994 -128449 8634 224195 178257 40839
10306G4800b17695A52409K49006A69826A4839J24076M7505b24501e9432k53688
$$ 74800 -217695 152409 401415 169826 14839 138915 186420 -224501 -59432 -313120
10296c13120A04991K26279A44254l7690i2514A90845B7335P7903a97676A16K6869
$$ -313120 104991 331270 144254 106564 -92514 190845 27335 105238 -197676 116 26985
10285B6985g4228A36191a24364j49365C5951a30997A25061n8248a85289p0405
$$ 26985 -74228 136191 -124364 -273729 35951 -130997 125061 66813 -185289 -255694
10275b55694a3880D0776L1805b40938r1949K8192H3018a39800m6534J0108B86202
$$ -255694 -13880 40776 72581 -240938 -332887 -304695 83018 -139800 -186334 -176226 286202
10263I6490I866b61359A59747n6512e7660A65867b24923i8545q6968A41945M5170
$$ 96490 9866 -261359 159747 103235 -57660 165867 -224923 -98545 -185513 141945 187115
10252A87115b26050l9819b130k44219B07867c06885a8755q1182I6474l6604K2593
$$ 187115 -226050 -265869 -2130 -246349 207867 -306885 -18755 -99937 96474 59870 82463
10241H2463K19512a9613n3497B4427a5190k0631E8589i7092B9710d4660q7375
$$ 82463 301975 -19613 -73110 24427 -15190 -35821 58589 -97092 29710 -44660 -132035
10230a32035A11969f7418A40227e2712A59156e7503j08622M6040c3176j97559
$$ -132035 111969 -67418 140227 -52712 159156 -57503 -166125 -120085 -33176 -230735
10220b30735a12445d7652j33908G5621c6836p4548K9649J606A32208c18795i8778
$$ -230735 -112445 -47652 -181560 75621 -36836 -111384 -81735 -80129 132208 -318795 -98778
10208a83631g5567L1496H1236c07196L2304i7466k8960o8164h6982D1871a30783
$$ -183631 -75567 -44071 81236 -307196 -274892 -97466 -126426 -194590 -86982 41871 -130783
10196E4270e3278k4748j35089H893g4533k66073J09836c3704C10807q0035D9641
$$ 54270 -53278 -78026 -213115 8893 -74533 -340606 -230770 -33704 310807 230772 49641
10184I9087c26723a35895I5010i0074L8685E772c43778b7681j72308j46701I0925
$$ 99087 -326723 -135895 95010 -90074 -51389 5772 -343778 -27681 -199989 -346690 90925
10172A34050m5722L9601E9893d09026f9286a3651k764k80448H8864A5111a6971
$$ 134050 88328 127929 59893 -409026 -69286 -13651 -16415 -296863 88864 15111 -16971
10160b8578j7478k13691j51922a2498L99k9774k9674e285C7294L856A4574R3808
$$ -28578 -46056 -259747 -411669 -12498 -12099 -41873 -71547 -5285 37294 41150 14574 108382
10148A08382d21829J46343I3176J93737r6121B4746d30350b06402C1096c56175
$$ 108382 -421829 -275486 93176 286913 190792 24746 -430350 -206402 31096 -356175
10137B1929K3664Q2520C3282c27571g0249R105j46371i7734l9305A78685q5136
$$ 21929 45593 128113 33282 -327571 -70249 -61144 -207515 -97734 -137039 178685 93549
10126I3549a35540D5035A6392a64575E6242b93616A5944h7964p1702N3278j61839
$$ 93549 -135540 45035 16392 -164575 56242 -293616 15944 -87964 -159666 -106388 -268227
10115b68227A53831F6070f1640j02899P8279B85747m5927A10567a87077f0315
$$ -268227 153831 66070 -61640 -164539 -86260 285747 239820 110567 -187077 -60315
10104a05784j97315c0520A14497i7750o3151d2507d628A74327q2769J13491a93046
$$ -105784 -303099 -30520 114497 -97750 -160901 -42507 -4628 174327 91558 205049 -193046
10092a05168j61249A93826F2531a65085A55261R8323G0511L004k6525a12406c2109
$$ -105168 -266417 193826 62531 -165085 155261 253584 70511 73515 46990 -112406 -32109
10080f2134A56401a08177p5935j93745B28149a60947k46759F7837d2065q6391
$$ -62134 156401 -108177 -184112 -377857 228149 -160947 -407706 67837 -42065 -128456
10070a28456A06216A3473a6700o9131p8993M2741k2705l4444B67524b91359B01114
$$ -128456 106216 13473 -16700 -85831 -164824 -122083 -144788 -179232 267524 -291359 201114
10058b0250A83581g5675A4223b70540A38488n5742C1116g59C9211h7548D6363
$$ -20250 183581 -75675 14223 -270540 138488 82746 31116 -759 39211 -87548 46363
10046a26020R905j77933o377g0887a105B40554a61988C99540a39426j02961C1098
$$ -126020 -116115 -294048 -300425 -70887 -1105 240554 -161988 399540 -139426 -242387 31098
10034B9694i2067c4041A9330d4025j1173E823a94047j27507A10407E882M5060
$$ 29694 -92067 -34041 19330 -44025 -55198 5823 -194047 -321554 110407 5882 50942
10023E0942c67037G654b64936d6879j7615j3285G695J25222a7964k9831C22335
$$ 50942 -367037 7654 -264936 -46879 -64494 -77779 7695 132917 -17964 -47795 322335
10011b12168B10588H9254M0337a95710C3237J69802b48475B66282E8773K80634
$$ -212168 210588 89254 129591 -195710 33237 203039 -248475 266282 58773 339407
10001C39407a86580k36373J27744B30475J04623a15286C7302a33929j14841O1249
$$ 339407 -186580 -422953 -295209 230475 335098 -115286 37302 -133929 -248770 -187521
9991a87521j9767g695B60733e2519g544j85141B042a55933O6099c5596j12259
$$ -187521 -207288 -7695 260733 -52519 -7544 -192685 2042 -155933 -89834 -35596 -147855
9980a47855j88679a64699A25245h8877k20520K1872A3827a66476k08424f9045
$$ -147855 -336534 -164699 125245 -88877 -309397 -287525 13827 -166476 -374900 -69045
9969a84766E7964k1586d4622j00998F5406c63503H2752K2108A0068b8824j66664
$$ -184766 57964 36378 -44622 -145620 65406 -363503 82752 104860 10068 -28824 -195488
9958a95488d6931j14494j46483f255n0447r9834D1857J54705r7992c29664A97488
$$ -195488 -46931 -161425 -307908 -6255 -56702 -156536 41857 196562 98570 -329664 197488
9946a70955h614j43092j09451H2153a03604j49373a9542B670J10472J7803a81915
$$ -170955 -8614 -151706 -261157 82153 -103604 -252977 -19542 2670 113142 130945 -181915
9934D7761B2976a41841P903K817O2406C80632a64693D8480M5054B4394M4558b55651
$$ 47761 22976 -141841 -133938 -131121 -68715 380632 -164693 48480 93534 24394 68952 -255651
9921d8058C75743F9160i2871q1099O5477E6044d5444n8837l44467b04106I9860
$$ -48058 375743 69160 -92871 -173970 -108493 56044 -45444 -104281 -448748 -204106 99860
9909F0487Q1000b7m2006m0316B0245b54341A39933f6029K5909r0739l59045J06058
$$ 60487 141487 -27 -42033 -82349 20245 -254341 139933 -66029 -40120 -130859 -489904 -383846
9897c83846h9597j61024i0672A05622b51995e242j71129e9158D2077a63011C35001
$$ -383846 -89597 -250621 -90672 105622 -251995 -5242 -176371 -59158 42077 -163011 335001
9885g1476j97595m6549a13016d5289k02128I7838c3680n5644N895c5761J5506
$$ -71476 -269071 -315620 -113016 -45289 -247417 97838 -33680 -89324 -83429 -35761 -20255
9874b0255G589d1162k03537R9581c7907B20152a48931O5820j0468j7128B4576
$$ -20255 7589 -41162 -244699 -145118 -37907 220152 -148931 -83111 -93579 -110707 24576
9862b10458J3731C456f8946k4678j53353q9317f8608j38008E9732J13964b78301
$$ -210458 -196727 3456 -68946 -93624 -246977 -336294 -68608 -206616 59732 173696 -278301
9850e062F8955K45096a82155l06660l8210K31939P5741a4496d69o2410H769R187
$$ -5062 68955 314051 -182155 -488815 -527025 -295086 -219345 -14496 -469 -62879 8769 17956
9838A7956h1736A40285b44750i6339b4067j98218l4790K3567J06329A71483a78566
$$ 17956 -81736 140285 -244750 -96339 -24067 -222285 -257075 -233508 -127179 171483 -178566
9826b1888D3035J44649B509a91339H6304a08634A49599E7545i2954j39717b782
$$ -21888 43035 187684 2509 -191339 86304 -108634 149599 57545 -92954 -232671 -2782
9814a5417m5537p1325j99543A53073c36582g2520j11337m75B57882j00690J2137
$$ -15417 -60954 -132279 -331822 153073 -336582 -72520 -183857 -184332 257882 157192 169329
9803A69329a38920j4637k1976c6807j60219J404Q6794r8369l45531b2240I142
$$ 169329 -138920 -153557 -175533 -36807 -197026 -195622 -108828 -207197 -552728 -22240 9142
9791a54885c2979B10069H7717a03486j73898a7344j09565k28777a25591B45024
$$ -154885 -32979 210069 87717 -103486 -277384 -17344 -126909 -355686 -125591 245024
9780d37700J93894G7162J57906j8130b7334k75772g8197A21554d8252a2538k97546
$$ -437700 -243806 77162 235068 216938 -27334 -303106 -78197 121554 -48252 -12538 -310084
9769c10084F1152a69342f1945k90230b3853k17425B43757d25674F2293K8038N5559
$$ -310084 61152 -169342 -61945 -352175 -23853 -241278 243757 -425674 62293 90331 145890
9758A45890f2735r638j70880h1336B65803a46359n522c4463k21653k5244B00216
$$ 145890 -62735 -72373 -243253 -81336 265803 -146359 -151881 -34463 -256116 -281360 200216
9746a23867k09939b7828j1200k65650A97630c26546J14328P9921j59173E1977
$$ -123867 -333806 -27828 -39028 -304678 197630 -326546 -212218 -132297 -291470 51977
9735b5394A23553O7742a54019o6392D0204K7236b48674A4276K96797D5018c90060
$$ -25394 123553 191295 -154019 -220411 40204 67440 -248674 14276 311073 45018 -390060
9723B5613f0918J4026m04757a31498L5149j76716a550C7346k938i5959B78391
$$ 25613 -60918 -46892 -451649 -131498 -96349 -273065 -1550 37346 34408 -95959 278391
9711i1806B49793A2002a10033j5351e3459r5263J6706M5182k13503k17427E6943
$$ -91806 249793 12002 -110033 -125384 -53459 -148722 -132016 -86834 -300337 -517764 56943
9699C7965b10463b9090B27822a77375m0384M2805P9138c413C9329J9816b88776
$$ 37965 -210463 -29090 227822 -177375 -217759 -174954 -95816 -3413 39329 59145 -288776
9687d85834C76b84818f8647B07320c3317j082a0659p6619j22706B39983c04796
$$ -485834 376 -284818 -68647 207320 -33317 -34399 -10659 -87278 -209984 239983 -304796
9675B09560h1829A09773J3915b81184r1840i7620k29554H1962B7178K13038I7265
$$ 209560 -81829 109773 123688 -281184 -373024 -97620 -327174 81962 27178 240216 97265
9663b88117B29472g6701G5508L00685c34064b0605C5167Q2440b96006a45616e0330
$$ -288117 229472 -76701 75508 376193 -334064 -20605 35167 117607 -296006 -145616 -50330
9651a0307E14749A97315f4137B2835b82632f4617o4708o4334k3666d3515k03229
$$ -10307 514749 197315 -64137 22835 -282632 -64617 -129325 -193659 -217325 -43515 -246744
9640b46744a19058L5391d984j69298Q4430l96450a85818B04898e12683d1539k0121
$$ -246744 -119058 -83667 -4984 -174282 -89852 -486302 -185818 204898 -512683 -41539 -61660
9629f1660B9141K9499J04636a24402C2160N2080P3366K6934a65967A18292h6344
$$ -61660 29141 58640 163276 -124402 32160 84240 157606 184540 -165967 118292 -86344
9617d00389J48311N6958a8139B6595f6955A282O4752N1460e8261o8004b9306q8809
$$ -400389 -252078 -195120 -18139 26595 -66955 1282 66034 117494 -58261 -126265 -29306 -118115
9605a18115a7247j74205P5493k40471A64769c01535e9314o3197J8029j158e2162
$$ -118115 -17247 -191452 -115959 -356430 164769 -301535 -59314 -122511 -104482 -105640 -52162
9593c04514J37398n7988E4004r351b11150Q9132A21474g1570B7711h0107B43977
$$ -304514 -167116 -225104 54004 44653 -211150 -122018 121474 -71570 27711 -80107 243977
9581b16739H7631a85639B15357n4345n4680a5950m78805b07243a3621k19227A49762
$$ -216739 87631 -185639 215357 161012 106332 -15950 -494755 -207243 -13621 -232848 149762
9569b21341c3522k02848j72704A06368b48174j49144P9570L9458a16772N5452
$$ -221341 -33522 -236370 -409074 106368 -248174 -397318 -317748 -278290 -116772 -61320
9559f1320j16616A9789c20042B18969n5865J3919c17629Q0593c8273C6253g2522
$$ -61320 -177936 19789 -320042 218969 163104 177023 -317629 -237036 -38273 36253 -72522
9547D9001c3917l15005e8289B35190H0388h022k38299P6509i567j25872O2180
$$ 49001 -33917 -348922 -58289 235190 80388 -8022 -246321 -169812 -9567 -135439 -73259
9536g3259A21546a76316o9385k3748g3241A00152L26724A86802D2003g2685K186
$$ -73259 121546 -176316 -245701 -269449 -73241 100152 426876 186802 42003 -72685 -70499
9525g0499j1087A23746O5355H1989i5330A91858I4589i0496F29981i5605K0590
$$ -70499 -81586 123746 189101 81989 -95330 191858 94589 -90496 629981 -95605 -75015
9514g5015A35347F0549N4878b91039C3835P5199a07290j82986e8539n49053A19111
$$ -75015 135347 60549 115427 -291039 33835 109034 -107290 -290276 -58539 -607592 119111
9502A01974a70012L7691M7581D7487f122k0821l8183K8234A39000b38549m4484
$$ 101974 -170012 -132321 -84740 47487 -6122 -26943 -65126 -36892 139000 -238549 -283033
9491b83033h8243k74172B15045a70024j7430b1860j71032B26171b58064G632a50690
$$ -283033 -88243 -362415 215045 -170024 -187454 -21860 -192892 226171 -258064 7632 -150690
9479a21841p9795O7872D00588F647a39709K7055j87143A44730a33219R203J2174
$$ -121841 -201636 -133764 400588 6647 -139709 -112654 -299797 144730 -133219 -124016 -111842
9468a11842a5037E2461K1312c19278A28495a05526A69127f0389A10265f5119I7842
$$ -111842 -15037 52461 73773 -319278 128495 -105526 169127 -60389 110265 -65119 97842
9456b66621o8787c4271j71541j68029J76283D4968K78965b6470j20597j01796
$$ -266621 -335408 -34271 -205812 -373841 -197558 44968 323933 -26470 -147067 -248863
9446b48863j49173J80026c7450p1567E4070J77131d25714a59482l9765k68518
$$ -248863 -398036 -218010 -37450 -109017 54070 231201 -425714 -159482 -199247 -467765
9436d67765Q8024k3234H4753R3344a51421j14537O8924a5522A07235a19434d050
$$ -467765 -379741 -402975 84753 178097 -151421 -265958 -197034 -15522 107235 -119434 -4050
9424a07920k83366A90208O0028A5308a01236F9411b57176B61844i7016j62240
$$ -107920 -391286 190208 250236 15308 -101236 69411 -257176 261844 -97016 -259256
9414b59256H5450J01274A9276N1977b05111l2839h0083k07330j5208f0619o3134
$$ -259256 85450 186724 19276 71253 -205111 -237950 -80083 -287413 -302621 -60619 -123753
9403a23753D7033a64281J0618l2374d7508b2455H9779a12247B762K58950c77308
$$ -123753 47033 -164281 -153663 -186037 -47508 -22455 89779 -112247 2762 261712 -377308
9391a88091Q1252F3064j6533b43952f0708F5646Q6140a05802A00444b79709j6907
$$ -188091 -106839 63064 46531 -243952 -60708 65646 151786 -105802 100444 -279709 -296616
9380b96616a8479D6953O511A511c4258l5959A8844a78213J7210e5953a0066j27515
$$ -296616 -18479 46953 53464 1511 -34258 -70217 18844 -178213 -161003 -55953 -10066 -137581
9368a37581H536J68034D917c72509A42089a49975E9858N5061a16045o6867A50949
$$ -137581 8536 176570 4917 -372509 142089 -149975 59858 114919 -116045 -182912 150949
9356C7974d08263a82081A90025H2061J60180o5658a79099j95250J1341a49097
$$ 37974 -408263 -182081 190025 82061 242241 176583 -179099 -374349 -363008 -149097
9345a28141p2344j03045A62414a5386j76505H0337b44447J14306L2769A1764c44611
$$ -128141 -200485 -303530 162414 -15386 -191891 80337 -244447 -130141 -97372 11764 -344611
9333A30615d34822a46758e3626k25526C55973i6411G9985b2744B27199j6377a08319
$$ 130615 -434822 -146758 -53626 -279152 355973 -96411 79985 -22744 227199 210822 -108319
9321B114a09336j59950B40780f1055b4755A10728b06284i8486k30901a26178c7052
$$ 2114 -109336 -269286 240780 -61055 -24755 110728 -206284 -98486 -329387 -126178 -37052
9309E7361R373b15233E8524a2372l6725J5093A14584a28567A76935E2486J01908
$$ 57361 66734 -215233 58524 -12372 -49097 -34004 114584 -128567 176935 52486 154394
9298A54394p1372Q6202J6798d2384A84653q5214g2984j47882G6730b28697i2062
$$ 154394 83022 169224 186022 -42384 184653 99439 -72984 -220866 76730 -228697 -92062
9286A3579L4420a66537P6107b8351j12396O6211j06435e2020D768J82758j2251
$$ 13579 47999 -166537 -90430 -28351 -140747 -74536 -180971 -52020 4768 187526 175275
9275A75275h5172I4257m4873h2561o2872E7078f2721B09580a4239H4019b26833
$$ 175275 -85172 94257 49384 -82561 -145433 57078 -62721 209580 -14239 84019 -226833
9263B22304q511m0368b63990J16243j28892h6578A08821M6135b9938B07475b2191
$$ 222304 213793 173425 -263990 -147747 -276639 -86578 108821 154956 -29938 207475 -22191
9251I7746K63769e69629a90299i0393b4507l390a0323A5137N2424h9345C2386
$$ 97746 361515 -569629 -190299 -90393 -24507 -27897 -10323 15137 67561 -89345 32386
9239a6990j61187J8326A23661D4408i55B05a25546J2034L0810j59808J908l5726
$$ -16990 -178177 -159851 123661 44408 -955 205 -125546 -113512 -82702 -242510 -240602 -276328
9227b76328b7005l09158e7736j1597A48078G60b85619F7436a07871b1064E5315
$$ -276328 -27005 -336163 -57736 -69333 148078 760 -285619 67436 -107871 -21064 55315
9215B1129O9886a43825C8189a06858q3443j7182j2322E7678K5076b92408b0926
$$ 21129 91015 -143825 38189 -106858 -190301 -207483 -219805 57678 82754 -292408 -20926
9203a20410A10014a13925C9149a91678A27368D7402N226M43887B22927A01104
$$ -120410 110014 -113925 39149 -191678 127368 47402 52628 496515 222927 101104
9192G4924a9820j43774I9481h2023k08244l0925J01693a4882B00925b34176o3764
$$ 74924 -19820 -163594 99481 -82023 -290267 -321192 -219499 -14882 200925 -234176 -297940
9181b97940P3768j12380A41507o0113O7299b46950b497o3014k65859E2124b86241
$$ -297940 -224172 -336552 141507 81394 148693 -246950 -2497 -65511 -331370 52124 -286241
9169b15951r9621g9259a4A45764J56445I0065O8137C4932f10482b80496g425k24294
$$ -215951 -315572 -79259 -14 145764 302209 90065 158202 34932 -610482 -280496 -7425 -231719
9157b31719M3433g0185k27294B48761B4164K9663a11959C37448b26906J05727
$$ -231719 -188286 -70185 -297479 248761 24164 53827 -111959 337448 -226906 -121179
9147a21179j11167B52086I4862l5856K28853E2166J4542b6439A56941b22814a9091
$$ -121179 -232346 252086 94862 59006 287859 52166 66708 -26439 156941 -222814 -19091
9135A63762c35091B01959B2258b24746Q5514M1766p6605j99930A71566c1384K705
$$ 163762 -335091 201959 22258 -224746 -139232 -97466 -174071 -374001 171566 -31384 -28679
9124b8679B42713G9051R7526a70356E8032B4360L0580a59276g2135r8262A07170
$$ -28679 242713 79051 176577 -170356 58032 24360 54940 -159276 -72135 -170397 107170
9112A83877d4296J1534j15232l4342N4858j2382j60111N1404A11439c52539a31908
$$ 183877 -44296 -32762 -147994 -182336 -127478 -139860 -299971 -248567 111439 -352539 -131908
9100D0131c69060B67803G1878K6651a06827Q49j59153A76811a42931q608g0367
$$ 40131 -369060 267803 71878 98529 -106827 -105978 -265131 176811 -142931 -151539 -70367
9088c30459g1974I8729a99315O6166E9788c11689A18891P697M6861a70927Q4286
$$ -330459 -71974 98729 -199315 -133149 59788 -311689 118891 126588 173449 -170927 -86641
9077h6641I8124J20672d31076a42298A0410c9323k59451D3002c25521a27367F3816
$$ -86641 98124 218796 -431076 -142298 10410 -39323 -298774 43002 -325521 -127367 63816
9065a67414H2800d19959a3534b600l39456J69655D891i3611m7490o9256b8461
$$ -167414 82800 -419959 -13534 -2600 -342056 -172401 4891 -93611 -141101 -210357 -28461
9053a16727k6196l86921A68250a12736l62114b14540C1581L06953b01092r0546
$$ -116727 -142923 -529844 168250 -112736 -474850 -214540 31581 338534 -201092 -291638
9043b91638J41629J2843e121A7038P7355D7117c1957l3108l23610a06683a1519
$$ -291638 -150009 -137166 -5121 17038 94393 47117 -31957 -65065 -388675 -106683 -11519
9031D60683a76919b5076A69478d2382j30824A4080K81307d2324p7751k3849B83820
$$ 460683 -176919 -25076 169478 -42382 -173206 14080 295387 -42324 -120075 -143924 283820
9019D6961a91829k92172A82769a2649D1749a17422k50309a18266j1632G5036a63071
$$ 46961 -191829 -484001 182769 -12649 41749 -117422 -367731 -118266 -129898 75036 -163071
9007e0452m3204B07837a72158G0236f3031O809b3003A4278M061R7646J0900f589
$$ -50452 -93656 207837 -172158 70236 -63031 -56222 -23003 14278 18339 115985 126885 -6589
8994B00261N230b8204A18862b74027B92262j25761Q4367A02813B9185O6150j2450
$$ 200261 205491 -28204 118862 -274027 292262 166501 250868 102813 29185 95335 82885
8983H2885a14357J007b3426l52569A11349J20487C209R5562a65312A99593B704
$$ 82885 -114357 -113350 -23426 -375995 111349 231836 3209 98771 -165312 199593 2704
8971C954b95188B03507b9586G0636B4726J7156L6023k757a60040M0172A17789
$$ 3954 -295188 203507 -29586 70636 24726 41882 77905 75148 -160040 -119868 117789
8959a39519j11589i651A19103b25445A60987K3578B4661J15304b31508H5490g543
$$ -139519 -251108 -9651 119103 -225445 160987 184565 24661 139965 -231508 85490 -7543
8947A08507d14313J85778Q1402q8540P6064P7806D0060R1254b4431j49633C2513
$$ 108507 -414313 -228535 -147133 -235673 -159609 -81803 40060 131314 -24431 -174064 32513
8935D7266M3085P7518h3682j99711a04795j56057b3140C60763E6095f273j47781
$$ 47266 90351 167869 -83682 -283393 -104795 -260852 -23140 360763 56095 -6273 -154054
8924a54054B60639b36123A5317J75689D3686J61049A2830P5089N646R0644N3073
$$ -154054 260639 -236123 15317 191006 43686 204735 12830 87919 93565 184209 237282
8913B37282A09409J56663J54695J57560M37786P89995J503090L958972j942758
$$ 237282 109409 266072 420767 578327 1016113 1806108 3309198 7268170 5325412
8904E325412k599550j309039m36216C51666J37645j31403j74986J5516n3267j6667
$$ 5325412 2725862 1416823 980607 351666 489311 357908 182922 198438 145171 128504
8894A28504d2152D2828K20174M9587a29651H7935a94817Q1730A06737a21956k26630
$$ 128504 -42152 42828 263002 312589 -129651 87935 -194817 -113087 106737 -121956 -348586
8883c48586B2496a61719b8792A18346J283a73772d6803J2579A30947e5573k15614
$$ -348586 22496 -161719 -28792 118346 119629 -173772 -46803 -34224 130947 -55573 -271187
8872b71187Q661a6112L672r0306h843j61124M7429K8422O201D52567e83m4628
$$ -271187 -262526 -16112 -12440 -102746 -8843 -169967 -122538 -94116 -87915 452567 -583 -45211
8860d5211E1337a16955m6386j90947f2556a7676j78261n4051A64058B7412a71000
$$ -45211 51337 -116955 -163341 -354288 -62556 -17676 -195937 -249988 164058 27412 -171000
8848b79319L4338M2177d4488j62215R5925D82347a26431n0388m9342E6311J12205
$$ -279319 -244981 -202804 -44488 -206703 -110778 482347 -126431 -176819 -226161 56311 168516
$$ [...]
##END NTUPLES=NMR SPECTRUM
##END=
