
##TITLE=AC1106_ROVE100D_5868126_5qzzNgtZPV
##JCAMPDX= 6.0         $$ Bruker NMR JCAMP-DX V2.0
##DATA TYPE= NMR SPECTRUM
##DATA CLASS= NTUPLES
##ORIGIN= BRUKER
##OWNER= Administrator
$$ 1.72 TOPSPIN		Version 2.1
$$ 2012-03-31 01:13:20.687 -0500  Administrator@TOPSPIN
$$ Compression mode = diff/dup
##.OBSERVE FREQUENCY= 400.13188235
##.OBSERVE NUCLEUS= ^1H
##.ACQUISITION MODE= SIMULTANEOUS (DQD)
##.ACQUISITION SCHEME= undefined
##.AVERAGES= 64
##.DIGITISER RES= 22
##SPECTROMETER/DATA SYSTEM= spect
##.PULSE SEQUENCE= noesygpps1d.comp
##.SOLVENT NAME= COFFEE_meoh
##.SHIFT REFERENCE= INTERNAL, COFFEE_meoh, 1, 14.96671
##AUDIT TRAIL= $$ (NUMBER, WHEN, WHO, WHERE, PROCESS, VERSION, WHAT)
$$ ##TITLE= Audit trail, TOPSPIN		Version 2.1
$$ ##JCAMPDX= 5.01
$$ ##ORIGIN= Bruker BioSpin GmbH
$$ ##OWNER= Administrator
$$ $$ C:\Bruker\TOPSPIN/data/COFFEE/nmr/AC1106_ROVE100D_5868126_5qzzNgtZPV/12/pdata/1/auditp.txt
$$ ##AUDIT TRAIL=  $$ (NUMBER, WHEN, WHO, WHERE, PROCESS, VERSION, WHAT)
(   1,<2012-03-31 01:13:15.984 -0500>,<Administrator>,<TOPSPIN>,<go>,<TOPSPIN 2.1>,
      <created by zg
	started at 2012-03-31 01:01:44.437 -0500,
	POWCHK enabled, PULCHK disabled,
       configuration hash MD5:
       1A 1E CE 29 27 FD 77 03 67 4E F0 E3 C4 B2 CB 90
       data hash MD5: 64K
       25 EF A6 2E D8 A1 75 FB 59 2F 49 EF 28 C0 83 0F>)
(   2,<2012-03-31 01:13:18.734 -0500>,<Administrator>,<TOPSPIN>,<proc1d>,<TOPSPIN 2.1>,
      <Start of raw data processing
       efp LB = 0.3 FT_mod = 6 PKNL = 1 PHC0 = 0 PHC1 = 0 SI = 128K 
       data hash MD5: 128K
       1D 1F D1 5E C2 56 78 5A 08 44 45 EB 43 4B FB 97>)
(   3,<2012-03-31 01:13:19.906 -0500>,<Administrator>,<TOPSPIN>,<proc1d>,<TOPSPIN 2.1>,
      <pk PHC0 = 30.6958 PHC1 = 0 
       data hash MD5: 128K
       6F 58 39 21 E8 72 DC E4 6A 7B E3 9B 23 A3 C9 BA>)
(   4,<2012-03-31 01:13:20.140 -0500>,<Administrator>,<TOPSPIN>,<proc1d>,<TOPSPIN 2.1>,
      <abs ABSG = 1 
       data hash MD5: 128K
       FA 53 05 63 49 DC 76 BE 93 2B BC 07 5D 4D 3F F2>)
(   5,<2012-03-31 01:13:20.218 -0500>,<Administrator>,<TOPSPIN>,<proc1d>,<TOPSPIN 2.1>,
      <abs ABSG = 2 
       data hash MD5: 128K
       BC 09 98 C4 11 30 0B C4 EF 75 62 43 10 E9 1E B2>)
(   6,<2012-03-31 01:13:20.281 -0500>,<Administrator>,<TOPSPIN>,<proc1d>,<TOPSPIN 2.1>,
      <abs ABSG = 3 
       data hash MD5: 128K
       21 31 2F 1A 62 3D 42 5D D5 7D 07 57 CF B2 ED B3>)
(   7,<2012-03-31 01:13:20.531 -0500>,<Administrator>,<TOPSPIN>,<proc1d>,<TOPSPIN 2.1>,
      <abs ABSG = 4 
       data hash MD5: 128K
       A7 3F 92 60 D2 85 7F 1F 09 7D 19 79 4D 4B 1D 28>)
(   8,<2012-03-31 01:13:20.593 -0500>,<Administrator>,<TOPSPIN>,<proc1d>,<TOPSPIN 2.1>,
      <abs ABSG = 5 
       data hash MD5: 128K
       F0 AA 99 30 84 69 A6 B5 F8 C1 27 CB 1C 97 8E DA>)
$$ ##END=
$$ 
$$ $$ hash MD5
$$ $$ DC 83 4B 70 CE 57 17 13 26 BD 19 57 D0 46 1F 8B
##$RELAX= 
##$RELAX= 
##$RELAX= 
##$RELAX= 
##$RELAX= 
##$RELAX= 
##$RELAX= 
##$RELAX= 
$$ Bruker specific parameters
$$ [...]
##$TP07= 0
##$TPNAME0= <>
##$TPNAME1= <>
##$TPNAME2= <>
##$TPNAME3= <>
##$TPNAME4= <>
##$TPNAME5= <>
##$TPNAME6= <>
##$TPNAME7= <>
##$TPOAL= (0..7)
0.5 0.5 0.5 0.5 0.5 0.5 0.5 0.5
##$TPOFFS= (0..7)
0 0 0 0 0 0 0 0
##$TUNHIN= 0
##$TUNHOUT= 0
##$TUNXOUT= 0
##$USERA1= <user>
##$USERA2= <user>
##$USERA3= <user>
##$USERA4= <user>
##$USERA5= <user>
##$V9= 5
##$VALIST= <valist>
##$VCLIST= <CCCCCCCCCCCCCCC>
##$VD= 0
##$VDLIST= <DDDDDDDDDDDDDDD>
##$VPLIST= <PPPPPPPPPPPPPPP>
##$VTLIST= <TTTTTTTTTTTTTTT>
##$WBST= 2048
##$WBSW= 25
##$XGAIN= (0..3)
0 0 0 0
##$XL= 0
##$YL= 0
##$YMAX_a= 8732602
##$YMIN_a= -5145210
##$ZGOPTNS= <>
##$ZL1= 120
##$ZL2= 120
##$ZL3= 120
##$ZL4= 120
##$ABSF1= 14.96671
##$ABSF2= -5.58582
##$ABSG= 5
##$ABSL= 3
##$ALPHA= 0
##$AQORDER= 0
##$ASSFAC= 0
##$ASSFACI= 0
##$ASSFACX= 0
##$ASSWID= 0
##$AUNMP= <proc_prof1d_extract.lims>
##$AXLEFT= 0
##$AXNAME= <>
##$AXNUC= <1H>
##$AXRIGHT= 0
##$AXTYPE= 0
##$AXUNIT= <>
##$AZFE= 0.1
##$AZFW= 0.1
##$BCFW= 0
##$BC_mod= 0
##$BYTORDP= 0
##$COROFFS= 0
##$CY= 15
##$DATMOD= 1
##$DC= 0
##$DFILT= <>
##$DTYPP= 0
##$F1P= 0
##$F2P= 0
##$FCOR= 0.5
##$FTSIZE= 131072
##$FT_mod= 6
##$GAMMA= 0
##$GB= 0
##$INTBC= 1
##$INTSCL= 1
##$ISEN= 128
##$LB= 0.3
##$LEV0= 0
##$LPBIN= 0
##$MAXI= 10000
##$MC2= 0
##$MEAN= 0
##$ME_mod= 0
##$MI= 0
##$NCOEF= 0
##$NC_proc= -3
##$NLEV= 6
##$NOISF1= 0
##$NOISF2= 0
##$NSP= 0
##$NTH_PI= 0
##$NZP= 0
##$OFFSET= 14.96671
##$PC= 1
##$PHC0= 30.6958
##$PHC1= 0
##$PH_mod= 1
##$PKNL= yes
##$PPARMOD= 0
##$PPDIAG= 0
##$PPIPTYP= 0
##$PPMPNUM= 2147483647
##$PPRESOL= 1
##$PSCAL= 4
##$PSIGN= 0
##$PYNMP= <proc.py>
##$REVERSE= no
##$SF= 400.130005561587
##$SI= 131072
##$SIGF1= 0
##$SIGF2= 0
##$SINO= 400
##$SIOLD= 131072
##$SPECTYP= <>
##$SREGLST= <1H.CDCl3>
##$SSB= 0
##$STSI= 131072
##$STSR= 0
##$SW_p= 8223.68421052632
##$SYMM= 0
##$S_DEV= 0
##$TDeff= 65536
##$TDoff= 0
##$TI= <>
##$TILT= no
##$TM1= 0
##$TM2= 0
##$TOPLEV= 0
##$USERP1= <user>
##$USERP2= <user>
##$USERP3= <user>
##$USERP4= <user>
##$USERP5= <user>
##$WDW= 1
##$XDIM= 131072
##$YMAX_p= 446152001
##$YMIN_p= -148542802
##$CURPLOT= <Network HP LaserJet P1505>
##$CURPRIN= <$Network HP LaserJet P1505>
##$DFORMAT= <normdp>
##$LAYOUT= <+/1D_H.xwp>
##$LFORMAT= <normlp>
##$PFORMAT= <normpl>
##$SURQMSG= 1
$$ End of Bruker specific parameters
$$ ---------------------------------
##NTUPLES= NMR SPECTRUM
##VAR_NAME=  FREQUENCY,     SPECTRUM/REAL,   SPECTRUM/IMAG
##SYMBOL=    X,             R,               I
##VAR_TYPE=  INDEPENDENT,   DEPENDENT,       DEPENDENT
##VAR_FORM=  AFFN,          ASDF,            ASDF
##VAR_DIM=   131072,        131072,          131072
##UNITS=     HZ,            ARBITRARY UNITS, ARBITRARY UNITS
##FACTOR=    0.0627417313425165, 1,          1
##FIRST=     8223.62146879498, 1717,         -86331
##LAST=      0,             5241,            -86008
##MIN=       0,             -148542802,      0
##MAX=       8223.62146879498, 446152001,    0
$$ Real data points
##PAGE= N=1
##DATA TABLE= (X++(R..R)), XYDATA
$$ [...]
63777H27774k5592k6851k7518k7394k6789k5625k3597k1151j9439j9132j9684
63766E65002j9926j9013j6920j4408j2511j1651j1202j0240q805q014q694j0297
63754D13321j1469j1435j0485r216p820o358n269n090n595n670m366k034j17K42
63740C28639p75k102l030l660m185m226l328j894j034j357k345l077l165k743
63726B91718k025j262q85j116j675k141k454k680k626k132j458r32m31K16O75
63711B70792N77K46K23L84L20K71O91J135P91P2L38J725K624J822J01j003j015
63694B80094m29L36J035J336J145Q33P30Q84J445K419K937K015L69N3J579K902
63678B99683K239M97l73N7J213L194N921P718P038N079M413N286N550M316L321
$$ y = [827774, 802182, 775331, 747813, 720419, 693630, 668005, 644408, 623257, 603818, 584686, 565002, 545076, 526063, 509143, 494735, 482224, 470573, 459371, 449131, 440326, 432312, 423618, 413321, 401852, 390417, 379932, 370716, 362896, 356538, 351269, 346179, 340584, 334914, 330548, 328514, 328397, 328639, 327864, 325762, 322732, 319072, 314887, 310661, 307333, 305439, 304405, 303048, 300703, 297626, 294461, 291718, 289693, 288431, 287546, 286430, 284755, 282614, 280160, 277480, 274854, 272722, 271264, 270332, 269901, 270117, 270792, 271369, 271615, 271838, 272222, 272542, 272813, 273504, 274639, 275430, 275502, 275840, 277565, 280189, 282011, 282112, 281109, 280094, 279665, 280001, 281036, 282372, 283517, 284350, 285080, 285964, 287409, 289828, 292765, 294780, 295149, 295202, 296781, 299683, 301922, 302419, 302046, 302103, 303316, 306510, 312431, 320149, 327187, 332266, 336679, 341965, 347515, 351831, 355152]
63663C55152M054N576O159N541M667M296M638N302N092L058J71j331q26j65r36
63648D00448k331k782k356k179k474k591k401k308k228j771j104o25j4J300K863
63633C79447L444K603J247M40M00P19R92J034R21J008J597K593L599M269M340
63618D08653L577K053L51q50j236p87M88K376M319N844O924P573P335N696K961
63603D55277L81p82k70R25J366N16o72q67j00J70j105l349n236o062n758m277
63587D30157j873M96J888K348K509K569K376K259K872M213N561O436P000P476
63573D76287P910Q556R809J1515J2989J3920J4696J5640J6493J6967J7382J8372
63561F40536K0163K2412K4582K6462K8403L0916L3824L6068L6947L7339L8962
$$ y = [355152, 359206, 364782, 370941, 376482, 381149, 385445, 390083, 395385, 400477, 403535, 403706, 402375, 401549, 401384, 400448, 398117, 395335, 392979, 390800, 388326, 385735, 383334, 381026, 378798, 377027, 375923, 375298, 375284, 376584, 379447, 382891, 385494, 386741, 387181, 387581, 388300, 389292, 390326, 391247, 392255, 393852, 396445, 400044, 404313, 408653, 412230, 414283, 414634, 413784, 412548, 411761, 412249, 414625, 418944, 424788, 431712, 439285, 446620, 452316, 455277, 455658, 454876, 454606, 455531, 456897, 457413, 456741, 455874, 455774, 455944, 454839, 451490, 446254, 440192, 434434, 430157, 428284, 428780, 430668, 433016, 435525, 438094, 440470, 442729, 445601, 449814, 455375, 461811, 468811, 476287, 484197, 492753, 502562, 514077, 527066, 540986, 555682, 571322, 587815, 604782, 622164, 640536, 660699, 683111, 707693, 734155, 762558, 793474, 827298, 863366, 900313, 937652, 976614]
63550I76614M2311M6075M8681M9837N0230N0369N0064M8556M4886L8642L0639
63539A476904K2405J4796P728J305l737p125r662j2020j3842j4915j6368j9503
63527A425966k3879k7838l0594l2618l4105l4466l3482l1711k9403k6202k2277
63516A099391j8712j6194j4242j2249j0426r084p817o040l642o25L008O443Q281
63503A018092Q594R655J3307J8271K1496K1781K0760K0655K2505K6220L0774L4293
63491A266403L5593L5870L7418M0554M3447M5302M7577N0986N3236N1353M5032
63480A752771L6075K5698J4387L642m438r501j3145j6432j8791j9815k0598k2457
63468A707396k5330k8416l1522l4836l7930m0154m1778m3695m5846m6817m5532
$$ y = [976614, 1018925, 1065000, 1113681, 1163518, 1213748, 1264117, 1314181, 1362737, 1407623, 1446265, 1476904, 1499309, 1514105, 1521833, 1523138, 1519401, 1512276, 1502614, 1490594, 1476752, 1461837, 1445469, 1425966, 1402087, 1374249, 1343655, 1311037, 1276932, 1242466, 1208984, 1177273, 1147870, 1121668, 1099391, 1080679, 1064485, 1050243, 1037994, 1027568, 1018484, 1010667, 1004627, 1000985, 1000360, 1003368, 1009811, 1018092, 1026686, 1036341, 1049648, 1067919, 1089415, 1111196, 1131956, 1152611, 1175116, 1201336, 1232110, 1266403, 1301996, 1337866, 1375284, 1415838, 1459285, 1504587, 1552164, 1603150, 1656386, 1707739, 1752771, 1788846, 1814544, 1828931, 1832573, 1828135, 1818634, 1805489, 1789057, 1770266, 1750451, 1729853, 1707396, 1682066, 1653650, 1622128, 1587292, 1549362, 1509208, 1467430, 1423735, 1377889, 1331072, 1285540]
63457A285540m2798m0527l9584l9047l7612l5044l1922k8620k5294k2500k0864
63446I21728k0110j9296j8170j7369j7049j6329j4608j2475j0677r122p749p293
63434G51481q102r035q965q661r457j0567r747o703l832k944l065k446j220o40
63420F66097q51q92l65K54P17J280J891K004J316J05j225k437l406m126m627m673
63404F51062l940k847k636l948n734o332n321l529j599L96K098K826K739K981
63390F26216M078N084N080M817N953Q888J2281J4660J5764J6208J6611J7435J9144
63377G72219K1981K5746L0073L4718L9262M2809M4468M4119M2352L9759L6645
63366A174151L3325L0220K7681K6207K6754L0109L5651M1409M5751M8618N0899
$$ y = [1285540, 1242742, 1202215, 1162631, 1123584, 1085972, 1050928, 1019006, 990386, 965092, 942592, 921728, 901618, 882322, 864152, 846783, 829734, 813405, 798797, 786322, 775645, 766523, 758774, 751481, 743379, 734344, 725379, 716718, 707261, 696694, 686947, 680244, 676412, 673468, 670403, 667957, 666737, 666097, 665246, 664354, 663989, 664243, 664960, 666240, 668131, 670135, 671451, 671556, 670331, 667894, 664488, 660362, 655735, 651062, 647122, 644275, 641639, 637691, 631957, 625625, 620304, 616775, 615176, 615572, 617670, 620496, 623235, 626216, 630294, 635378, 640458, 645275, 651228, 660116, 672397, 687057, 702821, 719029, 735640, 753075, 772219, 794200, 819946, 850019, 884737, 923999, 966808, 1011276, 1055395, 1097747, 1137506, 1174151, 1207476, 1237696, 1265377, 1291584, 1318338, 1348447, 1384098, 1425507, 1471258, 1519876, 1570775]
63355A570775N3239N5765N8097N8883N6135M9067L9189K8678J8194P477k410r326
63343A983763j2870j5334j8968k3409k6845k8872l0927l4272l8601m2777m6088
63332A664800m8424m9660m9334m7160m3677m0009l6744l3467k9770k6219k3495
63321A236841k1041j7765j3919j0807q489n400r00L448O210Q266J1071J4015J5518
63308A217048J6112J8192K2614K7507L0962L3181L5276L7438L9376M1414M4027
63297A563147M6902M9482N1839N4092N5373N4412N0911M5513L8641L0220K0565
63286B061097J0702J570o555j3727j9855k4636k7672k8838k9035l0212l3713l8594
63274A820532m2602m4949m6982m9637n1644n1386m9405m7480m5889m3389l9805
$$ y = [1570775, 1624014, 1679779, 1737876, 1796759, 1852894, 1901961, 1941150, 1969828, 1988022, 1995499, 1993089, 1983763, 1970893, 1955559, 1936591, 1913182, 1886337, 1857465, 1826538, 1792266, 1753665, 1710888, 1664800, 1616376, 1566716, 1517382, 1470222, 1426545, 1386536, 1349792, 1316325, 1286555, 1260336, 1236841, 1215800, 1198035, 1184116, 1173309, 1164820, 1159420, 1158520, 1161968, 1168178, 1176444, 1187515, 1201530, 1217048, 1233160, 1251352, 1273966, 1301473, 1332435, 1365616, 1400892, 1438330, 1477706, 1519120, 1563147, 1610049, 1659531, 1711370, 1765462, 1820835, 1875247, 1926158, 1971671, 2010312, 2040532, 2061097, 2071799, 2073369, 2066814, 2053087, 2033232, 2008596, 1980924, 1952086, 1923051, 1892839, 1859126, 1820532, 1777930, 1732981, 1685999, 1636362, 1584718, 1533332, 1483927, 1436447, 1390558, 1347169, 1307364]
63263A307364l6524l3959l0475k4996j9241j5943j5831j7723k0676k4329k7618
63252A040049k9055k8471k7106k5740k4059k2045k0598k0154j9939j9243j8473
63241G85166j8124j7609j6106j4068j2924j3374j4580j5032j3941j1948j0497
63230F26963j0254j0304r509q370q363r400r496p694n846o123p816q307o737m932
63216E13812m551m918m412k934k007k712m290n045m316l246l323m462n073m112
63202D58411k285r37m71n22r55j846k803l219l076k816k612k397k361k648k758
63187D26705k022o81K55K79j73n11n53l00K14O01K75q73k311l473m132m198l512
63170D05590k043l6J944L060K714J342K39Q2R8n91j479j437n10L09Q60J945L512
$$ y = [1307364, 1270840, 1236881, 1206406, 1181410, 1162169, 1146226, 1130395, 1112672, 1091996, 1067667, 1040049, 1010994, 982523, 955417, 929677, 905618, 883573, 862975, 842821, 822882, 803639, 785166, 767042, 749433, 733327, 719259, 706335, 692961, 678381, 663349, 649408, 637460, 626963, 616709, 606405, 596896, 588526, 580163, 570763, 561267, 553573, 547727, 541604, 533788, 525481, 518744, 513812, 509261, 504343, 499931, 496997, 494990, 492278, 487988, 482943, 478627, 475381, 472058, 467596, 462523, 458411, 456126, 455189, 454718, 454196, 453241, 451395, 448592, 445373, 442297, 439481, 436869, 434472, 432111, 429463, 426705, 424683, 424002, 424257, 424536, 424363, 423852, 423299, 422999, 423213, 423814, 424089, 423216, 420905, 417432, 413300, 409102, 405590, 403547, 403511, 405455, 408515, 411229, 412571, 412810, 412892, 412990, 412399, 410920, 409483, 408973, 409282, 410142, 412087, 415599]
63153D15599M220L387K184K055K778L029K295J396J331K256L494M175M055L869
63139D56123M553N974P027P224P459Q599R993J0256R270Q477R142J0944J2602
63126E67643J3392J3681J4160J4910J5434J5390J5038J4803J4584J3801J2094
63115G24930R803P777O866P319Q414Q778P482M838J961l01j767k707l751n738
63101G73904q882j2158j4198j4776j4761j4685j4214j3194j2359j2476j3338j4022
63089F14841j3777j2392j0173p765n738m202l169l032m038n397n787m850l287
63076E31234j573K89J639J396J06J85K900O314P696O998O235O166N714M606M350
63061E84255N815P553P747O774O523P795R640J1093J2326J3692J4617J4251J2977
$$ y = [415599, 419819, 423206, 425390, 427445, 430223, 433252, 435547, 436943, 438274, 440530, 444024, 448199, 452254, 456123, 460676, 466650, 473677, 480901, 488360, 496959, 506952, 517208, 526478, 534955, 544097, 555041, 567643, 581035, 594716, 608876, 623786, 639220, 654610, 669648, 684451, 699035, 712836, 724930, 734733, 742510, 749376, 756695, 765109, 773887, 781369, 786207, 788168, 787867, 786100, 783393, 779642, 773904, 765022, 752864, 738666, 723890, 709129, 694444, 680230, 667036, 654677, 642201, 628863, 614841, 601064, 588672, 578499, 570734, 564996, 560794, 557625, 554593, 550555, 545158, 539371, 534521, 531234, 529661, 529950, 531589, 532985, 533091, 533276, 536176, 542490, 550186, 557184, 563419, 569585, 575299, 579905, 584255, 590070, 597623, 605370, 612144, 618667, 626462, 636102, 647195, 659521, 673213, 687830, 702081, 715058]
63048G15058J2403J3557J5597J6820J6652J5971J5683J5794J6078J6612J7045
63037H87270J6190J3421J0011P940P466O897M943K229J11j245k886n712r503j3083
63023I24049j5125j5146j4118j3798j5027j6839j7616j6894j5640j4851j4431
63012G54564j3610j2105j0440r271q645q148p487o614n394l667j855j007j642
62999F64679k764k748j296J53K45n92p85M44K323L608L795L330L070L679N203
62984F82344O955Q175Q787R302R836R780Q814P862Q318J0320J2349J2759J1389
62971H06990R395P823O729N618M327L230K614K159J321K34j51Q05K456L431L100
62956H60081K054J203R86J544K939M827O486P606Q661J0121J1670J2727J3272
$$ y = [715058, 727461, 741018, 756615, 773435, 790087, 806058, 821741, 837535, 853613, 870225, 887270, 903460, 916881, 926892, 934832, 942298, 949195, 954138, 956367, 956478, 955233, 952347, 946635, 937132, 924049, 908924, 893778, 879660, 865862, 850835, 833996, 816380, 799486, 783846, 768995, 754564, 740954, 728849, 718409, 709138, 700493, 692345, 684858, 678244, 672850, 669183, 667328, 666321, 664679, 661915, 659167, 657871, 658024, 658269, 657677, 656892, 657336, 659659, 663267, 667062, 670392, 673462, 677141, 682344, 689299, 697474, 706261, 715563, 725399, 735179, 743993, 751855, 760173, 770493, 782842, 795601, 806990, 816385, 824208, 830937, 836555, 840882, 844112, 846726, 848885, 850206, 850440, 850289, 851094, 853550, 856981, 860081, 862135, 863338, 864324, 865868, 868807, 873634, 880120, 887726, 896387, 906508, 918178, 930905, 944177]
62943I44177J3682J4121J4562J5083J5547J5421J4522J3529J3083J2814J2204
62932A098745J1843J2602J3698J3119J0242O803M675L789K877J218j198m512q812
62919A165089j3454j7370k0070k1863k3271k4586k5794k6601k6669k6005k4881
62908I14525k3374k1455j9483j7937j6551j4611j2370j1156j1499j2229j2188
62897G41672j1779j1792j1642j0265q270p505q495r708r703q774q081q101q555
62884F19002r049r215q773p938p443p651p996p676o732o019o153o741o761n732
62870E15123m383l890m402m785m091k793k069k196k464k462k499k655k275q68
62856D73291R18J787J167j40o63L69K352M051M945N445N810N655N005M974O366
$$ y = [944177, 957859, 971980, 986542, 1001625, 1017172, 1032593, 1047115, 1060644, 1073727, 1086541, 1098745, 1110588, 1123190, 1136888, 1150007, 1160249, 1167052, 1171727, 1175516, 1178393, 1179611, 1178413, 1173901, 1165089, 1151635, 1134265, 1114195, 1092332, 1069061, 1044475, 1018681, 992080, 965411, 939406, 914525, 891151, 869696, 850213, 832276, 815725, 801114, 788744, 777588, 766089, 753860, 741672, 729893, 718101, 706459, 696194, 687924, 680419, 671924, 662216, 652513, 643739, 635658, 627557, 619002, 609953, 600738, 591965, 584027, 576584, 568933, 560937, 553261, 546529, 540510, 534357, 527616, 520855, 515123, 510740, 506850, 502448, 497663, 493572, 490779, 488710, 486514, 484050, 481588, 479089, 476434, 474159, 473291, 474209, 475996, 477163, 477023, 476360, 476729, 479081, 483132, 488077, 493522, 499332, 504987, 509992, 514966, 521332]
62841E21332Q241R048Q919R289J0288J0232Q294O073N353N543M819L058J848J817
62827F14154J607k2k462m448n946p735r665j0641j0337r834j0042j0454j0133
62814E24042r276q723q326p180n567n223o900q808q598o208l536j845r45o72j528
62799D40707l323m522l821j702J20M38o85k224k903k098m82O31P07L51K23L77
62783D21794O92R38K82j984m703n302l028l48J76p59o60R24K129J882J068M33
62767D13534m19j452j621p59l02r38j191J75J750J328p69k170j801q20l35p9K37
62750D04368O5p64j256n39R46K298L270L789L186J015j842l794m194l634k861
62735D00053k073j230l72L86Q92R73P21N21N35M37M3k06J99J066J796K134K173
$$ y = [521332, 529573, 538621, 547540, 556829, 567117, 577349, 585643, 591716, 597069, 602612, 607431, 610489, 612337, 614154, 615761, 615739, 613277, 608829, 602883, 595148, 585483, 574842, 564505, 554671, 544629, 534175, 524042, 514766, 506043, 497717, 490537, 484970, 479747, 472847, 464039, 455441, 449233, 445697, 443852, 442907, 442235, 440707, 437384, 432862, 429041, 427339, 427459, 427897, 427212, 424988, 422085, 419987, 419505, 420136, 420843, 421194, 421417, 421794, 422486, 423424, 423706, 421722, 417019, 411717, 408689, 408341, 408517, 407758, 407098, 408022, 410151, 412033, 413101, 413534, 413115, 411663, 410042, 409283, 408981, 408043, 406852, 407027, 408777, 410105, 409336, 407166, 405365, 404545, 404210, 404131, 404368, 404433, 403669, 402413, 401874, 402820, 405118, 408388, 412177, 415363, 416378, 414536, 410742, 406548, 402914, 400053, 397980, 396750, 396378, 396764, 397656, 398629, 399350, 399871, 400406, 400843, 400886, 400680, 400879, 401945, 403741, 405875, 408048]
62718D08048J973J709J761K090K060J502J375K335L331K892J421O56J045J303
62704D33501P46K76N32P59L05k83n20r10j518j197M20J554O49j036j213r4N7j503
62686D30525l084l289k521j494k21P89K54j930l861l867k472j170k60Q52K001
62671D10252K239J223l03j335j328k96J289K831M104N185N869N803N413N839P379
62656D54164Q884R281R006R182J0082J1242J2427J3529J4179J4513J5815J9064
62644F01368K3187K6065K7157K7748K8641K9247K9274K9665L0904L1842L1344
62633I16442L0065K9215K8349K6024K2332J8994J6704J3906Q893J979n179j1579
62621A096145j7158k1763k4971k6872k8121k9146k9896l0398l0873l1154l0574
$$ y = [408048, 410021, 411730, 413491, 415581, 417641, 419143, 420518, 422853, 426184, 429076, 430497, 431153, 432198, 433501, 434247, 434523, 435055, 435814, 436119, 435836, 435316, 434406, 432888, 431691, 432111, 433665, 434314, 433278, 432065, 431971, 432028, 430525, 427441, 424152, 421631, 420137, 419916, 420705, 420959, 419029, 415168, 411301, 408829, 407659, 407399, 408251, 410252, 412491, 413714, 413411, 412076, 410748, 410452, 411741, 414572, 418676, 423861, 429730, 435533, 440946, 446785, 454164, 463048, 472329, 481335, 490517, 500599, 511841, 524268, 537797, 551976, 566489, 582304, 601368, 624555, 650620, 677777, 705525, 734166, 763413, 792687, 822352, 853256, 885098, 916442, 946507, 975722, 1004071, 1030095, 1052427, 1071421, 1088125, 1102031, 1110924, 1112903, 1107724, 1096145, 1078987, 1057224, 1032253, 1005381, 977260, 948114, 918218, 887820, 856947, 825793, 795219]
62610G95219k8739k6129k3783k2585k2588k2719k1493j8722j6155j5574j6393
62599E60339j6357j4641j2720j1800j1063r464p755p103o837n515l580k956m064
62586D46484n208n162m626m458m159l035j646r59r36q90o66n70o47p49q96j012
62570D10865p68k55k85j419l130m383m585l643j786J11Q60L14k82p8N3r82k410
62553C88197k476j156l80j296k652k618j238j97n74j598j691l17J419J912P17
62538C76052j039j858j336l14J65j43o13m77L70J243J470J111N38l56j865l422
62522C69526l822k706r92M72J673K472K139P20k07N68J998K092N02j406k588k971
62506C67470k485j063M27Q21L65M37J431K325K563K790L233K915J347l64j021
$$ y = [795219, 766480, 740351, 716568, 693983, 671395, 648676, 627183, 608461, 592306, 576732, 560339, 543982, 529341, 516621, 504821, 493758, 484294, 476539, 469436, 462599, 457084, 453504, 450548, 446484, 441276, 436114, 431488, 427030, 422871, 419836, 418190, 417231, 416295, 415405, 414739, 414169, 413522, 412773, 411877, 410865, 410097, 409842, 409557, 408138, 405008, 400625, 396040, 392397, 390611, 390722, 391582, 391896, 391614, 391536, 391589, 390607, 388197, 385721, 384565, 384185, 382889, 380237, 377619, 376381, 376184, 375610, 374012, 372321, 372004, 373423, 375335, 376052, 375013, 373155, 371819, 371505, 371670, 371527, 370914, 370437, 370807, 372050, 373520, 374631, 375169, 374813, 372948, 369526, 365704, 362998, 362006, 362478, 364151, 366623, 368762, 369482, 369275, 369843, 371841, 373933, 374435, 373029, 370441, 367470, 364985, 363922, 364349, 365170, 365535, 365972, 367403, 369728, 372291, 375081, 378314, 381229, 382576, 382212, 381191]
62491C81191q36m57L61J932L389L569K625J576P60l5l69N32K273L434L428L182
62475D06555L592M235M172L400K887L399M724O013O662O777O838P013P122P331
62461D80720Q436J1059J4714J8028J9733J9384J7602J6020J6401J9002K1876K2607
62449F85582K0783J8106J6064J4325J1838Q765O536O035O354N629K992n31l113
62436G99365l960l776l577l571l469l279l160k865j995o65P54K481N087Q320J0989
62421G96679J2427J3408J5092J7595K0104K2020K3272K3799K3329K1770J9356
62410A008851J6350J2924R249N504J783j793n059q219j2032j6946k2046k5556
62398I63010k6666k6397k6240k6414k6106k5163k4640k5305k6200k5439k2417
$$ y = [381191, 380355, 379898, 380259, 382191, 385580, 389149, 391774, 393350, 394110, 394075, 393706, 394238, 396511, 399945, 403373, 406555, 410147, 414382, 418554, 421954, 424841, 428240, 432964, 438977, 445639, 452416, 459254, 466267, 473389, 480720, 489156, 500215, 514929, 532957, 552690, 572074, 589676, 605696, 622097, 641099, 662975, 685582, 706365, 724471, 740535, 754860, 766698, 775463, 781999, 788034, 794388, 800017, 803009, 802478, 799365, 795405, 791629, 788052, 784481, 781012, 777733, 774573, 771708, 769713, 769048, 769802, 772283, 777370, 785690, 796679, 809106, 822514, 837606, 855201, 875305, 897325, 920597, 944396, 967725, 989495, 1008851, 1025201, 1038125, 1047374, 1052878, 1054661, 1052868, 1047809, 1039590, 1027558, 1010612, 988566, 963010, 936344, 909947, 883707, 857293, 831187, 806024, 781384, 756079, 729879, 704440, 682023]
62387F82023j8619j5991j4884j4047j2558j1078j0967j2430j4028j4019j1944
62376E31458q829o127m551l786l152k511k323k828l392l158k219j638k116l205
62362D81623m041m425m602m423l500k030o98L48J679L400M507L985K195N29j24
62347D74423LM15J133K308L482L807L129K480L038M571N472M797L760M336O461
62332E23615P905P242N847N903P450Q763R115R480J0403J1035J0881J1089J2825
62319F41553J5412J7308J8392J9874K2269K4702K6397K7736K9522L1907L4526
62308I09598L7155L9834M2704M5961M9758N3971N8306O2664O7225P2233P7981
62297A517390Q4690R1869R7962J01312J01466R8953R3952Q6169P6029O4785N2885
$$ y = [682023, 663404, 647413, 632529, 618482, 605924, 594846, 583879, 571449, 557421, 543402, 531458, 522629, 516502, 511951, 508165, 505013, 502502, 500179, 497351, 493959, 490801, 488582, 486944, 484828, 481623, 477582, 473157, 468555, 464132, 460632, 458602, 457904, 458252, 459931, 463331, 467838, 471823, 474018, 474547, 474423, 474426, 474841, 475974, 478282, 481764, 485571, 488700, 491180, 494218, 498789, 504261, 509058, 512818, 517154, 523615, 531520, 538762, 544609, 550512, 557962, 566725, 575840, 585320, 595723, 606758, 617639, 628728, 641553, 656965, 674273, 692665, 712539, 734808, 759510, 785907, 813643, 843165, 875072, 909598, 946753, 986587, 1029291, 1075252, 1125010, 1178981, 1237287, 1299951, 1367176, 1439409, 1517390, 1602080, 1693949, 1791911, 1893223, 1994689, 2093642, 2187594, 2273763, 2349792, 2414577, 2467462]
62286B467462L9442K4147Q711m755j6173k7099l8337m9149n8581o6244p1767p4919
62274B132738p6547p8122p9712p9493p6096p0576o5221o0965n6995n2502m7792
62263A388717m3720m0815l9133l8343l7683l6287l3955l1478k9977k9745k9724
62252I97857k8447k5777k3443k3179k4332k4283k1520j7393j4148j2102r970p432
62240G65831n796n925o790o791n649m261l211k298j301l87L78J358K831M432N500
62225G37921N924O340P386R030J0828J2570J4223J5318J5134J3780J2629J3167
62213H74250J5628J9084K2558K5579K7955K9699L1296L3567L7125M2010M7806
62202A206557N3802N9251O3857O8067P2748P8525Q5310R2122R7270R9352R8377
$$ y = [2467462, 2506904, 2531051, 2539762, 2535007, 2518834, 2491735, 2453398, 2404249, 2345668, 2279424, 2207657, 2132738, 2056191, 1978069, 1898357, 1818864, 1742768, 1672192, 1606971, 1546006, 1489011, 1436509, 1388717, 1344997, 1304182, 1265049, 1226706, 1189023, 1152736, 1118781, 1087303, 1057326, 1027581, 997857, 969410, 943633, 920190, 897011, 872679, 848396, 826876, 809483, 795335, 783233, 773263, 765831, 760035, 754110, 747320, 740529, 734880, 730619, 727408, 725110, 723809, 723422, 723800, 725158, 727989, 732421, 737921, 743845, 750185, 757571, 766601, 777429, 789999, 804222, 819540, 834674, 848454, 861083, 874250, 889878, 908962, 931520, 957099, 985054, 1014753, 1046049, 1079616, 1116741, 1158751, 1206557, 1260359, 1319610, 1383467, 1451534, 1524282, 1602807, 1688117, 1780239, 1877509, 1976861, 2075238]
62191B075238R5420R0803Q3396P2303N8472M3662K8480J2623l356j7991l0617
62180B508433m1910n2481o2122p0685p8449q5042q8978q9207q6612q3339q0846
62169A688762p8826p5752p0540o4010n8399n4837n1863m7544m2500l9030l7433
62158A068028l5395l1604k7738k5637k4410k2084j8681j5714j3578j1449r265
62147H32473p807o988n782l991k612k287k630l172l697l486j602J657M670O427
62133H01173P609R250J1198J2588J3228J3766J4646J5581J6156J6559J7391J8741
62121I67886J9898K0435K1184K3208K5883K7219K6517K5489K6013K8057L0845
62110A242634L4699M0137M6115N1087N5253N9855O4686O8287P0357P1723P1713
$$ y = [2075238, 2170658, 2261461, 2344857, 2417160, 2475632, 2519294, 2547774, 2560397, 2557041, 2539050, 2508433, 2466523, 2414042, 2351920, 2281235, 2202786, 2117744, 2028766, 1939559, 1852947, 1769608, 1688762, 1609936, 1534184, 1463644, 1399634, 1341235, 1286398, 1234535, 1186991, 1144491, 1105461, 1068028, 1032633, 1001029, 973291, 947654, 923244, 901160, 882479, 866765, 853187, 841738, 832473, 824666, 817678, 811896, 807905, 805293, 803006, 800376, 797204, 793507, 790021, 788419, 790076, 794746, 801173, 808782, 818032, 829230, 841818, 855046, 868812, 883458, 899039, 915195, 931754, 949145, 967886, 987784, 1008219, 1029403, 1052611, 1078494, 1105713, 1132230, 1157719, 1183732, 1211789, 1242634, 1277333, 1317470, 1363585, 1414672, 1469925, 1529780, 1594466, 1662753, 1733110, 1804833, 1876546]
62099A876546O7913N9412M8263L6758K5157J3272K429o124j3514k1924l1517m0375
62087B016296m7363n3317n9039o3569o5272o4161o2242o1321o0826n8370n2686
62076A368130m5471l9540l5701l2480k8716k4849k1426j7981j4226j1016q897
62065A087827o772l361P75M061O235Q376J0798J2356J2026J0083P524N303M379
62052A159610N456P999J0098J0010P661M402J463r88l526o542r725j2269j3455
62039A160194j3098j1577r571p674o086m705l586k996k779k016K6K863N392P406
62025A111793R667J2516J5403J8088K1202K5002K8588L1085L2974L5297L8181
62014A379796M1068M3914M7056N0054N1927N2733N3964N6717O0069O2022O1935
$$ y = [1876546, 1944459, 2003871, 2052134, 2088892, 2114049, 2127321, 2129750, 2123626, 2110112, 2088188, 2056671, 2016296, 1968933, 1915616, 1856577, 1793008, 1727736, 1663575, 1601333, 1540012, 1479186, 1420816, 1368130, 1322659, 1283119, 1247418, 1214938, 1186222, 1161373, 1139947, 1121966, 1107740, 1096724, 1087827, 1081055, 1077694, 1078469, 1082530, 1088765, 1097141, 1107939, 1120295, 1132321, 1142404, 1149928, 1155231, 1159610, 1165066, 1173065, 1183163, 1193173, 1200834, 1205236, 1206699, 1205711, 1202185, 1195643, 1185918, 1173649, 1160194, 1147096, 1135519, 1125948, 1118274, 1112188, 1107483, 1103897, 1100901, 1098122, 1096106, 1096132, 1098995, 1104387, 1111793, 1121460, 1133976, 1149379, 1167467, 1188669, 1213671, 1242259, 1273344, 1306318, 1341615, 1379796, 1420864, 1464778, 1511834, 1561888, 1613815, 1666548, 1720512, 1777229, 1837298, 1899320, 1961255]
62003A961255O1294O1703O2481O1138N6285M9116M1339L2638K1664R090k303j1047
61991B404653j8760k7550l7097m5586n2383n8126o2836o5719o6729o6853o6668
61980A836346o5859o4351o2680o0835n7844n3299m8447m4920m2739m0432l6988
61969A257952l2924k9278k6314k3817k2054k1376k0856j8716j4824j1669j1494
61958A024630j3337j4426j4040j3855j4633j4889j3623j1999j1125j0114p991
61947H84598n734m570l685j796K51P66K10M07J405J708J346J987L757M611L447
61932H88708J418m81k709n132o204n636n713q061j0976j1946j1366j1465j2569
61919G97868j2876j1552r820q877q561q386q396q503q224p505o879o471n678m224
$$ y = [1961255, 2022549, 2084252, 2146733, 2207871, 2264156, 2313272, 2354611, 2387249, 2408913, 2418003, 2415700, 2404653, 2385893, 2358343, 2321246, 2275660, 2223277, 2165151, 2102315, 2036596, 1969867, 1903014, 1836346, 1770487, 1706136, 1643456, 1582621, 1524777, 1471478, 1423031, 1378111, 1335372, 1294940, 1257952, 1225028, 1195750, 1169436, 1145619, 1123565, 1102189, 1081333, 1062617, 1047793, 1036124, 1024630, 1011293, 996867, 982827, 968972, 954339, 939450, 925827, 913828, 902703, 892589, 884598, 878864, 874294, 870609, 868813, 869064, 869830, 870040, 870447, 871852, 873560, 874906, 876893, 880650, 885261, 888708, 890126, 889645, 886936, 881804, 875600, 869964, 864251, 856190, 845214, 833268, 821902, 810437, 797868, 784992, 773440, 763620, 754743, 746182, 737796, 729400, 720897, 712673, 705168, 698289, 691818, 686140, 681916]
61905F81916k857k558l433m571m694l092l69J882K740L103M393O394P398O650
61891F92902N556N944P990J0491J2498J3995J5457J7418K0140K3072K5071K5812
61879H76346K6626K8991L2415L4923L5632L5568L5565L4782L2323K9281K7608
61868A230060K7349K6490K3590J9190J4468R926N952L219J571m88m007p951j0450
61855A338919j1158j1195j1030r739o472j760K913O277Q032Q954J0219J2194J4112
61842A350266J5216J5538J4916J2246O997P47m338q205j2414j7141k0714k2413
61830A330701k3665k5583k7187k7326k6875k7470k8969k9725k8813k6738k4373
61819A033977k2283k0877k0273k0070j9811j9288j8095j5729j2730j0648r903
$$ y = [681916, 679059, 676501, 673068, 668497, 663803, 660711, 660342, 662224, 664964, 668067, 672460, 678854, 686252, 692902, 698458, 704402, 712392, 722883, 735381, 749376, 764833, 782251, 802391, 825463, 850534, 876346, 902972, 931963, 964378, 999301, 1034933, 1070501, 1106066, 1140848, 1173171, 1202452, 1230060, 1257409, 1283899, 1307489, 1326679, 1341147, 1351073, 1357025, 1360244, 1361815, 1361327, 1357320, 1349369, 1338919, 1327761, 1316566, 1305536, 1295797, 1289325, 1287565, 1290478, 1296755, 1304787, 1313741, 1323960, 1336154, 1350266, 1365482, 1381020, 1395936, 1408182, 1415179, 1415926, 1411588, 1403383, 1390969, 1373828, 1353114, 1330701, 1307036, 1281453, 1254266, 1226940, 1200065, 1172595, 1143626, 1113901, 1085088, 1058350, 1033977, 1011694, 990817, 970544, 950474, 930663, 911375, 893280, 877551, 864821, 854173, 844270]
61808H44270q776n771k009M39J794M123P910J1306J3074J4384J6814K0239K3704
61795I41501K7123L0933L4970L8770M2423M6197M9739N2448N4197N5029N4583
61784A427913N2644M9856M7030M4002L9876L4213K7330J9614J1440L659k733p558
61772A747286j1387j4296j5555j4841j2990j0864p988l221L292R511J3131J3543
61760A695621J1990J0010P856M484j009q002j4714k0025k4642l0096l6659m2747
61748A552067m6521m7764m7898m8284m8797m8208m5785m2310l9365l7759l6964
61737A062412l5941l4098l1321k7745k4022k1299k0139j9614j8307j6158j4414
61726G99354j3761j3461j2709j1810j1316j0813r479p433n769n369o232p625q535
$$ y = [844270, 835494, 829723, 827714, 828153, 829947, 834070, 841980, 853286, 866360, 880744, 897558, 917797, 941501, 968624, 999557, 1034527, 1073297, 1115720, 1161917, 1211656, 1264104, 1318301, 1373330, 1427913, 1480557, 1530413, 1577443, 1621445, 1661321, 1695534, 1722864, 1742478, 1753918, 1757577, 1754844, 1747286, 1735899, 1721603, 1706048, 1691207, 1678217, 1667353, 1659365, 1656144, 1659436, 1668947, 1682078, 1695621, 1707611, 1717621, 1725477, 1729961, 1728952, 1720950, 1706236, 1686211, 1661569, 1631473, 1594814, 1552067, 1505546, 1457782, 1409884, 1361600, 1312803, 1264595, 1218810, 1176500, 1137135, 1099376, 1062412, 1026471, 992373, 961052, 933307, 909285, 887986, 867847, 848233, 829926, 813768, 799354, 785593, 772132, 759423, 747613, 736297, 725484, 716005, 708572, 702803, 697434, 691202, 683577, 675042]
61713F75042q280p124n906m803l224j345n98j646k843k140MJ210L76j256k080
61698F35387j602N0K446M332M427L317L001M015M583L477K067K167L241L475K689
61683F77072K293K767L048K480J842J917K281K146J613J433J949K794L424L582
61669G10641L333K848K321K042K368L342M422M920M724M234L644K880K231K397
61655G56347L553M925N626N468M801M054L665L810L955L228J439q22l126n307
61641G91616o608o032m132l157m396o415o941n701m253l792m286n218o016o126
61627G18543n604n293n588n667m841l830l534l426k592j603j646k308k126j098
61613F69387p02j358j833j493j327k010k662k332j472j029j135j432j733j722
$$ y = [675042, 666762, 659638, 653732, 648929, 645705, 644360, 643762, 642116, 639273, 637133, 637137, 638347, 638723, 637467, 635387, 633785, 633835, 636281, 640613, 645040, 648357, 651358, 655373, 659956, 663433, 665500, 667667, 670908, 674383, 677072, 679365, 682132, 685180, 687660, 689502, 691419, 693700, 695846, 697459, 698892, 700841, 703635, 707059, 710641, 713974, 716822, 719143, 721185, 723553, 726895, 731317, 736237, 740961, 745195, 748839, 751719, 753950, 756347, 759900, 764825, 770451, 775919, 780720, 784774, 788439, 792249, 796204, 799432, 800871, 800049, 796923, 791616, 785008, 778976, 774844, 771687, 767291, 760876, 753935, 748234, 743981, 740189, 735903, 730685, 724669, 718543, 712939, 707646, 702058, 696391, 691550, 687720, 684186, 680760, 678168, 676565, 674919, 672611, 670485, 669387, 668685, 667327, 665494, 664001, 662674, 660664, 658002, 655670, 654198, 653169, 652034, 650602, 648869, 647147]
61599F47147q80O30J911K570L096L651L604K847K371K813L526L851M216N022N565
61584F91940N215M792N420O650P067O404N816O009O194N102K543k06j366l35J428
61569G52673J625m95l490n650o597o650n890m707m132m481m522l213j415n79o12
61554G01865n80p63k072l858m434l884m152n907p299o862n845o356q377j0132
61540F31344j0513r843q742p540o571n998n378m197k784k100k676m197n843o697
61526E48265o221m941m217m664n213m551l083k424l107l899l627k660k198k800
61512D94660m055n132n231m114k606k076k928m020m078l250k644k685k728k209
61498D46904j354n98N4O60Q49J82j055j915j730p34L36J037J341J149K63r01j151
$$ y = [647147, 646267, 646897, 648808, 651378, 654474, 658125, 661729, 664576, 666947, 669760, 673286, 677137, 681353, 686375, 691940, 697155, 701947, 707367, 714017, 721084, 727488, 733304, 739313, 745507, 750609, 753152, 752946, 751580, 751245, 752673, 754298, 753803, 750313, 744663, 738066, 731416, 725526, 720819, 716687, 712206, 707684, 704471, 703056, 702477, 701865, 701285, 700522, 698450, 694592, 690158, 686274, 682122, 676215, 668916, 662054, 656209, 649853, 641476, 631344, 620831, 610988, 602246, 594706, 588135, 582137, 576759, 572562, 569778, 567678, 565002, 560805, 554962, 548265, 542044, 537103, 532886, 528222, 523009, 518458, 515375, 512951, 509844, 505945, 502318, 499658, 497460, 494660, 490605, 485473, 480242, 476128, 473522, 471446, 468518, 464498, 460420, 457170, 454526, 451841, 449113, 446904, 445550, 444952, 445006, 445666, 446515, 446697, 445642, 443727, 441997, 441263, 441599, 442636, 443977, 445126, 445389, 444488, 443337]
61481D43337K52K430L661L337K287J145m73k549l599k243O58K680K510R54n44
61466D53843j203p98N03J753J749M26j076k011k747l544l757l026k240k336k863
61451D32673k771k040j593j964k888l801m012k872p22Q80Q61J24K56J209J531
61436D14871O63m17p79m76K40J214J717R16n35p40R08K667K731J448L12k85j050
61419D23405k156k825k392r56Q65K186K234J180L27O39J344Q28j150k978l044
61404D17507j457L15R84L68q46j869k366k364j887r78j34j74j280k484k519j123
61388C99693R00K546L202K667J272l8k80O71K012K856K998K831K870L355M130
61373D31685M817N220N361N082L947K000L41K46J602K838K650J459O59Q87J567
$$ y = [443337, 443589, 446019, 449680, 453017, 455304, 456449, 455976, 453427, 449828, 447585, 448243, 450923, 453433, 454387, 453843, 452640, 451842, 452345, 454098, 455847, 456273, 455197, 453186, 450439, 446895, 443138, 440112, 437872, 435536, 432673, 429902, 427862, 426269, 424305, 421417, 417616, 413604, 410732, 410010, 410890, 411751, 411875, 412131, 413340, 414871, 415534, 415117, 414338, 413862, 414102, 415316, 417033, 417949, 417414, 416674, 417582, 420249, 422980, 424428, 424740, 424455, 423405, 421249, 418424, 416032, 415076, 415941, 418127, 420361, 421541, 421868, 422507, 423851, 424679, 423529, 420551, 417507, 416050, 416365, 417349, 417717, 416871, 415002, 412636, 410272, 408385, 407407, 407273, 407099, 405819, 403335, 400816, 399693, 400593, 403139, 406341, 409008, 410280, 410242, 409962, 410633, 412645, 415501, 418499, 421330, 424200, 427555, 431685, 436502, 441722, 447083, 452165, 456112, 458112, 458453, 458699, 460301, 463139, 465789, 467248, 467907, 468794, 470361]
61358D70361K038K360K783L015K718K323K599L352L444K342R43K75Q5n30j562
61343D96546k205k295k555l262l709l340k526j763q91K57J117J090N82O11J492
61328D79149K463K580J635K40p69j143j517k523l582l262j249Q06J166K30p3J056
61312D75207K309K165R35K80J111K542K931J649k83j168j07K420N090O687O665
61297E08433N330L658K705K999M399O372Q172R084Q975Q574Q723R385R929J0180
61283F06918J0452J0613J0094R068Q515Q642Q250O457M172L003L330M390N659
61270F99563O929P397N937K543j347m103n059m552l486k825k868l069k891k611
61256F89558k628k446j285M22J250O61k06l2J156K323K706K332J751J707K799
$$ y = [470361, 472399, 474759, 477542, 480557, 483275, 485598, 488197, 491549, 494993, 497335, 498278, 498553, 498638, 498108, 496546, 494341, 492046, 489491, 486229, 482520, 479180, 476654, 474891, 474000, 474257, 475374, 476464, 477046, 477657, 479149, 481612, 484192, 485827, 486067, 485298, 484155, 482638, 480115, 476533, 473271, 472022, 472828, 473994, 474224, 474151, 475207, 477516, 479681, 480616, 480896, 482007, 484549, 487480, 489129, 488846, 487678, 487571, 489991, 495081, 501768, 508433, 513763, 517421, 520126, 523125, 527524, 533896, 542068, 551152, 560127, 568701, 577424, 586809, 596738, 606918, 617370, 627983, 638077, 647145, 655660, 664302, 672552, 679009, 683181, 686184, 689514, 693904, 699563, 706492, 713889, 719826, 722369, 721022, 716919, 711860, 707308, 703822, 700997, 698129, 695060, 692169, 689558, 686930, 684484, 683199, 683621, 684871, 685532, 685326, 685294, 686450, 688773, 691479, 693811, 695562, 697269, 700068]
61241G00068M875O815P217N566K730K97p92j059j803l562n524o495o031m432k266
61226F95604l76K33p05k164k736j957l29J525L116M002M235M630N727O761O603
61211G24169N601N440P090R675J1532J1692J0317Q506P683Q407R659J0026R579
61198H39376R684J1003J2660J3582J3619J3013J1803J0226Q866P901O923N906
61186I64562N464N660N471M094K096N34m45j361k421l502m687n960o755o583n879
61171I50288n544n775n976n702n076m369l692l118k670k230j750j483j727k407
61157H98769l196l896m421m521l848k372o21O54J035Q48P67Q93L86j466l984n501
61141H69526n003k824J59L203N547O595O742P266Q853J0843J2321J3288J4201
$$ y = [700068, 704943, 711758, 718975, 724541, 727271, 727568, 726776, 725717, 723914, 720352, 714828, 708333, 702302, 697870, 695604, 695228, 695461, 694756, 692592, 689856, 687899, 687570, 689095, 692211, 696213, 700448, 705078, 710805, 717566, 724169, 729770, 735210, 742300, 751975, 763507, 775199, 785516, 794022, 801705, 810112, 819771, 829797, 839376, 849060, 860063, 872723, 886305, 899924, 912937, 924740, 934966, 943832, 951733, 958656, 964562, 970026, 975686, 981157, 985251, 987347, 987881, 987436, 986075, 983654, 980152, 975465, 969505, 962750, 956167, 950288, 944744, 938969, 932993, 927291, 922215, 917846, 914154, 911036, 908366, 906136, 904386, 902903, 901176, 898769, 895573, 891677, 887256, 882735, 878887, 876515, 875894, 876548, 877583, 878431, 879198, 880091, 880477, 879011, 875027, 869526, 864523, 861699, 861858, 865061, 870608, 877203, 883945, 891211, 900064, 910907, 923228, 936516, 950717]
61128I50717J5031J5506J5721J5824J5509J4536J3368J2705J2687J3068J3743
61117A108415J4381J4055J2142R364P160O096N601N058M415L757L069K516K292
61104A198321K173J627M41j194l067m893o080o261o060o541p860r116r691r967
61090A131832j0359j0415r381p274m839k718j278r83k201m498o748q255r425j0818
61076A042640j1940j1750j0329r123r025r042p654m968k506j170n07M4M72J032
61062I66174K518N014P347Q570R245J0492J2386J4168J5550J6908J8501K0308
61050A107181K2436K4986K7515K9152K9240K7760K5494K3978K4467K6486K8039
61039A396734K7774K6215K4208K1198J6220R994M669J530l1j378l285n703p935
$$ y = [950717, 965748, 981254, 996975, 1012799, 1028308, 1042844, 1056212, 1068917, 1081604, 1094672, 1108415, 1122796, 1136851, 1148993, 1158357, 1165517, 1171613, 1177214, 1182272, 1186687, 1190444, 1193513, 1196029, 1198321, 1200494, 1202121, 1202562, 1201368, 1198301, 1193408, 1187328, 1181067, 1175007, 1168466, 1160606, 1151490, 1141799, 1131832, 1121473, 1111058, 1101677, 1094403, 1089564, 1086846, 1085568, 1084585, 1082384, 1077886, 1071138, 1062883, 1053458, 1042640, 1030700, 1018950, 1008621, 999498, 990473, 981431, 973777, 968809, 966303, 965133, 964626, 964670, 965142, 966174, 968692, 973706, 981053, 989623, 998868, 1009360, 1021746, 1035914, 1051464, 1068372, 1086873, 1107181, 1129617, 1154603, 1182118, 1211270, 1240510, 1268270, 1293764, 1317742, 1342209, 1368695, 1396734, 1424508, 1450723, 1474931, 1496129, 1512349, 1522343, 1527012, 1528542, 1528511, 1527133, 1523848, 1518145, 1510210]
61026A510210r177r367r348r718j0105j0265j1013j2970j4945j5085j3405j1820
61014A372992j1675j2386j2609j1628r522o901m575k750p31J856M085N080N719
61001A316955P597J0689J3625J5959J8455K1302K3870K6240K9130L2268L4806
60990A550896L7419M1733M7292N1583N3887N6626O1719O8001P3892Q0232Q8317
60979B211597R6856J03520J08541J14464J22796J32674J42573J51770J60348J68912
60969C514051J78049J87463J96434K05661K17281K32231K49302K67987K90310
60960E538769L18060L50051L84373M22051M66635N22008N92655O83282P94423
60951A0072307R20041J053396J193894J344596J505966J678776J872120K101292
$$ y = [1510210, 1501033, 1491666, 1482318, 1472600, 1462495, 1452230, 1441217, 1428247, 1413302, 1398217, 1384812, 1372992, 1361317, 1348931, 1336322, 1324694, 1315172, 1308271, 1303696, 1300946, 1300215, 1302071, 1306156, 1311236, 1316955, 1324552, 1335241, 1348866, 1364825, 1383280, 1404582, 1428452, 1454692, 1483822, 1516090, 1550896, 1588315, 1630048, 1677340, 1728923, 1782810, 1839436, 1901155, 1969156, 2043048, 2123280, 2211597, 2308453, 2411973, 2520514, 2634978, 2757774, 2890448, 3033021, 3184791, 3345139, 3514051, 3692100, 3879563, 4075997, 4281658, 4498939, 4731170, 4980472, 5248459, 5538769, 5856829, 6206880, 6591253, 7013304, 7479939, 8001947, 8594602, 9277884, 10072307, 10992348, 12045744, 13239638, 14584234, 16090200, 17768976, 19641096, 21742388]
60943B1742388K377154K702047L065743L417680L631560L530448L003531K127578
60935D5598129J158860L78924o4406j81308n4578K17097M90132N56257K31159
60926D8330266n02787j454084k340468k958964l261185l307225l184684k967538
60918B8353331k711926k455696k215576j993682j789765j605479j440408j290850
60910A2849949j153817j029124r17369q18332p31256o54525n85321n21623m64139
60901E974443m14361l71315l32200k95646k62204k32286k05975j84483j69153
60892C506820j58826j50417j42301j35042j28803j22389j15347j08554j02053
60883B343088r4511q5696p7432p1160o6331o2150n8934n6593n3830n0250m7447
$$ y = [21742388, 24119542, 26821589, 29887332, 33305012, 36936572, 40467020, 43470551, 45598129, 46756989, 47135913, 47071507, 46890199, 46835621, 47052718, 47542850, 48099107, 48330266, 47827479, 46373395, 44032927, 41073963, 37812778, 34505553, 31320869, 28353331, 25641405, 23185709, 20970133, 18976451, 17186686, 15581207, 14140799, 12849949, 11696132, 10667008, 9749639, 8931307, 8200051, 7545526, 6960205, 6438582, 5974443, 5560082, 5188767, 4856567, 4560921, 4298717, 4066431, 3860456, 3675973, 3506820, 3347994, 3197577, 3055276, 2920234, 2791431, 2669042, 2553695, 2445141, 2343088, 2248577, 2162881, 2085449, 2014289, 1947958, 1885808, 1826874, 1770281, 1716451, 1666201, 1618754]
60872A618754m6378m5464m3168m0827m0604m1830m1849l9791l7152l5036l3212
60861A173443l1818l1511l1566l0028k6625k3657k3007k3727k3642k2089j9912
60850H85861j7774j5774j4175j3326j2954j2299j0916q938o835n188m325l861
60838G59496l042j754o27J32J125K423K883J724O2l80L03L20j385l995o153p355
60822G43777p801p871q062q679r285r208q708q625q741p822n779m397m952o371
60808F37476p020p140p813q428p291m484k030r13J1J458K048L98k481m262l919
60793E85610k145K8J851K743K739K694L181L684L721L997N237O594O620N422M383
60778F36359L984L486K678K278K277J549k69j841j901r10j69j78o88j507k375
$$ y = [1618754, 1572376, 1526912, 1483744, 1442917, 1402313, 1360483, 1318634, 1278843, 1241691, 1206655, 1173443, 1141625, 1110114, 1078548, 1048520, 1021895, 998238, 975231, 951504, 927862, 905773, 885861, 868087, 852313, 838138, 824812, 811858, 799559, 788643, 779705, 772870, 767682, 763357, 759496, 756454, 754700, 754073, 754205, 755330, 757753, 760636, 762360, 762422, 762042, 762345, 762665, 761280, 757285, 751132, 743777, 735976, 728105, 720043, 711364, 702079, 692871, 684163, 675538, 666797, 658975, 653196, 648799, 643847, 637476, 630456, 623316, 615503, 607075, 599784, 595300, 593270, 592357, 592368, 593826, 595874, 596272, 593791, 589529, 585610, 583465, 583493, 585344, 588087, 590826, 593520, 596701, 600385, 604106, 608103, 613340, 619934, 626554, 631976, 636359, 640343, 643829, 646507, 648785, 651062, 652611, 652342, 650501, 648600, 647690, 647521, 647343, 646655, 645148, 642773]
60763F42773k684k120j271r37j246j861k597l270l499l236l173m092n985q068
60749E98734r357r167p692o241o175p285p929p154n702m628l980l460l201l050
60735E13713k199o84j51j738m033m635l197j358k33L95O60K72l09p3Q66J230O07
60718D99133J22O65J771K728L493L943L608K905L378N664Q206R046Q111O815O141
60703E65729O219P027Q318R125Q510O766N132M401M421M622M388L254J570O29
60689F40111J332K825L380K561J611J650K295K430J639L56r68k357m001n731o976
60674F40157p242o681n932n481n373n528n850n974n521m845m797n377n470m502
60660E61584l428l098k545m51K257L210K080J321K795N339O770O952P342Q451
$$ y = [642773, 640089, 637969, 636698, 635761, 634515, 632654, 630057, 626787, 623288, 620052, 616879, 612787, 606802, 598734, 589377, 580210, 572518, 566277, 560102, 552817, 544888, 537734, 532032, 527404, 523424, 519964, 516763, 513713, 511514, 510830, 510679, 508941, 504908, 500273, 497076, 495718, 495485, 495880, 496540, 496812, 496503, 496430, 497296, 498526, 499133, 499255, 499920, 501691, 504419, 507912, 511855, 515463, 518368, 521746, 527410, 535616, 544662, 552773, 559588, 565729, 571948, 578975, 587293, 596418, 604928, 611694, 616826, 621227, 625648, 630270, 634658, 637912, 639482, 640111, 641443, 644268, 647648, 650209, 651820, 653470, 655765, 658195, 659834, 660190, 659222, 656865, 652864, 647133, 640157, 632915, 626234, 620302, 614821, 609448, 603920, 598070, 592096, 586575, 581730, 576933, 571556, 566086, 561584, 558156, 555058, 552513, 552062, 554319, 557529, 559609, 560930, 563725, 569064, 575834, 582786, 590128, 598579]
60646E98579R420R752R943J0295J0475J0508J1095J2419J3530J3486J2515J1558
60634G33575J1160J1374J2247J3763J5364J6241J6177J5818J5934J6473J6542
60623H94668J5450J3764J2939J3596J4525J4063J2205J0385R172P429M300P51
60611A023247j864l841o421r763j3027j5993j8946k1170k1459k0295j9715k0375
60599H50378k0600j9242j7625j7328j7527j6295j3425j0269p727o152o271q036
60587F89881r164p336l709j807k709l854l292k412l072m344m241k990k422k993
60573F35536l566l519l260k848j868n83K73R58K506M905O686O659N080K891P83
60558F50633q19j643j732j208K5J619K297J111r04j714r82l97j023j870j844j643
$$ y = [598579, 607999, 617751, 627694, 637989, 648464, 658972, 670067, 682486, 696016, 709502, 722017, 733575, 744735, 756109, 768356, 782119, 797483, 813724, 829901, 845719, 861653, 878126, 894668, 910118, 923882, 936821, 950417, 964942, 979005, 991210, 1001595, 1010767, 1018196, 1022496, 1023247, 1021383, 1017542, 1011121, 1001358, 988331, 972338, 953392, 932222, 910763, 890468, 870753, 850378, 829778, 810536, 792911, 775583, 758056, 741761, 728336, 718067, 710340, 704188, 697917, 689881, 680717, 673381, 669672, 667865, 665156, 661302, 658010, 655598, 652526, 648182, 643941, 640951, 638529, 635536, 631970, 628451, 625191, 622343, 620475, 619892, 620165, 621123, 623629, 628534, 635220, 641879, 646959, 649850, 650633, 649814, 648171, 646439, 645231, 645256, 646875, 649172, 650283, 649379, 647665, 646683, 646286, 645263, 643393, 641549, 639906]
60542F39906k544m261n332n116m211l265k455j946j893j999j834j414q47L17K376
60527F05482M380M880L974L401M254N678O500P055Q345J0167J1433J2149J3642
60514G01340J6566J9873K2325K4047K5839K7734K9286L0697L2469L3897L3071
60503I97144K8863K2275J5437R742N138P34m183r246j2801j3121j0192n840j850
60490A022100J517M868Q431J2144J6275K1068K6112L0877L5415L9690M2689M3340
60478A304526M2051L9900L6411K9658J9231P779j309o874r949j1637j2171j1574
60466A426042j0100q170o628o720q846j1471j2305j0706q061n673l304k32L292
60453A337118O596R907J4013J8781K3130K6657L0422L5668M2553N0608N9839P0478
$$ y = [639906, 637362, 633101, 627769, 622653, 618442, 615177, 612722, 610776, 608883, 606884, 605050, 603636, 602789, 603106, 605482, 609862, 614742, 618716, 622117, 626371, 632049, 638549, 645604, 653949, 664116, 675549, 687698, 701340, 717906, 737779, 760104, 784151, 809990, 837724, 867010, 897707, 930176, 964073, 997144, 1026007, 1048282, 1063719, 1073461, 1078599, 1079333, 1075150, 1065904, 1053103, 1039982, 1029790, 1023950, 1022100, 1023617, 1028485, 1036916, 1049060, 1065335, 1086403, 1112515, 1143392, 1178807, 1218497, 1261186, 1304526, 1346577, 1386477, 1422888, 1452546, 1471777, 1479556, 1478247, 1471373, 1461424, 1449787, 1437616, 1426042, 1415942, 1407772, 1401144, 1394424, 1385578, 1374107, 1361802, 1351096, 1343035, 1337362, 1334058, 1333826, 1337118, 1343714, 1353621, 1367634, 1386415, 1409545, 1436202, 1466624, 1502292, 1544845, 1595453, 1655292, 1725770]
60441A725770Q1961R2962J02514J10452J16782J21321J24051J25041J23672J18526
60431B843052J08573R4103P6110N5128L1152M419k4034n2366p8350j00285j17826
60420B839676j31436j40812j44683j42753j37005j30147j23213j15667j07297
60411A666663r8818r0788q3183p6117o9913o4356n8925n3820m9699m6213m2001
60400I32830l6570l1161k7218k4833k3150k1431j9237j6472j3864j2488j2259
60389F94147j1760j0201q611q253q693q461o977m921l270k814l859n437n516l232
60375F02142m28J93j901n000p458q718q525o953n281n088o125o467n171l332k095
60360E29793j229m55n19j793k952k592j364j133k495m347n455n299l680r32J574
$$ y = [1725770, 1807731, 1900693, 2003207, 2113659, 2230441, 2351762, 2475813, 2600854, 2724526, 2843052, 2951625, 3045728, 3121838, 3176966, 3208118, 3212537, 3188503, 3136137, 3057787, 2957502, 2839676, 2708240, 2567428, 2422745, 2279992, 2142987, 2012840, 1889627, 1773960, 1666663, 1567845, 1477057, 1393874, 1317757, 1247844, 1183488, 1124563, 1070743, 1021044, 974831, 932830, 896260, 865099, 837881, 813048, 789898, 768467, 749230, 732758, 718894, 706406, 694147, 682387, 672186, 663575, 655322, 646629, 638168, 631191, 626270, 623000, 620186, 616327, 610890, 605374, 602142, 601714, 601907, 600006, 595006, 587548, 578830, 570305, 563352, 558071, 552983, 546858, 540391, 535220, 531888, 529793, 528564, 528109, 527590, 525797, 522845, 520253, 518889, 517756, 515261, 510914, 505459, 500160, 496480, 495548, 497122]
60345D97122K324J383K10k54l08k86P0N09j28k174l874l067Q0L090L874K615R19
60328E02105k0p1L19N83L44k44m43L13J613K310J768N66k07k15j39n67j030m85
60310E06500J167K580K419J119N23J585L036K885R68p66m73J602L584L897K556
60295E33182R11L79J130J984J922J646K756N185O609N327K752J622K259K446J057
60280E71167k11L47J667J513j28j181n94M92R38J261K365L815M493M216L774L683
60264E97617L817L988M073L722K840K465M175Q142J2368J4546J4428J3821J4454
60251G00456J6343J8340J9763K1209K3876K8281L3577L8000M0053L9358L6395
60240A015651L1627K5070J6616O499m622j5707k5358l2242l5839l6639l5409l2617
$$ y = [497122, 499446, 500829, 501039, 500785, 500477, 500191, 500261, 500770, 500642, 498468, 494594, 491527, 491607, 494697, 498571, 501186, 502105, 502085, 502014, 502333, 502916, 503260, 503016, 502573, 502886, 504499, 506809, 508577, 509143, 508936, 508721, 508582, 508015, 506985, 506500, 507667, 510247, 512666, 513785, 514308, 515893, 518929, 521814, 522782, 522016, 521543, 523145, 526729, 530626, 533182, 534093, 534472, 535602, 537586, 539508, 541154, 543910, 549095, 555704, 561031, 563783, 565405, 567664, 570110, 571167, 570956, 571303, 572970, 574483, 574355, 573174, 572580, 573072, 574010, 575271, 577636, 581451, 585944, 590160, 593934, 597617, 601434, 605422, 609495, 613217, 616057, 618522, 622697, 630839, 643207, 657753, 672181, 686002, 700456, 716799, 735139, 754902, 776111, 799987, 828268, 861845, 899845, 939898, 979256, 1015651, 1047278, 1072348, 1088964, 1095463, 1090841, 1075134, 1049776, 1017534, 981695, 945056, 909647, 877030]
60228H77030k8858k5317k3026k1740k0310j8279j6329j4988j3778j2148j0455
60217F71802r316q561p615o528n746n190m442l561k847k007q00k13j564m157n401
60202F03854m049j906j321k183k768k592k651l162k962j446K70P57K0p98q58l48
60186E77857j20p85j977k494j595Q1J337J852K083K158J871J732K726M723O212
60171E95661O081M842L597K665J810J082P43P82R52R36L61p24j325m29J345K167
60155F20546J496Q73J558K626K528J358L72J43N21J600L278M434M158L306L367
60140F52164M065L776K192R45J302K690L849M202L709K501J079N6n76j043q42
60125F80069P03K843L814L021J583M89k69n00N18K368L198K218J015J188J968
$$ y = [877030, 848172, 822855, 799829, 778089, 757779, 739500, 723171, 708183, 694405, 682257, 671802, 662486, 653925, 646310, 639782, 634036, 628846, 624404, 620843, 617996, 615989, 615189, 614976, 613412, 609255, 603854, 599805, 597899, 596578, 594395, 591627, 589035, 586384, 583222, 580260, 578814, 579084, 579841, 579861, 579063, 578205, 577857, 577737, 576952, 574975, 572481, 570886, 570967, 572304, 574156, 576239, 578397, 580268, 582000, 584726, 589449, 595661, 601742, 606584, 610181, 612846, 614656, 615738, 616481, 617263, 618215, 619151, 619512, 618788, 617463, 617034, 618379, 620546, 622042, 622915, 624473, 627099, 629627, 630985, 631357, 631500, 632021, 633621, 636899, 641333, 645491, 648797, 652164, 656229, 660005, 662197, 663142, 664444, 667134, 670983, 675185, 678894, 681395, 682474, 682530, 681954, 680911, 680069, 680772, 683615, 687429, 690450, 692033, 692522, 692253, 691753, 692271, 694639, 697837, 700055, 701070, 702258, 704226]
60110G04226J710O07P7K06k79j607k351j470L29J702K171K156K297L123M615N807
60094G23319N421L250N46j301k011k075j621k35K030M082M662L790K815K819L458
60079G48949L735L464L224L224L104K771K489K118J274K46l17p66k137m169n123
60064G62086m242k871k128j065J361L904M617L987M262N916O928N865L823K712
60050G95155L015M011N017N547N152L866K421J460Q94K75o41j829k984l493l052
60035H14814k414k730l955m626l604j380P91K277L069K998J792j69j796k255j710
60020H01102j066r84j336j610j746k100k598k565j771j073j342k241k794k850
60006G75026l077l806m822o173q073r902j0489r642q440p672p038o337o239p099
$$ y = [704226, 705936, 706543, 706620, 706826, 706547, 704940, 702589, 701119, 701448, 703150, 705321, 707477, 709774, 712897, 717512, 723319, 728740, 731990, 732536, 731235, 729224, 727149, 725528, 725293, 727323, 731405, 736067, 739857, 742672, 745491, 748949, 752684, 756148, 759372, 762596, 765700, 768471, 770960, 773078, 774352, 774598, 774281, 773515, 771378, 767209, 762086, 757844, 754973, 752845, 751780, 753141, 757045, 761662, 765649, 769911, 775827, 782755, 788620, 792443, 795155, 798170, 802181, 807198, 812745, 817897, 821763, 824184, 825644, 826538, 826813, 826172, 824343, 821359, 817866, 814814, 812400, 809670, 805715, 801089, 797485, 796105, 796896, 799173, 802242, 805240, 807032, 806863, 805067, 802812, 801102, 800036, 799052, 797716, 796106, 794360, 792260, 789662, 787097, 785326, 784253, 782911, 780670, 777876, 775026, 771949, 768143, 763321, 757148, 749075, 739173, 728684, 719042, 710602, 702930, 695892, 689555, 683316, 676217]
59992F76217p849p201n358l617k547j612m14O54J132J083P38J09p26j365j430
59977F47814r63k96L03P43R59R23O92L74J67M10J357K552K729R09k214m637n116
59960F46706m362l664l129k319j967l322n658o321m216j601j119k183k140j97
59946F04508J789K242J660J187J070J120J436J861J764R90L20L69P45Q30O62N86
59930F23139P17J267K648M682O304O683O094N135L816K101P58O82J618K294J750
59915F69688P8j925l241l104j718l93k07o36k53J072J685L50j786k455j150L52
59899F56357N53J09L36Q51K86j099j334K92J909J669K61n17m40m18l47N55J716
59882F60739J634L68m32k31l34j312j768o69Q90J456J192P37m33k800m984n086
$$ y = [676217, 668368, 661167, 655809, 652192, 649645, 648033, 647619, 648273, 649405, 650488, 651226, 651335, 650609, 649244, 647814, 646851, 646555, 646858, 647601, 648560, 649483, 650175, 650549, 650716, 651126, 652483, 655035, 657764, 658673, 656459, 651822, 646706, 642344, 638680, 635551, 633232, 631265, 627943, 622285, 615964, 611748, 610147, 609028, 606845, 604705, 604508, 606297, 608539, 610199, 611386, 612456, 613576, 615012, 616873, 618637, 619627, 619947, 620316, 621061, 621891, 622553, 623139, 623856, 625123, 627771, 632453, 638757, 645440, 651534, 656669, 660485, 662586, 663344, 664026, 665644, 667938, 669688, 669766, 667841, 664600, 661496, 659778, 659385, 659178, 658542, 658289, 659361, 661046, 661396, 659610, 657155, 656005, 656357, 656910, 657019, 657355, 658206, 658492, 657393, 656059, 656351, 658260, 659929, 660190, 659673, 659233, 658815, 658468, 659023, 660739, 662373, 662741, 662309, 662078, 661744, 660432, 658664, 657995, 658885, 660341, 661533, 662270, 661837, 659037, 654053, 648967]
59866F48967l296j507o43K0R30J297L93j269k493k393p86J644L487L637K449J349
59850F51786J250J851K473K984L689M703N616N554L773N94k321l052r46K895O440
59835F87289Q056P475N831M469L638K759J882J918L080M189M230L720L586L565
59821G45687K930K132K255L144L584L341L525M570N313M793L891M028M851M343
59807G98387J393k501m554l582j187J37j40k23J396L830M934M080K831K986M938
59792H12725Q087J1775J5210J7026J5988J2246P516L678J329j39j218j552p70
59779I01901M20O07r41l918p793j2088j5757j7460j7076j6045j5559j5146j3791
59766G67354j1651r692q220o891n815n580o332p567q707r162q291o216m301l853
$$ y = [648967, 645671, 644164, 643521, 643541, 644471, 645768, 646161, 644892, 642399, 640006, 639220, 640864, 644351, 647988, 650437, 651786, 653036, 654887, 657360, 660344, 664033, 668736, 674352, 679906, 683679, 684273, 681952, 678900, 677954, 680849, 687289, 695345, 702820, 708651, 713120, 716758, 719517, 721399, 723317, 726397, 730586, 734816, 738536, 742122, 745687, 748617, 750749, 753004, 756148, 759732, 763073, 766598, 771168, 776481, 781274, 785165, 789193, 794044, 798387, 799780, 797279, 792725, 789143, 787956, 788093, 787953, 787730, 789126, 792956, 797890, 801970, 804801, 807787, 812725, 820812, 832587, 847797, 864823, 880811, 893057, 900573, 904251, 905580, 905441, 904223, 902671, 901901, 902321, 902928, 901987, 898069, 890276, 878188, 862431, 844971, 827895, 811850, 796291, 781145, 767354, 755703, 746011, 737791, 730900, 725085, 719505, 713173, 705606, 696899, 687737, 679446, 673230, 668929, 665076]
59752F65076m585n282n591o040o669o833o326n387l760j264P89M47k126m326m328
59737F03795l225l065m035m806m632l759k414p96K34k20j705k619k095q48p4j22
59721E69614n90j066j397j438j107p03q33j768k979l594l446l227l364l192j845
59706E39065K89J803J933J181J68j087k401k865j921m49J79j67l42M92K071L735
59690E41684N050N580M982L804L426M432N550N088L159J459R22P09q9r77j067
59675E83712o20l72l7J121K591L058K518K272K433J284j920n068n555l570j536
59660E80311r49j230j332r67k19P76J581J699J294R30Q34R25J289J803J760Q30
59644E89335M1O49K288L444L569L458L595L600L471L911M947N608N464N317N583
$$ y = [665076, 660491, 655209, 649618, 643578, 636909, 630076, 623750, 618363, 614603, 613339, 614128, 614575, 612449, 608123, 603795, 600570, 597505, 593470, 588664, 584032, 580273, 577859, 577063, 577297, 577077, 575372, 572753, 570658, 569810, 569736, 569614, 569024, 567958, 566561, 565123, 564016, 563313, 562480, 560712, 557733, 554139, 550693, 547466, 544102, 540910, 539065, 539354, 541157, 543090, 544271, 544439, 543352, 540951, 538086, 536165, 535716, 535895, 535728, 535386, 535878, 537949, 541684, 546734, 552314, 557296, 561100, 564526, 568958, 574508, 579596, 582755, 584214, 585136, 585845, 585756, 584779, 583712, 583092, 582720, 582683, 583804, 586395, 589453, 591971, 594243, 596676, 597960, 596040, 590972, 585417, 581847, 580311, 579362, 578132, 576800, 575833, 575614, 576390, 577971, 579670, 580964, 581894, 582728, 583653, 584942, 586745, 588505, 589335, 589376, 590025, 592313, 595757, 599326, 602784, 606379, 609979, 613450, 617361, 622308, 627916, 633380, 638697, 644280]
59629F44280N149K862o01l203l600k118j43R76P83n8n79n83m91l38K91J280J868
59612F45775J725J304Q27n2j262j967j734j313j733l126m780n736n235l431j683
59597F17579j112q56P85L309L983J621j426k322j142L55J747L525M753L774J113
59582F35686o50l45M63Q6j061j787k060k415k533j836q92q25j462j324J30J337
59566F20512M81j975l599k887r49J75J72M20J626K656K083l0k445m195n080n151
59550F01814m464l297k060j042l62k3J51L15K50m10j340j511m41R65J371N73l53
59533E90136l68M48J094Q07l8k80N16J259O60q84j723j295q41j464k587l069k893
59516E79478k782k897k863k639k487k423k383k530k798k621j745q30n22n29l50
$$ y = [644280, 649429, 652291, 651690, 648487, 644887, 642769, 642626, 643602, 644385, 644327, 643748, 643165, 642674, 642336, 642627, 643907, 645775, 647500, 648804, 649631, 649579, 648317, 646350, 644616, 643303, 641570, 638444, 633664, 627928, 622693, 619262, 617579, 616467, 615611, 616396, 619705, 623688, 625309, 623883, 621561, 620419, 620774, 622521, 626046, 630799, 634573, 635686, 635036, 634691, 635154, 635240, 634179, 632392, 630332, 627917, 625384, 623548, 622656, 621831, 620369, 619045, 619175, 620512, 620993, 619018, 615419, 612532, 611583, 611758, 611930, 612350, 613976, 616632, 618715, 618685, 616240, 612045, 606965, 601814, 597350, 594053, 591993, 590951, 590589, 590566, 590717, 591032, 591282, 590872, 589532, 588021, 587580, 588545, 589916, 590489, 590136, 589768, 590216, 591310, 592117, 592079, 591799, 592315, 593574, 594234, 593350, 591627, 590332, 589491, 588027, 585440, 582371, 579478, 576696, 573799, 570936, 568297, 565810, 563387, 561004, 558474, 555676, 553055, 551310, 550480, 549958, 549429, 549079]
59501E49079k57o31r31m00N92J124J319K121L681N146O077O823P335O856N327
59486E93261M005M094N445P136Q809J0690J2783J4625J5862J6695J7617J8847
59474G29869J9781J9020J5218Q335K58o044q537p731o184n886o266n364k787m46
59460G43236m8r24j175k39O85M50o50j305m95J427K733J791j162m222n967o625
59444G27510o761o115m672l720m410n929o523n940n408n530n674n424n159m936
59430F51309m152k668j272n83l18J7M63R31J424J715J452Q68Q83K253M880P812
59414F65014R650R410P636O166N953N665L533K04j784j232M10J315J438J899L181
59399G18458M707N663N779N593O031P374Q870R833J0682J2101J3743J4857J5722
$$ y = [549079, 548822, 548191, 547260, 546860, 547452, 548576, 549895, 552016, 555697, 560843, 566920, 573743, 581078, 587934, 593261, 597266, 601360, 606805, 613941, 622750, 633440, 646223, 660848, 676710, 693405, 711022, 729869, 749650, 768670, 783888, 792223, 792481, 786437, 777900, 770169, 763985, 758099, 751833, 746469, 743682, 743236, 743188, 742264, 741089, 740850, 741535, 741985, 741335, 740030, 739535, 740962, 743695, 745486, 744324, 740102, 734135, 727510, 720749, 714634, 709962, 706242, 701832, 695903, 689380, 683440, 678032, 672502, 666828, 661404, 656245, 651309, 647157, 644489, 643217, 642634, 642316, 642333, 642796, 643727, 645151, 646866, 648318, 649186, 650069, 652322, 657202, 665014, 674664, 684074, 691710, 697876, 703829, 709494, 713027, 713231, 711447, 710215, 710625, 711940, 713378, 715277, 718458, 723165, 728828, 734607, 740200, 746231, 753605, 762475, 772308, 782990, 795091, 808834, 823691, 839413]
59386H39413J6988J7982J7244J4671J1566Q443M606J85l298n084o316q156j0237
59373H98007j1767j2793j3353j2737j0708q487p404p347p295o559m880k330K63
59360G92610J850K771M562P525J0125J1699J3979J8425K3687K7456K9373L0013
59348I74075K8307K2546J3530M278l139q466j1263j0652p349l635n40K857O378
59335A006927P008J840q327j9556k8167l2640l3231l1314k8783k6850k5110k2424
59323G59373j8655j5017j2694j1558j0387q209n362l179k472k519j899l51Q13
59310F67884L14j527l223l799l591l402l326k677r90J198K786L160K614J841J449
59295F58711J880L182M744N859O752Q232J0105J1038J0618J0420J1808J3670J3924
$$ y = [839413, 856401, 874383, 891627, 906298, 917864, 926307, 930913, 931098, 927800, 922716, 916400, 908244, 898007, 886240, 873447, 860094, 847357, 836649, 828162, 820758, 813411, 806116, 799557, 794677, 792347, 792610, 794460, 797231, 801793, 809318, 819443, 831142, 845121, 863546, 887233, 914689, 944062, 974075, 1002382, 1024928, 1038458, 1042736, 1039597, 1031131, 1019868, 1009216, 1001867, 998232, 997692, 1000549, 1006927, 1013935, 1015775, 1007448, 987892, 959725, 927085, 893854, 862540, 833757, 806907, 781797, 759373, 740718, 725701, 713007, 701449, 691062, 682853, 677491, 674312, 671840, 669321, 667422, 667071, 667884, 668198, 666671, 663448, 659649, 656058, 652656, 649330, 646653, 645663, 646861, 649647, 652807, 655421, 657262, 658711, 660591, 663773, 668517, 674376, 681128, 689360, 699465, 710503, 721121, 731541, 743349, 757019, 770943]
59282G70943J2712J2226J3474J5122J5881J6195J6691J6660J5310J3421J2396
59271I31031J2333J2148J1037Q813N517J826o91j137q66k123n142p832q509p593
59257I48812o295m970l556k526k357k539k075o09J562M208P055R377J0590J1140
59243I67817J2113J4007J6521J9279K1691K2189J8873J1468J902p388j4968k0041
59231A063463k1961k1121j9427j8580j8281j7118j4880j2711j1211r784q036o471
59219H83882n253l456m19K847M578M298L301L239M716P063R098J0106J0330J0451
59205I44781J0583J0190R003P561O439N513M383L152K245J569M59j507l940o031
59191I94400p319q034q699r437r806r403q467p628p237p240p494p737p507o603
$$ y = [770943, 783655, 795881, 809355, 824477, 840358, 856553, 873244, 889904, 905214, 918635, 931031, 943364, 955512, 966549, 975362, 980879, 982705, 982014, 980877, 980011, 977888, 972746, 964914, 956405, 948812, 942517, 937547, 933991, 931465, 929108, 926569, 924494, 923885, 925447, 929655, 936710, 946087, 956677, 967817, 979930, 993937, 1010458, 1029737, 1051428, 1073617, 1092490, 1103958, 1105860, 1098472, 1083504, 1063463, 1041502, 1020381, 1000954, 982374, 964093, 946975, 932095, 919384, 908173, 898389, 890353, 883882, 878629, 875173, 874754, 877601, 882179, 886477, 889778, 893017, 897733, 904796, 913894, 924000, 934330, 944781, 955364, 965554, 974557, 982118, 988557, 994070, 998453, 1001605, 1003850, 1005419, 1005878, 1004371, 1000431, 994400, 987081, 979047, 970348, 960911, 951105, 941702, 933235, 925607, 918370, 911130, 903636, 895899, 888392, 881789]
59177H81789n459m493l377j798o27j097k743l538k509r93n86j188j887k632l735
59162H45127m690m844m687n100n792n817n412n858p560r453j0378r953q210n635
59148G51738l639l631n232o542o469n596m584l188j603j192k648m459m600l118
59134F95237j653r41l35L94N25J38Q35L533O468O819M295J821K138M706O811P124
59118G37915O814P089P213O068M554M758O888Q791Q947Q349Q525R059Q593P407
59104H40970P136Q087Q657P877O963P428Q867R723R463Q720P738O066L899K395
59090I43989K247K752K798K082Q76p88k954n085o167n661m115k884l156m797o148
59075I12989n541l312j623j929l316l944l291k114r17K83J176J499K036L786O097
$$ y = [881789, 876330, 871837, 868460, 866662, 866035, 864938, 862195, 858657, 856148, 855155, 854569, 853381, 851494, 848862, 845127, 840437, 835593, 830906, 825806, 820014, 814197, 808785, 802927, 795367, 785914, 775536, 765583, 757373, 751738, 748099, 744468, 739236, 732694, 726225, 720629, 716045, 712857, 711254, 710062, 707414, 702955, 698355, 695237, 693584, 692643, 692308, 692702, 693227, 693365, 694200, 697733, 704201, 711020, 715315, 717136, 719274, 723980, 730791, 737915, 744729, 751818, 759031, 765099, 769653, 774411, 781299, 790090, 799037, 807386, 815911, 824970, 833563, 840970, 848106, 856193, 864850, 872727, 879690, 887118, 895985, 905708, 915171, 923891, 931629, 937695, 941594, 943989, 946236, 948988, 951786, 953868, 954744, 953956, 951002, 945917, 939750, 934089, 929974, 927090, 923934, 919137, 912989, 907448, 904136, 902513, 900584, 897268, 893324, 890033, 887919, 887002, 887285, 888461, 889960, 891996, 895782, 901879]
59060I01879P173O813P056R336J2450J4433J5198J5870J6356J5450J3146J1208
59048A046368J0955J1689J1834J0870R498Q396P561O824O403O542O733N879L658
59035A153210J371O68J365J436n21l569n732o260n895n468n283n660p088r566
59021A103008j2291j4238j4870j4527j4357j5512j7856j9720j9444j7094j4194
59010I28905j2079j1044j0839j1237j1954j2507j2463j1607r989p868n534l193
58998H08591j385j285l606o873q048n856k601j469k746m125m176l662l367k665
58984G56727j016N97Q78L7n87j68J110K644L736L714K570J369J377K811M769O241
58968G86809O754O279N168M281M614O374Q623J0122J0599J0898J1764J2749J2758
$$ y = [901879, 909052, 915865, 922921, 932257, 944707, 959140, 974338, 990208, 1006564, 1022014, 1035160, 1046368, 1057323, 1069012, 1080846, 1091716, 1101214, 1109610, 1117171, 1123995, 1130398, 1136940, 1143673, 1149552, 1153210, 1154581, 1155249, 1156614, 1158050, 1157529, 1153960, 1148228, 1141968, 1136073, 1130605, 1125322, 1119662, 1112574, 1103008, 1090717, 1076479, 1061609, 1047082, 1032725, 1017213, 999357, 979637, 960193, 943099, 928905, 916826, 905782, 894943, 883706, 871752, 859245, 846782, 835175, 825186, 817318, 811784, 808591, 807206, 805921, 802315, 795442, 787394, 781538, 778937, 777468, 774722, 770597, 766421, 762759, 759392, 756727, 755711, 756308, 757186, 757223, 756636, 756468, 757578, 760222, 763958, 767672, 770242, 771611, 772988, 775799, 780568, 786809, 793563, 799842, 805010, 809291, 813905, 820279, 828902, 839024, 849623, 860521, 872285, 885034, 897792]
58955H97792J1505R954R159R126R105Q545P471O310N702N985O565O320M964L335
58941A001838J906R3k042k621k23L345M703L328K188L371N155M691J934q58k427
58926A024381l422m410m856m401l675l339l179k726k167k114k784l722m057k995
58912I76534m85K364M006L959L292L242L708L746L300L568N311P628R016R169
58898A038358Q812Q170O789M939L902M118M189K691K39j497k353l654n747p102
58884A061854o498m797l620l126k307r57o7l23j327k696m871q111j1306j2882
58870I98966j2643j1733j0755r194p139o236p636r879j0310q288n456l178j549
58857H94970r74k334m702n072k032J954L694L352L314M203M601M220M623O523
$$ y = [897792, 909297, 919251, 928410, 937536, 946641, 955186, 962657, 968967, 974669, 980654, 987219, 993539, 998503, 1001838, 1003744, 1003837, 1001795, 999174, 998951, 1002296, 1006999, 1010327, 1012515, 1015886, 1021041, 1025732, 1027666, 1026808, 1024381, 1020959, 1016549, 1011693, 1007292, 1003617, 1000278, 997099, 994373, 992206, 990092, 987308, 983586, 979529, 976534, 976049, 978413, 982419, 986378, 989670, 992912, 996620, 1000366, 1003666, 1007234, 1012545, 1020173, 1029189, 1038358, 1047170, 1055340, 1062129, 1067068, 1070970, 1075088, 1079277, 1081968, 1082207, 1080710, 1078357, 1074703, 1068956, 1061854, 1055356, 1050559, 1046939, 1043813, 1041506, 1040549, 1040482, 1040159, 1038832, 1036136, 1031265, 1023154, 1011848, 998966, 986323, 974590, 963835, 954641, 947502, 941266, 933630, 923751, 913441, 905153, 899697, 896519, 894970, 893996, 891662, 886960, 881888, 879856, 881810, 885504, 888856, 892170, 896373, 900974, 905194, 909817, 916340]
58843I16340Q614R799J0588J1581J2297J2372J2412J2677J2286J0762R171Q647
58831A047546Q804Q728Q658R388J0652J1391J1421J1705J2950J4656J5727J5491
58819A187117J4118J2314J0701R301P621N225K071j485m783p071q129q463q652
58806A209885q849r388j1078j3924j6252j6494j5383j4855j5065j4470j2825j1951
58794A049351j2852j4168j4558j4714j5588j6304j5543j3933j3189j3587j3898
58783H91017j3427j2582j1687j0548r177p958p067o503o329o268n514l833k378
58770G87746k465l911n418o163o076n013k859l48J238J246k9j843l181k966j179
58755G48779O02Q03k17q99q82j347k904m450m574l181j130Q84K478L112K366O97
$$ y = [916340, 924954, 934753, 945341, 956922, 969219, 981591, 994003, 1006680, 1018966, 1029728, 1038899, 1047546, 1056350, 1065078, 1073736, 1083124, 1093776, 1105167, 1116588, 1128293, 1141243, 1155899, 1171626, 1187117, 1201235, 1213549, 1224250, 1233551, 1241172, 1246397, 1248468, 1246983, 1242200, 1235129, 1227000, 1218537, 1209885, 1201036, 1191648, 1180570, 1166646, 1150394, 1133900, 1118517, 1103662, 1088597, 1074127, 1061302, 1049351, 1036499, 1022331, 1007773, 993059, 977471, 961167, 945624, 931691, 918502, 904915, 891017, 877590, 865008, 853321, 842773, 833596, 825638, 818571, 812068, 805739, 799471, 793957, 790124, 787746, 785281, 781370, 775952, 769789, 763713, 758700, 755841, 755493, 756731, 757977, 757948, 756105, 752924, 749958, 748779, 749381, 750184, 749967, 749068, 748186, 746839, 743935, 739485, 734911, 731730, 730600, 731484, 733962, 737074, 739440, 740137]
58739G40137n87n16L59L65j317l327l415j142J522K527J812O11l04p62l79J177
58723G36761L294M779N135M892M731M756M551L638K166J275K025L651L889J721
58709G87264j122k365j991j544j557j337q58j047k043k736k440j699j075l75M00
58694G65475N76nk82O59K165L028L387M582P048R306R648Q327P353Q073R639J0276
58678H49255R518Q390P804P823Q526J0271J2544J3669J2622J0456R160R546J0854
58665I80438J1928J2124J1532J0785J0306R522P723N771N518O923P555O045M319
58652A090489M664O164O352N217M850N566N299L133Q46jl74k021m974q015j0489
58637A106706j2569j4438j6088j7532j8713j9542k0067k0168j9315j7428j5636
$$ y = [740137, 739550, 739034, 739393, 739758, 738441, 735114, 731699, 730557, 732079, 734606, 736418, 737029, 736725, 735963, 735584, 736761, 740055, 744834, 749969, 754861, 759592, 764348, 768899, 772537, 774703, 775978, 778003, 781654, 785543, 787264, 786142, 783777, 781786, 780242, 778685, 777348, 776490, 775443, 773400, 770664, 768224, 766525, 765450, 765075, 765475, 766051, 766046, 765764, 766423, 768588, 771616, 775003, 779585, 786633, 795939, 805587, 813914, 821267, 829340, 838979, 849255, 858773, 867163, 874967, 882790, 891316, 901587, 914131, 927800, 940422, 950878, 960038, 969584, 980438, 992366, 1004490, 1016022, 1026807, 1037113, 1046635, 1054358, 1060129, 1065647, 1072570, 1080125, 1086170, 1090489, 1095153, 1101317, 1107669, 1112886, 1117736, 1123302, 1128601, 1131734, 1132580, 1132579, 1132205, 1130184, 1125210, 1117195, 1106706, 1094137, 1079699, 1063611, 1046079, 1027366, 1007824, 987757, 967589, 948274, 930846, 915210]
58626I15210j5123j5450j5191j4006j2768j1809j0591r118q062p284n925m195
58614G85688l397l695l676k734k050k300k210o25J474K405K120J848K343L630
58600G78821N467O979O788M731K504J521J141K47n74j86O65J29j782k939k013
58585H01499o6J162J257Q04J70o73j599k338k805l156l525l650k844p40J735K713
58569G87944J298j268k972l168k628j849m07J912M256N433N054L745K527K116
58555H01993K445K671K048R51P63K386N020O738O337M422K526J513J161J128J524
58540H43626K244K486J650M06k6N11J008R25R64J834K911K906J655N66J061K850
58524H67577M245M316M134N294P548R097R137Q811R111R523R644J0510J2678J4278
$$ y = [915210, 900087, 884637, 869446, 855440, 842672, 830863, 820272, 811154, 803092, 795808, 789883, 785688, 782291, 778596, 774920, 772186, 770136, 767836, 765626, 765001, 766475, 768880, 771000, 772848, 775191, 778821, 784288, 791267, 798055, 802786, 805290, 806811, 807952, 808199, 807625, 807439, 808104, 808233, 806451, 803512, 801499, 801433, 802595, 803852, 804656, 804826, 804153, 802554, 800216, 797411, 794255, 790730, 787080, 784236, 783496, 785231, 787944, 789242, 787974, 785002, 781834, 779206, 777357, 776950, 778862, 783118, 788551, 793605, 797350, 799877, 801993, 804438, 807109, 809157, 810108, 810871, 813257, 818277, 825015, 831352, 835774, 838300, 839813, 840974, 842102, 843626, 845870, 848356, 850006, 850412, 850386, 850897, 851905, 852830, 853794, 855628, 858539, 861445, 863100, 863666, 864727, 867577, 871822, 876138, 880272, 885566, 893114, 902211, 911348, 920159, 929270, 938793, 948437, 958947, 971625, 985903]
58510I85903J3146J0062P772P341P820Q996J1677J5118J7085J7281J8075K0666
58498A140942K2983K2875K1192J9956J9310J8176J6370J4165J1052O810K725m2
58486A316514k246n013p620q766r019r936j1465j2416j2891j3932j5185j5263
58474A192762j4402j4373j5458j5823j4568j3262j3402j4022j3124j0391p337
58463A046600n533n472o509p153o055l427j038l61j066j747j545o35L67J003J182
58448A008611J207J374J465R07l56j501j502r6J963L466L621K576J123k2m37J73
58432A022572J698L045K967J877J845L943O457O812M645J891N18J348M308Q277
58418A072203J1048J1227J0145J0178J1240J0897Q250N536M875N438N324M576
$$ y = [985903, 999049, 1009111, 1016883, 1024224, 1032044, 1041040, 1052717, 1067835, 1084920, 1102201, 1120276, 1140942, 1163925, 1186800, 1207992, 1227948, 1247258, 1265434, 1281804, 1295969, 1307021, 1313831, 1316556, 1316514, 1314268, 1309255, 1301635, 1292869, 1283850, 1273914, 1262449, 1250033, 1237142, 1223210, 1208025, 1192762, 1178360, 1163987, 1148529, 1132706, 1118138, 1104876, 1091474, 1077452, 1064328, 1053937, 1046600, 1041067, 1035595, 1029086, 1021933, 1015878, 1012451, 1011413, 1011052, 1009986, 1008239, 1006694, 1006059, 1006426, 1007429, 1008611, 1009818, 1011192, 1012657, 1013564, 1013208, 1011707, 1010205, 1010109, 1012072, 1015538, 1019159, 1021735, 1022858, 1022836, 1022399, 1022572, 1024270, 1027315, 1030282, 1032159, 1034004, 1037947, 1044404, 1051216, 1055861, 1057752, 1058270, 1059618, 1063926, 1072203, 1083251, 1094478, 1104623, 1114801, 1126041, 1136938, 1145188, 1150724, 1155599, 1161037, 1166361, 1170937]
58406A170937M297L903J640k215m920m675k934k317l255l827k587l37J021P23
58392A155454k69n92J36J337K363K987L139K634J441q6j395k101k029j116M56
58377A162359K081L031L140K994L240L845M227M072L710L733M592O549R441J2243
58363A229257J3517J2895J1641J1045J0766R639P768O537O445O288M975L096J864
58350A335733J419J096Q01J065J959K884L364L418L143K529J777J284J202J344
58336A363018J594K114L075M348N552O303O433O034N373M841M849N548O543P262
58322A432887P709Q355R119R224Q609Q528R771J1078J0679Q990Q132Q927J0083
58309A552091J0457J0399J0404J0147R721J0298J2482J5055J6343J6045J4951
$$ y = [1170937, 1175234, 1179137, 1180777, 1178562, 1173642, 1168967, 1166033, 1163716, 1160461, 1156634, 1154047, 1153710, 1154731, 1155454, 1155185, 1154593, 1154729, 1156066, 1158429, 1161416, 1164555, 1167189, 1168630, 1168544, 1167149, 1165048, 1163019, 1161903, 1162359, 1164440, 1167471, 1170611, 1173605, 1176845, 1180690, 1184917, 1188989, 1192699, 1196432, 1201024, 1207573, 1217014, 1229257, 1242774, 1255669, 1267310, 1278355, 1289121, 1298760, 1306528, 1313065, 1319510, 1325798, 1330773, 1333869, 1335733, 1337152, 1338248, 1339049, 1340114, 1342073, 1344957, 1348321, 1351739, 1354882, 1357411, 1359188, 1360472, 1361674, 1363018, 1364612, 1366726, 1369801, 1374149, 1379701, 1386004, 1392437, 1398471, 1403844, 1408685, 1413534, 1419082, 1425625, 1432887, 1440596, 1448951, 1458070, 1467294, 1475903, 1484431, 1494202, 1505280, 1515959, 1524949, 1533081, 1542008, 1552091, 1562548, 1572947, 1583351, 1593498, 1603219, 1613517, 1625999, 1641054, 1657397, 1673442, 1688393]
58298A688393J3779J3117J3528J4854J6083J6615J6872J7130J6806J5640J4512
58287A857329J4192J4184J3789J3495J4306J6364J8960K1253K2416K2009K0891
58276B049188K0752K1983K3095K3097K3245K5279K8819L1750L2523L1209K8968
58265B339908K7389K7628K9357L1106L2042L2521L2706L2101L0974L0551L1049
58254B677332L1191L0525L0376L1422L2462L2886L4125L6862L8908L8199L6143
58243C050431L5607L7037L8993M1081M3673M5869M6478M6430M7616M9888N1545
58232C534648N2311N3418N5134N6455N7121N8024N9835O2702O6679P0935P3578
58221D200840P4129P5044P8641Q3657Q7194Q9027R1390R5221R9404J03304J07564
$$ y = [1688393, 1702172, 1715289, 1728817, 1743671, 1759754, 1776369, 1793241, 1810371, 1827177, 1842817, 1857329, 1871521, 1885705, 1899494, 1912989, 1927295, 1943659, 1962619, 1983872, 2006288, 2028297, 2049188, 2069940, 2091923, 2115018, 2138115, 2161360, 2186639, 2215458, 2247208, 2279731, 2310940, 2339908, 2367297, 2394925, 2424282, 2455388, 2487430, 2519951, 2552657, 2584758, 2615732, 2646283, 2677332, 2708523, 2739048, 2769424, 2800846, 2833308, 2866194, 2900319, 2937181, 2976089, 3014288, 3050431, 3086038, 3123075, 3162068, 3203149, 3246822, 3292691, 3339169, 3385599, 3433215, 3483103, 3534648, 3586959, 3640377, 3695511, 3751966, 3809087, 3867111, 3926946, 3989648, 4056327, 4127262, 4200840, 4274969, 4350013, 4428654, 4512311, 4599505, 4688532, 4779922, 4875143, 4974547, 5077851, 5185415]
58210E185415J12456J17456J22229J26482J29734J32800J38059J46297J54881
58201F365809J61397J67276J75189J84710J93801K02702K12799K23243K32680
58192H119606K42847K56201K71141K84108K95730L10164L28654L48418L68094
58183A0824963L89634M14177M40328M67523M97547N31633N69019O08628O49667
58174A5393119O90812P31765P74664Q21122Q69311R17393R67749J023464J082940
58165B3272339J143128J205842J274969J349528J426381J508311J602011J708976
58157C4491485J826036J954260K099308K263108K443406K641808K864041L112238
58149E3695690L385875L691104M040458M443181M905266N438978O061742O785264
$$ y = [5185415, 5297871, 5415327, 5537556, 5664038, 5793772, 5926572, 6064631, 6210928, 6365809, 6527206, 6694482, 6869671, 7054381, 7248182, 7450884, 7663683, 7886926, 8119606, 8362453, 8618654, 8889795, 9173903, 9469633, 9779797, 10108451, 10456869, 10824963, 11214597, 11628774, 12069102, 12536625, 13034172, 13565805, 14134824, 14743452, 15393119, 16083931, 16815696, 17590360, 18411482, 19280793, 20198186, 21165935, 22189399, 23272339, 24415467, 25621309, 26896278, 28245806, 29672187, 31180498, 32782509, 34491485, 36317521, 38271781, 40371089, 42634197, 45077603, 47719411, 50583452, 53695690, 57081565, 60772669, 64813127, 69256308, 74161574, 79600552, 85662294, 92447558]
58141I2447558P616227Q566348R647558J0856634J2178958J3607089J5137824
58134A70058196J6749909J8405584K0077099K1748120K3381214K4898399K6170498
58127C21489019K6951993K6795375K5111740K1442112J5739564Q419704K02494
58120D46152001q047623j5423931k1147690k4818160k6532876k6734795k5931953
58113B97514973k4531709k2833899k1057982j9338727j7733598j6260760j4923441
58106A60834857j3705367j2574700j1507570j0497434r540862q631463p772113
58099H6605348o977384o257169n608491n026608m512143m062680l668156l319802
58091D7172915l015014k749467k513148k298860k107182j938799j788727j651999
$$ y = [92447558, 100063785, 108630133, 118277691, 129134325, 141313283, 154920372, 170058196, 186808105, 205213689, 225290788, 247038908, 270420122, 295318521, 321489019, 348441012, 375236387, 400348127, 421790239, 437529803, 445949507, 446152001, 438104378, 422680447, 401532757, 376714597, 350181721, 323446926, 297514973, 272983264, 250149365, 229091383, 209752656, 192019058, 175758298, 160834857, 147129490, 134554790, 123047220, 112549786, 103008924, 94377461, 86605348, 79627964, 73370795, 67762304, 62735696, 58223553, 54160873, 50492717, 47172915, 44157901, 41408434, 38895286, 36596426, 34489244, 32550445, 30761718, 29109719]
58083B9109719j528514j418313j318075j226250j146080j079120j020347r63705
58075A9409315r08532q56867q08270p61093p15941o74201o35321n98275n63765
58066A2887050n32552n03437m75001m47875m23713m03105l85466l69689l54426
58057H991786l39022l24212l10452k96380k81070k66695k55920k47402k37339
58048F433294k25099k13621k04415j96055j87806j80695j74350j66835j58543
58039D725875j52405j48998j45233j39238j32854j27744j22742j17004j12272
58030C527385j09640j07072j02614r7521r3784r0832q7028q2522p8381p4514p0432
58019B533045o6706o3954o1646n9208n6964n5011n2764n0451m9115m8304m5981
$$ y = [29109719, 27581205, 26162892, 24844817, 23618567, 22472487, 21393367, 20373020, 19409315, 18500783, 17643916, 16835646, 16074553, 15358612, 14684411, 14049090, 13450815, 12887050, 12354498, 11851061, 11376060, 10928185, 10504472, 10101367, 9715901, 9346212, 8991786, 8652764, 8328552, 8018100, 7721720, 7440650, 7173955, 6918035, 6670633, 6433294, 6208195, 5994574, 5790159, 5594104, 5406298, 5225603, 5051253, 4884418, 4725875, 4573470, 4424472, 4279239, 4140001, 4007147, 3879403, 3756661, 3639657, 3527385, 3417745, 3310673, 3208059, 3110538, 3016754, 2925922, 2838894, 2756372, 2677991, 2603477, 2533045, 2466339, 2402385, 2340739, 2281531, 2224567, 2169556, 2116792, 2066341, 2017226, 1968922, 1922941]
58008A922941m1967l8978l8752l9398l8373l5952l3762l1923k9831k8143k7728
57997A538134k7896k7555k6928k6474k5539k3832k2717k2998k2915k0529j7044
57986A273707j5311j5790j6295j5355j3700j2583j2452j3267j4558j5206j4466
57975A114724j3062j2252j2160j2212j2594j3805j5187j5458j4704j4384j5145
57964I63761j5805j5010j3011j1388j1313j2363j2948j2059j0495r859j0369j0607
57952H18534r686q516q221q424q145p515p333p456o948n697m811n252o671p718
57938G16141p132m785j943j82K21M07J245K218K446K057J901K304K805K841K222
57923G22766J238N52O57J185J202K74j165k545l549l853l364k789k914l265k674
$$ y = [1922941, 1880974, 1841996, 1803244, 1763846, 1725473, 1689521, 1655759, 1623836, 1594005, 1565862, 1538134, 1510238, 1482683, 1455755, 1429281, 1403742, 1379910, 1357193, 1334195, 1311280, 1290751, 1273707, 1258396, 1242606, 1226311, 1210956, 1197256, 1184673, 1172221, 1158954, 1144396, 1129190, 1114724, 1101662, 1089410, 1077250, 1065038, 1052444, 1038639, 1023452, 1007994, 993290, 978906, 963761, 947956, 932946, 919935, 908547, 897234, 884871, 871923, 859864, 849369, 839510, 829141, 818534, 808848, 800332, 792111, 783687, 775542, 768027, 760694, 753238, 746290, 740593, 735782, 730530, 723859, 716141, 709009, 704224, 702281, 702099, 702320, 702727, 703972, 706190, 708636, 710693, 712594, 714898, 717703, 720544, 722766, 724004, 724556, 725213, 726398, 727600, 727874, 726709, 724164, 720615, 716762, 713398, 710609, 707695, 704430, 701756]
57908G01756j371j066k487m273n032n146n518n831n303m194l385l234l773n207
57894F45936p041p677o133l718k710l788n672o830o573n026l108k105k234k074
57880E81247l42K180L569L219K324K144K818L771M375M249L651L455M141N070
57866F25871N293M714L785K511O07j702l764n221o012o037n487n137n558o285
57852E97578o510o319o583p746r255j0072r522q083p406q856j1672j3422j2702
57839D79430j0422q071o046m457m025m774n042l426r10N60Q23J071J345N06j415
57824D35147k789k570j382k24N59Q67O48L55M65N46r1r75j048n41o51j315j087
57807D25914L06J094m0k041l114k997k566k125j304L8J748L761N694O531N624
$$ y = [701756, 700385, 699319, 696832, 692559, 687527, 682381, 676863, 671032, 665729, 661535, 658150, 654916, 651143, 645936, 638895, 631218, 625085, 621367, 618657, 614869, 609197, 602367, 595794, 590768, 587660, 585555, 583321, 581247, 580905, 583085, 586654, 589873, 592197, 594341, 597159, 600930, 605305, 609554, 613205, 616660, 620801, 625871, 631164, 635878, 639663, 642174, 642781, 641079, 637315, 632094, 626082, 620045, 614558, 609421, 603863, 597578, 591068, 584749, 578166, 570420, 561165, 551093, 541571, 533488, 526082, 517226, 505554, 492132, 479430, 469008, 460937, 454891, 450434, 446409, 441635, 436593, 433167, 432257, 432817, 433640, 434711, 436056, 436562, 435147, 432358, 429788, 428406, 428182, 428741, 429608, 430256, 430611, 431076, 431622, 431531, 430556, 429508, 428967, 428316, 427001, 425914, 426220, 427314, 427274, 425233, 422119, 419122, 416556, 414431, 413127, 413165, 414913, 418674, 424368, 430899, 436523]
57792D36523L788K656L003M080M499L512J655L59O36J958K775K231Q81l53j268
57777D66935k011k323j807p66k44j027k759m076l793k179q18r09k012k876l055
57762D36280k909k353q20J335K661K350J354J009J242R21l58j738k337k406k885
57747D31346m061n030m735l311j984j577j787k253l482n830q129q590p000m945
57733C68632l788l503l611m053m667m773m022k923k045j312o00k85o36j223j544
57718C29647j609j368k41J991M323N497N524N429N596N322M076K382J151O86P26
57703C69132J021J343J155j54k404m341m700l652k729l079m218m880m774m742
57689C32978n274n633m808k772m54J231J941J763R74O5l48J36J270K256K418J712
$$ y = [436523, 440311, 442967, 445970, 450050, 454549, 458061, 459716, 460075, 460711, 462669, 465444, 467675, 468556, 468203, 466935, 464924, 462601, 460794, 460028, 459784, 458757, 455998, 451922, 448129, 445950, 445132, 444223, 442211, 439335, 436280, 433371, 431018, 430198, 431533, 434194, 436544, 437898, 438907, 440149, 441070, 440712, 438974, 436637, 434231, 431346, 427285, 422255, 417520, 414209, 412225, 410648, 408861, 406608, 403126, 397296, 389167, 380577, 373577, 368632, 364844, 361341, 357730, 353677, 349010, 344237, 340215, 337292, 335247, 333935, 333335, 333050, 332414, 331191, 329647, 328038, 326670, 326429, 328420, 332743, 338240, 343764, 349193, 354789, 360111, 364187, 366569, 367720, 368406, 369132, 370153, 371496, 372651, 372497, 370093, 365752, 361052, 357400, 354671, 351592, 347374, 342494, 337720, 332978, 327704, 322071, 317263, 314491, 314037, 315268, 317209, 318972, 319946, 320011, 319663, 319799, 321069, 323325, 325743, 327455]
57673C27455M79j100k651l112j615R02K215J542O09J002J697P66j415k587j927
57658C22260q51m18R5J328K337J929L56j188j817j173N65K301K703J874J205J194
57642C32700P45o35j562q35O07J226J220J767K844L402L124K494J643O44L86J548
57626C51318L020L003J570N53J048K568M660P547J0983J4050J6551J9124K1607
57613D57602K2997K3604K5561L0081L5701M0481M4564M8781N1515M8877L8310
57602H68074K1094J395j6227k8777l5704l8519l9068l8038l5443l2001k8993k6770
57590E71023k4496k1735j9275j7852j6857j5176j2731j0372q554p104o138o058
57578D04675o468o112m537k891k275k056q98R65J921J314K89r7k11o55r81o68
$$ y = [327455, 327934, 326834, 324183, 321071, 319456, 320358, 322573, 324115, 324724, 325726, 327423, 328189, 326774, 324187, 322260, 321409, 320991, 321086, 322414, 324751, 326680, 327036, 325848, 324031, 322858, 323423, 325724, 328427, 330301, 331506, 332700, 333445, 332810, 331248, 330413, 331020, 332246, 333466, 335233, 338077, 341479, 344603, 347097, 348740, 349384, 349770, 351318, 354338, 357341, 358911, 359464, 360512, 363080, 367740, 375287, 386270, 400320, 416871, 435995, 457602, 480599, 504203, 529764, 559845, 595546, 636027, 680591, 729372, 780887, 829764, 868074, 889168, 890563, 874336, 845559, 809855, 771336, 732268, 694230, 658787, 626786, 597793, 571023, 546527, 524792, 505517, 487665, 470808, 455632, 442901, 432529, 423975, 416871, 410733, 404675, 398207, 392095, 387558, 384667, 382392, 380336, 379438, 380403, 382324, 383638, 383927, 383830, 383619, 382964, 381983, 381315]
57562C81315m35j279k638k911j645L8J200K048K790K764J395p13k381l035k796
57547C73717j871m96Q16J568J684J321M63q23j997k402j956j103k31L91K61j026
57531C68316k827l462j921O73J987J003r62k010j822j449j517j597j359j228j495
57516C50330j620j143n60n25o83k39O27R93P24P42J513K303K300J685J149R46
57500C58542R79J139J136N34l57k31J629L849M064J745r60j546K44K586L756L525
57484C80634K578J462M49n8M21J962M084O002O762N505K327r61j937q2K356K833
57468D14337J494P24J881L747M518M159L860L995L834L107K712L483M974O007
57454D62832O119N971O400P333P871P305N928M701M233M261M116L517K703J956
$$ y = [381315, 380880, 379601, 376963, 374052, 372407, 372445, 373645, 375693, 378483, 381247, 382642, 381929, 379548, 376513, 373717, 371846, 371350, 372166, 373734, 375418, 376739, 377202, 376379, 374382, 371980, 370024, 368921, 368690, 369081, 369342, 368316, 365489, 362027, 360106, 360779, 362766, 363769, 362807, 360797, 358975, 357526, 356009, 354412, 353053, 351825, 350330, 348710, 347567, 347007, 346482, 345799, 345560, 346187, 347180, 347904, 348646, 350159, 352462, 354762, 356447, 357596, 358542, 359521, 360660, 361796, 362330, 361973, 361742, 363371, 367220, 371284, 373029, 372069, 370523, 370767, 373353, 377109, 380634, 383212, 384674, 385123, 385065, 385486, 387448, 391532, 397534, 404296, 409801, 412128, 411167, 409230, 409148, 411504, 414337, 415831, 416555, 418436, 422183, 426701, 430860, 434720, 438715, 442549, 445656, 448368, 451851, 456825, 462832, 468951, 474922, 481322, 488655, 496526, 503831, 509759, 514460, 518693, 522954, 527070, 530587, 533290, 535246]
57440E35246J181R9j296k589l317l374k937j981k42K159M353N336M802L180J113
57425E41733o50j185l6J957L158K813J692Q83O21O85J256K540L909M353L803L291
57409E70823L594M258M251L285K194K106L374N256O595O805O164N213M229L399
57395F31546L039L173L286L000K721K958L310L060K731L802O425Q582Q491O985
57381F93109O225O541O205M503L299M455O811P284M799J731R94K701M471M465
57367G57593L198K354K685L579M351N191O544Q007Q399P104M916L310L156M333
57353H24720O213P998Q826Q346P233O532O347N832M682L921M631O506Q243Q976
57339I19006Q737P930P093O843P288P637P177O428O471P275P672P080O228N970
$$ y = [535246, 536427, 536526, 535230, 532641, 529324, 525950, 523013, 521032, 520790, 522949, 527302, 532638, 537440, 540620, 541733, 541083, 539898, 539862, 541819, 544977, 547790, 549482, 550365, 550986, 551671, 552927, 555467, 559376, 563729, 567532, 570823, 574417, 578675, 582926, 586211, 588405, 590511, 593885, 599141, 605736, 612541, 618705, 623918, 628147, 631546, 634585, 637758, 641044, 644044, 646765, 649723, 653033, 656093, 658824, 662626, 669051, 677633, 686124, 693109, 699334, 705875, 712080, 716583, 719882, 724337, 731148, 738432, 743231, 744962, 745956, 748657, 753128, 757593, 760791, 763145, 765830, 769409, 773760, 778951, 785495, 793502, 801901, 809005, 813921, 817231, 820387, 824720, 830933, 838931, 847757, 856103, 863336, 869868, 876215, 882047, 886729, 890650, 895281, 901787, 910030, 919006, 927743, 935673, 942766, 949609, 956897, 964534, 971711, 978139, 984610, 991885, 999557, 1006637, 1012865, 1018835]
57325A018835O296O894P731Q522Q590P869P326P703Q551R204R807J0493J0290
57312A128111Q275N384L723M053N223O084O740P536Q075P942P540P471P686P973
57298A221816Q682J0178J1895J2701J2136J0827R783R669J0522J1734J2427J2299
57286A354669J1972J2120J2463J2157J1087J0045R613R554R582J0056J1300J2698
57274A487316J3141J2364J1230J0658J0674J0728J0553J0451J0905J2055J3436
57263A613511J4181J3843J3046J2996J4101J5552J6554J7385J8597J9671J9518
57252A788955J8275J7417J7771J8412J8204J7555J7712J8805J9590J9052J7500
57241A989248J6121J5991J7411J9520K0775K0427J9478J9459K0441K1100K0655
$$ y = [1018835, 1025131, 1032025, 1039756, 1048278, 1056868, 1064737, 1072063, 1079766, 1088317, 1097521, 1107328, 1117821, 1128111, 1136386, 1141770, 1145493, 1149546, 1154769, 1160853, 1167593, 1175129, 1183204, 1191146, 1198686, 1206157, 1213843, 1221816, 1230498, 1240676, 1252571, 1265272, 1277408, 1288235, 1298018, 1307687, 1318209, 1329943, 1342370, 1354669, 1366641, 1378761, 1391224, 1403381, 1414468, 1424513, 1434126, 1443680, 1453262, 1463318, 1474618, 1487316, 1500457, 1512821, 1524051, 1534709, 1545383, 1556111, 1566664, 1577115, 1588020, 1600075, 1613511, 1627692, 1641535, 1654581, 1667577, 1681678, 1697230, 1713784, 1731169, 1749766, 1769437, 1788955, 1807230, 1824647, 1842418, 1860830, 1879034, 1896589, 1914301, 1933106, 1952696, 1971748, 1989248, 2005369, 2021360, 2038771, 2058291, 2079066, 2099493, 2118971, 2138430, 2158871, 2179971, 2200626]
57230B200626J9768J9396J9809K1013K2977K4840K5070K3320K1360K1074K2149
57219B441402K2817K2306K1264K0037J8056J5233J2714J1612J1809J2439J2891
57208B622580J2926J2555J2348J3257J5456J7816J9149J9551J9956K0705K1302
57197B807601K1282K0599J9306J7642J6415J6489J7693J8924J9529J9985K0944
57186C016409K2217K3054K2887K1445J8761J5672J3761J4002J5712J7472J8776
57175C220168K0018K1129K1387K0725K0097K0033J9790J8717J7680J8113J9999
57164C437856K1909K2911K3415K3929K4120K3711K3553K4725K6824K8031K7216
57153C708200K5425K4794K6164K8254K9212K8602K7502K7055K7398K7942K8058
$$ y = [2200626, 2220394, 2239790, 2259599, 2280612, 2303589, 2328429, 2353499, 2376819, 2398179, 2419253, 2441402, 2464219, 2486525, 2507789, 2527826, 2545882, 2561115, 2573829, 2585441, 2597250, 2609689, 2622580, 2635506, 2648061, 2660409, 2673666, 2689122, 2706938, 2726087, 2745638, 2765594, 2786299, 2807601, 2828883, 2849482, 2868788, 2886430, 2902845, 2919334, 2937027, 2955951, 2975480, 2995465, 3016409, 3038626, 3061680, 3084567, 3106012, 3124773, 3140445, 3154206, 3168208, 3183920, 3201392, 3220168, 3240186, 3261315, 3282702, 3303427, 3323524, 3343557, 3363347, 3382064, 3399744, 3417857, 3437856, 3459765, 3482676, 3506091, 3530020, 3554140, 3577851, 3601404, 3626129, 3652953, 3680984, 3708200, 3733625, 3758419, 3784583, 3812837, 3842049, 3870651, 3898153, 3925208, 3952606, 3980548, 4008606]
57142D008606K7333K5861K4669K5090K7039K8489K7756K5900K5613K7657K9898
57131D303911L0338K9754L0201L1895L3054L2465L0647K8523K6284K4145K3004
57120D624221K3304K3696K1911J7048J0556M704L16l814r350j6452k3575k9174
57108D643391l3195l6571l9639m1784m2502m2118m1232m0121l8986l8160l7536
57097D211547l6405l4481l2793l2786l4678l7330l9582m1142m2202m2995m3830
57086C793323m4896m5670m5175m3167m0594l8530l7075l5826l4888l4846l5974
57075C356682l8089m1020m4764m9311n4844o1959p0993q1289r1919j03212j16872
57064B602410j34274j55286j79072k05377k34619k67162l03034l41976l83493
$$ y = [4008606, 4035939, 4061800, 4086469, 4111559, 4138598, 4167087, 4194843, 4220743, 4246356, 4274013, 4303911, 4334249, 4364003, 4394204, 4426099, 4459153, 4491618, 4522265, 4550788, 4577072, 4601217, 4624221, 4647525, 4671221, 4693132, 4710180, 4720736, 4725440, 4725756, 4721942, 4712592, 4696140, 4672565, 4643391, 4610196, 4573625, 4533986, 4492202, 4449700, 4407582, 4366350, 4326229, 4287243, 4249083, 4211547, 4175142, 4140661, 4107868, 4075082, 4040404, 4003074, 3963492, 3922350, 3880148, 3837153, 3793323, 3748427, 3702757, 3657582, 3614415, 3573821, 3535291, 3498216, 3462390, 3427502, 3392656, 3356682, 3318593, 3277573, 3232809, 3183498, 3128654, 3066695, 2995702, 2914413, 2822494, 2719282, 2602410, 2468136, 2312850, 2133778, 1928401, 1693782, 1426620, 1123586, 781610, 398117]
57055C98117b9273m74680n27289n86461o51881p23111q01254q88352r85966j095603
57045f763870j220254j363938j529656j719343j936443k187229k478784k816835
57037b2016352l206326l652530m158870m722526n332184n969743o613163p236741
57029f2908435p808506q288340q632510q805706q791829q590282q195790p579366
57021a29600764o692645n498494m006371k286911m57617J349153L018607M473714
57013a39701328N678511O627806P332357P808397Q074254Q150765Q061912P834673
57005h0132653P498678P085158O624247O141290N654376N175119M711616M270604
56997c2971565L857098L473307L119422K795587K502210K238200K000169J784387
$$ y = [398117, -29273, -503953, -1031242, -1617703, -2269584, -2992695, -3793949, -4682301, -5668267, -6763870, -7984124, -9348062, -10877718, -12597061, -14533504, -16720733, -19199517, -22016352, -25222678, -28875208, -33034078, -37756604, -43088788, -49058531, -55671694, -62908435, -70716941, -79005281, -87637791, -96443497, -105235326, -113825608, -122021398, -129600764, -136293409, -141791903, -145798274, -148085185, -148542802, -147193649, -144175042, -139701328, -134022817, -127395011, -120062654, -112254257, -104180003, -96029238, -87967326, -80132653, -72633975, -65548817, -58924570, -52783280, -47128904, -41953785, -37242169, -32971565, -29114467, -25641160, -22521738, -19726151, -17223941, -14985741, -12985572, -11201185]
56989a1201185J588913J413138J255899J115315R90275Q80710P85902P03518O31047
56980a836468N67558N13007b89705A34852L86341L51947L22327K96575K72611
56971A764653K50415K33130K23726K21220K21250K19543K12961J97701J69832
56962C714431J29887Q5463M6508J7836k464j7949k9542l6848m1120m4974m9872
56951C771356n5493o1224o7080p3025p8455q2681q5536q7399q8895r0562r2390
56940B908616r3816r4413r4419r4193r3455r1698q9239q7168q6077q5495q4878
56929A913765q4642q5690q8193r1408r4538r7296r9493j00676j00551r9651r8955
56918H72672r8710r7833r4840q9241q1837p3773o5668n7625m9664m1833l4240
$$ y = [-11201185, -9612272, -8199134, -6943235, -5827920, -4837645, -3956935, -3171033, -2467515, -1836468, -1268910, -755903, -289705, 134852, 521193, 873140, 1195467, 1492042, 1764653, 2015068, 2248198, 2471924, 2693144, 2914394, 3133937, 3346898, 3544599, 3714431, 3844318, 3929781, 3976289, 3994125, 3991661, 3973712, 3944170, 3907322, 3866202, 3821228, 3771356, 3715863, 3654639, 3587559, 3514534, 3436079, 3353398, 3267862, 3180463, 3091568, 3001006, 2908616, 2814800, 2720387, 2625968, 2531775, 2438320, 2346622, 2257383, 2170215, 2084138, 1998643, 1913765, 1829123, 1743433, 1655240, 1563832, 1469294, 1371998, 1272505, 1171829, 1071278, 971627, 872672, 773962, 676129, 581289, 492048, 410211, 336438, 270770, 213145, 163481, 121648, 87408]
56907H7408k7279k1562j7336G167c715p412l818l18K987N792A064P938P157N643
56893B1802L628J199j400l675n180n821D702g03m192j995N11J932J621O08M94
56878a724a05B894L967N032O810Q917J0510J1416J2079J2659J2691J1531Q753
56865A07259M428m51m149n596n621o140p886r535r385p387n093l880l670l353
56851C9541k116l05R07P08n04j513j489n90O09J800K884L676M089M428M999N532
56835F2656N520N080N084O267Q527J1204J3593J5098J5325J4460J3292J2514J2076
56822B00696J1481J0451Q986O979M323J350j224k801l032j717Q09L357M818N655
56808B50131P486J0693J3382J3668J2262J1576J2579J3987J4669J5264J6591J7596
$$ y = [87408, 60129, 38567, 21231, 7167, -3715, -11127, -14945, -15263, -12276, -6484, 1064, 9002, 16159, 21802, 25430, 26629, 25229, 21554, 16374, 10553, 4702, -703, -4895, -6890, -6379, -4447, -2826, -2218, -1724, -105, 2894, 6861, 11893, 18703, 27620, 38130, 49546, 61625, 74284, 86975, 98506, 107259, 111687, 111236, 107087, 101491, 95870, 89730, 81844, 72309, 62924, 55537, 50444, 46564, 42894, 39541, 37425, 37120, 38027, 38735, 38231, 36718, 35229, 34639, 35248, 37048, 39932, 43608, 47697, 52125, 57124, 62656, 68176, 73256, 78340, 84607, 93134, 104338, 117931, 133029, 148354, 162814, 176106, 188620, 200696, 212177, 222628, 231614, 238593, 242916, 244266, 243042, 240241, 237209, 235492, 236301, 239658, 244476, 250131, 257617, 268310, 281692, 295360, 307622, 319198, 331777, 345764, 360433, 375697, 392288, 409884]
56796D09884J6237J2093O959K819N9k097m069n382n408m194k400m47J980N379
56782D31413R452J3247J6293J9172K2513K5879K8204K9202K9681L0361L0674K8937
56770G15028K3659J4864M370n279j2495j7369k0820k3333k4710k4611k2982k0132
56758E86190j6718j3385j0124o300j769K425N112O441P615R377J1502J3575J5202
56745F09143J5390J2713O783r64q319j3881j7404j9216j9754j9411j8529j7426
56733E09125j6366j5271j3750j1816j0177r246q224o031k918j01J956L606M517
56720D25304L662J135j577l759o382j0073j3695j5946j7032j7480j6807j4789
56708C12561j2811j2177j2099j1288j0474j1098j2215j1398q604o582o900q056
$$ y = [409884, 426121, 438214, 445173, 447992, 448051, 445954, 441885, 436503, 431095, 426901, 424501, 424054, 426034, 431413, 440865, 454112, 470405, 489577, 512090, 537969, 566173, 595375, 625056, 655417, 686091, 715028, 738687, 753551, 757921, 752642, 740147, 722778, 701958, 678625, 653915, 629304, 606322, 586190, 569472, 556087, 545963, 539663, 537894, 540319, 545431, 551872, 559487, 568864, 580366, 593941, 609143, 624533, 637246, 644029, 643065, 634746, 620865, 603461, 584245, 564491, 545080, 526551, 509125, 492759, 477488, 463738, 451922, 441745, 432499, 424275, 418244, 415326, 415225, 417181, 420787, 425304, 428966, 430101, 428524, 424765, 418383, 408310, 394615, 378669, 361637, 344157, 327350, 312561, 299750, 287573, 275474, 264186, 253712, 242614, 230399, 219001, 210397, 203815, 196915, 188859]
56696A88859q325q120q311q089o258l419j364j027k135l968n458n362l604j808
56682A21611j439j993j989j120l37l10r06j740k289j766j4J735J990Q15l93p21
56666A11134m85k56j57k46o95j316j428n91Q49K041K276J489L44k90j58K98P05
56649A13514J080J203M23j298k805k971k044j070m75p4Ln57j376j611j118n61
56633A00263l88l19O2Q14J579J684O15j077j948j448p96j131j581o53J028J385
56617I8089J58n86K89J303Q88j81l72Ol84j368j353J45J692J922J107L24l6l68
56599A01275r15j379j372r58n64m32l15J24P82J367K010L154M681N727N553M249
56583A22987K467R75N23J445K992L659K763J309Q12J604K712L130K717K083J983
$$ y = [188859, 180534, 172414, 164103, 156014, 149756, 146337, 144973, 143946, 141811, 137843, 132385, 127023, 123419, 121611, 120172, 118179, 116190, 115070, 114733, 114423, 113517, 111777, 109488, 107722, 107708, 109443, 111433, 112248, 111855, 111134, 110649, 110393, 110236, 109990, 109295, 107979, 106551, 105960, 106809, 108850, 111126, 112615, 112959, 112669, 112511, 112809, 113514, 114594, 115797, 116220, 114922, 112117, 109146, 107102, 106032, 105557, 105483, 105486, 104929, 103553, 101942, 100824, 100263, 99875, 99556, 99618, 100432, 102011, 103695, 104310, 103233, 101285, 99837, 99041, 97910, 96329, 95676, 96704, 98089, 98247, 97661, 97950, 99253, 100141, 99960, 99588, 99594, 99210, 97842, 96489, 96634, 98326, 100248, 101355, 101679, 101643, 101275, 100360, 98981, 97609, 96651, 96087, 95655, 95340, 95464, 96246, 97613, 99623, 102777, 107458, 113185, 118738, 122987, 125454, 126429, 126952, 128397, 131389, 135048, 137811, 139120, 139932, 141536, 144248, 147378, 150095, 152178, 154161]
56568A54161K667L585L937L623L279L223L029K466K143K581L198L023K097J379
56554A94391J397J694J526O03p36j618j071Q32K441J983k71k082j811k24P36L94
56538A98184k83m99p68j782k863k610r82L04P7n55K07K007K599R96j178k043j786
56521A89025j573j420o25L70L96k32K95K616M940N368M289L375K984K010K31p61
56505B11288L61K584L694L149K685L795N723O687O309N730N667N651N274M859
56491B73456M476L436J590K10N30J990K831K078K01j806l127l298k623k193k693
56476B75058l393l141k027j189j212j702k262k821l067k689k191k413l148l394
56462B40409l028k891k941j919M24K279K082P33J77O16O81j35q04n47Q3K96J59
$$ y = [154161, 156828, 160413, 164350, 167973, 171252, 174475, 177504, 179970, 182113, 184694, 187892, 190915, 193012, 194391, 195788, 197482, 199008, 199611, 198875, 197257, 196186, 197018, 199459, 201442, 201171, 199089, 197278, 197054, 197790, 198184, 197901, 197402, 196634, 194852, 191989, 189379, 188397, 188701, 188778, 188223, 188430, 190437, 193036, 194032, 192854, 190811, 189025, 187452, 186032, 185407, 185777, 186173, 185941, 186236, 188852, 193792, 199160, 203449, 206824, 209808, 211818, 212049, 211288, 211649, 214233, 217927, 221076, 223761, 227556, 233279, 239966, 246275, 252005, 257672, 263323, 268597, 273456, 277932, 281368, 282958, 283168, 283698, 285688, 288519, 290597, 290798, 288992, 285865, 282567, 279944, 277751, 275058, 271665, 268524, 266497, 265308, 264096, 262394, 260132, 257311, 254244, 251555, 249364, 246951, 243803, 240409, 237381, 234490, 231549, 229630, 230054, 232333, 234415, 235148, 235325, 235941, 236622, 236487, 235683, 235136, 235219, 235515, 235674]
56445B35674O7j35q29j809k333j872n26J106K277K406J450N3r01j055q92j028
56429B31653j308r63J16Q54K88r51j320m35M83M93K56Q35J916K231J390L83J83
56412B36104O04Q02M53J04N05J777L200L791L162J842Q24Q78K063L603M303L528
56396B67543J879N84J84K36L44O95J342J651J157M18K93P14Q14K32m68o16k02
56379B76800K83L85R9r3L02R52P61p44k425k630j127P48J838K181K234K000J427
56362B82991R07P66O48N2p43r08j56Q46J268R14J81m61o89k96P39K073L071L210
56344B94413K421J054l88j419j719j337p48l97k29J47Q45J622K309K878L059K515
56328C05026J616J336J904K277J622Q03J334L144M509M331L370K833K728K324
$$ y = [235674, 235741, 235606, 234777, 232968, 230635, 228763, 228237, 229343, 231620, 234026, 235476, 235529, 234628, 233573, 232681, 231653, 230345, 229382, 229498, 230352, 230640, 229689, 228369, 227934, 228417, 228910, 229166, 230001, 231917, 234148, 235538, 235921, 236104, 236708, 237510, 237963, 238067, 238572, 240349, 243549, 247340, 250502, 252344, 253168, 254046, 256109, 259712, 264015, 267543, 269422, 270006, 270190, 270426, 270770, 271465, 272807, 274458, 275615, 276033, 276326, 277040, 277854, 278086, 277618, 277002, 276800, 277083, 277468, 277567, 277474, 277776, 278728, 279489, 278745, 276320, 273690, 272563, 273311, 275149, 277330, 279564, 281564, 282991, 283898, 284664, 285312, 285364, 284621, 283713, 283557, 284403, 285671, 286585, 286766, 286305, 285616, 285320, 286059, 288132, 291203, 294413, 296834, 297888, 297500, 296081, 294362, 293025, 292277, 291880, 291651, 291798, 292643, 294265, 296574, 299452, 302511, 305026, 306642, 307978, 309882, 312159, 313781, 314584, 315918, 319062, 323571, 327902, 331272, 334105, 336833, 339157]
56314C39157J568J083J042Q81K49m02m01K64R82J278J208R97M88o31k067k773
56298C42923k070o13K69J72oN93J649K175J781R93N23N48O28K59l78k91J231L435
56280C53821M615M072K904K446K660K697K394K205K104J742J524K361M091N303
56266C94939N088M007K822J447j45j012m67N01L86o12r04R2J243J559J306Q31
56250D11081k27j697k169q06J021J393O39Q95K966N135N499M124K359J152P12
56235D32077J090J988K537K077J066N92J115K169L116L704L942L806L126J753
56221D64158J14o11M93K602L657K883J893K449M012M786M499M461N013M945L888
56206E09242L518N174P581Q359P120N713N720P023Q746J0382J1580J1811J0985
$$ y = [339157, 340725, 341808, 342850, 343731, 343980, 343578, 343177, 343441, 344423, 345701, 346909, 347906, 348394, 347763, 345696, 342923, 340853, 340240, 340509, 340681, 340675, 341268, 342917, 345092, 346873, 347866, 348389, 348937, 349565, 349824, 349446, 349155, 350386, 353821, 358436, 362508, 365412, 367858, 370518, 373215, 375609, 377814, 379918, 381660, 383184, 385545, 389636, 394939, 400027, 404034, 406856, 408303, 408158, 407146, 406679, 407180, 407566, 406954, 406050, 406142, 407385, 408944, 410250, 411081, 410854, 409157, 406988, 406182, 407203, 408596, 409235, 410130, 413096, 418231, 423730, 427854, 430213, 431365, 432077, 433167, 435155, 437692, 439769, 440835, 441427, 442542, 444711, 447827, 451531, 455473, 459279, 462405, 464158, 464272, 463661, 464154, 466756, 470413, 473296, 475189, 477638, 481650, 486436, 490935, 495396, 500409, 505354, 509242, 512760, 517934, 525515, 533874, 540994, 546707, 552427, 559450, 568196, 578578, 590158, 601969, 612954]
56193F12954J0030J0311J2328J5139J7192J7830J7896J8630K0080K1148K1211
56182G94749K0932K1105K1451K1366K1168K1634K2542K2677K1170J8010J3513
56171A020317Q319L855J419M93q93l630o522q344r691j1748j4105j5251j4745
56158I49474j3675j2938j2345j1554j0950j1126j1959j2655j2480j1394j0075
56147H18323r248q804q020o843o284o828p167n632k646m12j42p81q14j02O29J126
56131G56355J582J971K176K383K812L317L704M064M498M933N367N738N517M287
56117H08704K966L236N306P466Q576R573J1272J2173J0465P321N943P420R622
56104I10043J0484J0411J0778J1712J2516J3108J3931J5077J6220J6971J6960
$$ y = [612954, 622984, 633295, 645623, 660762, 677954, 695784, 713680, 732310, 752390, 773538, 794749, 815681, 836786, 858237, 879603, 900771, 922405, 944947, 967624, 988794, 1006804, 1020317, 1028636, 1032491, 1033910, 1034403, 1033510, 1029880, 1023358, 1015014, 1005323, 993575, 979470, 964219, 949474, 935799, 922861, 910516, 898962, 888012, 876886, 864927, 852272, 839792, 828398, 818323, 809075, 800271, 792251, 785408, 779124, 772296, 765129, 759497, 756851, 756439, 756297, 755516, 754702, 754600, 755229, 756355, 757937, 759908, 762084, 764467, 767279, 770596, 774300, 778364, 782862, 787795, 793162, 798900, 804417, 808704, 811670, 814906, 820212, 827678, 836254, 845827, 857099, 869272, 879737, 887058, 893001, 900421, 910043, 920527, 930938, 941716, 953428, 965944, 979052, 992983, 1008060, 1024280, 1041251, 1058211]
56093A058211J6257J5875J7003J9432K1785K3637K6160L0090L4391L7915M1292
56082A342048M5911N1882N8292O4871P2015P9534Q6574R2633R7584J00827J01398
56071B193569R8881R3452Q5342P5294O5328N7797N3304N0272M6616M1103L3227
56060B894185K3021J1498N63q124j4122j8199k1827k6559l3098m0894m9015n7212
56048B660217o5396p2325p6044p5739p2289o6822n9827n2112m5335m0579l6972
56037A996777l2610k6606j9761j3618r277o733m864k380Q05L581N277O633Q524
56024A905748J0505J1597J2079J3316J5794J8452K0272K1549K3006K4438K5147
56013B101903K5356K6162K7959K9736L0336K9873K9265K8751K7873K6929K7391
$$ y = [1058211, 1074468, 1090343, 1107346, 1126778, 1148563, 1172200, 1198360, 1228450, 1262841, 1300756, 1342048, 1387959, 1439841, 1498133, 1563004, 1635019, 1714553, 1801127, 1893760, 1991344, 2092171, 2193569, 2292450, 2385902, 2471244, 2546538, 2611866, 2669663, 2722967, 2773239, 2819855, 2860958, 2894185, 2917206, 2928704, 2929267, 2921143, 2907021, 2888822, 2866995, 2840436, 2807338, 2766444, 2717429, 2660217, 2594821, 2522496, 2446452, 2370713, 2298424, 2231602, 2171775, 2119663, 2074328, 2033749, 1996777, 1964167, 1937561, 1917800, 1904182, 1894905, 1888172, 1883308, 1880928, 1881733, 1885314, 1890591, 1897224, 1905748, 1916253, 1927850, 1939929, 1953245, 1969039, 1987491, 2007763, 2029312, 2052318, 2076756, 2101903, 2127259, 2153421, 2181380, 2211116, 2241452, 2271325, 2300590, 2329341, 2357214, 2384143, 2411534]
56002B411534L0121L3824L6243L6709L6682L7688L9702M1834M3840M6101M8497
55991B842775N0128N0410N0053N0617N2986N6291N8503N8409N6895N6072N7155
55980C440294N9678O2713O6149P0280P4646P8090Q0049Q1336Q3348Q6625R0412
55969D273620R3619R6119R8870J02699J07328J11940J16513J21889J28474J35640
55959E386711J42782J50260J58581J67099J74693J81557J89248J98635K08934
55950F958500K19419K31105K45470K62035K78681K94498L10976L29832L50904
55941I481420L73062L96119M20694M46739M73674N01744N31964N64638N99043
55932A3789097O34581O71180P08499P46037P84364Q25001Q68608R14521R62682
$$ y = [2411534, 2441655, 2475479, 2511722, 2548431, 2585113, 2622801, 2662503, 2704337, 2748177, 2794278, 2842775, 2892903, 2943313, 2993366, 3043983, 3096969, 3153260, 3211763, 3270172, 3327067, 3383139, 3440294, 3499972, 3562685, 3628834, 3699114, 3773760, 3851850, 3931899, 4013235, 4096583, 4183208, 4273620, 4367239, 4463358, 4562228, 4664927, 4772255, 4884195, 5000708, 5122597, 5251071, 5386711, 5529493, 5679753, 5838334, 6005433, 6180126, 6361683, 6550931, 6749566, 6958500, 7177919, 7409024, 7654494, 7916529, 8195210, 8489708, 8800684, 9130516, 9481420, 9854482, 10250601, 10671295, 11118034, 11591708, 12093452, 12625416, 13190054, 13789097, 14423678, 15094858, 15803357, 16549394, 17333758, 18158759, 19027367, 19941888, 20904570]
55923B0904570J014711J072270J135538J204221J279043J361318J452213J553564
55915C0977448J668193J797903J942012K099496K272181K464503K680987K925777
55907D8828500L204718L526433L901148M339255M850956N446614O137117O932543
55899H7167284P837679Q847696R950141J1131939J2381838J3685392J5022159
55892A66024128J6369846J7702502J8971157K0075901K0843138K1006754K0203536
55885C01196962J8035226J4240614Q913203K596407l860144r611574j4092852
55878C17417842j7111854j8774585j9348671j9146463j8450012j7475230j6369227
55871A90741800j5226582j4105748j3038160j2035298j1097314j0219915r397061
$$ y = [20904570, 21919281, 22991551, 24127089, 25331310, 26610353, 27971671, 29423884, 30977448, 32645641, 34443544, 36385556, 38485052, 40757233, 43221736, 45902723, 48828500, 52033218, 55559651, 59460799, 63800054, 68651010, 74097624, 80234741, 87167284, 95004963, 103852659, 113802800, 124934739, 137316577, 151001969, 166024128, 182393974, 200096476, 219067633, 239143534, 259986672, 280993426, 301196962, 319232188, 333472802, 342386005, 344982412, 341122268, 331510694, 317417842, 300305988, 281531403, 262182732, 243036269, 224586257, 207111027, 190741800, 175515218, 161409470, 148371310, 136336012, 125238698, 115018783, 105621722]
55864A05621722q622133p889904p198062o546756n937099n370237m847416m370168
55856E4839947l939498l554321l211008k905228k634028k395362k185989k001151
55848C2013362j836370j688553j555368j434862j326010j228416j141084j062355
55840B0740344r91022r26354q67011q11372p58999p10263o64356o19549n75857
55831A3815561n35404m99178m65173m30864l95947l61440l27868k95915k67401
55822A0236371k43743k24395k08525j97265j92522j94444k01850k14276k31326
55813H328025k50382k67363k80079k88918k94070k94253k88939k79892k69204
55804E814925k57173k43371k28746k15117k03101j91883j80973j71081j62947
$$ y = [105621722, 96999589, 89109685, 81911623, 75364867, 69427768, 64057531, 59210115, 54839947, 50900449, 47346128, 44135120, 41229892, 38595864, 36200502, 34014513, 32013362, 30176992, 28488439, 26933071, 25498209, 24172199, 22943783, 21802699, 20740344, 19749322, 18822968, 17955957, 17144585, 16385586, 15675323, 15010967, 14391418, 13815561, 13280157, 12780979, 12315806, 11884942, 11488995, 11127555, 10799687, 10503772, 10236371, 9992628, 9768233, 9559708, 9362443, 9169921, 8975477, 8773627, 8559351, 8328025, 8077643, 7810280, 7530201, 7241283, 6947213, 6652960, 6364021, 6084129, 5814925, 5557752, 5314381, 5085635, 4870518, 4667417, 4475534, 4294561, 4123480, 3960533]
55795C960533j56157j49431j41779j33203j24735j17882j13472j10578j07011
55786B806285j01470r5066r0021q6818q3561p8529p2482o7582o4586o2202n9037
55775A944931n5116n1284m8046m5465m3528m2224m1404m0664l9266l6567l3033
55764A468334l0220k9047k8625k7780k7008k7392k8196k7506k5244k3387k2842
55753A171087k2256k0538j8388j6390j3833j0881r646j1170j3147j2844j0826
55742A011168r541r460r206q583q746r656r844q776p399o319n335m581m168k991
55728I06563j13K800K957N96r18K52K116K067n2l208p208j1805j5682j8015j9644
55713H40706k1123k1110j8434j4469j1619j0300r322q425q543r843j1309j2304
$$ y = [3960533, 3804376, 3654945, 3513166, 3379963, 3255228, 3137346, 3023874, 2913296, 2806285, 2704815, 2609749, 2519728, 2432910, 2349349, 2270820, 2198338, 2130756, 2066170, 2003968, 1944931, 1889815, 1838531, 1790485, 1745020, 1701492, 1659268, 1617864, 1577200, 1537934, 1501367, 1468334, 1438114, 1409067, 1380442, 1352662, 1325654, 1298262, 1270066, 1242560, 1217316, 1193929, 1171087, 1148831, 1128293, 1109905, 1093515, 1079682, 1068801, 1059155, 1047985, 1034838, 1021994, 1011168, 1001627, 992167, 982961, 974378, 965632, 955976, 946132, 937356, 929957, 923638, 918303, 913722, 909554, 906563, 906450, 909250, 912207, 912803, 911885, 912137, 914253, 916320, 916268, 913060, 905852, 894047, 878365, 860350, 840706, 819583, 798473, 780039, 765570, 753951, 743651, 734329, 725904, 717361, 707518, 696209, 683905]
55701F83905j3162j4120j4739j4469j3072j0697q153o635o403o411o099o602q844
55688E54499j1287j1523r739q467q810q958p259m859l961m733n431m913l673k664
55674D58222k349k942m393n892o192n024l604l252l927m690n247o140p421q077
55660C89072p309n745m619m166l551k246o80L67M22n67j933k254n57K264M043
55645C62541L623J798j14j669k994m219n587p149p964o763m050k256k890m721
55631C17586n838o172o523o347m638k344j667k790l397j921L69J286M15r29j419
55616B75671p20N12J003j66k496m518n486n981o571o803o000m352k656j459q70
55601B29108p61p83n46j08O8l35j248k355k894j705J401M492N111L317J779K331
$$ y = [683905, 670743, 656623, 641884, 627415, 614343, 603646, 595493, 588858, 582455, 576044, 569945, 563343, 554499, 543212, 531689, 521950, 513483, 504673, 495715, 488456, 483597, 479636, 474903, 469472, 464559, 460886, 458222, 455873, 452931, 448538, 442646, 436454, 431430, 427826, 424574, 420647, 415957, 410710, 404570, 397149, 389072, 381763, 376018, 371399, 367233, 363682, 361436, 360756, 361123, 361545, 360978, 359045, 356791, 356234, 358498, 362541, 366164, 367962, 367848, 366179, 363185, 358966, 353379, 346230, 338266, 331503, 327453, 325197, 322307, 317586, 311748, 305576, 299053, 292706, 288068, 285724, 284057, 281267, 277870, 275949, 276318, 277604, 278019, 277090, 275671, 274951, 275463, 276466, 276300, 273804, 269286, 263800, 257819, 251248, 244445, 238445, 234093, 231437, 229978, 229108, 228347, 227564, 227018, 226910, 226978, 226643, 225395, 223040, 220146, 218441, 219842, 224334, 229445, 232762, 234541, 236872]
55585B36872L837M271L441K348J078r04k891l196j414R46K353K707K488J590l14
55570B53212k692m218m116l100k780l931n523n859m607l061k369k303k158j967
55556B04528k081k242k010j654j731k186k652l196l889m018k948j528j360k595
55542A70438l627l275k156j501j575j770j504n06J151K776L378K716J579O62k18
55527A66568j355k259k185j274m80l64l57N40K367L661K795J02j849q90K187M575
55511A71782M717L433J984O06n47o32N32J499Q12j040k445k828k841k888k689
55496A69455k230k030k411l274m407n399n469m237k416j054l98l72j477l935o256
55481A24090o301l914j212l9l40j230k195k699k043m18R50J414J576J770J212
$$ y = [236872, 240709, 244980, 248421, 250769, 251847, 250943, 248052, 244856, 243442, 244388, 246741, 249448, 251936, 253526, 253212, 250520, 246302, 242186, 239086, 236306, 232375, 226852, 220993, 216386, 213325, 210956, 208653, 206495, 204528, 202447, 200205, 198195, 196541, 194810, 192624, 189972, 186776, 182887, 178869, 175921, 174393, 173033, 170438, 166811, 163536, 161380, 159879, 158304, 156534, 155030, 154524, 155675, 158451, 161829, 164545, 166124, 166786, 166568, 165213, 162954, 160769, 159495, 159015, 158651, 158294, 158834, 161201, 164862, 167657, 167759, 165910, 165020, 167207, 171782, 176499, 179932, 181916, 182522, 181975, 181343, 181875, 183374, 184186, 183146, 180701, 177873, 175032, 172144, 169455, 167225, 165195, 162784, 159510, 155103, 149704, 144235, 139998, 137582, 136528, 136130, 135758, 134281, 130346, 124090, 117789, 113875, 112663, 112624, 112284, 111054, 108859, 106160, 104117, 103699, 104649, 106063, 107639, 109409, 110621]
55466A10621l45j446r03L3p49k961m088k808o37K63l91j256j244l83O46J263J385
55449I7000J325J233Q00j40r48p76K88J254J468J234J128J298J645K055K223J696
55433A12783M77p55j299j119p01m60l91j66M64J211J386P00k49p74j007j562k361
55416A06177k605j891o76N12J607K498K666J759J08j556k570k453j277r6k58j766
55400A00179k940k283k68J352J546P61M0J20J149K628L561L213J842L24q93k041
55384A08290l217l818l120j282M86J014L32m42m94k18l89r12j085q01n86m61J06
55367I3403R56J161N99M35J229J890J453P31Q11R59j10j603j503J14Q39n14k148
55350I8702j994m48Q02J267J462J255J37j273j586n34O93J188J329J739K106J615
$$ y = [110621, 110276, 108830, 107927, 107960, 107211, 104250, 100162, 97354, 96717, 96980, 96589, 95333, 94089, 93706, 94352, 95615, 97000, 98325, 99558, 100358, 100218, 99270, 98494, 98782, 100036, 101504, 102738, 103866, 105164, 106809, 108864, 111087, 112783, 113260, 112505, 111206, 110087, 109386, 108926, 108535, 108369, 108833, 110044, 111430, 112130, 111881, 111107, 110100, 108538, 106177, 103572, 101681, 101005, 101517, 103124, 105622, 108288, 110047, 110155, 108599, 106029, 103576, 102299, 102203, 101945, 100179, 97239, 94956, 94688, 96040, 97586, 98347, 98387, 98507, 99656, 102284, 105845, 109058, 110900, 111224, 110331, 108290, 105073, 101255, 98135, 96853, 97339, 98353, 98685, 98243, 97749, 97531, 97142, 96230, 95145, 94344, 93758, 93297, 93403, 94359, 95520, 96119, 96554, 97783, 99673, 101126, 101857, 102668, 103627, 103517, 101914, 100411, 100525, 101364, 100850, 98702, 96708, 96260, 97062, 98329, 99791, 101046, 101183, 99910, 98324, 97790, 98483, 99671, 101000, 102739, 104845, 106460]
55334A06460R2j780l126l378k366m43J392J976J155K80Q44K437K884J037j389
55319A06075j875m87L57o04j905j857q87l45k86O7O28P46O17P93P12o03k371k372
55301I6403N7K715K992P26j987l028j838M81K017J577j03j151p49L9r2j050j827
55284I5182j793r38M45J608J578L55o78m01M41K54j145k331k162r02N47J501J509
55267I3070N20o27o94N66K076K779K683K268J628P21j16n99j066j910k695k497
55251I6107j129M49R87K4j759k934k362k97J692K316J925J750K123K304K007J895
55235A05098K112J423j104m162n217l470p40Q53J160J413K146K542J581p28l259
55220I9648m552l827j641N02J502J528J416J462J357J021Q32R49R79O08J46J68
$$ y = [106460, 106552, 104772, 101646, 98268, 95902, 95459, 96851, 98827, 99982, 100262, 101106, 103543, 106427, 107464, 106075, 104200, 103713, 104070, 103466, 101561, 99704, 98817, 98472, 98186, 98253, 98881, 99627, 100244, 101037, 101749, 101146, 98775, 96403, 96460, 99175, 102167, 102893, 100906, 97878, 96040, 96521, 98538, 100115, 100012, 98861, 98112, 98151, 98059, 97009, 95182, 93389, 92451, 92896, 94504, 96082, 96437, 95759, 95358, 95799, 96053, 94908, 92577, 90415, 89513, 90060, 91561, 93070, 93590, 92963, 92269, 92835, 94911, 97690, 100373, 102641, 104269, 104990, 104874, 104275, 103209, 101299, 98604, 96107, 94978, 95427, 96414, 96438, 94679, 91745, 89383, 89086, 90778, 93094, 95019, 96769, 98892, 101196, 103203, 105098, 107210, 108633, 107529, 103367, 98150, 94680, 93940, 94793, 95953, 97366, 99512, 102054, 103635, 102907, 99648, 95096, 91269, 89628, 90130, 91632, 93160, 94576, 96038, 97395, 98416, 99248, 100197, 101176, 101784, 101930, 102098]
55204A02098Q81J988K911L045K123N46q68j622j799j654j299q85n87k39N82J749
55188A06970K418J945O57n51j031n32Q30K270K593J429j52r44j109j568k317k424
55172A08484j636q72q16r27l73O92J329R48j42j099j314q70l45JN57J488J985
55155A07090J202k57p77K38J716K482K460J970R30n96j867k287k100j705r99J
55139A07501O32N51L97O15L70j100k722k649p93J061J681J524J331J087Q23J158
55123A11467K223K962K331N31j487l060l781l150j273N75J001P1q57p80M5Q30
55107A07648J271J617K042K323K021J008k84j138j238q88o23o82q89q91m56J59
55091A11000K39p34k280l143k452m89J701L179L576L099K281J484O26m89j579
$$ y = [102098, 102979, 104967, 107878, 110923, 113046, 113592, 112724, 111102, 109303, 107649, 106350, 105465, 104878, 104639, 105221, 106970, 109388, 111333, 111990, 111439, 110408, 109876, 110706, 112976, 115569, 116998, 116846, 115902, 114793, 113225, 110908, 108484, 106848, 105976, 105160, 104233, 103860, 104552, 105881, 106829, 106687, 105588, 104274, 103404, 103059, 103060, 103617, 105105, 107090, 108292, 108035, 107258, 107496, 109212, 111694, 114154, 116124, 117054, 116458, 114591, 112304, 110204, 108499, 107500, 107501, 108133, 108684, 109081, 109696, 110066, 108966, 106244, 103595, 102802, 103863, 105544, 107068, 108399, 109486, 110309, 111467, 113690, 116652, 118983, 119514, 118027, 114967, 111186, 108036, 106763, 107338, 108339, 108410, 107553, 106773, 106818, 107648, 108919, 110536, 112578, 114901, 116922, 117930, 117646, 116508, 115270, 114382, 113759, 113077, 112188, 111297, 110841, 111000, 111239, 110505, 108225, 105082, 102630, 102141, 103842, 107021, 110597, 113696, 115977, 117461, 118087, 117598, 116019]
55076A16019k098j970j642j293o50K73Q88Q88Q09J229J891K161J897J391P18j66
55060A20345r82j431j719k241k735k457j195L78J493J936J827J319P42O88J487
55045A17455K679L249K566J036j93l02M00Q05J90j135k291k642k066q08N47J266
55029A20756J025K88j02L19J293K093K006R75k03n84j71J91K8k26k63o14j679
55012A25132k794l058k681k430k216j339n4M80m1m77K5Q30R48N22L58O16Q21P76
54994A15418O10K32m95j064o60O79J843J845Q17l98j228j617j643j331q47m35
54978A11726n9O52J887L126L426K264J16j876k729k320j351n73M8J105K492K905
54962A20839J417p17j008J088L105K571J70j269n14P72N23j205k729k845j757
$$ y = [116019, 113921, 111951, 110309, 109016, 108366, 108639, 109527, 110415, 111224, 112453, 114344, 116505, 118402, 119793, 120511, 120345, 119363, 117932, 116213, 113972, 111237, 108780, 107585, 107963, 109456, 111392, 113219, 114538, 115280, 115968, 117455, 120134, 123383, 125949, 126985, 126792, 126490, 126890, 127695, 127885, 126750, 124459, 121817, 119751, 118943, 119490, 120756, 121781, 122069, 121967, 122286, 123579, 125672, 127678, 128653, 128450, 127866, 127695, 127886, 127914, 127688, 127425, 126811, 125132, 122338, 119280, 116599, 114169, 111953, 110614, 110560, 111040, 110999, 110522, 110547, 111377, 112325, 112847, 113205, 113821, 114642, 115418, 116028, 116260, 115765, 114701, 114041, 114720, 116563, 118408, 119225, 118827, 117599, 115982, 114339, 113008, 112161, 111726, 111667, 112319, 114206, 117332, 120758, 123022, 123138, 121262, 118533, 116213, 114862, 114289, 114337, 115442, 117934, 120839, 122256, 121539, 120531, 121619, 124724, 127295, 127465, 126196, 125682, 126454, 126977, 125772, 123043, 120198, 118441]
54947A18441m14M57Q13J161J916K818L194K765J922J195Q28Q21R90R27L32n89
54931A37577j349j700j630j033LQ34Q49M15M58J138J726J786J624J410Q90J99
54915A43197J24R58J873J901R24n91k161l280l590l363l040k122K44L260M494
54900A38828K851K39q62l57K66N44J128J957K166J621R43J20j335k862l133j971
54884A40143n69M24J470K499K412J026r2J90P09k61k257l068j680M96J487R93
54868A43922L68Q27K114K977K785K239K311K964L530L956M663N389N284M332L507
54853A91168L223K808K036J953L221M744N059M292L599L320K959K477K188J588
54839B34635k62l061n214n800n516n339n322n206n198n359m948l277r17P49J033
$$ y = [118441, 118027, 118484, 119297, 120458, 122374, 125192, 128386, 131151, 133073, 134268, 135096, 135917, 136907, 137834, 138166, 137577, 136228, 134528, 132898, 131865, 131868, 132702, 133551, 133966, 134424, 135562, 137288, 139074, 140698, 142108, 142998, 143197, 143321, 144279, 146152, 148053, 148977, 148386, 146225, 142945, 139355, 135992, 132952, 130830, 131074, 134334, 138828, 141679, 141918, 141056, 140699, 140965, 141509, 142637, 144594, 146760, 148381, 149324, 149444, 148109, 145247, 142114, 140143, 139574, 139998, 141468, 143967, 146379, 147405, 147313, 147503, 148212, 147951, 145694, 142626, 140946, 141442, 142929, 143922, 144290, 145117, 147231, 150208, 152993, 155232, 157543, 160507, 164037, 167993, 172656, 178045, 183329, 187661, 191168, 194391, 197199, 199235, 201188, 204409, 209153, 214212, 218504, 222103, 225423, 228382, 230859, 233047, 234635, 234373, 231312, 226098, 220298, 214782, 209443, 204121, 198915, 193717, 188358, 183410, 180133, 179216, 179965, 180998]
54824A80998M76OK1L00M33L26L76J002J883K105J480J164K265M096M877M288M116
54807B10212N748P999Q537O821M377K450Q94m88j168j285k283m897p396p504n553
54792B16464m128m651n906o192n420m519m014l941m173m176l337k149k036l300
54778A58522m257l473j861j277j817j974j020K70J171J714J764Q06q16j690j070
54763A44992N8L18k35l30Q27K548L318K237pj684j801j114r18j276j272p61o61
54746A44239j286j640q99L44J016J031J096J545K007J919R20p98k230k238r21
54731A44105M09R68J346K036K179Q99r18j637j156p12o44k2J311J990J149j40
54715A51163m64r8k38q31n86R49K531K845K181J868K485L351L706L788M364N558
$$ y = [180998, 181474, 181480, 181501, 181801, 182234, 182560, 182936, 183938, 185821, 187926, 189406, 190570, 192835, 196931, 201808, 206096, 210212, 215960, 223959, 232496, 239317, 243694, 246144, 247038, 246550, 245382, 244097, 241814, 236917, 229521, 222017, 216464, 212336, 207685, 201779, 195587, 190167, 185648, 181634, 177693, 173520, 169344, 166007, 163858, 161822, 158522, 154265, 150792, 148931, 147654, 145837, 143863, 142843, 143113, 144284, 145998, 147762, 148568, 147752, 146062, 144992, 145050, 145368, 145133, 144803, 145630, 148178, 151496, 153733, 153726, 152042, 150241, 149127, 148209, 146933, 145661, 144900, 144239, 142953, 141313, 140414, 140758, 141774, 142805, 143901, 145446, 147453, 149372, 150292, 149494, 147264, 145026, 144105, 144514, 145482, 146828, 148864, 151043, 151942, 151024, 149387, 148231, 147519, 146875, 146853, 148164, 150154, 151303, 151163, 150699, 150601, 150363, 149532, 148946, 149895, 152426, 155271, 157452, 159320, 161805, 165156, 168862, 172650, 177014, 182572]
54699A82572O684P239P570Q164Q741Q503P258N746M769M296L642K265K96j668
54685B56077l093l951m540m918m773m004l114k681k594k340j875j786k506l835
54671B10067n127n543m300j494J263J938L74j226q14J060K188J723J118J797L070
54656B06094L190J984J241K330M334N300M767M089M267M588L960K662J751J299
54642B51856L61j434l416n096o694q093q371p037m965l419k809k982l850m873
54628A89178m796l085j103n68j137r60L89J181J85j381j503p0J235J181J25r71
54612A77900j625j817j562j007n50n70r96j383j353r26m26j73l30q36j302j122
54596A61922j22R24R39m2p26j91R24J487J414J295J100M44p7N93J988K170K85
$$ y = [182572, 189256, 196495, 204065, 212229, 220970, 229473, 236731, 242477, 247246, 251542, 255184, 257449, 257745, 256077, 252984, 249033, 244493, 239575, 234802, 230798, 227684, 225003, 222409, 220069, 218194, 216408, 213902, 210067, 204940, 199397, 195097, 193603, 194866, 196804, 197178, 195952, 195138, 196198, 198386, 200109, 201227, 203024, 206094, 209284, 211268, 212509, 214839, 219173, 224473, 229240, 233329, 237596, 242184, 246144, 248806, 250557, 251856, 252217, 250783, 247367, 242271, 235577, 227484, 219113, 212076, 207111, 203692, 200883, 197901, 194051, 189178, 184382, 181297, 180194, 179626, 178489, 177529, 177918, 179099, 179284, 177903, 176400, 176330, 177565, 178746, 178871, 177900, 176275, 174458, 172896, 171889, 171339, 170769, 169773, 168390, 167037, 166111, 165685, 165512, 165182, 164346, 163044, 161922, 161800, 162724, 163663, 163621, 162895, 162704, 163628, 165115, 166529, 167824, 168924, 169368, 169291, 169884, 171872, 174042, 174327]
54579A74327k172l455l649l681l369j899M24K304L024K734J565k14j411q20Q88
54564A64596J602M73j115j763j862k269k390j044J352K957K881K137J909J892
54550A69356J034o55j885j622k12J199J932K021J590O25m99r59m55J67n8q13q78
54533A69888R4R78O05q39k226k708k182r80L45J313J892K388K666K102P47j50
54517A73933L84J497J473J2j547k192k254k145j458j14P01J1j198j012P56K293
54501A69140K300J532J333J749K036K289L225M490M481K422j87j042L05K062K509
54486A98644J930J735K222K182Q19q76j332m26O10J042J369K017K453K179J787
54471B16355K122K986L660M221N164N792M460Q89k837m412l708k308j314n59K79
$$ y = [174327, 172155, 168700, 165051, 161370, 158001, 156102, 156526, 158830, 161854, 164588, 166153, 165939, 164528, 163708, 164596, 166198, 166671, 165556, 163793, 161931, 159662, 157272, 156228, 157580, 160537, 163418, 165555, 167464, 169356, 170390, 169735, 167850, 166228, 166016, 167215, 169147, 171168, 172758, 173383, 172884, 171925, 171470, 171637, 171579, 170766, 169888, 169982, 170960, 171565, 170726, 168500, 165792, 163610, 162630, 162975, 164288, 166180, 168568, 171234, 173336, 174083, 173933, 174317, 175814, 177287, 177299, 175752, 173560, 171306, 169161, 167703, 167589, 168290, 168301, 167103, 166091, 166847, 169140, 171440, 172972, 174305, 176054, 178090, 180379, 183604, 188094, 192575, 194997, 194810, 193768, 194073, 196135, 198644, 200574, 202309, 204531, 206713, 207532, 206656, 205324, 204898, 205508, 206550, 207919, 209936, 212389, 214568, 216355, 218477, 221463, 225123, 229344, 234508, 240300, 244760, 245649, 242812, 238400, 234692, 232384, 231070, 230511, 230790]
54456B30790Q89P96j6j168k153k389j497K03J719K125J284k47j784k958l645l714
54440B18235k970j523nQ88J069J016J013R24P33Q06J274J798K245K945L705L349
54424B35502J249j216j956q36K71K09JR94K805M037M231L926L360K386J513J754
54408B58230L136M364M453L913L646L394K202J75j282j155K9J121J706J954J718
54393B87604O35r51j976j779p30L12P52L81n51j240r90k29j82j184k071j827j083
54376B74891j174k298l504m064l885k927j358j47l48j650k614k485j892j550j210
54361B43785l14J043K218K628K102J147P90J517K426K342J539J174J096q6k355
54346B61052l522k245k79j42j589k132m84K200M236M938M188K091m11j718j063
$$ y = [230790, 231679, 232475, 232459, 231291, 229138, 226749, 225252, 225455, 227174, 229299, 230583, 230336, 228552, 225594, 221949, 218235, 215265, 213742, 213737, 214625, 215694, 216710, 217723, 218647, 219380, 220186, 221460, 223258, 225503, 228448, 232153, 235502, 236751, 235535, 233579, 232743, 233014, 233223, 233224, 234218, 237023, 241060, 245291, 249217, 252577, 254963, 256476, 258230, 261366, 265730, 270183, 274096, 277742, 281136, 283338, 283513, 282231, 281076, 281105, 282226, 283932, 285886, 287604, 288239, 287288, 285312, 283533, 282803, 283115, 283867, 284248, 283697, 282457, 281467, 281238, 281056, 279872, 277801, 275974, 274891, 273717, 271419, 267915, 263851, 259966, 257039, 255681, 255534, 255186, 253536, 250922, 248437, 246545, 244995, 243785, 243471, 244514, 246732, 249360, 251462, 252609, 253399, 254916, 257342, 259684, 261223, 262397, 263493, 263407, 261052, 257530, 255285, 255006, 254864, 253275, 251143, 250659, 252859, 257095, 262033, 266221, 268312, 267901, 266183, 265120]
54331B65120O98K161K697K511J967J252M12n17j264j331n89K92M83j4m56m35l65
54314B72622q67k038l271l511j979P92K897K694O05j296j576p27q2j61m27k85
54298B63390K04N12K54m69j231j683j747j579j593k284l532m236l498k174k186
54283B38148l848n057l988j545K9Q3l30o01j153k017k487k360k212k226j963j431
54267B07042r86j06K131M857N464K846q35k712k437j579r72l21J94k74j644k559
54251B08109k032n39Q66J823K560L083L022K255J353J096J497J554L43j659k809
54236B20522k030M5J812K167J101p42k496l400l032j484O35K288K487J174n69
54221B18478j634k050k434k704k279j382r28j002p02K69J150J572K073K516J543
$$ y = [265120, 265818, 267979, 270676, 273187, 275154, 276406, 276818, 276301, 275037, 273706, 273117, 273409, 273892, 273878, 273422, 272987, 272622, 271755, 269717, 266446, 262935, 260956, 261748, 264645, 267339, 267944, 266648, 265072, 264345, 264263, 264102, 263675, 263390, 263594, 264106, 264360, 263891, 262660, 260977, 259230, 257651, 256058, 253774, 250242, 246006, 242508, 240334, 238148, 234300, 229243, 225255, 223710, 223739, 223822, 223492, 222891, 221738, 219721, 217234, 214874, 212662, 210436, 208473, 207042, 206056, 205950, 208081, 212938, 218402, 221248, 220413, 217701, 215264, 213685, 212713, 212392, 212586, 212312, 210668, 208109, 206077, 205538, 206404, 208227, 210787, 213870, 216892, 219147, 220500, 221596, 223093, 224647, 224990, 223331, 220522, 218492, 218537, 220349, 222516, 223617, 222875, 220379, 216979, 213947, 212463, 213098, 215386, 217873, 219047, 218478, 216844, 214794, 212360, 209656, 207377, 205995, 205067, 204065, 203363, 203632, 204782, 206354, 208427, 210943, 212486]
54206B12486j208l690l623j311R36J495L65j666l332l094p73J516J546j11j036
54191A98500n01r9o61o58J372M366N905M995K657L43j296k339k940k826j482R37
54175B06273L081L482K070lj899l466m218l407j505m23j313k971l289j770J31
54160A90773P37l63k216l294k675q20Q95J601J463Q69j29j233j658j031k7N15
54144A83407N84O48Q50J034J113Q97J17r26j345p83J11P63J345J771J140o38j843
54127A88245j059M43L33j259j943p60O00Q23R31K020K942K061J7j159r22l80Q
54110A90941Q44J974K165J137L00N89R40K7j536k026j116k24m89j432j903j520
54094A88671q23m02k37J70J122K133K272J266Jm31R1Q33J177R43J43r25j553j389
$$ y = [212486, 211278, 207588, 203965, 202654, 203590, 205085, 205450, 203784, 200452, 197358, 196585, 198101, 199647, 199536, 198500, 197999, 197900, 197239, 196581, 197953, 202319, 208224, 213219, 215876, 216219, 214923, 212584, 209644, 206818, 205336, 206273, 209354, 212836, 214906, 214903, 213004, 209538, 205320, 201913, 200408, 199985, 198672, 195701, 192412, 190642, 190773, 191510, 191147, 188931, 185637, 182962, 182142, 183037, 184638, 186101, 186970, 186841, 185608, 183950, 182919, 182892, 183407, 183991, 184639, 185489, 186523, 187636, 188533, 188650, 187724, 186379, 185596, 185707, 186470, 187815, 189586, 190726, 190088, 188245, 187186, 187629, 187962, 186703, 184760, 184000, 184600, 185423, 186354, 188374, 191316, 193377, 193394, 192235, 191313, 190933, 190941, 191785, 193759, 195924, 197061, 197361, 197950, 198890, 198917, 197381, 195355, 194239, 194015, 193526, 192094, 190191, 188671, 187848, 187446, 187209, 187379, 188501, 190634, 192906, 194172, 194173, 193742, 193833, 194666, 195843, 196786, 196929, 196004, 194451, 193062]
54076A93062j195j940l202l475k273p49N9N50J380K043J691O36o2j64l60r83j573
54059A83445j628j109k80L61L23l0O31K838M817M156R80j853k148p26J42m62j662
54042A87795k279j822m29J209K108J775P78J96N82J625K515K501J506L94J82P47
54026A99383R11R1q23o88L82J343J518R98J38n84n68L10J194J011l08j707k023
54009B00578q75R93J970P50k036l893k995k78J892K725L441M843N945N438L571
53994B22069J776J125J575K210J818q6k343k925j212J152K312K458L169M939O549
53979B44586O915O413N970N669M914L656K796L322N207P179P630N993L389J616
53965C15255J418J916J942J519J637K823M348M906L754J210j587l323l389k413
$$ y = [193062, 191867, 189927, 186725, 183250, 180977, 180228, 180287, 180837, 182217, 184260, 185951, 186587, 186525, 186361, 186001, 185018, 183445, 181817, 180708, 180428, 180789, 181112, 181082, 181713, 184551, 189368, 193524, 194504, 192651, 190503, 189777, 189919, 189457, 187795, 185516, 183694, 183265, 184474, 186582, 188357, 189135, 189331, 189913, 191538, 194053, 196554, 198060, 198454, 198636, 199383, 200294, 200385, 199562, 198874, 199256, 200599, 202117, 203115, 203253, 202669, 202101, 202411, 203605, 204616, 204308, 202601, 200578, 199703, 200696, 202666, 203416, 201380, 197487, 194492, 194214, 196106, 198831, 202272, 207115, 213060, 218498, 222069, 223845, 224970, 226545, 228755, 230573, 230487, 228144, 225219, 224007, 225159, 227471, 229929, 233098, 238037, 244586, 251501, 257914, 263884, 269553, 274467, 278123, 280919, 284241, 289448, 296627, 304257, 310250, 313639, 315255, 316673, 318589, 320531, 322050, 323687, 326510, 330858, 335764, 339518, 340728, 339141, 335818, 332429, 330016]
53951C30016j714k014k776k993k399j641j489k180l413m592n105m797m204m024
53937B86675m286m359l803k957k483k656l187l560l418k909k644k967l254k494
53923B41698p25P64R92M39P7q1o19j370j557j144q56p14K14K020L091K087J28
53906B44444l10J505L689M154K905J542J239J923K918L636L789L485L252L513
53892B81684L962L799K742J547J345K494M266N510N619M945M393M637N704P245
53878C39892R075J1210J3425J4958J4816J2505Q559M343J141p52j907k692k721
53865D21852j704l91No46j206p58L41J185J507J740K360L564N221O610O611M775
53849D51066K038Lm30M57J749K489K124R21j72n04l97n69j253k183l086l777m161
$$ y = [330016, 328302, 326288, 323512, 320519, 318120, 316479, 314990, 312810, 309397, 304805, 299700, 294903, 290699, 286675, 282389, 278030, 274227, 271270, 268787, 266131, 262944, 259384, 255966, 253057, 250413, 247446, 244192, 241698, 240973, 241737, 242729, 243168, 243245, 243164, 242545, 241175, 239618, 238474, 237618, 236904, 237118, 239138, 242229, 244316, 244444, 244134, 245639, 249328, 253482, 256387, 257929, 259168, 261091, 264009, 267645, 271434, 274919, 278171, 281684, 285646, 289445, 292187, 293734, 295079, 297573, 301839, 307349, 312968, 317913, 322306, 326943, 332647, 339892, 348967, 360177, 373602, 388560, 403376, 415881, 424440, 428783, 429924, 429172, 427265, 424573, 421852, 420148, 419757, 419762, 419116, 417910, 417152, 417493, 418678, 420185, 421925, 424285, 427849, 433070, 439680, 446291, 451066, 453104, 453107, 452677, 453134, 454883, 457372, 459496, 460417, 460245, 459741, 459344, 458775, 457522, 455339, 452253, 448476, 444315]
53832D44315m527n266o000n742m599m197n458o892o564m897l851l868l676k995
53818C75783l136m548n842o023n755n582m755l040j940k574l749l823l318l844
53804C17854n255n761m572k724j427r39j092j672k206k210j741j111m36O3m6n46
53788B86179l84O91J319M46r16j274j026j426k112j735o19m16j222j393n02j33
53772B75477j026j731j093j87m34j389j732j194k75Q31J755J460m53k649l433
53757B63927k595r85Q34K451L050K344J536J991L303L920L366K657K677L242L819
53742B95537M193M338M387M719N477O038N637M362K986K038J711K309L841N283
53728C52856N285L790K150J462J506J596J654J880J967J365K16o56q26q51j411
$$ y = [444315, 439788, 434522, 428522, 422780, 418181, 413984, 408526, 401634, 395070, 390173, 386322, 382454, 378778, 375783, 372647, 368099, 362257, 356234, 350479, 344897, 340142, 337102, 335162, 332588, 328839, 325016, 321698, 317854, 312599, 306838, 302266, 299542, 298115, 297176, 296084, 294412, 292206, 289996, 288255, 287144, 286708, 286771, 286725, 286179, 285795, 286486, 287805, 288251, 287335, 286061, 285035, 283609, 281497, 279762, 279143, 278727, 277505, 276112, 275610, 275477, 274451, 272720, 271627, 271440, 271006, 269617, 267885, 266691, 266416, 267247, 269002, 270462, 270009, 267360, 263927, 261332, 260347, 261181, 263632, 266682, 269026, 270562, 272553, 275856, 279776, 283142, 285799, 288476, 291718, 295537, 299730, 304068, 308455, 313174, 318651, 324689, 330326, 334688, 337674, 339712, 341423, 343732, 347573, 352856, 358141, 361931, 364081, 365543, 367049, 368645, 370299, 372179, 374146, 375511, 375727, 375071, 374245, 373394, 371983]
53713C71983k181k125r01O22J553K015K424K448J629N72L24N91p3k175m593o348
53697C65765p668q762q901p685o064n046m377l535l043l491m125l856l102l134
53683B92976m008m610m419l741k467k22K124K808J420m59j367j420j268p93L25
53668B74879J667K477K550K175J636J106O56O6q95j932k439k252j637o28Q35K186
53652B80450K708K679K987L415K743J017K18J735M249N445M889L928L314K497
53638C22274J212L09M67J088J146N82K99Q48J699J906J251M41J62K93L01J40K00
53621C34618N16O15L25N9P9J46J39M04R70J051J9j505k218j695o46K74J232K588
53603C36971M069M902M639L557K331J465J018Q05O54N15M05L36J79m27j685l007
$$ y = [371983, 369802, 367677, 366776, 367398, 368951, 370966, 373390, 375838, 377467, 378039, 378363, 378954, 378881, 376706, 372113, 365765, 358097, 349335, 340434, 332749, 326685, 321639, 317262, 313727, 310684, 307193, 303068, 299212, 296110, 292976, 288968, 284358, 279939, 276198, 273731, 273509, 275633, 278441, 279861, 279402, 278035, 276615, 275347, 274554, 274879, 276546, 279023, 281573, 283748, 285384, 286490, 287146, 287212, 286317, 284385, 281946, 279694, 278057, 277429, 278264, 280450, 283158, 285837, 288824, 292239, 294982, 295999, 296217, 297952, 302201, 307646, 312535, 316463, 319777, 322274, 323486, 323795, 324262, 325350, 326496, 327078, 327377, 328225, 329924, 331830, 333081, 333522, 333684, 333977, 334278, 334418, 334618, 335134, 335749, 336074, 336133, 336212, 336358, 336497, 336901, 337871, 338922, 338941, 337436, 335218, 333523, 332877, 333151, 334383, 336971, 341040, 345942, 350581, 354138, 356469, 357934, 358952, 359757, 360411, 360926, 361331, 361667, 361846, 361419, 359734, 356727]
53587C56727l301k275j074j003j900k572k487k109j599n08R86J708J078J30J10
53572C41911Q46J318J272J305J756K465L262L935L922K914J642J277K075L283
53558C73183M171M430L793K286Q59P33J841K869L043L021L445L680K833J326M52
53543D11965O41J196J606K128K897L342K901J761L52j211k638k957j594J56L7
53528D20582k300m277l198M14L240K799k16l219m343l474j567K86J438J921K156
53513D10242K258J917J050K18J9L19M29p2q73j107j4K230M229M434K823J075P39
53496D29916J634K405K268J628J267J572K504L829N258O609P855Q849R231Q808
53482D93633P893P095O945P826R778J2184J4057J4988J5449J5887J6125J6048
$$ y = [356727, 353426, 351151, 350077, 349074, 347174, 344602, 342115, 340006, 338407, 337899, 338885, 340593, 341671, 341801, 341911, 342757, 344075, 345347, 346652, 348408, 350873, 354135, 358070, 361992, 364906, 366548, 367825, 369900, 373183, 377354, 381784, 385577, 387863, 388722, 389455, 391296, 394165, 397208, 400229, 403674, 407354, 410187, 411513, 411965, 412606, 413802, 415408, 417536, 420433, 423775, 426676, 428437, 428789, 427578, 424940, 421983, 420389, 420545, 420582, 418282, 414005, 410807, 411221, 414461, 417260, 417044, 413825, 409482, 406008, 404441, 404727, 406165, 408086, 410242, 412500, 414417, 415467, 415685, 415704, 416023, 416452, 416380, 415507, 414400, 414386, 416616, 420845, 425279, 428102, 429177, 429916, 431550, 433955, 436223, 437851, 439118, 440690, 443194, 447023, 452281, 458890, 466745, 475594, 484825, 493633, 501526, 508621, 515566, 523392, 533170, 545354, 559411, 574399, 589848, 605735, 621860, 637908]
53470F37908J6335J7782K0224K2641K4069K4046K2743K1223K1017K2637K5026
53459H75651K7115K9255L2132L5019L6554L6803L6984L7332L6989L6121L6178
53448A256133L7442L8063L6714L4722L4244L5286L6029L5362L3705L1794L0120
53437A639614K9431L0304L1919L2362L0722K8136K6389K6058K6374K6449K6092
53426A953850K5559K4928K3864K1997J9452J6889J4837J3156J1194Q399M704O42
53414B139471k880n356p335r845j2886j5206j6178j7193k0115k4648k8481l0099
53402A949249l0335l0702l1313l1342l0828l0802l1803l3177l4007l4005l3173
53391A597762l1427k8997k6720k5253k4249k2995k1622k0874k0570j9330j6273
$$ y = [637908, 654243, 672025, 692249, 714890, 738959, 763005, 785748, 806971, 827988, 850625, 875651, 902766, 932021, 964153, 999172, 1035726, 1072529, 1109513, 1146845, 1183834, 1219955, 1256133, 1293575, 1331638, 1368352, 1403074, 1437318, 1472604, 1508633, 1543995, 1577700, 1609494, 1639614, 1669045, 1699349, 1731268, 1763630, 1794352, 1822488, 1848877, 1874935, 1901309, 1927758, 1953850, 1979409, 2004337, 2028201, 2050198, 2069650, 2086539, 2101376, 2114532, 2125726, 2134125, 2138829, 2139471, 2136591, 2131235, 2123900, 2114055, 2101169, 2085963, 2069785, 2052592, 2032477, 2007829, 1979348, 1949249, 1918914, 1888212, 1856899, 1825557, 1794729, 1763927, 1732124, 1698947, 1664940, 1630935, 1597762, 1566335, 1537338, 1510618, 1485365, 1461116, 1438121, 1416499, 1395625, 1375055, 1355725, 1339452]
53380A339452j2301q940o442l977j310Q16K036L133N086Q071J1647J5273J8320
53367A370864K0398K2109K4694K8369L1794L3853L5217L7181L9631M1484M2798
53356A728392M4963M8526N2168N4442N5636N7174N9771O2962O6100O9085P2090
53345B371309P4955P7090P8051P8291P9140Q1479Q4460Q6117Q5506Q3746Q2601
53334C262745Q2570Q2778Q2190Q0374P7442P3987P0864O8298O5296O0596N4263
53323D061403M7600M1412L5162K8259K1386J5732J1216O315k81q428j7031k5239
53311D217506l2888m0206m7478n4845o2115o8910p5184q1349q7526r2819r5840
53300C478346r6219r5190r4490r4737r5212r4939r3673r1851q9916q8034q6198
$$ y = [1339452, 1327151, 1318211, 1311769, 1307792, 1306482, 1307298, 1309334, 1312467, 1317553, 1325624, 1337271, 1352544, 1370864, 1391262, 1413371, 1438065, 1466434, 1498228, 1532081, 1567298, 1604479, 1644110, 1685594, 1728392, 1773355, 1821881, 1874049, 1928491, 1984127, 2041301, 2101072, 2164034, 2230134, 2299219, 2371309, 2446264, 2523354, 2601405, 2679696, 2758836, 2840315, 2924775, 3010892, 3096398, 3180144, 3262745, 3345315, 3428093, 3510283, 3590657, 3668099, 3742086, 3812950, 3881248, 3946544, 4007140, 4061403, 4109003, 4150415, 4185577, 4213836, 4235222, 4250954, 4262170, 4268485, 4268204, 4259776, 4242745, 4217506, 4184618, 4144412, 4096934, 4042089, 3979974, 3911064, 3835880, 3754531, 3667005, 3574186, 3478346, 3382127, 3286937, 3192447, 3097710, 3002498, 2907559, 2813886, 2722035, 2632119, 2544085, 2457887]
53289B457887q4291q1946p8741p4792p0951o7999o5732o3281o0261n7034n3691
53278A699168m9682m4987m0874l8472l7009l4660l0988k7235k4103k0682j6249
53267A334227j1803q806p308o451n853n308l783m25L753O732Q093R364J1618J4230
53253A338280J6400J8416K0663K2589K3711K4687K6443K8983L1756L4497L6838
53242A623263L8053L8204L8778M0902M3585M5019M5051M4814M4498M3268M1368
53231B086803M0247M0044L8716L4712K9095K3979K0022J6655J3759J1525R262
53220B364819N844J247l597q324j3262j7987k1228k2740k4144k6964l0619l3236
53208B169809l4162l4862l7198m1453m6151m9539n1021n1400n1873n2954n4283
$$ y = [2457887, 2373596, 2291650, 2212909, 2138117, 2067166, 1999167, 1933435, 1870154, 1809893, 1752859, 1699168, 1649486, 1604499, 1563625, 1525153, 1488144, 1453484, 1422496, 1395261, 1371158, 1350476, 1334227, 1322424, 1313618, 1306310, 1299859, 1294006, 1288698, 1284915, 1284490, 1288243, 1294975, 1303068, 1312432, 1324050, 1338280, 1354680, 1373096, 1393759, 1416348, 1440059, 1464746, 1491189, 1520172, 1551928, 1586425, 1623263, 1661316, 1699520, 1738298, 1779200, 1822785, 1867804, 1912855, 1957669, 2002167, 2045435, 2086803, 2127050, 2167094, 2205810, 2240522, 2269617, 2293596, 2313618, 2330273, 2344032, 2355557, 2364819, 2370663, 2371910, 2368313, 2359989, 2346727, 2328740, 2307512, 2284772, 2260628, 2233664, 2203045, 2169809, 2135647, 2100785, 2063587, 2022134, 1975983, 1926444, 1875423, 1824023, 1772150, 1719196, 1664913]
53197A664913n5218n5419n4956n4178n3483n2892n1875m9901m7201m4576m2438
53186A102776m0521l8744l7665l7554l7557l6522l4530l2714l1549l0212k7976
53175G17232k5446k3606k2193k0011j6945j4554j4158j4940j4727j2580r833q479
53163E19760r008j0150j0384r329p803o863o837p090o778n752m699m317m666n403
53149D20681o191o549n831m049k508k638m157n225m743l621l184l293l043k688
53135C62961l405n133o095m994k677p97L24J468K662K819J352q65k564l426l770
53120C37860l559k496j012k23o10j295j168l79l8n74j129r07k92l5O2P00J535
53103C26440J309k86j957k563k466k367j799p2J909K399J308M49R41J704J215
$$ y = [1664913, 1609695, 1554276, 1499320, 1445142, 1391659, 1338767, 1286892, 1236991, 1189790, 1145214, 1102776, 1062255, 1023511, 985846, 948292, 910735, 874213, 839683, 806969, 775420, 745208, 717232, 691786, 668180, 645987, 625976, 609031, 594477, 580319, 565379, 550652, 538072, 528239, 519760, 510752, 500602, 490218, 480889, 473086, 466223, 459386, 452296, 445518, 439766, 435067, 430750, 426084, 420681, 414490, 407941, 402110, 398061, 395553, 392915, 388758, 383533, 378790, 375169, 371985, 368692, 365649, 362961, 359556, 354423, 348328, 343334, 340657, 339860, 340184, 341652, 344314, 347133, 348485, 347620, 345056, 341630, 337860, 334301, 331805, 330793, 330570, 329960, 328665, 327497, 327118, 327080, 326506, 325377, 324470, 324178, 324143, 324205, 324905, 326440, 327749, 327463, 325506, 322943, 320477, 318110, 316311, 316239, 318148, 320547, 321855, 322304, 323245, 324949, 326164]
53088C26164m60k143l099l143k061l7J893K871L238L544L132J078j795l410l046
53073C22726k114j962k342k497k473k516k317j665j117j059r82l98K64O52J345
53058C03545K631L347K413Q66N39J033P1k939n664n947m468l247k855k487j859
53043B84979j464j388j231r86q89n36O61K084K193N52j470k458k541k567k428
53028B72511j337N28J709J179l39j273j000k61N0j25k91j34L42R68J397J161J93
53011B75278q39j191q98o44q71j512k391l247l359k084o2R06j78k177l099k317
52995B51315r11r0l1k12r4O30J929L198L515K441M67j461k635k840k165r43K28
52978B52341O96K56n90j031q02m12m08o03l76L78J033R68R7j234k383k480j070
$$ y = [326164, 325704, 323561, 320462, 317319, 315258, 315221, 317114, 319985, 323223, 326767, 329899, 330977, 329182, 325772, 322726, 320612, 318650, 316308, 313811, 311338, 308822, 306505, 304840, 303723, 302664, 301682, 301284, 301548, 302200, 303545, 306176, 309523, 311936, 312802, 313341, 314374, 314445, 311506, 305842, 299895, 295427, 292180, 289325, 286838, 284979, 283515, 282127, 280896, 279910, 279021, 278485, 279146, 281230, 283423, 283975, 282505, 280047, 277506, 274939, 272511, 271174, 271702, 273411, 274590, 274251, 272978, 271978, 271717, 271767, 271642, 271351, 271217, 271559, 272527, 273924, 275085, 275278, 274439, 273248, 272350, 271706, 270835, 269323, 266932, 263685, 260326, 258242, 258180, 259086, 258908, 256731, 253632, 251315, 250404, 250314, 250283, 250071, 249977, 250607, 252536, 255734, 259249, 261690, 262157, 260696, 258061, 255221, 253056, 252113, 252341, 253037, 253293, 252703, 251672, 250870, 250458, 250050, 249447, 249071, 249449, 250482, 251450, 251547, 250313, 247930, 245450, 244380]
52961B44380J052K325K102J230N97r9j475l082l781l191j878m23Q82J567J168
52946B41374l7j126j480j157m98L7j28j118k112k208j675j541j909j658j42J780
52930B26402K812K662J959J282Q08M92J24n68j546k383k693k398j585m42O54J376
52914B26956J760J957J854J498J560K466L228K342nj796j727p72n43j052r90M27
52898B37163K779N000N999N143K933P62n43j460k614l628l771l047j830k08J360
52883B44038J599l2j913j970m97K09r60k677l326k890k162j449q07n42o22m79
52867B25520j9k5q03j403j011l45m99j145j146n27l21n40Q1J907L385K978J104
52850B27191q37k354l632m062k711j94J455J310P07J147K209K514J880J159N34
$$ y = [244380, 245432, 247757, 249859, 251089, 251686, 251587, 250112, 247030, 243249, 240058, 238180, 237757, 238639, 240206, 241374, 241337, 240211, 238731, 237574, 237076, 237113, 236985, 235867, 233755, 231547, 229872, 228331, 226422, 224764, 224622, 226402, 229214, 231876, 233835, 235117, 235925, 236417, 236541, 235973, 234427, 232044, 229351, 226953, 225368, 224926, 225580, 226956, 228716, 230673, 232527, 234025, 235585, 238051, 241279, 243621, 243616, 241820, 240093, 239321, 238778, 237726, 236736, 237163, 239942, 244942, 250941, 256084, 259017, 259779, 259236, 257776, 255162, 251534, 247763, 244716, 242886, 242678, 244038, 245637, 245605, 243692, 241722, 241225, 241434, 240474, 237797, 234471, 231581, 229419, 227970, 227163, 226621, 225999, 225520, 225501, 225476, 224673, 223270, 222259, 221914, 221415, 220270, 219124, 218597, 218276, 217736, 217817, 219724, 223109, 226087, 227191, 226354, 224000, 220368, 216306, 213595, 213401, 214856, 216166, 216873, 218020, 220229, 222743, 224623, 225782, 226316]
52835B26316m63j356p95J271K864K253Q5j561j547l41J003J614J005m80j564j158
52819B27146L86J676J880J363R44J082J765K603K981K522J459L73k99l40K81J121
52803B46943J430J095R89J735K532K086M39j067j616j765k292l103l589l382k359
52788B38076n34J633L129L096J569n58k116k209p03J513K991K723Q35j542l135
52773B44768l429k942k433j928j009L4K29m97q29K8R26M63o79o78N25J063L6j182
52755B32466j120k57J9n95j289j393q26J89J128J293N95j6N57K383M381N145L874
52738B46534R71k018l493l123j930j235j802l501n116m934k587k3N71m50r17j81
52722B16766J78o97j446q07L45O35K90J44j28j100j982j628m60K55M77J127K165
$$ y = [226316, 225853, 224497, 223702, 224973, 227837, 230090, 230175, 228614, 227067, 226726, 227729, 229343, 230348, 229868, 228304, 227146, 227532, 229208, 231088, 232451, 233395, 234477, 236242, 238845, 241826, 244348, 245807, 246180, 245881, 245541, 245822, 246943, 248373, 249468, 250457, 252192, 254724, 256810, 257249, 256182, 254566, 252801, 250509, 247406, 243817, 240435, 238076, 237542, 239175, 242304, 245400, 246969, 246411, 244295, 242086, 241383, 242896, 245887, 248610, 249445, 247903, 244768, 241339, 238397, 235964, 234036, 233027, 233061, 233290, 232793, 231964, 231992, 232918, 233381, 232702, 232024, 232549, 233612, 233648, 232466, 231346, 231089, 231108, 230513, 229224, 227831, 227005, 227194, 228322, 229615, 230210, 230194, 230751, 233134, 237515, 242660, 246534, 247505, 245487, 241994, 238871, 236941, 235706, 233904, 230403, 225287, 220353, 217766, 217743, 218314, 217864, 216947, 216766, 216944, 216247, 214801, 213994, 214339, 214974, 215264, 215408, 215280, 214180, 212198, 210570, 210110, 210365, 210842, 211969, 214134]
52705B14134K552J942J047L73j35l79k08n5k42RJ465L053K685N5k825m027l409
52688B16035j829j02R44P49m3J1J330K767L191K712K004J441J269J593J913J511
52672B35496O98N82J280J441J89j495k034j070N60J871K199J392J51n36p32j494
52656B38498l019l899k956q92P66J404J167L1j666k524j499L19O99r33k928l650
52640B18918l099k068r15K80J174J530J567J443P28r62k969l820k666k39J800
52625B10702K396J810R61M61M85J096K144K921K632J318j50j090j534j621j112
52610B21419J80J878L277L774L100J614M43N33J412J655P97j46m02m88q46o55
52594B37545P75K387K583J542R33J507K399K746K618K162J098n18j897k416k177
$$ y = [214134, 216686, 218628, 219675, 220048, 219913, 219534, 219326, 219271, 219029, 219038, 220503, 223556, 226241, 226296, 223471, 219444, 216035, 214206, 214104, 215048, 215797, 215754, 215765, 217095, 219862, 223053, 225765, 227769, 229210, 230479, 232072, 233985, 235496, 236194, 236776, 238056, 239497, 239686, 238191, 236157, 235087, 235647, 237518, 239717, 241109, 241260, 240724, 239992, 238498, 235479, 231580, 228624, 227732, 228498, 229902, 231069, 231100, 229434, 226910, 225411, 225730, 226429, 225496, 222568, 218918, 215819, 213751, 212836, 213116, 214290, 215820, 217387, 218830, 219558, 218596, 215627, 211807, 209141, 208902, 210702, 213098, 214908, 215869, 216330, 216815, 217911, 220055, 222976, 225608, 226926, 226776, 225686, 224152, 222531, 221419, 221599, 223477, 226754, 230528, 233628, 235242, 235685, 236218, 237630, 239285, 240082, 239936, 239534, 239046, 238200, 237545, 238320, 240707, 243290, 244832, 245765, 247272, 249671, 252417, 255035, 257197, 258295, 257777, 255880, 253464, 251287]
52579B51287j505o21M4K0m82p69p67j080j826k281j969j147R4K026M093M739L354
52562B53210J447Q19J290J348L09j293k947m312m552k994o15N83K2q76r20o81
52546B39838j086j600r34J012K938L584K657O15j555k584j790Q7J487J582R15
52531B45166N24R09J821K511K228R19m76q36n4J053J894K575L069K757J274o59
52515B64675j807j664p49J32N33M45K6o51j597k597l072k757k399l025m405m944
52499B36144l577j122P95J635K125K985M072M564L594J118j609k960k771k415
52485B42578k541j952J96K324K282M97n96J0J018J362J552K002K028J277N79M25
52469B53041J00q83j842k260k664l128k536m69J569K262K395L083L452K095k02
$$ y = [251287, 249782, 249161, 249205, 249225, 248743, 247974, 247207, 246127, 244301, 242020, 240051, 238904, 238998, 241024, 245117, 249856, 253210, 254657, 255476, 256766, 258114, 258423, 257130, 254183, 249871, 245319, 242325, 241710, 242293, 242315, 241439, 240519, 239838, 238752, 237152, 236218, 237230, 240168, 243752, 246409, 247024, 245469, 242885, 241095, 241182, 242669, 244251, 245166, 245690, 246599, 248420, 250931, 253159, 254078, 253602, 252766, 252712, 253765, 255659, 258234, 261303, 264060, 265334, 264675, 262868, 261204, 260455, 260587, 261120, 261565, 261591, 260940, 259343, 256746, 253674, 250917, 248518, 245493, 241088, 236144, 232567, 231445, 232240, 233875, 236000, 238985, 243057, 247621, 251215, 252333, 250724, 247764, 244993, 242578, 240037, 238085, 238281, 240605, 242887, 243384, 242788, 242798, 243816, 245178, 246730, 248732, 250760, 252037, 252616, 253041, 253141, 252258, 250416, 248156, 245492, 242364, 239828, 239359, 240928, 243190, 245585, 248668, 252120, 254215, 254013]
52454B54013j300p28K59J079K156L169L177K542K590L174K667P62q29j105j107
52439B70519j635j653k77J341J692J164R92R76k8j871k944k225m13J032J215L20
52423B68205o20o76r6J3n77o78M99J831J663J00j236j334o01L09J218J830J521
52406B71371K78p52l56J273K504J918q6j555j054Q15K387L019L367L739L487K326
52390B92681R82k0j081k199k276r13K84k43j486j204O46J637J77k532m117l438
52374B76898j119J083J321p45l082l103o50J900K679K073J211K71p99j306p79
52359B75853o6k92j224j624q04Q97K659L493K671P99j55J031L110L836K896K149
52343B95229K872M074M055K704J430J214J535J277J45j186k123k738l025k243
$$ y = [254013, 252713, 251985, 252244, 253323, 255479, 258648, 261825, 264367, 266957, 270131, 272798, 273560, 272731, 271626, 270519, 268884, 267231, 266954, 268295, 269987, 271151, 272143, 273119, 273091, 271220, 268276, 266051, 265638, 266670, 267885, 268205, 267585, 266909, 266813, 266826, 266249, 265571, 266070, 267901, 269564, 269664, 268428, 267094, 266493, 266802, 268020, 269850, 271371, 271649, 270897, 270541, 271814, 274318, 276236, 276150, 274595, 273541, 274356, 276743, 279762, 283129, 286868, 290355, 292681, 293663, 293643, 292562, 290363, 288087, 287174, 287458, 287215, 285729, 284525, 285171, 286808, 286985, 284453, 280336, 276898, 275779, 276862, 278183, 277438, 274356, 271253, 270603, 272503, 275182, 277255, 278466, 278737, 277938, 276632, 275853, 275787, 275495, 274271, 272647, 271843, 272740, 275399, 278892, 281563, 282362, 282207, 283238, 286348, 290184, 293080, 295229, 298101, 302175, 306230, 308934, 310364, 311578, 313113, 314390, 314535, 313349, 311226, 308488, 305463, 303220]
52329C03220R4K749L516J810m64j239o17l9n3r7N9K2q3O24K492M547N181L393
52311C25115l37l807m388j677J491J993J36j004J51J925K322J713J444J484J101
52296C27662P04J163J884J362m60k006k288j928j753j659j300p34R4J537L296
52281C25574M146L318J641O52J010K285L814N137N908O002N642N197M918N005
52267C80249N503N933N569M530M023M940O583P475P176O518O190N975N485M844
52253D60993M191L150J353o61j707j135N37K224L214L424L019K159J087J64m00
52238D81612o06l76M67J713K613K752K679L076L564L253K385K218L012L407K518
52223E14287J404J400J955J603M35rQ85K157L102M088N166N355M161K694K281
$$ y = [303220, 303314, 306063, 309579, 311389, 310925, 309686, 309069, 309030, 308977, 308880, 308939, 308961, 308878, 309502, 311994, 316541, 321722, 325115, 324778, 320971, 316583, 314906, 316397, 318390, 318526, 317522, 317673, 319598, 321920, 323633, 325077, 326561, 327662, 328366, 329529, 331413, 332775, 332315, 330309, 328021, 326093, 324340, 322681, 321381, 320647, 320741, 322278, 325574, 329720, 333038, 334679, 335331, 336341, 338626, 342440, 347577, 353485, 359487, 365129, 370326, 375244, 380249, 385752, 391685, 397254, 401784, 405807, 410747, 417330, 424805, 431981, 438499, 444689, 450664, 456149, 460993, 465184, 468334, 469687, 469026, 467319, 466184, 466721, 468945, 472159, 475583, 478602, 480761, 481848, 482012, 481612, 481006, 480630, 481097, 482810, 485423, 488175, 490854, 493930, 497494, 500747, 503132, 505350, 508362, 511769, 514287, 515691, 517091, 519046, 520649, 521084, 521075, 521960, 524117, 527219, 531307, 536473, 541828, 545989, 548683, 550964]
$$ [...]
##END NTUPLES=NMR SPECTRUM
##END=
