
##TITLE=AC1107_ROVE100E_5867855_BpCmW4qnMg
##JCAMPDX= 6.0         $$ Bruker NMR JCAMP-DX V2.0
##DATA TYPE= NMR SPECTRUM
##DATA CLASS= NTUPLES
##ORIGIN= BRUKER
##OWNER= Administrator
$$ 1.72 TOPSPIN		Version 2.1
$$ 2012-03-30 21:45:02.968 -0500  Administrator@TOPSPIN
$$ Compression mode = diff/dup
##.OBSERVE FREQUENCY= 400.13188235
##.OBSERVE NUCLEUS= ^1H
##.ACQUISITION MODE= SIMULTANEOUS (DQD)
##.ACQUISITION SCHEME= undefined
##.AVERAGES= 8
##.DIGITISER RES= 22
##SPECTROMETER/DATA SYSTEM= spect
##.PULSE SEQUENCE= zg30
##.SOLVENT NAME= COFFEE_meoh
##.SHIFT REFERENCE= INTERNAL, COFFEE_meoh, 1, 14.98061
##AUDIT TRAIL= $$ (NUMBER, WHEN, WHO, WHERE, PROCESS, VERSION, WHAT)
$$ ##TITLE= Audit trail, TOPSPIN		Version 2.1
$$ ##JCAMPDX= 5.01
$$ ##ORIGIN= Bruker BioSpin GmbH
$$ ##OWNER= Administrator
$$ $$ C:\Bruker\TOPSPIN/data/COFFEE/nmr/AC1107_ROVE100E_5867855_BpCmW4qnMg/10/pdata/1/auditp.txt
$$ ##AUDIT TRAIL=  $$ (NUMBER, WHEN, WHO, WHERE, PROCESS, VERSION, WHAT)
(   1,<2012-03-30 21:44:56.187 -0500>,<Administrator>,<TOPSPIN>,<go>,<TOPSPIN 2.1>,
      <created by zg
	started at 2012-03-30 21:43:49.687 -0500,
	POWCHK enabled, PULCHK disabled,
       configuration hash MD5:
       1A 1E CE 29 27 FD 77 03 67 4E F0 E3 C4 B2 CB 90
       data hash MD5: 64K
       56 F1 A7 53 A8 23 49 79 4C 46 1A A2 5A A9 03 E6>)
(   2,<2012-03-30 21:44:58.828 -0500>,<Administrator>,<TOPSPIN>,<proc1d>,<TOPSPIN 2.1>,
      <Start of raw data processing
       efp LB = 0 FT_mod = 6 PKNL = 1 PHC0 = 0 PHC1 = 0 SI = 32K 
       data hash MD5: 32K
       D4 E8 3A DC B4 EE 96 0D 34 33 69 FA CF F1 36 A4>)
(   3,<2012-03-30 21:44:59.250 -0500>,<Administrator>,<TOPSPIN>,<proc1d>,<TOPSPIN 2.1>,
      <pk PHC0 = 209.2401 PHC1 = 0 
       data hash MD5: 32K
       1C 06 42 BF 4F EC A2 12 E2 1F 74 29 C5 C9 8B AF>)
(   4,<2012-03-30 21:44:59.343 -0500>,<Administrator>,<TOPSPIN>,<proc1d>,<TOPSPIN 2.1>,
      <abs ABSG = 1 
       data hash MD5: 32K
       95 72 9C 92 EE E2 5F 4A 73 A6 F2 B8 07 35 E9 D6>)
(   5,<2012-03-30 21:44:59.375 -0500>,<Administrator>,<TOPSPIN>,<proc1d>,<TOPSPIN 2.1>,
      <abs ABSG = 2 
       data hash MD5: 32K
       D1 23 0F 2E E7 69 67 AB F8 E1 07 69 2E 45 9E 3E>)
(   6,<2012-03-30 21:44:59.406 -0500>,<Administrator>,<TOPSPIN>,<proc1d>,<TOPSPIN 2.1>,
      <abs ABSG = 3 
       data hash MD5: 32K
       45 CF AD D0 A2 B6 0E 8A B7 B5 25 04 1D 4B D8 6D>)
(   7,<2012-03-30 21:44:59.437 -0500>,<Administrator>,<TOPSPIN>,<proc1d>,<TOPSPIN 2.1>,
      <abs ABSG = 4 
       data hash MD5: 32K
       9D 79 67 18 DE 8C E1 96 1F CF 1C 50 FD 0D 0C 6E>)
(   8,<2012-03-30 21:44:59.468 -0500>,<Administrator>,<TOPSPIN>,<proc1d>,<TOPSPIN 2.1>,
      <abs ABSG = 5 
       data hash MD5: 32K
       7F 4D 1C 7C 7C FB 76 22 90 F4 B4 46 37 49 C0 B4>)
$$ ##END=
$$ 
$$ $$ hash MD5
$$ $$ 5E 80 F7 C1 63 95 35 E7 CE ED 3D 5A F5 B9 3C F1
##$RELAX= 
##$RELAX= 
##$RELAX= 
##$RELAX= 
##$RELAX= 
##$RELAX= 
##$RELAX= 
$$ Bruker specific parameters
$$ --------------------------
$$ [...]
150 150 150 150 150 150 150 150
##$TP07= 0
##$TPNAME0= <>
##$TPNAME1= <>
##$TPNAME2= <>
##$TPNAME3= <>
##$TPNAME4= <>
##$TPNAME5= <>
##$TPNAME6= <>
##$TPNAME7= <>
##$TPOAL= (0..7)
0.5 0.5 0.5 0.5 0.5 0.5 0.5 0.5
##$TPOFFS= (0..7)
0 0 0 0 0 0 0 0
##$TUNHIN= 0
##$TUNHOUT= 0
##$TUNXOUT= 0
##$USERA1= <user>
##$USERA2= <user>
##$USERA3= <user>
##$USERA4= <user>
##$USERA5= <user>
##$V9= 5
##$VALIST= <valist>
##$VCLIST= <CCCCCCCCCCCCCCC>
##$VD= 0
##$VDLIST= <DDDDDDDDDDDDDDD>
##$VPLIST= <PPPPPPPPPPPPPPP>
##$VTLIST= <TTTTTTTTTTTTTTT>
##$WBST= 2048
##$WBSW= 25
##$XGAIN= (0..3)
0 0 0 0
##$XL= 0
##$YL= 0
##$YMAX_a= 520212
##$YMIN_a= -633700
##$ZGOPTNS= <>
##$ZL1= 120
##$ZL2= 120
##$ZL3= 120
##$ZL4= 120
##$ABSF1= 14.98061
##$ABSF2= -5.57192
##$ABSG= 5
##$ABSL= 3
##$ALPHA= 0
##$AQORDER= 0
##$ASSFAC= 0
##$ASSFACI= 0
##$ASSFACX= 0
##$ASSWID= 0
##$AUNMP= <proc_prof1d_extract_pilot.lims>
##$AXLEFT= 0
##$AXNAME= <>
##$AXNUC= <1H>
##$AXRIGHT= 0
##$AXTYPE= 0
##$AXUNIT= <>
##$AZFE= 0.1
##$AZFW= 0.1
##$BCFW= 0
##$BC_mod= 0
##$BYTORDP= 0
##$COROFFS= 0
##$CY= 15
##$DATMOD= 1
##$DC= 0
##$DFILT= <>
##$DTYPP= 0
##$F1P= 0
##$F2P= 0
##$FCOR= 0.5
##$FTSIZE= 32768
##$FT_mod= 6
##$GAMMA= 0
##$GB= 0
##$INTBC= 1
##$INTSCL= 1
##$ISEN= 128
##$LB= 0
##$LEV0= 0
##$LPBIN= 0
##$MAXI= 10000
##$MC2= 0
##$MEAN= 0
##$ME_mod= 0
##$MI= 0
##$NCOEF= 0
##$NC_proc= -8
##$NLEV= 6
##$NOISF1= 0
##$NOISF2= 0
##$NSP= 0
##$NTH_PI= 0
##$NZP= 0
##$OFFSET= 14.98061
##$PC= 1
##$PHC0= 209.2401
##$PHC1= 0
##$PH_mod= 1
##$PKNL= yes
##$PPARMOD= 0
##$PPDIAG= 0
##$PPIPTYP= 0
##$PPMPNUM= 2147483647
##$PPRESOL= 1
##$PSCAL= 4
##$PSIGN= 0
##$PYNMP= <proc.py>
##$REVERSE= no
##$SF= 400.13
##$SI= 32768
##$SIGF1= 0
##$SIGF2= 0
##$SINO= 400
##$SIOLD= 32768
##$SPECTYP= <>
##$SREGLST= <1H.CDCl3>
##$SSB= 0
##$STSI= 32768
##$STSR= 0
##$SW_p= 8223.68421052632
##$SYMM= 0
##$S_DEV= 0
##$TDeff= 65536
##$TDoff= 0
##$TI= <>
##$TILT= no
##$TM1= 0
##$TM2= 0
##$TOPLEV= 0
##$USERP1= <user>
##$USERP2= <user>
##$USERP3= <user>
##$USERP4= <user>
##$USERP5= <user>
##$WDW= 1
##$XDIM= 32768
##$YMAX_p= 440334065
##$YMIN_p= -710810
##$CURPLOT= <Network HP LaserJet P1505>
##$CURPRIN= <$Network HP LaserJet P1505>
##$DFORMAT= <normdp>
##$LAYOUT= <+/1D_H.xwp>
##$LFORMAT= <normlp>
##$PFORMAT= <normpl>
##$SURQMSG= 1
$$ End of Bruker specific parameters
$$ ---------------------------------
##NTUPLES= NMR SPECTRUM
##VAR_NAME=  FREQUENCY,     SPECTRUM/REAL,   SPECTRUM/IMAG
##SYMBOL=    X,             R,               I
##VAR_TYPE=  INDEPENDENT,   DEPENDENT,       DEPENDENT
##VAR_FORM=  AFFN,          ASDF,            ASDF
##VAR_DIM=   32768,         32768,           32768
##UNITS=     HZ,            ARBITRARY UNITS, ARBITRARY UNITS
##FACTOR=    0.250966925370066, 1,           1
##FIRST=     8223.43324360095, 62350,        -166898
##LAST=      0,             28497,           -402160
##MIN=       0,             -710810,         0
##MAX=       8223.43324360095, 440334065,    0
$$ Real data points
##PAGE= N=1
##DATA TABLE= (X++(R..R)), XYDATA
$$ [...]
19534a58544g7123j87404B36688G9363g9428D0178H253c67053A1033L3017c10075
19522B2735b28834r5025O3643I4713a12479k21019a24105l69677A46661c274A03099
19510B7152f3869A86438p3989a21727j86001a50593k12726J0321h6501j09024
19500a95525Q243b3051P675l45036d9618j52412c8585j0183k61454J18190L0859
19489a61173e4665C40042o878H0196a27516E7836b56904k9644A13137a98331H2
19477h422o9263H4799c86773A84106b2292l8300k89299G6399b6735j76521N0422
19466a52834E0744J41184d18427I956B273c31572a28678K7258j66143I3052b17049
19454d651A63032o6666P7412a02297D543c7168r5049A99468c37528a5247o1295
$$ y = [-158544, -77123, -264527, 236688, 79363, -79428, 40178, 8253, -367053, 11033, 44050, -310075, 22735, -228834, -323859, -260216, 94713, -112479, -333498, -124105, -493782, 146661, -3274, 103099, 27152, -63869, 186438, 112449, -121727, -307728, -150593, -363319, -352998, -86501, -195525, -187282, -23051, -15376, -360412, -49618, -202030, -38585, -48768, -310222, -192032, -161173, -54665, 340042, 333164, 80196, -127516, 57836, -256904, -286548, 113137, -198331, 82, -8422, -77685, 84799, -386773, 184106, -22292, -60592, -349891, 76399, -26735, -203256, -152834, 50744, 191928, -418427, 9956, 2273, -331572, -128678, -101420, -267563, 93052, -217049, -4651, 163032, 96366, 173778, -102297, 4543, -37168, -132217, 199468, -337528, -15247, -76542]
19443g6542A95510J17159A17423B2415g4637A32809a39064o2188k16381g8296
19432C1691R6481a05333k95941B16764f3870B82687c66666a30782j50739A17618
19421i2578J3979A43240R1120a50218J4203o4915B88561o0903i1100A31183b56879
19409h5897j31740g7761B2783e1137k07440m9291J510G8522c95400J50497h7011
19397A67927e45265A26011a39490j22870N9884k5791L9584d8029C07817e2426
19386e1945l3797j41295a09669p3689A66444a37425n170B10341a42979O4032G4160
19374I4839a55358j46097h1719a5536k76170I0709A0061D441b22473F4590a20259
19362a06704A58746O989B4450J12811a11401k9379A65198a30509c6413E8187K58098
$$ y = [-76542, 195510, 312669, 117423, 22415, -74637, 132809, -139064, -201252, -417633, -78296, 31691, 128172, -105333, -401274, 216764, -63870, 282687, -366666, -130782, -281521, 117618, -92578, -78599, 143240, 234360, -150218, -136015, -200930, 288561, 227658, -91100, 131183, -256879, -85897, -217637, -77761, 22783, -51137, -258577, -307868, -306358, 78522, -395400, -244903, -87011, 167927, -545265, 126011, -139490, -262360, -202476, -228267, -188683, -48029, 307817, -52426, -51945, -85742, -227037, -109669, -183358, 166444, -137425, -142595, 210341, -142979, -78947, 74160, 94839, -155358, -301455, -81719, -15536, -291706, 90709, 10061, 4441, -222473, 64590, -120259, -106704, 158746, 165735, 24450, 137261, -111401, -140780, 165198, -130509, -36413, 58187, 316285]
19351C16285a90021F5569a86975h0354j1415o9556a1918n10812d1021A26688a41305
19339a52107o9068J09292A59963a93472P1972A20999E8196K23563A22211J18642
19329B40853G7932b71438a08331K9909m18A83650D3759Q5168Q7236o1028h4899
19317A05255b11115c7309a3707o825C4805g3606j96845D286J36486O4639H6718
19305D5182L9552a39123e6196I9509d83453A72439e472m20606J45320P5406E373
19293f6668A29516n6293e9762r8144k10812K9594B70203a56508b9364p6759J5524
19282i0599j19392A94601D1447a00085k66950h7166F0741a51853L5496B36380
19271e7971F1076G210J44471n7136b13227R7058j59111o1320a2167A66970c86699
$$ y = [316285, -190021, 65569, -186975, -80354, -91769, -161325, -11918, -522730, -41021, 126688, -141305, -152107, -221175, -111883, 159963, -193472, -121500, 120999, 58196, 281759, 122211, 240853, 77932, -271438, -108331, -78422, -78840, 183650, 43759, 128927, 216163, 155135, -84899, 105255, -211115, -37309, -13707, -20532, 34805, -73606, -270451, 4286, 140772, 205411, 86718, 45182, 84734, -139123, -56196, 99509, -483453, 172439, -5472, -426078, -280758, -205352, 5373, -66668, 129516, 73223, -59762, -157906, -368718, -339124, 270203, -156508, -29364, -106123, -90599, -209991, 194601, 41447, -100085, -367035, -87166, 60741, -151853, -116357, 236380, -57971, 61076, 7210, 151681, 94545, -213227, -116169, -275280, -336600, -12167, 166970, -386699]
19259g3642j15728G5085b05411c6263B6859K39672r8105b07344k7593j08766D7988
19247h5539L2527m2549A45682n2551a92100N5919B7610N1898b9811q2255i07l35120
19235c36027H4261b01202c6721r882A47138i0599p1224A29920C3371b00958C9300
19223A8013O7236i0355A00927k7598a80611A28862k9238b7153B6107K1409a71439
19211a99168L5772j0257m9716E8937a13759A08515f6245q3267Q433A21651F704
19199g7268J2642B4947b63981B90588c48700B2636c5259p376A66194c9233A89334
19187a86009B96931b57671A55042a30233A8055R3612B6116a04310b7522j08883
19177a36405e2102F458L3969A9193g0365B1117K08495A2068R030J7280c752m158
$$ y = [-73642, -189370, 75085, -205411, -36263, 26859, 266531, 168426, -207344, -234937, -343703, 47988, -85539, -53012, -95561, 145682, 93131, -192100, -136181, 27610, 79508, -29811, -112066, -907, -336027, 84261, -201202, -36721, -46603, 147138, -90599, -161823, 129920, 33371, -200958, 39300, 18013, 85249, -90355, 100927, 73329, -180611, 128862, 99624, -27153, 26107, 47516, -171439, -199168, -163396, -173653, -223369, 58937, -113759, 108515, -66245, -149512, -141079, 121651, 6704, -77268, -64626, 24947, -263981, 290588, -348700, 22636, -35259, -42635, 166194, -39233, 189334, -186009, 296931, -257671, 155042, -130233, 18055, 111667, 26116, -104310, -27522, -136405, -52102, 6458, 40427, 19193, -70365, 21117, 229612, 12068, 21098, 38378, -3752, -7910]
19165g910j66619H7151j1637f5056E687J07350n4526Q1476A1194c47670h5766
19153A35685l188b45394C67303I3948b75960H4894j6335b5675j88593N2094C2114
19141D630e16487B37571c98259A15821c31948c0638C2964c4001n4456g988A18047
19129a07576A54231a30733I8170h8554n3320j81216E073d9944l57949a72068j44901
19118c16969J32977B9547b44255B9057e4827A19000l9024b4177n0999D4638e5384
19106D2569L9600b12416B35670A6318R3668b88605i0637M1194H7005M8412e6048
19094c373D4613b97886a09905c603k11718i1114j0631A91410b62140E8490c63783
19082a65672A8464d33739e131A51580E0916c31503A3044b30939J7773I7677h3413
$$ y = [-7910, -174529, 87151, 75514, -65056, 5687, 113037, 58511, 139987, 11194, -347670, -85766, 135685, 132497, -245394, 367303, 93948, -275960, 84894, 68559, -25675, -214268, -162174, 32114, 4630, -516487, 237571, -398259, 115821, -331948, -30638, 32964, -34001, -88457, -7988, 118047, -107576, 154231, -130733, 98170, -88554, -141874, -323090, 5073, -49944, -407893, -172068, -316969, -183992, 29547, -244255, 29057, -54827, 119000, 79976, -24177, -75176, 44638, -55384, 42569, 82169, -212416, 235670, 16318, 109986, -288605, -90637, -49443, 87005, 135417, -56048, -3373, 44613, -297886, -109905, -3603, -215321, -91114, -101745, 191410, -262140, 58490, -363783, -165672, 18464, -433739, -5131, 151580, 50916, -331503, 13044, -230939, -213166, 97677, -83413]
19070G6704J06679H2819g0507p2184k15589c5539j83929B32072C1733J1993N842
19059D9568N5004c10558A30650a69123L6807B92556A12706d32305a41422c3249
19048G4154i8489L0134J672i684j90569A55946f497B70778i8229A65246g0154
19036a75404c4651E3438B5712b70659c3197d114B07036e9373E8662c46131e9428
19024b51142A66128a31050c4913A03493h0745k5138B1554a18032M1733j09500
19014a85799f7539A76512e0004a5503I2164a03246F2644R2031l2720b73423g747
19002a52223E9382J07555L25904G9398c57975j10956b6893k084j0430n4307C6685
18990a18773j19992C45102A57910e8914j00031k45899a23158I8530j7448e14132
$$ y = [76704, 183383, 82819, -70507, -142691, -358280, -35539, -219468, 232072, 31733, 43726, 49568, 104572, -310558, 130650, -169123, -132316, 292556, 112706, -432305, -141422, -33249, 74154, -98489, -68355, -66683, -9684, -200253, 155946, -6497, 270778, -98229, 165246, -70154, -175404, -34651, 53438, 25712, -270659, -33197, -4114, 207036, -59373, 58662, -346131, -59428, -251142, 166128, -131050, -34913, 103493, -80745, -105883, 21554, -118032, -76299, -185799, -67539, 176512, -50004, -15503, 92164, -103246, 62644, 154675, 121955, -273423, -7747, -152223, 59382, 166937, 492841, 79398, -357975, -468931, -26893, -28977, -39407, -93714, 36685, -118773, -238765, 345102, 157910, -58914, -158945, -404844, -123158, 98530, 81082, -514132]
18979b75169D4533i7033A75755G5795d3078j53471j7421h7194I9464c828j11187
18968a15015E9766k7254a61607B00394a18300d3205p8905A50867i7316o0658G2155
18956a74732F3002Q2966b9889m2613j17147G1083b49068h6072L7128A74878k4723
18945A50155D4830J28063J73741a7257k39081B08431F3096b28133N3990K6757
18935a47386A25510c0893j4981j63336H4141a92111g6558N749F1958a05650A57695
18923C49107a63576c9785A09611c34473J17002k13352B85963f06006B32890b88593
18912F0306A3442c60737A00011M2763f6707p5569A4181n419K06050a28721q2281
18901b11002A19161e1144j40786C2961d4427b1829o3499j25812h5173J0902D9425
$$ y = [-275169, 44533, -97033, 175755, 75795, -43078, -196549, -213970, -87194, 99464, -3828, -115015, 59766, 32512, -161607, 200394, -118300, -43205, -122110, 150867, -97316, -157974, 72155, -174732, 63002, 145968, -29889, -72502, -189649, 71083, -249068, -86072, -48944, 174878, 150155, 44830, 172893, 346634, -17257, -256338, 208431, 63096, -228133, -174143, -147386, 125510, -30893, -45874, -209210, 84141, -192111, -76558, -70809, 61958, -105650, 157695, 349107, -163576, -39785, 109611, -334473, -217471, -430823, 285963, -606006, 232890, -288593, 60306, 13442, -360737, 100011, 142774, -66707, -142276, 14181, 8762, 214812, -128721, -211002, 119161, -51144, -191930, 32961, -44427, -21829, -85328, -211140, -85173, -74271, 49425]
18889b11535G8442a22867A98570b1542j72024P5327G462b02273Q7200k08366I4177
18877b6038A75596b34230F1075k6734c3389A71770b94820J34172b1778n7569A49622
18865E0625J07542i1985k11794B92600C7535K3266d6892j61125j06235F6681A1521
18853A25372a29163p2669A8497a13779i791r8567j84238N7489B77063c22084j4789
18842c36873B7673J06821a67773F830d6374A93082i2728A37055C5698A7754c2263
18830a0028q6132k16269i0428k3285D7632B0324b0737G4200C686b23504h375G7647
18817b25501I4482b3979j76919A23053f3798E2229a58929f1681k77228a15363
18806a21836j740e1098J6457j13566i921a680A81525P248a69773C77980a52746
$$ y = [-211535, 78442, -122867, 198570, -21542, -193566, -118239, 7462, -202273, -115073, -323439, 94177, -26038, 175596, -234230, 61075, 34341, -33389, 171770, -294820, -160648, -21778, -79347, 149622, 50625, 158167, -91985, -303779, 292600, 37535, 60801, -46892, -208017, -314252, 66681, 11521, 125372, -129163, -201832, 18497, -113779, -9791, -108358, -292596, -235107, 277063, -322084, -336873, 27673, 134494, -167773, 6830, -46374, 193082, -92728, 137055, 35698, 17754, -32263, -10028, -96160, -312429, -90428, -113713, 47632, 20324, -20737, 74200, 3686, -223504, -8375, 77647, -225501, 94482, -23979, -200898, 123053, -63798, 52229, -158929, -61681, -338909, -115363, -121836, -123576, -51098, -34641, -148207, -9921, -1680, 181525, 188773, -169773, 377980, -152746]
18794B58611J19766a54978M9524A06788N3912L0380c02842B9998c50227G0124
18783e5940A0300J35080J77882E3258b06260B9930c8814n1713B4542e6789b5368
18771c88640n0345A22201d637n4757j93820h9584J0507A85409d9790j55770Q2458
18760a23102e0125E718b21832f5520A26065a17900I2530b11425H5810c19261B3830
18748b2882j8353m5080B70686b77540I4841l0223a87469L6618O6661j82681a26026
18736c46933a24865F6989p375b44295D4751g8462k2812C5062c57827J74191C7952
18724c82920a28822A11422K87478b58009j35A5626a68040D4356Q9201P4168g3541
18712a98624r4945L4851j86283J93937D5523j5349h9658L9245l3185k40163B39226
$$ y = [258611, 378377, -154978, -105454, 106788, 160700, 191080, -302842, 29998, -350227, 70124, -55940, 10300, 145380, 323262, 53258, -206260, 29930, -38814, -90527, 24542, -56789, -25368, -388640, -438985, 122201, -4637, -59394, -253214, -89584, -79077, 185409, -49790, -205560, -123102, -50125, 5718, -221832, -65520, 126065, -117900, 92530, -211425, 85810, -319261, 23830, -22882, -41235, -86315, 270686, -277540, 94841, 64618, -187469, -150851, -84190, -266871, -126026, -346933, -124865, 66989, 59614, -244295, 44751, -78462, -101274, 35062, -357827, -183636, 37952, -382920, -128822, 111422, 398900, -258009, -258144, 15626, -168040, 44356, 133557, 207725, -73541, -198624, -293569, -258718, -445001, -251064, 45523, 30174, -89658, -50413, -83598, -323761, 239226]
18700a20301H0580d4414C9438a45428a9483o8957k3655L4180A64208N5780i2045
18688A05646b18708Q5497n2558m6529R1856J2124J2025J0795M9358A55891i9608
18676B02941b39297f0974q7454j23809J19858F7209b0134O929j11829K0544C23220
18664A37485E7978a07568a9833F0416c3419A34029m8950a48126B11140I7136J76836
18653B73972a03979B2287a59928L978M4122a7321E5426b6930F7854h9619j08182
18642a97801R7713c6703j04764H4687J6550J16183D9475b87477a12479a29m3474
18631d3603D0642e0521k289B7088i6580G857a45339K6768B80599A00442A5183
18619B23154b66129d2646l5854j94554o289g4644o0594B01130d7902n8785L6463
$$ y = [-120301, 80580, -44414, 39438, -145428, -19483, -88440, -112095, -77915, 164208, 219988, -92045, 105646, -218708, -133211, -185769, -232298, -140442, -128318, -116293, -105498, -56140, 155891, -99608, 202941, -239297, -60974, -148428, -272237, -152379, 67209, -20134, -13205, -125034, -104490, 323220, 137485, 57978, -107568, -19833, 60416, -33419, 134029, 85079, -148126, 211140, 97136, 273972, -103979, 22287, -159928, -155950, -111828, -17321, 55426, -26930, 67854, -89619, -197801, -100088, -36703, -141467, 84687, 101237, 217420, 49475, -287477, -112479, -129, -43603, 40642, -50521, -52810, 27088, -96580, 7857, -145339, -118571, 280599, 100442, 15183, 223154, -266129, -42646, -78500, -273054, -279343, -74644, -135238, 201130, -47902, -106687, -70224]
18608g0224j64439Q3746k0064b9774A66232B2203a87556A34078J5272L5685Q8994
18597B74029q3034M588d62223J91972A05503c29023a62770j87558f5941A10815
18586a11484A6922b23726A68233D31i6289j0634q9344A38348h0034H2252D0070
18574a94914L2463J8208L3442J3752j50468A91030a38817N3792p904j33980J11155
18563a15754B8950B68a73419I5928l860f6258C97495a00663q1096B32912i2575
18551C10343a47987r057E2255a50572a2883n8571l32981D3475d44377a58541e0722
18539E6945a54785E9471h8280o9598B5521R5427i5875D3355R4762J49866G7164
18527b2273j15492G182a5971j87980l70043I8645C5885J14899c34362k43489i9723
$$ y = [-70224, -234663, -150917, -170981, -29774, 166232, 22203, -187556, 134078, 149350, 185035, 274029, 190995, 195583, -462223, -270251, 105503, -329023, -162770, -350328, -65941, 110815, -111484, 16922, -223726, 168233, 431, -96289, -106923, -196267, 138348, -80034, 82252, 40070, -194914, -162451, -144243, -110801, -97049, -247517, 191030, -138817, -85025, -92929, -226909, -115754, 28950, 268, -173419, 95928, 92068, -66258, 397495, -100663, -181759, 232912, -92575, 310343, -147987, -157044, 52255, -150572, -12883, -71454, -404435, 43475, -444377, -158541, -50722, 56945, -154785, 59471, -88280, -157878, 25521, 120948, -95875, 43355, 138117, 287983, 77164, -22273, -137765, 7182, -15971, -203951, -573994, 98645, 35885, 150784, -334362, -577851, -99723]
18515a09012j81259k17636a29799k31709D8389h5534b8405A30740b06628g2629
18504h0317p6218k04981f4413k35311c4211l6161E51155H1919A9560g1512A93287
18492i7756J76k31040a59612B3627e040G740b57334g8445j53694H1067c0569C74275
18479H7619C1028b03068L4950A66682R620K0583b33496G9419C0214b82139c92
18467a44951B33758d65215J71153j35503C7880b86257a15505a5679j06871C43185
18456a52026H468c49659A72486j8883g1297k5141l3764m6366k53533a27568A44687
18444B91336e0884B23452B4278h5830A64945h2916A51870B2011Q4019n0221e4254
18432f3568j63901N8963O0318M2962A77006b98822C01874c11536A92890H7428
$$ y = [-109012, -290271, -507907, -129799, -361508, 48389, -85534, -28405, 130740, -206628, -72629, -80317, -156535, -361516, -64413, -299724, -34211, -70372, 551155, 81919, 19560, -71512, 193287, -97756, -97580, -328620, -159612, 23627, -5040, 7740, -257334, -78445, -232139, 81067, -30569, 374275, 87619, 31028, -203068, -168118, 166682, 176302, 196885, -233496, 79419, 30214, -282139, -392, -144951, 233758, -465215, -294062, -429565, 37880, -286257, -115505, -15679, -122550, 343185, -152026, 8468, -349659, 172486, 153603, -71297, -96438, -130202, -176568, -430101, -127568, 144687, 291336, -50884, 223452, 24278, -85830, 164945, -82916, 151870, 22011, 106030, 55809, -54254, -63568, -227469, -168506, -108188, -65226, 177006, -298822, 301874, -311536, 192890, 87428]
18421A35098a77795f5928j62803A08908H695b63l48916a41337A14584a16796l09835
18410d26631J43129B65245a05747B55185B8626J80454f0663j95591J26492M3622
18400h6140l5215N85l9570j97685A05071Q7569a94371f9968I6881a03235F9515
18388G9912J64205d6325A66103A6278Q587c65868P4445B4321Q9947a26941A28654
18376a31693R310j70658f2053A97335a98432h4650A26325b25758m59A56358f2280
18364B32715B1499a18472j06620L1616a3473j24249F298L06960a51331q7764J19149
18353a19946A72382d4537E1690b17377b3342A23446M3009e0165A33255K1681g395
18341a09357B6560o062a36816r4190B01340r2494m2829i5306l1670A12671a13736
$$ y = [135098, -177795, -65928, -228731, 108908, 8695, -263, -349179, -141337, 114584, -116796, -426631, -283502, 265245, -105747, 255185, 28626, 209080, -60663, -256254, -129762, -86140, -121355, -120770, -160340, -358025, 105071, 192640, -194371, -69968, 96881, -103235, 69515, 79912, 244117, -46325, 166103, 16278, 24865, -365868, -291423, 24321, 114268, -126941, 128654, -131693, -122383, -293041, -62053, 197335, -198432, -84650, 126325, -225758, -226217, 156358, -62280, 232715, 21499, -118472, -225092, -193476, -13473, -137722, 6298, 313258, -151331, -239095, -119946, 172382, -44537, 51690, -217377, -23342, 123446, 166455, -50165, 133255, 154936, -7395, -109357, 26560, 20498, -136816, -231006, 201340, 108846, 66017, -95306, -126976, 112671, -113736]
18329g7034r8355n6511a4672A28807a52467a4126A9547a4597j4721D29751G0608
18317e5743A02414L6843J17396H4381d1352a6550j3399q617B6280f6045b5026
18305B5923P2546l7199b44289H2089J94945A0460c0339j03260m8687J6124j12281
18294b78443A02879l0050h6646q2821M2106j58222k2476J44242O5811j08622j94303
18283d00931C8941a44149j18399N6424e7856A10814j3869J69367b61622K3989
18273b37633d9487C69305b23039G0526j122b10249I0842b78879C99777c03109
18262B35132l3315Q9993a0211B7737a64948l2001m28265b32838k43570f4329p6466
18251a40795N3012l00926A23432j9729e5560J5026B96254A6518a75933A32530
$$ y = [-77034, -175389, -231900, -14672, 128807, -152467, -14126, 19547, -14597, -29318, 429751, 70608, -55743, 102414, 139257, 256653, 84381, -41352, -16550, -29949, -38566, 26280, -66045, -25026, 25923, 98469, 61270, -244289, 82089, 277034, 10460, -30339, -133599, -182286, -166162, -278443, 102879, 72829, -86646, -169467, -127361, -285583, -308059, -163817, -98006, -206628, -400931, 38941, -144149, -262548, -206124, -57856, 110814, 96945, 266312, -261622, -237633, -49487, 369305, -223039, 70526, 69404, -210249, 90842, -278879, 399777, -303109, 235132, 201817, 291810, -10211, 27737, -164948, -196949, -625214, -232838, -476408, -64329, -140795, -87783, -388709, 123432, 103703, -55560, -40534, 296254, 16518, -175933, 132530]
18240f4705C26515a62939A67718p5400b13026j11693a45260C4062O9291b38932
18229A53179J84486A36039b6717D29572a83338O7874L5107D6164j3814c82384
18218A500b24998A1091g6901A96859i9939A61077b10889G2901b4739B03252D6302
18206c36778Q2585g1820r8822A72968M879b03333h5966J8411l59891B77524A04900
18194h1833l6197l98919f4198B44725a67168B37975a2980A0680b11075R9829j0483
18183a21729c3786m7851K7226D9189c77433B60660a58104J6500A99537c55693
18172A57627a48616k0917g2717L0940F2839b57761A39439J54604b30322D1350
18161a96971A40481J45651K9326C5088H335N7926M8966a74057o3263C5641d18337
$$ y = [-64705, 326515, -162939, 167718, 92318, -213026, -324719, -145260, 34062, 103353, -238932, 153179, 337665, 136039, -26717, 429572, -183338, -115464, -80357, 46164, 32350, -382384, 1500, -224998, 11091, -76901, 196859, -99939, 161077, -210889, 72901, -24739, 203252, 46302, -336778, -254193, -71820, -170642, 172968, 177847, -203333, -85966, -67555, -427446, 277524, 104900, -81833, -118030, -516949, -64198, 244725, -167168, 237975, -12980, 10680, -211075, -111246, -121729, -33786, -81637, -54411, 49189, -377433, 260660, -158104, -141604, 199537, -355693, 157627, -148616, -169533, -72717, -41777, 62839, -257761, 139439, 294043, -230322, 41350, -196971, 140481, 286132, 315458, 35088, 8335, 66261, 115227, -174057, -237320, 35641, -418337]
18149B16952A4176a28024c0985j07061j0522A70469o7262A965R599b61164J17288
18138a43876j71731M091a33703N9250A02444c29755A99151g7123l5794G1226c9456
18126a66386d1130A36175C4165c3650H1031Q2106c3474k13286Q0220A41980G750
18114a19308k1360k08920A85147e776l3005m6620j05368A33054I893b98543F5492
18102A17133D7458a100p7655B8344K2195b54332J24611F0831h8760E1641c4751
18090b54962J17847p0486M1255C7415b0297j05059B41335b52234a0666A06971
18079a42739l1792N2093k34948J22096O1866P0455q4509r68A47115a6187B3853
18067a35790G4035c2851k2902j80767G4568b0642R53k34317J005h1292B44840
$$ y = [216952, 14176, -128024, -30985, -138046, -148568, 170469, 103207, 1965, 11564, -261164, -143876, -315607, -311516, -133703, -74453, 102444, -329755, 199151, -77123, -112917, 71226, -39456, -166386, -41130, 136175, 34165, -33650, 81031, 163137, -33474, -246760, -166540, 141980, 7750, -119308, -140668, -349588, 185147, -5776, -38781, -85401, -190769, 133054, 9893, -298543, 65492, 117133, 47458, -1100, -78755, 28344, 50539, -254332, -129721, 60831, -88760, 51641, -34751, -254962, -137115, -207601, -166346, 37415, -20297, -125356, 241335, -252234, -10666, 106971, -142739, -174531, -122438, -357386, -235290, -173424, -102969, -187478, -188446, 147115, -16187, 23853, -135790, 74035, -32851, -55753, -236520, 74568, -20642, -19689, -254006, -253001, -81292, 244840]
18055b55877h4092n2939b2265A68924k5376c11165I9885k3283B2470J47233b45420
18043c83016J16638A68788g8385p5661k5707G3780m793M1922a31318A18143d0911
18031i7134c5241b865k81108F7205k895L83574a50797j79336B10082b69848F3116
18019H3877a73182B02890b61061C3325a09825B17861C7305a54467P0745k72798
18009c56520J12014K2335l07511a51704B93069d2234j0659j05239j7453q7454
17999b63039a15090l08468i2213A1322K08020a46447k52758B41067b32048O4320
17989a67728m5568A54281D7440a34971j86827a05765b1558j46162e3273B66727
17978a58697I7079J96749a27518k79905E4376B4704L39557e686q9990L1339F2984
$$ y = [-255877, -84092, -137031, -22265, 168924, 143548, -311165, 99885, 76602, 22470, 169703, -245420, -383016, -266378, 168788, -78385, -154046, -179753, 73780, 68987, 110909, -131318, 118143, -40911, -97134, -35241, -2865, -283973, 67205, 64310, 447884, -150797, -330133, 210082, -269848, 63116, 83877, -173182, 202890, -261061, 33325, -109825, 217861, 37305, -154467, -83722, -356520, -244506, -222171, -529682, -151704, 293069, -42234, -52893, -158132, -175585, -263039, -115090, -423558, -92213, 11322, 219342, -146447, -399205, 241067, -232048, -167728, -213296, 154281, 47440, -134971, -321798, -105765, -21558, -167720, -53273, 266727, -158697, 97079, 293828, -127518, -407423, 54376, 24704, 364261, -5686, -95676, -64337, 62984]
17966i2065C20405C6818J03272L6300b4470A33417n9964C3899b37701i3831J105
17955i2726l09889a55463I1971A930a64806G8917J78047j05002b36044f7971l7761
17944a05732R497k7188E6428a54512M2284D4447K40619a09883M7870A37037R176
17933A46213l5382j2208O4767a49051j50912a46967H6092c63980C6740c3713B12869
17921e4719a4761k1748B13228i4238k46997A83620C850L19784a50938B25561a78831
17909A36288a47281A18603a26824A61550M7533A9474L84376a24108j28676A62649
17898b08863A69041H1048C1789g4131k8566B228d2596k00157K3772D83370c05864
17886C38788A44007C8967J76185a06144H3658K10480a64773A0074a21201C4977
$$ y = [-92065, 320405, 36818, 140090, 176390, -24470, 133417, 73453, 33899, -237701, -93831, -92726, -402615, -155463, 91971, 1930, -164806, 78917, 256964, 151962, -236044, -67971, -105732, -96235, -123423, 56428, -154512, -112228, 44447, 285066, -109883, -62013, 137037, 146213, 110831, 98623, 163390, -149051, -299963, -146967, 86092, -363980, 36740, -33713, 212869, -54719, -14761, -36509, 213228, -94238, -341235, 183620, 3850, 323634, -150938, 225561, -178831, 136288, -147281, 118603, -126824, 161550, 209083, 19474, 403850, -124108, -252784, 162649, -208863, 169041, 81048, 31789, -74131, -102697, 2228, -42596, -242753, -218981, 483370, -305864, 338788, 144007, 38967, 215152, -106144, 83658, 294138, -164773, 10074, -121201, 34977]
17875F6042O7320f0145D6538R006b00551q9382Q0493h3209r8811d4413n3576n6923
17863a54912Q849k024O553f5081j05017F2907K66199j08977a69424P2811k9020
17852a25633G934f4655B7330b22741A12380a58175A72645a80783B44048a53186
17841A17229C6200j6904g3783j70096A20843a63635L7445b5086j8008B64742g3617
17829B35895B4838J25158C7383a58404B42967I0792g6760J9162B26015d5004j95210
17818b40214j38955C1845K24564b09696E5272J52411Q8107p7578a13210b271G3302
17806b24311A44257n6833J24107f7629B25260f164m6312A90461q9433f2483O235
17795e6248B4439Q143R2665f9598l4013B74423m5606b78421a35410A77306i6396
$$ y = [66042, 133362, -60145, 46538, 55544, -200551, -289933, -209440, -83209, -182020, -44413, -97989, -154912, -146063, -148087, -141534, -65081, -170098, 62907, 329106, 220129, -169424, -96613, -125633, 7934, -64655, 27330, -222741, 112380, -158175, 172645, -180783, 244048, -153186, 117229, 36200, 19296, -73783, -243879, 120843, -163635, -126190, -25086, -43094, 264742, -73617, 235895, 24838, 149996, 37383, -158404, 242967, 90792, -76760, -57598, 226015, -45004, -240214, -379169, 31845, 256409, -209696, 55272, 207683, 295790, 218212, -113210, -2271, 73302, -224311, 144257, 87424, 211531, -67629, 225260, -6164, -52476, 190461, 101028, -62483, -56248, 24439, 32582, 125247, -69598, -103611, 274423, 228817, -278421, -135410, 177306, -96396]
17783a51177g0529G1957K22892c1957F989Q5640b82474C73908c32399J12345A56338
17771h8123A37306a8429j5487B3185a3725C39899j66026l4369c61146A83991J20455
17760C04446r7807c75186J69016Q3760A79961J03215A33041B6462K3282K18205
17750B67949a66880c6916G7780a23295o1420A50463j8483K5358b60073A11167
17739A64056e9129k47843d989A8581O759a29083A58366M3759a30986j49531F2534
17727I0036M2028b6496A08109e8877A02166a00770A70357K7259D175M0532J20106
17716A64813o4939c48048d9369k4594n9621G9766h3190D8125r086J64841f9044
17704g2714j10325O3213C31219b01534B3462h2701A36875C325f1696B2236J07790
$$ y = [-151177, -70529, 71957, 294849, -31957, 6989, 92629, -282474, 373908, -332399, -220054, 156338, -88123, 137306, -18429, -33916, 23185, -13725, 339899, 173873, 139504, -361146, 183991, 304446, 206639, -375186, -206170, -122410, 179961, 283176, 133041, 26462, 49744, 267949, -166880, -36916, 77780, -123295, -184715, 150463, 131980, 157338, -260073, 111167, 164056, -59129, -306972, -4989, 18581, 25340, -129083, 158366, 202125, -130986, -280517, 62534, 90036, 132064, -26496, 108109, -58877, 102166, -100770, 170357, 197616, 4175, 44707, 164813, 99874, -348048, -49369, -73963, -133584, 79766, -83190, 48125, 39039, 203880, -69044, -72714, -183039, -119826, 331219, -201534, 23462, -82701, 136875, 3325, -61696, 22236, 130026]
17693A30026N2582K04650b9633a1101n0300a3512m8974C15370f5625m9851j09956
17682b25432N3300j23838g8130m4294f509C73736a48018K3067d8281B6864L57213
17671C84077c94956c1806G9222f0794G4969O7987B31M5132a5386A10567M2981
17660A53548M737l4858l4404K46316A3317f935C17028b75278c3950q4235A21910
17648b57878l3665J09578A25186C5795J00743P1839k9473B9110J96409a23834
17637e3299j617C5598J8476a58338A26449c54331D25276a61264J9890C8189L9182
17626G7371C2646a59988A79478p3367a28482A23690N0832c0634A63320E2558a72348
17614A6395g2542A90383c2204C52879b97304A65140a0650k44951J12812A28123
$$ y = [130026, 182608, 387258, -29633, -11101, -61401, -13512, -62486, 315370, -65625, -115476, -225432, -172132, -295970, -78130, -122424, -6509, 373736, -148018, -124951, -48281, 26864, 384077, -394956, -31806, 79222, -60794, 74969, 142956, 231, 45363, -15386, 110567, 153548, 158285, 123427, 89023, 335339, 13317, -6935, 317028, -275278, -33950, -118185, 121910, -257878, -291543, -181965, 125186, 35795, 136538, 208377, 178904, 29110, 225519, -123834, -53299, -54916, 35598, 54074, -158338, 126449, -354331, 425276, -161264, -141374, 38189, 77371, 32646, -159988, 179478, 106111, -128482, 123690, 174522, -30634, 163320, 52558, -172348, 16395, -72542, 190383, -32204, 352879, -297304, 165140, -10650, -255601, -142789, 128123]
17603i3298a5409p8900B00562a83923C69994F7642O8492a00168l1891B45855D9962
17591B34108n1608a33904A35059g9272A1506b77244A91701f7035n7268c2040j36308
17580a68348H9147C8861a28662B53612A05924c4307F8828a17742H3873j8299k1007
17569D4567b8451F4018N9730L5717a27707A439c85811f5186B5048D910O1033A1706
17556B07207c96540A72990a40711f2926F7162d123C44996A08289b9091H3316j6678
17545F6638K91082b11759B14341J2896p2674o5903a4621B03766J04074a79998
17534a8601A44410n7265L5669A6989J87561a20675C95128a09036B51701E5142
17523e2913C52619j70241E0285a1260A24212J31030c42157a26338B24421J96668
$$ y = [-93298, -15409, -94309, 200562, -183923, 369994, 67642, 136134, -100168, -132059, 245855, 49962, 234108, 182500, -133904, 135059, -79272, 11506, -277244, 191701, -67035, -124303, -32040, -168348, 89147, 38861, -128662, 253612, 105924, -34307, 68828, -117742, 83873, 65574, 44567, -28451, 64018, 123748, 159465, -127707, 1439, -385811, -65186, 25048, 4910, 65943, 11706, 207207, -396540, 172990, -140711, -62926, 67162, -4123, 344996, 108289, -29091, 83316, 66638, 357720, -211759, 214341, 227237, 154563, 88660, -14621, 203766, 307840, -179998, -18601, 144410, 87145, 122814, 16989, 204550, -120675, 395128, -109036, 251701, 55142, -52913, 352619, 182378, 50285, -11260, 124212, 255242, -342157, -126338, 224421, 421089]
17513D21089A7022J0132O4001L09305q0985a5982B19683J35009f849A32840m8780
17502H4060a65039I6223b3746C12380A374J6234J24810a54022C58922p6556c072
17490f9379C757d2654l6644j83640a5461G1791K28487A24377a38258C0309M9731
17479H0040M10985j42711A63819c56014I0428l1103a5710p0528G3712k7618L5652
17468H1746r896K62402A13278J36289l5567e2750r6429h710F951L9253P6549c6757
17455a48146C3768M4666Q7231h0923A6987K64032j0238a55838b0009p6511A17905
17443a08529a6054A26178J97798j39544o3065a29379A97788J56034j58626G3402
17432C15475k962o2188k0261p5784e3152D25601c66526B32908a0835B11682r2742
$$ y = [421089, 17022, 27154, 91155, 400460, 319475, -15982, 219683, 354692, -6849, 132840, 84060, -165039, 96223, -23746, 312380, 1374, 17608, 142418, -154022, 358922, 282366, -3072, -69379, 3757, -42654, -79298, -262938, -15461, 71791, 300278, 124377, -138258, 30309, 80040, 491025, 348314, 163819, -356014, 90428, 59325, -15710, -86238, 73712, 46094, 81746, 71850, 334252, 113278, 249567, 214000, -52750, -149179, -8710, 6951, 46204, 122753, -36757, -148146, 33768, 78434, 165665, -80923, 16987, 281019, 270781, -155838, -20009, -96520, 117905, -108529, -16054, 126178, 323976, 184432, 121367, -129379, 197788, 353822, 195196, 73402, 315475, 312513, 250325, 230064, 154280, -53152, 425601, -366526, 232908, -10835, 211682, 118940]
17421A18940K10662a1119B55084a11663m6742C58314j69080o8305K23916M7730
17411C92575j02040D6890K34279r0086M18995B68742D4247j3480O47277B17305
17400B84173J62151o2543j79535L6259j18359C1456Q4427C8841J47392B3574Q7185
17389A10759J17641J04489j39301L7371A13321J53690A14964a70998A09872m7788
17379F2084J33663J12963j43576B9023L09676G1915k4971J94862o9918G8990a46387
17367a83531A44994k4116B0765b12616A71741J81183j71420a59175B54689J76434
17357D31123C7818N4862J82021A12525a21020K8001B48394b54088B86826J44085
17347D30911d8303B7316K34120a45638C50099A67145l3523J11141C4312J50751
$$ y = [118940, 329602, -11119, 255084, -111663, -158405, 358314, 189234, 120929, 344845, 392575, 290535, 46890, 281169, 191083, 610078, 268742, 44247, 30767, 678044, 217305, 284173, 446324, 383781, 204246, 240505, 122146, 31456, 115883, 38841, 186233, 23574, 110759, 228400, 332889, 193588, 230959, 113321, 267011, 114964, -170998, 109872, 62084, 195747, 308710, 165134, 29023, 338699, 71915, 46944, 241806, 171888, 78990, -146387, -183531, 144994, 120878, 20765, -212616, 171741, 352924, 181504, -159175, 254689, 431123, 37818, 92680, 274701, 112525, -121020, -93019, 248394, -254088, 286826, 430911, -48303, 27316, 261436, -145638, 350099, 167145, 133622, 244763, 34312, 185063]
17337A85063K04030c1055j00436G5911K27012A45620b81887A38409l6315a23981
17326h871A50302Q9558b78417C72279j71602o9426j849n4908L90097j99035C6415
17314E25376I1058K13474a27855A52927o0156L0113K594L6978J12826A5268J82460
17303A97728M7974I9353D2602J90369q8497K65253J28183a11254A87993i7728
17292B16917J32149a2295F3575L48203A65869K6547A686K18807b33579A32381
17281B41544J37645F4692b14325E785J99489J96016A15649K19517l8037a90189
17270a7808E3464Q200a33058B09385M5074A08986F056J83643n5200a83411C24557
17258a6049j03151D33872A16648k1240m0904a87304I6057R3349I946K04305n0424
$$ y = [185063, 389093, -31055, -131491, 75911, 302923, 145620, -281887, 138409, 102094, -123981, -8871, 150302, 239860, -278417, 372279, 200677, 131251, 129402, 74494, 464591, 265556, 36415, 525376, 91058, 304532, -127855, 152927, 92771, 122884, 125478, 162456, 275282, 15268, 197728, 245702, 99353, 42602, 232971, 144474, 409727, 537910, -111254, 187993, -97728, 216917, 349066, -12295, 63575, 411778, 165869, 192416, 1686, 220493, -233579, 132381, 241544, 379189, 64692, -214325, 5785, 205274, 401290, 115649, 335166, 297129, -190189, -17808, 53464, 61664, -133058, 209385, 254459, 108986, 6056, 189699, 134499, -183411, 324557, -16049, -119200, 433872, 116648, 95408, 54504, -187304, 96057, 189406, 9946, 214251, 163827]
17247A63827o6838d5219B00830p9239J50550r5563q2067l4884a33889N3565B03460
17235A57252N5959K52021A5810c2167i885C19986j3940A24159b00442C20564m8499
17224B72065J92638k15467N791l7485e619B65332p6049K56929A47956J06171q3580
17213A70547j5270A233J45140B2361L146J88953K08591A34960J80355b08616C14662
17201F04410A79000E3354K9610M1935N32472b98467c1831I961J5430L48998A01303
17189B79917b04856b0703B01437J26185A41646L91500r3289B00870F5742f1445
17178E03720A70969O6542d5151B78417j19356p2827e71H2379J55912J037H0917
17166a19358B45913j02191K48202A69622b1188p0999B05318N7689J70410A59047
$$ y = [163827, 96989, -45219, 200830, 121591, 272141, 176578, 94511, 59627, -133889, -80324, 203460, 157252, 213211, 465232, 15810, -32167, -9885, 319986, 306046, 124159, -200442, 320564, 272065, 464703, 249236, 255027, 217542, -5619, 265332, 189283, 446212, 147956, 254127, 170547, 155277, 1233, 146373, 22361, 25507, 214460, 423051, 134960, 315315, -208616, 314662, 604410, 179000, 53354, 82964, 124899, 657371, -298467, -31831, 9961, 25391, 374389, 101303, 279917, -204856, -20703, 201437, 327622, 141646, 533146, 439857, 200870, 65742, -61445, 503720, 170969, 237511, -45151, 278417, 159061, 86234, -571, 82379, 238291, 239328, 80917, -119358, 245913, 143722, 391924, 169622, -21188, -92187, 205318, 263007, 433417, 159047]
17155D29026E7532R2469J66004A41420J58251D5059K28898j44A32623j5079k7572
17144H9972N2904L6167c8723A99731G0392K47346d0574C94988l9095A23764J02768
17133B26532M6072A07640N362M4812K15588L3570l4056R3773B07410O7850j30713
17122A44547J91251C3692J44935O03357D8557K80450r3373R6270J9203n0962A09037
17110A68985F2367O65759C26469j5879q3001p5233J6062K1691Q8395J97448B07738
17098E26330A5585L48892o673b9568C52207k8932K29998j69783A00447R2679E9616
17086B93567o7469J30340j1809G7877B6534L00972K34829k50339q1317K60219
17076D90898j46120f8494B05004J28254R6660O5935A57418n9579N46580B69746
$$ y = [429026, 57532, 150001, 316005, 141420, 299671, 45059, 273957, 273813, 132623, 117544, 89972, 142876, 179043, -38723, 199731, 70392, 317738, -40574, 394988, 355893, 123764, 226532, 272604, 107640, 113002, 157814, 373402, 406972, 372916, 466689, 207410, 275260, 144547, 335798, 33692, 178627, 781984, 48557, 329007, 235634, 331904, 351107, 300145, 109037, 168985, 62367, 728126, 326469, 310590, 227589, 152356, 168418, 190109, 278504, 475952, 207738, 526330, 15585, 364477, 357804, -29568, 352207, 323275, 553273, 383490, 100447, 193126, 59616, 293567, 226098, 356438, 344629, 77877, 26534, 327506, 562335, 311996, 230679, 490898, 344778, -68494, 205004, 333258, 429918, 495853, 157418, 97839, 644419, 269746]
17065B33049K346J64392R3418p0425o3975J638A78233l4764K98408J09655m3040
17054E08492K8843k00637K04966j73029J79055Q0382j307B44431Q4075K3284J33011
17043D84801I0531K99497K48680B44050L70879j2976k81833O3407J79630O8179
17033F31336j60896J32038k1870B84375L24361o2563r9349m4902K40245j79930
17023D62237j41662A34359M36855r8049O5127M3594j74012A97534K89245J05040
17013E91819A06691L09762q2691K61356k09960J66908k39778K50226j44702K4048
17003D41860J17555Q9605j24567L4571J97768l44557M4077j79345L22532K30422
16993H29921l57567A48383J70096L12925R8801k30063K91960j69833O497k15444
$$ y = [233049, 235395, 399787, 493205, 422780, 358805, 360443, 178233, 143469, 441877, 551532, 508492, 537335, 336698, 541664, 368635, 547690, 628072, 626765, 244431, 328506, 351790, 484801, 90531, 390028, 638708, 244050, 614929, 601953, 320120, 383527, 563157, 631336, 470440, 602478, 580608, 284375, 608736, 546173, 446824, 401922, 642167, 462237, 320575, 134359, 571214, 473165, 538292, 581886, 407874, 197534, 486779, 591819, 106691, 416453, 333762, 595118, 385158, 552066, 312288, 562514, 417812, 441860, 559415, 649020, 524453, 559024, 756792, 412235, 456312, 276967, 599499, 829921, 472354, 148383, 318479, 631404, 730205, 500142, 792102, 622269, 628766, 413322]
16983D13322L70926C82853N60664j70685p4514B93678J07277M00486j24153J2214
16973F89502j84700J77244j1458J60662l30342L48467k30957r2046J67097k0583
16963F72886J74889k55432K52716J4689N5640l71616K64774r1558q1679n508J42258
16952G72059K51491m5489k57867J66878J02666j93433j37843j86059K91007J90753
16942I54163J3703k22278j68071L02480l94050O62504E62627K59292P9780m00192
16932E01507L15044K24329k83071J48468n7931J25266r0959J60641M9991k82929
16922H10356N5611K78320j74359O9029j23862R9641j14876J36273R0490l24373
16912H02250Q2611L4669J47404k27478O18451l09397m6981P8879J73325l48225
$$ y = [413322, 784248, 382853, 943517, 772832, 698318, 293678, 400955, 801441, 677288, 689502, 504802, 682046, 670588, 831250, 500908, 849375, 618418, 526372, 693469, 672886, 847775, 592343, 845059, 859748, 915388, 543772, 808546, 716988, 635309, 629801, 772059, 1023550, 978061, 720194, 887072, 989738, 796305, 658462, 472403, 763410, 954163, 967866, 745588, 577517, 879997, 485947, 1148451, 562627, 821919, 901699, 501507, 816551, 1040880, 757809, 906277, 848346, 973612, 882653, 1043294, 1093285, 810356, 865967, 1144287, 969928, 1038957, 915095, 1014736, 899860, 1036133, 1126623, 802250, 884861, 919530, 1066934, 839456, 1457907, 1148510, 1101529, 1180408, 1353733, 1005508]
16902A005508J09270J61589J3305k59636J91938J18564j3563p312R1554r7228
16892A313989L59281j13647n77093J29342K46868k89159L09173M40248m36028
16883A382974J48932k14227j90738J14707K57295M5988r0200L48914k75295j00869
16873A427481K01198j75130n9566N63827k87132O3495J33405N6334n7356k18978
16863A647578J50644K31636K09314j35252k45221K7544J85081p0824J16133n6194
16853B060439j98466L09468n0066J26152P3981Q7938j47712K57351j58938K12278
16843B572425k23223J82451J33526k49509L60768m94901L82052K47974k40638
16834B670925L97982L9484q8276J05291J02779l45092P7956K48300R9629j95348
$$ y = [1005508, 1114778, 1276367, 1289672, 1030036, 1221974, 1340538, 1326975, 1319663, 1411217, 1313989, 1673270, 1559623, 982530, 1111872, 1358740, 1069581, 1378754, 1819002, 1382974, 1531906, 1317679, 1126941, 1241648, 1498943, 1544931, 1454731, 1803645, 1528350, 1427481, 1628679, 1453549, 1393983, 1957810, 1670678, 1734173, 1867578, 1923912, 1866556, 1647578, 1798222, 2029858, 2239172, 2103920, 1858699, 1886243, 2071324, 2000500, 2116633, 2060439, 1861973, 2171441, 2121375, 2247527, 2321508, 2409446, 2261734, 2519085, 2360147, 2572425, 2349202, 2531653, 2665179, 2415670, 2776438, 2281537, 2663589, 2911563, 2670925, 3068907, 3108391, 3020115, 3125406, 3228185, 2883093, 2961049, 3209349, 3308978, 3113630]
16824C113630K95813J68494j03548J96633q2653L30384k63966J19095K15093q2721
16814C906254J45236j63184J18212L14759l4492j5351L13033n0308L45558k55375
16804D624342J3224L11707m12374L91980M20173K48061L4514j02753L5056P5609
16794E639539k0160K90992M43368J51593N2245j14258L03248K96558M89588m90060
16784G042653N25653K10173K55032J24285J43376p1681M46239K04895L05835k1699
16774I164761L87319J92267P91192o7732K97668J54317N94886M54630J83218M62962
16764A2615488L03772L45455K97165J077058j69782L17690Q98496Q08784M50204
16755A6944330O26543N32805Q74385P87051N75716O55609P83489Q02691J039289
$$ y = [3113630, 3409443, 3577937, 3474389, 3671022, 3588369, 3918753, 3654787, 3773882, 3988975, 3906254, 4051490, 3888306, 4006518, 4321277, 4286785, 4271434, 4584467, 4534159, 4879717, 4624342, 4637566, 4949273, 4536899, 4928879, 5349052, 5597113, 5631627, 5528874, 5563930, 5639539, 5619379, 5910371, 6353739, 6505332, 6557577, 6443319, 6746567, 7043125, 7532713, 7042653, 7568306, 7778479, 8033511, 8157796, 8301172, 8229491, 8675730, 8880625, 9186460, 9164761, 9552080, 9744347, 10535539, 10467807, 10765475, 10919792, 11514678, 11969308, 12152526, 12615488, 12919260, 13264715, 13561880, 14638938, 14469156, 14786846, 15685342, 16494126, 16944330, 17570873, 18103678, 18978063, 19765114, 20340830, 20996439, 21779928, 22582619, 23621908]
16746B3621908J175943P39407J276402J261310Q17501J558815J942780J305687
16738C3699753J750017J627247J625045K530608J686160K098574K702716K806194
16730E0526314L009021K924693L448190L838693L767643L878367M632669M387735
16722H0413325N541054N347442N745458O067235O631230O783947P353484P305316
16714A31188491P889753P312043Q136273P281999P964063O940299O695975N702224
16706A89111120N343341L578815K523690J365402J95423j731743k796881m282720
16698A93306447n338014o184393o891076p402372p784596q288578p865353p863662
16690A35688403p752011p053103p403907o649357o474442o130856n888069n298688
$$ y = [23621908, 24797851, 25537258, 26813660, 28074970, 28892471, 30451286, 32394066, 33699753, 35449770, 37077017, 38702062, 41232670, 42918830, 45017404, 47720120, 50526314, 53535335, 56460028, 59908218, 63746911, 67514554, 71392921, 76025590, 80413325, 85954379, 91301821, 97047279, 103114514, 109745744, 116529691, 123883175, 131188491, 139078244, 146390287, 154526560, 161808559, 169772622, 176712921, 183408896, 189111120, 194454461, 198033276, 200556966, 201922368, 202117791, 200386048, 197589167, 193306447, 187968433, 181784040, 174892964, 167490592, 159705996, 151417418, 143552065, 135688403, 127936392, 120883289, 113479382, 106830025, 100355583, 94224727, 88336658, 83037970]
16682H3037970m633409m670870m293546l921684m013799l532911l295508l176443
16674E1499800k765300k599581k308180k145266k616475j866458j934601j674828
16666C3589111j528754j382843j563098j105340j423579j187798j314968r40880
16658B3141851n92544j138127p00628o80138q04499r34425p53889j123475K27952
16649A6642078o64541q42842l81093n23185l51722o42923p53156j89119k01181
16640A2092316p03647r4168l40107k63646k75705l82576n42811l43702J65721
16631I311675p23545K70467n67738J56280p13738N360R4615p28254k37334K91366
16621G159154l33488l22332L2978k00721j31930k26200l96405K17843m0646p0452
$$ y = [83037970, 78404561, 73733691, 69440145, 65518461, 61504662, 57971751, 54676243, 51499800, 48734500, 46134919, 43826739, 41681473, 39064998, 37198540, 35263939, 33589111, 32060357, 30677514, 29114416, 28009076, 26585497, 25397699, 24082731, 23141851, 22549307, 21411180, 20710552, 20030414, 19225915, 18291490, 17537601, 16414126, 16642078, 15977537, 15134695, 14753602, 14230417, 13878695, 13235772, 12482616, 12293497, 12092316, 11388669, 11294501, 10954394, 10690748, 10415043, 10032467, 9489656, 9145954, 9311675, 8588130, 8858597, 8290859, 8447139, 7733401, 7738761, 7833376, 7105122, 6867788, 7159154, 6825666, 6503334, 6536312, 6335591, 6203661, 5977461, 5581056, 5798899, 5758253, 5687801]
16611E687801n79647J51955j42242p1986r3128k04805Q8804m60309L4080j10810
16601D299713k08596J54397k65604k28990M5597j61038j17221N2162K005L1960
16591C604385k96914k7527j09519O0322L27449m14027q621k42373o7521J2288
16581B837942K83215M8357l18519J17751p24049M22851j59959K15867J04446m74238
16571B353664N7477P0053l06539J61534r494K1695N7982l77297Q7418k79965M25310
16560B261838k59003O4299n59191N91203j59938J82430R5775m71336M4559l4579
16550A756057j92676R2020r6691K49454m24973J42928J67651k83040L72910m8218
16540A735422j60620J82046n74625K97035j30255j96740J18402j00724L29607
$$ y = [5687801, 5108154, 5260109, 5117867, 5045881, 4952753, 4747948, 4836752, 4376443, 4410523, 4299713, 4091117, 4245514, 3979910, 3750920, 3796517, 3635479, 3518258, 3570420, 3572425, 3604385, 3307471, 3279944, 3170425, 3230747, 3558196, 3144169, 3135548, 2893175, 2825654, 2837942, 3121157, 3169514, 2850995, 2968746, 2244697, 2667548, 2507589, 2723456, 2827902, 2353664, 2411141, 2481194, 2174655, 2336189, 2326695, 2348390, 2406372, 2029075, 2116493, 1836528, 2261838, 2002835, 2067134, 1507943, 2099146, 1939208, 2121638, 2217413, 1746077, 1790636, 1756057, 1563381, 1655401, 1558710, 1808164, 1383191, 1526119, 1693770, 1410730, 1783640, 1735422, 1574802, 1756848, 1182223, 1479258, 1349003, 1152263, 1270665, 1169941, 1499548]
16531A499548k45789K42894j60882k51870Q3942L26305k73351P1967k66367P4349
16521A100746J47697j65702j01330j52474M8630N1570j83788M72809k87778J13821
16511A044201J95029j77985J96592m92185N86100m29687J68450k31598J74593
16502A033510k53986k5975J49389R1530j44908J64097q0109k232q4884l0144j1860
16491H04428L57084j79795j18199O9666j06092l29069J99716J87430l3634l03467
16481E48068L06345j91471K90484k39141j41220j56595P18977D21120L31185j59607
16471E92698K69844k99014L58341j91143J07286k94909M2814j0119K06590q6280
16461F96108K16516C71833K57375J89203m00892L19667j75898J01079P3361K47565
$$ y = [1499548, 1253759, 1496653, 1335771, 1083901, 1167843, 1494148, 1220797, 1292764, 1026397, 1100746, 1248443, 1082741, 981411, 828937, 877567, 929137, 745349, 1218158, 930380, 1044201, 1239230, 1061245, 1257837, 765652, 1351752, 922065, 1090515, 858917, 1033510, 779524, 753549, 902938, 994468, 849560, 1013657, 933548, 931316, 846432, 816288, 804428, 1161512, 981717, 863518, 933184, 827092, 498023, 697739, 885169, 851535, 548068, 854413, 662942, 953426, 714285, 573065, 416470, 1135447, 421120, 752305, 592698, 862542, 563528, 921869, 730726, 838012, 543103, 585917, 575798, 782388, 696108, 912624, 371833, 629208, 818411, 417519, 737186, 561288, 662367, 735728, 983293]
16451I83293l57249j24369P0882J21643j78994O8952L4659L27808k86362k7886
16441F32377K17147k28848j74098L69103k37060J0229N9693k67146o7378O9947
16431C83966J19695l2462L50324j32065j19427r4845J52009B00500L27728k53126
16421B75102r9741M42635L3341k03290K4003N2841n5002A89343P3107J93492j65995
16410B89947K46942A64155K32765P9537o2328J01048J91469k67017m8209n324
16400C86096j03052k8435R5355K07061j44481L1799D1539K08708N3023l7324j04946
16389A61000L42231j59815p7288p7869J11132L044A03995K86445q7008L21875
16379F25307j68573j54950P8789J24679p2653o8242R1094j56813J7766P42m0248
$$ y = [983293, 626044, 501675, 572557, 694200, 515206, 584158, 618817, 946625, 660263, 632377, 849524, 620676, 446578, 815681, 578621, 588850, 648543, 381397, 314019, 383966, 503661, 471199, 821523, 689458, 570031, 475186, 627195, 200500, 528228, 275102, 175361, 617996, 651337, 448047, 472050, 524891, 469889, 189343, 262450, 455942, 289947, 536889, 164155, 396920, 476457, 414129, 515177, 706646, 439629, 391420, 386096, 283044, 254609, 349964, 557025, 412544, 444343, 41539, 250247, 303270, 265946, 161000, 503231, 343416, 266128, 188259, 299391, 302435, 103995, 390440, 303432, 625307, 456734, 301784, 380573, 505252, 432599, 364357, 455451, 298638, 316404, 317146, 276898]
16368B76898M9905K83856o4011k36339j28108K57648j39987J68376j35342k3345
16358C09551J24009q5979I0944K02350D0044M93925G2387L64542B10077K63336
16348D73413A40599l1086J9767h2604A84054M2516J51839j76386J29802n1612
16338B80213n2862l7322N3430e8478h561D94146k26751J2925K3875Q2864K09841
16327E96900B75406d5949C89852m1295F4661K00740k810n8111Q8734J57720c7960
16315F1973K49763g834E55274k75560N696p4289m7649Q6696L13288n3600k02994
16304C06862A46046m9286q791R3306B4914K42887N5864a52000C35721A5385L09858
16293C25243J4918j14920Q1004m1959j0099m9742J6231C3030K43644E8396L52293
$$ y = [276898, 326803, 610659, 546648, 310309, 182201, 439849, 299862, 468238, 332896, 309551, 433560, 347581, 90944, 293294, 40044, 533969, 72387, 436929, 210077, 473413, 140599, 109513, 129280, -82604, 184054, 226570, 378409, 202023, 331825, 280213, 227351, 190029, 243459, -58478, -8561, 494146, 267395, 280320, 304195, 387059, 596900, 275406, -45949, 389852, 348557, 64661, 265401, 262591, 204480, 293214, 450934, -37960, 61973, 311736, -7834, 555274, 279714, 285410, 211121, 163472, 250168, 563456, 509856, 306862, 146046, 96760, 87969, 181275, 24914, 267801, 323665, -152000, 335721, 15385, 325243, 340161, 225241, 306245, 264286, 254187, 204445, 220676, 33030, 276674, 58396, 410689]
16282D10689k00792q7361c5875B93291a3476C86933j40719L71107B61009c3602
16271C09260C3226K70713J84994A28481J25811I8871J53043Q2049A20595J80224
16261C00819A36501j3931J9703J05154r9140j1656P9230J45995j42587K93917
16251E13186B34874N38599B39929g2512C5256J21906M47413B07875M031j3726
16241A98180j9482J05535b49667C13117c3547B36045F6953J87349D6583k0658
16231B5925K59431O3445J4050j38820j11463b1425j1361A98819r7137a89282D20908
16219C40074A35163J08579J03325l890j57917O3301l1333Q3619a93653B75858
16208B31566O2908k4573H6591k3564P5445J01103j1418I2298B4641K9962b78029
$$ y = [410689, 209897, 122536, -35875, 293291, -13476, 386933, 246214, 617321, 261009, -33602, 309260, 33226, 303939, 488933, 128481, 254292, 98871, 251914, 333963, 120595, 300819, 136501, 122570, 142273, 247427, 148287, 136631, 215861, 361856, 219269, 513186, 234874, 773473, 239929, -72512, 35256, 157162, 604575, 207875, 211906, 198180, 178698, 284233, -249667, 313117, -33547, 236045, 66953, 254302, 46583, 25925, 285356, 348801, 362851, 224031, 112568, -21425, -32786, 198819, 101682, -189282, 420908, 340074, 135163, 243742, 347067, 343177, 185260, 248561, 217228, 300847, -193653, 275858, 231566, 294474, 269901, 86591, 63027, 138472, 239575, 228157, 92298, 24641, 54603, -278029]
16196E9204M09864c74735F7689k1342L35181j29511N7205R9933b66610a15443
16185g5469A72173Q0081b92808D1228A1688l962K667J88967N9326n2522A02204
16173A15128k9411c51028A83914H4047A8892K81401c10630C20931a1997j44166
16163a56163D08689j49366j17797C9139c37906a280A9811K46012p7406a40612
16152I4144K73722F0818J13918K32795A05632b12758n6261B95112A39872A2825
16141a56112A50009K13266j44965h0696G4771n612K1407h159B41204d205D09417
16129A95325m7877a20537J9130A80020a02036p7306C3283K5324J23082C3921c66480
16117A6088K67608e1265B14202j6980k7368G9126Q2523C6744f4018j7156c4914
$$ y = [59204, 469068, -374735, 67689, 46347, 381528, 252017, 309222, 409155, -266610, -115443, -75469, 172173, 252254, -292808, 41228, 11688, 7726, 10393, 199360, 258686, 206164, 102204, 115128, 85717, -351028, 183914, 84047, 18892, 300293, -310630, 320931, -11997, -156163, 408689, 259323, 141526, 39139, -337906, -1280, 19811, 265823, 188417, -140612, 94144, 367866, 60818, 174736, 407531, 105632, -212758, -269019, 295112, 139872, 12825, -156112, 150009, 363275, 218310, -80696, 74771, 69159, 90566, -8159, 241204, -4205, 409417, 195325, 147448, -120537, -101407, 180020, -102036, -179342, 33283, 58607, 181689, 33921, -366480, 16088, 283696, -51265, 214202, 197222, 169854, 79126, 161649, 36744, -64018, -81174, -34914]
16105D6081j4122d2095B74855E3116G972K395i6968B42299g1977B55789l3626
16094B22163F6671N6189a93392n4580M8457A42040J2261a75042r4566H7672K25996
16083C13668c08055I6019d4528a4281A33815o3070J26374a26252N3499A00877
16072A52465F8891J10438H2843a14511c6249A9216b41916B6913Q1496K27175j26859
16061B08725I0409b8371A32569a97651d668A20280D9497c12480D78981f5325j54000
16050b19325A39120i3573j64937e7998B52219I4053C6754f7276D4346a25628p7299
16039b02927A41829E8436A8680J77107l3310o3654M4582b411H4569K85882b59253
16027c0221B0353f6517a4902H4202R2392a79731c8248A37732e9524k39653G8946
$$ y = [46081, 31959, -42095, 274855, 53116, 7972, 10367, -96968, 242299, -71977, 255789, 222163, 66671, 122860, -193392, -247972, -199515, 142040, 154301, -175042, -269608, 87672, 313668, -308055, 96019, -44528, -14281, 133815, 70745, 197119, -126252, -72753, 100877, 152465, 68891, 179329, 82843, -114511, -36249, 19216, -241916, 26913, 108409, 335584, 208725, 90409, -28371, 132569, -197651, -4668, 120280, 49497, -312480, 478981, -65325, -219325, 139120, -93573, -258510, -57998, 252219, 94053, 36754, -67276, 44346, -125628, -202927, 141829, 58436, 18680, 195787, 162477, 98823, 143405, -2411, 84569, 370451, -259253, -30221, 20353, -66517, -14902, 84202, 176594, -179731, -38248, 137732, -59524, -299177, 78946]
16015d6849F2356J0454R7750q752b25442A84817b02143k9097e0833J2974l6576
16004g4435a1722A93460a4112l9778A6149a58201H0248a66308d5660p3827N672
15993a13815J0280B29826a2663B13370a22738K257d6768j79837j30387C06925
15982A75039b8420j19115J2088A47940a42599j94087c2140A04234b09763A82197
15971a63477p4271a6385C7553J34736J8908I3369b60362a19100F2760j8880d8557
15959C383a5125B60175D2329b77715E8355c1669B03781g6474j2652o8568m72698
15948f30392a6998H917K22019c16070J32465f1708n8587F5596a28467d1970A8762
15936c97569d0547k31692A9655a27137m8790F0035c64034H3425c28874g1971j18492
$$ y = [-46849, 62356, 72810, 170560, 161808, -225442, 184817, -202143, -231240, -50833, -37859, -74435, -11722, 193460, -14112, -53890, 16149, -158201, 80248, -166308, -45660, -119487, -113815, -103535, 229826, -12663, 213370, -122738, -120481, -46768, -226605, -356992, 306925, 175039, -28420, -147535, -135447, 147940, -142599, -336686, -32140, 104234, -209763, 182197, -163477, -237748, -16385, 37553, 172289, 191197, 93369, -260362, -119100, 62760, 43880, -48557, 3383, -15125, 260175, 42329, -277715, 58355, -31669, 203781, -76474, -89126, -157694, -630392, -16998, 8917, 230936, -316070, -183605, -61708, -120295, 65596, -128467, -41970, 18762, -397569, -40547, -272239, 19655, -127137, -175927, 60035, -364034, 83425, -328874, -71971, -190463]
15925a90463c1959H4053l9057a8448A43326D4529f3998i622l8584A37183c44818
15913G175c30851D2079P396i8755H4640g8488j28938K6059G7020a02404j16667
15902b19071H8005d4121g090j78147e3719F6452A8855a44461d8309k1828o6206
15891a36343j22592B2544J21281J2871a40386f3250B22024a05140K7312J8948
15881e8880k20727e6341B14224O077J44959j53260b51664A72310J13083D8416
15870a80564B0419P4536M4523b4656A85910I363d216j011A3594a80291g9258A48860
15857a46845B6941b9462o8410L7238k7406A3952f6027n2116A9025b89471A4556
15845A59265b43653G0587d4054I5075H05a88139O1173e1938B20310o7700a40785
$$ y = [-190463, -31959, 84053, 44996, -18448, 143326, 44529, -63998, -9622, -48206, 137183, -344818, 7175, -330851, 42079, 49475, -98755, 84640, -78488, -207426, -181367, 77020, -102404, -219071, 88005, -44121, -7090, -185237, -53719, 66452, 18855, -144461, -48309, -70137, -136343, -258935, 22544, 143825, 156696, -140386, -63250, 222024, -105140, -77828, -58880, -279607, -56341, 214224, 220301, 365260, 212000, -251664, 172310, 285393, 48416, -180564, 20419, 94955, 139478, -24656, 185910, 9363, -4216, -5227, 13594, -180291, -79258, 148860, -146845, 26941, -29462, -97872, -60634, -88040, 13952, -66027, -118143, 19025, -289471, 14556, 159265, -243653, 70587, -44054, 95075, 805, -188139, -126966, -51938, 220310, 152610, -140785]
15833i9001j31581g4891j70235A27225M4983h4679E9876O2355a58206e3610E6973
15821E7660a24708J045C5040Q720J22657b75464J09059j00655o3190A8145e5862
15809c26371a12620m64784e9340A50031b70199G7029N2841m8504b02316M1100
15799a61216A15332d4141B5904b78145G9429a09757D5959b62192J08831o5506
15789b18867A27048b61873I2972C6847a28705p6378m07538a13791I7173c38359
15778a96474k0043j76588i108C6807a73095A38830b91778H5291a83686k25084
15768d08770J26946a39342c6056I5543E220d3920F4498j0159g126A38238r772
15757A28466J6071a44457L5885A64400b01830R5896D26280d42956h4119l0261
$$ y = [-99001, -230582, -74891, -245126, 127225, 172208, -84679, 59876, 122231, -158206, -53610, 56973, 57660, -124708, -123663, 35040, 43760, 166417, -275464, -166405, -267060, -330250, 18145, -55862, -326371, -112620, -577404, -59340, 150031, -270199, 77029, 129870, 81366, -202316, -161216, 115332, -44141, 25904, -278145, 79429, -109757, 45959, -262192, -153361, -218867, 127048, -261873, 92972, 36847, -128705, -205083, -612621, -113791, 97173, -338359, -196474, -216517, -393105, -9108, 36807, -173095, 138830, -291778, 85291, -183686, -408770, -281824, -139342, -36056, 95543, 5220, -43920, 64498, 54339, -7126, 138238, 128466, 144537, -144457, -108572, 164400, -201830, -105934, 426280, -442956, -84119, -114380]
15747a14380G5059G447a21636c1036o7775m0789n0460B3140L90524C8698J11038
15736A49736a1174j45076q2851a00901K2214A71121F2906J09374f8309A2735c8878
15724A02895h4405C8648H432a60001g3058j38047h9915l4705m6361g0794o9640
15713a40434A63783a70722f2004H1618g409r7133A5296P6755b89973a5972k5919
15702d1891A63239a26932j66503N0308h7783k39767a59215e6421P953f812B19778
15690b93925J35555a2425j5573A46684f2966D0767h4100G5129J41686a97950B264
15678B41187C3768J46382a40168m13249g2335A84019a7899B84082a5313k72584
15668b87897a05133C3339b72538B01734B7294Q8943D4503a70542d5460k25687
$$ y = [-114380, 75059, 7447, -121636, -31036, -98811, -139600, -190060, 23140, 413664, 38698, 149736, -11174, -156250, -239101, -100901, -78687, 171121, 62906, 172280, -68309, 12735, -38878, 102895, -84405, 38648, 8432, -160001, -73058, -211105, -89915, -124620, -170981, -70794, -140434, 163783, -170722, -62004, 81618, -7409, -104542, 15296, 92051, -289973, -15972, -41891, 163239, -126932, -293435, -243127, -87783, -327550, -159215, -56421, -48468, -6812, 219778, -293925, -158370, -12425, -27998, 146684, -62966, 40767, -84100, 75129, 216815, -197950, 2264, 241187, 33768, 180150, -140168, -553417, -72335, 184019, -17899, 284082, -15313, -287897, -105133, 33339, -272538, 201734, 27294, 116237, 44503, -170542, -45460, -271147]
15658b71147a22295E3452O6539L912c3226k31647a05j87942a3672p8244j29711
15647b21627h2038j96292B23298b22274J08730A4900K07753k6017a08288c6370
15636c1611k78376J46471O7774m8313A34949N8804h2279j52163K8385r1435i8038
15624d2202E8555g0656j8844j81835E0227a08785i440F3140c81638a45091A71786
15612a54745F589J57590i0691J0353F3549c44657a67343k434b0730j60642j32242
15601c13614A1563a11415D4199b56030k89O0129B93388g4732A69371b15406B63136
15589A09551a118p2937L6668k72929A79013f7798M738A78300K175p6461P0594
15578A74608a70909l9802Q61D5528J07594b74397a12161G7544C3360b0328j58143
$$ y = [-271147, -122295, 53452, 119991, 123903, -33226, -264873, -105, -188047, -13672, -91916, -221627, -82038, -278330, 223298, -222274, -113544, 14900, 222653, 196636, -108288, -36370, -31611, -309987, -163516, -95742, -144055, 134949, 193753, -82279, -234442, -206057, -297492, -98038, -42202, 58555, -70656, -89500, -271335, 50227, -108785, -9440, 63140, -381638, -145091, 171786, -154745, 6589, 164179, -90691, -80338, 63549, -344657, -167343, -169777, -20730, -181372, -313614, 11563, -111415, 44199, -256030, -256319, -196190, 293388, -74732, 169371, -215406, 263136, 109551, -1118, -74055, -37387, -310316, 179013, -67798, -63060, 178300, 180475, 104014, 174608, -170909, -210711, -209850, 45528, 153122, -274397, -112161, 77544, 33360, -20328, -178471]
15567a78471b4358j07866P903A91389a6323j48814H8229O3767L3078b16563a5475
15555A22432a43195D216K39514h2428C07536N4169A46541c9873E3914J04440a90012
15543d31706J37517A02400a17710j04754i7318A71427a84365l6396f1112a1196
15532e1417k3665B06464j5849K17688A43324h3576p0414p392o8811A73115i3032
15520e5931k510h885B37956C8576i2201A82815a27421f469B95373q4655b87308
15508a33726J6009A68208c07365a05712j29519n6188F6494J97518G3903h3367
15497A18833a09590B52265I2600f1258j37721j2143L3130A0073a10359o5859j36114
15486c12332R5011O8571k69511a62727b9156j51735B85255a27717e985j71055
$$ y = [-178471, -24358, -132224, -124321, 191389, -16323, -165137, 88229, 151996, 185074, -216563, -15475, 122432, -143195, 4216, 243730, -82428, 307536, 361705, 146541, -39873, 53914, 158354, -190012, -431706, -294189, 102400, -117710, -222464, -97318, 171427, -184365, -220761, -61112, -11196, -51417, -75082, 206464, 190615, 408303, 143324, -83576, -153990, -161382, -230193, 173115, -93032, -55931, -58441, -8885, 237956, 38576, -92201, 182815, -127421, -6469, 295373, 210718, -287308, -133726, -117717, 168208, -307365, -105712, -235231, -291419, 66494, 264012, 73903, -83367, 118833, -109590, 252265, 92600, -61258, -198979, -211122, -177992, 10073, -110359, -176218, -312332, -217321, -148750, -418261, -162727, -29156, -180891, 285255, -127717, -5985, -177040]
15476a77040d2602D9474G218b03229B4798L21169b16706B58673B3865L8509J41789
15465B04163j4885J22688l2863B5933J78294K53904k27065F2769E360J99307A4249
15453d8507n4922L4781B83477a69227B6202Q0340d0761n3467C30382G5565L1236
15442A06801b00833a4728B03182I3445b23606M9372f4011l21904C6234a56255
15431b09989k25008J52936E1310L1722M5777N4128B7078a48026m2233c2593k9539
15420f2132A17982d24114E5216J45809c1859o3707C399a11622o1197j17349B10950
15408b57445G4673d043A51491L66235a05054A55209b20401C25329I8794b20255
15397B84951j12595G8924a86370j03476k3229D1898R4047k8964a26147L2556B00351
$$ y = [-177040, -42602, 49474, 7218, -203229, 24798, 345967, -216706, 258673, 23865, 62374, 204163, 189278, 311966, 279103, 25933, 204227, 458131, 231066, 62769, 5360, 204667, 14249, -48507, -103429, -68648, 283477, -169227, 26202, 106542, -40761, -94228, 330382, 75565, 106801, -200833, -14728, 203182, 93445, -223606, -174234, -64011, -385915, 36234, -156255, -209989, -434997, -282061, 51310, 83032, 128809, 182937, 27078, -148026, -190259, -32593, -62132, 117982, -424114, 55216, 201025, -31859, -95566, 3399, -111622, -172819, -290168, 210950, -257445, 74673, -4043, 151491, 517726, -105054, 155209, -220401, 325329, 98794, -220255, 284951, 172356, 78924, -186370, -289846, -313075, 41898, 135945, 106981, -126147, -93591, 200351]
15385c0007j4607B05914c0397q3878A20949c6196a7243I5010g2057k54524a19822
15373A17368b01635c3450p6888k2777B79803c53395c1822j77987j4959N1532p8551
15362b51787L6765D1786A5178e1573B07187b79597d4049D7798K08520A0740f2192
15350a28097r0094E7462f1298e151A69921b93761B29784A00933d83599C36158
15339A84717a09989A65443a65096A27232k1702n1987j0098J06211c22539H6626
15328G895b32585b9838A52356a45036C5691g8383J9448b2082A72497L5316H0099
15316A06997J05766q4371d9395C41479a89170d969q5277A84420a45778O4600C47546
15304e9049j69093g3069A99356a0675j9060k42322Q6063f1567A17396J3119b34387
$$ y = [-30007, -44614, 205914, -30397, -114275, 120949, -36196, -17243, 95010, -72057, -326581, -119822, 117368, -201635, -33450, -110338, -133115, 279803, -353395, -31822, -209809, -224768, -173236, -251787, -215022, 41786, 15178, -51573, 207187, -279597, -44049, 47798, 256318, 10740, -62192, -128097, -218191, 57462, -61298, -5151, 169921, -293761, 229784, 100933, -483599, 336158, 184717, -109989, 165443, -165096, 127232, 105530, 53543, 43445, 149656, -322539, 86626, 7895, -232585, -29838, 152356, -145036, 35691, -78383, -58935, -22082, 172497, 207813, 80099, 106997, 212763, 128392, -49395, 341479, -189170, -4969, -90246, 184420, -145778, -81178, 347546, -59049, -228142, -73069, 199356, -10675, -29735, -272057, -185994, -61567, 117396, 130515, -234387]
15292a38667A91932a10967A97735h6076A6222a32700A14291a93133F1209L3361
15282I4570a09517j47148A23348K852b22867B3628J34400J41392j0385A33366
15271C06734r2891G1576K0007b2649A72487B2115K82022F1859c71026A49511K10849
15260C60360A75975c9266B66906D8223M05545r7687i3360K2401j01010l4283B81368
15248B12400N3033a9671F9197N38683b10374B17513f6171D23351j58219M3937
15238C09069C9777J09640R955L10986O75081N40078m35877L14048k07420n97204
15228G59064l79107P696A63962Q9416R0754C1229L4761M5989b0273j42j30304
15217a50719M3759m6302A11119J60914a05255L4497o5948K4247d0259B14617H6134
$$ y = [-138667, 191932, -110967, 197735, -86076, 16222, -132700, 114291, -193133, 61209, 94570, -109517, -256665, 123348, 126200, -222867, 23628, 158028, 299420, 289035, 133366, 306734, 213843, 71576, 91583, -22649, 172487, 22115, 304137, 61859, -371026, 149511, 360360, 175975, -39266, 266906, 48223, 453768, 356081, -93360, -70959, -171969, -206252, 281368, 212400, 265433, -19671, 69197, 607880, -210374, 217513, -66171, 423351, 265132, 309069, 39777, 149417, 159372, 470358, 1145439, 1685517, 1249640, 1563688, 1356268, 759064, 379957, 387653, 163962, 253378, 344132, 31229, 65990, 111979, -20273, -20415, -150719, -106960, -153262, 111119, 272033, -105255, -70758, -136706, -112459, -40259, 214617, 86134]
15205C02578n2006j2019h7382j3995K3887A95774G6143E304a39398A1352J68111
15194A79463B6846a01310q73A42304P0891b41290A66252A0728K66608n3742b64653
15182a75448C0499P8217k1975d0704C4554g4196C20512f8984j6184p9997B4674
15170A19307m575K28287j47657D0926K22355G8226a5366F8683a9A98682p6476
15159A22206J36795D351N3200a7717D03556E7675a72255C701R5055h5898A58658
15147G5507M5661a51288A63965K75542c36744N8167E8175c23851O0704A84764
15136A20520j8807L9328O081J49431i7198C489d5920A1652i5790D8760a59472
15124a066A42546J54067b01989B32723i5114A11767C2510a0822B69015p5992C7306
$$ y = [302578, 250572, 238553, -87382, -101377, -77490, 195774, 76143, 5304, -139398, 11352, 179463, 26846, -101310, -102183, 142304, 213195, -241290, 166252, 10728, 277336, 223594, -264653, -175448, 30499, 108716, 86741, -40704, 34554, -74196, 320512, -68984, -85168, -165165, 24674, 119307, 114732, 343019, 195362, 40926, 263281, 78226, -15366, 68683, -19, 198682, 122206, 259001, 4351, 57551, -17717, 403556, 57675, -172255, 3701, 98756, -85898, 158658, 75507, 121168, -151288, 163965, 439507, -336744, -278577, 58175, -323851, -263147, 184764, 120520, 101713, 141041, 147122, 296553, -97198, 3489, -45920, 11652, -95790, 48760, -159472, -1066, 142546, 296613, -201989, 232723, -95114, 111767, 32510, -10822, 269015, 193023, 37306]
15112B25690j10634k8241k3800K26365A17941m9748j0388K09740j18321M4122
15102A93346P5427m1807a14244B27248q9598k1750d2848k5697B74722j32313b90458
15090I7685h368C16922A3171K89919A0610K99657l97i204F5491i6885D2819M19919
15078D62738c4139B22877J79314j02142D5267e3563B93218B5084J80031K93718
15068D98833j13793l9215a27542C33868L14599A25042a25896E47176B33285E0527
15057E6780O6862C1007b68856A97542o1827b62381C21737d0745j36651D22770
15046d5418A58531K06790b38179D9259L5129J18808j2600O7935i1578B13515o5007
15035A48508P7445A9345e9477F0924h4254A70438G5383R37P8824R0881A09820
$$ y = [225690, 115056, 86815, 63015, 289380, 117941, 68193, 57805, 267545, 149224, 193346, 268773, 226966, -114244, 227248, 137650, 115900, -42848, -68545, 274722, 142409, -290458, 97685, -8368, 316922, 13171, 303090, 10610, 310267, 309870, -9204, 65491, -96885, 42819, 462738, -34139, 222877, 402191, 300049, 45267, -53563, 293218, 25084, 205115, 498833, 385040, 345825, -127542, 333868, 648467, 125042, -125896, 547176, 233285, 50527, 56780, 123642, 31007, -268856, 197542, 135715, -262381, 321737, -40745, -177396, 422770, -45418, 158531, 365321, -238179, 49259, 84388, 203196, 190596, 258531, -91578, 213515, 148508, 225953, 19345, -59477, 60924, -84254, 170438, 75383, 76320, 155144, 246025, 109820]
15023B72881K47021B0578J57699l7841K3827e1979j19921B00877c04688B21892
15012B51464l0178j6783p7670D3811Q096a8482B17232J70307n7399p8806J2160
15001B63494J1544l9337n6844K69708d296A58166L245L42951k3085A67724M6526
14990B14250d9315D50210m0782r2503p2294I0216K24631I9460c9678q340B54377
14978a0773B69916M2735H6289J5130O1968j1749J68278H1510c55285D46018j00705
14967C45313A63644Q7433o1716K64744j90578H4854k6860L7446J19530J19632
14957C34602d1634D68300o5947a56085e2770k35022E0090K21454n1706J8859q9734
14946A48963P5396Q9564r5872q0009a03906B4117K74975r6424m8941K23446j04654
$$ y = [272881, 519902, 20578, 178277, 140436, 164263, -51979, -171900, 200877, -304688, 221892, 251464, 221286, 204503, 126833, 43811, 51907, -18482, 217232, 387539, 330140, 251334, 263494, 275038, 235701, 178857, 448565, -4296, 158166, 161411, 504362, 481277, 167724, 214250, -49315, 450210, 409428, 316925, 244631, 90216, 314847, 99460, -39678, -48018, 254377, -10773, 269916, 312651, 86289, 101419, 163387, 151638, 319916, 81510, -355285, 446018, 345313, 163644, 251077, 189361, 454105, 263527, 84854, 57994, 95440, 214970, 334602, -41634, 468300, 402353, -156085, -52770, -287792, 50090, 271544, 219838, 238697, 148963, 224359, 313923, 218051, 138042, -103906, 24117, 299092, 202668, 153727, 377173, 272519]
14935B72519A09842J70661m1883j3383B4066P8940L5770J26528I2813K16010p670
14924C01153f5388A04012J511L04654j21319j24704J71788J02249A61948L4571
14914A96519l0980L56196A63137L38410R6077k43220F8934M58373B51109A20166
14903F00482B39406o1365Q2605Q8450j0986M729o4482k6599N65243D00461K0181
14892D20642A27800P2670K07942A73256J60864L4669A35898K98282g2815D69309
14881B95458L301K99645B86097J19714K6501j34488l4887N7216O6236R0738r8278
14870C78849D5267J41314K61336r2320K8192O7877n3985A73626P3416k8304P8270
14859B97008K74739j57567J31931j41990A15582M49303r4950J00011k25063O3163
$$ y = [272519, 109842, 280503, 238620, 225237, 24066, 103006, 138776, 265304, 92813, 308823, 301153, -65388, 104012, 105523, 410177, 288858, 164154, 335942, 438191, 161948, 196519, 165539, 521735, 163137, 501547, 597624, 354404, 68934, 527307, 251109, 120166, 600482, 239406, 178041, 260646, 349096, 338110, 342839, 278357, 251758, 817001, 400461, 420642, 127800, 200470, 408412, 173256, 334120, 368789, 135898, 434180, -72815, 469309, 295458, 298759, 598404, 286097, 405811, 432312, 297824, 262937, 320153, 386389, 477127, 378849, 45267, 186581, 447917, 355597, 383789, 451666, 397681, 173626, 247042, 218738, 297008, 571747, 414180, 546111, 404121, 115582, 564885, 469935, 569946, 344883, 408046]
14849D08046A79531J26066R830P7857j39548M41159k41245p6506j0221K51146
14839F18069k82935J03091N9214f7438K1914B06581M31830j16639k42293k6122
14829B53357J21458A84397K00177r2077J07208K72135l12437J48251m5924r175
14819D52555J00796L1777j12126J9936j65967m1232J10918j11547A35613M65782
14809F01395B31210J07627Q2876j07156J47845m9343L65272B50123Q1882l1806
14799C00199l2646L45384k0220J16442j17631k03527j81665L55998j9679B42533
14788G49091B38455L10291J73235k15986k41548J50388R7887B10410J86208J23422
14778E20040J94948j0119C50322K71664K45967C95692A22664K48413K80538o7875
$$ y = [408046, 179531, 305597, 315427, 393284, 253736, 694895, 453650, 377144, 366923, 618069, 335134, 438225, 497439, -67438, -45524, 206581, 638411, 521772, 279479, 253357, 374815, 184397, 384574, 292497, 399705, 671840, 359403, 507654, 461730, 452555, 553351, 585128, 473002, 492938, 326971, 285739, 396657, 285110, 135613, 601395, 231210, 338837, 421713, 314557, 462402, 413059, 778331, 250123, 332005, 300199, 267553, 612937, 592717, 709159, 591528, 388001, 206336, 562334, 542655, 242533, 749091, 238455, 548746, 721981, 505995, 264447, 414835, 512722, 210410, 396618, 520040, 714988, 704869, 350322, 621986, 867953, 395692, 122664, 371077, 651615, 583740]
14768E83740Q8381k5789N3974k58457L13916K7940k04977J40799l04192L97274
14758H12609k96087j5132P7977j78214K44824K08372C59350J58475j87723L65231
14748F95333N6129R0675j54659l7191j9027j4927k4972n6675j05731k6391K82613
14737F85177k19671L96204k68141J75320l73852M44728j43406l9759A62535Q57861
14727A020396E01216K01631j91625J57642J9253j40114K77677l69112J72911J40051
14717G69530k17501J74430j37325M17500k05001k5290l4947l59476J33218K09819
14707G24957m5919L23079j75070m3682J0156j33600M70666l52542J57032j3429
14697I21648k73513J46796q6527K13861J478l11374L01668k83598K39386J03751
$$ y = [583740, 672121, 646332, 700306, 441849, 755765, 783705, 578728, 719527, 415335, 812609, 516522, 501390, 579367, 401153, 645977, 854349, 359350, 517825, 330102, 695333, 751462, 842137, 687478, 650287, 631260, 616333, 591361, 534686, 428955, 402564, 685177, 465506, 861710, 593569, 768889, 395037, 839765, 696359, 656600, 162535, 1020396, 501216, 702847, 511222, 668864, 688117, 548003, 825680, 456568, 629479, 769530, 552029, 726459, 589134, 1006634, 801633, 776343, 741396, 381920, 515138, 724957, 679038, 1002117, 827047, 783365, 793521, 659921, 1130587, 778045, 935077, 921648, 648135, 794931, 708404, 922265, 923743, 612369, 914037, 630439, 869825, 973576]
14687I73576k26059j5201J37478m33164M94047k08937L42190j45432J9813o871
14677I31440J15246j26696l04913J76571J98142l31555M17072o5491l9528k5168
14667I45120K41452k08284K62854m45407N8374K23524K28992k63673J0348r3514
14657I59786k40350J9155N12977k64778R340l35582K55006j90260L30875K19284
14647A275453j58602L195k31954R4971p4623K95388l01160M46575n22508P7653
14637I04388N16701o82783N57474j67398J63617r5457O5541L2140j82515L32523
14627A444231l40417M9025N17360p76126J12633J73694J64021j21258j0428j32729
14617A080006r9804M57801k1093j32182K38065m27500J64924L67632m56139J70293
$$ y = [973576, 747517, 732316, 869794, 436630, 930677, 721740, 1063930, 918498, 938311, 931440, 1046686, 919990, 615077, 791648, 989790, 658235, 1075307, 1009816, 970288, 945120, 1186572, 978288, 1241142, 795735, 854109, 1077633, 1306625, 1042952, 1053300, 959786, 719436, 738591, 1251568, 986790, 996130, 660548, 915554, 725294, 1056169, 1275453, 1116851, 1120046, 888092, 983063, 908440, 1203828, 902668, 1349243, 826735, 904388, 1421089, 738306, 1295780, 1128382, 1291999, 1196542, 1262083, 1294223, 1111708, 1444231, 1103814, 1152839, 1670199, 894073, 1006706, 1180400, 1344421, 1223163, 1212735, 1080006, 980202, 1438003, 1416910, 1284728, 1522793, 1095293, 1260217, 1627849, 1171710, 1342003]
14607A342003K55549j22562n6362o2410J94328J4930j72986K56498J0161j0759
14597A648390q0799j20072K89891l33994L4563L90236k84506L6841r4083Q4627
14587A571094p2937L80362m57288j0457M10169j8491q8872J19553j55767n47Q1606
14576A758425K12023k06082l27379N38321J14259j90670J11156l36717Q13086
14567B486422m16532l5697O3292J78902l82603L97954k40569J95194k9477j76917
14557B039969K58584k48357J61478L1167L14206l59928N17220o6518J78543k50984
14547B575380J93836K31147p2871L53862K21895K56714j7027M41702M76614L84157
14537E045409Q26905J114593J355275K235190L601242N793851P822893j51047
$$ y = [1342003, 1597552, 1474990, 1418628, 1356218, 1550546, 1565476, 1392490, 1648988, 1659149, 1648390, 1567591, 1447519, 1737410, 1403416, 1437979, 1828215, 1543709, 1580550, 1486467, 1571094, 1498157, 1878519, 1421231, 1410774, 1820943, 1802452, 1713580, 1833133, 1677366, 1676819, 1758425, 1970448, 1764366, 1436987, 1975308, 2089567, 1898897, 2010053, 1673336, 2486422, 2069890, 2034193, 2097485, 2276387, 1893784, 2291738, 2051169, 2246363, 2216886, 2039969, 2298553, 2050196, 2211674, 2242841, 2557047, 2197119, 2714339, 2647821, 2826364, 2575380, 2769216, 3000363, 2927492, 3281354, 3503249, 3759963, 3742936, 4184638, 4661252, 5045409, 5872314, 6986907, 8342182, 10577372, 14178614, 19972465, 27795358, 27644311]
14529B7644311p569157p477142m740778k124212j553250o21051m06916m42608
14521B709197j37026L68340l58256l20267P2303K03153k56018K03782K43302k35581
14511B492929j16439k5624N3009J58397L8970J11924m33525K50928J8191K26412
14501B775172K34283J9476k32403p993J20098j19283l50967Q2518K22750L4727
14491B778378O9910l4357M78952n84316O44592l23015J84955j87745K80175J31226
14481C438755J40453k43193J04886K4688j87936K64888J66600k22089j17291M07113
14471C776874l40106Q31469r72062J98259K29483K61196P6892l05348K63586R8988
14461D119231K54829r9333j14413k82354M30764L86201k32821K90784q8581n33316
$$ y = [27644311, 20075154, 12598012, 7857234, 5733022, 4179772, 3558721, 3151805, 2709197, 2572171, 2940511, 2582255, 2261988, 2334291, 2537444, 2281426, 2485208, 2728510, 2492929, 2376490, 2350866, 2403875, 2562272, 2601242, 2713166, 2279641, 2530569, 2548760, 2775172, 3009455, 3028931, 2796528, 2788535, 2908633, 2789350, 2438383, 2520901, 2743651, 2778378, 2848288, 2813931, 3292883, 2708567, 3353159, 3030144, 3215099, 3027354, 3307529, 3438755, 3579208, 3336015, 3440901, 3465589, 3277653, 3542541, 3709141, 3487052, 3369761, 3776874, 3436768, 4268237, 3296175, 3494434, 3723917, 3985113, 4062005, 3756657, 4020243, 4119231, 4374060, 4274727, 4160314, 3877960, 4308724, 4694925, 4462104, 4752888, 4664307, 4130991]
14451D130991M07091j17518K14270J08926k973J04221K46817k54367K23011O4771
14441E125240N05493n57212j5457J02106M10689L5220J61256n15711M19886K9523
14431E701033L82107J39036k97619L19422k07681J08128j55453O80197m5943m26076
14421F197151M51675J7606J07604K8493N0519o7493M37354J71983l51003L37906
14411G381795j4851K17858K68383k66787J02187L83374r4862J11754M02622J80898
14401H672371j23276K67713J35399l1224j75296N49335N6337K89736K3111N38985
14391A0203191j85538N82205m83403j03882P80592J50797j23229N09375J26665
14382A1456773J81602J30902l7237R2495L29504N77354R1977O2410J71314K63417
$$ y = [4130991, 4538082, 4420564, 4634834, 4743760, 4740787, 4845008, 5091825, 4837458, 5060469, 5125240, 5630733, 5073521, 5058064, 5160170, 5570859, 5606079, 5767335, 5251624, 5671510, 5701033, 6083140, 6222176, 5924557, 6243979, 6036298, 6144426, 5988973, 6669170, 6623227, 6197151, 6648826, 6666432, 6774036, 6802529, 6853048, 6785555, 7222909, 7394892, 7043889, 7381795, 7366944, 7584802, 7853185, 7586398, 7688585, 8071959, 7977097, 8088851, 8491473, 8672371, 8549095, 8816808, 8952207, 8920983, 8745687, 9295022, 9351359, 9641095, 9664206, 10203191, 10017653, 10599858, 10116455, 10012573, 10793165, 10943962, 10820733, 11330108, 11456773, 11638375, 11769277, 11732040, 11824535, 12154039, 12731393, 12823370, 12885780, 13057094, 13320511]
14372A3320511L39271L02174K35948l8563R68971m31051N82112K03793L68390
14363A5851556L62907K8442M20050L89787L83988M85296O0440N31102L48459q0348
14353A8781679P41057M19355L33415N89206O38347K02716M52918M03794P00177
14344B3262664N99431M20216R26222K96500K43711R27918N53088Q72305N82669
14335B8684724N32067O95214R87341P35249Q93777P25064R60572O93794J041532
14326C5949334J189172R91582J110911P79310J214917J430145J058461J549214
14318D5273046J367574J218744J836016J591519J605276J444828J630273K464140
14310E8431416J982081K306326J369926K596688K524858K365142K891626K414508
$$ y = [13320511, 13659782, 13961956, 14197904, 14159341, 15128312, 14697261, 15279373, 15483166, 15851556, 16214463, 16242905, 16662955, 17052742, 17436730, 17922026, 17982466, 18513568, 18862027, 18781679, 19522736, 19942091, 20275506, 20864712, 21503059, 21705775, 22158693, 22562487, 23262664, 23862095, 24282311, 25208533, 25505033, 25748744, 26676662, 27229750, 28102055, 28684724, 29216791, 29912005, 30899346, 31634595, 32528372, 33253436, 34214008, 34907802, 35949334, 37138506, 38130088, 39240999, 40020309, 41235226, 42665371, 43723832, 45273046, 46640620, 47859364, 49695380, 51286899, 52892175, 54337003, 55967276, 58431416, 60413497, 62719823, 64089749, 66686437, 69211295, 71576437, 74468063, 76882571]
14302G6882571L326174L066495L132649L587034L795471L399094M272537M296171
14294A05758196M413287M960924N114210N061044N792397O056393O536868O605490
14286A50298809P354130P687073P854437Q594496Q871893R881788R944542J0215631
14278B20702799J1223925J1507357J2216635J2689149J2917311J3308677J3717587
14271C08283440J3545846J3760105J3120293J2094695J1526383J0725083J0522274
14264C93578119R060136Q369334P077370O368665O061184M783392L150258J381041
14256D39829499N04566p64816m292937n569121o715013r284645j0981564j1403526
14248C91322443j2023736j2895648j2659559j2965375j3068115j3283356j2635284
$$ y = [76882571, 80208745, 83275240, 86407889, 89994923, 93790394, 97189488, 101462025, 105758196, 110171483, 115132407, 120246617, 125307661, 131100058, 137156451, 143693319, 150298809, 157652939, 165340012, 173194449, 181788945, 190660838, 200542626, 210487168, 220702799, 231926724, 243434081, 255650716, 268339865, 281257176, 294565853, 308283440, 321829286, 335589391, 348709684, 360804379, 372330762, 383055845, 393578119, 402638255, 411007589, 418084959, 424453624, 430514808, 435298200, 438448458, 439829499, 440334065, 439569249, 435276312, 429707191, 422992178, 413707533, 402725969, 391322443, 379298707, 366403059, 353743500, 340778125, 327710010, 314426654, 301791370]
14241C01791370j2804300j2188090j1855385j1573275j1069677j0570632j0479222
14234B21250789j0420032r969979r125629r000828q799625q153350p717848p325410
14226A50738088o924998o591573o086970n999324n257298n564164m645778m290821
14218A05377162m740267l713497l889056l828115l053695l559780l266145k842019
14210G6484588k930633k775545k305134k174180k556822j991316j683287k230044
14202E7837627k060377j497767j965868j384447j394532j719789j573667j057821
14194D5183359j371084j017951j200078q50082j416915j031315j071805q16489
14186C6407640j307638q16372p13091q09226r30927o13846p67100j229367n66810
$$ y = [301791370, 288987070, 276798980, 264943595, 253370320, 242300643, 231730011, 221250789, 210830757, 200860778, 191735149, 182734321, 173934696, 165781346, 158063498, 150738088, 143813090, 137221517, 131134547, 125135223, 119877925, 114313761, 109667983, 105377162, 100636895, 96923398, 93034342, 89206227, 86152532, 82592752, 79326607, 76484588, 73553955, 70778410, 68473276, 66299096, 63742274, 61750958, 60067671, 57837627, 55777250, 54279483, 52313615, 50929168, 49534636, 47814847, 46241180, 45183359, 43812275, 42794324, 41594246, 40744164, 39327249, 38295934, 37224129, 36407640, 35100002, 34283630, 33570539, 32761313, 31830386, 31216540, 30449440, 29220073, 28653263]
14177B8653263l43189j052471n70122m24589o82878o42206o61839l24911p59754
14168B3191304k80166q15354k36138l14635o73713n23738l03603k28126m40336
14159A9375495p3437q08670j32916l47305q16095n0350m87975j72879p3564l68675
14149A6043629n32291l61410L8198m80977k71313j9211k46034m62902l71962L28458
14139A3664185o68490l01569l99591Q2322p9230m4384k76344n38170K84715n25045
14129A1198399L6083m96970L67009n05195R5872n18046R1561j99957q3141M5035
14119A0030650m94244j04742k43377K74045n36378P5616O3945l36460j1190j54384
14109H563481o793m68404K90125k52760l32178r2943L6793l827m7373l26520k64294
$$ y = [28653263, 28310074, 27257603, 26687481, 26262892, 25580014, 24937808, 24275969, 23951058, 23191304, 22911138, 22095784, 21859646, 21545011, 20871298, 20347560, 20043957, 19815831, 19375495, 19302058, 18493388, 18360472, 18013167, 17197072, 17146722, 16658747, 16485868, 16412304, 16043629, 15511338, 15149928, 15188126, 14707149, 14435836, 14416625, 14170591, 13707689, 13335727, 13664185, 12995695, 12694126, 12294535, 12376857, 12297627, 12253243, 11976899, 11438729, 11723444, 11198399, 11234482, 10737512, 11104521, 10599326, 10695198, 10177152, 10268713, 10068756, 9985615, 10030650, 9536406, 9431664, 9188287, 9462332, 8925954, 9001570, 9065515, 8729055, 8717865, 8563481, 8556688, 8088284, 8378409, 8125649, 7793471, 7700528, 7737321, 7733494, 7686121, 7359601, 7095307]
14098G095307k20251K68466K48625l88518j51052p9185J88401k96159l24881J69240
14088F509993q237j46942l9977j27462j08978j89296K41296k69068j02809K9506
14078E788026k96438J55338k0967m70848O07598k11844j32923l70358J5974J27483
14068E191041l98147K47842k975j01630k7607J24303M9028l92341k47545l1434
14058D410535R2258L8139O0818r3600j78739K01938l09914k7235k03331L25891
14048D316760k75916p471J90384j01929j06406k45854j21406K29649k0087p8276
14038C779448k11375K27501J08513k32145k663M5123m81621K63698j46202J30906
14028C481183j2605j49282j56950K83778J69515o9762k96538M7686o2717r8824
$$ y = [7095307, 6875056, 7143522, 7392147, 7003629, 6852577, 6773392, 6961793, 6665634, 6340753, 6509993, 6501756, 6354814, 6314837, 6187375, 6078397, 5889101, 6130397, 5861329, 5758520, 5788026, 5491588, 5646926, 5625959, 5155111, 5762709, 5550865, 5417942, 5047584, 5063558, 5191041, 4792894, 5040736, 5037761, 4936131, 4908524, 5032827, 5081855, 4689514, 4441969, 4410535, 4502793, 4540932, 4601750, 4508150, 4329411, 4531349, 4221435, 4194200, 3990869, 4316760, 4040844, 4033373, 4223757, 4121828, 4015422, 3769568, 3648162, 3877811, 3857724, 3779448, 3568073, 3795574, 3904087, 3671942, 3669279, 3714402, 3232781, 3496479, 3350277, 3481183, 3468578, 3319296, 3162346, 3446124, 3615639, 3545877, 3249339, 3297025, 3234308, 3135484]
14018C135484O259m810k9917l1142j16645j40266K39083j36511J93131k34993
14008B879673j80928L8102N7684k19590j77684L74493j4183j24160K2970k48336
13998B408041L99599j43831m71632J51107J11090j13234J00679J12387N1575m4672
13988B561109k10132K26754J08548q7873r7312j04094M36262n6862L18660J19335
13978C214395N35145R4431P18953R17976J952636K788662N260732Q644195K863709
13969B6990834o779523o438267l873433k382583j674179p85363m99801o80651
13961C877034o4192l42009n8541l97509K95158l73091j00006M7531j70333k65784
13951B448258J86805k8091m5773O5784m14125K89198k39716Q5982k88191m148
$$ y = [3135484, 3141743, 3136933, 3107016, 3075874, 2959229, 2818963, 3058046, 2921535, 3114666, 2879673, 2698745, 2736847, 2794531, 2574941, 2397257, 2771750, 2757567, 2633407, 2656377, 2408041, 2807640, 2663809, 2192177, 2343284, 2454374, 2341140, 2441819, 2554206, 2605781, 2561109, 2350977, 2577731, 2686279, 2598406, 2501094, 2397000, 2833262, 2776400, 3095060, 3214395, 3749540, 3843971, 4562924, 5480900, 7433536, 10222198, 15482930, 24127125, 26990834, 20211311, 13773044, 9899611, 7517028, 5842849, 5057486, 4557685, 3877034, 3812842, 3470833, 3412292, 3014783, 3309941, 2936850, 2836844, 2884375, 2714042, 2448258, 2635063, 2606972, 2561199, 2626983, 2212858, 2502056, 2262340, 2348322, 2060131, 2055983]
13941B055983L49254l33891o3352l3623M36928j28567Q7359p58473M05155R1366
13931B108139j24391l7048J5216m54737K67649J87606R1116j72160M0951j29407
13921A792934j61342J15795m39503N37144J07116m50766J61353L26974j91637
13912A798068k34357m0587J96914k25340K57898j41878J21334j86744j4984j6521
13902A513803n12050R08048m98946K40938m2891k61507L30568j46051l8756J46914
13892A640070k2562k9680m74k06217K69048j80361l25631K09543J08470n67830
13882H94376L13370P5660K46844j55376M2068J5622R2109j96037j37863J9521
13872A210294L9741r5914K53135M0544l95976j8646K69781k5570k55802K35769
$$ y = [2055983, 2405237, 2071346, 2007994, 1974371, 2411299, 2282732, 2370091, 1611618, 2016773, 2108139, 1983748, 1946700, 1961916, 1507179, 1774828, 1962434, 2053550, 1881390, 1922341, 1792934, 1631592, 1747387, 1307884, 1845028, 1952144, 1501378, 1662731, 1989705, 1798068, 1563711, 1523124, 1720038, 1494698, 1752596, 1610718, 1732052, 1545308, 1530324, 1513803, 1001753, 1909801, 1410855, 1651793, 1608902, 1347395, 1677963, 1531912, 1493156, 1640070, 1617508, 1587828, 1587354, 1381137, 1650185, 1469824, 1144193, 1353736, 1462206, 894376, 1207746, 1283406, 1530250, 1374874, 1416942, 1432564, 1524673, 1328636, 1190773, 1210294, 1250035, 1154121, 1407256, 1447800, 1051824, 1033178, 1302959, 1277389, 1021587, 1257356]
13862A257356L9700P4830j72824L46712m06016k27159K0221L13793J02667m9191
13852A300089j34333O5404n06218K91705J35329k13046K85933n3950p2357j49923
13842I48633L51969k11370k62103J28374J70936j0115k82419K58430J40168q1263
13832A151240K8648m423m90051N78803l5021l50972J31012r3438K83102j18640
13822A080260j46254j34728J61310K09713r7765o5190n3866k32306L91951m5869
13812A067256N3267j51426l84108J20934M37040j74884j02554j15897M83342m19949
13802H13021o5678K63896K8980j79231j37008J74890m2605M393q5465j84865M64092
13791A054420j20215J48634E38228N70056k80899k84822N44795m97549L26920
$$ y = [1257356, 1297056, 1371886, 1199062, 1545774, 1139758, 912599, 932820, 1246613, 1349280, 1300089, 1165756, 1231160, 724942, 1016647, 1151976, 938930, 1224863, 1170913, 1098556, 948633, 1300602, 1089232, 827129, 955503, 1126439, 1116324, 833905, 1092335, 1232503, 1151240, 1179888, 1175465, 685414, 1264217, 1229196, 878224, 1009236, 915798, 1198900, 1080260, 934006, 799278, 960588, 1170301, 1072536, 1007346, 953480, 721174, 1113125, 1067256, 1120523, 969097, 584989, 705923, 1142963, 968079, 865525, 749628, 1232970, 813021, 747343, 1011239, 1040219, 860988, 723980, 898870, 856265, 860658, 775193, 590328, 1054420, 934205, 1082839, 538228, 1108284, 827385, 542563, 1087358, 589809, 916729]
13782I16729j82113K8764J27433j58745j0005j30014j08864J38300J94493J54628
13772I70606j81286K32566k65557m3912K11248j58949J85495D58580N98212m18484
13762F38308j65459K08546R1592K8300j22078L2297L41958k06114k83680P5291
13752F38961p1033J68628J80817P301j13664k0873K29140j7783D52332L24649
13742G76981P8787j43119O8502L2542M36297m01480L1994j26829Q4778J44383
13732I82836D79518K39525p7294L8767K29000l78779n0507O6883P5154l6878L52509
13721I37898n0961p0123R77l78037J05963L87003l34950l4216L79662D15045K55378
13710F70423j64109J10032j5210j36051K08488J12581l35711M49895M9099m12325
$$ y = [916729, 734616, 763380, 890813, 732068, 722063, 592049, 483185, 621485, 815978, 970606, 789320, 1021886, 756329, 712417, 923665, 764716, 950211, 458580, 1056792, 638308, 472849, 681395, 772987, 801287, 679209, 711506, 1053464, 847350, 563670, 638961, 567928, 736556, 917373, 924674, 811010, 790137, 1019277, 1001494, 452332, 776981, 855768, 712649, 781151, 813693, 1249990, 848510, 880504, 753675, 838453, 982836, 479518, 719043, 641749, 680516, 909516, 530737, 480230, 547113, 622267, 585389, 937898, 886937, 816814, 817791, 439754, 545717, 932720, 597770, 563554, 943216, 415045, 670423, 506314, 616346, 601136, 465085, 673573, 786154, 450443, 900338, 949437, 537112]
13700E37112J2174K06026q6127O054n2148J86346j23503j20133M8049J03720l08535
13689D09035J18821B60451L65245J7517n4487K56248C97197L70820k41312k61179
13679B65526K31827j29591L36936n3023J51973j56754j12551A43037L36478j41967
13669C37548J72128N0657j0814N1090J4114k72709J47628j56000M6788n1621N10397
13658H39206l81370j1090J73730j03410K7590j4958j73470K15006j30772r15j87152
13647B52395K08517m0714L2452J53935j79902n2715J82617B42734K85781l7427
13637D91088q8188J98169k16330m1940K6721K10595j16966k19659K31269J96161
13627F70920k62605N1895J32402j16863P9459j32563K41750B84116K44952j91643
$$ y = [537112, 549286, 755312, 669185, 675239, 623091, 809437, 685934, 565801, 613850, 717570, 409035, 527856, 260451, 625696, 643213, 588726, 844974, 397197, 768017, 526705, 265526, 497353, 367762, 704698, 651675, 803648, 646894, 534343, 143037, 479515, 337548, 509676, 560333, 549519, 600609, 614723, 342014, 489642, 333642, 380430, 328809, 839206, 457836, 446746, 620476, 517066, 544656, 529698, 356228, 571234, 440462, 439547, 252395, 460912, 420198, 452650, 606585, 426683, 373968, 556585, 242734, 528515, 491088, 402900, 601069, 384739, 342799, 369520, 580115, 463149, 243490, 474759, 670920, 408315, 460210, 592612, 475749, 555208, 422645, 664395, 284116, 529068, 337425]
13617C37425J30195m8553J58954A46982J49184q0975K81574J1548A56921K09427
13607C66348A49026J47962K88452k177j99289j74581a72736E25383N0168j33553
13597D41998j6431L7966k9198p0529j30498J45984j83091L49250k52988K71054
13587E63517J60971C57377J74594A50419j0428K19682q3213K23160A56505J73153
13577C29658l6698p4913J37864J84620j71668J02804j27647K65553B35871J70800
13567D06671K47550k27323k8268J50j3320j31168J93740j60839m8770K82289j33439
13556C87273j67842J34835L38751a05022C05159r3099B1497K91835j23817J75730
13546C65245L9268j1119A51098L91865A82267K19470J80724j84313R796P8847
$$ y = [337425, 467620, 419067, 578021, 146982, 296166, 215191, 496765, 508313, 156921, 366348, 149026, 296988, 585440, 583263, 383974, 209393, -172736, 525383, 575551, 441998, 425567, 463533, 434335, 363806, 233308, 379292, 196201, 545451, 292463, 563517, 724488, 357377, 531971, 150419, 139991, 359673, 276460, 499620, 156505, 329658, 292960, 218047, 355911, 540531, 368863, 471667, 344020, 609573, 235871, 406671, 654221, 426898, 398630, 398780, 385460, 254292, 448032, 287193, 238423, 520712, 387273, 219431, 354266, 693017, -105022, 305159, 212060, 21497, 313332, 189515, 365245, 404513, 393394, 151098, 542963, 182267, 401737, 582461, 398148, 407944, 486791]
13536D86791j81488j43456M7594k3157m3020L97424k04060N2542j25462o5886
13526A97822J44640j57387p7421L41320j20654N9860j46605J05899C4373O71024
13516G05397B57410m3744A03340J05186K3750J21623K05752a29054B28623J52254
13506C80877r2473E0249J49224J69943A29827d6198B68773L12887A41210c9803
13495D73203o9471Q0470B14656O5847J66390K2384j32835j51553K25243L0149
13485D40281j73307C619M44337A12239J71226j37968M26748a266C82817J81491
13475E64308A97818n8316K34091L489j27041a21023B12556J20779J48872I3713
13464D44969j37228o3649K3738A0306L18049q1640L79044j48813A76710L83969
$$ y = [486791, 305303, 161847, 209441, 186284, 143264, 540688, 336628, 389170, 263708, 197822, 342462, 185075, 107654, 448974, 328320, 388180, 241575, 347474, 34373, 705397, 257410, 213666, 103340, 208526, 232276, 353899, 559651, -129054, 228623, 380877, 288404, 50249, 199473, 369416, 129827, -46198, 268773, 581660, 141210, -39803, 473203, 403732, 484202, 214656, 280503, 446893, 469277, 336442, 184889, 410132, 440281, 266974, 3619, 447956, 112239, 283465, 145497, 572245, -1266, 382817, 564308, 197818, 139502, 373593, 377082, 250041, -121023, 212556, 333335, 482207, 93713, 444969, 307741, 244092, 267830, 10306, 328355, 246715, 625759, 476946, 176710, 560679]
13454E60679I908L40392n3597n1537E4715K73355R7901E8600L2960J78726J05625
13443C75911q1181O226N7157p3122J21491j85633b9543A98177J34450k4901j19731
13432A87995J04904G1969J65848P3811j31015A0826M02343A00165N3492J05706
13422B59363j01542a53227B12387K6817k8648J31912j29638I2253k5890K26524
13412B92887J05186j52341J33225I6132k2088K99505j9923q3817L37372a03230
13401H7237k6883L69020j89989c1828C20643j26533J54107j6965A04832R899J83088
13390B97819L4679A48822C6347N63519B71839j2076P0285N5122E8978K86969j09165
13379B36782j16046A4633K40862j26012L19433B14393J18394r2321q226q2797
$$ y = [560679, 9908, 350300, 296703, 245166, 54715, 328070, 425971, 58600, 91560, 270286, 375911, 294730, 300956, 358113, 284991, 406482, 220849, -29543, 198177, 332627, 307726, 187995, 292899, 71969, 237817, 311628, 180613, 10826, 413169, 100165, 153657, 259363, 157821, -153227, 212387, 239204, 210556, 342468, 212830, 92253, 66363, 292887, 398073, 245732, 378957, 96132, 74044, 373549, 353626, 269809, 607181, -103230, 87237, 60354, 429374, 239385, -31828, 320643, 194110, 348217, 331252, 104832, 114731, 297819, 332498, 148822, 36347, 599866, 271839, 259763, 330048, 385170, 58978, 345947, 236782, 120736, 14633, 255495, 129483, 448916, 214393, 332787, 240466, 232240, 149443]
13369A49443J64091j44607L8440a00141A70771J659M18150a22907I2796K13148
13359C05944E7611L15374j85352k3649l9796J82501g6999B05302K93369j86813
13349C11858J50676b6333D3418l204K92524a9464n7581A69288K04807j54020K06649
13338D26724q164H7460J15140f5455A55503K72221r2180l6777J28193l2647j73462
13327B20851A4060J12734K6716K22523E8902Q5870R1169J2325M3933A43792J6026
13316A59818P4462K37640O5828A2736K73008q7649J12048k7271J69046j83890
13306B68028j23873L8030J26497B1638k575a6584k0098C29280j18384J79077A70149
13294A87990J1658r439K23616r366j76569A8049N3933h6363B96047a52797B89451
$$ y = [149443, 313534, 168927, 207367, -100141, 170771, 172430, 590580, -122907, 92796, 305944, 57611, 372985, 187633, 163984, 124188, 306689, -76999, 205302, 498671, 311858, 462534, -26333, 43418, 40214, 332738, -19464, -77045, 169288, 374095, 220075, 426724, 418560, 87460, 202600, -65455, 155503, 427724, 335544, 298767, 426960, 394313, 220851, 14060, 126794, 153510, 376033, 58902, 144772, 235941, 248266, 292199, 143792, 159818, 234280, 471920, 537748, 12736, 285744, 198095, 310143, 282872, 451918, 268028, 144155, 182185, 308682, 21638, 19063, -16584, -36682, 329280, 210896, 389973, 170149, 187990, 199648, 190209, 413825, 404459, 227890, 18049, 71982, -86363, 296047, -152797, 289451]
13282A01205A5837M113J70337J0781K19225n8915j56706l7657a02288A99852E6276
13270B33866a5945B17710f9591B61973e553D55418k23059l5357n4650c1440D5454
13258D77723A11006q857E839L6659a32326a3565j63819B00211f5444B67982A12711
13246B88962a6850C7365J988K03889a09805B11621K2532q217B4768a1q9552C42889
13233B68983H5275n161K68548j16889B2058j0932Q0568R7175m3289m7798J19704
13222B17486K0925G0182J10884k5123d3643K0655A6744J71780c6024D3963J77310
13211B21273n7151E0602j1020K86632F9044B3516K26038e1736j09511A92522D5241
13199B13493k0775J22521a8239A25291f7156B50367m4221C3376L10554C5950d1522
$$ y = [101205, 15837, 19950, 190287, 201068, 420293, 361378, 204672, 167015, -102288, 199852, 56276, 233866, -15945, 217710, -69591, 261973, -5553, 455418, 232359, 197002, 142352, -31440, 45454, 477723, 111006, 102149, 5839, 42498, -132326, -13565, -177384, 200211, -65444, 267982, 112711, 288962, -16850, 37365, 39353, 243242, -109805, 211621, 234153, 225936, 24768, -11, -89563, 342889, 268983, 85275, 80114, 348662, 231773, 22058, 11126, 91694, 188869, 145580, 97782, 217486, 238411, 70182, 181066, 155943, -43643, -22988, 16744, 188524, -36024, 43963, 221273, 164122, 50602, 39582, 326214, 69044, 23516, 249554, -51736, -161247, 192522, 45241, 213493, 192718, 315239, -18239, 125291, -67156, 250367, 206146, 33376, 343930, 35950, -41522]
13187b6421H7584J6049a4749E3165g200C98993a93655B298K88960J91541C1393
13175b5634C7042K59078b82706B88442A17535a09130D26301a19236B64993a08742
13164A95804p4427a11473B29139M7335k5608B0529O5657b311C31796A49697a66734
13152c2210F6031h844B84828d2247B28382M175m958F8845A1599e7899D2281L38285
13140C80566j70380N1195I1684J01733H9224O6435K06949F3912J74552a33762
13129F3293b5693j17719d8460A15267b60652i3509F3498O3942k7629b36500I6425
13117C60449A24619b11029A49927C7114J05436A8565J98922e9922G1049a48881
13106B03369N7262k9900l9258f552A9404J22216a7701C07407B2507K81015a69133
$$ y = [-26421, 87584, 103633, -14749, 53165, -7200, 398993, -193655, 2298, 291258, 482799, 31393, -25634, 37042, 296120, -282706, 288442, 117535, -109130, 426301, -119236, 264993, -108742, 195804, 121377, -111473, 229139, 276474, 250866, 20529, 86186, -2311, 331796, 149697, -166734, -32210, 66031, -8844, 284828, -42247, 228382, 232557, 227599, 68845, 11599, -57899, 42281, 380566, 210186, 261381, 91684, 193417, 89224, 155659, 362608, 63912, 238464, -133762, 63293, -25693, -143412, -48460, 115267, -260652, -93509, 63498, 127440, 99811, -236500, 96425, 360449, 124619, -211029, 149927, 37114, 142550, 18565, 217487, -59922, 71049, -148881, 203369, 260631, 230731, 191473, -6552, 19404, 141620, -17701, 307407, 22507, 303522, -169133]
13094A12717b6078m5966C27047F3839J14951J04952a04049A99755I8343b53972
13083A49270J4299b4410C388J9756J90778N8648A06670a1126B4738O6746g3131
13071B73351a66819B72171c96070A51045b6509E1448h008A81310b16861C10277
13060a05132H5323B6458a3470A19142n5235J53137J3198H0180e1332A05375k544
13049A02831K45908d8441B26202c204D3902J19615o2741J14646i1115B19290a04394
13037d8377j31029E8591M00831i9908D6073L48546d4815B39673D5311J68604p7335
13026A36580n9288a21330B51066o4418e9498r0361B24005h055A63494n6122f8537
13014a61793A10575J99619A06264L93426B38208N8095c08708C48509m8847m4917
$$ y = [112717, -26078, -72044, 327047, 63839, 178790, 283742, -104049, 199755, 98343, -253972, 149270, 163569, -24410, 3388, 23144, 213922, 272570, 106670, -11126, 24738, 91484, -73131, 273351, -166819, 272171, -396070, 151045, -26509, 51448, -8008, 181310, -216861, 310277, -105132, 85323, 26458, -13470, 119142, 63907, 217044, 230242, 80180, -51332, 105375, 102831, 348739, -48441, 226202, -3204, 43902, 163517, 100776, 215422, -91115, 219290, -104394, -48377, -179406, 58591, 459422, -99908, 46073, 394619, -44815, 239673, 45311, 213915, 136580, 77292, -121330, 251066, 186648, -59498, -149859, 224005, -8055, 163494, 107372, -68537, -161793, 110575, 310194, 106264, 499690, 238208, 296303, -308708, 348509, 299662, 254745]
13004B54745k6349G5706d7504o9925B05995f7818C05275c25984J51993H4899b49036
12992h876C63943a74396G6140Q3008h7316C91808j65448a4322A31019L23343H1214
12980b56521H9833b25275C15937K61982b0393m444F8968l3090g6915F2294J15303
12969A77597L3928a95997j31610I3315R2021h0784B25486M1061e2301m66408A34249
12957g3203B5742R7612f9230m5229D7078h9334A35794E4447J42818B0074a75044
12945g4518A33343P7219B9121J65436a6955A27917j214P2728D2637O3589J28810
12934B35036p9546p1554d4927G5806f1661A7983K62342p5224J28387E767N1995
12923E7762J5298A6379b0201A50490B2496a9953B17691J9043g5129l9333A53262
$$ y = [254745, 228396, 75706, -47504, -117429, 205995, -67818, 305275, -325984, -173991, 84899, -249036, -8876, 363943, -174396, 76140, 159148, -87316, 391808, 226360, -14322, 131019, 454362, 81214, -256521, 89833, -225275, 315937, 577919, -20393, -24837, 68968, 35878, -76915, 62294, 177597, 211525, -195997, -327607, 93315, 185336, -80784, 225486, 266547, -52301, -518709, 134249, -73203, 25742, 123354, -69230, -114459, 47078, -89334, 135794, 54447, 197265, 20074, -175044, -74518, 133343, 210562, 29121, 194557, -16955, 127917, 126703, 199431, 42637, 106226, 235036, 155490, 83936, -44927, 75806, -61661, 17983, 280325, 205101, 333488, 5767, 57762, 73060, 16379, -20201, 150490, 22496, -19953, 217691, 236734, -75129, -114462, 153262]
12911D85623a09065C9108O5416c77172a20590f073B6570e0841C3470e3313B34313
12899B06755r9942A0263c10519B045b78304A93032h3360B65290h4931A5722H70
12887b25084B2732J00975J0525j1265B6750J8798c6344A9005J55879a37509H236
12875A1961L400L4782L9007b27885C56052A32404h4175K2726F2939B2020b9579
12863E6113J5590b62364A91119D880f006j19215N5703j13428A78578f1233A64686
12851A29426B3143P6309a44877D10860O827m1724j51959o7345b5959n9786L7500
12840d8245A79544J12625j34758e6079R375o7467d2047A40239a49520C20648b09107
12828A93269O4667F6679i565F3800Q2429g5611j10336B08004F1018L478E547a2015
$$ y = [485623, -109065, 39108, 104524, -377172, -120590, -6073, 26570, -50841, 33470, -53313, 234313, 206755, 106813, 10263, -310519, 2045, -278304, 193032, -83360, 265290, -84931, 15722, 870, -225084, 22732, 123707, 134232, 122967, 26750, 45548, -36344, 19005, 174884, -137509, 8236, 11961, 15361, 50143, 89150, -227885, 356052, 132404, -84175, -61449, 62939, 22020, -29579, 56113, 71703, -262364, 191119, 4880, -6006, -125221, -69518, -182946, 178578, -61233, 164686, 129426, 23143, 99452, -144877, 410860, 417687, 375963, 224004, 156659, -25959, -85745, -48245, 179544, 292169, 157411, -56079, -46704, -114171, -42047, 140239, -149520, 320648, -209107, 193269, 257936, 66679, -9565, 63800, 146229, -75611, -185947, 208004, 61018, 64496, 5547, -12015]
12815A37868a10087H0254A4570A222c6358n811B77768O468g4405C04668H2174
12803d2390k03002R0610B51024c6996B24918c0319I5594J44608A00952e1662A69263
12791h4603I3498a59866B7826f6828A13564E327J36321a90322j01746g6295k20787
12780b97082A14341j879C5212h7183A96410C814L48605a07899C09119a38362H9964
12768b9920j69852b5829B072e0799A69162J75621n6734E9742E035J21967h868
12756a20098A7043L2240a22849A0922L93373D5526K54780a46686C98519a88941
12745a57735B27842H3589K87906j60736f7853A84986D0079A417g1143B1178L8474
12734E9652C575b1804B89563A9132K91013I8351J02411n606k4516a17762a3406
$$ y = [137868, -110087, 80254, 14570, 1222, -36358, -42169, 277768, 284236, -74405, 304668, 82174, -42390, -245392, -154782, 251024, -36996, 224918, -30319, 95594, 240202, 100952, -51662, 169263, -84603, 93498, -159866, 27826, -66828, 113564, 5327, 141648, -190322, -292068, -76295, -297082, 114341, 112462, 35212, -87183, 196410, 3814, 352419, -107899, 309119, -138362, 89964, -29920, -199772, -25829, 2072, -50799, 169162, 344783, 288049, 59742, 5035, 127002, -8868, -120098, 17043, 49283, -122849, 10922, 404295, 45526, 300306, -146686, 398519, -188941, -157735, 227842, 83589, 371495, 210759, -67853, 184986, 40079, 1417, -71143, 21178, 59652, 3575, -21804, 289563, 19132, 310145, 98351, 200762, 195156, 170640, -117762, -13406]
12722a6520A43120N0741c2964A97672J11994g684D7465b9185e358A99432a52160
12710B33749e9150q7992a7598A7641a22676I016M4036b08925A40968b58741B36553
12698A55473o0064g8276A1626h7140c0704k70357d1102A1891R3716J57142b54097
12686A61342k2840J05186b95459B94069F0212b7997q4164j31942N7148H3845l4725
12675D9120J84579b30440B88138I2661a85350L0002E6257i4306A11340L22701
12665D34041e9779j9399L5139I5228b74159B44978K34889B00088D3827a67063
12654b21875B33965D4742J02877K02577b12332B57478F0658J98159a09085a4572
12643B81310A03114a9815C49840j55977k68L57473A11780b11347A08488l5943
$$ y = [-16520, 143120, 193861, -32964, 197672, 309666, -7684, 47465, -29185, -5358, 199432, -152160, 233749, -59150, -147142, -17598, 17641, -122676, 9016, 53052, -208925, 140968, -258741, 236553, 155473, 95409, -78276, 11626, -87140, -30704, -301061, -41102, 11891, 105607, 262749, -254097, 161342, 138502, 243688, -295459, 294069, 60212, -27997, -112161, -244103, -186955, 83845, 49120, 233699, -230440, 288138, 92661, -185350, -155348, 56257, -94306, 111340, 434041, -59779, -79178, -44039, 95228, -274159, 244978, 479867, 200088, 43827, -167063, -221875, 233965, 44742, 147619, 350196, -212332, 257478, 60658, 258817, -109085, -14572, 281310, 103114, -19815, 349840, 193863, 193595, 551068, 111780, -211347, 108488, 72545]
12633G2545I267M8717K66015a08577F6973a45516a3878m5133G9788A7368m344
12622A3024J15475E6145J41086J15438j27090l2918o8470J13471a3076A84173
12611E98456A96657J10864A02678J52649G7456J6076L13277A63709K46240a28775
12600A76958J23793h309E6231a21699C8168b92362a33478A47145i7958j84939
12590b82897h3967F4526g2955C7993b895B370J13292J50131c4715C0484J63309
12579A93793J42548a92098A4110N2919O355J28273G8805b9030j0942A97642a06732
12567C20172E9491J76047L96530A4919a58119a3855j64360B25856q0253N5857
12557B01460E8069a19567A23881a1787r789C54260j20833A11962M2832e93B06234
$$ y = [72545, 9267, 57984, 323999, -108577, 66973, -145516, -13878, -59011, 79788, 17368, 13024, 128499, 56145, 197231, 312669, 185579, 152661, 84191, 197662, -13076, 184173, 598456, 196657, 307521, 102678, 255327, 77456, 93532, 406809, 163709, 409949, -128775, 176958, 300751, -8309, 56231, -121699, 38168, -292362, -133478, 147145, -97958, -282897, -83967, 64526, -72955, 37993, -2895, 2370, 115662, 265793, -34715, 30484, 193793, 336341, -192098, 14110, 67029, 73384, 201657, 78805, -29030, -39972, 197642, -106732, 320172, 59491, 235538, 632068, 14919, -158119, -13855, -178215, 225856, 145603, 201460, 58069, -119567, 123881, -11787, -21576, 354260, 233427, 111962, 154794, -593, 206234]
12545C00152c32753e5947A16492P8385a09997B42832I3080J52584r6891b92684
12534b3728A97775b53572B76988B5661a49958C39100a03352K7456B1058L03156
12524C24214A42079K6707D8108i7078A86809Q2710d4344j4674p8277D2475a86778
12512F5333i0045I7724J39166j17763i5053D88374A02925g0009H405P0719J71216
12501B50340C0749Q0767i3353D5788j3672J34604a074A71331G1099K97143A23977
12489A61630c628A16703d4762B05479L5865J38505A29206B3725b6572k0556A55836
12477A71296b50888j30861A07517m9687B8256h7471A52989D3597K02875a36000
12466C87419j08487c70280F2492j3527c16701B48808f9314l1703g827k6298H6315
$$ y = [300152, -332753, -55947, 116492, 194877, -109997, 242832, 93080, 245664, 148773, -292684, -23728, 197775, -253572, 276988, 25661, -149958, 339100, -103352, -75896, 21058, 324214, 142079, 168786, 48108, -97078, 186809, 269519, -44344, -59018, -137295, 42475, -186778, 65333, -90045, 97724, 236890, 119127, -95053, 488374, 102925, -70009, 8405, 79124, 250340, 30749, 111516, -93353, 45788, 32116, 166720, -1074, 171331, 71099, 368242, 123977, 161630, -3628, 116703, -44762, 205479, 241344, 379849, 129206, 23725, -26572, -47128, 155836, 171296, -250888, -381749, 107517, 57830, 28256, -87471, 152989, 43597, 246472, -136000, 387419, 278932, -370280, 62492, 48965, -316701, 248808, -69314, -101017, -7827, -34125, 86315]
12454I5774a5134C72367r8010j02054g5477o3440A53781e1479B22813k2458a65189
12442A02224f7370B49381A01644a11593A67945G6389a06914k7748K0294k19154
12432c33522O2863A33267c2117j31210p4311O0574O6162A14878a86733D95577
12421A05441d6209J7222p4416k99645a19900A70118h4193B07997b87032g7219
12410a73405L6796c6443a4008C49868L9759a1728I5927J78265b40816B37076k9604
12399B07472k3093C6350a56352B12822c8570r9883D4752j1652a74982D13809C5080
12387d9868E9627b04617k4243M8964c3277q0057m8619G2243J62313G2397a3695
12375i5026o7666G655L69070a60757a2747E8396B1788a10953K8592l78354A3662
$$ y = [95774, -15134, 372367, 274357, 172303, -75477, -138917, 153781, -51479, 222813, 200355, -165189, 102224, -67370, 249381, 101644, -111593, 167945, 76389, -106914, -134662, -114368, -333522, -270659, 133267, -32117, -163327, -237638, -177064, -110902, 114878, -186733, 495577, 105441, -46209, -28987, -103403, -403048, -119900, 170118, -84193, 207997, -287032, -77219, -173405, -136609, -36443, -14008, 349868, 389627, -11728, 95927, 274192, -240816, 237076, 207472, 184379, 36350, -156352, 212822, -38570, -138453, 44752, 33100, -174982, 413809, 35080, -49868, 59627, -204617, -228860, -179896, -33277, -113334, -161953, 72243, 234556, 72397, -13695, -95026, -162692, 7655, 376725, -160757, -12747, 58396, 21788, -110953, -82361, -460715, 13662]
12363g4644o2271a9110p3125A69142j3839c5310I4525Q5442h0784A41165M9690
12352A90855b23999A97819e7116q2750m2161C42304g7928o8706C74550e5839r2070
12341a47909B38782d861j23340n9040A5339b77357F9005A8524J71166H072e8612
12329a10909A80296a54338B21095l4995L2631g6970c2930A44602d5021a4043L41
12318a3702j20894C4504J3588O9385a54384O4002B20986P5906E4350K0371J6831
12307I1552K0132m8376a58163A77916a90561j89157J25950r7253e8612H6082b69159
12295a38971c8577k52387A17075b43866H2426K52399F2088b28765A9647a88033
12284A13789J76558a84896h2585M051j9990A41541a7627A56016i675H2762b31178
$$ y = [-74644, -136915, -19110, -92235, 169142, 155303, -35310, 94525, 179967, -80784, 141165, 190855, -223999, 197819, -57116, -139866, -182027, 342304, -77928, -146634, 374550, -55839, -147909, 238782, -4861, -128201, -187241, 15339, -277357, 69005, 18524, 189690, 8072, -58612, -110909, 180296, -154338, 221095, 186100, 218731, -76970, -32930, 144602, -45021, -14043, -13702, -134596, 34504, 48092, 117477, -154384, -90382, 220986, 296892, 54350, 74721, 91552, 111684, 63308, -158163, 177916, -190561, -379718, -253768, -351021, -58612, 86082, -269159, -138971, -38577, -290964, 117075, -243866, 82426, 334825, 62088, -228765, 19647, -188033, 113789, 290347, -184896, -82585, -78534, -98524, 141541, -17627, 156016, -9675, 82762, -231178]
12272e7342A20280K53836A57492B1001J56100j6024f9483A66598b538j7647C04470
12260E3684M1450a95282G2826J23867p3724h6090A52626a76890N2709A55926p3384
12249H2542J9444a72639j95009h6772A82276b70673B65791k0481A19642c37974
12238a27312D8691K23857j08871h4859A9176J40712B5570a76464D621K54689a6313
12226i7219J4419A61135b2890j65100A41191g1300k96792a62742O1947D61103
12215A0640P9150Q0141D291K90887A43989L1949E8586K78024A6443L52394P9692
12204D48529E5766K04851a40358A16838b01950L179A06620Q3418j1714J54587
12194C32911a01979j23858A07363a05261B91895r4079J53847l0514Q3308j96282
$$ y = [-57342, 120280, 374116, 157492, 21001, 177101, 161077, -69483, 166598, -2538, -20185, 304470, 53684, 95134, -195282, 72826, 196693, 122969, -86090, 152626, -176890, -124181, 155926, 82542, 101986, -172639, -367648, -86772, 182276, -270673, 265791, 245310, 119642, -337974, -127312, 48691, 272548, 163677, -84859, 19176, 159888, 25570, -176464, 4621, 259310, -16313, -97219, -82800, 161135, -22890, -187990, 141191, -71300, -368092, -162742, -100795, 461103, 10640, 89790, 169931, 4291, 295178, 143989, 175938, 58586, 336610, 16443, 368837, 448529, 55766, 260617, -140358, 116838, -201950, -198771, 106620, 190038, 178324, 332911, -101979, -225837, 107363, -105261, 291895, 197816, 351663, 321149, 404457, 208175]
12184B08175J4549j0250J95299p1019a910D8680M07310H8443f491k8146q6631
12173a21268A26577Q3075Q6344G2706a5002o0489L6390B32670a4614B80575b7168
12161E4944K37715A15069K94159m1243g1152B02556k2943B801K35581P2730j52590
12150A58522e3901G8720J31107H9365M3685R1105a20122A41576L9143H0491c6839
12138a48402D5146J45480R0094j06539a67890D42337c8711B15460D613J38100
12128A42713C6044G959J57415P9095c3842B49617j18090P0258J27758A22617N460
12117A28077a32997H4257a73326C07798b32106A25511J37090g4173b8705A36319
12106B4945K46425j23464b34749I6647k4638k2332J81895a74229h5517B76712
$$ y = [208175, 222724, 212474, 407773, 336754, -1910, 48680, 455990, 88443, -6491, -34637, -121268, 126577, 209652, 295996, 72706, -15002, -75491, -39101, 232670, -14614, 280575, -27168, 54944, 292659, 115069, 409228, 367985, -71152, 202556, 179613, 2801, 238382, 311112, 158522, -53901, 78720, 209827, 89365, 133050, 224155, -120122, 141576, 180719, 80491, -36839, -148402, 45146, 190626, 280720, 174181, -167890, 442337, -38711, 215460, 4613, 142713, 36044, 7959, 165374, 244469, -33842, 249617, 131527, 201785, 329543, 122617, 128077, -132997, 84257, -173326, 307798, -232106, 125511, 262601, -74173, -28705, 136319, 24945, 271370, 147906, -234749, 96647, 72009, 49677, 231572, -174229, -85517, 276712]
12095D9069P0207k7645a44957a0873A74801A9311K3892j7007J37133b4772C08041
12083a26009f1148m0475C9895a13172a4546A56303h0641A80352O5938A6900h6359
12071D1362b8871q3198j4100c6431F6413f4235G2773a94836j71831C1740h471
12059b65502J02861f0286B98722h9048L4754a8074j8025j88272c9558o9543k92732
12048d01833A62940F9760F587a8311G0472a05171l03282F7930K27925l2583M74129
12037G37401k34945A65496q029o0993h4904A65769Q223a36074B07032F5242a71839
12025h081j35186A12471b17801r1136F4151J70715b32757J0468N5539B31036a05627
12013d712j27262E6535a34982I2292M50480a56584j11843q353f5658o0053c9337
$$ y = [49069, 119276, 91631, -144957, -10873, 174801, 19311, 43203, 26196, 163329, -24772, 308041, -126009, -61148, -101623, 39895, -113172, -14546, 156303, -80641, 180352, 246290, 16900, -86359, 41362, -28871, -112069, -126169, -36431, 66413, -64235, 72773, -194836, -366667, 31740, -8471, -265502, -162641, -60286, 298722, -89048, -54294, -18074, -36099, -224371, -39558, -109101, -401833, 162940, 69760, 6587, -18311, 70472, -105171, -408453, 67930, 295855, 263272, 737401, 502456, 165496, 157467, 96474, -84904, 165769, 173992, -136074, 207032, 65242, -171839, -8081, -143267, 112471, -217801, -308937, 64151, 234866, -232757, -222289, -166750, 231036, -105627, -4712, -131974, 56535, -134982, 92292, 542772, -156584, -268427, -276780, -65658, -125711, -39337]
12001a96569F1122N8027a69851d7509a7436A50183i175m7044G9624l3378b03230
11989a54402j68251B9872c264k91484E8632A1998M0149d9105B6273J00695J26669
11978B53637d44123K02088B46486i1177j48095a1391C44886C5134R2571a09876
11967D9204R3288J46977d9505j24741c3739p80F0608k2684N7379a68389I7179
11955a12757j67744o2937J53887a0287j2828E9913J19072l9780E5142h8195A38819
11943i8699l0407B45544a17757A63790N9341b9457N636A37467c85543D3966R0380
11932A34346c06143A11874c11323G9104c59759B4775J76744f6356B87201j42598
11922A44603c13977F5875a62830A29306D7828K4700a37933D2255a31647K4439
$$ y = [-196569, 61122, 119149, -169851, -47509, -17436, 150183, -9175, -56219, 79624, 46246, -203230, -154402, -322653, 29872, -3264, -294748, 58632, 11998, 52147, -49105, 26273, 126968, 253637, -444123, -242035, 246486, -91177, -239272, -11391, 344886, 35134, 127705, -109876, 49204, 142492, 289469, -49505, -174246, -33739, -34519, 60608, 37924, 95303, -168389, 97179, -112757, -280501, -343438, -189551, -10287, -23115, 59913, 178985, 139205, 55142, -88195, 138819, -98699, -129106, 245544, -117757, 163790, 223131, -29457, -23821, 137467, -385543, 43966, 134346, -306143, 111874, -311323, 79104, -359759, 24775, 201519, -66356, 287201, 144603, -313977, 65875, -162830, 129306, 47828, 72528, -137933, 42255, -131647, -107208]
11912a07208L7943A8034J06257e5546k23295C4107c94849C589K03898e5297b2434
11900d5058B83722e2467r4152B24723j06759b97941P2603Q1695A09204l5885K5041
11889I8360h9376L6193B07590j01686k3184A8648O6987d79416c7001A31664a45102
11877b14145A40673k3933p416j905i5412M3012C30107E5076e8537G8962a45091
11865c6094j31765f6511G6255j4472J31651a3537m3771A28934a37141j36613B4034
11853C31732a14375k7840G9191K83028A0131b22840g345B48191g7554j32444I6016
11841A2408h1936o3074A9992c45185a10224k29407B48716m7939r8995j693a72841
11829a8413A86937a91711I1565b1580F0749a48552P1683j50495A36922h9617l74933
$$ y = [-107208, -69265, 18034, 124291, -55546, -278841, 34107, -394849, 3589, 207487, -55297, -22434, -45058, 283722, -52467, -146619, 224723, 117964, -297941, -225338, -143643, 109204, 73319, 98360, -89376, -53183, 207590, 105904, 82720, 18648, 85635, -479416, -37001, 131664, -145102, -214145, 140673, 116740, 109324, 107419, -95412, -52400, 330107, 55076, -58537, 78962, -145091, -36094, -167859, -66511, 76255, 61783, 193434, -13537, -57308, 128934, -137141, -273754, 24034, 331732, -114375, -142215, 79191, 362219, 10131, -222840, -7345, 248191, -77554, -209998, 96016, 12408, -81936, -145010, 19992, -345185, -110224, -339631, 248716, 200777, 101782, 100089, -172841, -18413, 186937, -191711, 91565, -21580, 60749, -148552, -76869, -227364, 136922, -89617, -464550]
11818d64550J71459c6956A97575A9204g2180I5431b83327J21955j2346r7015h1116
11806c6984C33551b39792A67679f4570B13874a03906j65596M9286A01865l624
11796I8241g8334a8940j03631F2029Q7909e1649j26305B58641B6267K3109L0008
11785G9384K66212B4396P5402e3123l6347m5316B65337f8571G1683O5821l8045
11774I9459b12342I7375J35947a85490e482A81001a12252A98065f8667I0492b4947
11762g7269b4581H9978J31331q5161e24435A12175b23359P9352O267n6082j26443
11751c20265C9005b0997k84205A63090r657b51596h4669G1927A3997J16897b07663
11739G0769n447g7515B08703b34202A81690d18731C0426J46282c31805e7906l88772
$$ y = [-464550, -293091, -36956, 197575, 19204, -72180, 95431, -283327, -161372, -173718, -270733, -81116, -36984, 333551, -239792, 167679, -64570, 213874, -103906, -269502, -220216, 101865, 98241, -78334, -18940, -122571, 62029, 149938, -51649, -177954, 258641, 26267, 49376, 79384, 345596, 24396, 99798, -53123, -89470, -134786, 265337, -68571, 71683, 137504, 99459, -212342, 97375, 233322, -185490, -5482, 181001, -112252, 198065, -68667, 90492, -24947, -77269, -24581, 89978, 221309, 136148, -524435, 112175, -223359, -144007, -137740, -193822, -320265, 39005, -20997, -305202, 163090, 153433, -251596, -84669, 71927, 13997, 130894, -207663, 70769, 65322, -77515, 208703, -234202, 181690, -418731, 30426, 176708, -331805, -57906, -446678]
11728d46678K22777Q122g1455A36058c4660A09368g7148A40369N4721b39654d0817
11716a91687g0468J3327o9978H1042g3691D7064K61755b68511F0445c5737j3482
11705d9219j04825e4326A22398J00378e9608A40086B2681g349C787c0011O011
11694b4000j94845C202a59150K0567f8494j8338q275k3789M4630B22193m158N2658
11682B70693B8202c53481J07401A8444N5285c318m8244D720O7437l0789e16942
11670b5311r4146B43040a09624H3403M2678a40381m9984C1553N5147J1351J13007
11659B11058d7817O478j90609Q2159d3960j50019M2388j41847Q2320d2990I0590
11647b685k57964a9615m05567A80636A3914c75108d0602A72142a06722j25088
$$ y = [-446678, -223901, -215779, -71455, 136058, -34660, 109368, -77148, 140369, 195090, -239654, -40817, -191687, -70468, -57141, -127119, 81042, -73691, 47064, 308819, -268511, 60445, -35737, -49219, -154044, -54326, 122398, 222776, -59608, 140086, 22681, -7349, 3787, -30011, -24000, -218845, 3202, -159150, -138583, -68494, -86832, -95107, -118896, -74266, 222193, 218035, 270693, 28202, -353481, -246080, 18444, 73729, -3318, -51562, 4720, 72157, 41368, -516942, -25311, -119457, 243040, -109624, 83403, 126081, -140381, -190365, 31553, 86700, 98051, 211058, -47817, -41339, -231948, -149789, -43960, -193979, -151591, -293438, -211118, -42990, 90590, -2685, -260649, -19615, -425182, 180636, 13914, -375108, -40602, 172142, -106722, -231810]
11637b31810F4496f3187A73998b92343O3815A29673a47767q2175J13294j29150
11627b45798f5975B72846a20321k9776j5317B2663L84668e21129a00871A8508
11616a62003D6337J43984C981K60700m1870k0847a17605A40920b12720A03982
11605D27897b46861r3953C0432f2345B55919a88121J8960j8735B56665A611J11421
11594A13032a65979B09489M9165j236A16228c40524C2193K7483J44320E0366K2357
11583G2723a53579A49636a78706j08208O7564N1166q8184C1387O69d6306D6507
11571I9842l2109i2630K7846C18615c63846I6801h8444A94083a67893A53611L99854
11560E53465e9794l7875p3892l4305G0050b4629k2008E0112a64895p8444f7711
$$ y = [-231810, 64496, -63187, 173998, -292343, -228528, 129673, -147767, -229942, -116648, -245798, -65975, 272846, -120321, -150097, -165414, 22663, 407331, -521129, -100871, 18508, -162003, 46337, 190321, 3981, 264681, 222811, 201964, -117605, 140920, -212720, 103982, 427897, -246861, -340814, 30432, -62345, 255919, -188121, -169161, -187896, 256665, 1611, 113032, -165979, 209489, 258654, 257418, 116228, -340524, 32193, 59676, 203996, 50366, 72723, -153579, 149636, -178706, -286914, -219350, -168184, -256368, 31387, 32056, -46306, 46507, 99842, 67733, -92630, -64784, 318615, -363846, 96801, -88444, 194083, -167893, 153611, 553465, -59794, -97669, -171561, -205866, 70050, -24629, -46637, 50112, -164895, -243339, -67711]
11548g8164b8889A71558B9882R6748a35321A06363b32176E3086c32571g2707j33959
11537b06666A85561B820N8224J16647b6310L561B3075b79577B68424b07858B15404
11525i3898A21360m9277e2101B05072A323a78562I0611J62617H4824N4054A9848
11513A68101n6668d9795A75058p1261b36862G5889O3738J410i0532j73076A4751
11501g1882p0149F4172J14061e5603D0543d1796k38698F0382K83087G6881a58544
11489B03232c8160A83419e047n0110C76721M600A13057k85b23979B0838K6006
11478D6844a30643e1692a9075A86678a14697C25532M1698a84940Q4219j55391
11468b56112H2895j8486b34832e7596G8732J36394l220j002j04869D2247L21133
$$ y = [-78164, -28889, 171558, 29882, 126630, -135321, 106363, -232176, 53086, -332571, -72707, -206666, 185561, 2820, 61044, 177691, -26310, -22749, 23075, -279577, 268424, -207858, 215404, -93898, 121360, 72083, -52101, 205072, 1323, -178562, 90611, 253228, 84824, 138878, 19848, 168101, 111433, -49795, 175058, 103797, -236862, 75889, 139627, 141037, -90532, -263608, 14751, -71882, -142031, 64172, 178233, -55603, 40543, -41796, -280494, 60382, 343469, 76881, -158544, 203232, -38160, 183419, -5047, -55157, 376721, 381321, 113057, 112772, -223979, 20838, 46844, -130643, -51692, -19075, 186678, -114697, 325532, 367230, -184940, -100721, -256112, 82895, 64409, -234832, -57596, 78732, 215126, 211906, 210904, 106035, 42247, 363380]
11457C63380G6703G701i5936A75785L27269A37451J09185r5298a38433e9219D0055
11445H7783K2694J72876j41610J24595L3398f8576E5891O9511j4588d9650C3469
11433A33522i8723B6660a09964A37700E1742e28A10282a78505g1997B85921a5964
11421C21584A55811c75329A06756a42232j08015A79231b90868C2665h1479o7187
11411a48666k19777i6340A24750A2137a73301C20146A10040h6307M3141A00557
11400C02173b55530D9265b6094A15002R4818n9606L52088a4361A7766L22714a17975
11388B46627p5182G0630c7461j4638A3752a34313d556B31513p8137m3790k3270
11377H6316C4490e13851f5916q8700C861g3237k1455o680j70719P6289N912A36865
$$ y = [363380, 76703, 7701, -95936, 175785, 503054, 137451, 246636, 151338, -138433, -59219, 40055, 87783, 110477, 283353, 141743, 266338, 299736, -68576, 55891, 125402, 110814, -49650, 33469, 133522, -98723, 26660, -109964, 137700, 51742, -528, 110282, -178505, -71997, 285921, -15964, 321584, 155811, -375329, 106756, -142232, -250247, 179231, -290868, 32665, -81479, -148666, -368443, -96340, 124750, 12137, -173301, 320146, 110040, -86307, -43166, 100557, 302173, -255530, 49265, -26094, 115002, 209820, 150214, 502302, -14361, 17766, 340480, -117975, 246627, 171445, 70630, -37461, -52099, 13752, -134313, -4556, 231513, 153376, 109586, 86316, 34490, -513851, -65916, -154616, 3861, -73237, -94692, -101372, -272091, -195802, -189890, 136865]
11364D25256F7013c8090A36371g5853B0444J6330a76354A86265f3303D49041E0865
11352I8091J3778b3218C9150M6906e5673N947e112C26035j20711E5037J81056
11341B36093a40530O0678c7825E5466c2179J2387A046b5066j62206K8600C7521
11329a30927I4924a11647C5214P1192b23273C23185C0176f2655b9351B72111j22731
11318A49380b64362A43857C345c31934D10303b44110i4068j99287B2047a50118
11307g2408r1825f4888k9782a5227r906F4283a06132C23894b18467B62967i8366
11295i2724j0371K1917C6235J02477d9212j72739j80550a18105L5924j67711A12988
11283b21678D8641J24910B6374b0352l89088A41775a77971K500m2990A21043J62561
$$ y = [425256, 67013, -38090, 136371, -75853, 20444, 36774, -176354, 186265, -63303, 449041, 50865, 98091, 111869, -23218, 39150, 86056, -55673, -49726, -5112, 326035, 205324, 55037, 236093, -140530, -79852, -37825, 55466, -32179, -19792, 1046, -25066, -187272, -158672, 37521, -130927, 94924, -111647, 35214, 106406, -223273, 323185, 30176, -62655, -29351, 272111, 149380, -264362, 143857, 3345, -331934, 410303, -244110, -94068, -293355, 22047, -150118, -72408, -164233, -64888, -94670, -15227, -25133, 64283, -106132, 323894, -218467, 262967, -98366, -92724, -103095, -81178, 36235, 138712, -49212, -221951, -402501, -118105, -82181, -249892, 112988, -221678, 48641, 173551, 26374, -20352, -409440, 141775, -177971, -175471, -218461, 121043, 283604]
11272B83604g6870j92295a34060l67156A9015i0788B0118K32594a86179H3265
11261b09571A3782b523k44918M9500g0877I0353d5950A22149c96322B6577P5419
11250A01996g390k4298A5531f7330A6886J7234a31031F3311R4079D5459a85306
11238b05046c1797E8893f6094p3473o082E7010b69153a8708A98675J65205l6405
11227C27475e7j9591A833J17996b1267m5093a2590B06268C6656c57057C86967
11215h2648Q581k49636J52590l240G5428d02958C0863K2088J33924d06676A5593
11203a33340A45594a02221C17874p7312c51380a12807k3294J2632M9148L5260
11193c9061j33373c6279C56842I6534f0711A36684O5897d7430j70237C0622K69685
$$ y = [283604, -76870, -269165, -134060, -501216, 19015, -90788, 20118, 252712, -186179, 83265, -209571, 13782, -2523, -247441, -197941, -70877, 90353, -45950, 122149, -396322, 26577, 101996, -7390, -31688, 15531, -67330, 16886, 34120, -131031, 63311, 157390, 45459, -185306, -205046, -31797, 58893, -66094, -139567, -145649, 57010, -269153, -18708, 198675, 363880, 327475, -57, -19648, 1833, 119829, -21267, -66360, -12590, 206268, 36656, -357057, 386967, -82648, -74067, -323703, -171113, -174353, 75428, -402958, 30863, 52951, 186875, -406676, 15593, -133340, 145594, -102221, 317874, 240562, -351380, -112807, -136101, -123469, -74321, -39061, -172434, -36279, 356842, 96534, -60711, 136684, 202581, -47430, -217667, 30622, 300307]
11182C00307c91387b4790j78421B1908b84567F1638a09937B8243c2009A64901
11171B4264P4794b6121j1358i803q7048j06848G7612c4520j16881C3352c5770
11159b23871P5207B21330a36445n4409J6300E0046L74834b34941b1720j47327
11149a69047A93463o9328a19264j82945a47496D5957h2923A41447N6295n9249
11139A38493b99j92542O5984H2590i4398J983B27672p0023a135H7902K7421c4871
11126a61079g172j57084Q0675C37073f4170l41661M6150c3192A2770C92J42080
11115A42472E1690b34135a125j20626n0122K84P3245g317k25983A13621P3652
11104A87273l8437a53164A46886c5772l15167B1375L8388Q9964b951D68846j29270
$$ y = [300307, -391387, -24790, -203211, 21908, -284567, 61638, -109937, 28243, -32009, 164901, 24264, 99058, -26121, -37479, -9803, -96851, -203699, 77612, -34520, -151401, 33352, -35770, -223871, -148664, 221330, -136445, -190854, -174554, 50046, 424880, -234941, -21720, -169047, 193463, 124135, -119264, -302209, -147496, 45957, -82923, 141447, 197742, 138493, -299, -192841, -126857, 82590, -94398, -92415, 227672, 157649, -1135, 87902, 115323, -34871, -161079, -7172, -164256, -83581, 337073, -64170, -405831, -359681, -33192, 12770, 392, 142472, 51690, -234135, -1125, -121751, -171873, -171589, -98344, -7317, -233300, 113621, 187273, 148836, -153164, 146886, -35772, -350939, 21375, 59763, 149727, -2951, 468846, 339576]
11093C39576j52286J98443A60416J8972c1036o1605D0953K22919a4173F6296b99
11081F25624c7264F2098J61592K9921G5203J45353b5892C51409d147o4908I6581
11069I9024J11460L4578j8898e1000B52007J87761A87831L51985k9360k49978
11059B60478j00581J6157J06604N3729L9999o5349j16821J84615j63862P979M23540
11048F46488C09169j31339L43545j43103K0968R2113j53071j20481K44981Q3654
11038E46436j51190J30203j7936K97553j68362J38362N1146o3695l0646M97324
11028A229195n06893j90086L326J81297k37170K30305j64373K90743O0779l13525
11018E83598j43642R3229L54206r2918l03854K51167m7431J13643J80837D34418
$$ y = [339576, 187290, 385733, 160416, 179388, -31036, -92641, 40953, 263872, -14173, 66296, -299, 625624, -37264, 62098, 223690, 253611, 75203, 220556, -25892, 351409, -4147, -69055, 96581, 99024, 210484, 245062, 226164, -51000, 252007, 439768, 187831, 539816, 510456, 260478, 159897, 176054, 282658, 336387, 376386, 311037, 194216, 378831, 214969, 222948, 646488, 309169, 177830, 521375, 378272, 399240, 491353, 338282, 217801, 462782, 546436, 395246, 525449, 507513, 805066, 636704, 775066, 826212, 762517, 731871, 1229195, 722302, 532216, 535542, 716839, 479669, 709974, 545601, 836344, 897123, 583598, 439956, 533185, 887391, 794473, 490619, 741786, 694355, 807998, 988835, 434418]
11007E07922L4731k6951r7846r3865R6256L53929j01786m7255J14641j68879j38297
10996D32600N03460C60099J81221m4248k17062M15858k65727L13669k64711Q4822
10986E63921Q4453j24213L8899J36412J48464j7188l14725J35607K60314n5978
10976H55966k22031l11269K75742K40600L3479K3007q9542K88186J2750j31791
10966I75097J41946Q385k95836Q12949k78880N25122J76429L1926N38911k0384
10956B615665j13166K68197o50099M44900m72987j9742o95729O1638j32073O7934
10946A374538m0474F49590J90897k50484L60818m13050m6319R716L7311O0450
10936E98929A63475O2768d025G3858M1489j5744J04009A01725K21857a06677C20364
$$ y = [507922, 542653, 515702, 417856, 323991, 420247, 774176, 672390, 625135, 739776, 570897, 432600, 936060, 360099, 541320, 497072, 280010, 695868, 430141, 743810, 479099, 563921, 648374, 524161, 563060, 699472, 847936, 830748, 516023, 651630, 911944, 855966, 633935, 322666, 598408, 839008, 872487, 895494, 805952, 1094138, 1106888, 975097, 1117043, 1125428, 829592, 1642541, 1363661, 1888783, 2065212, 2097138, 2636049, 2615665, 2502499, 2770696, 2120597, 2565497, 2092510, 2072768, 1377039, 1438677, 1306604, 1374538, 1334064, 649590, 840487, 590003, 950821, 537771, 491452, 501168, 538479, 598929, 163475, 226243, -4025, 73858, 115347, 99603, 203612, 101725, 323582, -106677, 320364]
10924a95418A86668F8933K41203A40564B046K07817b69400c0301A36279c44166
10913e8852E7455a20156A40828j4420D5317c4814n2798C0438L9131g4119C47829
10901a00567B9296K34956A7886m297a13612o0726E7851B2265h8967h408j61395
10890a69803N3393F8189J27691f2307F6935a63300B7846N0039a43250b4437F9245
10878a0605A26971K56336A11782L32407C4660g0498k30230e3460b1216k57431
10868b78647E1722K02343d5408G0906c93283J08257g9378l13545A89123m1747
10858A47376J3796p0243d651m3932P837D5989k2860i0377D2387R1593D795J20390
10846A25185B9464a62253A83256b06704c1918k01952E6312a0184C71166b06935
$$ y = [-195418, 186668, 68933, 310136, 140564, 2046, 209863, -269400, -30301, 136279, -344166, -58852, 57455, -120156, 140828, 126408, 45317, -34814, -87612, 30438, 69569, -74119, 347829, -100567, 29296, 264252, 17886, 13589, -113612, -174338, 57851, 22265, -88967, -8408, -169803, -116410, 68189, 195880, -62307, 66935, -163300, 27846, 77885, -143250, -24437, 69245, -10605, 126971, 383307, 111782, 444189, 34660, -70498, -300728, -53460, -21216, -278647, 51722, 254065, -45408, 70906, -393283, -285026, -79378, -392923, 189123, 147376, 161172, 90929, -4651, -48583, -40746, 45989, 23129, -90377, 42387, 133980, 4795, 125185, 29464, -162253, 183256, -206704, -31918, -233870, 56312, -10184, 371166, -206935]
10835g3538K2572l09884A01760J42285K597l0209a20610H8786J01930a38440O6604
10824g1836j3762D2409A1483K8659b1849G4154j6141i1371K8982H308J67651B7420
10811f5512l04604k3469D8350c6461A87653A798P8519c36110d7646l98107C03849
10799g7266F8429J69466E928b23825K7373A13633C8547B265a20733I1508L812
10788I5320a18628J9929A0686b75486e9025l12242D1420a17961A4448b99192R0307
10777b08885A70061b830j00992j47290F2140b55300D1190K10031a7833j38323
10767a56156j78714J17874a05323D5936K2715K44269a8435j16622N4818j78207
10757b58446q4791i4632B2954J76822a33652e9079D6753B771i0821B0990e3454
$$ y = [-73538, -50966, -360850, 101760, 244045, 246642, 216433, -120610, 88786, 190716, -138440, -71836, -85598, 42409, 11483, 40142, -21849, 74154, 58013, -91371, -62389, 8308, 175959, 27420, -65512, -370116, -393585, 48350, -36461, 187653, 1798, 80317, -336110, -47646, -445753, 303849, -77266, 68429, 237895, 5928, -223825, -196452, 113633, 38547, 2265, -120733, 91508, 95320, -118628, -98699, 10686, -275486, -59025, -371267, 41420, -117961, 14448, -299192, -208885, 170061, -2830, -103822, -251112, 62140, -255300, 41190, 251221, -17833, -156156, -334870, -216996, -105323, 45936, 68651, 312920, -18435, -135057, -80239, -258446, -343237, -94632, 22954, 199776, -133652, -59079, 46753, 2771, -90821, 20990, -53454]
10745B1439a2482j57157j20870B38390a0174H2442f5686K7077j71024g1453r892
10734h1345A16996b35697J6120A09857j2388a77270B20591F4367a03398G0592
10723A61591f873k23055g580j74630B75572j30077e8925l89665e8244j64641N3518
10712a69367D8950d9926p9726H7748d3367j2777A15769e89169i3561c1025l66211
10701c97236F1770L9355f9640c1038A2362O748f1707j0878A05549b79345a00891
10689a91542R0165E3281h6113I1650b34238K7094J9109O6738E6074M3196J35314
10678B34584b03536h1544J3167A32805B1436a8070E8328d55530A00728a59608
10667a47128e0078D6124J72538g2252F6567h9069p0151j01552c910k10343d2417
$$ y = [21439, -12482, -169639, -290509, 238390, -10174, 82442, -65686, -38609, -209633, -71453, -81345, 116996, -235697, -219577, 109857, 97469, -177270, 220591, 64367, -103398, 70592, 161591, -6873, -229928, -7580, -182210, 275572, 145495, -58925, -448590, -58244, -222885, -169367, 48950, -49926, -129652, 87748, -43367, -56144, 115769, -589169, -93561, -31025, -397236, 61770, 101125, -69640, -31038, 12362, 19110, -61707, -72585, 105549, -279345, -100891, -191542, -101377, 53281, -86113, 91650, -234238, -207144, -188035, -121297, 56074, 99270, 234584, -203536, -81544, -68377, 132805, 21436, -18070, 58328, -455530, 100728, -159608, -147128, -50078, 46124, 218662, -72252, 66567, -89069, -159220, -260772, -3910, -214253, -42417]
10655a20524P955A62584J2855a27314o5736A4979a34351o5000A41182a08304C75419
10643a31054B6573c1112j56190A27848a10232N2489l08476R0824C2418i0709H8754
10631D15367A25787k3580J16987a51908D9623b38979j0789A29168E4561K76066
10621C30627b65525a786A41261b4652j7590m1214L3355B38809c62396H5952d2068
10609A07332f0638B58388e1794A34680o4814h3968B6566c00105c759B8174L7911
10598F6085c87539H6540c81673J61512R0953L1108D6806a51113C40847H8024J25876
10587B13900D9483N1860A125a43432A92398E7072i2349b9818p8412k5534F0868
10575a16521m0457N3447H2422F371K64371c36389A18635a80211a1807A5672a84693
$$ y = [-120524, -112569, 162584, 175439, -127314, -193050, 14979, -134351, -199351, 141182, -108304, 375419, -131054, 26573, -31112, -187302, 127848, -110232, -57743, -366219, -275395, 32418, -90709, 88754, 415367, 125787, 102207, 219194, -151908, 49623, -238979, -249768, 129168, 54561, 330627, -265525, -1786, 141261, -24652, -42242, -83456, -50101, 238809, -362396, 85952, -42068, 107332, -60638, 258388, -51794, 134680, 69866, -83968, 26566, -300105, -3759, 28174, 66085, -387539, 86540, -381673, -220161, -129208, -98100, 46806, -151113, 340847, 88024, 213900, 49483, 101343, 1125, -143432, 192398, 57072, -92349, -29818, -108230, -133764, 60868, -116521, -156978, -103531, 82422, 6371, 270742, -336389, 118635, -180211, -11807, 15672, -184693]
10563i6115A11720a70254p3026b6194A36550h1103l2886o6559A46774O4326B5516
10551A79969a98197L0330k80866F8956J00509F6615a61439A0681d145A631L6644
10540C8275L885K35545K3246b18458G3905a13045A91634J6369a57021A8195h0975
10528B80797a04049E1878b25216b8754l61191a43144a3776G9918l5413K9986J98503
10517B72994d04616E8995a04547d3588F304a13190A31774E517K48579a52998C54835
10505b25983d2044k75145E077d6882B0203n949J42782C1387A600J58645A3351
10493A4046F901b7588B70578j21074a17862j11772g1312j71786D536d2808J9689
10482b3119B44360b96861a01043m0212K5233A61140a23917A89831A2144P3396
$$ y = [-96115, 111720, -170254, -243280, -26194, 136550, -81103, -113989, -180548, 146774, 211100, 25516, 179969, -198197, -167867, -448733, 68956, 169465, 66615, -161439, 10681, -4145, 1631, 38275, 42160, 277705, 300951, -218458, 73905, -113045, 191634, 208003, -157021, 18195, -80975, 280797, -104049, 51878, -225216, -28754, -389945, -143144, -13776, 79918, 44505, 74491, 272994, -404616, 58995, -104547, -43588, 6304, -113190, 131774, 5517, 254096, -152998, 354835, -225983, -42044, -317189, 5077, -46882, 20203, 14254, 157036, 31387, 1600, 160245, 13351, 14046, 6901, -27588, 270578, 149504, -117862, -229634, -71312, -243098, 4536, -42808, -23119, 244360, -296861, -101043, -141255, -116022, 161140, -123917, 189831, 12144, 85540]
10472H5540b01736B12480C6108j6528a1345G7534B9522a6004e152k7427k88251
10461c20830i3634D042f056A02650J13955c91298A23732a13516J3157k07237J12640
10450a94956i417C2122c15413A73778a76694J8179q6979i501j65507A86265E0515
10438a63573j72299j6967b8421j4735C72172q3054a97766E9968K09452a20204
10427D2774a81693e00r1863b6351j97593A04255l7802d7575k70629b4234k28005
10416b52239F9882b1825m29040c2217l74786a08155I1180a08252G2341j97e5864
10404A9218a5975A03964k4271g3683B08437i1403l9160I9199f8039A2021J00219
10393A12240O9941A1132N03691D3043Q3475a38104b6910B67779G8582B1334b61688
$$ y = [85540, -201736, 212480, 36108, 19580, -11345, 77534, 29522, -16004, -5152, -32579, -320830, -93634, 4042, -6056, 102650, 216605, -391298, 123732, -113516, -100359, -307596, -194956, -9417, 32122, -315413, 173778, -176694, -158515, -245494, -9501, -175008, 186265, 50515, -163573, -335872, -352839, -28421, -43156, 372172, 289118, -197766, 59968, 269420, -120204, 42774, -181693, -500, -92363, -26351, -223944, 104255, 66453, -47575, -318204, -24234, -252239, 69882, -21825, -450865, -32217, -407003, -108155, 91180, -108252, 72341, 72144, -55864, 19218, -15975, 103964, 79693, -73683, 208437, -91403, -130563, 99199, -68039, 12021, 112240, 182181, 11132, 514823, 43043, 126518, -138104, -26910, 267779, 78582, 21334, -261688]
10381c4144j36300A8231Q8265K25739a2710k2367j73821H7938Q928C1962d6797
10369A74232C5311K8272a2997B39745m9640i9875B89726j6858A3121L39597H3687
10357C54267p479J0286A15948D3902K43207O3600Q4745m2724l7990O6355C4056
10345i0454A21700e3018C07855L2556L28794H5010K63793m8098J56150q4911J50550
10334E22494D4834c9015r5876A52623K5924E6709O3049J18888D0208N51863B63678
10322A3002K26375c02409a1968D03451A53053J75819K68225B64602b45016J08275
10312a36741l2531C54090D8768J78876m6758o8070L09548j43936p9002o4777A1857
10300c77644A56475m1816k6911a10234j1894L6698F4983a40240f4859C54905D01
$$ y = [-34144, -170444, 18231, 106496, 332235, -12710, -35077, -208898, 87938, 96866, 31962, -46797, 174232, 35311, 63583, -12997, 239745, 190105, -99875, 289726, 272868, 13121, 352718, 83687, 354267, 346788, 357074, 115948, 43902, 287109, 350709, 435454, 392730, 354740, 421095, 34056, -90454, 121700, -53018, 307855, 340411, 669205, 85010, 348803, 300705, 456855, 371944, 522494, 44834, -39015, -134891, 152623, 178547, 56709, 119758, 238646, 40208, 592071, 263678, 13002, 239377, -302409, -11968, 403451, 153053, 328872, 597097, 264602, -245016, -136741, -169272, 354090, 48768, 227644, 180886, 112816, 422364, 278428, 199426, 134649, 11857, -377644, 156475, 114659, 87748, -110234, -122128, -85430, 64983, -140240, -64859, 354905, 401]
10288B90582b2611j99271H1490d21740A03917q460a12668k11998a44250M9450
10278i4800j24297A8735a67256e3405n0471A14004O7615g9671l67376b1499j79523
10267b01022A55997K5008e3697l47216E8511J48076p4447E3156c55106J9280h7243
10255a98186A80136a08690n2077A31375o0552J96559q3163p4241b13960B43301
10244g0109L3879o670k504B41530F7318J15751p2584K9644a2824r0103F5461b77620
10231D0267g0233G6816K7051g9877A98166b99441a5158k8205j690n5030b5851
10219b11164o5897B77297C2091a27211b9464B8190a68898A27075D4344g7278l5929
10208a13207E6541g1052o5988B91563r3293m5431c63353a66345j5118B58093b02712
$$ y = [290582, -22611, -221882, 81490, -421740, 103917, 95457, -112668, -324666, -144250, -94800, -219097, 18735, -167256, -53405, -103876, 114004, 181619, -79671, -447047, -21499, -201022, 155997, 181005, -53697, -400913, 58511, 206587, 132140, 53156, -355106, -335826, -87243, -198186, 180136, -108690, -160767, 131375, 70823, 267382, 184219, 109978, -213960, 243301, -70109, -36230, -42900, -45404, 241530, 67318, 183069, 110485, 140129, -12824, -102927, 65461, -277620, 40267, -70233, 76816, 103867, -79877, 198166, -299441, -15158, -43363, -45053, -100083, -25851, -211164, -277061, 277297, 32091, -127211, -29464, 28190, -168898, 127075, 44344, -77278, -113207, 56541, -71052, -137040, 291563, 198270, 152839, -363353, -166345, -181463, 258093, -202712]
10196f8101A75895J17861r0962c59064A1092a54349M8303q4567B14127b52058
10185f054G8047J18480a89452l4283K4051A20802Q3513b31333b4132D8836J53974
10174B02810o7826o0776a73641l5232B36680b40986R3415E1400b3198A07464E1196
10162C3978a10956A49065b0451j24262j07923d8718k29327R1074h3764m6975A37189
10150A7965b75042B00354G3899b01281j50892D3586n190a25886A75873J2317c3007
10138f1487F6362A831b78396B91113q2317i9582d7595A54881b611B00742b29522
10126g1223j04994M4693c9968j5555j07288F2478i395A00088Q9296F1516b67942
10114A29919a22795l22803A60194d16506h6735m016D2607a85957B91194b54877
$$ y = [-68101, 175895, 293756, 202794, -359064, 11092, -154349, -106046, -190613, 214127, -252058, -6054, 78047, 196527, -189452, -223735, -199684, 120802, 204315, -231333, -24132, 48836, 202810, 134984, 74208, -173641, -208873, 236680, -240986, -147571, 51400, -23198, 107464, 51196, 33978, -110956, 149065, -20451, -144713, -252636, -48718, -278045, -186971, -83764, -130739, 137189, 17965, -275042, 200354, 73899, -201281, -352173, 43586, 38396, -125886, 175873, 188190, -33007, -61487, 66362, 1831, -278396, 291113, 208796, -99582, -47595, 154881, -2611, 200742, -229522, -71223, -176217, -131524, -39968, -55523, -162811, 62478, -9395, 100088, 189384, 61516, -267942, 129919, -122795, -445598, 160194, -416506, -86735, -90751, 42607, -185957, 291194, -254877]
10103A97402d0624j02224A09624B8716A3577J34197a97620e547p4994c6042B26790
10091C014b27618A7438c82491D8679d1976a6813H0167J43450a9758B18196b06037
10079A05116c8850H3053d26644C7967K28605H5603R2945D5583J03001k9610m8519
10068G0455B8064a12597B20132F9541C0370M4151a47231F578a20146C14186b36
10056a02525A03212B2820h8994q7814j5373q2780A71066b7640B5180E282N8072
10045F3354b68286J18640A13840K71750i7927B23247b2115l20332d8704G1671
10034d3639o2690j00591H1576c23011G3786J529A5087d21749A4287J45651A9576
10022c6938j62666A14602c0860l09124G5226b2575j68501R1441F6176a37396j20053
$$ y = [197402, -40624, -142848, 109624, 28716, 13577, 147774, -197620, -5547, -80541, -36042, 226790, 3014, -227618, 17438, -382491, 48679, -41976, -16813, 80167, 223617, -19758, 218196, -206037, 105116, -38850, 83053, -426644, 37967, 266572, 85603, 178548, 45583, 148584, 118974, 70455, 28064, -112597, 220132, 69541, 30370, 74521, -147231, 6578, -120146, 314186, -236, -102525, 103212, 22820, -88994, -176808, -192181, -274961, 171066, -27640, 25180, 5282, 63354, -268286, -149646, 113840, 385590, -97927, 223247, -22115, -342447, -48704, 71671, -43639, -106329, -206920, 81576, -323011, 73786, 75315, 15087, -421749, 14287, 159938, 19576, -36938, -199604, 114602, -30860, -339984, 75226, -22575, -191076, -99635, 66176, -137396, -257449]
10011b57449a7070k27265k3984M1544A0141M6424c47655a29277e226k56738P4170
10000a87794d7338B55298a59858H4335a02498B59074g0936b1802n1085k3308j98831
9989b95026o3824A49005A6979a86131c6085E9904Q888g8520e024E8671a82591
9977h3518C5601R6499a58927A15590a90391l3072C19068b46798c0758p3493j67240
9966b71491Q6784C52422D4941j1247a80945d8298L585j16429C658L3758K18909
9955B56325F4767J89205o250H6670a66184l8445l4760D2929K4431B5084a00898
9943D09188m6989d8201j56478Q0365m6343l5836j0782c1376A61754d7556D5218
9931C8473I261J90906i4369m5757A48637L0230b4917k49478Q2034C0767b65863
$$ y = [-257449, -17070, -244335, -268319, -226775, 10141, 56565, -347655, -129277, -5226, -261964, -187794, -47338, 255298, -159858, 84335, -102498, 259074, -70936, -21802, -72887, -96195, -295026, -358850, 149005, 16979, -186131, -36085, 59904, 68792, -78520, -5024, 58671, -182591, -83518, 35601, 132100, -158927, 115590, -190391, -223463, 319068, -246798, -30758, -104251, -271491, -184707, 352422, 44941, 33694, -180945, -48298, -44713, -161142, 3658, 37416, 256325, 64767, 253972, 247722, 86670, -166184, -204629, -239389, 42929, 67360, 25084, -100898, 409188, 362199, -48201, -204679, -124314, -170657, -206493, -217275, -31376, 161754, -47556, 45218, 38473, 9261, 200167, -94369, -140126, 148637, 178867, -24917, -274395, -192361, 30767, -265863]
9919b6957j50309d8040B18375b93643I2256J18524b25061a07770m55828B85c64901
9907a4224B0518a81410f7755q0854J5640d1312A4495J18204c05548h2508k56330
9896c38838h7362G8976c30219g632j39126j6126m4035d1135j69120r8915K1900
9885b87270B22585d25137a49017i014B1768A75a85933c0071m0960A50946O8891
9874B19837J65002a36093k5848l14723B3207O4517d0346B28354c74122G7955a22421
9862A51830a49157A14236e5677j03374j41840B68758a38231b990B13565g6180
9851a60345H4159A9733b19591H9339c38957J43854O3465j42789i6885H3285b07300
9839E2633J61663a01916a3110k6481A37496G318J85480f8520j73480K1739H5440
$$ y = [-26957, -177266, -48040, 218375, -293643, 92256, 210780, -225061, -107770, -563598, 285, -364901, -14224, 20518, -181410, -67755, -148609, -132969, -41312, 14495, 132699, -305548, -82508, -338838, -87362, 78976, -330219, -7632, -146758, -162884, -206919, -41135, -210255, -309170, -287270, 222585, -425137, -149017, -9014, 21768, 175, -185933, -30071, -71031, 150946, 219837, 384839, -136093, -161941, -476664, 23207, 87724, -40346, 228354, -374122, 77955, -122421, 151830, -149157, 114236, -55677, -159051, -300891, 268758, -138231, -2990, 213565, -76180, -160345, 84159, 19733, -219591, 89339, -338957, -195103, -131638, -274427, -96885, 83285, -207300, 52633, 214296, -101916, -13110, -39591, 137496, 7318, 192798, -68520, -242000, -220261, 85440]
9827b41942J03191O464C9070c12552h3607D1902a39028k2819N3229k9301F4089
9815H296J32051D9753b65449B04680a81877j19161C18958b37847A03121C3582
9804F7694a61458d9124E3524J25261A4180O8725b85132H3905a15070E5950q784
9793D7166O4751B1246P4150k0972a11909I9940e1649j69303m6626A40834a08538
9781a09366j59923H9690a51854K7744f778j01227B32027a27731m1715B5319a80322
9769b85180g1396B8014d46721C59844F9561a52495j3973j6577B06709d08927c4772
9757A79018j2545a19404H3401b45688c748n8012A72180e5507j65566A3267a81856
9745A30145E4402f1161j18501p4588B7501b55638I023Q9991i3084M2601I8639
$$ y = [-241942, -138751, -132287, 39070, -312552, -83607, 41902, -139028, -161847, -108618, -137919, 64089, 8296, 140347, 49753, -265449, 204680, -181877, -301038, 318958, -237847, 103121, 33582, 67694, -161458, -49124, 53524, 178785, 14180, 82905, -285132, 83905, -115070, 55950, 47166, 111917, 21246, 95396, 74424, -111909, 99940, -51649, -220952, -267578, 140834, -108538, -109366, -269289, 89690, -151854, -124110, -6778, -108005, 232027, -127731, -169446, 25319, -180322, -285180, -71396, 28014, -446721, 359844, 69561, -152495, -166468, -183045, 206709, -408927, -34772, 179018, 166473, -119404, 83401, -245688, -3748, -61760, 172180, -55507, -221073, 13267, -181856, 130145, 54402, -61161, -179662, -254250, 27501, -255638, 9023, 99014, -93084, -50483, 98639]
9733a02858K9518j03261E4913a18094n3433B82864f9859j04452N9157j86504J21351
9722a80307E8651d0852F2582b3051B25399c05740f5117j431F8153a94703G1052
9710A2509i8836H2432a58857a6268r5509d3869j82478b9604k29881n0223J28071
9699a81637B69079f2491A19640c94889d2427J333k30220G29i1685G7753c41770
9687B41961A15982a09908N3090j18101d1562g65q5609c0057B33466E6152B7724
9675I2404i0858A61645L150d9355A23707c96105J81323p7775B7332b04765A50037
9663G4427h5351p3069P3332h367j99514J00121A0571b63663B2762a0938j57075
9652a68013A20281J71694i5097o8119M7391l7824j95560a14198I7071a45884l00547
$$ y = [-102858, -73340, -176601, 54913, -118094, -171527, 282864, -69859, -174311, -115154, -301658, -180307, 58651, -40852, 62582, -23051, 225399, -305740, -65117, -66548, 68153, -194703, 71052, 12509, -98836, 82432, -158857, -16268, -111777, -43869, -226347, -29604, -259485, -309708, -181637, 269079, -62491, 119640, -394889, -42427, -41094, -271314, 729, -91685, 77753, -341770, 241961, 115982, -109908, -56818, -174919, -41562, -765, -86374, -30057, 233466, 56152, 27724, 92404, -90858, 161645, 164795, -49355, 123707, -396105, -214782, -292557, 27332, -204765, 150037, 74427, -85351, -158420, -85088, -8367, -207881, -107760, 10571, -263663, 22762, -10938, -168013, 120281, 291975, -95097, -163216, -115825, -153649, -349209, -114198, 97071, -145884, -446431]
9641d46431a66964B34205G9694C889a1058l25582C8653a38831a5729j24948D2524
9629E9304c01015J35405j78979H6523b50394j48534a31103a2058j57179a9807
9618f6337C06292g6408j46341C2340J53457a04759j20736h7578a1235k81326B49304
9606A72837b34624g0259L3053A04950a09154m5355D9839d1370j15213l41686a5412
9594e7198p6340p1692I8736b84476b8909A2545a00411b9921N582j67366J8641
9583a73064O1730C1508I000L20134h9363I4754c50795a56493j51139b0559A84187
9571a29317A33520f2979p649I8526a5289A44715E5093c23468A29439b1483H7921
9559c472j05459j47549B17867j02445a3651m2598C8374a43817A74212A8441Q8220
$$ y = [-446431, -166964, 234205, 79694, 3889, -11058, -336640, 38653, -138831, -15729, -140677, 42524, 59304, -301015, -165610, -344589, 86523, -250394, -398928, -131103, -12058, -169237, -19807, -66337, 306292, -76408, -222749, 32340, 185797, -104759, -225495, -87578, -11235, -292561, 249304, 172837, -234624, -70259, -37206, 104950, -109154, -154509, 49839, -41370, -156583, -498269, -15412, -57198, -133538, -205230, 98736, -284476, -28909, 12545, -100411, -29921, -24339, -191705, -173064, -111334, 31508, 9000, 329134, -89363, 94754, -350795, -156493, -307632, -20559, 184187, -129317, 133520, -62979, -70628, 98526, -15289, 144715, 55093, -323468, 129439, -21483, 87921, -3472, -108931, -256480, 217867, 115422, -13651, -56249, 38374, -143817, 174212, 18441, 106661]
9548A06661a47577A11517f3414j03842B31102g9688A95077d00170C66256F9205
9537a82583P1825c9610j0229j25043b1290C02800a27868M2936B76425b41765A3902
9525B40825f1310p7400l1198k3844P6089A13828j17a48681G9721a15701p5511
9514a91212J3332f9365D8382B929c01192A19916K8831J06203b93067a27251C3013
9502C9894j8260O3913k6245a75842b6480l6363K3330q071n3691j22249f9426A01023
9489i2162J266i774p1433C22055a30626q4356A15393h3494k13354a23216N8203
9478f5013j00252q5064J608a19293o3774l6412M8799B03742b64466c8446p6941
9467a15387D03377I1441a6470j96819D1679h3095B8329O1265P2755a00253k30790
$$ y = [106661, -147577, 111517, -63414, -167256, 231102, -79688, 195077, -400170, 366256, 69205, -182583, -110758, -39610, -49839, -174882, -21290, 302800, -127868, -84932, 276425, -241765, 13902, 240825, -61310, -138710, -169908, -193752, -117663, 113828, 113711, -148681, 79721, -115701, -191212, -177880, -69365, 48382, 2929, -301192, 119916, 148747, 254950, -293067, -127251, 33013, 39894, 21634, 85547, 59302, -175842, -26480, -62843, -39513, -47584, -101275, -223524, -69426, 101023, -92162, -90896, -9774, -81207, 322055, -130626, -214982, 115393, -83494, -296848, -123216, -65013, -165265, -250329, -248721, -119293, -183067, -219479, -170680, 203742, -264466, -38446, -115387, 403377, 91441, -16470, -213289, 41679, -83095, 28329, 89594, 162349, -100253, -331043]
9456c31043c1129k88609G158K22757c04322A07158f1737K6980r1711D8651K6886
9445G5537i0808c8406q2508E7617c02035D4438d4656j57873L5911r5779l38853
9434f01250b49183a15990k14417e3437A27626d5329j36729a859l44541B090J8286
9423B0376L9946b03906D1278i1705M2301i152n8163A15188b59747G2790b27339
9411e0892o066A68897i3504A30257K404a70837j88570h5192C01923d176k35957
9400b40133G7368c73258A02581J9183g2106k07347N1064c8610m2881j07276f6714
9388a36153h409n5039c677k92989J30701j32802a48508B98055A26263a21215J957
9377a19258a1995C6935i2996o1812H6643N9306K06817b65762K6059L1743F8376
$$ y = [-331043, -31129, -319738, 7158, 229915, -304322, 107158, -61737, -34757, -126468, 48651, 75537, -90808, -38406, -120914, 57617, -302035, 44438, -44656, -202529, -166618, -262397, -601250, -249183, -115990, -330407, -53437, 127626, -45329, -182058, -1859, -346400, 2090, 20376, 60322, -203906, 41278, -91705, -49404, -9152, -67315, 115188, -259747, 72790, -227339, -50892, -56958, 168897, -93504, 130257, 132661, -170837, -359407, -85192, 301923, -4176, -240133, 77368, -373258, 102581, 121764, -72106, -279453, -228389, -38610, -81491, -188767, -66714, -136153, -8409, -63448, -3677, -296666, -165965, -298767, -148508, 298055, 126263, -121215, -119258, -11995, 36935, -92996, -154808, 86643, 145949, 352766, -265762, -239703, -207960, 68376]
9365G101a42421j31727C01685a24409C26760A51501G1926b55056b8012I3781b72248
9353i9950A02399L7083j0977a76336l9407A67885n4221b70639a23793K9680J2636
9342h1477b4540B54290g8651p7115A78081b1698A60809b31053C5078c095B2068
9330I7810d06177a06468n7675E8574i427I7302a99845C42740j23988F8303a8480
9318a21740G5815b5715D0085c4273j61942A24495b26015L8402B4279i4763q426
9307a03189D4292g159q1689J1001B03597a03996A05087a35538G5279l171a11023
9295A0697a57768A01105c46186B4661H601a83935A04680a77723M1072b9979l22760
9284c52739a42037b3017q140B7710L3020b10062j72982a54593H7183C7196a83895
$$ y = [7101, -142421, -274148, 301685, -124409, 326760, 151501, 71926, -255056, -28012, 93781, -272248, -99950, 102399, 139482, 128505, -176336, -215743, 167885, 113664, -270639, -123793, -94113, -81477, -24540, 254290, -78651, -155766, 178081, -21698, 160809, -231053, 35078, -3095, 22068, 97810, -406177, -106468, -164143, 58574, -9427, 97302, -199845, 342740, 218752, 68303, -18480, -121740, 75815, -25715, 40085, -34273, -196215, 124495, -226015, -187613, 24279, -94763, -103189, 44292, -7159, -88848, -77847, 203597, -103996, 105087, -135538, 75279, 72108, -111023, 10697, -157768, 101105, -346186, 24661, 8601, -183935, 104680, -177723, -136651, -29979, -352739, -142037, -23017, -31157, 27710, 60730, -210062, -383044, -154593, 87183, 37196, -183895]
9272a32893J5935l8144c9010A36944D012a95679A75983p3238J44685b09160A79694
9260c03664A96292M7921g0843A61577E3621L27681a72880B27276a37917j5618
9250a53535A55699L4078J46782A0677P3908A7910h2310F0601b3087D20384F8403
9238e1107r189H3185e0049k8929j02281A70397a47598L1273C60830d2304D8972
9226b50149A44255j8030G497J949g8034L3029k71267B06568a47844B99887d2924
9214C2741c3961q1475N1292A40108a07581e0837m50508b44569J15839A9564b55280
9202b5017p8017k08511O2135q3535h9769L7530C1081b70611A30464b45943B8516
9190h0559B03642q2244a73421d8359k55432O407a46124C1234G800a55823P940
$$ y = [-132893, -116958, -155102, -39010, 136944, 4012, -195679, 175983, 102745, 247430, -209160, 179694, -303664, 196292, 244213, -70843, 161577, 53621, 381302, -172880, 227276, -137917, -153535, 155699, 189777, 336559, 10677, 84585, 17910, -82310, 60601, -23087, 420384, 68403, -51107, -60296, 83185, -50049, -78978, -181259, 170397, -147598, -116325, 360830, -42304, 48972, -250149, 144255, 126225, 7497, 9446, -78034, -45005, -316272, 206568, -147844, 299887, -42924, 32741, -33961, -115436, -64144, 140108, -107581, -50837, -501345, -244569, -128730, 19564, -255280, -25017, -103034, -311545, -249410, -332945, -89769, -52239, 31081, -270611, 130464, -245943, 28516, -80559, 203642, 121398, -173421, -48359, -303791, -297384, -146124, 31234, 7800, -155823, -147883]
9179a47883B09790o1008c73328c767j02274k5386j29641D0908a88135B5304J62164
9168A87468a87119l20329i6634d7989A15034a09546B2944A0921P7799d17163a5265
9156a26278A70536M2229b76536a6470j64482n1107A1853a51247q1522P9358A26460
9144A42645m4407a09735n4859A0858a24711j1403o9829l4486I1724K67901A71365
9132h6439B49932C9384b94858A34931j4680a5772H5227B5135b14389j0873i1927
9120a05338B46912c92725C07423f9408j22299f5262D90597i5386j46606J09397
9110a32595m8622G1942M388b45812r6830C466a78558B66038a58833c4044A32816
9098a74499A39887a57525k13169a78348A7871J26481b75131L3502J13644k23855
$$ y = [-147883, 209790, 148782, -373328, -3767, -106041, -131427, -261068, 40908, -188135, 25304, 187468, -187119, -507448, -96634, -47989, 115034, -109546, 22944, 10921, 88720, -417163, -15265, -126278, 170536, 212765, -276536, -16470, -180952, -232059, 11853, -151247, -232769, -153411, 126460, 142645, 98238, -109735, -164594, 10858, -124711, -136114, -205943, -240429, 91724, 359625, 171365, -86439, 249932, 39384, -294858, 134931, 120251, -15772, 85227, 25135, -214389, -225262, -91927, -105338, 246912, -392725, 307423, -69408, -191707, -65262, 490597, -95386, -241992, -132595, -181217, 71942, 76330, -245812, -342642, 3466, -178558, 266038, -158833, -34044, 132816, -174499, 139887, -157525, -370694, -178348, 17871, 144352, -275131, -241629, -127985, -351840]
9088c51840Q3730B17870c5935j71021C7223a09395d0076k19977h1696p9702A78057
9076a13827E08477a28423j2959G0752a89309l7738B35878E99b79312Q8107j76891
9065c68096a76911N6114j50f403A53832p0681k6828b53294H557K5851a08843d8665
9052c3953k26928j5139a19840L2223k00720A40549a39723M2611P808A68163J37442
9041C05605r1287e9504r6391A98297j5251k8556c95949a88887h6823A32605a88603
9029C70712i7591G533a4604k55194G0230c2573B11028d70666C44088b8399k23278
9018b51677I807b42446f2130q8252j07064l4423A12691a12199e4405C45854d3434
9006b7230p9026k42955d5569B20601C5357a75959k28039B10555j300J46135p8487
$$ y = [-351840, -268110, 217870, -35935, -206956, 37223, -109395, -40076, -260053, -81696, -161398, 178057, -113827, 508477, -128423, -141382, 70752, -189309, -227047, 235878, 599, -279312, -191205, -368096, -176911, -120797, -120947, -6403, 153832, 83151, 56323, -253294, 8557, 34408, -108843, -48665, -33953, -260881, -276020, -119840, -87617, -288337, 140549, -139723, -97112, -89304, 168163, 305605, 214318, -59504, -155895, 198297, 183046, 154490, -395949, -188887, -86823, 132605, -188603, 370712, -97591, 7533, -14604, -269798, 70230, -32573, 211028, -470666, 344088, -28399, -251677, 9807, -242446, -62130, -150382, -257446, -291869, 112691, -112199, -54405, 345854, -43434, -27230, -106256, -349211, -45569, 220601, 35357, -175959, -403998, 210555, 209255, 355390, 276903]
8995B76903b8475k12395A4238a438D1894a45773f1945k29499Q8994P8429J1614
8984a12407j13925J2641c4703j43138A58021A1822h6116l7905A964R1034A8644
8972a86183Q0945p5812C54727j18291M9812b88304A27576a19691B67760d321F2396
8960C3252K69651b61919a27383A51484a02468j52666A04086A6697b44791A471
8949b57194j05535g1583A34647g8959A73794e3564K2752l1136n7508o8944q5597
8938b73997j93922H9490b12088o5655C1962J3043b27453B61558C2063a38842p6059
8927b14901l1619J15557o6124J0026D14919D3714a67994B1321J76355J73326j81438
8916A89564a66594C2456K41562J87110a55432B09748F1495P80785K30710R06724
$$ y = [276903, -28475, -240870, 14238, -1438, 41894, -145773, -61945, -291444, -202450, -124021, -112407, -226332, -213691, -34703, -177841, 158021, 11822, -86116, -124021, 1964, 92998, 18644, -186183, -105238, -181050, 354727, 236436, 286248, -288304, 127576, -119691, 267760, -4321, 62396, 33252, 302903, -261919, -127383, 151484, -102468, -255134, 104086, 16697, -244791, 1471, -257194, -362729, -71583, 134647, -78959, 173794, -53564, -30812, -61948, -119456, -188400, -273997, -467919, 89490, -212088, -277743, 31962, 45005, -227453, 261558, 32063, -138842, -214901, -246520, -130963, -197087, -187061, 414919, 43714, -167994, 21321, 197676, 371002, 189564, -166594, 32456, 274018, 461128, -155432, 209748, 61495, 842280, 1072990, 1979714]
8906A979714K173658M33818B142906r55308E36825j05678m3554A81108J86381
8897C67489a21831N4991B37136A09053a57956D6250a44465A50951e4666m57202
8887e11868H8581O8455F6235a48401J1214j04372B88223E8063a05330p8763A35903
8875a51620L5902d9482D4118b57595G751c15593Q6483B72016J5941j29735N1948
8864B10170J0111a62575D021b02820h2899A08997f1719J2718q5817a4422l74711
$$ y = [1979714, 4153372, 4587190, 2142906, 1187598, 536825, 431147, 387593, 181108, 367489, -121831, -66840, 237136, 109053, -157956, 46250, -144465, 150951, -54666, -511868, 88581, 157036, 66235, -148401, -137187, -241559, 288223, 58063, -105330, -184093, 135903, -151620, -115718, -49482, 44118, -257595, 7751, -315593, -229110, 272016, 287957, 158222, 210170, 220281, -162575, 4021, -202820, -82899, 108997, -61719, -49001, -134818, -14422, -389133]
$$ [...]
##END NTUPLES=NMR SPECTRUM
##END=
