
##TITLE=AC1107_ROVE100E_5867855_BpCmW4qnMg
##JCAMPDX= 6.0         $$ Bruker NMR JCAMP-DX V2.0
##DATA TYPE= NMR SPECTRUM
##DATA CLASS= NTUPLES
##ORIGIN= BRUKER
##OWNER= Administrator
$$ 1.72 TOPSPIN		Version 2.1
$$ 2012-03-30 21:58:37.734 -0500  Administrator@TOPSPIN
$$ Compression mode = diff/dup
##.OBSERVE FREQUENCY= 400.13188235
##.OBSERVE NUCLEUS= ^1H
##.ACQUISITION MODE= SIMULTANEOUS (DQD)
##.ACQUISITION SCHEME= undefined
##.AVERAGES= 64
##.DIGITISER RES= 22
##SPECTROMETER/DATA SYSTEM= spect
##.PULSE SEQUENCE= noesygpps1d.comp
##.SOLVENT NAME= COFFEE_meoh
##.SHIFT REFERENCE= INTERNAL, COFFEE_meoh, 1, 14.96686
##AUDIT TRAIL= $$ (NUMBER, WHEN, WHO, WHERE, PROCESS, VERSION, WHAT)
$$ ##TITLE= Audit trail, TOPSPIN		Version 2.1
$$ ##JCAMPDX= 5.01
$$ ##ORIGIN= Bruker BioSpin GmbH
$$ ##OWNER= Administrator
$$ $$ C:\Bruker\TOPSPIN/data/COFFEE/nmr/AC1107_ROVE100E_5867855_BpCmW4qnMg/12/pdata/1/auditp.txt
$$ ##AUDIT TRAIL=  $$ (NUMBER, WHEN, WHO, WHERE, PROCESS, VERSION, WHAT)
(   1,<2012-03-30 21:58:32.984 -0500>,<Administrator>,<TOPSPIN>,<go>,<TOPSPIN 2.1>,
      <created by zg
	started at 2012-03-30 21:47:01.281 -0500,
	POWCHK enabled, PULCHK disabled,
       configuration hash MD5:
       1A 1E CE 29 27 FD 77 03 67 4E F0 E3 C4 B2 CB 90
       data hash MD5: 64K
       14 E0 DD 6B D8 09 60 5A F1 FE B4 8C C7 7D 45 C9>)
(   2,<2012-03-30 21:58:35.796 -0500>,<Administrator>,<TOPSPIN>,<proc1d>,<TOPSPIN 2.1>,
      <Start of raw data processing
       efp LB = 0.3 FT_mod = 6 PKNL = 1 PHC0 = 0 PHC1 = 0 SI = 128K 
       data hash MD5: 128K
       70 1F 45 ED 93 82 F9 CA 68 74 A1 61 D8 DB 5E 1B>)
(   3,<2012-03-30 21:58:37.156 -0500>,<Administrator>,<TOPSPIN>,<proc1d>,<TOPSPIN 2.1>,
      <pk PHC0 = 31.94275 PHC1 = 0 
       data hash MD5: 128K
       5A 9F CB 35 7E 99 51 D0 38 27 91 68 FA 81 30 2E>)
(   4,<2012-03-30 21:58:37.421 -0500>,<Administrator>,<TOPSPIN>,<proc1d>,<TOPSPIN 2.1>,
      <abs ABSG = 1 
       data hash MD5: 128K
       3B B1 29 A4 BF 12 AB 99 9C 07 F4 6C 97 7E 91 E8>)
(   5,<2012-03-30 21:58:37.500 -0500>,<Administrator>,<TOPSPIN>,<proc1d>,<TOPSPIN 2.1>,
      <abs ABSG = 2 
       data hash MD5: 128K
       D3 B0 10 65 0D 0F 82 24 95 9E 2E 58 9F C9 60 E9>)
(   6,<2012-03-30 21:58:37.562 -0500>,<Administrator>,<TOPSPIN>,<proc1d>,<TOPSPIN 2.1>,
      <abs ABSG = 3 
       data hash MD5: 128K
       AC 15 A5 0C CC 48 0C 07 CF 3C 68 F7 4B 7E 24 94>)
(   7,<2012-03-30 21:58:37.609 -0500>,<Administrator>,<TOPSPIN>,<proc1d>,<TOPSPIN 2.1>,
      <abs ABSG = 4 
       data hash MD5: 128K
       7C 1E 63 50 1D 9E 51 20 AF E1 55 90 6C F6 E6 3E>)
(   8,<2012-03-30 21:58:37.656 -0500>,<Administrator>,<TOPSPIN>,<proc1d>,<TOPSPIN 2.1>,
      <abs ABSG = 5 
       data hash MD5: 128K
       B6 C2 A6 C7 2E FC C8 FD 27 AF 15 04 8E 62 D5 16>)
$$ ##END=
$$ 
$$ $$ hash MD5
$$ $$ 2D 7C CE 4A D6 F9 DB 6C 00 7C 81 9F 73 AA 72 9B
##$RELAX= 
##$RELAX= 
##$RELAX= 
##$RELAX= 
##$RELAX= 
##$RELAX= 
##$RELAX= 
##$RELAX= 
$$ Bruker specific parameters
$$ [...]
##$TP07= 0
##$TPNAME0= <>
##$TPNAME1= <>
##$TPNAME2= <>
##$TPNAME3= <>
##$TPNAME4= <>
##$TPNAME5= <>
##$TPNAME6= <>
##$TPNAME7= <>
##$TPOAL= (0..7)
0.5 0.5 0.5 0.5 0.5 0.5 0.5 0.5
##$TPOFFS= (0..7)
0 0 0 0 0 0 0 0
##$TUNHIN= 0
##$TUNHOUT= 0
##$TUNXOUT= 0
##$USERA1= <user>
##$USERA2= <user>
##$USERA3= <user>
##$USERA4= <user>
##$USERA5= <user>
##$V9= 5
##$VALIST= <valist>
##$VCLIST= <CCCCCCCCCCCCCCC>
##$VD= 0
##$VDLIST= <DDDDDDDDDDDDDDD>
##$VPLIST= <PPPPPPPPPPPPPPP>
##$VTLIST= <TTTTTTTTTTTTTTT>
##$WBST= 2048
##$WBSW= 25
##$XGAIN= (0..3)
0 0 0 0
##$XL= 0
##$YL= 0
##$YMAX_a= 9369574
##$YMIN_a= -5481398
##$ZGOPTNS= <>
##$ZL1= 120
##$ZL2= 120
##$ZL3= 120
##$ZL4= 120
##$ABSF1= 14.96686
##$ABSF2= -5.58567
##$ABSG= 5
##$ABSL= 3
##$ALPHA= 0
##$AQORDER= 0
##$ASSFAC= 0
##$ASSFACI= 0
##$ASSFACX= 0
##$ASSWID= 0
##$AUNMP= <proc_prof1d_extract.lims>
##$AXLEFT= 0
##$AXNAME= <>
##$AXNUC= <1H>
##$AXRIGHT= 0
##$AXTYPE= 0
##$AXUNIT= <>
##$AZFE= 0.1
##$AZFW= 0.1
##$BCFW= 0
##$BC_mod= 0
##$BYTORDP= 0
##$COROFFS= 0
##$CY= 15
##$DATMOD= 1
##$DC= 0
##$DFILT= <>
##$DTYPP= 0
##$F1P= 0
##$F2P= 0
##$FCOR= 0.5
##$FTSIZE= 131072
##$FT_mod= 6
##$GAMMA= 0
##$GB= 0
##$INTBC= 1
##$INTSCL= 1
##$ISEN= 128
##$LB= 0.3
##$LEV0= 0
##$LPBIN= 0
##$MAXI= 10000
##$MC2= 0
##$MEAN= 0
##$ME_mod= 0
##$MI= 0
##$NCOEF= 0
##$NC_proc= -3
##$NLEV= 6
##$NOISF1= 0
##$NOISF2= 0
##$NSP= 0
##$NTH_PI= 0
##$NZP= 0
##$OFFSET= 14.96686
##$PC= 1
##$PHC0= 31.94275
##$PHC1= 0
##$PH_mod= 1
##$PKNL= yes
##$PPARMOD= 0
##$PPDIAG= 0
##$PPIPTYP= 0
##$PPMPNUM= 2147483647
##$PPRESOL= 1
##$PSCAL= 4
##$PSIGN= 0
##$PYNMP= <proc.py>
##$REVERSE= no
##$SF= 400.130005504237
##$SI= 131072
##$SIGF1= 0
##$SIGF2= 0
##$SINO= 400
##$SIOLD= 131072
##$SPECTYP= <>
##$SREGLST= <1H.CDCl3>
##$SSB= 0
##$STSI= 131072
##$STSR= 0
##$SW_p= 8223.68421052632
##$SYMM= 0
##$S_DEV= 0
##$TDeff= 65536
##$TDoff= 0
##$TI= <>
##$TILT= no
##$TM1= 0
##$TM2= 0
##$TOPLEV= 0
##$USERP1= <user>
##$USERP2= <user>
##$USERP3= <user>
##$USERP4= <user>
##$USERP5= <user>
##$WDW= 1
##$XDIM= 131072
##$YMAX_p= 412944307
##$YMIN_p= -170063078
##$CURPLOT= <Network HP LaserJet P1505>
##$CURPRIN= <$Network HP LaserJet P1505>
##$DFORMAT= <normdp>
##$LAYOUT= <+/1D_H.xwp>
##$LFORMAT= <normlp>
##$PFORMAT= <normpl>
##$SURQMSG= 1
$$ End of Bruker specific parameters
$$ ---------------------------------
##NTUPLES= NMR SPECTRUM
##VAR_NAME=  FREQUENCY,     SPECTRUM/REAL,   SPECTRUM/IMAG
##SYMBOL=    X,             R,               I
##VAR_TYPE=  INDEPENDENT,   DEPENDENT,       DEPENDENT
##VAR_FORM=  AFFN,          ASDF,            ASDF
##VAR_DIM=   131072,        131072,          131072
##UNITS=     HZ,            ARBITRARY UNITS, ARBITRARY UNITS
##FACTOR=    0.0627417313425165, 1,          1
##FIRST=     8223.62146879498, 3925,         -83390
##LAST=      0,             6337,            -83300
##MIN=       0,             -170063078,      0
##MAX=       8223.62146879498, 412944307,    0
$$ Real data points
##PAGE= N=1
##DATA TABLE= (X++(R..R)), XYDATA
$$ [...]
67518 64725 64805 65438 67477 71014 74596 76298 75436 73046 70699 69020 67500 65650 64014 63706 65136 67714
67502 67714 70890 74763 79201 82877 84002 82104 78578 75362 73447 72658 72359 72103 71845 71828 72151 72488
67486 72488 72514 72675 74036 76950 80209 82078 82088 81206 80206 78587 75570 71562 67867 65144 63045 61463
67470 61463 61214 62861 65507 67537 68355 68688 69394 70631 72126 73444 73910 73107 71795 71595 73224 75526
67454 75526 76819 76781 76449 76761 77772 79078 80203 80442 79083 76232 73182 71592 72157 74031 75528 75507
67438 75507 74205 72699 71610 70682 69688 69157 69793 71552 73790 76010 77904 78972 78902 78242 77901 77809 76913
67421 76913 74771 72431 71170 70900 70469 69324 68315 68871 71678 76038 80237 82588 82405 80169 76929
67406 76929 73855 72166 72664 74802 76729 76949 75837 74964 75160 75925 76745 78025 80292 83111 85539 87414
67390 87414 89522 92336 95160 96792 96768 95644 94219 92845 91492 90109 88609 86736 84368 82071 81014
67375 81014 82026 84781 88014 90493 91671 91598 90578 89032 87412 86010 84839 83779 82761 81736 80583
67360 80583 79201 77716 76470 75790 75864 76809 78675 81172 83450 84405 83491 81355 79571 79503 81250 83602
67344 83602 85070 85024 83974 82951 82700 83261 84018 84107 82993 80905 78662 77019 76265 76431 77587 79567 81545
67327 81545 82388 81723 80431 79772 80063 80569 80752 81252 83140 86208 88592 88588 86669 85092 85448 87162 88691
67310 88691 89462 89890 89886 88501 85375 81674 78991 77756 77349 77453 78557 80991 84027 86310 87071 86791 86741
67293 86741 87946 90406 93143 94943 95262 94646 94315 95085 96533 97344 96664 94991 93575 93226 93939 95337
67277 95337 96916 98093 98681 99180 99868 99765 97625 94199 92274 93750 97546 101135 103232 103977 103451 101630
67261 101630 99544 98838 99852 101197 101592 101271 101326 102452 104580 106982 108453 108118 106386 104573 103518 103233
67245 103233 103764 105229 106832 107148 106045 105176 105741 106781 106655 105367 104277 104161 104763 105861 107527 109410
67229 109410 110824 111549 111808 111663 111242 111238 112081 112819 112026 109883 108142 107768 107826 107133 105921 105233 105546 106718
67211 106718 108469 110165 110716 109506 107102 104505 102233 100653 100515 102217 104981 107674 110106 112590 114636
67196 114636 115432 115629 117117 120401 123399 123912 122515 121799 122997 124562 124318 122034 119293 117508 116869 116992
67180 116992 117770 119279 121274 123106 124035 123546 121706 119477 118283 118697 119546 118861 115994 112529 110777 111494
67164 111494 113248 113986 113058 111767 112095 114901 119277 123523 126534 128207 128882 128935 128848 129034 129219 128508 126552
67147 126552 124392 123567 124420 125797 126460 126381 126521 127658 129708 131947 133631 134462 134663 134700 134914 135319 135661
67130 135661 135648 135290 135076 135650 137143 138972 140421 141229 141512 141543 141975 143791 147199 150658 151975 150735 148957
67113 148957 148891 150701 152852 154175 154635 154343 152978 150626 148512 148179 150026 153031 155839 157876 159428
67098 159428 160997 162852 165104 167813 170781 173394 175021 175584 175440 174656 172955 170624 168940 168969 170151
67083 170151 170819 170267 169676 170609 173038 175433 176657 177265 178723 181655 185202 188108 190060 191636 193114
67068 193114 193924 193475 192071 190662 190011 190455 192021 194230 196208 197799 200268 204820 210478 214629 216054
67053 216054 216277 217391 219698 222452 225713 229929 234178 236666 237249 238077 241078 245678 249615 251351 251168
67038 251168 250464 250612 252176 254657 257016 258659 259756 260592 261182 261778 263118 265586 268454 270576 271719
67023 271719 272692 274306 276719 279666 282759 285487 287528 289273 291530 294397 296828 297822 297847 298584 301218
67008 301218 305405 310030 314494 318760 322446 324635 324961 324390 324470 325907 328333 331339 335094 339702 344440
66993 344440 348245 350953 353671 357758 363504 369885 375482 379531 382170 384052 385979 388699 392498 396761
66979 396761 400404 403142 406070 410502 416445 422729 428498 433948 439536 445157 450384 455050 459326 463590
66965 463590 468459 474483 481474 488510 494854 500517 505657 510051 513745 517764 523352 530549 538138 545013
66951 545013 551066 556704 562192 567786 574009 581176 588706 595478 601177 607023 614647 624214 634208 643350
66937 643350 652092 661476 671078 679390 686321 693889 703704 714827 725134 734031 742693 752074 761886 771467
66923 771467 780731 790200 800758 813127 826788 839738 850359 859451 869432 881611 895296 909452
66911 909452 923823 938256 952413 966805 982762 1000520 1018476 1035304 1051835 1069756 1089285
66900 1089285 1109254 1128755 1147492 1165255 1182591 1201585 1224188 1249576 1274685 1297848 1320606
66889 1320606 1345261 1371768 1398030 1422597 1446086 1470197 1496114 1523867 1552604 1581262 1609235
66878 1609235 1636714 1664626 1694347 1727173 1763483 1802229 1841551 1880125 1917886 1955662 1994456
66867 1994456 2034934 2077017 2119923 2163007 2206546 2251180 2296710 2342350 2388336 2436277 2487290
66856 2487290 2540613 2594815 2649646 2705708 2762758 2819631 2875884 2932532 2990910 3051657 3114928
66845 3114928 3180566 3247494 3313774 3378162 3441318 3504877 3569656 3635383 3701845 3769369 3838032
66834 3838032 3907146 3975845 4043845 4111339 4178467 4245010 4310326 4373463 4433735 4491382 4547188
66823 4547188 4601111 4651798 4698091 4740672 4781413 4821016 4858029 4890313 4916805 4937539 4952806
66812 4952806 4963061 4969141 4971527 4969360 4961057 4946249 4926492 4903611 4877721 4847396 4811536 4770504
66800 4770504 4725450 4677112 4625621 4571139 4514102 4454644 4392221 4326268 4257172 4186119 4113905
66789 4113905 4040437 3965784 3891137 3817989 3746518 3675649 3604708 3534076 3463845 3392854 3320094
66778 3320094 3246633 3175098 3107099 3041925 2977910 2914347 2851639 2790170 2729707 2669845 2610549
66767 2610549 2552044 2494410 2437600 2381970 2328605 2278647 2232070 2187403 2143077 2098825 2055299
66756 2055299 2012485 1969341 1925341 1881738 1840686 1803278 1768886 1736199 1704331 1672855 1641317
66745 1641317 1609148 1576109 1542671 1509883 1478746 1449612 1422116 1395603 1369547 1343721 1318256
66734 1318256 1293558 1269830 1246621 1223212 1199615 1176796 1155613 1135790 1116218 1095948 1074630
66723 1074630 1052505 1030556 1010342 992798 977124 961450 944719 927385 910266 893485 876902
66712 876902 860915 846101 832244 818302 803518 788361 774280 762445 752636 743408 733426 722452
66700 722452 710846 698565 685418 672164 660315 650393 641139 631078 620325 610149 601063 592177
66688 592177 582417 571775 561207 551675 543439 536072 529111 522565 516518 510251 502370 492295 481183
66675 481183 470942 462685 456561 452422 449677 446835 442361 436144 429376 422983 417092 412032 408582 406670
66661 406670 404841 401793 397678 393135 387821 381053 373474 366922 362542 359957 358308 357078 355564 352571
66647 352571 347462 341127 335176 330390 326493 323124 320176 317153 313197 308361 304180 302046 301191 299179
66633 299179 294616 288655 283523 280206 278002 275749 272823 269328 265963 263487 261726 259418 255758 251806
66619 251806 249483 249285 249895 249949 249072 247112 243629 238755 233586 229131 225629 223307 222643 223120 222834 220527
66603 220527 217194 214503 212435 209982 207575 206953 208556 210708 211763 211680 211067 210033 208745 207928 207853 207655
66587 207655 206507 204860 203696 203127 202501 201411 199839 197802 195723 194616 194859 194983 192840 188133 182871
66572 182871 179112 177082 175852 174959 174673 175138 176039 176934 177306 176376 173630 169861 167072 166673 167940 168834
66556 168834 168322 167208 166528 166030 164944 163523 162652 162199 161046 158941 157014 155957 154824 152538 149666
66541 149666 147541 146284 144984 143511 142783 143055 143170 141955 139493 136496 133180 129456 125805 123235 122322
66526 122322 122636 123186 123317 123149 123094 123063 122602 121907 122062 123626 125512 126147 125406 124393 123521 122155 120299 119199
66508 119199 119569 120424 120463 119679 118709 117570 116236 115721 117111 119762 121712 121964 121365 121270 122295 124318 126623
66491 126623 127868 126922 124171 121322 119709 119394 119877 120755 121460 121397 120708 120036 119221 117383 114848 113675 115066
66474 115066 117201 117197 114823 112684 112613 113354 112509 109661 106593 104921 104600 104808 105293 106147 106667 105544 102639
66457 102639 99848 99270 100744 102142 102087 101281 100843 100615 99993 99394 99576 100155 100224 100206 101524 104171 106019 105264
66439 105264 102564 100009 98721 98326 98284 98792 100318 102808 105486 107245 107340 105878 103587 101156 99056 97829
66423 97829 97849 98529 98438 96749 94176 92087 91084 90953 91442 92289 92769 92217 91068 90568 91209 92159 92640 93178
66405 93178 94818 97488 99987 101600 102950 104858 106852 107428 105734 102509 99201 96570 94478 92802 91984
66390 91984 92451 93683 94208 92748 89526 86385 85350 86847 89385 91068 91322 91007 91158 92005 93162 94333
66374 94333 95568 97008 98525 99671 100106 100113 100429 101271 101822 101077 99068 96711 94518 92114 89305 86973
66358 86973 86425 87980 90494 92220 92053 90177 87806 86291 86327 87718 89497 90241 88944 86167 83879 83425
66342 83425 83919 83499 81914 80794 81392 83306 85666 88251 90707 91869 90947 88769 86940 86216 86309 86725
66326 86725 87032 86932 86817 87683 89725 91721 92618 92946 93529 93696 92294 89966 88638 88791 88915 87937 86648
66309 86648 86337 87305 89197 91556 93480 93963 93268 92910 93679 94710 95138 95430 96123 96391 95123 92659 90139
66292 90139 87694 84679 81408 79244 78830 79332 79717 79879 80221 80927 82068 83804 86009 88017 89173 89591
66276 89591 90132 91632 94132 96730 98221 98074 96838 95586 94989 94950 94962 94718 94442 94577 95040 95005 93818 91998
66258 91998 90767 90614 90970 91307 91694 92079 92074 92033 93234 96000 98456 98469 96359 94328 93399 92536 91082 90478
66240 90478 92466 96427 99699 100383 98966 97109 95591 93891 91530 89206 88201 88821 89961 90437 90350 90660
66224 90660 91729 92851 93177 92563 91411 90075 88628 87035 85541 84970 86338 89780 94081 97807 100720
66209 100720 103445 105819 106514 104718 101573 99351 99370 101043 102698 102968 101529 98991 96306 94244 93206
66194 93206 93250 94103 95323 96656 98093 99372 99737 98652 96679 95147 94942 95927 97460 99015 100339 101474
66178 101474 102681 103995 104990 105407 105753 106621 107670 108168 108341 109036 110056 110232 109564 109731 111534 113175 112479
66161 112479 109867 107594 106693 106436 106514 107764 110331 112765 113724 113375 112369 110619 108193 106532 107348 110475
66145 110475 113787 115299 114763 113319 112316 112516 113745 114965 114971 113311 110672 108541 108405 110690 114119 116606
66129 116606 117228 116891 116557 115631 113201 110371 109706 112083 115509 117697 118549 119197 119816 119795 119319 119150 119020
66112 119020 117833 115716 114423 115139 116973 118333 118858 119128 119240 118769 117834 117270 117730 119190 121169 122856
66096 122856 123331 122479 121556 121990 123539 124433 123596 121903 120886 120976 121626 122446 123316 123743 123239 122438 122874 125081
66078 125081 127537 128147 126529 124340 123493 124643 127213 130056 131805 131333 128628 125056 122252 120821 120344
66063 120344 120285 120344 120233 119926 120054 121311 123338 124943 125588 125885 126473 127322 128527 130664 133494 135279 134629
66046 134629 132517 131189 131269 131202 129633 127135 125201 124510 124765 125611 127093 129453 132670 135950 137762 136992
66030 136992 134171 131069 129065 128539 129671 132667 136771 140075 141208 140752 140376 140974 142158 143127 143403 143027
66014 143027 142584 142795 143669 144373 144342 144046 144062 143931 142769 140833 139514 139630 140373 140267 138883 137358 137311 139159
65996 139159 141416 141974 140337 138192 137437 138080 138662 138301 137479 137032 137395 138910 141768 145158 147314 147196
65980 147196 145710 144623 144546 144664 144332 144206 145485 148464 152167 155243 156995 157689 158194 159412 161795 165169
65964 165169 169005 172856 176414 179143 180263 179521 177859 176864 177474 179492 182252 185192 187767 189528 190731
65949 190731 192391 195256 198920 202283 204597 205712 205699 204784 203493 202430 201943 202251 203613 206093 209521
65934 209521 213997 219979 227327 234745 240892 245712 249892 253262 254813 254352 253209 252935 253958 255702 257353
65919 257353 258217 257996 257125 256414 255956 254762 251758 246852 240893 235075 230489 227627 225874 223918 221107
65904 221107 218086 215753 214033 212155 209878 207812 206526 205722 204482 202285 199839 198711 199818 202259
65890 202259 204102 204475 204363 205156 207012 209171 211362 214062 217503 221168 224513 227688 231273 235521 240122
65875 240122 244570 248482 251612 253821 255318 256825 259083 262057 264948 267310 269817 273504 278523 284140
65861 284140 289704 294932 299389 302551 304503 305806 306529 306302 305552 305747 307858 311443 315774 320976 327186
65846 327186 333450 338556 342442 345715 348189 349180 349091 349370 350692 352283 353327 353962 354379 353917 351845 348477
65830 348477 344744 340954 336610 331297 325252 319037 313023 307227 301439 295463 289256 282826 276048 268804
65816 268804 261307 254095 247692 242504 238995 237450 237347 237242 235723 232521 228583 225069 222376 220143 218027
65801 218027 216234 215077 214245 213069 211669 211239 212645 215141 217145 218027 218420 218903 219361 219899 221470 224921
65785 224921 229851 234940 239155 242164 243902 244391 244075 243882 244677 246608 248956 250667 251241 251191 251516 252670
65769 252670 254230 255495 256068 255837 254869 253565 252537 252039 251814 251911 253338 257407 264332 272781 280809 287051
65753 287051 291109 293208 293779 293364 292679 292523 293403 295223 297417 299272 300052 299096 296323 292640 289333 286820
65737 286820 284361 281240 277782 274830 272503 270022 266728 262895 259481 257201 255877 254617 252677 250162
65723 250162 247716 245690 244136 243662 245520 250204 256361 261875 265980 269709 274290 279766 285366 290555
65709 290555 295237 299245 302206 303979 304910 305438 305387 303714 299199 291682 282683 274662 269473 267397 267345 267798
65693 267798 267771 267368 267591 269411 272828 276894 280705 284330 288855 295674 305614 318332 332391 346176
65679 346176 359094 371843 385300 399129 411725 421684 429120 435252 440700 444584 445558 443382 438953
65666 438953 432872 424705 413983 401317 387809 373654 358130 341187 324331 309430 296938 285790
65654 285790 274909 264301 254552 245764 237493 229680 223128 218735 216280 214287 211268 207205 203772 202899
65640 202899 204851 207706 209009 208081 206505 206206 207483 209285 210936 212738 214891 216694 217310 216810 216017
65625 216017 215564 215504 215633 215894 216546 218056 220676 224103 227873 232136 237539 244202 251328 258096 264430 270644
65609 270644 277102 284662 294625 307322 321322 334983 348396 362778 378227 393350 407252 420708
65597 420708 434864 449551 463416 475278 485060 493701 502273 510741 517589 521185 521553 520338 519178
65584 519178 518816 519578 521478 523599 524534 524040 523353 523222 522507 519460 513597 505443 495107 482260 467248
65569 467248 451212 434980 418383 400690 381528 361667 343074 327452 314365 301629 288228
65558 288228 275751 265939 257878 249350 240372 233358 229679 227931 226051 223410 220037 215445 209597 203960
65544 203960 200227 198444 197445 196531 195642 194383 192187 189368 186959 185508 184923 185423 187580 191168 194814
65529 194814 197236 198298 198694 199246 200724 203551 207201 210480 212902 215346 218863 223313 227789 232091 237065
65514 237065 243563 251601 260594 269951 279324 288655 298153 308162 319069 331380 345545 361418 378066
65501 378066 394435 409894 423834 435217 443199 447850 449413 447213 440454 430117 418661 407435
65489 407435 395584 382092 367613 353259 338790 323444 307843 293518 280911 269259 258150
65478 258150 247732 237688 227762 219278 214208 212309 211038 208939 207201 206874 206665 205162 203498 203482 204209
65463 204209 202980 199146 194582 190418 185749 180211 175534 173295 172675 171769 169984 167990 166255 164888 164193
65448 164193 164063 163291 160772 157276 154944 154970 156650 158694 160546 162184 163499 164423 165273 166506 168193 169906
65432 169906 171011 171144 170607 170270 170763 171784 172645 173514 175577 179590 184684 189172 192317 194707 196913 198502
65416 198502 198756 197812 196495 195341 194403 193784 193551 193177 192035 190583 190009 190197 189168 185518 180540 176708
65400 176708 174662 173102 171240 169645 168628 167561 166377 166117 167037 167605 166560 164904 164443 165153 165601 165457
65384 165457 165813 166981 167701 167189 166648 167762 170456 173105 174682 175894 178177 182044 186534 190066 191829
65369 191829 192443 193277 195117 197576 199796 201506 203266 205678 208504 210669 211290 210583 209504 208520 207193
65354 207193 205201 203266 202523 203172 204269 204780 204507 204063 204349 205947 208588 211170 212577 212485 211285 209623
65338 209623 208471 209110 212127 216345 219572 220678 220426 220277 221079 222990 225672 228032 228617 227110 225067
65323 225067 224411 225489 227183 228538 229448 230046 230482 231483 234124 238379 242426 244060 242718 239823 237415
65308 237415 236842 238416 241530 244831 246866 247162 246780 247556 250697 256052 262544 269076 275087 280546 285673
65293 285673 290681 295712 300882 306240 311640 316792 321583 326170 330554 334174 336235 336375 334723 331400
65279 331400 326526 320827 315620 311764 308938 306247 303145 299373 294526 288423 281712 275331 269334 262860
65265 262860 255339 247178 239217 232173 226774 223599 222231 221147 219170 216846 215772 216623 218376 219532
65251 219532 219608 219220 218988 218758 217926 216267 214164 212007 209666 206812 203495 200051 196644 193438 191203 190913
65235 190913 192394 193963 194016 192623 191077 190302 190416 191477 193467 195330 195156 192180 188127 185734 186075 187903
65219 187903 189423 189927 189629 188918 188353 188747 190355 192184 192930 192592 192373 192934 193682 194187 195256 197630 200250
65202 200250 201059 199506 197179 195783 195381 195015 194188 193198 192552 192635 193506 194521 194587 193356 191842 191318 191891
65185 191891 192675 192963 192514 191072 188594 185980 184575 184611 184846 184106 182486 180617 178481 175738 172845 170955
65169 170955 170655 171388 172236 172808 173232 173667 174033 174033 173364 172166 171300 171784 173694 175837 176749 175914 173877 171516
65151 171516 169531 168390 168123 168005 166893 164319 161195 159152 159077 160298 161238 160931 159976 159986 161986 165442
65135 165442 168885 171303 172607 172943 172191 170381 168241 166935 167295 169327 172200 174691 176083 176867 178216
65120 178216 180506 182810 184103 184387 184210 183652 182551 181276 180401 179824 179092 178482 178872 180558 183058 186032
65104 186032 189320 192043 192964 192250 191654 192226 192962 192646 191948 192388 193919 195180 195956 197821 201953 207474
65088 207474 212571 216496 219883 223567 227699 231878 235828 239905 244802 250557 256088 260192 263035 266133
65074 266133 270730 276559 282316 287005 290695 294148 297760 300818 302147 301717 301123 301825 303330 304052 303712
65059 303712 303657 304581 305140 303537 299657 294958 290906 288258 287174 287055 286529 284536 281388 278127 274983 271239
65043 271239 266552 261545 256875 252366 247410 241781 235734 229676 224058 219263 215317 211903 208870 206468
65029 206468 204877 203819 203012 202696 203218 204167 204565 204120 203816 204833 207077 209183 209898 209089 207466 205806
65013 205806 204639 204192 204175 203799 202478 200585 199230 199211 200353 201776 202625 202561 201898 201309 201223 201410 201271 200408
64995 200408 198767 196518 194226 192984 193712 196209 199305 201988 203894 204757 204281 202913 201888 201816 201780 200575
64979 200575 198340 196116 194181 191944 189388 187424 186349 184917 181686 176881 172328 169763 169611 171138
64965 171138 173262 175159 176563 177745 179184 181083 183027 184092 183575 181918 180627 180759 181617 181621 180521 179984
64949 179984 181622 185137 188960 192128 194775 197198 199341 201138 202569 203374 203484 203770 205484 208598 211469
64934 211469 212711 212775 213074 214121 215413 216828 218998 222027 224716 225696 224919 223484 222262 221319 220667 220856
64918 220856 222373 224733 226789 228014 229155 231283 234365 237089 238138 237415 235940 234790 234353 234477 234975
64903 234975 235685 236051 234992 231635 226330 220624 215873 212025 208167 204083 200638 198527 197392 196570 196052
64888 196052 195999 195809 194678 193020 192339 193323 194784 195006 193647 191806 190519 189730 188597 186392 183107 179564
64872 179564 177002 176324 177511 179752 182156 184463 187158 190761 194763 197489 197516 195302 192903 191932 192252
64857 192252 192895 193555 194600 196102 197634 198907 200013 201032 201857 202351 202285 201307 199522 198042 198297 200633
64841 200633 204015 207178 209637 211630 213641 216216 219765 224276 229487 235388 242061 249011 255315 260760
64827 260760 266237 272561 279505 286541 293985 302440 311243 318431 322562 323978 323952 323124 321370 318941 316973
64812 316973 316461 317057 317330 316262 314064 311362 308098 303894 299301 295777 293990 292768 290375 286586 282815
64797 282815 280215 278295 275661 271644 266789 261989 257561 253227 248693 244029 239575 235626 232178 228876
64783 228876 225256 221246 217467 214821 213643 213439 213611 214233 215797 218295 220814 222054 221172 218415 215202
64768 215202 213197 212749 212475 211087 209402 209541 212041 214881 215966 215548 215302 215800 216193 216133 216664 218867 222459
64751 222459 226190 229100 231113 232885 235398 239328 244351 249247 252963 255583 258102 261311 264959 268020
64737 268020 269776 270603 271472 272697 273586 273536 272909 272314 271513 269849 267554 265592 264092 261899 258151 253543
64721 253543 249499 246700 245067 244638 245561 247405 249235 250548 251627 252931 254635 256903 260139 264586 269769
64706 269769 274663 278511 281547 284902 289655 295873 302614 308897 314457 319497 324123 328361 332512 336993
64692 336993 341868 346883 351887 356810 361264 364670 366968 368849 371119 374108 377713 381469 384379 385335
64678 385335 384166 381839 379078 375271 369462 362055 354516 347524 340605 333783 328270 324734 321897 318055
64664 318055 313388 309657 307950 307921 308997 310909 312888 313778 313586 313778 315342 317582 319619 321959 325360
64649 325360 329027 331485 332865 334712 337543 340161 341695 342837 344325 345413 344810 342305 338512 333684
64635 333684 327849 321705 316251 311591 306993 302082 297078 291843 285759 279092 273642 271182 271431 272208 271591
64620 271591 269565 267554 266823 267472 268685 269553 269665 269268 269092 269948 272176 275403 279016 282996 288041 294591
64604 294591 301837 308096 312288 314754 316511 318068 319292 320061 320321 319496 316665 311855 306648 302802 300438
64589 300438 298244 295317 292034 289190 287211 286397 286889 287960 288450 288698 290864 296052 301975 305258 305727
64574 305727 306588 310286 316089 322229 328400 334969 341346 346864 352260 358589 365260 370710 374596 377707
64560 377707 379969 380294 378564 376090 373588 370144 364832 358155 351171 344314 337907 332736 328985 325340
64546 325340 320334 314094 307836 302196 297238 293568 291939 291690 290969 288826 286011 283429 280983 278534 276819
64531 276819 276457 276920 277539 278854 281741 285544 288507 290154 291947 295168 299342 303453 307789 313498 320841
64516 320841 328910 336897 344731 352509 360166 367903 376194 385053 393805 401797 408889 415131 420579 425669
64502 425669 430939 435822 438351 436979 432506 427537 423977 421524 418449 413316 406048 397950 390811 385526
64488 385526 381439 377261 372556 367953 364073 360914 358354 356516 355263 353808 351315 347797 344183 341559
64474 341559 340353 339933 338992 336702 333649 331234 329969 328701 325797 320819 314839 309406 305404 302568 299852
64459 299852 296590 293545 292438 294047 297130 299628 300605 300570 300305 300179 300443 301304 302412 302949 302635 302209 302566
64442 302566 303791 305482 307715 311002 315255 319384 322347 324302 326341 329081 331945 334017 335350 337157
64428 337157 340744 346394 353118 359331 363929 367005 369478 371897 373946 375483 377556 381491 386995 392059
64414 392059 394964 395650 394907 393246 391207 389866 390010 391273 392939 395172 398446 402110 404719 405850 406604
64399 406604 408160 410740 414144 418329 423023 427613 431986 436871 442817 449275 455265 460662 466419 473688
64385 473688 482880 493325 503754 513478 523192 534188 546853 560652 575690 593326 614767 639789
64373 639789 667322 696551 726879 757730 789405 823624 862234 905626 953194 1004920 1061467
64362 1061467 1122900 1188432 1257561 1330577 1407645 1488030 1570425 1653567 1736390 1817944 1897008
64351 1897008 1971385 2037882 2093843 2138639 2172931 2196635 2208523 2207752 2194661 2169800 2133302 2085767
64339 2085767 2028928 1964796 1894760 1819929 1741606 1660779 1577801 1493291 1408912 1326569 1247120
64328 1247120 1170358 1096051 1024747 957999 897973 846051 801372 761450 724743 691752 662993
64317 662993 637119 612364 588959 568418 550821 534557 518869 504950 493937 485124 476884 468372
64305 468372 459695 451218 443349 436233 429040 420282 409562 398398 388662 380716 373653 366703 359625 352331
64291 352331 345122 339020 334927 332578 331112 330452 331233 333492 336401 339447 342932 346926 350462 352231 351654
64276 351654 349006 344987 340562 336778 334296 333300 333980 336591 340569 344056 345030 343053 339654 336957 336012
64261 336012 336244 336207 334961 332872 331063 330041 329196 327769 325873 324133 322675 321131 319510 318349 317744
64246 317744 316833 314701 311567 308672 307005 306337 305460 303251 299602 295510 292260 290376 289280 287814 285093
64231 285093 281031 276421 272450 269780 267967 266054 263751 261698 260486 259971 259825 260190 261311 263041 265413
64216 265413 269122 274399 279648 282630 283415 284882 289486 296476 303294 308910 314416 320634 326665 331116
64202 331116 333612 334584 334514 334088 334478 336587 340152 344063 347393 349862 351650 353237 355060 356861 357637 356806
64186 356806 355214 354375 354709 355100 354241 351940 349096 346983 346686 348673 352484 357149 362171 367882 374642
64171 374642 382142 389881 398025 407218 417539 428194 438540 449093 461030 474640 488693 501747
64159 501747 513804 525966 538303 548933 556041 560283 563998 567967 570197 568470 563111 556220 548742
64146 548742 539492 527088 511823 495287 478816 462834 447426 433002 420197 409130 398995 388825
64134 388825 378764 370073 363552 358563 354219 350916 349642 350080 350655 350570 350554 351279 352308 353287 355019 358292
64118 358292 362491 366418 369844 373050 375366 375507 373210 369232 363779 356344 347399 338939 332607 328112
64104 328112 324054 319533 314400 308748 302958 297727 293345 289378 285640 282872 281659 281204 280163 278433
64090 278433 277073 276471 275696 274015 272215 271734 272955 274909 276491 277539 278749 280864 284051 287878 291714
64075 291714 295081 297715 299505 300374 300137 298599 296154 294091 293589 294179 294079 292647 291654 293090 296214 298148
64059 298148 297348 295114 293400 292555 292114 292540 294718 298269 301800 304918 308774 314291 320872 327455 333975
64044 333975 340917 347802 353186 356315 357983 359292 360121 359579 357794 356341 356586 358205 359989 361704 364206
64029 364206 367589 370156 369926 366796 362502 358555 354893 350671 345696 340485 335232 329448 322795 315840
64015 315840 309626 304742 301113 298438 296305 293931 290523 286320 282893 281801 283035 285135 286701 287334
64001 287334 287238 286655 286063 286352 288086 290588 292352 292691 292715 294158 297201 299935 300369 298635 296639 295731 295525
63984 295525 295124 294549 294351 294616 295212 296427 298357 299950 299837 298196 296813 297100 298844 301023 302952 304459
63968 304459 305852 308078 311974 316900 320967 323160 324496 326570 329784 333568 337376 340635 342648 343719
63954 343719 345706 350188 356349 361724 364780 365789 365594 364805 364096 364034 364520 365358 367268 371071 375818 379150
63938 379150 380102 380366 382206 386090 390956 395851 400546 405279 410712 417602 425950 434970 444277 454334
63924 454334 465213 475922 485913 496433 509224 524260 539891 554927 569581 584529 600197 617057
63912 617057 635628 655881 677345 700050 724735 751843 780759 810189 838961 866631 893972
63901 893972 923014 955906 993457 1035066 1080088 1128685 1181377 1238530 1300673 1368766 1443836
63890 1443836 1526696 1618239 1719598 1831910 1956370 2094585 2248017 2416610 2598516 2791683
63880 2791683 2995150 3208287 3429438 3656148 3886302 4118027 4348390 4572861 4786039
63871 4786039 4982312 5156158 5303003 5420358 5507469 5563387 5585931 5573073 5524853 5443248
63861 5443248 5330326 5187313 5015731 4819021 4602761 4373352 4136482 3896391 3656008
63852 3656008 3417544 3183176 2955534 2737674 2532356 2341188 2164610 2002878 1856779
63843 1856779 1726896 1612262 1510420 1419159 1337817 1266461 1204177 1148847 1098585 1052783 1011560
63832 1011560 974740 941753 912167 885785 862339 841544 823397 807902 794405 781776 769711
63821 769711 759464 752648 749314 747821 746781 746521 748243 752308 758132 765606 775557 788418 803211 818621
63807 818621 834783 853142 874478 897749 921255 944506 968530 994502 1022390 1050794 1077791
63796 1077791 1101998 1123154 1141700 1157704 1170326 1178614 1182671 1183580 1182071 1177773 1169995 1158788 1144622
63783 1144622 1127285 1105858 1080026 1050892 1020125 988675 956679 924311 892016 859901 827521
63772 827521 794697 762198 731200 702190 674836 648865 624577 602285 581701 562307 544177
63761 544177 527930 513850 501478 490229 479935 470563 461824 453527 445852 438592 430477 420311 408970
63748 408970 399228 393034 389621 386815 383395 379365 374794 369742 364977 361300 358017 353367 346840 339871
63734 339871 333785 328228 322383 316667 312118 308751 305622 302146 298474 294954 292051 290482 290508 291336 292010
63719 292010 292524 293194 293403 292295 290517 289818 290670 291557 291075 289551 288036 286723 285256 283832 283108 283248
63703 283248 283683 283625 282640 281073 280027 280440 282036 283846 285680 288170 291159 293261 293557 292722 291815 291060
63687 291060 290666 291703 294819 298761 301557 302870 304116 306618 310701 316135 322220 327578 331147 333394
63673 333394 335543 337745 339209 340062 341682 344940 349393 354599 360982 368711 376777 384065 390675 397483
63659 397483 404877 412557 420179 427594 434615 440901 445941 449176 450468 450397 449508 447351 443038 436839 430334
63644 430334 424753 420088 416101 413078 410884 408324 404471 400141 397214 396841 398908 402668 407015 410524
63630 410524 412191 412206 411538 410977 410972 411927 413983 416774 419961 423609 427558 431087 434036 437626 442996 449250
63614 449250 454218 457096 459187 461990 465815 470471 475955 481830 487068 491332 495584 500581 505441 508589
63600 508589 509652 509580 509246 508752 507797 505979 502938 498997 495406 493069 491110 487684 482265 476202 470814
63585 470814 466147 462196 460275 461978 467193 474165 481395 488587 495777 502555 508701 515017 522889 533002
63571 533002 544701 556622 568053 579865 593955 611465 631606 652459 672748 692460 712120
63560 712120 732254 753530 776561 801408 827884 856437 887872 922087 958195 996289 1037875
63549 1037875 1083781 1132795 1183451 1236044 1291292 1347641 1401633 1450819 1494718 1532876 1563773
63538 1563773 1586282 1600899 1608752 1610362 1606053 1596697 1583338 1566726 1547831 1528034 1507976 1486594
63526 1486594 1461981 1433045 1400169 1364910 1329512 1296007 1265021 1235648 1207027 1179754 1155368
63515 1155368 1134824 1118033 1104668 1094856 1088964 1086851 1087402 1089113 1091503 1095630 1102568 1111658 1121265
63502 1121265 1131130 1142730 1157086 1173582 1191451 1211044 1232825 1256376 1281456 1308892 1339104
63491 1339104 1370734 1402269 1434421 1469434 1508453 1551145 1597673 1649220 1705881 1764941 1821605
63480 1821605 1871033 1909987 1937620 1954874 1962648 1960856 1949941 1932536 1912093 1890006 1865584 1838947
63468 1838947 1812204 1786928 1761682 1733172 1699320 1660491 1618218 1573594 1526907 1478302 1428505
63457 1428505 1378739 1329941 1282461 1236786 1194004 1154928 1119266 1086448 1056709 1030290 1006052
63446 1006052 982358 959308 938603 921034 905499 890891 877399 865362 854293 844004 835346
63435 835346 828546 821788 812901 801929 790795 780765 771507 762493 754140 747297 742404 739311 737318
63422 737318 735266 732269 728661 725902 725283 726754 728967 730391 730626 730833 732713 736834 742116 747028 750875
63407 750875 753652 755150 754749 751949 746723 739480 730995 722147 713344 704407 695425 687471 681913 679054
63393 679054 677980 677925 679272 682848 688453 694666 700422 706502 714941 726833 741180 756237 771669 788796
63379 788796 808996 832493 858662 886807 916529 948055 982486 1021061 1063628 1108061 1151522
63368 1151522 1192158 1229552 1264037 1295980 1325550 1353067 1379728 1407893 1440113 1477632 1520097
63357 1520097 1566676 1616950 1670774 1727993 1788461 1851485 1914698 1973998 2025178 2065523 2093917
63346 2093917 2110266 2115398 2111062 2099348 2082157 2061209 2037891 2012552 1984346 1952233 1916010 1876277
63334 1876277 1833864 1789594 1744135 1697791 1650784 1603867 1558133 1514146 1472062 1432744 1397782
63323 1397782 1367923 1342433 1320703 1303456 1291385 1283358 1277203 1271926 1268217 1267083 1269005 1274251 1282981
63310 1282981 1294924 1309586 1326738 1346228 1367601 1390619 1415946 1444643 1477121 1513113 1552299
63299 1552299 1594226 1637986 1682869 1729271 1778230 1830130 1884389 1939954 1995221 2047732 2094983
63288 2094983 2135494 2168311 2191831 2204329 2205740 2197894 2182840 2161878 2136164 2106944 2074720 2039170
63276 2039170 2000381 1959233 1916098 1870174 1820749 1768355 1714071 1658537 1602446 1547211 1494102
63265 1494102 1443273 1394774 1350113 1311515 1279485 1252315 1228385 1207815 1190998 1176225 1160077
63254 1160077 1140235 1117062 1092295 1067085 1041806 1016853 992583 968820 945476 923547 904292
63243 904292 887221 870006 851030 831094 811950 794046 776690 759777 744093 730030 717043
63232 717043 704404 691842 679501 667882 657704 649200 641730 634548 627548 620617 612920 603883 594585
63219 594585 586909 581349 576709 571898 566928 562046 557117 552218 547829 544067 540539 537133 534029 530770
63205 530770 526392 520789 514925 509312 503389 496845 490434 484849 479917 475560 472435 470719 469328 467377
63191 467377 465472 464356 463245 460992 458304 457057 457497 457742 456403 454318 453061 452742 452118 450343 447892
63176 447892 445921 445180 445480 445948 445751 444664 442947 440823 438334 435795 434109 434314 436560 439623 441820
63161 441820 442642 443185 444630 446798 448843 450873 453670 456838 458698 458546 457801 458011 458817 459016 458867 459998
63145 459998 463379 468589 474859 481692 488476 494617 500294 506272 512923 520165 528309 537977 548994 560233
63131 560233 570843 580920 590830 600785 611416 623800 638355 654368 671108 688661 707022 725131
63119 725131 741734 756812 771208 785062 797585 808473 818631 829053 839517 848886 856449 862487
63107 862487 867529 871415 873316 872549 869137 863537 856073 846779 835509 821832 805115 785419 764463
63094 764463 744897 728099 713113 698269 683366 669550 657374 646034 634683 623602 613670 605310
63082 605310 598372 592506 587153 581730 576418 572352 570313 569609 569103 569073 570984 575324 580747 585705 589977
63067 589977 593984 597599 600602 603720 608089 613828 620179 627036 635317 645536 656790 667706 677894
63054 677894 687992 698677 710123 722185 734608 747035 759195 771175 783375 796178 809814
63043 809814 824528 840584 857847 875437 892155 907476 921943 936323 950520 963688 975302
63032 975302 985530 994381 1001111 1004873 1005674 1004261 1001214 996321 988669 977296 962211 944899 927274
63019 927274 909950 892259 874136 856902 841435 826670 811143 795233 780497 767286 754616
63008 754616 742248 731288 722522 715602 710195 706526 704225 701928 698831 695787 694218 694639 696633 699337
62994 699337 701593 702676 703521 706259 711914 719426 727397 735616 744082 751917 758585 765211 773291 782665
62980 782665 792150 801630 811914 822704 832213 839213 844402 849409 855246 862074 869774 878167 886805 894849
62966 894849 901419 906358 910489 914462 917344 917342 914372 910841 909187 909643 911326 914289 918976 924502 929386
62951 929386 933843 939713 948041 958164 969318 981693 995569 1010731 1027216 1045517 1065509 1086164
62939 1086164 1106769 1127465 1148190 1168210 1187307 1206305 1225546 1243700 1259180 1272242 1284637
62928 1284637 1297414 1309913 1320840 1329418 1335259 1337803 1336551 1331796 1324539 1315187 1302438 1284169 1259841
62915 1259841 1231494 1201774 1171455 1139734 1106612 1073800 1043090 1014812 988299 963054 939023
62904 939023 916299 895099 875723 858212 842298 827718 814215 801273 788442 775960 764478
62893 764478 754060 744094 734167 724295 714202 703338 691903 680967 671079 661436 650910 639277
62881 639277 627073 614922 603366 592683 582464 572146 562311 554460 548896 543915 538059 532242 528381
62868 528381 526536 524719 521292 516273 510487 504743 500012 497109 495608 493971 491369 488886 488451 490836
62854 490836 494925 498597 500178 499521 498058 497612 498916 501352 504041 506881 510484 515379 521401 527734 533720
62839 533720 539851 547704 558285 570532 582154 592052 601132 610444 619406 626696 632339 637717 643399
62826 643399 647865 648855 645499 638735 630198 621258 612747 604676 596062 585693 573418 560346 547639
62813 547639 535649 524426 514396 505936 498770 492465 487084 482539 477698 471281 463693 456858 451929
62800 451929 448186 444658 441711 440146 439641 439211 438687 438431 437848 435626 431788 428264 426702 426517 425898 424135
62784 424135 422022 420268 418579 416633 415182 415507 417842 420737 422098 420967 418444 416777 417218 418625 418609
62769 418609 416278 413438 412637 414373 416966 418937 420489 422380 424321 425311 425075 424401 424171 424677 425759 427046
62753 427046 428049 428426 428207 427543 426478 425274 424623 424939 425633 425649 424610 422906 420899 418706 416659 415166
62737 415166 414066 412842 411532 410728 410574 410541 410384 410473 410942 411357 411627 412377 413735 414493 413290 410247 406752
62720 406752 404027 402632 403106 406083 411459 417880 423472 427102 429022 430373 431971 433618 434719 435326 436087
62705 436087 437251 438416 439411 440699 442508 444211 445109 445341 445499 445660 445389 444532 443567 443265 444106 445718 446817
62688 446817 446281 444517 443063 442433 441199 437919 433314 429483 427468 426706 426706 427894 430426 433203 434801 435055
62672 435055 435114 436099 437977 439768 440743 441330 442748 445791 450300 455897 462639 470452 478394 485303 491172
62657 491172 497251 504701 513650 523608 534181 545143 556393 568324 581887 597831 615966 635579
62645 635579 656505 679341 704450 731263 759032 788086 819694 854491 891582 929505 967638
62634 967638 1006143 1044927 1083246 1120097 1154401 1185076 1211700 1234899 1255138 1271082 1280133 1280845
62622 1280845 1274017 1261226 1243214 1220109 1192317 1160612 1125940 1089492 1052301 1014462 975547
62611 975547 936069 897565 860836 825266 790574 758052 729071 703317 679595 657539 637405
62600 637405 618926 601628 585663 571174 557493 544157 532041 522073 513464 504863 496737 490758
62588 490758 486941 483328 478729 473937 469774 465705 461247 457229 454523 452557 450176 447281 444645 442660
62574 442660 441170 440189 439989 440534 441310 441750 441597 440959 440091 439016 437419 435070 432113 428719 424907 421195
62558 421195 418729 417882 417249 415137 411734 408596 406266 403901 401247 399368 398997 399569 400472 401958 404062
62543 404062 405736 405871 404343 401500 397593 393359 390086 388230 386802 384934 383259 382917 383892 385200 386088
62528 386088 386270 385692 384928 385208 387067 389370 390432 389739 387984 386129 385110 385592 386888 386811 383987 380053
62512 380053 378327 380274 384238 387504 388555 387387 384852 382173 380327 379431 379052 379199 380466 383172 386872
62497 386872 390842 394615 397978 400904 403557 405949 407558 407717 406580 405413 405700 407986 411540 415116 418094
62482 418094 420886 424044 427190 429404 430711 432441 435753 440430 445585 450862 456296 461548 466132 470225
62468 470225 474672 480322 487706 496940 507467 518349 529332 541102 554002 567226 580113 593562
62456 593562 609078 626914 646247 666738 688586 711369 734325 757773 782714 808703 833574
62445 833574 855735 875404 892935 907388 917881 925244 930974 935158 936740 935493 932406 928155 922400
62432 922400 914938 906620 898690 891833 886349 882709 881399 882499 885940 892001 901082 913098 927654 944763
62418 944763 964697 986837 1009455 1031349 1053245 1076617 1101195 1124531 1144155 1159088 1168918 1172653
62406 1172653 1169681 1161283 1149851 1136460 1120019 1098926 1072852 1042743 1009878 975428 940533 906211
62394 906211 872965 840599 808514 776483 745244 716125 689887 666284 644966 626261 610453
62383 610453 596632 583162 569403 556386 545589 537539 531785 527675 524719 522292 519434 515273 509894
62370 509894 504657 501131 499479 498262 496118 493187 490512 488632 487393 486653 486299 485845 484903 483924 483677 484080
62354 484080 484353 484257 484292 484708 485277 486097 487614 489634 491367 492799 495018 498709 503265 507986 513142 519017
62338 519017 524712 529002 531949 534799 538633 543905 550938 559806 569784 579744 589134 598119 607012 616463
62324 616463 627943 642776 660291 677898 693708 708560 724946 744426 766706 790710 815645
62313 815645 841181 867596 896061 928041 963878 1002478 1042858 1085518 1131642 1181395 1234038
62302 1234038 1289662 1349639 1414957 1485111 1559426 1638699 1724425 1816653 1913624 2013356 2114502
62291 2114502 2215463 2313630 2406027 2490053 2563118 2622212 2664669 2689307 2696514 2687487 2663760
62280 2663760 2627154 2579394 2521496 2453767 2376713 2291931 2202170 2110580 2019961 1932499 1849755
62269 1849755 1772382 1699774 1630536 1563870 1500523 1442092 1389467 1342174 1299104 1259476 1223100
62258 1223100 1189962 1159675 1131243 1103474 1075725 1048018 1020425 992957 966474 942913 923590
62247 923590 907464 892074 876224 860835 847203 835549 825564 817174 809940 802627 794488 786585 780876
62234 780876 777993 776688 775594 774880 775809 778998 783681 788861 794787 802625 812555 822953 832124 840410
62220 840410 849742 861411 875258 890862 908199 926795 945500 963906 983195 1004852 1029227 1056016
62208 1056016 1085396 1117769 1152965 1190704 1231639 1277023 1327363 1382041 1440262 1501976 1568106
62197 1568106 1640325 1720249 1808092 1902201 2000291 2100878 2202899 2304271 2401603 2491190 2569602
62186 2569602 2633494 2679957 2707607 2717066 2710176 2688875 2654504 2607605 2548245 2476975 2395521 2306291
62174 2306291 2211440 2113014 2013856 1917477 1826469 1741287 1660863 1584336 1512112 1445357 1384634
62163 1384634 1329157 1277593 1229514 1185641 1146523 1111605 1079967 1051390 1025989 1003269 982440
62152 982440 963461 946847 932425 919255 906980 896407 888215 881736 875682 869807 865214 862946 862698
62139 862698 863216 863831 865162 868113 872621 878131 885087 894851 907752 922319 937292 953472 972322
62126 972322 993420 1014835 1035830 1057612 1081102 1105411 1129199 1152474 1176301 1201444 1227941
62115 1227941 1255408 1283199 1310720 1338076 1366100 1395670 1427742 1464095 1506852 1556592 1611840
62104 1611840 1671164 1734794 1803190 1874858 1946878 2017028 2083975 2145580 2198530 2240007 2268772
62093 2268772 2284498 2287246 2277990 2258502 2229856 2191694 2143700 2087299 2025036 1958628 1888508 1815292
62081 1815292 1740867 1667781 1598098 1533198 1474025 1420721 1372117 1326466 1283224 1243768 1209886
62070 1209886 1181775 1158124 1137996 1121726 1109648 1100794 1093735 1088453 1086498 1089263 1096765 1108242
62058 1108242 1123099 1140600 1159038 1176065 1190192 1201757 1212281 1223016 1234209 1245630 1257411
62047 1257411 1270029 1283336 1295812 1305009 1308902 1306928 1299990 1289787 1278102 1266309 1255156 1244884
62035 1244884 1235603 1227527 1220879 1215756 1212317 1211068 1212705 1217579 1225469 1235956 1248849 1264069 1281349
62022 1281349 1300493 1322012 1347113 1376781 1410955 1448706 1488936 1530674 1573024 1615484 1658506
62011 1658506 1703378 1751268 1802439 1856443 1912834 1971540 2032665 2096087 2161168 2226682 2291096
62000 2291096 2353022 2411478 2465609 2514188 2555437 2587398 2608539 2618128 2616210 2603404 2580705 2549157
61988 2549157 2509407 2461620 2406122 2344082 2277150 2206377 2131986 2054525 1975830 1898449 1824410
61977 1824410 1754811 1690114 1630143 1574146 1521686 1473428 1430261 1391643 1355837 1322120 1291886
61966 1291886 1266803 1246465 1228693 1211896 1196259 1182482 1170089 1157547 1143891 1129706 1116293
61955 1116293 1104061 1092142 1079697 1067116 1055516 1045307 1035791 1026171 1016517 1007739 1000945 996683
61943 996683 994314 992349 990061 988664 990093 994686 1001033 1008062 1015892 1024129 1030778 1033968 1033846 1031649
61929 1031649 1027726 1021803 1014462 1006650 997831 986314 971814 956441 942599 930844 920237 909834
61917 909834 899173 888077 876849 866355 857381 850076 844301 840072 837174 834742 831780 828071 824263
61904 824263 821078 818643 816504 814214 811982 810737 811356 813855 817574 822087 827622 834677 843535 854062
61890 854062 865616 877347 889205 902543 919023 939011 961797 987266 1016139 1048283 1082013
61879 1082013 1115991 1150903 1188270 1228206 1269388 1310837 1352684 1395294 1438607 1482368 1526166
61868 1526166 1569026 1609538 1646578 1679513 1707853 1731260 1749864 1763859 1772675 1775192 1771057 1761294
61856 1761294 1747482 1730851 1712474 1693833 1676693 1662632 1652879 1648232 1648709 1653463 1661540 1672788
61844 1672788 1687737 1706564 1728329 1751330 1773902 1794613 1811765 1823208 1826998 1822209 1809036 1788405
61832 1788405 1761859 1731408 1698629 1663703 1626008 1585808 1544599 1503562 1462641 1421957 1383202
61821 1383202 1348439 1317813 1289475 1261556 1233319 1204807 1176820 1151291 1130163 1113239 1098172
61810 1098172 1083186 1068879 1056825 1047530 1040746 1036866 1036746 1040558 1048002 1059424 1075535 1095905 1118867
61797 1118867 1143337 1170049 1200548 1235520 1274570 1317273 1363865 1414901 1470618 1530785 1595018
61786 1595018 1662968 1734088 1807271 1880810 1952647 2020616 2082692 2137388 2183825 2221103 2247855
61775 2247855 2262966 2266681 2260411 2245631 2223956 2198369 2172890 2150041 2129515 2110465 2094455 2084812
61763 2084812 2083331 2088934 2099480 2113486 2129541 2145164 2157228 2163200 2161553 2151353 2131987 2103179
61751 2103179 2065011 2017921 1962755 1900742 1833511 1763208 1692165 1621989 1553125 1485709 1420510
61740 1420510 1358533 1300200 1245792 1196366 1152961 1114877 1079897 1046626 1015644 988046 963835
61729 963835 942270 922806 905051 888585 873458 860040 847748 834925 820908 807295 796010
61718 796010 786850 778319 770212 763648 758610 753283 746463 739227 733341 728917 724646 719871 715454 712551
61704 712551 711150 710074 708290 706025 704482 704553 706196 709103 713264 718332 723041 726176 727883 729099 729905
61689 729905 729527 728013 726706 726711 727932 730072 733446 737866 741585 742508 740306 736664 733692 732597 733448 735453
61673 735453 737625 739750 742508 746253 750096 752880 754584 755983 757323 758350 759449 761610 765123 769282
61659 769282 773500 777747 781690 784543 786307 788160 790903 793923 796533 799396 803417 807727 810135 809570
61645 809570 807015 803998 801226 798876 797095 795643 793807 791205 788086 784432 779524 773080 766320 761103
61631 761103 758242 757217 757086 756967 755975 753733 750955 748636 746531 743349 738760 734263 731385 729707 727489
61616 727489 723841 719390 715035 711135 708147 707083 708477 711193 713026 712658 710637 708363 706526 704902
61602 704902 703367 702491 702888 704356 706011 707149 707662 707705 707489 707619 709231 713272 719513 726542 732902 738214
61586 738214 743132 748336 753910 759827 766626 774955 784387 793395 801011 807991 815585 823395 829371 832059
61572 832059 832029 830727 828645 825256 820228 813921 806844 799313 791756 784809 778847 773672 768881 764437 760729
61557 760729 758073 756230 754555 752561 750176 747433 744245 740731 737328 733970 729498 722651 713594 703593
61543 703593 693226 682046 670324 659770 651650 645170 638802 632342 626347 620142 612092 602015 591948
61530 591948 584102 578938 575661 573730 573275 574346 576122 576760 574356 568651 561682 556104 552949 551570 551282
61515 551282 551882 552661 552302 550282 547453 544830 542596 540512 538331 535488 531474 526822 522635 518733 513833
61500 513833 508307 505024 505868 508681 509558 507448 504599 502908 501999 501023 500193 499667 498536 496111 493232 491225
61484 491225 490187 489203 487815 486465 485792 486155 487671 490107 492860 495521 498369 501855 505710 509020 511181
61469 511181 512342 512805 512436 511014 508924 506967 505353 503212 499481 494148 488296 483087 479217 477208 477245
61454 477245 478221 477774 474361 469076 464634 462630 462546 463171 463886 464255 463524 461303 458255 455421 453172 451311
61438 451311 449857 449122 449236 450121 451801 454156 456353 457146 455984 453555 451078 449291 448198 447418 446441 444845
61422 444845 442786 441243 441257 442710 444250 444709 444239 443727 443630 444039 445471 448389 451881 453983 453826 452469
61406 452469 451020 449014 445726 442156 440286 440710 442314 444047 445595 446472 446120 445319 445913 448394 451019
61391 451019 452113 452086 452252 452833 453384 454296 456324 459012 460974 461701 462027 462904 464701 467547 471267 474978
61375 474978 478024 481449 487255 495576 503684 508642 510306 510861 511951 513357 514366 515324 517224 520234 523406
61360 523406 526042 528860 533216 539245 545428 550348 554197 557876 561113 562561 561756 559958 558747 558564 559001
61345 559001 559684 560238 559930 558115 554863 550763 546338 541950 537874 534003 529857 525336 521077 517587 514444
61330 514444 511039 507774 505760 505458 506370 507953 510035 512296 514177 515587 517049 518862 520639 521952 522905
61315 522905 523880 525246 527539 531204 535677 539352 541130 541596 542085 542935 543469 543504 544073 546403 550719 556258
61299 556258 562097 567821 573648 580126 587666 596236 605408 614432 622392 628922 635130 643219 654535 668230
61285 668230 682360 695814 708452 719935 729842 738901 748601 759030 768395 775558 781964 789946 799801
61272 799801 809695 817941 824063 827933 829382 829011 828238 827908 827496 826002 822940 818193 811791 804455 797630
61257 797630 792207 787606 782782 777651 772721 767812 762362 757085 754098 754713 757814 761142 763747 766457
61243 766457 770270 775259 781087 787524 793899 798788 801206 801815 801959 801426 798183 790858 780766 770723
61229 770723 762348 755371 749218 744006 739805 736127 732930 731368 732543 735772 739042 741181 742937 745801
61215 745801 750544 757148 765418 774974 784966 794566 803821 813579 824461 836285 848651 861648 875503
61202 875503 889620 902516 913143 922265 932276 945481 962417 981749 1001550 1020509 1038053 1053790
61190 1053790 1067279 1078447 1088036 1097413 1107738 1119034 1129938 1138512 1143601 1145376 1144407 1140500 1133016
61177 1133016 1122384 1110583 1099646 1090019 1080744 1070857 1060099 1048722 1037398 1027171 1018642 1011155
61165 1011155 1003528 995644 988507 982664 977607 973124 969952 968150 965766 960508 952456 943977 937049 931697
61151 931697 927067 922874 919407 916874 915159 913770 911929 909311 906743 905460 905426 905184 903677 901601 900706
61136 900706 902391 907230 914964 924461 934545 945577 959506 977486 998033 1018342 1036915 1053935
61124 1053935 1069563 1083205 1094471 1103794 1111970 1119894 1128767 1139486 1151523 1163276 1173956 1184378
61112 1184378 1195471 1206751 1216784 1224651 1230435 1234756 1238250 1241119 1242879 1243050 1242342 1242283 1243013 1242225 1237255
61097 1237255 1227841 1215902 1203107 1189909 1176809 1165086 1155606 1147888 1141011 1134901 1130090 1126661 1124042
61084 1124042 1121630 1119107 1116223 1112603 1107630 1100398 1090126 1076999 1062402 1047992 1034615 1022203
61072 1022203 1010397 999021 988312 979086 972352 968331 966005 964074 962282 961453 962409 965326 970104 976955
61058 976955 986442 999089 1014785 1032448 1050584 1068600 1087351 1108053 1130886 1155061 1179880 1205033
61046 1205033 1230095 1254647 1278961 1303844 1329566 1355556 1381222 1406386 1430613 1452830 1472022
61035 1472022 1487935 1500736 1510336 1516350 1518457 1516649 1511431 1503832 1494872 1484978 1474270 1463101 1451585
61022 1451585 1438836 1423732 1406650 1389467 1373697 1359593 1347173 1336725 1327841 1319383 1311227 1304714
61010 1304714 1300406 1296913 1293310 1291419 1293848 1300639 1309780 1320518 1334165 1351698 1372380 1394943 1418645
60997 1418645 1443093 1468609 1497016 1530504 1569240 1611351 1655585 1702613 1753254 1806924 1862811
60986 1862811 1921661 1985438 2055553 2131839 2213011 2298196 2388510 2486660 2594153 2709455 2830186
60975 2830186 2956518 3090640 3233432 3384145 3543581 3715045 3901175 4101744 4315232
60966 4315232 4540383 4775401 5018242 5269523 5533383 5814101 6113829 6435067 6782892
60957 6782892 7162334 7575312 8022541 8507032 9033775 9608190 10238083 10935938 11716659
60948 11716659 12594339 13583674 14702489 15970237 17408080 19046565 20930984 23112142
60940 23112142 25632828 28527375 31816905 35459807 39268557 42884065 45885533 47985471
60932 47985471 49157549 49602555 49614110 49474011 49417276 49596484 49998430 50384037 50358320 49561915
60922 49561915 47845256 45301131 42167953 38711654 35161768 31694194 28426169 25417365
60914 25417365 22686198 20233193 18053544 16137063 14467311 13024408 11786269 10727144
60906 10727144 9818549 9033281 8347931 7742831 7202568 6716955 6279446 5884146 5525590
60897 5525590 5200646 4908009 4645365 4408847 4195335 4002925 3828356 3666032 3510904
60888 3510904 3361130 3217042 3078981 2947342 2823493 2708820 2602961 2503990 2410309 2321714
60878 2321714 2238748 2161672 2090060 2022889 1958888 1897068 1837140 1779461 1724512 1672261 1622012
60867 1622012 1573111 1525825 1481046 1438894 1398253 1358157 1319051 1281891 1246517 1211940 1178061
60856 1178061 1146097 1117170 1091218 1067341 1044535 1022096 1000142 979815 962199 946869 932169
60845 932169 917089 902207 888716 877235 867759 860000 853485 847909 843563 840775 838849 836394 832932
60832 832932 829291 826027 822450 817912 813222 809731 807355 804486 799863 793851 787713 782117 776542 769969
60818 769969 761914 752798 743395 734194 725505 717765 711126 704765 697333 688408 679055 670648 663538 657094
60804 657094 650682 644313 638631 634465 632119 630931 629811 628261 626519 624707 622546 620152 618468 618410 620055
60789 620055 622983 626858 631045 634165 634965 633761 632488 633034 635601 638676 640581 641199 642160 645034 649344
60774 649344 652864 653998 653243 652003 650809 649422 648033 647170 646429 644443 640640 636418 633908 633776 634774
60759 634774 635473 635915 637104 639082 640241 638998 635642 631770 628064 623576 617502 610642 604421 599112 593952
60744 593952 588616 583616 579232 574981 570433 565865 561695 557768 553708 549666 546136 543053 539660 535591
60730 535591 531682 529140 527939 526671 524278 521334 519120 517893 516893 515743 514775 514013 513043 512293 513198
60715 513198 516277 519908 522085 522806 523736 525966 529295 533416 538464 544219 549920 555407 561620 569297 577709
60700 577709 585260 591154 596028 601090 606868 612850 618246 623032 627965 633464 638899 643404 646990 650205
60686 650205 653082 655315 657333 660133 663828 667296 669595 670779 670903 669198 665017 658887 651833 644203
60672 644203 635901 627204 618399 609095 598994 589127 581149 575419 570858 566799 563754 561909 560159 557480
60658 557480 554383 551995 550333 548586 546658 545183 544253 543524 543742 546626 552423 558663 562496 563746 564630
60643 564630 566919 570598 575195 581054 588675 597626 606827 615558 623699 631339 638643 645917 653391 660950
60629 660950 668231 674837 680406 684792 688472 692517 697874 704757 712749 721144 729175 736546 744123 753465
60615 753465 764984 776906 786829 794288 801304 810539 823418 839742 858189 876908 894371 910240
60603 910240 925352 940638 956105 970806 983571 993801 1001826 1008458 1013934 1017437 1017995 1015721 1011730
60590 1011730 1006939 1001439 994935 987101 977274 964488 948352 929797 910690 892773 876829 862436
60578 862436 848338 833431 817717 802342 788654 777182 767303 757691 747440 737105 728342 722065
60566 722065 717382 712939 708779 705846 704025 702137 700093 699474 701269 704235 706525 708023 709872 712273
60552 712273 713946 713678 711487 708332 705332 703145 701387 698728 694182 688275 682569 678168 675075 672615
60538 672615 669868 666033 661138 656260 652438 649565 646981 644691 643013 641308 638458 634894 632972 634612
60524 634612 639357 645411 651925 659325 667777 676359 684067 691214 699415 710181 723619 738597 754114
60511 754114 770292 787933 807511 829118 853223 880773 912158 946281 980789 1013147 1041618
60500 1041618 1065542 1084777 1098831 1106677 1107643 1102287 1092230 1079433 1065915 1053646 1043983 1037388
60488 1037388 1034339 1036294 1044972 1060730 1082442 1108981 1140045 1175474 1214646 1256690 1300430 1343710
60476 1343710 1383648 1418065 1446122 1467219 1480027 1483296 1477250 1463871 1446285 1427995 1411821 1398743
60464 1398743 1387979 1378474 1369953 1362525 1356244 1351485 1348773 1347584 1346278 1344185 1343080 1345642 1352980 1364505
60450 1364505 1379467 1397469 1418152 1441811 1470063 1504506 1544841 1589688 1639300 1696061 1762109
60439 1762109 1837821 1922902 2017427 2120963 2231852 2348305 2469250 2592976 2715519 2831397
60429 2831397 2935626 3024231 3093237 3138395 3156258 3145145 3105044 3037091 2943393 2827238 2693455
60418 2693455 2548339 2398573 2249624 2105087 1967445 1838804 1720510 1612565 1514085 1424276
60408 1424276 1342680 1268850 1202367 1143065 1090646 1044065 1001799 962874 927334 895582 867545
60397 867545 842665 820490 800949 783925 768712 754270 740213 727298 716548 707906 700102 691829
60385 691829 682715 673210 664084 656198 650250 646431 644553 644506 646042 648007 648510 646286 641509 635096 627887
60370 627887 620774 614667 609528 604095 597369 589846 582487 575163 567315 559726 554121 550925 548648 545840
60356 545840 542631 540012 538596 538556 539777 541448 542299 541958 541489 541854 542372 541455 538630 535174 532899 532624
60340 532624 533535 533727 531855 528746 526909 527919 530708 532980 533731 533628 533523 533702 534303 535183 535318 533582
60324 533582 530478 528051 527619 528530 529700 531441 534795 539694 544732 548529 550600 551129 550632 549778 548907 547777
60308 547777 546297 545229 545504 547013 548927 551052 553890 557264 560067 561881 563783 566718 569862 571682
60294 571682 572081 572323 572995 573369 573060 573196 575186 578926 582901 585801 587529 588880 590728 593407 596501 599214
60278 599214 601228 603108 605689 609198 613133 616698 619017 619317 617722 615963 616533 620528 626529 632075 636247
60263 636247 640463 646653 654990 663788 671470 678141 685001 692709 700982 709611 718898 728806 738522 747711
60249 747711 757758 770829 787764 807773 830259 856064 886458 921451 959322 997174 1031572
60238 1031572 1059408 1078955 1089885 1091790 1083223 1063022 1032503 995617 956920 919729 885842 855824
60226 855824 829177 804957 782872 763533 747408 733969 722267 711872 702709 694297 685935 677697
60214 677697 670644 665682 662418 659442 655699 651454 647896 645833 644865 643877 642266 640426 638915 637480 635250
60199 635250 631831 627776 623880 620308 616686 612861 609359 607146 607013 608954 611790 613550 612801 609883 606551
60184 606551 604160 602601 601389 601218 603441 607872 612120 613811 612927 611333 610468 610428 611046 612751 615979 620458
60168 620458 625490 630483 634986 638799 642362 646413 650792 654146 655385 655014 654505 654857 656322 658896 662087
60153 662087 664648 665796 666679 669421 674446 679798 683504 685592 687274 689222 691529 694569 698667 703237
60139 703237 707250 710466 713372 715995 717703 718318 718707 719954 722426 725788 729365 732266 733721 733804 733527
60124 733527 733895 734994 736203 737033 737423 737356 736583 734850 732255 729273 726374 723711 721313 719585 719194 720180
60108 720180 721437 721649 720794 720320 721701 725182 729963 735192 740486 745800 751144 756337 760871 764094 765712
60093 765712 766120 766333 767605 770777 775404 779600 781459 780955 779937 779993 780855 781335 781166 781065 781376 781740 782282
60076 782282 784194 788550 794947 801716 807247 810844 812644 813231 813304 813329 813364 813274 813107 813137 813612 814593 815981 817544
60058 817544 818993 820295 821981 824863 829252 834537 839812 844850 850253 856615 863861 871510 879209 886666
60044 886666 893310 898523 902140 904329 904958 903602 900301 895777 890624 884803 878423 872572 868624 866720
60030 866720 865506 863532 860509 857188 854498 853104 853344 855081 857542 859611 860499 860292 859893 860295 861639
60015 861639 862867 862404 859302 853757 846724 839244 832001 825133 818321 811257 804092 797260 790886 784715
60001 784715 778696 773193 768368 763740 758743 753469 748330 743114 736979 729615 722030 715859 711987 709947
59987 709947 708541 706873 704918 703228 702108 701177 699868 698260 697013 696447 696098 695427 694510 693639 692766 691993
59971 691993 692223 694321 697586 700139 701193 701912 703318 704241 702551 697958 692359 687481 683410 679637 676350
59956 676350 673929 671923 669373 665829 661566 657117 653007 649609 646852 644397 642417 641668 642294 643100 642752
59941 642752 641362 640188 640053 640860 642395 644663 647433 650401 653941 658719 664257 668862 671637 673740 676770
59926 676770 680410 682681 682480 680972 680307 681580 684397 687904 691677 695646 699594 702957 705058 705433 704060
59911 704060 701529 699037 697901 698588 700217 701282 701058 700117 699407 699041 698258 696567 694737 694499 697140 702348
59895 702348 708480 713896 717856 720186 720672 719327 717013 715107 714275 713893 712760 710189 706391 702162 698355
59880 698355 695420 693318 691949 691485 692005 692999 693755 694147 694494 694704 694280 693246 692116 690646 687762 683639
59864 683639 680996 682795 688687 694909 698051 698083 697346 697532 698483 699448 700392 701755 703612 705625 707754 710503
59848 710503 714253 718557 722420 725235 727223 729005 731068 733685 736959 740711 744555 748268 751817 754909
59834 754909 756992 758039 758904 760371 762187 763699 765275 768316 773684 780708 787921 794300 799581 803997
59820 803997 808115 812544 817241 821306 823880 825183 826297 827960 829959 831663 832724 833025 832347 830529 828034
59805 828034 825988 825376 826133 827150 827288 826431 825616 826152 828569 832239 835971 839088 842095 846298 852728 861498
59789 861498 872212 884728 899115 914787 930018 942573 950810 954187 953062 948512 942397 937096 934383
59776 934383 934225 934672 933025 927220 916476 901268 883068 863879 845472 828808 814053 800865 788529
59763 788529 776268 763995 752564 742677 733651 724043 713588 703697 695622 688912 682319 675576 669476
59750 669476 664561 660650 657417 654481 650927 645783 639347 633318 629128 626650 624879 623196 621393 618950
59736 618950 615273 610627 606229 603143 601313 599757 597613 595045 593255 593371 595038 596331 595578 593195 591187
59721 591187 590815 591329 591242 590173 588892 587961 587066 585559 583011 579273 574786 570990 569547 570556 572048 571891
59705 571891 569815 566999 564167 561104 557885 555427 554491 554935 556422 559093 562964 567282 571260 575133 579791
59690 579791 585409 591027 595519 598614 600941 603280 605775 607811 608861 609428 610602 612537 614090 614463 614501
59675 614501 615554 617581 619339 620196 620685 621346 622067 622734 623558 624446 624801 624283 623072 621211 618567 615765
59659 615765 614202 614394 615068 614618 612958 611176 610013 609703 610824 614044 618839 623587 627381 631053 635918
59644 635918 642099 648620 654693 660124 664589 667387 668389 668830 670498 674136 678991 683959 688680 693299
59630 693299 697709 701591 704901 707649 709334 709355 708081 706831 706479 706623 706427 705710 704754 703561 701950 700208
59614 700208 699069 699042 700030 701454 702478 702303 700616 697710 694068 690087 686380 683834 682861 682847 682839 682633 682680
59597 682680 683104 683393 683101 682347 681487 680716 680181 680268 681567 684489 688781 693373 697063 699586 701687 703826
59581 703826 705195 704533 701583 697137 691948 686394 681085 676844 673808 671317 669013 667340 666566 665911 664285
59566 664285 661613 658973 657571 657864 659421 661261 662448 662567 661552 659167 655164 650057 645128 641199 637883
59551 637883 634517 631315 628848 626761 623997 620442 617490 616466 616934 617015 615224 611780 608289 606359 606306
59536 606306 606898 606452 604411 601878 600482 600795 602053 603286 604305 605364 606213 605974 604112 601190 598440
59521 598440 596686 595877 595451 594785 593348 590802 587236 583234 579571 576830 575092 573764 571877 569041 566226
59506 566226 565121 566432 569113 571473 572701 573020 572878 572604 572700 573685 575516 577615 579684 582109 585252 588686
59490 588686 591542 593599 595781 599449 605247 612630 620436 627864 634945 642406 651373 663055 678107 696025
59476 696025 715519 735705 756425 776968 795072 808125 815290 817738 816912 813499 808189 802261 796676
59463 796676 791368 786190 782019 780034 780274 781799 784003 786771 789362 790414 789635 788580 788891 790133 790150
59448 790150 787419 782367 776341 769962 762938 755052 746750 738690 731178 724213 717828 711987 706217 699798
59434 699798 692563 685367 679491 675640 673540 672345 671225 669708 667850 666244 665669 666483 668222 669807 670300
59419 670300 669726 669273 670493 674155 679825 686408 692795 698149 702226 705816 710345 716381 722668 727117 728642
59404 728642 727738 725654 723714 723145 724568 727338 730096 732255 734493 737655 741915 747325 754379 763394 773823
59389 773823 784885 796569 809477 823865 839334 855114 870072 882664 891655 897015 899680 900404
59377 900404 899228 895969 890668 883477 874612 864652 854549 845082 836402 828157 819922 811586 803570 796728
59363 796728 791765 788797 787667 788556 791899 797645 805008 813164 822008 832186 844811 861431 883903
59350 883903 913387 948743 985730 1018201 1040812 1051298 1050771 1042406 1029991 1017044 1006072 998076
59338 998076 993036 991069 992568 996729 1000410 999143 989469 970483 943921 913455 883259 855963 831525
59325 831525 808407 785830 764490 745430 729094 715571 704927 696847 690468 685012 680346 676693
59313 676693 674073 672213 670823 669860 669627 670475 672166 673772 674574 674838 675116 675098 674074 672551 672409 674998
59297 674998 679658 684468 687948 689847 691029 693114 697655 705035 714386 724772 735983 747958 760132
59284 760132 771976 783829 796701 811441 828265 846551 864779 881399 896314 911012 926710
59273 926710 942857 957988 971272 982449 991039 996898 1001146 1005121 1008364 1008842 1005571 999933 993951
59260 993951 988178 981917 974839 967558 960897 955209 950328 945836 941452 937343 933903 931221 929200 928399
59246 928399 930184 935488 943667 953101 962880 973597 986647 1003216 1023934 1048814 1077019 1106499
59234 1106499 1133863 1154797 1165370 1163991 1152548 1135180 1115436 1094682 1073248 1052319 1033764
59223 1033764 1018333 1004994 992389 980227 968989 959050 950814 945070 942254 941544 941562 941985 943775 947767
59209 947767 953787 961282 970092 980226 991483 1003654 1016588 1029616 1041236 1049936 1055302 1058217 1060132
59196 1060132 1062021 1063626 1063599 1060787 1055513 1049220 1042852 1036136 1028528 1020118 1011307 1002294 993396 985256
59182 985256 978202 971809 965566 959589 954307 949931 946679 944927 944494 944206 942869 940368 937273 933779 929712
59167 929712 925291 921081 917331 913871 910452 906636 901702 895373 888435 881845 875343 867699 858351 848098
59153 848098 838145 829127 821113 813871 806882 799600 791967 784329 776743 768797 760405 752509 746597 743413
59139 743413 742228 741542 740621 740022 740353 741042 741229 741496 743355 746824 750012 751758 753201 755671 758533 760743
59123 760743 763367 768480 776043 783837 790394 796168 801817 807252 812736 819196 826824 834719 842418 850405
59109 850405 858668 866224 872665 878677 884352 888591 891351 894961 901666 910762 919669 927243 934589 942997
59095 942997 952538 962672 972951 982783 991349 998175 1003379 1007125 1009082 1008642 1005737 1001524 998025 996569
59081 996569 996510 995918 993472 989103 983136 976057 969349 965107 963945 964200 964037 963562 963986 965520 967209 968462
59065 968462 969711 971716 974892 979205 984381 990539 998742 1009998 1023332 1036130 1047357 1059230 1074310
59052 1074310 1091909 1109059 1124375 1138959 1153685 1167783 1180641 1193185 1206443 1219930 1232431
59041 1232431 1243574 1253775 1263276 1272014 1279963 1286907 1292197 1295429 1297204 1298677 1300291 1301190 1299953 1295962
59027 1295962 1290235 1284712 1280308 1275717 1268652 1258309 1246046 1233461 1220397 1205270 1187063 1166647
59015 1166647 1146255 1127743 1111163 1094890 1077321 1058456 1039604 1021694 1004384 986899 969210
59004 969210 952095 936374 922486 910616 900875 893280 887602 883302 879720 876456 873426 870414 866889
58991 866889 862611 858244 854830 852707 851385 850420 849851 849740 849962 850699 852518 855466 858521 860468 861083 861055
58975 861055 861077 861667 863716 868329 875694 884584 893532 902294 911659 921965 932538 942850 953555 965636
58961 965636 978813 991646 1003361 1014818 1027289 1040808 1054296 1066997 1079212 1091668 1104598
58950 1104598 1117476 1129316 1139145 1146406 1151090 1153585 1154512 1154541 1153986 1152547 1149911 1146751 1144585 1144313 1145347
58935 1145347 1146570 1147604 1148610 1149394 1149590 1149487 1149767 1150320 1150002 1147774 1143540 1137815 1131175 1124248 1117648
58920 1117648 1111437 1104865 1097002 1087664 1077702 1068481 1060949 1054983 1049745 1044951 1041538 1040661 1042214 1045004
58906 1045004 1048367 1052871 1059197 1067021 1075412 1083739 1091588 1098296 1103462 1107815 1112714 1118464 1123739 1127068
58892 1127068 1128400 1128687 1128310 1126753 1123727 1119716 1115095 1109534 1102898 1096032 1089820 1083962 1077755 1071898
58878 1071898 1068272 1067641 1068564 1068984 1068048 1065958 1062908 1058861 1053716 1047155 1038901 1029653 1021038 1014019 1008042
58863 1008042 1002275 996786 991657 986002 979253 972682 968052 965038 961534 956560 951386 947651 945840 945961
58849 945961 948224 952226 956666 960793 965362 971295 978187 985110 992294 1000997 1011867 1024312 1037375
58836 1037375 1050399 1062795 1074008 1084189 1094455 1105902 1118317 1130173 1140125 1148391 1156466 1165555
58824 1165555 1175644 1186106 1196717 1207599 1218553 1229013 1238594 1247203 1254667 1260688 1265106 1267733
58812 1267733 1267881 1264590 1257539 1247522 1235875 1223557 1210756 1197286 1183427 1170295 1159018 1149417
58800 1149417 1140098 1130081 1119612 1108958 1097377 1084237 1070410 1057231 1044493 1030869 1016170
58789 1016170 1001671 988061 974579 960715 947446 935958 926082 916809 907649 898764 890365 882684
58777 882684 876036 870294 864626 858257 851139 843612 835991 828923 823518 820382 818816 817480 815636 813459
58763 813459 811541 810465 810446 810828 810343 808423 806075 804882 805160 805456 803901 799893 794536 789563 785848 783040
58747 783040 780637 778945 778486 778972 779683 780682 782628 785354 787683 788855 789126 788644 786920 784019 781194 779539
58731 779539 778822 778462 778749 780047 781525 781942 781392 781196 782322 784985 789557 796510 805124 813366 819821 825186
58715 825186 831164 838051 844061 847223 847544 846822 846394 845816 844135 841693 839629 838042 836061 833790 832570
58700 832570 832620 831925 828708 824028 820592 819662 820405 821755 823339 824731 825340 825432 826153 828200 831343 835451
58684 835451 840976 847909 855191 861919 868607 876529 886066 896337 906358 916009 925777 935936 946322
58671 946322 956893 968191 980983 995376 1010525 1025291 1039000 1051393 1062140 1070868 1077764 1083876
58659 1083876 1090418 1097614 1104421 1109828 1114482 1120382 1128510 1137397 1144885 1150869 1157033 1164014 1170374 1174881
58645 1174881 1178357 1182108 1185476 1186115 1182257 1173710 1161118 1145362 1127449 1108058 1087215 1065149 1043117
58632 1043117 1022411 1002682 982333 960798 939539 920479 904057 889180 874667 860392 847191
58621 847191 835816 825976 816654 807544 799636 793847 789485 784873 779408 774195 770656 769292 769990 772642
58607 772642 776834 781395 785019 787506 790092 794359 800780 808403 815989 823228 830457 837268 842045 843304
58593 843304 841192 837258 832989 828937 825094 821652 819229 818318 818428 817961 815451 811036 806246 802368 799609
58578 799609 797786 796831 796264 795209 793579 792441 792423 792572 791647 789925 788741 788734 789456 790303 790839 790556 789202
58561 789202 787176 784916 782353 779727 778286 779023 781173 783179 784781 786933 789964 793372 797310 802645
58547 802645 809155 815106 819248 822137 824938 827938 830855 833671 836367 838472 839689 840618 842276 845050
58533 845050 848405 851423 853525 854942 856605 859234 862576 865801 868460 870665 872778 875602 880536 888458
58519 888458 898541 909111 919568 930488 941937 953073 963734 975187 988636 1003775 1019277
58508 1019277 1033901 1046913 1058526 1070513 1085276 1103537 1123707 1144229 1165540 1188826 1213773
58497 1213773 1238884 1263447 1287793 1311696 1333878 1353382 1370354 1384911 1396095 1402738 1405056 1404554
58485 1404554 1402264 1397674 1389722 1378403 1364801 1349714 1333096 1314978 1296032 1276574 1255861 1233408
58473 1233408 1210580 1189645 1171277 1154053 1136540 1118823 1101739 1085730 1071123 1058635 1048747
58462 1048747 1040915 1033985 1027191 1020441 1014076 1008657 1004560 1001392 998234 994846 992166 991153 991443 991723
58448 991723 991216 990282 989680 989741 990360 991378 992683 994079 995421 996979 999428 1003079 1007239 1010787 1013414 1015721
58432 1015721 1018062 1020197 1022389 1025679 1030235 1034382 1036573 1037691 1040067 1044715 1050985 1058444 1067154 1076087
58418 1076087 1083412 1089130 1095721 1105133 1116456 1127686 1138533 1150079 1162388 1173820 1182532 1187727
58406 1187727 1189706 1189495 1188253 1186393 1183424 1178973 1173507 1167613 1161279 1154580 1148507 1144162 1141431 1139349
58392 1139349 1137659 1137156 1138484 1141320 1144937 1148968 1153367 1157949 1162216 1165486 1167188 1167309 1166591 1165967 1165640
58377 1165640 1164884 1163028 1160545 1158811 1158700 1159745 1160985 1162236 1163922 1165938 1167702 1169493 1172731 1178469
58363 1178469 1186447 1196055 1207158 1219255 1230983 1241483 1251306 1260783 1268625 1273710 1277289 1281397 1285636
58350 1285636 1287717 1286943 1284973 1283020 1280657 1277893 1276076 1275637 1274833 1272095 1268347 1265785 1265407 1266694 1268747
58335 1268747 1270858 1272830 1275468 1279887 1285882 1292028 1297752 1303934 1310888 1317346 1322420 1327181 1333183 1340560
58321 1340560 1348568 1356829 1365026 1372537 1379398 1386464 1393600 1399118 1402353 1405571 1411746 1421274 1432209 1442829
58307 1442829 1452570 1461472 1470356 1480864 1493735 1507480 1520114 1531668 1543739 1557234 1571992 1587904
58295 1587904 1604752 1621386 1636718 1651260 1666256 1681573 1696022 1709600 1723706 1738988 1754384
58284 1754384 1768664 1781839 1794787 1808458 1823593 1840430 1858525 1877404 1897205 1918131 1939726
58273 1939726 1961635 1984536 2009179 2034806 2059741 2083422 2106731 2130400 2154324 2178567 2203850
58262 2203850 2230559 2257978 2284845 2310158 2333477 2355159 2376506 2399171 2424118 2451329 2480361
58251 2480361 2510794 2542152 2573731 2604716 2634724 2664513 2695821 2729737 2765381 2801068 2836635
58240 2836635 2873404 2911914 2951338 2991564 3034067 3079787 3127738 3176873 3227793 3281243 3336217
58229 3336217 3391237 3446554 3503488 3562355 3622607 3684508 3749194 3817293 3888521 3962310 4038179
58218 4038179 4116223 4197948 4285544 4379406 4477454 4577886 4681327 4789167 4901321 5017249
58208 5017249 5137935 5265020 5398861 5539058 5686043 5840656 6003120 6173973 6355000
58199 6355000 6547669 6751671 6966607 7193973 7435791 7692368 7963186 8248899 8550637
58190 8550637 8868419 9202082 9552692 9921292 10307692 10712575 11139351 11591624 12070065
58181 12070065 12574081 13105175 13666091 14258024 14881457 15538602 16232100 16962313 17728843
58172 17728843 18533939 19381800 20275671 21218631 22216018 23273619 24394117 25578527 26830555
58163 26830555 28156697 29563227 31056505 32645276 34338813 36143174 38062401 40102675
58155 40102675 42272341 44579726 47035273 49654969 52457828 55461760 58686785 62161226
58147 62161226 65920005 69998666 74435393 79278375 84585093 90414921 96829419 103901245
58139 103901245 111718057 120379468 129998965 140711324 152673140 166056202 181043730
58132 181043730 197821783 216547770 237306839 260084129 284729710 310835258 337498296
58125 337498296 363116907 385465010 402185053 411532294 412944307 407053754 395152527
58118 395152527 378542925 358253808 335192725 310384418 284961467 259937869 236030369
58111 236030369 213664115 193067554 174333204 157443865 142311669 128820657 116840929
58104 116840929 106227000 96829445 88511926 81151559 74630872 68841103 63689757 59095902
58096 59095902 54981262 51273999 47918162 44871360 42094616 39550441 37208031 35043224
58088 35043224 33034418 31164167 29423389 27808043 26311416 24923121 23633814 22436109
58080 22436109 21321859 20283037 19314734 18413254 17571643 16780581 16033141 15325414 14653330
58071 14653330 14012667 13402207 12823660 12278059 11764342 11280972 10826417 10398178 9993548
58062 9993548 9611184 9250294 8908895 8584631 8276464 7983685 7704150 7435510 7177440
58053 7177440 6930732 6694863 6468180 6249583 6038239 5832569 5631500 5436012 5247809
58044 5247809 5067299 4894291 4729180 4571330 4417625 4265178 4114880 3970146 3832908
58035 3832908 3702920 3579977 3464140 3354026 3247432 3143916 3044978 2951723 2864000 2781631
58025 2781631 2704695 2632610 2564353 2499463 2437638 2377866 2319442 2263211 2210152 2159177 2108079
58014 2108079 2056357 2005590 1957312 1911989 1869537 1829191 1789246 1748611 1708374 1670368 1634680
58003 1634680 1600149 1566718 1535437 1506544 1479420 1454096 1430789 1408216 1384472 1359641 1335497
57992 1335497 1312495 1289072 1264367 1239772 1217188 1197219 1179438 1162925 1146204 1128214 1109832
57981 1109832 1093104 1078630 1065121 1051719 1039033 1027369 1015617 1002752 989111 975414 961741
57970 961741 948226 935606 924257 913676 903472 893780 884072 872806 859265 844741 830930 817944
57958 817944 804923 791903 779972 769960 761849 755135 748980 742364 734985 728024 723335 721715 722227
57945 722227 723102 722981 721498 719234 717357 717071 719039 723020 728011 732985 737697 742586 747915 753433 759195
57930 759195 765949 773994 782058 788292 792268 795077 797470 798806 798076 795178 790832 785802 780470 774670
57916 774670 767702 759020 749127 739333 730480 722391 714748 707757 701504 695232 688013 679888 671710 663897
57902 663897 655987 647691 639833 633571 628726 623650 617139 609985 603929 599373 595057 590043 584985 580935
57888 580935 577726 574361 570567 567115 564618 562582 559845 555927 551946 549879 550489 552318 553590 554890
57874 554890 558595 565457 573240 579484 584199 588748 593373 597326 600544 603569 606287 608173 609427 610520
57860 610520 610893 609430 605985 601199 595124 587441 578777 570357 562373 554097 545464 536941 527848 516770
57846 516770 504223 493149 485730 480883 475872 469369 461924 454220 446100 437301 428413 420885 415904 413011
57832 413011 410256 406394 402526 400533 400262 399744 398110 396482 395641 394781 393499 393294 395550 399260 402226
57817 402226 403705 404427 404811 404816 405000 405991 406960 406283 403889 401531 400410 399980 399591 399844 401238 402586 402179
57800 402179 400088 398024 397123 397076 397492 398796 401229 404000 406289 408298 410401 411975 412377 412700 415010 419597
57784 419597 424414 427675 429666 431192 431679 430201 427487 425304 424220 423330 422012 420561 419049 416893 413818
57769 413818 410233 406359 401952 397184 392854 389365 386385 383877 382640 383287 385378 388056 390903 393669
57755 393669 395825 397126 398193 399817 401787 402942 402352 400118 396983 393370 388982 383397 377002 371043
57741 371043 366539 363425 361041 359023 357114 354384 349547 342349 334192 327088 322112 318834 316108 313477
57727 313477 311686 311383 311448 309774 306206 303371 303407 304990 305221 303782 303222 305299 309038 312656 315576 317963
57711 317963 320035 322603 326763 331966 335701 336243 334806 333910 334458 335445 335774 335109 333340 330360 326443 322223
57695 322223 318292 315058 312593 310309 307228 302966 298166 293814 290521 288404 286959 285088 282257 279723
57681 279723 279437 281490 283916 285407 286732 288672 290126 289544 287132 284210 281275 278120 275215 273438 272690
57666 272690 272023 271038 270113 269426 268725 268007 267717 268349 270315 273647 277270 279303 279038 277971 277835 278224 277353
57649 277353 274756 271891 270240 269950 270241 270092 268586 265651 262530 260750 260774 262326 265467 270099 274760
57634 274760 277473 278014 278210 279759 282764 286464 290239 293587 296131 298046 299781 301262 302218 303275 305713
57619 305713 309997 315598 322365 330892 341290 352931 365933 381663 401132 424080 450531 482123
57607 482123 520637 565649 614371 662897 706364 738715 754511 752139 734830 708132 676499 642116
57595 642116 606065 569640 534263 500456 467682 435643 405576 379671 359153 343336 330489
57584 330489 319185 308928 300229 294151 290880 288424 283774 276157 268470 264614 265709 269615 273578 276187
57570 276187 277016 275903 273328 270628 268865 267717 266131 263903 261950 261010 260787 260692 260746 260980 260288 257050
57554 257050 251369 245821 243031 242697 241840 238174 232538 227786 225854 226396 227831 228963 229446 229287 228539 227547
57538 227547 226969 227084 227202 226258 224047 221451 219340 217826 216785 216309 216039 214739 211535 207305 203846 201732
57522 201732 199874 197220 193942 190698 187636 184604 181698 179119 176907 175140 173928 172994 171835 170616
57508 170616 170224 170855 171106 169226 165083 160428 157329 156649 157709 158918 158918 157591 155925 154722 153744 152439
57492 152439 151059 150465 151077 152654 154955 157826 160590 162199 162477 162644 164001 166286 168056 168658 169099 170516
57476 170516 172391 173198 172658 172259 173056 173987 173388 171640 170946 172441 174835 176360 176937 177642 178915 180338
57460 180338 181728 183387 185290 186867 187661 187743 187575 187888 189476 192372 195343 196903 196833 196040 194950 192951
57444 192951 189751 186343 183940 182430 180545 177325 172917 168198 164154 161462 159967 158471 155620 151345
57430 151345 147135 144562 143652 143012 141484 139329 137554 136332 134604 131460 127487 124176 122096 120320 117864
57415 117864 114961 112374 109977 106942 103165 99564 96707 94051 91105 88778 88787 91936 97497 104033 110175
57400 110175 114726 116880 116723 115180 113266 111651 110884 111470 113512 116686 120800 125915 131647 136841 140423
57385 140423 142337 143270 143722 143724 143237 142344 141157 139851 138673 137601 136362 135156 135038 136770 139455 141135
57369 141135 141001 140359 141060 143412 145939 146863 145539 142836 140510 139881 140731 141593 141448 140923 141421 143156 144559
57352 144559 143856 140979 137664 135668 135136 134800 133671 132187 131574 132333 133750 134837 135321 135536 135699 135666 135334
57335 135334 134919 134676 134474 133955 133240 133324 135288 138895 142357 144032 144270 144966 147170 149717 150684 149836 148956
57318 148956 149760 151954 153597 153055 150383 146947 144057 142104 140816 140089 140319 141846 144165 145975 146322
57303 146322 145631 145308 146167 147634 148745 149549 150894 153074 155452 157531 159507 161413 162559 162599 162496 163544
57287 163544 165844 168787 172675 178581 186429 194476 201314 207413 213939 220853 227118 232321 237115 242272
57273 242272 248129 254912 262666 270684 277783 283547 288843 294732 301295 307905 314350 321168 328958 337782
57259 337782 347401 357820 369396 382350 396209 409831 422163 433067 443262 453364 463253 472624
57247 472624 481861 491754 502273 512260 520722 528047 535488 543720 552442 561248 570221 579485 588644 597007
57233 597007 604201 610543 617021 624791 634219 644406 654113 663239 672884 683962 696469 710207 725118
57220 725118 740284 753623 763816 772108 780954 790900 799956 806327 810769 815581 821803 828133 832469
57207 832469 834040 833987 834189 835882 839380 844589 851102 857855 863594 868158 872748 878423 884913 891501 898374
57192 898374 906120 914328 921866 928564 935687 944543 955258 966917 978344 988900 999210 1010937 1025019
57179 1025019 1040400 1055345 1069728 1084895 1101567 1119256 1137656 1156971 1176688 1195751 1214521
57168 1214521 1234799 1256999 1278891 1298397 1316242 1334460 1353492 1372512 1391686 1412150 1434081
57157 1434081 1456540 1479281 1503233 1529046 1556350 1584634 1613777 1643540 1673545 1704009 1735620
57146 1735620 1768456 1801706 1834591 1866835 1898340 1929299 1960717 1993798 2028421 2062947 2095933
57135 2095933 2127515 2159052 2192066 2227590 2265635 2304896 2343671 2381485 2419282 2457871 2496957
57124 2496957 2535942 2574762 2613283 2650719 2686466 2721068 2755512 2789878 2823505 2856383 2889600
57113 2889600 2924257 2960414 2997222 3033722 3069403 3104248 3138319 3171197 3201985 3230133 3256143
57102 3256143 3281104 3305637 3329785 3353880 3378843 3405227 3432438 3459428 3485933 3512559 3539837
57091 3539837 3567833 3596613 3626274 3656292 3685576 3713667 3741200 3768465 3794012 3815514 3831686
57080 3831686 3842429 3847274 3844728 3833144 3811128 3776829 3727792 3661838 3577235 3471804 3343062
57069 3343062 3189768 3012175 2809944 2580786 2321871 2031313 1707122 1345828 943718
57060 943718 498704 9199 -528467 -1119781 -1769285 -2479988 -3255831 -4103139 -5029009 -6039632
57050 -6039632 -7141149 -8341333 -9649809 -11077469 -12636566 -14341041 -16206501 -18250645
57042 -18250645 -20494404 -22962313 -25681253 -28679117 -31984919 -35629575 -39645651 -44065823
57034 -44065823 -48920874 -54237527 -60035611 -66323969 -73095582 -80323822 -87961058 -95937591
57026 -95937591 -104159061 -112508378 -120862479 -129119037 -137203378 -145027097 -152412362 -159040479
57018 -159040479 -164477269 -168270578 -170063078 -169662833 -167054551 -162371905 -155859437 -147838601
57010 -147838601 -138676846 -128754625 -118432006 -108023431 -97786557 -87922086 -78577367
57003 -78577367 -69851060 -61800577 -54451778 -47806926 -41848786 -36543460 -31844959 -27701024
56995 -27701024 -24057767 -20862280 -18063909 -15615007 -13471276 -11591906 -9939897 -8482835
56987 -8482835 -7193724 -6050723 -5035411 -4130999 -3322349 -2597027 -1944978 -1356538 -821588
56978 -821588 -331099 121345 540228 929328 1291529 1628334 1941059 2232423 2506215 2765777
56968 2765777 3013731 3252904 3487058 3721522 3963453 4218462 4482604 4736812 4952665
56959 4952665 5107237 5193978 5221083 5202508 5151650 5080342 4998998 4915502 4834190 4756050 4679515
56948 4679515 4601657 4519954 4433623 4343246 4249527 4152918 4054240 3954898 3856310 3759361 3664270
56937 3664270 3570567 3477286 3383518 3288787 3192700 3094488 2993293 2888857 2781693 2672781
56927 2672781 2563326 2454591 2347490 2242360 2139358 2039025 1942185 1849360 1760347 1674212
56917 1674212 1589643 1505794 1423097 1342941 1266219 1192567 1121368 1052948 988034 926449 867386
56906 867386 811117 759489 714199 675110 640656 609518 581493 557096 536734 519967 505067
56895 505067 489455 471213 450341 428217 405779 382617 357991 332173 306313 281268 257237
56884 257237 234445 213466 194501 176976 160453 145543 133176 123209 114657 107459 103082 102820 106142
56871 106142 111406 117705 125103 133110 139850 143065 141453 134868 123817 109378 93259 77254 62299
56858 62299 48147 33975 19297 4441 -9615 -21909 -32088 -40479 -47552 -53432 -58046 -61605 -64609
56845 -64609 -67274 -69187 -69718 -68675 -66346 -62946 -58288 -52095 -44557 -36402 -28381 -20585 -12293 -2598 8756
56829 21365 34943 49681 65318 80322 92979 103384 113326 123651 132576 137486 137862 135541 132452
56816 132452 129218 125866 122721 120218 118719 118937 121865 127901 136652 147842 161709 178159 196422
56803 196422 216117 237991 262909 290629 320004 349537 376998 399362 414517 422755 425624 423766
56791 423766 417070 406636 394958 383878 373621 364284 357175 354090 356091 363483 376100 393095 413241
56778 413241 436094 462223 491898 524488 559705 598139 638995 677836 708154 725508 729541 722450
56766 722450 706827 685087 659442 631447 602040 572562 545264 522223 504026 489959 479283
56755 479283 471933 468172 468075 471590 478917 490538 506651 526458 548027 568923 587004 600796 609467
56742 609467 612538 609313 598706 580337 556081 529688 503994 478953 453296 427659 404825 386807
56730 386807 372949 361339 351111 342776 337099 334415 334596 337116 341488 347859 356476 366072 373605 376535
56716 376535 374923 370504 364107 354997 342494 327062 309653 290883 271276 251756 233498 217480
56704 217480 204038 192371 180725 167937 154919 143798 135298 127821 119606 111012 103923 99353 96511
56691 96511 94027 91317 88630 86359 84585 82941 80754 77512 73366 69109 65627 63426 62580 62847 63727
56676 63727 64621 65136 65296 65331 65201 64478 62850 60667 58703 57392 56611 56267 56530 57114 56935 55338 53454
56659 53454 53460 56282 60665 64606 67021 67884 67674 67214 67395 68314 69084 68979 68334 67853 67579 67206 66895 67004
56641 67004 67425 68002 69204 71296 73020 72364 68930 64609 61546 60185 59483 58151 55274 50703 45546
56626 45546 41622 39693 38663 37116 35086 33599 32997 32747 32753 33785 36273 39358 41652 42739 43651 45890
56610 45890 49918 54544 57967 59636 60880 63431 67593 72165 75876 78422 80317 82356 85173 88686
56596 88686 91874 93650 94169 94820 96712 99499 101885 102947 102820 102428 102783 104261 106321 108128 109492 110844
56580 110844 112286 113297 113710 114285 115672 117282 118084 118367 119644 122505 125480 126810 126868 127858 131099 135434
56564 135434 138664 139943 140121 140127 139966 139482 139284 140229 142293 144566 146290 147433 148350 149418 151084 153649
56548 153649 156648 158844 159219 157855 155653 153457 151691 150569 150261 150808 152062 153688 155205 156256 156923
56533 156923 157578 158341 159000 159587 160604 162256 163729 163722 161684 158411 155614 155045 157478 161903 165980 168069
56517 168069 168874 170563 174276 179160 183848 187943 191523 193996 194531 193600 193248 195409 200303 206763 213821
56502 213821 221451 229765 238110 245463 251553 257138 263190 270252 278531 287863 297262 305094 310310 313182
56488 313182 314385 313928 311630 308173 304598 301029 296928 292636 289468 288016 287360 286439 285266 284237 283089
56473 283089 281298 278910 276268 273353 269985 266197 261897 256704 250723 244929 240123 236138 232812 230985
56459 230985 231351 232756 232947 231035 228165 225797 224326 223444 222766 221819 220269 218386 216568 214399 211122
56444 211122 207166 204102 202758 202431 202342 202723 203818 204943 205431 205612 205896 205685 204338 202618 201977 202655 203617
56427 203617 204249 205009 206369 208115 209977 212167 214967 218204 221307 223579 224546 224539 224647 225455 226014 225004
56411 225004 222886 221924 223759 227791 232229 235843 238225 239271 239323 239358 240177 241571 242847 243857 244834 245501
56395 245501 245289 244561 244841 247346 251588 255788 258550 259909 260870 262155 263525 264268 264166 263792 263832 264391 265128
56378 265128 265830 266568 267394 268181 268805 269305 269812 270391 270923 271161 271019 270906 271487 272852 274111 274138 272690 270522
56360 270522 268576 267409 267242 268048 269446 270975 272542 274217 275410 274861 271932 267666 264112 262639 263137
56345 263137 264629 266330 268288 271268 275807 281107 285186 286721 286575 286841 288451 290425 291539 291858 292255
56330 292255 293203 294675 296648 298863 300410 300463 299506 299166 300668 303853 307680 311080 313195 313479 312095 310024
56314 310024 308432 307985 308754 310437 312462 314239 315691 317365 319729 322488 324892 326627 328087 329646 330931
56299 330931 331126 330071 328869 329025 330858 333019 333951 333641 333477 334433 335967 336910 336956 336869 337597 339578 342713
56282 342713 346389 349521 351047 350746 349587 349066 349987 351768 353062 353188 352835 353152 354504 356694 360146 365777
56266 365777 373302 380551 385294 387372 388487 390350 393686 398476 404072 409149 412554 414417 415821 417339
56252 417339 418571 419084 418991 418497 417786 417562 418753 421234 423700 425345 426798 428747 430562 431313 431454 432184
56236 432184 433457 434026 433538 433258 434232 435725 436228 435311 433796 432560 431977 432273 433644 435881 438318 440395
56220 440395 442071 443695 445636 448051 450854 453897 457219 461010 465200 469205 472282 474138 475126 475924 477113
56205 477113 478943 481386 484494 488719 494516 501405 507808 512365 515389 518582 523325 529694 537042 544843
56191 544843 552652 559955 566736 573834 582154 591686 601825 612374 623502 634827 645419 654962 664076
56178 664076 673125 681526 688932 696446 705603 716369 727058 736186 743479 748933 752035 752528 751271 749545
56164 749545 747848 746022 744206 742920 742271 741781 741114 740433 739931 739455 738793 737980 737190 736531 735972 735090 733038
56147 733038 729419 725319 722775 722726 723985 724703 724352 723685 723259 722929 722741 723383 725464 728823 732738 736317
56131 736317 738698 739619 740204 742526 747632 754193 759675 762836 764764 767567 772509 779420 787386 795590 803561
56116 803561 811029 817935 824656 831985 840589 850510 861246 872168 882691 892433 901720 911661 923032
56103 923032 935137 946564 957112 968075 980428 993843 1008076 1024140 1042973 1063693 1084445
56092 1084445 1104612 1124966 1146003 1167554 1190185 1215565 1244923 1278118 1314728 1355309 1401179
56081 1401179 1453718 1514142 1582960 1659091 1740472 1826362 1918400 2018654 2127128 2241736 2359761
56070 2359761 2478190 2593218 2701061 2799754 2889540 2971519 3046593 3115525 3178738 3235213 3281903
56059 3281903 3314815 3331076 3330460 3315660 3291086 3260700 3226288 3187426 3142656 3090367 3029042 2957752
56047 2957752 2876932 2788471 2694858 2598527 2502028 2408322 2320396 2240558 2170136 2109521 2058319
56036 2058319 2015586 1980276 1951623 1929206 1912713 1901597 1894817 1890940 1888669 1887344 1887033 1888288 1891921
56023 1891921 1898728 1909021 1922331 1937623 1953766 1969915 1985860 2002369 2020874 2042276 2066030
56012 2066030 2090765 2115712 2141175 2167733 2195605 2224943 2256033 2288685 2321838 2354507 2387152
56001 2387152 2421473 2458582 2497710 2537135 2576156 2615774 2657396 2701349 2746853 2793196 2840668
55990 2840668 2890425 2943572 3000211 3059311 3119693 3181175 3244399 3309489 3375608 3442277 3510488
55979 3510488 3581723 3656235 3733182 3812162 3893691 3978229 4065834 4156968 4252742 4353949 4460481
55968 4460481 4571884 4687854 4808110 4932624 5062258 5198570 5342885 5496130 5659322
55959 5659322 5833150 6017229 6211150 6416368 6635456 6869224 7116296 7376225 7651295
55950 7651295 7944202 8255612 8585251 8933789 9302020 9689475 10095772 10522675 10973264
55941 10973264 11449599 11952360 12481901 13038497 13622610 14236370 14883717 15567482 16287318
55932 16287318 17042161 17833580 18665031 19539280 20459022 21429017 22454900 23540358 24687940
55923 24687940 25902173 27189578 28556296 30008526 31554747 33204232 34963154 36835068
55915 36835068 38825736 40945124 43204947 45617654 48198769 50967886 53947283 57162650
55907 57162650 60646137 64436627 68577120 73114615 78102665 83601660 89677908 96406891
55899 96406891 103877707 112190913 121453761 131784622 143325380 156248482 170754855
55892 170754855 187067087 205408179 225948608 248725245 273542494 299833329 326467002
55885 326467002 351611436 372870440 387807591 394659938 392843360 382989425 366586552
55878 366586552 345495862 321556288 296343868 271069310 246581682 223432981 201952360
55871 201952360 182304155 164533576 148605070 134428108 121871262 110775984 100974541
55864 100974541 92304681 84616794 77778375 71677946 66224003 61338785 56953456 53007435
55856 53007435 49447506 46225117 43295952 40622653 38175732 35930628 33865073 31959429
55848 31959429 30197351 28564952 27050329 25644179 24339252 23128365 22003625 20957269
55840 20957269 19981622 19068194 18208728 17397913 16633923 15915865 15241779 14609234 14016294
55831 14016294 13461263 12942628 12459810 12012991 11601748 11224761 10881109 10570888 10294209
55822 10294209 10050455 9838633 9657066 9501843 9365899 9239721 9112459 8972916 8811349
55813 8811349 8621694 8402258 8154716 7883172 7593663 7292807 6986160 6678282 6374044
55804 6374044 6078489 5795138 5525444 5270005 5029082 4801906 4587095 4384413 4194874
55795 4194874 4018472 3853076 3696429 3548151 3408893 3278566 3156451 3042241 2935734
55786 2935734 2835968 2741676 2652451 2568721 2490723 2417992 2349498 2283806 2219599 2156746 2096617
55775 2096617 2040746 1989300 1941103 1894719 1849152 1804042 1759830 1717539 1677887 1640790 1605885
55764 1605885 1573021 1541791 1511069 1479717 1447685 1416041 1386056 1358382 1332697 1307878 1282939
55753 1282939 1258152 1234876 1214056 1195418 1178336 1162710 1148481 1135067 1122136 1110367 1100553
55742 1100553 1092199 1083818 1074426 1064045 1053086 1042124 1032107 1023825 1017039 1010853 1004965 999803 995399
55729 995399 991098 986779 983624 983024 985018 988221 991013 992440 992157 989823 984528 974790 959444 938905
55715 938905 915456 891870 869466 847526 824767 801464 779990 763058 751385 743182 735724 727045
55703 727045 716372 703908 690829 678896 669122 660799 652387 643366 634784 628051 623608 620709 617996
55690 617996 614325 609459 603986 598307 592000 584744 577435 571400 566479 560859 553169 543870 534282 525161
55676 525161 516808 509673 503868 498572 492759 486309 479748 473323 467072 461401 456540 451592 445154 437027
55662 437027 428405 420269 412474 404704 397326 390741 384629 378525 372629 367478 363335 360473 359491 360501
55648 360501 362359 363601 364100 364933 366526 367701 366861 363606 358918 354085 349720 345517 340817 335578 330744
55633 330744 327295 324854 321665 316173 308474 300143 292968 287911 284863 283086 281897 281009 280214 279130 277683
55618 277683 276594 276546 276839 275761 272703 269136 266860 265850 264657 262510 260096 258257 256865 255306 253503
55603 253503 251913 250725 249537 247957 246263 245152 244743 244133 242313 239379 236410 234224 232770 231744 231043
55588 231043 230472 229899 230122 232615 237507 242585 245458 246315 247369 249814 252611 254340 254969 255352 256029 257066
55572 257066 258223 258666 257201 253409 248028 241857 234937 227395 220309 214906 211334 208963 207383 206206
55558 206206 204319 200538 195167 189935 186112 183319 180477 177274 174309 172257 171340 171343 171773 172149 172300 172245
55542 172245 171757 170399 168179 165754 163724 162028 160401 159047 158272 157570 155771 152342 148162 144769 143083
55527 143083 143019 143966 145316 146771 148483 150744 153332 155413 156454 156905 157428 157722 156958 155340 154307 154921
55511 154921 156960 159963 164073 169041 173413 176091 178127 181422 185853 189258 190476 190696 191104 190753 188022
55496 188022 183104 177595 172250 166689 161143 156948 154984 154724 155213 156033 156804 156646 154968 152234 149188
55481 149188 145609 140677 134480 128354 123505 119994 117605 117112 119678 124818 129822 131875 130511 127476
55467 127476 124592 122565 121597 121731 122026 120612 116842 112806 111373 112755 114197 113257 110274 107231 105275
55452 105275 104191 103478 102856 102008 100765 99545 98906 98690 98209 97260 96278 95402 94141 92268 90422 89355
55436 89355 89026 88965 89186 90153 91978 94247 96682 99364 102040 103621 102897 99820 95944 93449 93578 95814
55420 95814 98484 100256 101059 101603 102321 103068 103618 103863 103466 102001 99797 98096 97798 98341 98405 97555 96588 96256
55402 96256 96342 96154 95377 94142 92647 91091 89778 89049 89192 90494 93019 96119 98456 98893 97386 94905
55386 94905 92608 91158 90567 90499 90803 91844 94078 97248 100332 102419 103322 103201 102110 100372 98941 98723
55370 98723 99565 100393 100310 99257 97823 96881 97206 98755 100301 100451 99216 98057 98124 98960 99261 98487 97372
55353 97372 97072 98113 99993 101625 102372 102642 103105 103323 101946 98680 95342 94056 94758 95381 94535 93058
55337 93058 92595 93352 93866 92750 90269 88244 88544 91524 95772 99451 101806 103123 103502 102400 99678 96342
55321 96342 93666 91944 90753 90151 90816 92952 95822 98603 101157 103560 105309 105574 104255 102404 101465
55306 101465 102098 103684 104944 105081 104317 103265 102045 100380 98389 96688 95525 94371 92742 91025 90045
55291 90045 90035 90479 90871 91252 92072 93742 96155 98379 99099 97820 95473 93467 92456 92501 93944 97032 100580
55274 100580 102185 100518 96912 94052 93399 94349 95588 96514 97277 97988 98361 98149 97662 97503 97614 97039 95243
55257 95243 93473 93824 96608 99487 99907 97823 95294 93836 93149 92270 90927 89498 88484 88429 89688 91690
55241 91690 92880 92033 89495 86685 84558 83105 82330 82964 85766 90385 95415 99562 102363 103719 103240
55226 103240 100563 96313 92298 90381 91028 92869 93732 92382 89540 87198 86757 87938 89576 91071 92537
55211 92537 93885 94678 95045 95862 97562 99399 100477 101031 101992 103599 105104 105728 105323 104237 103090 102673
55195 102673 103458 105081 106650 107531 107660 107323 106990 107051 107216 106560 104806 103198 103156 104331 105125 105062 105251 106153
55177 106153 106364 104599 101806 100070 99991 100308 99970 99526 100426 103544 108284 112576 114086 112245 108988 106693
55161 106693 105578 104057 101483 99252 98791 99689 100649 101411 102644 104378 105686 105952 105537 105012 104354 103214
55145 103214 101478 99276 96821 94576 93267 93344 94550 96281 98222 100307 102228 103482 104005 104386 105199
55130 105199 106312 107039 106756 105261 102816 100193 98410 97945 98297 98784 99689 101876 105148 107806 108548 108222
55114 108222 108841 111008 113260 114081 113666 113128 112661 111362 108774 105849 104063 103954 104751 105282 104970 104084 103327
55097 103327 103341 104364 106010 107290 107186 105541 103352 101880 101526 101842 102541 103847 105675 107088 107205 106396
55081 106396 105950 106552 107659 108380 108420 107935 107013 105767 104706 104534 105549 107379 109178 109920 108806 105917
55065 105917 102541 100502 100837 103065 105696 107399 107791 107278 106282 104730 102497 100199 99054 99642 101184
55050 101184 102554 103757 105707 108485 110563 110277 107663 104451 102404 102067 102928 104352 106120 108215 110289
55035 110289 111621 111921 112014 113161 115487 117706 118779 119201 119844 120080 118353 114831 112222 113134 117216 121682
55019 121682 124239 124648 123769 122247 120556 119467 119621 120702 121458 120597 117629 113045 108016 103850 101427
55004 101427 100924 102020 104247 107072 109800 111772 112825 113533 114687 116336 117412 116668 114296 112332 112870
54989 112870 115702 118250 118157 115580 112592 110776 110070 109788 109805 110434 111699 113189 114318 114521 113559 111941
54973 111941 110678 110323 110569 111085 112177 114110 116221 117483 117764 117773 117848 117605 116862 116156 116002 116285 116639 116941
54955 116941 117070 116758 116099 115795 116465 118035 120064 122192 123858 124143 122649 120266 118435 117830 118253 119502
54939 119502 121526 123727 125013 124824 123688 122636 122512 123777 126259 128913 130530 131069 131703 133188 134775
54924 134775 135227 134378 133075 132051 131671 132438 134687 137700 139980 140789 140809 141021 141581 142204 142981 144113 145153
54907 145153 145286 144325 142940 141953 141784 142385 143150 143046 141557 139599 138819 139794 141516 142752 143116 142613 141245
54890 141245 139793 139945 142347 145161 145949 144840 144316 145761 147706 148119 147034 145836 144997 143953 142805
54875 142805 142640 143918 145673 146905 148085 150516 154456 158542 161254 162505 163337 164365 165278 166046 167595
54860 167595 170382 172874 172847 170279 167764 167721 170367 174928 181385 189766 198696 206284 212203 217549 222792
54845 222792 227192 230298 232687 234681 235453 234065 230626 225739 219526 212058 204399 198188 193903 190096
54831 190096 184830 177885 171297 167476 166867 167755 168331 168383 168654 169214 169378 169044 169203 170822 173815 177381 180896
54814 180896 184182 187206 189801 191690 192866 194086 196764 201986 209653 218752 228107 236470 242467 245350
54800 245350 245676 244411 241534 236512 230117 224381 220260 216337 210656 203078 195098 187954 181878 176773
54786 176773 172605 169051 165519 161793 158277 155432 153207 151200 149214 147483 146247 145242 143910 142183
54772 142183 140603 139321 137500 134469 131208 129783 131169 134353 137660 140171 141738 142511 142877 143211 143336
54757 143336 142833 142074 142151 143422 144966 145839 146072 145950 145327 144298 143697 144029 144677 145012 145545 146981 148813
54740 148813 150027 150699 151597 152519 152394 151166 150299 151021 152801 153987 153470 151630 150052 150205 151887 153106
54724 153106 152089 149253 146671 145809 146509 147888 149313 150498 151590 153287 156138 159666 162843 165457 168153
54709 168153 171066 173298 174066 173693 173323 174300 177883 184532 192987 200751 206085 209203 211551 214676 219860
54694 219860 227644 236890 245049 250280 253016 254977 257063 258741 258923 256709 251733 244712 237556 232119
54680 232119 228642 225855 222583 218802 215194 212286 210154 208451 206465 203569 199962 196749 194883 194078
54666 194078 193073 191026 188418 186483 185993 186886 188790 191352 193890 195405 195546 195467 197237 202225 210091
54651 210091 219112 227281 233453 237931 241864 245759 248725 249534 248003 244826 240384 234675 228320 222605
54637 222605 218150 214255 209922 204914 199512 193957 188591 183939 180072 176372 172485 168988 166402 163978
54623 163978 160432 155869 152159 151043 152314 154125 154791 154061 152928 152633 153907 156783 160630 164233 166326
54608 166326 166659 166445 167149 168741 169760 169291 168127 167430 166919 165315 162387 159622 158647 159650 161624 163564
54592 163564 164943 165417 164727 163090 161435 161020 162569 165505 168023 168357 166439 164157 163544 164655 165645 165011
54576 165011 163216 161698 160816 159597 157464 155484 155496 158412 163605 169490 174274 176557 175946 173334 170468
54561 170468 169000 169610 171539 172980 172451 170075 167231 164963 163351 162427 162638 163856 164989 165525 166699
54546 166699 169913 174421 177805 178574 177376 175936 175902 178395 183148 187895 190081 189687 189267 190650 192717
54531 192717 193082 191030 187955 185530 184215 183307 182130 181342 182837 187550 193479 197194 197530 196505 196154
54516 196154 196071 195053 193612 193201 193746 193688 192238 190243 188894 188621 189279 190424 191414 191984 192741 194465 197030
54499 197030 199598 201631 203086 203971 204507 205510 207743 210908 213931 216158 217677 218643 218955 218518 217380
54484 217380 215747 214319 214188 215943 219312 224081 230413 237473 242907 245205 245866 247510 250270 251984 251779
54469 251779 251262 251766 252523 252523 252323 252744 253217 252842 251956 251184 249880 247135 243789 241792 241703 242299 242603 242861
54451 242861 243275 243164 242073 240746 240190 240395 240638 240641 240722 241063 241431 241534 241153 240027 238177 236357 235564 235915
54433 235915 236579 237172 238554 241555 245299 247828 248377 248143 248559 249714 250918 251950 253012 254085 255239
54418 255239 257131 260244 263825 266548 268254 270282 273842 278657 283316 286656 288907 291787 296997 304001
54404 304001 309875 312396 312853 314486 318353 322337 324435 325220 326243 327602 328414 328585 328541 327852 325651 322217
54388 322217 318868 316279 314053 312002 310756 310722 311390 312165 313187 314671 315840 315246 312154 307283 302180
54373 302180 298120 295627 294716 295231 296899 299251 301612 303166 303123 301236 298316 295827 294529 293837 292977 292366
54357 292366 292979 294602 295757 295489 294176 292331 289775 286589 283727 281765 279982 277804 276333 277040 279418
54342 279418 281428 282206 282831 284222 285767 286641 287308 288735 290794 292366 292806 292630 292875 294080 295789 296847
54326 296847 296428 294851 293110 291755 290814 290725 292216 294844 296731 296609 295307 294262 293374 291629 289284 287653
54310 287653 286832 285502 283502 282774 284616 287413 288636 288152 287816 288383 288724 288164 287712 288319 289360 289679 288994
54293 288994 287454 284839 281259 277814 275394 273406 270808 267921 265867 264461 262248 258834 255828 254768
54279 254768 255055 254785 253075 250832 249413 249209 249554 249678 249429 248974 247985 245749 242448 239687 238911 239503 239369
54262 239369 237418 234591 232405 231334 230722 229386 226216 221312 216850 215569 217745 220753 222355 223164 224711
54247 224711 226371 226107 223868 222218 223225 226182 228971 230532 231194 231443 231289 230607 229459 228162 227235 227070
54231 227070 227447 227660 227299 226613 226025 225651 225534 225839 226321 225922 223543 219383 215119 212499 211819 211789 210730
54214 210730 207897 203968 200543 199080 199895 202029 204244 206131 207972 209506 209470 206907 202647 198889 197328
54199 197328 198157 200625 203814 206806 208924 210220 211345 212669 213940 214864 215471 215738 215500 214978 214670 214393
54183 214393 213262 211118 209168 208438 208220 206947 204219 201082 198579 196860 195632 194795 194631 195724 198316
54168 198316 201279 202323 200122 195904 192079 189586 187581 185505 184169 184525 186311 188332 189476 189269 188037
54153 188037 186749 186240 186454 186820 187186 187840 188787 189718 190420 190436 188710 184818 180454 178292 178964 180329 180184
54136 180184 178558 176865 176045 176383 178052 180698 183146 184539 185364 186598 188327 190000 191432 192654 193204
54121 193204 192569 191037 189214 187012 184138 181397 180334 181337 183011 183742 183205 182067 180935 180056 179626
54106 179626 179822 180563 181322 181176 179253 175715 172331 171492 174126 178670 182325 183409 182565 181900 183018 185700
54090 185700 188319 189381 188625 186883 185367 185168 186761 189463 191680 192319 191875 191680 192233 192831 192773 192219 191701
54073 191701 191463 191677 192775 194931 197430 199147 199779 200096 200736 201100 199924 196991 193794 192162 192389 193107
54057 193107 192960 191958 191074 190952 191483 192500 194366 197534 201599 205041 206309 205335 203785 203473 204635 206022
54041 206022 206437 205592 203606 200608 197219 194632 193617 193910 194971 196663 198637 199828 199610 198975 199428 200939
54025 200939 202130 202361 202297 202307 201783 200599 199895 200380 200925 200146 198707 198716 201017 204302 206930 208478 209370 210041
54007 210041 210891 212208 213698 214734 215424 216598 218282 219102 218030 216012 214788 214582 214202 213231 212678 213202
53991 213202 213943 213796 212956 212496 213239 215779 220810 228285 236494 243014 246624 247817 247769 247706 248915 252188
53975 252188 256978 261963 266720 272168 279240 287912 297616 307613 316595 323038 326748 329403 332824 337172
53961 337172 341401 344770 347130 348322 348368 347986 347911 347781 346494 343709 340219 336870 333882 331329 329345 327421
53945 327421 324122 318238 310163 301773 294796 289353 284223 278687 273929 271976 273026 274618 274172 271894
53931 271894 270267 270910 272919 274316 274066 272351 269816 267157 264925 263090 261090 258652 256283 254604 253552
53916 253552 252635 251691 250981 250739 251031 251942 253395 254654 254498 252369 249434 248056 249759 253808 258177 261891
53900 261891 265678 270213 274696 277952 280148 282311 284533 285914 286232 286446 287342 288849 291038 294557 299347
53885 299347 303948 306990 308761 310582 313332 317377 323218 331026 339744 347726 354412 360793 368334 378079
53871 378079 390610 405982 423378 441207 457729 471471 481341 486835 488197 486199 481918 476739 471921
53858 471921 467670 463226 458453 454710 453309 453742 454630 456037 459404 465094 471405 476463 479945 482473 484392
53843 484392 485847 487128 488108 488080 486901 485562 484738 483515 480651 476602 472912 469860 466149 461152 456079
53828 456079 452204 448976 444846 439309 433073 426514 419151 410907 403049 397120 393167 389578 384846 379198
53814 379198 374176 370680 367772 363704 357910 351516 345782 340611 335117 329321 324450 321382 319481 317389
53800 317389 314499 311097 307508 303920 300991 299604 299635 299648 298361 295968 293471 291160 288586 285790 283638
53785 283638 282648 282168 281200 279672 278498 278586 280131 282710 285574 287836 288805 288514 287873 287939 288856 289661 289321
53768 289321 287757 285489 282609 278858 274806 271954 271023 270840 269898 268566 268625 270724 273459 275221 275966 276720
53752 276720 278225 280649 283846 287159 289502 290413 290825 292300 295752 301141 307865 314909 321260 326909 332967
53737 332967 339923 346234 349698 350140 349778 350868 353908 358185 362993 367779 371925 375108 377594 379737 381408
53722 381408 382118 381536 379823 377754 376431 376362 376803 376510 375186 373630 372482 371619 370804 369957 368463 365328
53706 365328 360756 356697 354946 355274 356250 357232 358491 359844 360462 360021 359142 358734 359764 363395 370053 378060
53690 378060 384313 386864 386110 383124 377956 370349 361257 352459 344840 338007 331641 326493 323679 323260 323822
53675 323822 323502 321470 318408 315420 312694 309649 306244 303348 301543 300333 299194 298760 300035 302712 305216
53660 305216 306460 306698 306536 306009 305161 304895 306441 310071 314747 319041 322183 324355 326150 327736 328554 328252
53644 328252 327974 330057 335673 343044 348852 351608 352883 354931 357949 360482 361979 363582 366097 368268
53630 368268 368059 365404 362783 362888 366193 370986 375277 378253 380215 381748 383140 384251 384613 383783 381901
53615 381901 379908 378928 379257 380100 380422 379885 378761 377237 375248 372952 370866 369413 368700 368762 369507 370257 370054
53598 370054 368778 367381 366483 365427 363466 361225 359872 359205 357995 356234 355599 357155 359909 362386 364577
53583 364577 367261 370255 372646 374413 376565 379596 382744 385032 386405 387640 389552 392308 395147 396890
53569 396890 397194 397191 398355 400775 403022 403673 402558 400704 399611 400391 402969 406085 408633 410943 414235 419072
53553 419072 425025 431515 437966 443189 445939 446453 446360 446620 446677 446205 446429 448600 452088 455289 457914 460943
53537 460943 464446 466845 466778 464828 462989 462984 465285 469091 472853 475247 476091 476175 476108 475635 474216 471896 469350
53520 469350 467307 466205 466221 467223 468575 469238 468449 466519 464714 463961 463640 462143 458938 455686 454857 457274
53504 457274 461341 464529 465370 464268 462874 462827 464813 468607 473717 479539 484972 488777 490975 493392 497982
53489 497982 504798 512318 519486 526526 533862 541439 549500 558969 570323 582722 595044 607390 620748
53476 620748 635349 650225 664675 679551 696582 716513 738361 760686 783250 806946 832102
53465 832102 857618 882297 906581 932112 959689 988479 1017356 1046290 1076213 1108350 1143958
53454 1143958 1183777 1226912 1270863 1313637 1355634 1398680 1443400 1488466 1532516 1575863 1619763
53443 1619763 1664486 1708828 1751481 1792405 1832605 1872795 1912721 1951917 1990688 2029739 2068843
53432 2068843 2106582 2141757 2174596 2206076 2236427 2264943 2291207 2315870 2340007 2363979 2387151
53421 2387151 2408543 2427688 2444831 2460231 2473379 2483274 2489633 2493374 2495502 2495868 2493525 2488014 2479604
53408 2479604 2468333 2453508 2434376 2410900 2383784 2354197 2323513 2292692 2261496 2228658 2193233
53397 2193233 2155703 2117596 2080175 2043615 2007147 1969784 1931141 1891922 1853598 1817350 1783181
53386 1783181 1750154 1717656 1686502 1658641 1635512 1616662 1600291 1585191 1571721 1560774 1552480
53375 1552480 1546550 1543366 1543791 1548095 1555963 1567484 1583108 1602486 1624439 1648609 1676256 1708655
53363 1708655 1745269 1784239 1824294 1865629 1909283 1956264 2006891 2060326 2115015 2170195 2226828
53352 2226828 2286513 2349746 2415791 2483899 2553921 2625998 2700565 2778612 2860984 2947183 3035633
53341 3035633 3125463 3217379 3312451 3410595 3510538 3610733 3709876 3807155 3902693 3997584 4092839
53330 4092839 4188144 4281780 4371673 4456393 4535365 4608618 4676523 4739583 4798166 4852052 4900049
53319 4900049 4940329 4971673 4994554 5010675 5021287 5026101 5023824 5013426 4994671 4967765 4932745 4889173
53307 4889173 4836285 4773546 4701119 4619739 4530226 4433371 4330261 4222396 4111391 3998707
53297 3998707 3885452 3772045 3658221 3544001 3430728 3320484 3214302 3111557 3011381
53288 3011381 2913901 2819574 2727991 2638226 2550152 2464700 2382831 2304727 2229887 2157664 2087864
53277 2087864 2021218 1959096 1902415 1851038 1804482 1762731 1725781 1692827 1662740 1635221 1610796
53266 1610796 1589853 1572497 1559213 1550624 1546316 1544808 1545074 1547415 1552372 1559461 1567628 1576606 1587271
53253 1587271 1600801 1617741 1637607 1659148 1681285 1704180 1729178 1757499 1789219 1823614 1860059
53242 1860059 1898202 1937666 1978089 2019464 2062281 2107447 2155935 2207799 2261285 2313596 2363160
53231 2363160 2410735 2457671 2503634 2546882 2586470 2623056 2657239 2688050 2713701 2733434 2748035
53220 2748035 2758658 2765575 2768226 2766266 2760244 2751152 2739460 2724871 2706896 2685219 2659442 2629103
53208 2629103 2594363 2556186 2515295 2471269 2423238 2371210 2316095 2258675 2199278 2138381 2076766
53197 2076766 2014986 1953124 1890978 1827886 1762737 1695364 1628117 1564796 1507430 1454792 1404446
53186 1404446 1355186 1306772 1258540 1209793 1161025 1113361 1066864 1020719 975139 931774 891867
53175 891867 855156 821121 790097 762310 736796 712546 690156 670977 654716 639222 622995
53164 622995 606775 592093 579230 567479 556615 546834 537498 527265 515850 504755 495740 489130
53152 489130 483975 479228 474278 468983 463915 460114 457863 455980 453061 449100 444951 440522 434733 427475
53138 427475 420420 415313 412332 410582 409250 407461 403898 397801 390137 382897 377399 373920 372605 373550
53124 373550 375854 377539 376974 374086 370072 366269 363325 360992 358655 356297 354770 354677 355323 355481 355043 355025
53108 355025 355959 357191 357948 358161 357900 356862 355014 352952 351040 348887 346375 344557 344610 346230 347909 348572
53092 348572 348269 347475 346527 345711 345170 344651 343823 342815 341929 340991 339612 337994 336775 336134 335798 335949 337243
53075 337243 339612 341884 343100 343635 344459 345669 346289 345309 342549 338679 334811 331912 330330 329785 329803 329939
53059 329939 329715 328872 327808 327167 326748 325458 322796 319756 317576 316152 314698 313669 314840 319076 324813
53044 324813 329217 330379 328151 323592 318287 313763 310614 308057 304931 301335 298737 298126 298481 297725 295130
53029 295130 292155 290629 290639 290721 289751 287895 285731 283391 281072 279742 280372 282617 285020 286674 288052 289875
53013 289875 291768 292671 292339 291689 291450 291014 289145 285681 282015 279691 278894 278647 278252 278013 278445 279253 279442
52996 279442 278299 276064 273750 272376 272220 272563 272296 270960 269103 267590 266864 267074 268444 270891 273362
52981 273362 274257 272793 269629 265904 262022 257701 253056 249095 246904 246556 247148 247891 248784 249999 251037
52966 251037 251174 250696 250885 252429 254513 256039 257155 258799 261097 263105 264054 264025 263424 262687 262627 264039 266476
52949 266476 268201 267938 266114 263899 261773 259753 258410 258486 259542 259964 258666 256292 254487 254292 255419
52934 255419 256719 257165 256509 255229 253925 252802 251710 250446 248977 247631 247090 247826 249363 250550 250866
52919 250866 250931 251268 251149 249537 246973 245439 246076 247751 248347 247073 245084 243997 244186 244590 244079 242865
52903 242865 242342 243538 246180 249562 253691 258798 264005 267558 268645 268260 267942 268288 269008 269756 270285 270114
52887 270114 268706 266021 262697 259763 258124 257898 258043 257067 254435 251112 248532 247328 247176 247417 247499 247161
52871 247161 246566 246024 245401 244126 241932 239120 235907 232133 227984 224374 221923 220116 218150 216277 215559
52856 215559 216496 218604 221112 223473 225444 227334 229857 232979 235275 235413 234067 233245 233785 234699 235028 234960
52840 234960 234765 234003 232588 231505 231525 232000 231925 231478 231555 232265 232876 232967 232843 233095 234347 236866 239645 240597
52822 240597 238858 236468 236425 239137 242083 242971 241893 240212 238774 237890 237856 238642 239827 241460 244197 247927
52806 247927 251173 252778 253375 254230 255231 255228 253926 252175 250565 249041 247979 248371 250491 253475 256679 260403
52790 260403 264418 266764 265389 260845 256237 254107 254074 253856 252086 249576 248114 248573 250311 251994 252603
52775 252603 251772 249630 246667 243671 241318 239646 238151 236633 235751 236401 238585 241249 243249 244053 243414
52760 243414 241038 237223 233451 231428 231338 231768 231607 231255 231500 232018 231974 231607 232039 233472 234666 234594 233813 233792
52742 233792 235453 238672 242536 245678 247024 246708 245758 244594 242587 239552 236734 235420 235229 234730 233204
52727 233204 230820 227688 224033 220961 219681 219981 220625 221130 221849 222389 221614 219623 218175 218477 219891 221545
52711 221545 223813 227127 230534 232724 233648 233977 233775 232958 232352 232844 233908 234275 233708 232935 232292 231802 232077
52694 232077 233399 234094 231855 227017 222684 220922 220560 219718 218818 219614 222329 225415 227585 228641 228660 227832
52678 227832 227101 227714 229816 232296 234215 235604 236786 237748 238576 239811 241869 244482 247024 249062 250359
52663 250359 250765 250519 250303 250467 250399 249164 246772 244214 242041 239433 235250 229904 225577 224290 225933 228385
52647 228385 229404 228297 225994 223852 222407 221153 219564 218204 218367 220365 222754 223886 223913 224374 225850
52632 225850 227017 226490 224834 224008 225117 227324 228912 228907 227676 226368 225992 226887 228796 231280 233989 236740
52616 236740 239529 242296 244388 244563 242129 238077 234425 232274 231055 229855 228780 228585 229541 231240 233202
52601 233202 235126 236720 237712 238001 237734 237463 238102 240073 242404 243581 243653 244500 247281 250603 252386 252814
52585 252814 253931 256533 258914 259020 256733 253649 251376 250389 249877 248471 245719 242909 241800 242539 243682
52570 243682 244229 244497 244729 244194 242492 240844 240992 243264 246448 249221 251034 252012 252678 253556 254544 254980 254654
52553 254654 254160 253816 253006 251323 249560 248471 247211 244457 240839 238663 239003 240494 241514 242226 243666
52538 243666 245889 248095 249905 251350 251951 250960 248614 246357 245536 246369 248199 250288 252193 253875 255633
52523 255633 257681 259628 260716 260815 260949 262466 265557 268736 270037 268891 266789 265865 266784 268348 269182 269295
52507 269295 269522 269960 269808 268671 267152 265840 264434 262359 259765 257332 255455 254221 253993 255296 258016
52492 258016 261221 263958 265948 267471 268897 270441 272034 273225 273474 272704 271464 270491 270170 270288 270025 268369
52476 268369 265087 261437 259434 260114 262677 265338 266691 266309 264800 263620 264150 266298 268321 268629 267427
52461 267427 266046 265001 263639 261722 260416 261194 264145 267762 270317 271227 271235 271437 272231 273314 274588 276582
52445 276582 279673 283270 286286 288266 289543 290467 291018 291211 291299 291526 291974 292529 292625 291401 288903 286780 286699
52428 286699 288021 288300 286493 284400 284134 285238 285462 283755 281187 279067 277441 275774 274268 273895 275328
52413 275328 278111 280935 282803 283925 285131 286442 286914 286259 285756 286743 288778 290378 291237 292482 294711
52398 294711 297051 298621 299908 301969 304911 307814 309810 310612 310300 309175 307756 306508 305422 304017 301768
52383 301768 298647 295475 293600 293725 294867 295001 293055 289981 287626 286874 287203 287640 287640 287178 286453 285604 284497
52366 284497 282798 280335 277336 274292 271807 270587 271136 273189 275771 278106 280267 282697 285469 288346
52352 288346 291223 294067 296674 298930 301146 303717 306676 310040 314260 319683 325811 331793 337490 343137
52338 343137 348044 350761 350774 348969 346001 341471 335615 330523 328109 327429 325810 322589 320129 320633 323413
52323 323413 326095 327299 327062 325640 323385 321416 320895 321469 321625 320936 320930 323117 326934 330377 332255 333110
52307 333110 334211 336374 339779 344225 349120 353512 356566 358151 358880 359442 359900 359715 358555 356905 355708
52292 355708 355484 356066 357051 358045 358472 357772 356144 354676 354262 354636 354988 355339 356728 359913 364339 368675 372151
52275 372151 375181 378738 383323 388583 393974 399591 406115 413866 422216 430173 437375 444341 451969 460880
52261 460880 470879 480725 488865 494932 500272 506397 513130 519048 523633 527967 532953 537810 541118 542762
52247 542762 543936 545414 546772 547452 547737 548151 548427 547869 546662 546167 547578 550723 554591 558737 563449 568593
52231 568593 573132 576267 578484 580837 583562 586068 588026 589665 591042 591929 592557 593677 595590 597831 600205
52216 600205 603340 607628 612308 616295 619433 622185 624633 626839 629832 634963 641998 648865 653828 657274
52202 657274 660885 665654 671335 677500 684313 692060 700207 707266 711842 714014 715481 717963 721564 725208
52188 725208 728619 732948 739064 746052 752146 756684 760369 763944 767575 771427 775830 780611 785103 789203
52174 789203 793788 799646 806532 813680 820626 826946 831949 835538 839080 844375 851772 860091 868336 876540
52160 876540 884801 892565 899389 905639 911837 917988 924112 930813 938543 946740 954416 961182 967045 971861
52146 971861 976088 981629 990381 1001724 1012698 1021109 1027459 1033377 1039323 1044662 1049072 1052695 1055328 1056509
52132 1056509 1056306 1055263 1053657 1051487 1049092 1047175 1046246 1046549 1048372 1051736 1055838 1059369 1061507 1062117 1061255
52117 1061255 1059146 1056532 1054105 1051543 1048017 1043868 1040631 1038818 1036729 1032517 1026705 1021505 1017958 1015055
52103 1015055 1011663 1007993 1004779 1002227 1000616 1000961 1003789 1007627 1009925 1009712 1008452 1008107 1009269 1011566 1014848
52088 1014848 1018935 1022776 1024969 1025197 1024325 1023154 1021897 1020996 1021351 1023220 1025620 1027494 1028870 1030241 1031374
52073 1031374 1031628 1031140 1030798 1031156 1032200 1034132 1037427 1041931 1046788 1051664 1057377 1064885 1074220 1084922 1096976
52058 1096976 1110721 1126108 1142512 1159044 1174712 1188777 1201542 1214368 1228078 1241489 1252386
52047 1252386 1259964 1265403 1269795 1272499 1272262 1269238 1264805 1259574 1252752 1243889 1234424 1226624 1221250 1217113
52033 1217113 1213095 1209835 1208874 1210529 1213413 1216088 1218481 1221243 1224271 1226602 1227661 1227883 1227770 1226859 1224172
52018 1224172 1219557 1214147 1209408 1206050 1203914 1202553 1201578 1200630 1199430 1198019 1196828 1196291 1196245 1195707 1193393
52003 1193393 1188824 1183022 1177871 1174506 1172390 1170097 1166792 1162726 1158549 1154628 1150996 1147451 1143560 1138986
51989 1138986 1133926 1128855 1123730 1117964 1111432 1104960 1099377 1094587 1090168 1086473 1084324 1083634 1083082 1081403
51975 1081403 1078587 1075618 1073358 1071873 1070645 1069330 1068287 1068249 1069358 1070925 1072474 1074548 1077889 1082087
51961 1082087 1085800 1088156 1089130 1088724 1086825 1084090 1081859 1080584 1079155 1076383 1072425 1068088 1063446 1058066
51947 1058066 1052067 1045750 1038350 1028250 1014854 999648 984959 971935 959842 947143 933195 919003
51935 919003 906181 894975 883473 869148 851136 830879 810879 793133 778421 766375 756153
51924 756153 747383 740416 735393 731355 726841 721311 715465 710106 705168 700004 694263 688282 682670 677464
51910 677464 671779 664700 656681 649382 643696 638726 633569 629277 627657 628488 629695 630468 632582 637912 646095
51895 646095 655634 666077 677779 690365 702838 714853 726555 737337 745926 751799 755564 757861
51883 757861 758808 758652 758098 757693 757571 758120 760244 764533 770538 777194 783792 790563 798564 808881 821426
51868 821426 834578 846501 856563 864787 870243 871250 867334 859685 849198 835399 818167 799228
51856 799228 780448 761547 741142 719668 699406 681599 665313 649654 635293 622890 611571
51845 611571 600449 590544 583432 578629 574178 569730 567046 567039 568074 568291 568214 569714 573348 578361 584743
51830 584743 593358 603636 612808 618420 620701 621506 621614 620222 616774 611974 606692 600969 594787 589207
51816 589207 585836 585252 586635 588974 592035 595938 600443 605217 610437 616538 623382 630228 636542 642307
51802 642307 647511 651899 655430 658368 660489 660791 658652 654879 650912 647265 643514 639705 636862 636007 637567
51787 637567 641940 649602 659940 670711 679630 686154 690830 693128 691040 683230 670844 656655 642807
51774 642807 629874 617712 606335 595629 584900 573552 562226 552562 545467 540168 535554 531872
51762 531872 530190 530372 530799 530398 529869 530249 531168 531414 530554 528970 526710 523469 519619 516253 514131 513392
51746 513392 514170 516404 518901 519954 519582 520125 523635 529261 534105 536231 535847 533864 530526 525893 520792
51731 520792 516483 513473 511050 508086 504230 500256 497236 495413 494069 492542 491060 490309 490485 491230 492441
51716 492441 494507 497416 500000 500715 499300 497248 496313 496745 497317 496963 495909 495172 495553 497374 500623 504852
51700 504852 509411 514408 521022 530129 540899 551536 560948 568528 572743 571897 566933 561707 559133 558140
51686 558140 555702 550924 545434 540405 535229 529269 523093 517273 511379 505244 500340 498780 501211 506418
51672 506418 512870 520044 528218 537286 545997 552569 556316 558511 561222 565411 570600 576075 581536 586522
51658 586522 590243 592398 593314 592842 590057 584832 578971 574789 572779 571424 569029 565040 559862 554223 548806
51643 548806 543961 539794 536840 536230 538569 542956 547859 552646 557276 560686 560936 557540 552717 549480 548891
51628 548891 549751 550558 551061 551986 553795 555904 556965 555920 552889 548995 545463 543055 542143 542658 543745 544107
51612 544107 543210 541893 541439 542305 544143 546882 551285 558352 568294 580006 591480 601079 608679 615294
51598 615294 621287 625255 625138 620247 611727 601230 589902 578791 569394 562974 559412 557328 555593 554448
51584 554448 554873 556939 559195 559868 558454 555733 552331 547815 541463 533441 524760 516245 508024 499995 492357
51569 492357 485568 480035 475890 472822 470053 466715 462404 457439 452723 449427 448449 449673 451798 453273
51555 453273 453402 452312 450125 446869 443272 440900 440946 443189 446399 449428 451670 452911 453348 453629 454365 455581
51539 455581 456874 458038 459259 460837 463078 466357 470935 476613 482865 489417 496580 504953 514770 525319
51525 525319 534947 542042 546369 549240 552067 555003 557457 559612 562792 568268 576202 585753 595749 605442
51511 605442 615301 627069 642246 660299 679118 697462 716184 736666 759035 782565 806954 832168
51499 832168 857548 882274 906577 931590 958217 987051 1019193 1055835 1096699 1139815 1182996
51488 1182996 1224415 1261453 1290481 1309062 1317748 1318675 1312854 1299749 1279005 1251267 1217350 1177915
51476 1177915 1134432 1089421 1045057 1002051 960486 921110 884992 852137 821409 792093 764898
51465 764898 740989 720571 703029 688231 676730 668415 661716 654809 647193 639372 631385 622730 613681
51452 613681 605412 598322 591302 583497 575812 569577 564427 558886 552674 546862 541616 535413 527246 518430
51438 518430 511325 507014 505003 504425 504502 504356 503446 502090 500787 499326 497399 495754 495524 496389 496587 495197
51422 495197 493415 492924 493781 494665 494642 493849 492766 491730 491110 491177 491543 491230 489518 486472 482665 478833 475796
51405 475796 474058 473127 471728 469163 466186 464107 463289 463084 463048 463552 465024 467180 469324 471049 472415 473808
51389 473808 475929 479531 484696 490552 496089 501092 505937 510824 515840 521622 529203 539048 550800 564057
51375 564057 578577 593374 606382 615804 621536 624768 626530 627201 626973 625841 623107 617796 609944 600978
51361 600978 592477 584915 577812 570618 563098 555329 547883 541826 537990 536196 535572 535536 536125 537374 538995
51346 538995 540965 543957 548607 554472 560230 565030 569297 574042 579732 586004 592145 597430 601334 603990
51332 603990 606468 609990 614671 619487 623727 628163 634444 643584 655289 668494 682256 696343 711405
51319 711405 728642 749086 773108 800576 831343 865589 903928 947063 994870 1045772 1097590
51308 1097590 1149082 1199883 1248660 1292375 1328161 1355072 1373036 1380980 1377430 1362464 1337426 1303025
51296 1303025 1259655 1209748 1157622 1105891 1053644 999451 944860 893338 846714 804441 765961
51285 765961 732029 703519 680097 660388 642712 625703 608977 593191 578812 565192 551688
51274 551688 539192 529198 521531 514523 507607 502103 498795 496184 492250 486880 481402 476376 471088 464922
51260 464922 458244 451963 447003 444068 443207 443481 443552 442666 440869 438686 437023 436927 438593 440647 441175 439631
51244 439631 437295 435823 435885 437242 439432 442037 444660 447090 449401 451695 453811 455362 456036 455927 455664
51229 455664 455969 456794 457065 455664 452587 448795 445101 441765 439112 437746 437784 438486 439141 439971 441592 443783
51213 443783 445476 446018 445970 446425 447837 449770 451499 452512 452630 452199 452320 454309 458266 462325 464044 462918
51197 462918 461127 461475 464871 470093 475451 479814 482171 481353 477013 470574 464487 460377 458039 456247 454219
51182 454219 452137 450323 448299 445099 440634 436238 433436 432398 432183 432229 432781 433766 434316 434007 433768 434600
51166 434600 435866 435934 434477 433045 432978 433689 433632 432472 431478 431901 433621 435501 436707 437505 438915 441664 445394
51149 445394 448926 451429 453273 455527 458729 462436 465980 469242 472423 475358 477603 479193 480844 483083
51135 483083 485449 487001 487643 488556 491010 494879 498681 501207 502827 504855 507675 509993 510306 508870 507653
51120 507653 508183 509965 511344 511502 510932 510201 509039 506993 504321 501806 500026 499139 499023 499107 498407 496353
51104 496353 493501 490836 488499 485966 483503 482410 483181 484205 483325 480517 478043 477785 479198 480363 480398
51089 480398 480035 479972 479552 477548 473895 470046 467580 466834 467039 467378 467486 467069 465658 463032 459666 456514
51073 456514 454358 453381 453201 453215 453155 453359 454248 455541 456472 457009 458272 461105 464643 467121 468003 468505 470035
51056 470035 473008 477399 483255 489811 494972 497051 497004 497884 501839 508374 515717 522910 529842 535898 539834
51041 539834 541234 541485 542760 546124 550866 555612 559711 563364 566646 568953 569667 569055 568073 567372 566840 566113
51025 566113 565012 563307 560569 556689 552242 547866 543507 538862 534550 532110 532437 534762 537611 540408
51011 540408 543510 547010 550438 553735 557520 561845 565513 567583 569095 572104 577058 582329 586673 591003
50997 591003 596964 604617 612568 619866 626607 632775 637559 640168 640851 641013 642673 647363 654637 661805 666184
50982 666184 667802 669040 671589 674942 678213 682018 687618 695197 704025 713479 722771 730326 734878 736889
50968 736889 737629 737000 733555 726746 717841 708359 698690 688733 678844 669593 661316 654357 649040 645060 641684
50953 641684 639003 638097 639389 641657 643476 644959 647294 651203 656730 663936 672638 681715 689734 696266
50939 696266 701880 707133 712506 718965 727168 735838 742148 744440 743897 743172 744069 746998 751692 757450 763089
50924 763089 767728 771856 777121 784940 795471 807825 820858 833714 845868 856831 865931 872533 876423
50911 876423 877845 877270 875560 874169 874354 875630 875584 871889 864426 855058 845614 836733 828363 820544 813526
50896 813526 807819 804435 804565 808510 815281 823640 833326 844827 858189 872649 887591 903517 921768
50883 921768 943472 968814 997097 1027299 1058762 1091704 1126858 1164145 1201575 1236007 1265429
50872 1265429 1290324 1312467 1332668 1350115 1363667 1373010 1378429 1380233 1378861 1374986 1368864 1359792 1346890
50859 1346890 1330415 1311867 1292726 1273351 1253145 1231514 1208703 1185906 1164504 1144920 1126281
50848 1126281 1107492 1088493 1070108 1052888 1036734 1021602 1007816 995310 983204 970672 957975
50837 957975 946187 936110 927772 920650 913848 906246 897132 886948 877173 869322 864042 860907 858747
50824 858747 856326 853148 849671 846460 843170 838796 832959 826486 820493 815287 810590 806583 804155 803885
50810 803885 805060 806126 806327 806729 809203 814233 820097 824645 827614 830555 834613 839401 844491 850946 860129
50795 860129 871287 881693 889658 896480 904672 914904 925688 935766 945644 956498 968603 981584
50783 981584 995573 1011167 1028361 1046348 1064500 1082936 1102018 1121969 1143368 1167308 1194416
50772 1194416 1223972 1254609 1285749 1317959 1352106 1388741 1428245 1471046 1517554 1568085 1622628
50761 1622628 1680363 1739796 1800098 1862073 1926925 1994072 2061130 2126127 2188613 2248115 2302680
50750 2302680 2349819 2388170 2417416 2437399 2448383 2451526 2447759 2436558 2417188 2390995 2361033 2329378
50738 2329378 2296327 2262603 2230608 2202398 2177649 2154943 2134337 2117388 2105162 2097576 2094404 2095560
50726 2095560 2100213 2106860 2114735 2124306 2136008 2149220 2162955 2176756 2190246 2202344 2211705 2217769
50714 2217769 2220821 2221134 2218544 2212752 2203581 2190861 2174424 2154077 2129226 2098741 2061821 2019150
50702 2019150 1972580 1923449 1871801 1817696 1762685 1709128 1658220 1609484 1562400 1517783 1477154
50691 1477154 1441214 1409499 1381219 1355849 1332936 1311945 1292584 1275036 1259679 1246722 1236253
50680 1236253 1228488 1223666 1221654 1221836 1223630 1227161 1233165 1242134 1253854 1268082 1285199 1305268 1326449
50667 1326449 1345607 1361307 1375546 1391599 1410644 1431386 1452447 1473626 1494784 1515128 1534355
50656 1534355 1553434 1573340 1593747 1613775 1633356 1653013 1672810 1692494 1712368 1733119 1755036
50645 1755036 1778377 1804322 1834499 1869392 1908065 1949650 1994206 2041761 2091358 2141677 2192073
50634 2192073 2242366 2291875 2339294 2383520 2424274 2461962 2497198 2530592 2562879 2595064 2628035
50623 2628035 2661848 2695724 2729250 2763347 2799346 2837095 2874805 2911139 2946870 2984040 3024078
50612 3024078 3067474 3115030 3168531 3229713 3298685 3373580 3451928 3532427 3615145 3699728 3783830
50601 3783830 3864198 3939538 4011435 4081968 4151187 4217717 4281166 4342626 4402735 4460335 4513505
50590 4513505 4561130 4602977 4638951 4669305 4695571 4720474 4746425 4774282 4803843 4835326 4869821
50579 4869821 4908211 4950379 4996121 5046390 5102362 5162836 5223564 5279981 5330101 5373861 5410421
50568 5410421 5437557 5453748 5459313 5455009 5440825 5416979 5384687 5344239 5292864 5226345 5143394 5047628
50556 5047628 4945194 4841643 4741458 4649045 4568436 4501912 4449675 4410804 4383858 4366635 4356176
50545 4356176 4349445 4343723 4336259 4323908 4303376 4271718 4226838 4168174 4097175 4016675 3929363 3836747
50533 3836747 3739396 3637714 3532453 3425200 3318691 3215975 3118620 3026209 2938239 2856025
50523 2856025 2781757 2716008 2657561 2606026 2563199 2530737 2507315 2489568 2475879 2468028 2468532 2477153
50511 2477153 2490865 2506973 2525458 2548099 2575920 2607942 2642074 2676552 2710495 2743754 2776766
50500 2776766 2810311 2844835 2880007 2915483 2952277 2993017 3040483 3096054 3159690 3231037 3310030
50489 3310030 3396498 3489824 3589302 3694588 3805460 3921156 4040189 4160863 4281901 4402792
50479 4402792 4523977 4646876 4773369 4904876 5042040 5185472 5336389 5495796 5663140
50470 5663140 5836658 6015532 6201188 6395919 6600583 6814020 7034308 7259936 7490142
50461 7490142 7724745 7963403 8204112 8442283 8671859 8887340 9084214 9257820 9403002
50452 9403002 9515213 9591121 9627911 9623050 9575474 9486379 9358417 9194869 9000247 8781032
50442 8781032 8545097 8300882 8057399 7823602 7606212 7408574 7232955 7083415 6964806
50433 6964806 6878930 6823270 6793679 6786489 6797085 6817819 6838750 6850059 6843303 6811798 6751584 6662038
50421 6662038 6544518 6400538 6232148 6043597 5841009 5629873 5413657 5195030 4977319
50412 4977319 4764024 4557696 4359977 4172093 3994493 3826376 3666615 3515218 3373322
50403 3373322 3241821 3120655 3009400 2907792 2815378 2731172 2654003 2582889 2517001 2455862
50393 2455862 2399884 2350154 2307176 2270079 2237475 2208709 2183800 2162474 2143981 2127841 2114305
50382 2114305 2104051 2097738 2095623 2097114 2100789 2105473 2111357 2119719 2131588 2147221 2166681 2190194 2217896
50369 2217896 2249855 2286504 2328319 2374903 2425080 2478245 2535002 2596163 2661704 2731114 2804217
50358 2804217 2881354 2963313 3051409 3146926 3249960 3359312 3473850 3593345 3717693 3846358
50348 3846358 3979215 4116793 4258533 4401706 4543489 4683560 4823078 4961279 5094580
50339 5094580 5219053 5332246 5432154 5515785 5579672 5621051 5638058 5629408 5594444 5533189 5446429
50328 5446429 5336622 5208884 5070050 4926172 4781401 4639220 4503436 4377345 4263080
50319 4263080 4162670 4078736 4012770 3963150 3926127 3898801 3880339 3870316 3866550 3864551 3858398 3842291
50307 3842291 3812244 3766963 3707149 3634047 3548989 3453983 3351909 3245648 3137130 3027382
50297 3027382 2917291 2808098 2701229 2597816 2498530 2403900 2314514 2230647 2151876 2077487
50287 2077487 2007348 1941961 1881657 1826186 1775135 1728201 1685005 1645351 1609865 1579459 1553608
50276 1553608 1529938 1506360 1483157 1462223 1444619 1429698 1416209 1403232 1390209 1376993 1364031
50265 1364031 1351739 1339740 1327518 1315787 1306131 1298931 1292575 1285326 1277342 1270238 1265224 1262397 1261455
50252 1261455 1262288 1264866 1269207 1275523 1283950 1293993 1304661 1315307 1326056 1337242 1348753 1360280
50240 1360280 1371971 1384294 1397034 1408897 1418578 1426138 1432831 1439552 1445938 1451276 1455711 1459948 1464059
50227 1464059 1467352 1469520 1471215 1473194 1475444 1477644 1480063 1483336 1487406 1491462 1495250 1499991 1507440 1518243
50213 1518243 1531901 1548555 1570083 1598474 1632790 1668034 1697289 1715118 1719352 1710565 1690705 1662266
50201 1662266 1628122 1591423 1555089 1521085 1490105 1462091 1437131 1415670 1397833 1382951 1370133
50190 1370133 1359160 1350360 1343630 1338080 1332979 1328741 1326477 1326620 1328414 1330904 1334003 1338177 1343413 1349124
50176 1349124 1355057 1361540 1368567 1375236 1380633 1384826 1388286 1390665 1390933 1388783 1385188 1381308 1377280 1372208
50162 1372208 1365101 1355840 1345589 1336077 1328043 1320625 1312867 1305536 1300489 1298452 1298506 1299829 1302620 1306858
50148 1306858 1311427 1315413 1319498 1325356 1334301 1346929 1363001 1380976 1398898 1416881 1437807 1464256
50136 1464256 1495630 1529774 1566604 1608263 1656051 1709242 1767197 1830784 1901047 1977762 2059909
50125 2059909 2146404 2235756 2326073 2416097 2505302 2592271 2673707 2745868 2806845 2857422 2900416
50114 2900416 2939180 2975644 3009113 3037356 3058737 3072288 3075833 3065774 3039504 2996774 2938185
50103 2938185 2864127 2776574 2680413 2580996 2480928 2380824 2282483 2189365 2104065 2027134 1958611
50092 1958611 1899000 1848193 1804851 1767690 1736455 1710983 1690009 1671450 1653222 1633459 1610920
50081 1610920 1585998 1560746 1537126 1515434 1494801 1474620 1454869 1435516 1416553 1398645 1383087
50070 1383087 1370850 1361858 1355155 1349713 1345311 1342814 1343256 1346324 1350066 1352510 1353386 1353900 1355211 1357712
50056 1357712 1361496 1366659 1373031 1380317 1388698 1398669 1409982 1421383 1431833 1441557 1451446 1461906 1472916
50043 1472916 1484793 1498115 1512996 1529184 1546798 1566187 1586982 1608187 1629481 1651621 1675069
50032 1675069 1699075 1722916 1747454 1774460 1804656 1837333 1871788 1908174 1946820 1987781 2031589
50021 2031589 2079698 2133490 2193204 2258386 2329110 2406197 2490425 2582149 2681798 2790428 2909564
50010 2909564 3040492 3183482 3337267 3499033 3664890 3830494 3991591 4144671 4287647
50001 4287647 4420072 4542614 4656358 4762471 4861994 4955381 5042061 5120403 5187736 5239896
49991 5239896 5270940 5274309 5245432 5183821 5092712 4976683 4839667 4684882 4515790 4336326
49981 4336326 4150376 3961698 3774485 3593116 3420729 3258371 3106036 2964193 2833664
49972 2833664 2714449 2605742 2507333 2420077 2344366 2278582 2219691 2165228 2114282 2066719 2022116
49961 2022116 1979791 1939639 1902490 1869281 1839884 1812815 1786085 1758164 1728365 1696997 1665536
49950 1665536 1636136 1610144 1586845 1563924 1539285 1512500 1484817 1457966 1432685 1408137 1383234
49939 1383234 1358693 1337094 1320237 1307081 1295182 1283708 1274045 1267744 1265028 1265173 1267219 1270334 1274552
49926 1274552 1281083 1290669 1301716 1311473 1319154 1326285 1333716 1340231 1344897 1348911 1353770 1359071 1363564 1367146
49912 1367146 1370207 1372174 1372555 1372683 1374536 1378270 1382736 1388175 1396586 1409387 1426220 1446081 1468103
49899 1468103 1491297 1515459 1542880 1577500 1621415 1673231 1730462 1792501 1860722 1936874 2022287
49888 2022287 2117740 2222832 2335562 2452860 2571141 2686240 2793844 2891100 2977719 3055278
49878 3055278 3125639 3190071 3249079 3302504 3349894 3390708 3423397 3444154 3447429 3428309 3384166
49867 3384166 3314327 3219523 3102550 2968675 2824309 2675203 2525991 2380570 2242012 2112310
49857 2112310 1992731 1884205 1787047 1700700 1624175 1556512 1496671 1443592 1396726 1355985 1320805
49846 1320805 1289877 1262236 1237975 1217343 1199855 1184920 1172651 1163151 1155506 1148448 1141743 1136115
49834 1136115 1132091 1129779 1129541 1131863 1136494 1142354 1148315 1153423 1156561 1156814 1154305 1150108 1145249 1140239
49820 1140239 1135352 1130470 1124648 1116596 1105771 1092354 1076204 1056820 1034719 1011965 990747 971839
49808 971839 954783 939041 924475 911167 899366 889492 881874 876589 873535 872233 871494 870038 867921
49795 867921 866797 868174 871850 876624 882127 889133 898217 908935 920436 932217 944089 956044 968458
49782 968458 981965 996584 1011126 1023827 1033656 1040904 1046538 1051057 1054018 1054740 1053405 1051078 1048310
49769 1048310 1044086 1036833 1026506 1015039 1004491 995348 987010 979272 972584 967141 962533 958403 954963
49756 954963 952733 952064 952880 954615 956605 958983 962988 969753 978857 988712 998266 1007569 1016717 1025402 1033795
49741 1033795 1042683 1051970 1059966 1065240 1068549 1071916 1076118 1080014 1081982 1081038 1076823 1069598 1060200 1049081
49727 1049081 1035554 1019097 1001215 984659 970652 958242 946689 936817 929177 922360 914522 905687
49715 905687 897231 889734 882784 876536 872009 869730 869232 870006 871893 874273 876005 876820 878144 881851 888492
49700 888492 897216 907191 918581 932044 947500 963509 977867 988850 996026 1000132 1002566 1004889 1008046
49687 1008046 1011556 1013805 1013714 1011809 1009092 1005233 998788 989315 978377 968142 959614 952645 946961 942430
49673 942430 938540 934428 929697 924929 921263 919585 920100 922335 925316 927900 929352 929844 930286 931510 933702
49658 933702 936772 941037 947147 955334 965177 976218 988473 1002306 1018139 1036236 1056002 1075208
49646 1075208 1090687 1100541 1105332 1106713 1105644 1102693 1099299 1097223 1096651 1096021 1094061 1091114 1088129 1085206
49632 1085206 1081650 1076811 1070394 1062486 1053780 1045294 1037430 1029656 1021525 1013586 1006964 1002491 1000559 1001126
49618 1001126 1003266 1005359 1006713 1008808 1013981 1022896 1034025 1045688 1057781 1071219 1086348 1102285
49606 1102285 1117309 1129525 1137625 1141713 1143406 1144694 1146521 1148559 1150177 1151301 1152342 1153763 1155979
49593 1155979 1159340 1163515 1166711 1166097 1159637 1147505 1131343 1112431 1091299 1069034 1047844 1029517
49581 1029517 1013931 999815 986666 974995 964992 956069 947954 941283 936619 933566 931411 930053 929632
49568 929632 929646 929208 928050 926723 925816 925421 925221 924571 922618 918958 914284 909785 905750 901266 895676 889875
49552 889875 885662 883897 883613 883004 881202 879102 878431 879928 882588 884879 886419 887988 890114 892519 895113
49537 895113 898639 903722 909878 916143 922209 928234 933877 938312 941050 942065 941321 939083 936643 935749 936958
49522 936958 939256 941534 943713 946103 948459 950361 952034 954159 957125 960925 965486 970664 976202 982163
49508 982163 989122 997445 1006584 1015602 1024234 1032908 1041862 1050805 1059507 1068168 1077011 1085765 1093647 1099682
49494 1099682 1103161 1104115 1103361 1101717 1099162 1095024 1089111 1082407 1076486 1072286 1069423 1066658 1063204 1059644
49480 1059644 1057343 1056834 1057222 1057517 1058000 1059565 1062028 1064072 1065046 1065905 1067969 1071376 1075264 1079003 1082747
49465 1082747 1087161 1093177 1101756 1113209 1126743 1141202 1156235 1172224 1188934 1204784 1217903 1227772
49453 1227772 1235507 1242626 1249756 1256579 1262861 1269205 1276616 1285382 1294753 1304054 1313751 1324750 1336503
49440 1336503 1346479 1351984 1352051 1347109 1337427 1322937 1304535 1284424 1264676 1246131 1229049 1213925 1200945
49427 1200945 1189340 1178288 1168024 1159161 1151339 1143690 1136474 1130976 1127543 1124951 1122126 1119416 1117590
49414 1117590 1116556 1115819 1115374 1115300 1115067 1114167 1112917 1111776 1110322 1107836 1104629 1101847 1100078 1098988 1098229 1097991
49398 1097991 1098665 1100613 1104099 1108721 1113068 1115800 1117113 1118389 1120376 1122373 1123156 1121848 1117964 1111672
49384 1111672 1104358 1098070 1093879 1091257 1089118 1086756 1083739 1079972 1076314 1074143 1073658 1073399 1072115 1070369
49370 1070369 1069628 1070548 1073039 1077329 1083786 1092065 1101526 1112378 1125472 1141208 1159664 1181581 1207847
49357 1207847 1237974 1270654 1306420 1347853 1395234 1442462 1479244 1498077 1498656 1485847 1464982 1439838
49345 1439838 1413507 1388910 1367821 1350398 1336309 1325905 1319936 1318589 1321255 1326903 1334371 1342736
49333 1342736 1351995 1363041 1376233 1390146 1402515 1412473 1421079 1429391 1436819 1441837 1443690 1442762 1439770
49320 1439770 1435487 1431037 1427414 1424410 1420706 1415446 1409189 1402824 1396199 1388782 1381487 1376666 1375811 1378093
49306 1378093 1381816 1386502 1392509 1399172 1404877 1409179 1413410 1418479 1423253 1426072 1427008 1427405 1427773 1427465 1426244
49291 1426244 1424818 1423578 1421864 1418848 1414373 1408643 1401894 1394746 1388183 1382767 1378419 1375222 1373773 1374204
49277 1374204 1375482 1376280 1376238 1375789 1375045 1373413 1370241 1365553 1360226 1355568 1352348 1349907 1346464 1340738 1333202
49262 1333202 1325629 1319634 1315864 1314175 1314009 1314516 1314731 1313987 1312341 1310592 1309633 1309575 1309665 1309299 1308879 1309205 1310215
49245 1310215 1311078 1311551 1312537 1314900 1318283 1321463 1323529 1324379 1324461 1324441 1324947 1326317 1328668 1332240 1337383 1344066
49229 1344066 1351735 1359902 1368566 1377811 1387165 1395703 1402879 1409233 1416090 1424206 1432640 1439533 1444295 1448413
49215 1448413 1453539 1459556 1465322 1470502 1475318 1479136 1481104 1482078 1484079 1487622 1491443 1495247 1500533 1507714
49201 1507714 1514571 1519293 1523441 1529941 1539228 1549370 1559248 1569560 1581025 1593464 1606673 1620677
49189 1620677 1635142 1649967 1666409 1686127 1708968 1732932 1756191 1777693 1795739 1807785 1812327
49178 1812327 1809782 1801119 1786991 1768831 1749292 1730370 1711901 1692921 1674024 1657529 1645648 1639028
49166 1639028 1636516 1635593 1633313 1627677 1618362 1606153 1592147 1577654 1564210 1552870 1543411 1534577 1525144
49153 1525144 1514775 1504135 1494391 1486467 1480635 1476871 1475449 1476881 1481301 1488065 1495866 1503109 1508700
49140 1508700 1513091 1518308 1526137 1536213 1546379 1554891 1561738 1567864 1573831 1579317 1583454 1585715 1586967
49127 1586967 1589368 1594308 1600548 1605349 1607584 1608848 1611344 1615776 1621716 1628951 1637571 1647269 1657294 1666945
49113 1666945 1675810 1684013 1692493 1702580 1714934 1729320 1745668 1764855 1788115 1815932 1847433 1880049
49101 1880049 1909591 1931678 1943918 1946656 1941775 1931609 1919076 1907395 1898508 1892261 1887725 1884744
49089 1884744 1883543 1883740 1884740 1886575 1889240 1891500 1891565 1888997 1885010 1880746 1876085 1870359 1863539 1856347 1849778
49074 1849778 1844993 1843302 1845523 1851043 1857871 1864135 1869763 1876427 1885518 1896568 1908170 1920041 1933196
49061 1933196 1948142 1964156 1980835 1999218 2020416 2043764 2067325 2089877 2111596 2133229 2155713
49050 2155713 2180665 2210208 2245721 2286984 2332772 2382287 2436310 2497255 2567949 2649837 2741884
49039 2741884 2840578 2940481 3035592 3122419 3202901 3282670 3363759 3438408 3491678 3511665 3497694
49028 3497694 3459176 3407495 3348845 3283077 3207522 3121377 3027141 2929015 2830986 2736646 2649751
49017 2649751 2573454 2508603 2453680 2407059 2368913 2340341 2320863 2307516 2296780 2287123 2279362 2274650
49005 2274650 2272667 2272082 2272295 2273849 2277102 2281315 2285639 2290440 2296934 2305639 2315785 2326267 2336788 2348027
48991 2348027 2360963 2376163 2393517 2412524 2432676 2453395 2473870 2493605 2513241 2534227 2557323
48980 2557323 2581829 2606496 2630479 2653115 2673757 2692769 2712055 2733468 2756899 2780927 2805186
48969 2805186 2831012 2859657 2890934 2924021 2958795 2995692 3034562 3074060 3112098 3146892 3177934
48958 3177934 3206147 3232920 3258982 3284280 3308530 3331463 3352961 3373684 3395410 3419861 3447027
48947 3447027 3475326 3503552 3532010 3561554 3592313 3623717 3655140 3685923 3715196 3742264 3767007
48936 3767007 3789592 3809975 3827902 3843145 3855513 3864971 3872106 3878255 3884763 3892078 3899609 3906242 3910924
48923 3910924 3913129 3913110 3911644 3909364 3906561 3903721 3901882 3901949 3903747 3906146 3908233 3910244 3913371 3918884 3927323
48908 3927323 3938163 3950144 3962218 3974415 3987498 4001532 4015085 4026440 4035582 4044321 4054299 4065587
48896 4065587 4077601 4090527 4104914 4120472 4136573 4153836 4174009 4198146 4226007 4257421 4292892
48885 4292892 4332375 4374842 4419883 4468552 4521661 4578412 4637958 4701113 4768846 4839896 4911815
48874 4911815 4984047 5058165 5135070 5213757 5293082 5373076 5454006 5535647 5618050 5701714 5786306
48863 5786306 5870521 5953966 6038089 6124349 6212417 6301068 6389953 6479531 6569913 6660583 6750678
48852 6750678 6838811 6923310 7003469 7080016 7153661 7223890 7290043 7352774 7413244 7471397 7526286
$$ [...]
##END NTUPLES=NMR SPECTRUM
##END=
