
##TITLE=AC1108_Colombia_5835691_q6k7dCIauJ
##JCAMPDX= 6.0         $$ Bruker NMR JCAMP-DX V2.0
##DATA TYPE= NMR SPECTRUM
##DATA CLASS= NTUPLES
##ORIGIN= BRUKER
##OWNER= Administrator
$$ 1.72 TOPSPIN		Version 2.1
$$ 2012-03-28 11:05:53.359 -0500  Administrator@TOPSPIN
$$ Compression mode = diff/dup
##.OBSERVE FREQUENCY= 400.13188235
##.OBSERVE NUCLEUS= ^1H
##.ACQUISITION MODE= SIMULTANEOUS (DQD)
##.ACQUISITION SCHEME= undefined
##.AVERAGES= 64
##.DIGITISER RES= 22
##SPECTROMETER/DATA SYSTEM= spect
##.PULSE SEQUENCE= noesygpps1d.comp
##.SOLVENT NAME= COFFEE_meoh
##.SHIFT REFERENCE= INTERNAL, COFFEE_meoh, 1, 14.96828
##AUDIT TRAIL= $$ (NUMBER, WHEN, WHO, WHERE, PROCESS, VERSION, WHAT)
$$ ##TITLE= Audit trail, TOPSPIN		Version 2.1
$$ ##JCAMPDX= 5.01
$$ ##ORIGIN= Bruker BioSpin GmbH
$$ ##OWNER= Administrator
$$ $$ C:\Bruker\TOPSPIN/data/COFFEE/nmr/AC1108_Colombia_5835691_q6k7dCIauJ/12/pdata/1/auditp.txt
$$ ##AUDIT TRAIL=  $$ (NUMBER, WHEN, WHO, WHERE, PROCESS, VERSION, WHAT)
(   1,<2012-03-27 21:41:03.296 -0500>,<Administrator>,<TOPSPIN>,<go>,<TOPSPIN 2.1>,
      <created by zg
	started at 2012-03-27 21:29:31.312 -0500,
	POWCHK enabled, PULCHK disabled,
       configuration hash MD5:
       1A 1E CE 29 27 FD 77 03 67 4E F0 E3 C4 B2 CB 90
       data hash MD5: 64K
       83 56 4A 3E 67 E9 73 62 74 85 E8 48 0B 9B F7 D0>)
(   2,<2012-03-27 21:41:10.312 -0500>,<Administrator>,<TOPSPIN>,<proc1d>,<TOPSPIN 2.1>,
      <Start of raw data processing
       efp LB = 0.3 FT_mod = 6 PKNL = 1 PHC0 = 0 PHC1 = 0 SI = 128K 
       data hash MD5: 128K
       E6 B7 D3 52 F1 AE 6D 68 57 0C 19 FA E3 CE 5E BF>)
(   3,<2012-03-27 21:41:11.578 -0500>,<Administrator>,<TOPSPIN>,<proc1d>,<TOPSPIN 2.1>,
      <pk PHC0 = 37.99072 PHC1 = 0 
       data hash MD5: 128K
       50 1F 6C 95 68 72 85 D7 00 61 BA A1 DC 23 BE E6>)
(   4,<2012-03-27 21:41:12.484 -0500>,<Administrator>,<TOPSPIN>,<proc1d>,<TOPSPIN 2.1>,
      <abs ABSG = 1 
       data hash MD5: 128K
       34 36 17 5B 50 1A A0 D2 F2 92 34 7C 55 09 C5 D8>)
(   5,<2012-03-27 21:41:12.578 -0500>,<Administrator>,<TOPSPIN>,<proc1d>,<TOPSPIN 2.1>,
      <abs ABSG = 2 
       data hash MD5: 128K
       75 F0 F0 EF 68 A0 4D 89 51 C6 34 9D C4 F9 D8 E3>)
(   6,<2012-03-27 21:41:12.640 -0500>,<Administrator>,<TOPSPIN>,<proc1d>,<TOPSPIN 2.1>,
      <abs ABSG = 3 
       data hash MD5: 128K
       E0 16 55 6C 69 CE 6B E8 B4 C3 72 00 30 76 46 CE>)
(   7,<2012-03-27 21:41:12.703 -0500>,<Administrator>,<TOPSPIN>,<proc1d>,<TOPSPIN 2.1>,
      <abs ABSG = 4 
       data hash MD5: 128K
       44 A7 19 B7 64 B8 AD AB 27 73 46 50 46 43 A8 7E>)
(   8,<2012-03-27 21:41:12.781 -0500>,<Administrator>,<TOPSPIN>,<proc1d>,<TOPSPIN 2.1>,
      <abs ABSG = 5 
       data hash MD5: 128K
       7E 38 C3 7E A9 84 AD 06 78 BC 0E 5C DE 55 EB 29>)
(   9,<2012-03-27 21:41:14.093 -0500>,<Administrator>,<TOPSPIN>,<audit>,<TOPSPIN 2.1>,
      <user comment:
       ICON-NMR User ID: COFFEE
       data hash MD5: 128K
$$ [...]
##$TP07= 0
##$TPNAME0= <>
##$TPNAME1= <>
##$TPNAME2= <>
##$TPNAME3= <>
##$TPNAME4= <>
##$TPNAME5= <>
##$TPNAME6= <>
##$TPNAME7= <>
##$TPOAL= (0..7)
0.5 0.5 0.5 0.5 0.5 0.5 0.5 0.5
##$TPOFFS= (0..7)
0 0 0 0 0 0 0 0
##$TUNHIN= 0
##$TUNHOUT= 0
##$TUNXOUT= 0
##$USERA1= <user>
##$USERA2= <user>
##$USERA3= <user>
##$USERA4= <user>
##$USERA5= <user>
##$V9= 5
##$VALIST= <valist>
##$VCLIST= <CCCCCCCCCCCCCCC>
##$VD= 0
##$VDLIST= <DDDDDDDDDDDDDDD>
##$VPLIST= <PPPPPPPPPPPPPPP>
##$VTLIST= <TTTTTTTTTTTTTTT>
##$WBST= 2048
##$WBSW= 25
##$XGAIN= (0..3)
0 0 0 0
##$XL= 0
##$YL= 0
##$YMAX_a= 13630477
##$YMIN_a= -6253419
##$ZGOPTNS= <>
##$ZL1= 120
##$ZL2= 120
##$ZL3= 120
##$ZL4= 120
##$ABSF1= 14.96828
##$ABSF2= -5.58425
##$ABSG= 5
##$ABSL= 3
##$ALPHA= 0
##$AQORDER= 0
##$ASSFAC= 0
##$ASSFACI= 0
##$ASSFACX= 0
##$ASSWID= 0
##$AUNMP= <proc_prof1d_extract.lims>
##$AXLEFT= 0
##$AXNAME= <>
##$AXNUC= <1H>
##$AXRIGHT= 0
##$AXTYPE= 0
##$AXUNIT= <>
##$AZFE= 0.1
##$AZFW= 0.1
##$BCFW= 0
##$BC_mod= 0
##$BYTORDP= 0
##$COROFFS= 0
##$CY= 15
##$DATMOD= 1
##$DC= 0
##$DFILT= <>
##$DTYPP= 0
##$F1P= 0
##$F2P= 0
##$FCOR= 0.5
##$FTSIZE= 131072
##$FT_mod= 6
##$GAMMA= 0
##$GB= 0
##$INTBC= 1
##$INTSCL= 1
##$ISEN= 128
##$LB= 0.3
##$LEV0= 0
##$LPBIN= 0
##$MAXI= 10000
##$MC2= 0
##$MEAN= 0
##$ME_mod= 0
##$MI= 0
##$NCOEF= 0
##$NC_proc= -3
##$NLEV= 6
##$NOISF1= 0
##$NOISF2= 0
##$NSP= 0
##$NTH_PI= 0
##$NZP= 0
##$OFFSET= 14.96828
##$PC= 1
##$PHC0= 37.99072
##$PHC1= 0
##$PH_mod= 1
##$PKNL= yes
##$PPARMOD= 0
##$PPDIAG= 0
##$PPIPTYP= 0
##$PPMPNUM= 2147483647
##$PPRESOL= 1
##$PSCAL= 4
##$PSIGN= 0
##$PYNMP= <proc.py>
##$REVERSE= no
##$SF= 400.130004932699
##$SI= 131072
##$SIGF1= 0
##$SIGF2= 0
##$SINO= 400
##$SIOLD= 131072
##$SPECTYP= <>
##$SREGLST= <1H.CDCl3>
##$SSB= 0
##$STSI= 131072
##$STSR= 0
##$SW_p= 8223.68421052632
##$SYMM= 0
##$S_DEV= 0
##$TDeff= 65536
##$TDoff= 0
##$TI= <>
##$TILT= no
##$TM1= 0
##$TM2= 0
##$TOPLEV= 0
##$USERP1= <user>
##$USERP2= <user>
##$USERP3= <user>
##$USERP4= <user>
##$USERP5= <user>
##$WDW= 1
##$XDIM= 131072
##$YMAX_p= 497109098
##$YMIN_p= -393516733
##$CURPLOT= <Network HP LaserJet P1505>
##$CURPRIN= <$Network HP LaserJet P1505>
##$DFORMAT= <normdp>
##$LAYOUT= <+/1D_H.xwp>
##$LFORMAT= <normlp>
##$PFORMAT= <normpl>
##$SURQMSG= 1
$$ End of Bruker specific parameters
$$ ---------------------------------
##NTUPLES= NMR SPECTRUM
##VAR_NAME=  FREQUENCY,     SPECTRUM/REAL,   SPECTRUM/IMAG
##SYMBOL=    X,             R,               I
##VAR_TYPE=  INDEPENDENT,   DEPENDENT,       DEPENDENT
##VAR_FORM=  AFFN,          ASDF,            ASDF
##VAR_DIM=   131072,        131072,          131072
##UNITS=     HZ,            ARBITRARY UNITS, ARBITRARY UNITS
##FACTOR=    0.0627417313425165, 1,          1
##FIRST=     8223.62146879498, 384,          -111266
##LAST=      0,             5596,            -112791
##MIN=       0,             -393516733,      0
##MAX=       8223.62146879498, 497109098,    0
$$ Real data points
##PAGE= N=1
##DATA TABLE= (X++(R..R)), XYDATA
$$ [...]
62952C446924j02089r5484q7672p9966p2200o3249n3540m4972l7922l0624k2325
$$ 3446924 3344835 3249351 3161679 3081713 3009513 2946264 2892724 2847752 2809830 2779206 2756881
62941B756881j4806r455m823J131P940J3686J7848K1167K3521K4164K3556K2955
$$ 2756881 2742075 2732620 2727797 2728928 2736868 2750554 2768402 2789569 2813090 2837254 2860810 2883765
62929B883765K2417K0994J8889J7434J6795J5432J2373Q238L338l604j3523k4818
$$ 2883765 2906182 2927176 2946065 2963499 2980294 2995726 3008099 3016337 3019675 3016071 3002548 2977730
62917B977730l4633m1969m8359n5456o2995o9502p4274p7859q0783q2516q2165
$$ 2977730 2943097 2901128 2852769 2797313 2734318 2664816 2590542 2512683 2431900 2349384 2267219
62906B267219p9817p6503p2868o8572o3400n8274n4418n1767m8974m5117m0765
$$ 2267219 2187402 2110899 2038031 1969459 1906059 1847785 1793367 1741600 1692626 1647509 1606744
62895A606744l7140l4566l2355l0019k7954k6513k4844k1657j7259j3859j3101
$$ 1606744 1569604 1535038 1502683 1472664 1444710 1418197 1393353 1371696 1354437 1340578 1327477
62884A327477j3987j4199j2935j1306j0334j0004j0213j1061j1992j2073j1601
$$ 1327477 1313490 1299291 1286356 1275050 1264716 1254712 1244499 1233438 1221446 1209373 1197772
62873A197772j1922j3104j3401j1988j0597j1136j3010j4261j4253j3591j2319
$$ 1197772 1185850 1172746 1159345 1147357 1136760 1125624 1112614 1098353 1084100 1070509 1058190
62862A058190j0093p572n889m935l774k535k209k756k974k446k058k389k945l295
$$ 1058190 1048097 1040525 1034636 1029701 1025927 1023392 1021183 1018427 1015453 1013007 1010949 1008560 1005615 1002320
62848A002320l624l835l300j972p00k3M34J037J512J538J094P9j495k752k490
$$ 1002320 998696 994861 991561 989589 988889 988866 989300 990337 991849 993387 994481 994560 993065 990313 987823
62833I87823q27O42P53o1q70j506k205k799k931k611k182k043k486l235l296k049
$$ 987823 986996 987638 988391 988330 987460 985954 983749 980950 978019 975408 973226 971183 968697 965462 962166 960117
62817I60117l81K54j93m46N9N32L62j84j173l238n876p028n504k828j534k468
$$ 960117 959736 959990 959797 959351 959410 959942 960304 960120 958947 955709 949833 942805 937301 934473 932939 930471
62801I30471m545o293o654n276l075j806k122k815k872l123m568o092n692l507
$$ 930471 925926 919633 912979 907703 904628 902822 900700 897885 895013 891890 887322 881230 875538 872031
62787H72031j782j825k624k752k164j515q59J72J533K748L321K952J783O74P07
$$ 872031 870249 868424 865800 863048 860884 859369 858510 858682 860215 862963 866284 869236 871019 871693 872400
62772H72400K052L760M876N422N942O465O454N684M630L839L332L008L262M496
$$ 872400 874452 878212 883088 888510 894452 900917 907371 913055 917685 921524 924856 927864 931126 935622
62758I35622O048O556N808N273N994O955O826O465P802J0477J1905J1182J0580
$$ 935622 941670 948226 954034 959307 965301 972256 979082 985547 993349 1003826 1015731 1026913 1037493
62745A037493J2071J4347J5154J5042J6430J9683K2491K3362K3691K5607K9119
$$ 1037493 1049564 1063911 1079065 1094107 1110537 1130220 1152711 1176073 1199764 1225371 1254490
62734A254490L2391L4236L5471L7742M1472M5361M8305N1250N6130O2943O9316
$$ 1254490 1286881 1321117 1356588 1394330 1435802 1481163 1529468 1580718 1636848 1699791 1769107
62723A769107P3635P7199Q2131Q8422R4609J00447J06988J14442J21844J28672
$$ 1769107 1842742 1919941 2002072 2090494 2185103 2285550 2392538 2506980 2628824 2757496
62713B757496J35007J39941J41797J40396J37400J33653J27564J17035J01906
$$ 2757496 2892503 3032444 3174241 3314637 3452037 3585690 3713254 3830289 3932195
62704C932195Q3556O3144M1332J9024k866k4269m5700o7088q7301j04817j18628
$$ 3932195 4015751 4078895 4120227 4139251 4136385 4112116 4066416 3999328 3912027 3807210 3688582
62693C688582j28594j35173j38904j40149j39383j37324j34517j31026j26917
$$ 3688582 3559988 3424815 3285911 3145762 3006379 2869055 2734538 2603512 2476595
62684B476595j22478j17388j10435j01200r1614q4356p9711p5394o9748o3532
$$ 2476595 2354117 2236729 2126294 2025094 1933480 1849124 1769413 1694019 1624271 1560739
62674A560739n8029n2990m7614m2444l8719l6351l3905l0540k6831k3592k0736
$$ 1560739 1502710 1449720 1402106 1359662 1320943 1284592 1250687 1220147 1193316 1169724 1148988
62663A148988j7755j4667j2037j0209q873p419n567l499j417P64L214N896Q652
$$ 1148988 1131233 1116566 1104529 1094320 1085447 1078028 1072461 1068962 1067545 1068309 1071523 1077419 1086071
62650A086071J1220J3141J4149J5050J7447K1815K6508K9650L1513L3905L7647
$$ 1086071 1097291 1110432 1124581 1139631 1157078 1178893 1205401 1235051 1266564 1300469 1338116
62639A338116M2017M6402N0837N4875N7761O0081O3479O8005P1433P2194P1242
$$ 1338116 1380133 1426535 1477372 1532247 1590008 1650089 1713568 1781573 1853006 1925200 1996442
62628A996442O9895O7396O2431N5750M9115M2330L3378K1328P377o823k0237l1803
$$ 1996442 2066337 2133733 2196164 2251914 2301029 2343359 2376737 2398065 2405442 2398619 2378382 2346579
62616B346579m0654m7549n4520o2376o9542p4009p5571p5556p5149p4587p3350
$$ 2346579 2305925 2258376 2203856 2141480 2071938 1997929 1922358 1846802 1771653 1697066 1623716
62605A623716p0762o6878o2990o0495n9026n6642n2244m6908m2259l8523l5000
$$ 1623716 1552954 1486076 1423086 1362591 1303565 1246923 1194679 1147771 1105512 1066989 1031989
62594A031989l1614k8877k6816k4959k3186k1655k0154j8426j6983j6611j7114
$$ 1031989 1000375 971498 944682 919723 896537 874882 854728 836302 819319 802708 785594
62583G85594j7437j7030j6192j5022j3239j1247j0115r953r553q413p793q459
$$ 785594 768157 751127 734935 719913 706674 695427 685312 675359 665806 657393 649600 641141
62571F41141q634o143k058J58p06j982r53J682L490L718L312K683J605Q17J647
$$ 641141 632507 626364 624306 624464 623758 621776 620823 622505 625995 629713 633025 635708 637313 638130 639777
62556F39777L919N943O788P146P752Q620J0083J2839J6225J8145J7898J7568J9266
$$ 639777 643696 649639 656427 663573 671325 679945 690028 702867 719092 737237 755135 772703 791969
62543G91969K2151K3886K4246K5350K8656L3424L8265M2669M6680N0337N3853
$$ 791969 814120 838006 862252 887602 916258 949682 987947 1030616 1077296 1127633 1181486
62532A181486N7467O0868O3620O6245O9681P3361P5168P3926P0764O7077O2245
$$ 1181486 1238953 1299821 1363441 1429686 1499367 1572728 1647896 1721822 1792586 1859663 1921908
62521A921908N4643M4166L2276J9948P060n990j7682k7063l5095m3316n1614n8227
$$ 1921908 1976551 2020717 2052993 2072941 2080001 2074011 2056329 2029266 1994171 1950855 1899241 1841014
62509A841014o1793o2779o2775o2900o3073o2556o0946n8585n6014n3184m9445
$$ 1841014 1779221 1716442 1653667 1590767 1527694 1465138 1404192 1345607 1289593 1236409 1186964
62498A186964m4556l9374l5209l2502l0449k7985k4915k1958j9986j9320j9633
$$ 1186964 1142408 1103034 1067825 1035323 1004874 976889 951974 930016 910030 890710 871077
62487H71077k0342k0975k1160k0445j8511j5798j3556j2750j2924j2598j0890
$$ 871077 850735 829760 808600 788155 769644 753846 740290 727540 714616 702018 691128
62476F91128q315o012m621m000l470k143M40L638O073P010P025P153P835Q983
$$ 691128 682813 676801 672180 668180 664710 662567 663007 666645 672718 679728 686753 693906 701741 710724
62462G10724J0399J1695J2478J3116J4701J7635K0882K3385K5409K7617K9536
$$ 710724 721123 732818 745296 758412 773113 790748 811630 835015 860424 888041 917577
62451I17577L0319L0475L1441L3626L6276L8985M1720M3308M1810L7033L1180
$$ 917577 947896 978371 1009812 1043438 1079714 1118699 1160419 1203727 1245537 1282570 1313750
62440A313750K6206K1789J6541R992K664m706j1163j5950j9621k3616k7959l0888
$$ 1313750 1339956 1361745 1378286 1388278 1390942 1386236 1375073 1359123 1339502 1315886 1287927 1257039
62428A257039l1650l2002l3476l4782l3917l1518k9707k8507k6097k2377j9524
$$ 1257039 1225389 1193387 1159911 1125129 1091212 1059694 1029987 1001480 975383 953006 933482
62417I33482j8539j7760j5653j2978j1045r643q069o728o172n639m152k315j429
$$ 933482 914943 897183 881530 868552 857507 847864 839795 833067 826895 821256 817104 814789 813360
62404H13360j322o22J031K561L435M589O698Q624Q688P080N930O811R004J0722
$$ 813360 812038 811416 812447 815008 818443 823032 829730 838354 847042 854122 860052 866863 875867 886589
62390H86589J1449J2188J3494J4462J4116J2963J2216J1956J1057Q783N485J778
$$ 886589 898038 910226 923720 938182 952298 965261 977477 989433 1000490 1009273 1014758 1016536
62378A016536k129o079r781j3123j6019j7866j8045j7152j6808j7826j9240j9621
$$ 1016536 1014407 1008328 998547 985424 969405 951539 933494 916342 899534 881708 862468 842847
62366H42847j8609j6786j4794j3161j2313j2141j1912j1081r739p897n134j495
$$ 842847 824238 807452 792658 779497 767184 755043 743131 732050 722311 714414 709280 707785
62354G07785J805L361K963J680J044K345N773R613J1352J0513R564J0869J3591
$$ 707785 709590 712951 715914 717594 718638 720983 726756 736369 747721 758234 767798 778667 792258
62341G92258J4958J3967J2130J0944J0417J0223J0409J0478R413P350N913N948
$$ 792258 807216 821183 833313 844257 854674 864897 875306 885784 895197 902547 908460 914408
62329I14408O197N224L496K262J401j04j937k368m82K625N158O254O260O185P083
$$ 914408 920605 925829 929325 931587 932988 932884 930947 928579 928097 930722 935880 942134 948394 954579 961662
62314I61662R242J1879J4212J6817K1102K7252L3570L8225M1070M3387M6535N1191
$$ 961662 970904 982783 996995 1013812 1034914 1062166 1095736 1133961 1175031 1218418 1264953 1316144
62302A316144N7225O3610O8918P2554P5275P8081Q0862Q2441Q1544P7356O9745
$$ 1316144 1373369 1436979 1505897 1578451 1653726 1731807 1812669 1895110 1976654 2054010 2123755
62291B123755N9652M8813L8388K8107J7443P018k169j0589j9818l0196m0139m8180
$$ 2123755 2183407 2232220 2270608 2298715 2316158 2323176 2321007 2310418 2290600 2260404 2220265 2172085
62279B172085n4564o0129o4695o7435o8082o6859o3807n9176n4106m9956m7134
$$ 2172085 2117521 2057392 1992697 1925262 1857180 1790321 1726514 1667338 1613232 1563276 1516142
62268A516142m5177m3651m2190m0157l7338l4709l3377l2856l1498k8693k5496
$$ 1516142 1470965 1427314 1385124 1344967 1307629 1272920 1239543 1206687 1175189 1146496 1121000
62257A121000k2882k0630j8277j5996j3880j1407q507o159n046m399l189j787
$$ 1121000 1098118 1077488 1059211 1043215 1029335 1017928 1009421 1003262 998216 993817 990628 988841
62245I88841j163j023j97J216J583k0k482m146m630m558m278l703k938k273j757
$$ 988841 987678 986655 986458 987674 989257 989237 986755 982609 977979 973421 969143 965440 962502 960229 958472
62230I58472j365j336j745j866o84J858M701O913Q689J0707J2924J4485J4806
$$ 958472 957107 955771 954026 952160 951476 953334 958035 964948 973637 984344 997268 1011753 1026559
62217A026559J4383J4272J5033J6483J8371K0827K3824K6550K8004K8408K9409
$$ 1026559 1040942 1055214 1070247 1086730 1105101 1125928 1149752 1176302 1204306 1232714 1262123
62206A262123L2462L7244M2208M6419N0218N4134N7989O1522O5256O9900P4973
$$ 1262123 1294585 1331829 1374037 1420456 1470674 1524808 1582797 1644319 1709575 1779475 1854448
62195A854448P8620P9019P5706O9586O1964N3621M4431L3736K1341Q258l805j3837
$$ 1854448 1933068 2012087 2087793 2157379 2219343 2272964 2317395 2351131 2372472 2380730 2376925 2363088
62183B363088k2336l0664l9682m8989n7123o2528o4815o5225o5490o5938o5222
$$ 2363088 2340752 2310088 2270406 2221417 2164294 2101766 2036951 1971726 1906236 1840298 1775076
62172A775076o2201n7496n2606m7979m2959l7513l2866k9879k7599k4254j9463
$$ 1775076 1712875 1655379 1602773 1554794 1511835 1474322 1441456 1411577 1383978 1359724 1340261
62161A340261j4713j1543r780p973n304k509o58L87J651L260L996L106J831K101
$$ 1340261 1325548 1314005 1304225 1296252 1290948 1288439 1287781 1288168 1289819 1293079 1297075 1300181 1302012 1304113
62147A304113M137O272P169P118O979O901O712O825P875R886J2400J5204J8223
$$ 1304113 1308250 1314522 1321691 1328809 1335788 1342689 1349401 1356226 1364101 1373987 1386387 1401591 1419814
62134A419814K0930K2635K3410K4314K6403K9801L3634L6692L8234L8436L8038
$$ 1419814 1440744 1463379 1486789 1511103 1537506 1567307 1600941 1637633 1675867 1714303 1752341
62123A752341L7402L6136L3789L0567K7014K3404J9999J7566J6818J7450J8545
$$ 1752341 1789743 1825879 1859668 1890235 1917249 1940653 1960652 1978218 1995036 2012486 2031031
62112B031031K0178K3613K9495L6400M1876M4775M6065M7468M9582N1237N0469
$$ 2031031 2051209 2074822 2104317 2140717 2182593 2227368 2273433 2320901 2370483 2421720 2472189
62101B472189M6319L9837L3077K7003K0833J3664O129j97m624p834j0812j4110
$$ 2472189 2518508 2558345 2591422 2618425 2639258 2652922 2659051 2658854 2654230 2646396 2635584 2621474
62089B621474j8003k2386k6339k8657k9195k8840k7927k5645k1677j7363j4176
$$ 2621474 2603471 2581085 2554746 2526089 2496894 2468054 2440127 2414482 2392805 2375442 2361266
62078B361266j1883r400o837n195m342l053j219k54o49p09J191M408P237R296
$$ 2361266 2349383 2339983 2333146 2327951 2323609 2320556 2319337 2319083 2318434 2317725 2318916 2323324 2330561 2339857
62064B339857J1351J3630J5778J7969K0580K3105K4821K6214K8274L0653L2250
$$ 2339857 2351208 2364838 2380616 2398585 2419165 2442270 2467091 2493305 2521579 2552232 2584482
62053B584482L3508L6017L9514M1507M0966M0282M2043M5484M8104M9537N1529
$$ 2584482 2617990 2654007 2693521 2735028 2775994 2816276 2858319 2903803 2951907 3001444 3052973
62042C052973N4627N7362N8918O0527O3311O6199O6993O4812O0800N7082N5443
$$ 3052973 3107600 3164962 3223880 3284407 3347718 3413917 3480910 3545722 3606522 3663604 3719047
62031C719047N6452N9242O2378O5077O7243O8475O8071O6260O4467O3789O3958
$$ 3719047 3775499 3834741 3897119 3962196 4029439 4097914 4165985 4232245 4296712 4360501 4424459
62020D424459O4479O5911O8935P2591P4782P4708P3738P3410P3470P2617P0765
$$ 4424459 4488938 4554849 4623784 4696375 4771157 4845865 4919603 4993013 5066483 5139100 5209865
62009E209865O9534P0352P2791P5196P6412P6306P4856P1680O6805O1343N6634
$$ 5209865 5279399 5349751 5422542 5497738 5574150 5650456 5725312 5796992 5863797 5925140 5981774
61998E981774N2852M8831M3416L6782L0387K5656K2599J9805J5925J1041O063
$$ 5981774 6034626 6083457 6126873 6163655 6194042 6219698 6242297 6262102 6278027 6289068 6295131
61987F295131J089m603j0670j4964j5788j4217j2929j3081j3601j3522j3564j4782
$$ 6295131 6296220 6291617 6280947 6265983 6250195 6235978 6223049 6209968 6196367 6182845 6169281 6154499
61975F154499j6652j7392j5919j3021j0737j0638j2343j3690j2870j0408q555
$$ 6154499 6137847 6120455 6104536 6091515 6080778 6070140 6057797 6044107 6031237 6020829 6012274
61964F012274q843j0813j3053j4552j4909j4183j2907j1579r886p256m265k398
$$ 6012274 6003431 5992618 5979565 5965013 5950104 5935921 5923014 5911435 5901549 5894293 5890028 5887630
61952E887630k011j663j69J790K975L555M642O529Q558J0278J1813J3313J4744
$$ 5887630 5885619 5883956 5883787 5885577 5888552 5892107 5896749 5903278 5911836 5922114 5933927 5947240 5961984
61939E961984J5880J5848J3444Q692L303j402o221j2585k0095k7080l3073l8971
$$ 5961984 5977864 5993712 6007156 6015848 6019151 6017749 6011528 5998943 5978848 5951768 5918695 5879724
61927E879724m4959m9926n3075n4683n5199n5020n5188n6664n8580n8845n6915
$$ 5879724 5834765 5784839 5731764 5677081 5621882 5566862 5511674 5455010 5396430 5337585 5280670
61916E280670n4435n2681n1042m8783m6667m5694m5550m5403m5120m4622m3208
$$ 5280670 5226235 5173554 5122512 5073729 5027062 4981368 4935818 4890415 4845295 4800673 4757465
61905D757465m0661l8022l6183l4613l2630l0805k9805k8849k6924k4671k3424
$$ 4757465 4716804 4678782 4642599 4607986 4575356 4544551 4514746 4485897 4458973 4434302 4410878
61894D410878k2977k1943j9931j7622j5023j1421o999k884N40L829O964R262J0968
$$ 4410878 4387901 4365958 4346027 4328405 4313382 4301961 4294962 4292078 4292618 4296447 4303411 4312673 4323641
61881D323641J3239J6206J8636K0134K2111K5707L0116L3914L6952L9993M3372
$$ 4323641 4336880 4353086 4371722 4391856 4413967 4439674 4469790 4503704 4540656 4580649 4624021
61870D624021M7029N1131N5743O0424O4887O9578P4996Q1013Q7402R4447J02613
$$ 4624021 4671050 4722181 4777924 4838348 4903235 4972813 5047809 5128822 5216224 5310671 5413284
61859E413284J12202J23758J37827J53897J70687J88320K08942K33972K61760
$$ 5413284 5525486 5649244 5787071 5940968 6111655 6299975 6508917 6742889 7004649
61850G004649K89621L17569L48326L83827M23388M65508N09821N56570O05202
$$ 7004649 7294270 7611839 7960165 8343992 8767380 9232888 9742709 10299279 10904481
61841A0904481O54267P01986P46150P83701Q10715Q22338Q12543P74558P02440
$$ 10904481 11558748 12260734 13006884 13790585 14601300 15423638 16236181 17010739 17713179
61832A7713179N93023M47566K72883Q1137j12767k95197m56373n90247o93440
$$ 17713179 18306202 18753768 19026651 19107788 18995021 18699824 18243451 17653204 16959764
61823A6959764p65200q07863q26258q25927q11486p86022p51578p10168o64551
$$ 16959764 16194564 15386701 14560443 13734516 12923030 12137008 11385430 10675262 10010711
61814A0010711o17853n72334n28652m86538m45966m07473l71607l38537l08195
$$ 10010711 9392858 8820524 8291872 7805334 7359368 6951895 6580288 6241751 5933556
61805E933556k80364k54589k30427k08049j88142j70884j55213j39728j24152
$$ 5933556 5653192 5398603 5168176 4960127 4771985 4601101 4445888 4306160 4182008
61796D182008j09382r6181q4462p3968o4811n6848m9330m1868l5282l0652k7869
$$ 4182008 4072626 3976445 3891983 3818015 3753204 3696356 3647026 3605158 3569876 3539224 3511355
61785C511355k5948k4495k3837k3895k3939k3638k3294k2890k1811j9785j7182
$$ 3511355 3485407 3460912 3437075 3413180 3389241 3365603 3342309 3319419 3297608 3277823 3260641
61774C260641j4089j0071n261p45K692N346P678R542J0807J1744J2108J0994Q484
$$ 3260641 3246552 3236481 3231220 3230475 3233167 3238513 3246191 3255733 3266540 3278284 3290392 3301386 3309870
61761C309870O370O148P175Q007Q632J0049J2367J4880J7564K0980K5051K9397
$$ 3309870 3316240 3322388 3329563 3337570 3346202 3356251 3368618 3383498 3401062 3422042 3447093 3476490
61749C476490L4554M1294M8986N6302O3455P1952Q1960R1854J00862J10286J21198
$$ 3476490 3511044 3552338 3601324 3657626 3721081 3793033 3874993 3966847 4067709 4177995 4299193
61738D299193J32671J43441J54013J65783J79055J93206K08098K24045K40924
$$ 4299193 4431864 4575305 4729318 4895101 5074156 5267362 5475460 5699505 5940429
61729E940429K58517K77494K98911L22900L48737L76182M05933M38898M75773
$$ 5940429 6198946 6476440 6775351 7098251 7446988 7823170 8229103 8668001 9143774
61720I143774N17367N64574O17738O76546P40718Q10498Q86196R67441J052914
$$ 9143774 9661141 10225715 10843453 11519999 12260717 13071215 13957411 14924852 15977766
61711A5977766J140588J227939J311828J388101J451294J494461J508880J483937
$$ 15977766 17118354 18346293 19658121 21046222 22497516 23991977 25500857 26984794
61703B6984794J408161J271844J070216Q05889M90330J43771k07930n39370q30949
$$ 26984794 28392955 29664799 30735015 31540904 32031234 32175005 31967075 31427705 30596756
61694C0596756j070258j250985j372901j442343j469825j465163j435010j384691
$$ 30596756 29526498 28275513 26902612 25460269 23990444 22525281 21090271 19705580
61686A9705580j320307j247694j170445j090411j009694r30975q56041p85064
$$ 19705580 18385273 17137579 15967134 14876723 13867029 12936054 12080013 11294949
61678A1294949p17598o53901n95270n43068m97217m55770m16634l79697l46445
$$ 11294949 10577351 9923450 9328180 8785112 8287895 7832125 7415491 7035794 6689349
61669F689349l17414k91250k66635k43881k23729k05763j89197j74327j61838
$$ 6689349 6371935 6080685 5814050 5570169 5346440 5140677 4951480 4777153 4615315
61660D615315j51232j41337j32199j25080j20346j16460j11530j05277r8966r3748
$$ 4615315 4464083 4322746 4190547 4065467 3945121 3828661 3717131 3611854 3512888 3419140
61650C419140q9372q4632p8896p2950o8040o4363o1169n8082n5491n3576n1964
$$ 3419140 3329768 3245136 3166240 3093290 3025250 2960887 2899718 2841636 2786145 2732569 2680605
61639B680605n0516m9387m8077m5641m2296l9561l8167l7164l5841l4954l4892
$$ 2680605 2630089 2580702 2532625 2486984 2444688 2405127 2366960 2329796 2293955 2259001 2224109
61628B224109l4229l1766k8746k7198k6957k6331k5005k4131k3907k3182k1509
$$ 2224109 2189880 2158114 2129368 2102170 2075213 2048882 2023877 1999746 1975839 1952657 1931148
61617A931148j9586j7655j5278j2956j1921j1942j1174r001p344q164j1029j4107
$$ 1931148 1911562 1893907 1878629 1865673 1853752 1841810 1830636 1821635 1814291 1806127 1795098 1780991
61605A780991j6354j7736j8229j7892j7311j7069j6970j6275j4507j1801q937
$$ 1780991 1764637 1746901 1728672 1710780 1693469 1676400 1659430 1643155 1628648 1616847 1607910
61594A607910p039o567o524n478l446j823j336j087K7J925L830N190N721N384
$$ 1607910 1600871 1594304 1587780 1582302 1578856 1577033 1575697 1574610 1574637 1576562 1580392 1585582 1591303 1596687
61580A596687M710M395M325L816K973K610K700K319J607K159M630P313Q260P647
$$ 1596687 1601397 1605792 1610117 1613933 1616906 1619516 1622216 1624535 1626142 1628301 1632931 1640244 1648504 1656151
61566A656151O850O251N380M312L409K140l23l543o158p655q770j0083j1311j2076
$$ 1656151 1663001 1669252 1674632 1678944 1682353 1684493 1684170 1680627 1674469 1666814 1658044 1647961 1636650 1624574
61552A624574j2562j3153j3840j4233j3987j3352j3308j4528j6132j6279j4430
$$ 1624574 1612012 1598859 1585019 1570786 1556799 1543447 1530139 1515611 1499479 1483200 1468770
61541A468770j2062j0620r796q662p315o211m790k371K50J642J895K341L423M438
$$ 1468770 1456708 1446088 1436292 1427630 1420315 1414104 1409314 1406943 1407193 1408835 1410730 1413071 1416494 1420932
61527A420932N346P039R558J1696J2941J4287J6342J8056J8453J8486J9926K3022
$$ 1420932 1426278 1433317 1442875 1454571 1467512 1481799 1498141 1516197 1534650 1553136 1573062 1596084
61515A596084K6518K9578L2470L5431L8039L9997M1880M4468M7747N0879N3022
$$ 1596084 1622602 1652180 1684650 1720081 1758120 1798117 1839997 1884465 1932212 1983091 2036113
61504B036113N3799N3081N0748M7118M3338M0746L9533L8477L6440L3857L2196
$$ 2036113 2089912 2142993 2193741 2240859 2284197 2324943 2364476 2402953 2439393 2473250 2505446
61493B505446L2038L2208L1005K7944K4103K0945J8924J7180J4502J0429N473
$$ 2505446 2537484 2569692 2600697 2628641 2652744 2673689 2692613 2709793 2724295 2734724 2740197
61482B740197O01l100m778m723m941p502j1925j5189j5070j2498r760p507m942
$$ 2740197 2740798 2737698 2732920 2728197 2723256 2715754 2703829 2688640 2673570 2661072 2651312 2643805 2638863
61469B638863k099M2J587M175Q940J5299K2079K8747L5194M1418M7877N5261O3553
$$ 2638863 2636764 2636806 2638393 2642568 2651508 2666807 2688886 2717633 2752827 2794245 2842122 2897383 2960936
61456B960936P2081Q0657Q9722R9368J09442J20756J34608J50589J66509J81412
$$ 2960936 3033017 3113674 3203396 3302764 3412206 3532962 3667570 3818159 3984668 4166080
61446D166080J97090K15310K34936K53439K70209K86444L02258L15701L24476
$$ 4166080 4363170 4578480 4813416 5066855 5337064 5623508 5925766 6241467 6565943
61437F565943L26962L21535L06599K81701K47492K04458J53176R6241L8515j5526
$$ 6565943 6892905 7214440 7521039 7802740 8050232 8254690 8407866 8504107 8542622 8527096
61427H527096o3949j06398j42207j70548j91745k06986k16660k19937k16386k07473
$$ 8527096 8463147 8356749 8214542 8043994 7852249 7645263 7428603 7208666 6992280 6784807
61417F784807j96036j84236j72233j58850j43315j26095j08241r0517p3460n7557
$$ 6784807 6588771 6404535 6232302 6073452 5930137 5804042 5695801 5605284 5531824 5474267
61407E474267m2705k7874j2189L822J8716L1724M2913N2127N8957O4003O8885
$$ 5474267 5431562 5403688 5391499 5395321 5414037 5445761 5488674 5540801 5599758 5663761 5732646
61396E732646P4383P9525Q3071Q5049Q6119Q6362Q5582Q4091Q2262P9801P6539
$$ 5732646 5807029 5886554 5969625 6054674 6140793 6227155 6312737 6396828 6479090 6558891 6635430
61385F635430P3476P1975P2002P2022P0590O7364O2817N7852N3458M9767M5417
$$ 6635430 6708906 6780881 6852883 6924905 6995495 7062859 7125676 7183528 7236986 7286753 7332170
61374G332170L8845L0423K2428J6648J2671Q745L600k951j0431j8069k5063l0788
$$ 7332170 7371015 7401438 7423866 7440514 7453185 7461930 7465530 7462579 7452148 7434079 7409016 7378228
61362G378228l4857l7115l7967l8381l8992l9281l8287l5941l2921k9432k5252
$$ 7378228 7343371 7306256 7268289 7229908 7190916 7151635 7113348 7077407 7044486 7015054 6989802
61351F989802k1035j8277j7454j7208j6035j4007j2404j2332j4108j7164k0056
$$ 6989802 6968767 6950490 6933036 6915828 6899793 6885786 6873382 6861050 6846942 6829778 6809722
61340F809722k1420k1363k1061k0560j8169j2632m545N263J7348L2260M8799O5416
$$ 6809722 6788302 6766939 6745878 6725318 6707149 6694517 6689972 6695235 6712583 6744843 6793642 6859058
61328F859058Q2538J01822J23643J46968J71101J95714K19661K41960K63744K86867
$$ 6859058 6941596 7043418 7167061 7314029 7485130 7680844 7900505 8142465 8406209 8693076
61318H693076L10252L29836L42672L48905L48796L40086L19871K87664K45168
$$ 8693076 9003328 9333164 9675836 10024741 10373537 10713623 11033494 11321158 11566326
61309A1566326J94437J37844P8690K0062l6398q9504j37378j78786k14801k47307
$$ 11566326 11760763 11898607 11977297 11997359 11960961 11871457 11734079 11555293 11340492 11093185
61299A1093185k76233k99812l17155l28843l35099l35422l30461l22612l13906
$$ 11093185 10816952 10517140 10199985 9871142 9536043 9200621 8870160 8547548 8233642
61290H233642l04292k92658k78580k62450k44759k26112k07416j89352j71855
$$ 8233642 7929350 7636692 7358112 7095662 6850903 6624791 6417375 6228023 6056168
61281F056168j54563j37396j20377j03293q6040o9056n3022l8301k4874j2640
$$ 6056168 5901605 5764209 5643832 5540539 5454499 5385443 5332421 5294120 5269246 5256606
61271E256606j354R534K0527L1471M1461M9537N5457N9732O2879O4833O5325O4581
$$ 5256606 5255252 5264786 5285313 5316784 5358245 5407782 5463239 5522971 5585850 5650683 5716008 5780589
61259E780589O3107O0724N6607N0776M4918M0853L8467L5947L1958K6724K1021
$$ 5780589 5843696 5904420 5961027 6011803 6056721 6097574 6136041 6171988 6203946 6230670 6251691
61248F251691J5102Q985K864l361j0331j8370k6723l4343m1074m7445n3484n8540
$$ 6251691 6266793 6275778 6278642 6275281 6264950 6246580 6219857 6185514 6144440 6096995 6043511 5984971
61236E984971o2319o5432o8590p1673p3987p5094p5106p4227p2470o9847o6600
$$ 5984971 5922652 5857220 5788630 5716957 5642970 5567876 5492770 5418543 5346073 5276226 5209626
61225E209626o3056n9292n5038m9970m4157l8261l3177k9349k6525k4393k3278
$$ 5209626 5146570 5087278 5032240 4982270 4938113 4899852 4866675 4837326 4810801 4786408 4763130
61214D763130k3751k5489k7175k7835k7780k7642k6929k4485k0187j5238j0525
$$ 4763130 4739379 4713890 4686715 4658880 4631100 4603458 4576529 4552044 4531857 4516619 4506094
61203D506094n687k99M927R023J2392J6624K2810L0854M0381N1408O3814P6809
$$ 4506094 4500407 4500108 4505035 4514058 4526450 4543074 4565884 4596738 4637119 4688527 4752341 4829150
61191D829150Q9494J01556J13018J23507J32253J38680J42495J42975J38685J28253
$$ 4829150 4918644 5020200 5133218 5256725 5388978 5527658 5670153 5813128 5951813 6080066
61181F080066J11304Q8308N9749K6126j1259n0078q7825j22261j50938j71530
$$ 6080066 6191370 6279678 6339427 6365553 6354294 6304216 6216391 6094130 5943192 5771662
61171E771662j83761j90332j94445j96539j94647j87861j77889j66952j55783
$$ 5771662 5587901 5397569 5203124 5006585 4811938 4624077 4446188 4279236 4123453
61162D123453j44420j33500j23532j14016j04501r5642q7937q0258p1241o1680
$$ 4123453 3979033 3845533 3722001 3607985 3503484 3407842 3319905 3239647 3168406 3106726
61152C106726n3764m8079m2954l7022l0865k5555k0882j5868j0220m409J155O321
$$ 3106726 3052962 3004883 2961929 2924907 2894042 2868487 2847605 2831737 2821517 2817108 2818263 2824584
61140B824584J0881J4521J6951J7862J7109J5091J2562R843O636K738j435n286
$$ 2824584 2835465 2849986 2866937 2884799 2901908 2916999 2929561 2939404 2946040 2948778 2947343 2942057
61128B942057q619j1548j4134j6383j8396k0379k2535k4894k6997k8080k8015
$$ 2942057 2933438 2921890 2907756 2891373 2872977 2852598 2830063 2805169 2778172 2750092 2722077
61117B722077k7927k9209l1879l4518l5967l6563l7594l9844m2884m5411m6353
$$ 2722077 2694150 2664941 2633062 2598544 2562577 2526014 2488420 2448576 2405692 2360281 2313928
61106B313928m5979m5697m6391m7223m6836m5277m3703m2407m0478l7632l5008
$$ 2313928 2267949 2222252 2175861 2128638 2081802 2036525 1992822 1950415 1909937 1872305 1837297
61095A837297l3541l2745l1823l0973l0727l0871l1034l1670l3342l5376l6241
$$ 1837297 1803756 1771011 1739188 1708215 1677488 1646617 1615583 1583913 1550571 1515195 1478954
61084A478954l5130l2522k9429k6640k4391k2129j8928j4722j0703p920o082m487
$$ 1478954 1443824 1411302 1381873 1355233 1330842 1308713 1289785 1275063 1264360 1256440 1250358 1245871
61072A245871l330k959k451n05K409M384M851N452P502R953J0980J0789J1558
$$ 1245871 1242541 1239582 1237131 1236626 1239035 1243419 1248270 1253722 1261224 1271177 1282157 1292946 1304504
61059A304504J4630J8653K0838J9773J6792J4517J4124J4413J3756J2373J1766
$$ 1304504 1319134 1337787 1358625 1378398 1395190 1409707 1423831 1438244 1452000 1464373 1476139
61048A476139J2323J2649J1463R044O390L887J447r78l595o748r965j1803j1513
$$ 1476139 1488462 1501111 1512574 1521618 1528008 1531895 1533342 1532364 1528769 1522021 1512056 1500253 1488740
61035A488740j0248r683j0000j0205r891r477q961p852o418n763o366p436q051
$$ 1488740 1478492 1468809 1458809 1448604 1438713 1429236 1420275 1412423 1406005 1400242 1393876 1386440 1378389
61022A378389q104p832p218o332n482m744l949l467m138n914p433p593o961o839
$$ 1378389 1370285 1362453 1355235 1348903 1343421 1338677 1334728 1331261 1327123 1321209 1313776 1306183 1299222 1292383
61008A292383p464q003p918p459o824n598l330l48K182L106K400J401J491K582
$$ 1292383 1284919 1276916 1268998 1261539 1254715 1249117 1245787 1245439 1247621 1250727 1253127 1254528 1256019 1258601
60994A258601L559M163N419P811J0183J1283J1479J1942J2932J4025J5393J7457
$$ 1258601 1262160 1266323 1271742 1279553 1289736 1301019 1312498 1324440 1337372 1351397 1366790 1384247
60982A384247J9693K1105K1753K2621K4114K5942K8255L1432L4707L6597L7145
$$ 1384247 1403940 1425045 1446798 1469419 1493533 1519475 1547730 1579162 1613869 1650466 1687611
60971A687611L8219M0950M4164M6353M8054N1114N6178O1997O7019P0856P4209
$$ 1687611 1725830 1766780 1810944 1857297 1905351 1956465 2012643 2074640 2141659 2212515 2286724
60960B286724P7956Q2431Q7398R2604R8228J04629J11900J19995J29025J39021
$$ 2286724 2364680 2447111 2534509 2627113 2725341 2829970 2941870 3061865 3190890 3329911
60950C329911J49577J60175J70449J79859J88011J95974K06406K21105K39245
$$ 3329911 3479488 3639663 3810112 3989971 4177982 4373956 4580362 4801467 5040712
60941E040712K59199K81104L05937L33276L62305L94300M31644M75077N25078
$$ 5040712 5299911 5581015 5886952 6220228 6582533 6976833 7408477 7883554 8408632
60932H408632N85440O61769P56133Q66748R93002J136331J295997J469967J661583
$$ 8408632 8994072 9655841 10411974 11278722 12271724 13408055 14704052 16174019 17835602
60923A7835602J878766K124560K396539K695534L011742L277787L347841L071065
$$ 17835602 19714368 21838928 24235467 26931001 29942743 33220530 36568371 39639436
60915C9639436K424714J573728P77432K27166l0395m2815J19320L57235N05086
$$ 39639436 42064150 43637878 44415310 44642476 44612081 44569266 44688586 45045821 45550907
60906D5550907L68273j50667r60160j827230k524467k942640l094130l049543
$$ 45550907 45919180 45768513 44808353 42981123 40456656 37514016 34419886 31370343
60898C1370343k884857k662879k427598k200025j983879j779606j590983j420085
$$ 31370343 28485486 25822607 23395009 21194984 19211105 17431499 15840516 14420431
60890A4420431j263752j118694r86176q68992p66997o78184o01512n36177m79891
$$ 14420431 13156679 12037985 11051809 10182817 9415820 8737636 8136124 7599947 7120056
60881G120056m30288l86863l49795l17947k89458k63551k40522k20667k04025
$$ 7120056 6689768 6302905 5953110 5635163 5345705 5082154 4841632 4620965 4416940
60872D416940j90382j79039j69283j61176j54884j49293j42799j35400j28312
$$ 4416940 4226558 4047519 3878236 3717060 3562176 3412883 3270084 3134684 3006372
60863C006372j21647j14505j07401j02084r8411r3963q7804q2044p8430p5689
$$ 3006372 2884725 2770220 2662819 2560735 2462324 2368361 2280557 2198513 2120083 2044394
60853B044394p1753o6504o0835n4953m9345m5473m3689m2073l9100l5797l3580
$$ 2044394 1972641 1906137 1845302 1790349 1741004 1695531 1651842 1609769 1570669 1534872 1501292
60842A501292l1729k9057k6349k4891k3990k2269k0237j9239j8845j7619j5665
$$ 1501292 1469563 1440506 1414157 1389266 1365276 1343007 1322770 1303531 1284686 1267067 1251402
60831A251402j4104j2687j0308p380n451m662l706k142p61J80J244K344K716K356
$$ 1251402 1237298 1224611 1214303 1206923 1201472 1196810 1193104 1190962 1190201 1190381 1191625 1193969 1196685 1199041
60817A199041J962J592P65l47j230k101l225l878l588l781o057r272j0546r099
$$ 1199041 1201003 1202595 1203360 1203013 1201783 1199682 1196457 1192579 1188991 1185210 1179153 1169881 1159335 1150236
60803A150236o945n831n612n804o480p008n968l119P2K415M066N292N896O397
$$ 1150236 1143291 1137460 1131848 1126044 1119564 1112556 1106588 1103469 1103541 1105956 1110022 1115314 1121210 1127607
60789A127607Q018J0777J3124J4296J5466J7566J9440J9402J7641J5874J5280
$$ 1127607 1135625 1146402 1159526 1173822 1189288 1206854 1226294 1245696 1263337 1279211 1294491
60778A294491J5830J7003J8248J8953J8752J7783J6352J4596J2590J0506Q544
$$ 1294491 1310321 1327324 1345572 1364525 1383277 1401060 1417412 1432008 1444598 1455104 1463648
60767A463648P026O324O270O057N306M700M665M131J929j040k642k350j563j164
$$ 1463648 1470674 1476998 1483268 1489325 1494631 1499331 1503996 1508127 1510056 1509016 1506374 1504024 1502461 1501297
60753A501297o45o3q75l773p261r582j0877j2235j3599j4003j3447j3222j4279
$$ 1501297 1500652 1500589 1499714 1495941 1488680 1479098 1468221 1455986 1442387 1428384 1414937 1401715 1387436
60740A387436j6017j6870j5904j3865j2513j2622j2906j1547q449n111k498l54
$$ 1387436 1371419 1354549 1338645 1324780 1312267 1299645 1286739 1275192 1266743 1261632 1259134 1258780
60728A258780J340J808J011N19J846M612P176Q526Q999R552J0988J3422J6006
$$ 1258780 1260120 1261928 1262939 1263458 1265304 1269916 1277092 1285618 1294617 1304169 1315157 1328579 1344585
60715A344585J7532J7677J7363J7650J8703J9952K0783K0854K0220J9470J9198
$$ 1344585 1362117 1379794 1397157 1414807 1433510 1453462 1474245 1495099 1515319 1534789 1553987
60704A553987J9202J8582J6883J4700J2960J2040J1652J1244J0320Q722O653M407
$$ 1553987 1573189 1591771 1608654 1623354 1636314 1648354 1660006 1671250 1681570 1690292 1696945 1701352
60692A701352K213M80l73n84q65j126l36J568K812J979L4j398k750n363q431r583
$$ 1701352 1703565 1704045 1703672 1703088 1702223 1701097 1700761 1702329 1705141 1707120 1707154 1705756 1703006 1697643 1689212 1679629
60676A679629q626q076r344j0728j0294q751q019q490r156r400r306q910q284
$$ 1679629 1671003 1662927 1653583 1642855 1632561 1623810 1615791 1607301 1598145 1588745 1579439 1570529 1562245
60663A562245p860p869p824p135n694l658j393K33N16J20M56J625K250J752J223
$$ 1562245 1554385 1546516 1538692 1531557 1525863 1522205 1520812 1521045 1521561 1521681 1522137 1523762 1526012 1527764 1528987
60648A528987J372J125o27l160m996n893o559p094o825n393l240j357p32j431
$$ 1528987 1530359 1531484 1530857 1527697 1522701 1516808 1510249 1503155 1496330 1490937 1487697 1486340 1485608 1484177
60634A484177k116j545o71j778n108p968q114o532n754o761q781j0983j3052j4852
$$ 1484177 1482061 1480516 1479845 1478067 1472959 1464991 1456877 1450345 1444591 1437830 1429049 1418066 1405014 1390162
60620A390162j6673j8982k1146k1564j9994j8327j7858j7175j4488j0703q221
$$ 1390162 1373489 1354507 1333361 1311797 1291803 1273476 1255618 1238443 1223955 1213252 1205031
60609A205031p479o758m988k803r85M42J564K493L854O017P922Q064O726N901
$$ 1205031 1197552 1190794 1185806 1183003 1182018 1182460 1184024 1186517 1190371 1196388 1204310 1212374 1219100 1225001
60595A225001O784Q452R257Q616P137N763N102N150N555O210P183P921P445N809
$$ 1225001 1231785 1240237 1249494 1258110 1265247 1271010 1276112 1281262 1286817 1293027 1300210 1308131 1315576 1321385
60581A321385M474M388M758M624M565N418O319N825M478M458O679R808J2246J3728
$$ 1321385 1325859 1330247 1335005 1339629 1344194 1349612 1355931 1361756 1366234 1370692 1377371 1387179 1399425 1413153
60567A413153J4843J6095J7715J9451K0446K0129J9190J8911J9726K1106K2387
$$ 1413153 1427996 1444091 1461806 1481257 1501703 1521832 1541022 1559933 1579659 1600765 1623152
60556A623152K2865K1754J9222J6925J6179J6025J4508J1396Q101N291K457l48
$$ 1623152 1646017 1667771 1686993 1703918 1720097 1736122 1750630 1762026 1770127 1775418 1777875 1777527
60544A777527k328l835o606j1388j6857k1479k5058k7775k9026k8182k5677k2641
$$ 1777527 1775199 1771364 1764758 1753370 1736513 1715034 1689976 1662201 1633175 1604993 1579316 1556675
60532A556675k0053j8441j7523j6041j3012r314o759n417l403J94L827N757O216
$$ 1556675 1536622 1518181 1500658 1484617 1471605 1462291 1455532 1450115 1446712 1446906 1450733 1456490 1462706
60519A462706O204N636M136K569K013K007J428O63J093K576L263K337J418K531
$$ 1462706 1468910 1474546 1478682 1481251 1483264 1485271 1486699 1487362 1488455 1491031 1494294 1496631 1498049 1500580
60505A500580N553Q509R768R352Q491Q483R581J0628J0090P869N762N583P203
$$ 1500580 1506133 1514642 1524410 1533762 1542253 1550736 1560317 1570945 1581035 1588904 1594666 1600249 1607452
60492A607452R031J0047J0384J0085Q722O826O444R085J3784J8376K2157K5910
$$ 1607452 1616483 1626530 1636914 1646999 1655721 1662547 1668991 1678076 1691860 1710236 1732393 1758303
60480A758303K9798L2986L5562L8854M3067M6180M6360M4095M0588L5202K6347
$$ 1758303 1788101 1821087 1856649 1895503 1938570 1984750 2031110 2075205 2115793 2150995 2177342
60469B177342J4462K389p362j4452j9748k3663k5697k4931k0937j4852r215n739
$$ 2177342 2191804 2194193 2186831 2172379 2152631 2128968 2103271 2078340 2057403 2042551 2033336 2027597
60457B027597l275Q33P245J3574J7274J8511J9359K0980K2780K4293K6647L1252
$$ 2027597 2024322 2025155 2032400 2045974 2063248 2081759 2101118 2122098 2144878 2169171 2195818 2227070
60445B227070L7553M3314M7600N2399O0275P1029Q2239R2705J03602J15880J28563
$$ 2227070 2264623 2307937 2355537 2407936 2468211 2539240 2621479 2714184 2817786 2933666 3062229
60434C062229J40616J52835J66562J81798J97956K15399K34743K55582K77459
$$ 3062229 3202845 3355680 3522242 3704040 3901996 4117395 4352138 4607720 4885179
60425D885179L01165L27464L55167L81675M03949M16837M11828L80994L22846
$$ 4885179 5186344 5513808 5868975 6250650 6654599 7071436 7483264 7864258 8187104
60416H187104K42388J45705L7328p6602j85846k79315l50204l97383m23340m32035
$$ 8187104 8429492 8575197 8612525 8535923 8350077 8070762 7720558 7323175 6899835 6467800
60406F467800m27676m13801l93184l68415l41687l14105k86241k59503k35581
$$ 6467800 6040124 5626323 5233139 4864724 4523037 4208932 3922691 3663188 3427607
60397C427607k14440j94469j75090j57560j42515j28491j14098j00226q8665p9576
$$ 3427607 3213167 3018698 2843608 2686048 2543533 2415042 2300944 2200718 2112053 2032477
60387B032477p1738o4667n8935n4712n1188m7513m3504l9452l5694l2333k9107
$$ 2032477 1960739 1896072 1837137 1782425 1731237 1683724 1640220 1600768 1565074 1532741 1503634
60376A503634k5896k3346k2355k2593k2368k0532j7899j6163j5882j6136j5751
$$ 1503634 1477738 1454392 1432037 1409444 1387076 1366544 1348645 1332482 1316600 1300464 1284713
60365A284713j4316j2313j0624r740r278q503p311o251n661n348m961m056k053
$$ 1284713 1270397 1258084 1247460 1237720 1228442 1219939 1212628 1206377 1200716 1195368 1190407 1186351 1184298
60352A184298Q23K962L098K479L553O273P699O211M114M506P036Q666P838N897
$$ 1184298 1185121 1188083 1191181 1193660 1197213 1203486 1211185 1217396 1221510 1226016 1233052 1241718 1249556 1255453
60338A255453M745M827N681O897Q019Q446Q040P379P019O858O407N487M499M042
$$ 1255453 1260198 1265025 1270706 1277603 1285622 1294068 1302108 1309487 1316506 1323364 1329771 1335258 1339757 1343799
60324A343799M298M823N025M693L829K216k01k615l752l183j705l06N35N98j39
$$ 1343799 1348097 1352920 1357945 1362638 1366467 1368683 1368482 1365867 1362115 1358932 1357227 1356921 1357456 1358054 1357915
60309A357915j048j181m51J92J16j90N5J077K855N342P943R595R927R681R581
$$ 1357915 1356867 1355686 1355235 1355427 1355543 1355353 1355408 1356485 1359340 1364682 1372625 1382220 1392147 1401828 1411409
60294A411409R601R714J0259J0971J0872J0092J0625J3757J7522J8483J5957J2836
$$ 1411409 1421010 1430724 1440983 1451954 1462826 1472918 1483543 1497300 1514822 1533305 1549262 1562098
60282A562098J1885J2569J2345J0048O775L843J155j909m876o463o173m664k517
$$ 1562098 1573983 1586552 1598897 1608945 1615720 1619563 1620718 1618809 1613933 1607470 1601297 1596633 1594116
60269A594116K73L285N396O244O844P623P015L544j452n058o267o425o513o219
$$ 1594116 1594389 1597674 1603070 1609314 1616158 1623781 1630796 1634340 1632888 1627830 1621563 1615138 1608625 1602406
60255A602406n779o528q778j0927j1544j0930j0035r170q356p578o133l318j69
$$ 1602406 1596627 1590099 1581321 1570394 1558850 1547920 1537885 1528715 1520359 1512781 1506648 1503330 1503161
60242A503161J119J90q71n51M13J149K210L668L879J935l54q54r3k5j033j985
$$ 1503161 1504280 1504470 1503599 1503048 1503461 1504610 1506820 1510488 1514367 1516302 1515948 1515094 1515001 1514976 1513943 1511958
60226A511958k167j493J80K302L440L387M169P198J0809J2707J3266J4056J4540
$$ 1511958 1509791 1508298 1508478 1510780 1514220 1517607 1521776 1528974 1539783 1552490 1565756 1579812 1594352
60213A594352J3239J1214J1107J2993J4329J4158J4293J5853J7459J7927J8195
$$ 1594352 1607591 1618805 1629912 1642905 1657234 1671392 1685685 1701538 1718997 1736924 1755119
60202A755119J9394K1011K2257K3580K5607K7954L0239L3081L7102M1903M6844
$$ 1755119 1774513 1795524 1817781 1841361 1866968 1894922 1925161 1958242 1995344 2037247 2084091
60191B084091N1913N7146O2118O6805P2048P8514Q5840R3429J01262J09471J17719
$$ 2084091 2136004 2193150 2255268 2322073 2394121 2472635 2558475 2651904 2753166 2862637 2980356
60180B980356J25626J33340J41325J49868J58778J67148J73645J77721J80194
$$ 2980356 3105982 3239322 3380647 3530515 3689293 3856441 4030086 4207807 4388001
60171D388001J81696J80884J75517J65270J52204J38363J24114J09030R2866P5236
$$ 4388001 4569697 4750581 4926098 5091368 5243572 5381935 5506049 5615079 5707945 5783181
60161E783181N5712L4999J5180j911j5933k7296l6081m2037m4967m4717m1333
$$ 5783181 5838893 5873892 5889072 5887161 5871228 5843932 5807851 5765814 5720847 5676130 5634797
60150E634797l5378k7489j7707o012O787J9836L3769M9901O7730Q4853R9843J13733
$$ 5634797 5599419 5571930 5554223 5548211 5554998 5574834 5608603 5658504 5726234 5811087 5910930 6024663
60138F024663J27849J41511J52925J61235J66579J68803J67250J61344J50694
$$ 6024663 6152512 6294023 6446948 6608183 6774762 6943565 7110815 7272159 7422853
60129G422853J35091J15226R2940P0048M7103K3762m8k3754m6522o7450q5615
$$ 7422853 7557944 7673170 7766110 7836158 7883261 7907023 7906975 7883221 7836699 7769249 7683634
60118G683634j00301j11046j17443j19255j16739j10307r9897q5450o8073m9804
$$ 7683634 7583333 7472287 7354844 7235589 7118850 7008543 6908646 6823196 6755123 6705319
60108F705319l1786j3414O274K7044M7715O7158Q4394R8263J07984J13860J16699
$$ 6705319 6673533 6660119 6666393 6693437 6741152 6808310 6892704 6990967 7098951 7212811 7329510
60097G329510J16407J11742J01865Q7988P2970N9011M6056L3029K0261R616K239
$$ 7329510 7445917 7557659 7659524 7747512 7820482 7879493 7925549 7958578 7978839 7988455 7990694
60086G990694k499n139m711j33Q245J9924L5837N6673Q0429J03821J25907J48386
$$ 7990694 7988195 7983056 7978345 7978212 7986457 8006381 8042218 8098891 8179320 8283141 8409048 8557434
60074H557434J72576J98372K26092K56781K89872L22791L53980L84650M16317
$$ 8557434 8730010 8928382 9154474 9411255 9701127 10023918 10377898 10762548 11178865
60065A1178865M48064M77318N02115N21598N35268N42698N43093N34640N15503
$$ 11178865 11626929 12104247 12606362 13127960 13663228 14205926 14749019 15283659 15799162
60056A5799162M86060M48921M05994L56733K99900K35789J65988R2232J6338n9932
$$ 15799162 16285222 16734143 17140137 17496870 17796770 18032559 18198547 18290779 18307117 18247185
60046A8247185j35486k09077k77367l35624l81348m15540m39647m53187m55624
$$ 18247185 18111699 17902622 17625255 17289631 16908283 16492743 16053096 15599909 15144285
60037A5144285m48324m32774m08752l76321l38052k96964k53558k07329j60120
$$ 15144285 14695961 14263187 13854435 13478114 13140062 12843098 12589540 12382211 12222091
60028A2222091j15266p4087l5718j04L1227N7126P7224R0424R5351R2473Q3882
$$ 12222091 12106825 12032738 11997020 11996916 12028143 12085269 12162493 12252917 12348268 12440741 12524623
60017A2524623P0693N2648L0272N356k1020m8817p6964j03129j26286j47586j67949
$$ 12524623 12595316 12647964 12678236 12683592 12662572 12613755 12536791 12433662 12307376 12159790 11991841
60006A1991841j86586k02803k17317k30527k41103k47646k50469k50324k46621
$$ 11991841 11805255 11602452 11385135 11154608 10913505 10665859 10415390 10165066 9918445
59997I918445k38360k25959k10674j92934j72590j50248j26945j02780p7145n0211
$$ 9918445 9680085 9454126 9243452 9050518 8877928 8727680 8600735 8497955 8420810 8370599
59987H370599k3094L418K9331N4671P9086J02180J23385J41363J54370J61597
$$ 8370599 8347505 8350923 8380254 8434925 8514011 8616191 8739576 8880939 9035309 9196906
59977I196906J63632J61206J53934J40722J21356R7294P0813M3402J5028j5081
$$ 9196906 9360538 9521744 9675678 9816400 9937756 10035050 10105863 10149265 10164293 10149212
59967A0149212m7027p9492j10103j36531j57649j73949j86571j95574j99598j97536
$$ 10149212 10102185 10022693 9912590 9776059 9618410 9444461 9257890 9062316 8862718 8665182
59957H665182j90066j78737j64095j45821j24516j01992p9434n6398l2113o758
$$ 8665182 8475116 8296379 8132284 7986463 7861947 7759955 7680521 7624123 7592010 7585252
59947G585252J9041M4994P0679R5294J18839J42668J67677J92479K14517K32659
$$ 7585252 7604293 7649287 7719966 7815260 7934099 8076767 8244444 8436923 8651440 8884099
59937H884099K47293K57994K62493K58616K46278K27095K02643J73704J40747
$$ 8884099 9131392 9389386 9651879 9910495 10156773 10383868 10586511 10760215 10900962
59928A0900962J04535O6234K7020j2463n2050r1046j27362j58198j81622j97150
$$ 10900962 11005497 11071731 11098751 11086288 11034238 10943192 10815830 10657632 10476010 10278860
59918A0278860k05021k05732k00300j89860j74713j54522j29950j03240p6523
$$ 10278860 10073839 9868107 9667807 9477947 9303234 9148712 9018762 8915522 8838999
59909H838999n0235k3868K535K8479N3816P8170J00097J18177J32825J45586J56576
$$ 8838999 8788764 8764896 8767431 8795910 8849726 8927896 9027993 9146170 9278995 9424581 9581157
59898I581157J64092J67104J66583J63707J58150J49370J38404J26949J15336
$$ 9581157 9745249 9912353 10078936 10242643 10400793 10550163 10688567 10815516 10930852
59889A0930852J02940R0370P9675P2063O6817O3128O2065O5834P5544R0530J09798
$$ 10930852 11033792 11124162 11203837 11275900 11342717 11405845 11467910 11533744 11609288 11699818 11809616
59878A1809616J33370J61965J95873K34539K76983L21870L67074M10120M49777
$$ 11809616 11942986 12104951 12300824 12535363 12812346 13134216 13501290 13911410 14361187
59869A4361187M86530N20296N47925N64248N65608N51021N19772M70001M00895
$$ 14361187 14847717 15368013 15915938 16480186 17045794 17596815 18116587 18586588 18987483
59860A8987483L14867K16139J08473l987j14852k17069l06483l82097m42998m87203
$$ 18987483 19302350 19518489 19626962 19622975 19508123 19291054 18984571 18602474 18159476 17672273
59850A7672273n14066n25771n25323n14274m93410m64461m29962l91780l50562
$$ 17672273 17158207 16632436 16107113 15592839 15099429 14634968 14205006 13813226 13462664
59841A3462664l06260k58973k09766j60819j13988o9142k4937J8626N9564R6054
$$ 13462664 13156404 12897431 12687665 12526846 12412858 12343716 12318779 12337405 12396969 12493023
59831A2493023J27848J54922J76105J89991J96008J93478J80587J55598J18599
$$ 12493023 12620871 12775793 12951898 13141889 13337897 13531375 13711962 13867560 13986159
59822A3986159P1167J5148m7112j11992j75417k34470k87415l32713l69116l96383
$$ 13986159 14057326 14072474 14025362 13913370 13737953 13503483 13216068 12883355 12514239 12117856
59812A2117856m14888m24650m25656m18990m06785l91017l72903l53014l31150
$$ 12117856 11702968 11278318 10852662 10433672 10026887 9635870 9262967 8909953 8578803
59803H578803l06537k79147k50843k24272k00660j79328j59211j40061j22392
$$ 8578803 8272266 7993119 7742276 7518004 7317344 7138016 6978805 6838744 6716352
59794F716352j07132r5239q6765q0359p4621o9837o7241o6493o5166o1289n5478
$$ 6716352 6609220 6513981 6427216 6346857 6272236 6202399 6135158 6068665 6003499 5942210 5886732
59783E886732m9832m5498m2120l9194l7077l6544l7971m1036m5016m9256n3426
$$ 5886732 5836900 5791402 5749282 5710088 5673011 5636467 5598496 5557460 5512444 5463188 5409762
59772E409762n7301o0400o1992o1635n9611n6796n4040n1557m8758m4862l9705
$$ 5409762 5352461 5292061 5230069 5168434 5108823 5052027 4997987 4946430 4897672 4852810 4813105
59761D813105l3712k7057j9307j0359j349O023J1163J5160J9732K5992L4175M3917
$$ 4813105 4779393 4752336 4733029 4722670 4721321 4727344 4738507 4753667 4773399 4799391 4833566 4877483
59749D877483N4294O3973P1966P8428Q4330R0022R4318R5445R2932Q8055Q2295
$$ 4877483 4931777 4995750 5067716 5146144 5230474 5320496 5414814 5510259 5603191 5691246 5773541
59738E773541P5922O8555O0539N2983M6691M1930L9073L8601M0487M4516N1154
$$ 5773541 5849463 5918018 5978557 6031540 6078231 6120161 6159234 6197835 6238322 6282838 6333992
59727F333992O1058P3585Q7120J01398J18309J39405J63689J89003K14908K42951
$$ 6333992 6395050 6468635 6555755 6657153 6775462 6914867 7078556 7267559 7482467 7725418
59717G725418K74370L08681L44494L80645M16241M50249M81188N06670N22652
$$ 7725418 7999788 8308469 8652963 9033608 9449849 9900098 10381286 10887956 11410608
59708A1410608N23122N00837M49555L67329K59042J35675J0573j04294j99868
$$ 11410608 11933730 12434567 12884122 13251451 13510493 13646168 13656741 13552447 13352579
59699A3352579k70501l14808l35804l38980l29592l11457k87385k59579k29443
$$ 13352579 13082078 12767270 12431466 12092486 11762894 11451437 11164052 10904473 10675030
59690A0675030j97445j63510j27860r1712n6933k4470O570L7417O7738R6619J25166
$$ 10675030 10477585 10314075 10186215 10094503 10037570 10013100 10019670 10057087 10124825 10221444 10346610
59679A0346610J56028J89708K23342K54459K84371L16260L51218L87909M25264
$$ 10346610 10502638 10692346 10915688 11170147 11454518 11770778 12121996 12509905 12935169
59670A2935169M63698N04187N47621N94586O44490O95489P46571P98902Q53514
$$ 12935169 13398867 13903054 14450675 15045261 15689751 16385240 17131811 17930713 18784227
59661A8784227R08518R60399J007250J048535J082115J104242J112903J109099
$$ 18784227 19692745 20653144 21660394 22708929 23791044 24895286 26008189 27117288
59653B7117288J094274J068673J033245R91683R49468R11784Q82547Q63740Q54628
$$ 27117288 28211562 29280235 30313480 31305163 32254631 33166415 34048962 34912702 35767330
59644C5767330Q52329Q53858Q56788Q57864Q52341Q35401Q03475P54086O86025
$$ 35767330 36619659 37473517 38330305 39188169 40040510 40875911 41679386 42433472 43119497
59635D3119497O00515N01201L92289K77725J62573N3706m2309j21470j81764k21477
$$ 43119497 43720012 44221213 44613502 44891227 45053800 45107506 45065197 44943727 44761963 44540486
59625D4540486k39285k35615k12621j72563j16782m6158L7820J32557K35001L43044
$$ 44540486 44301201 44065586 43852965 43680402 43563620 43517462 43555282 43687839 43922840 44265884
59615D4265884M56010N73174O91815Q07422R15542J012373J093292J151868J180837
$$ 44265884 44721894 45295068 45986883 46794305 47709847 48722220 49815512 50967380 52148217
59606E2148217J173347J123105J024565Q74194O72110M23235J38025j67883m76272
$$ 52148217 53321564 54444669 55469234 56343428 57015538 57438773 57576798 57408915 56932643
59597E6932643p69902j034320j257779j431981j553967j626469j655565j648228
$$ 56932643 56162741 55128421 53870642 52438661 50884694 49258225 47602660 45954432
59589D5954432j611693j553453j480907j401609j324164j257824j210661j188303
$$ 45954432 44342739 42789286 41308379 39906770 38582606 37324782 36114121 34925818
59581C4925818j193314j223117j267835j312567j344114j355692j345803j315295
$$ 34925818 33732504 32509387 31241552 29928985 28584871 27229179 25883376 24568081
59573B4568081j267241j207388j141680j073293j003276r33102q64702p98720
$$ 24568081 23300840 22093452 20951772 19878479 18875203 17942101 17077399 16278679
59565A6278679p34817o73667o16881n64897n16551m70941m28268l88756l52264
$$ 16278679 15543862 14870195 14253314 13688417 13171866 12700925 12272657 11883901 11531637
59556A1531637l19286k90851k66691k44752k23371k03133j85768j72005j61433
$$ 11531637 11212351 10921500 10654809 10410057 10186686 9983553 9797785 9625780 9464347
59547I464347j53980j50279j50398j52897j55690j57691j59371j61619j64362
$$ 9464347 9310367 9160088 9009690 8856793 8701103 8543412 8384041 8222422 8058060
59538H058060j66421j66499j63929j58637j51083j42377j33716j25237j15817
$$ 8058060 7891639 7725140 7561211 7402574 7251491 7109114 6975398 6850161 6734344
59529F734344j04583r2197q0200o9364n9203m8866l7954k6583j5230m521N126
$$ 6734344 6629761 6537564 6457364 6388000 6328797 6279931 6241977 6215394 6200164 6195643 6200769
59518F200769J3633K0948K6937L1786L6147M0506M4707M8460N2019N5909O0355
$$ 6200769 6214402 6235350 6262287 6294073 6330220 6370726 6415433 6463893 6515912 6571821 6632176
59507F632176O5383P1246P8139Q5743R3595J01886J11394J22665J35501J49342
$$ 6632176 6697559 6768805 6846944 6932687 7026282 7128168 7239562 7362227 7497728 7647070
59497G647070J63917J79532J96783K15859K36145K56762K77516K98741L20172
$$ 7647070 7810987 7990519 8187302 8403161 8639306 8896068 9173584 9472325 9792497
59488I792497L40681L59504L77012L93617M08278M18780M23422M22061M15721
$$ 9792497 10133178 10492682 10869694 11263311 11671589 12090369 12513791 12935852 13351573
59479A3351573M05562L91978L74324L51549L23154K89393K50844K08718J65716
$$ 13351573 13757135 14149113 14523437 14874986 15198140 15487533 15738377 15947095 16112811
59470A6112811J25465R0323O0251L4262J2199n391j7990k4685k3872j4762J389
$$ 16112811 16238276 16328599 16388850 16423112 16435311 16429920 16411930 16387245 16363373 16348611 16350000
59459A6350000K2766M9212Q1368J17670J53831J85680K11179K29094K36865K30894
$$ 16350000 16372766 16421978 16503346 16621016 16774847 16960527 17171706 17400800 17637665 17868559
59449A7868559K08560J69585J15893N0576k3383j03746j88142k72662l52114m22112
$$ 17868559 18077119 18246704 18362597 18413173 18389790 18286044 18097902 17825240 17473126 17051014
59439A7051014m80514n26563n59363n77744n81319n71304n50633n23333m92875
$$ 17051014 16570500 16043937 15484574 14906830 14325511 13754207 13203574 12680241 12187366
59430A2187366m60342m24681l85493l45062l06609k70893k35877j99973j64303
$$ 12187366 11727024 11302343 10916850 10571788 10265179 9994286 9758409 9558436 9394133
59421I394133j30806r9255o7567l4776k348K7728N5136Q1073J06895J33479J61239
$$ 9394133 9263327 9164072 9096505 9061729 9059381 9087109 9142245 9223318 9330213 9463692 9624931
59410I624931J89678K17203K42032K63242K80559K93444L01059L02727K97608
$$ 9624931 9814609 10031812 10273844 10537086 10817645 11111089 11412148 11714875 12012483
59401A2012483K84116K60538K26433J82758J30805P1850Q001n7590j21815j82382
$$ 12012483 12296599 12557137 12783570 12966328 13097133 13168983 13176984 13119394 12997579 12815197
59391A2815197k37466k85351l24915l55937l78647l93445m01098m02580l98474
$$ 12815197 12577731 12292380 11967465 11611528 11232881 10839436 10438338 10035758 9637284
59382I637284l89252l76162l60922l44152l25177l03977k82315k62064k43202
$$ 9637284 9248032 8871870 8510948 8166796 7841619 7537642 7255327 6993263 6750061
59373F750061k24455k05355j86539j68422j50731j33489j17487j03530r1606q0896
$$ 6750061 6525606 6320251 6133712 5965290 5814559 5681070 5563583 5460053 5368447 5287551
59363E287551p0269n8903m6900l5275k5019j6138p772Q68R870J8667K6578L3499
$$ 5287551 5217282 5158379 5111479 5076204 5051185 5035047 5027275 5028143 5038013 5056680 5083258 5116757
59351E116757L9880M5520M8544M6768M0640L3902L0586L1914L6762M4109N3734
$$ 5116757 5156637 5202157 5250701 5297469 5338109 5372011 5402597 5434511 5471273 5515382 5569116
59340E569116O5077P7001Q8853J00532J11136J18650J21901J22563J24699J32081
$$ 5569116 5634193 5711194 5800047 5900579 6011715 6130365 6252266 6374829 6499528 6631609
59330F631609J45840J64356J85212K07205K30599K55825K82763L11306L41973
$$ 6631609 6777449 6941805 7127017 7334222 7564821 7820646 8103409 8414715 8756688
59321H756688L75347M11504M50433M92506N37754N85132O33275O81723P30463
$$ 8756688 9132035 9543539 9993972 10486478 11024232 11609364 12242639 12924362 13654825
59312A3654825P78196Q21915Q58357Q85291R01099R03906Q92012Q65260Q25576
$$ 13654825 14433021 15254936 16113293 16998584 17899683 18803589 19695601 20560861 21386437
59303B1386437P75958P19165O57540N93645N30237M69190M10943L55220L01556
$$ 21386437 22162395 22881560 23539100 24132745 24662982 25132172 25543115 25898335 26199891
59294B6199891K48431J92739J31539O4105q831q7349j72034k61341l51282m38376
$$ 26199891 26448322 26641061 26772600 26836705 26827874 26740525 26568491 26307150 25955868 25517492
59284B5517492n21163n97948o65121p19543p61382p92774q14608q26411q28653
$$ 25517492 24996329 24398381 23733260 23013717 22252335 21459561 20644953 19818542 18989889
59275A8989889q22982q10210p89837p61908p28024o90207o49891o08204n66186
$$ 18989889 18166907 17356697 16566860 15804952 15076928 14386721 13736830 13128626 12562440
59266A2562440n24358m82846m42139m03124l66288l31517k98602k67377k37580
$$ 12562440 12038082 11555236 11113097 10709973 10343685 10012168 9713566 9446189 9208609
59257I208609k09243j82919j58816j36123j14129r3477p5176n8753m2768k7068
$$ 9208609 8999366 8816447 8657631 8521508 8407379 8313902 8238726 8179973 8137205 8110137
59247H110137j2953q96J0386K2118L3984M5095N5172O3855O9833P1893P0562O7803
$$ 8110137 8097184 8096288 8106674 8128792 8162776 8207871 8263043 8326898 8396731 8468624 8539186 8606989
59235H606989O5099O2461N9232N5237N0852M6286M1382L6336L2305L0761L2307
$$ 8606989 8672088 8734549 8793781 8849018 8899870 8946156 8987538 9023874 9056179 9086940 9119247
59224I119247L6741M4167N4931O8149Q1631R4245J07268J21986J36713J47867
$$ 9119247 9155988 9200155 9255086 9323235 9404866 9499111 9606379 9728365 9865078 10012945
59214A0012945J53615J54786J52373J46221J36651J25499J14074J01063Q3658
$$ 10012945 10166560 10321346 10473719 10619940 10756591 10882090 10996164 11097227 11180885
59205A1180885O0502L2861L413k5408n2082p5877r6349j12960j25133j32604j35518
$$ 11180885 11241387 11274248 11277661 11252253 11200171 11124294 11027945 10914985 10789852 10657248 10521730
59194A0521730j34317j29720j22575j13488j02908r1771q1473p2636o4538n6542
$$ 10521730 10387413 10257693 10135118 10021630 9918722 9826951 9745478 9672842 9608304 9551762
59184I551762m9508m4712m1925l9774l7701l6194l5090l3142k9530k4502j8116
$$ 9551762 9502254 9457542 9415617 9375843 9338142 9301948 9266858 9233716 9204186 9179684 9161568
59173I161568r583J569J4766K9572M6783O7683R2670J21150J52294J85550K20796
$$ 9161568 9151985 9153554 9168320 9197892 9244675 9312358 9405028 9526178 9678472 9864022 10084818
59162A0084818K58198K97538L37651L77164M15421M51680M83420N06673N18305
$$ 10084818 10343016 10640554 10978205 11355369 11770790 12222470 12705890 13212563 13730868
59153A3730868N16815N00622M67220M15029L45141K60278J63035N6316n5341j66361
$$ 13730868 14247683 14748305 15215525 15630554 15975695 16235973 16399008 16455324 16399983 16233622
59143A6233622k72089l69217m54477n24120n75206o07098o21676o22317o12508
$$ 16233622 15961533 15592316 15137839 14613719 14038513 13431415 12809739 12187422 11574914
59134A1574914n94717n70318n40430n06658m70949m35154m00877l69183l39994
$$ 11574914 10980197 10409879 9869449 9362791 8891842 8456688 8055811 7686628 7346634
59125G346634l12176k84776k58176k33646k12002j93009j75856j59756j44174
$$ 7346634 7034458 6749682 6491506 6257860 6045858 5852849 5676993 5517237 5373063
59116E373063j29088j14970j02153r0229p8565o7410n7753m9637m1396l1536k1012
$$ 5373063 5243975 5129005 5026852 4936623 4858058 4790648 4732895 4683258 4641862 4610326 4589314
59105D589314j2396o531j322N398J3041J9550K4706L0350L7642M5826N3810O1260
$$ 4589314 4576918 4570387 4569065 4574463 4587504 4607054 4631760 4662110 4699752 4745578 4799388 4860648
59093D860648O7859P3245P8321Q4751R2219R7962J00343J01154J02936J05599
$$ 4860648 4928507 5001752 5080073 5164824 5257043 5355005 5455348 5556502 5659438 5765037
59083E765037J07442J07950J07220J03964R6835Q7253P8228P0395O1625N0716
$$ 5765037 5872479 5980429 6087649 6191613 6288448 6375701 6453929 6524324 6585949 6636665
59073F636665L9076K8350J8594R606K125l190o547p990o970l490J545P708J5588
$$ 6636665 6675741 6704091 6722685 6732291 6734416 6731226 6724679 6716689 6709719 6706229 6707774 6715482 6731070
59060F731070K5541L7135N0046O4139P8479R1834J04500J17930J32244J45915
$$ 6731070 6756611 6793746 6843792 6907931 6986410 7078244 7182744 7300674 7432918 7578833
59050G578833J58518J71719J86543K01614K15376K28340K41602K54615K66063
$$ 7578833 7737351 7909070 8095613 8297227 8512603 8740943 8982545 9237160 9503223
59041I503223K75852K84521K91477K95212K94701K89252K77416K57232K27346
$$ 9503223 9779075 10063596 10355073 10650285 10944986 11234238 11511654 11768886 11996232
59032A1996232J87368J37975Q1459K1376l9284r9096j56862k10272k56801k95117
$$ 11996232 12183600 12321575 12403034 12424410 12385126 12286030 12129168 11918896 11662095 11366978
59022A1366978l24910l46350l60609l69774l75098l76112l72348l64774l54544
$$ 11366978 11042068 10695718 10335109 9965335 9590237 9214125 8841777 8477003 8122459
59013H122459l41633l26200l10158k95521k81964k67752k52623k37898k24097
$$ 8122459 7780826 7454626 7144468 6848947 6566983 6299231 6046608 5808710 5584613
59004E584613k10212j95524j80551j66152j52924j41575j32535j24949j17281
$$ 5584613 5374401 5178877 4998326 4832174 4679250 4537675 4405140 4280191 4162910
58995D162910j09116j01281r4020q6314p7621o9156o2744n8869n6486n4221n1347
$$ 4162910 4053794 3952513 3858493 3772179 3694558 3625402 3562658 3503789 3447303 3393082 3341735
58984C341735m7877m4300m1270l9338l8776l9364m0222m0285l9254l7762l6181
$$ 3341735 3293858 3249558 3208288 3168950 3130174 3090810 3050588 3010303 2971049 2933287 2897106
58973B897106l3672k9001k2284j5402j0537q432p886o727l532J187N511P825P968
$$ 2897106 2863434 2834433 2812149 2796747 2786210 2777778 2769892 2763165 2759633 2760820 2766331 2774156 2782124
58960B782124O795N190L708K558J606O71KJ8M49M12l24q41k66J294L502O693J1004
$$ 2782124 2788919 2794109 2797817 2800375 2801981 2802652 2802654 2802672 2803121 2803533 2803209 2802368 2802102 2803396 2806898 2813591 2824595
58943B824595J5033J6519J4653J1035P974O202M535J630k286n589o998o758o136
$$ 2824595 2839628 2856147 2870800 2881835 2889809 2896011 2900546 2902176 2899890 2894301 2887303 2880545 2874409
58930B874409o186p114q189q044n804k416L7R95K338N598R483J1665J2123J2706
$$ 2874409 2868223 2861109 2852920 2844876 2839072 2836656 2836693 2837688 2840026 2845624 2855107 2866772 2878895 2891601
58916B891601J4199J5906J7751K0263K2589K3212K2980K4729K9097L3302L5293
$$ 2891601 2905800 2921706 2939457 2959720 2982309 3005521 3028501 3053230 3082327 3115629 3150922
58905C150922L6496L8861M1530M2689M2947M4544M8140N2362N5822N7984N8789
$$ 3150922 3187418 3226279 3267809 3310498 3353445 3397989 3446129 3498491 3554313 3612297 3671086
58894C671086N8893N9777O2386O6252P0703P5904Q1792Q7261R1565R5402R9485
$$ 3671086 3729979 3789756 3852142 3918394 3989097 4065001 4146793 4234054 4325619 4421021 4520506
58883D520506J03401J07108J12139J19670J28560J37037J45313J54890J66070
$$ 4520506 4623907 4731015 4843154 4962824 5091384 5228421 5373734 5528624 5694694
58874E694694J77729J88935J99562K10144K22096K36993K54570K72811K91178
$$ 5694694 5872423 6061358 6260920 6471064 6693160 6930153 7184723 7457534 7748712
58865G748712L11773L35735L60619L83826M06793M33033M63297M95711N29626
$$ 7748712 8060485 8396220 8756839 9140665 9547458 9980491 10443788 10939499 11469125
58856A1469125N66098O04917O44471O84712P27406P72936Q19277Q64522R08061
$$ 11469125 12035223 12640140 13284611 13969323 14696729 15469665 16288942 17153464 18061525
58847A8061525R48591R82991J007937J021258J021246J005832R72553R18197Q39071
$$ 18061525 19010116 19993107 21001044 22022302 23043548 24049380 25021933 25940130 26779201
58838B6779201P33445O03684M54614K90607J16108o1832k34464l95020n39599
$$ 26779201 27512646 28116330 28570944 28861551 28977659 28915827 28681363 28286343 27746744
58829B7746744o64900p67821q47549r05529r42945r60556r61176r49497r28521
$$ 27746744 27081844 26314023 25466474 24560945 23618000 22657444 21696268 20746771 19818250
58820A9818250q98541q60553q18259p75368p32900o90438o48378o07681n68934
$$ 19818250 18919709 18059156 17240897 16465529 15732629 15042191 14393813 13786132 13217198
58811A3217198n32869n00570m72118m46126m21233l96996l72974l48602l24524
$$ 13217198 12684329 12183759 11711641 11265515 10844282 10447286 10074312 9725710 9401186
58802I401186l02373k82469k63244k43673k24567k06815j90181j74668j61122
$$ 9401186 9098813 8816344 8553100 8309427 8084860 7878045 7687864 7513196 7352074
58793G352074j49137j36269j20861j04416q9546p6685o4291n1338l8125k5296
$$ 7352074 7202937 7066668 6945807 6841391 6751845 6675160 6610869 6559531 6521406 6496110
58783F496110j3327k442P929J9032L1355M4001N6211O8490Q1386R4114J05648
$$ 6496110 6482783 6480341 6488270 6507302 6538657 6582658 6638869 6707359 6788745 6882859 6988507
58772F988507J16507J28359J42077J57059J72238J87251K02768K19797K38326
$$ 6988507 7105014 7233373 7375450 7532509 7704747 7891998 8094766 8314563 8552889
58763H552889K56906K74540K92787L14500L40291L67711L94544M21479M50794
$$ 8552889 8809795 9084335 9377122 9691622 10031913 10399624 10794168 11215647 11666441
58754A1666441M83800N20468N60262O02252O45314O89122P34021P79323Q22915
$$ 11666441 12150241 12670709 13230971 13833223 14478537 15167659 15901680 16681003 17503918
58745A7503918Q63324R00563R33618R58318R69279R63217R38951Q94952Q28654
$$ 17503918 18367242 19267805 20201423 21159741 22129020 23092237 24031188 24926140 25754794
58736B5754794P38226O23830M87425L32519J64400j0163j83779l49260n00488
$$ 25754794 26493020 27116850 27604275 27936794 28101194 28091031 27907252 27557992 27057504
58727B7057504o33350p45677q36102r03657r48913r74577r84092r80060r64467
$$ 27057504 26424154 25678477 24842375 23938718 22989805 22015228 21031136 20051076 19086609
58718A9086609r39625r08037q71777q32694p92572p52350p11675o70121o28556
$$ 19086609 18146984 17238947 16367170 15534476 14741904 13989554 13277879 12607758 11979202
58709A1979202n88695n51628n17430m85849m56483m28522m01063l73970l48049
$$ 11979202 11390507 10838879 10321449 9835600 9379117 8950595 8549532 8175562 7827513
58700G827513l24338l03236k84211k66275k48863k32175k16456k01284j86171
$$ 7827513 7503175 7199939 6915728 6649453 6400590 6168415 5951959 5750675 5564504
58691E564504j71549j58374j46841j36374j26812j18607j11762j05485r9170r2834
$$ 5564504 5392955 5234581 5087740 4951366 4824554 4705947 4594185 4488700 4389530 4296696
58681D296696q6409p9584p2649o6602o2082n8891n6681n5178n3692n1527m9185
$$ 4296696 4210287 4130703 4058054 3991452 3929370 3870479 3813798 3758620 3704928 3653401 3604216
58670C604216m8063m8515m9244m9121m8468m8002m7512m6471m5246m4884m6066
$$ 3604216 3556153 3507638 3458394 3409273 3360805 3312803 3265291 3218820 3173574 3128690 3082624
58659C082624m8677n2009n5035n6965n7789n7988n7854n7514n7301n7204n6270
$$ 3082624 3033947 2981938 2926903 2869938 2812149 2754161 2696307 2638793 2581492 2524288 2468018
58648B468018n3589m9813m6536m4283m2294m0181l8418l7111l5603l3593l1445
$$ 2468018 2414429 2364616 2318080 2273797 2231503 2191322 2152904 2115793 2080190 2046597 2015152
58637B015152k9315k7214k5920k6334k7741k8200k7003k5360k4422k4060k3691
$$ 2015152 1985837 1958623 1932703 1906369 1878628 1850428 1823425 1798065 1773643 1749583 1725892
58626A725892k2856k0825j7410j4263j3419j4160j3428r938n763l014j134J293
$$ 1725892 1703036 1682211 1664801 1650538 1637119 1622959 1609531 1599593 1593830 1590816 1589682 1590975
58614A590975M083O332Q237J0465J2706J4066J3971J2013Q074L314l41k355l919
$$ 1590975 1595058 1601390 1609627 1620092 1632798 1646864 1660835 1672848 1680922 1684236 1683895 1681540 1677621
58601A677621n733p195q172r449j0599r827p151n361o127p375o435l792j473M67
$$ 1677621 1671888 1664693 1656521 1647072 1636473 1626646 1619495 1614134 1608007 1600632 1594197 1590405 1588932 1589399
58587A589399L312O837R685J1812J4314J7311K0043K2651K5948K9686L2678L4577
$$ 1589399 1592711 1599548 1609233 1621045 1635359 1652670 1672713 1695364 1721312 1750998 1783676 1818253
58575A818253L6161L8083M0479M3568M7540N2066N6544O0543O3720O6131O8889
$$ 1818253 1854414 1892497 1932976 1976544 2024084 2076150 2132694 2193237 2256957 2323088 2391977
58564B391977P3357P9243Q5036R0795R8597J09332J21064J31920J42744J55214
$$ 2391977 2465334 2544577 2629613 2720408 2819005 2928337 3049401 3181321 3324065 3479279
58554C479279J69132J83379J97939K13072K27793K41212K54099K67199K79006
$$ 3479279 3648411 3831790 4029729 4242801 4470594 4711806 4965905 5233104 5512110
58545E512110K86976K89850K87029K76971K58148K30549J94522J49533R6249L8570
$$ 5512110 5799086 6088936 6375965 6652936 6911084 7141633 7336155 7485688 7581937 7620507
58535G620507j8574p2481j21768j63847j96255k19687k36851k48645k53900k52502
$$ 7620507 7601933 7529452 7407684 7243837 7047582 6827895 6591044 6342399 6088499 5835997
58525E835997k46192k36402k23770k09742j96272j83632j70445j56212j42127
$$ 5835997 5589805 5353403 5129633 4919891 4723619 4539987 4369542 4213330 4071203
58516D071203j29358j18116j08372r9973r2184q4554p8010p3593p0649o7807o5193
$$ 4071203 3941845 3823729 3715357 3615384 3523200 3438646 3360636 3287043 3216394 3148587 3083394
58505C083394o3770o2931o0815n6825n2060m7461m3290m0180l8821l8764l9125
$$ 3083394 3019624 2956693 2895878 2839053 2786993 2739532 2696242 2656062 2617241 2578477 2539352
58494B539352m0159m2372m4565m4907m3816m3593m5166m7085m7838m7175m5059
$$ 2539352 2499193 2456821 2412256 2367349 2323533 2279940 2234774 2187689 2139851 2092676 2047617
58483B047617m1351l6996l3730l2068l0918k9440k7740k5587k2157j7673j3933
$$ 2047617 2006266 1969270 1935540 1903472 1872554 1843114 1815374 1789787 1767630 1749957 1736024
58472A736024j2568j3508j5332j6240j4914j1501p781n549m999n424o689q847
$$ 1736024 1723456 1709948 1694616 1678376 1663462 1651961 1644180 1638631 1633632 1628208 1621519 1612672
58460A612672j1034j2250j2766j3414j4068j4249j4565j5824j7264j7359j6127
$$ 1612672 1601638 1589388 1576622 1563208 1549140 1534891 1520326 1504502 1487238 1469879 1453752
58449A453752j4971j4614j4700j4922j4974j3906j1325q750p917q163p364n162
$$ 1453752 1438781 1424167 1409467 1394545 1379571 1365665 1354340 1345590 1337673 1329510 1322146 1316984
58437A316984l258k739l008l302l442l056j770k19N57O02O39O33K05j38J49K83
$$ 1316984 1313726 1310987 1307979 1304677 1301235 1298179 1296409 1296190 1296747 1297349 1297988 1298621 1298826 1298688 1298837 1299120
58421A299120n73j380o55P85Q19o50j615j111j93K10K54m8r64j758j167O25K159
$$ 1299120 1298547 1297167 1296512 1297297 1298116 1297466 1295851 1294740 1294547 1294757 1295011 1294963 1293999 1292241 1291074 1291699 1293858
58404A293858K781L001L015K588K217K572L107K964K797L677M727M047J768q9
$$ 1293858 1296639 1299640 1302655 1305243 1307460 1310032 1313139 1316103 1318900 1322577 1327304 1331351 1333119 1333030
58390A333030p06j196k300l538m681n942o677n922m309l495l736l912l732l798
$$ 1333030 1332324 1331128 1328828 1325290 1320609 1314667 1307990 1302068 1297759 1294264 1290528 1286616 1282884 1279086
58376A279086l684k162N27K706L663M086M140L075R40j186k758m057n068n565
$$ 1279086 1275402 1273240 1273767 1276473 1280136 1284222 1288362 1291437 1292377 1291191 1288433 1284376 1279308 1273743
58362A273743n816n758m274j042J987K931K809L784N689O786O979P585Q821J0142
$$ 1273743 1267927 1262169 1257895 1256853 1258840 1261771 1264580 1268364 1274053 1280839 1287818 1295403 1304224 1314366
58348A314366J2174J5586J8917K0405K0866K1862K2386K0681J8067J6987J6370
$$ 1314366 1326540 1342126 1361043 1381448 1402314 1424176 1446562 1467243 1485310 1502297 1518667
58337A518667J3237Q222M936M042K539q07l790n197o505q198q439o588m506l269
$$ 1518667 1531904 1540126 1545062 1549104 1551643 1550836 1547046 1541849 1535344 1527146 1518707 1512119 1507613 1504344
58323A504344j916l12J27n64m42R76K012K074K463L397L426K402J902K452L286
$$ 1504344 1502428 1502116 1502243 1501679 1501237 1502213 1504225 1506299 1508762 1512159 1515585 1517987 1519889 1522341 1525627
58308A525627M793P685J0170R831Q177R001J2355J4673J5023J6081J8381J8863
$$ 1525627 1530420 1538105 1548275 1558106 1566283 1575284 1587639 1602312 1617335 1633416 1651797 1670660
58296A670660J6467J4165J3796J3577J2304J1557J1991J1810J0564J0258J1083
$$ 1670660 1687127 1701292 1715088 1728665 1740969 1752526 1764517 1776327 1786891 1797149 1808232
58285A808232J0418P580N176M244K641o5q98J257L348L396L576N777Q321R521
$$ 1808232 1818650 1826230 1831406 1835650 1838291 1838226 1837328 1838585 1841933 1845329 1848905 1854682 1863003 1872524
58271A872524J0510J2232J3485J3975J5486J8168J9664J9541K0426K3082K4863
$$ 1872524 1883034 1895266 1908751 1922726 1938212 1956380 1976044 1995585 2016011 2039093 2063956
58260B063956K4655K4822K6559K7988K8496L0087L2712L3484L2220L2335L4356
$$ 2063956 2088611 2113433 2139992 2167980 2196476 2226563 2259275 2292759 2324979 2357314 2391670
58249B391670L4366L1012K8112K7835K7369K5086K3873K5256K6258K5302K5241
$$ 2391670 2426036 2457048 2485160 2512995 2540364 2565450 2589323 2614579 2640837 2666139 2691380
58238B691380K7351K8531K7785K8992L3618L7295L7636L8676M3093M6890M6790
$$ 2691380 2718731 2747262 2775047 2804039 2837657 2874952 2912588 2951264 2994357 3041247 3088037
58227C088037M6306M9051N2337N3022N3592N6606N8924N7548N5856N8063O2442
$$ 3088037 3134343 3183394 3235731 3288753 3342345 3398951 3457875 3515423 3571279 3629342 3691784
58216C691784O5711O9050P4273P9019Q1291Q3808Q8762R3475R6191J00329J07842
$$ 3691784 3757495 3826545 3900818 3979837 4061128 4144936 4233698 4327173 4423364 4523693 4631535
58205D631535J14477J17085J19494J25423J31978J36120J40982J49613J58896
$$ 4631535 4746012 4863097 4982591 5108014 5239992 5376112 5517094 5666707 5825603
58196E825603J66083J74666J87322J99758K08227K16411K28338K41557K53993
$$ 5825603 5991686 6166352 6353674 6553432 6761659 6978070 7206408 7447965 7701958
58187G701958K69826K91361L12904L30107L47494L69403L92022M12139M34608
$$ 7701958 7971784 8263145 8576049 8906156 9253650 9623053 10015075 10427214 10861822
58178A0861822M62808M91258N16586N45740N83719O23535O58672O94893P38878
$$ 10861822 11324630 11815888 12332474 12878214 13461933 14085468 14744140 15439033 16177911
58169A6177911P86231Q32643Q85518R51694J024947J098876J180389J276258J378519
$$ 16177911 16964142 17796785 18682303 19633997 20658944 21757820 22938209 24214467 25592986
58160B5592986J478444J582489J698416J818371J932998K049289K176840K310555
$$ 25592986 27071430 28653919 30352335 32170706 34103704 36152993 38329833 40640388
58152D0640388K446277K598893K783978K996110L226600L486508L790081M135052
$$ 40640388 43086665 45685558 48469536 51465646 54692246 58178754 61968835 66103887
58144F6103887M525900M996516N580615O280475P096209Q062430R221100J0583903
$$ 66103887 70629787 75626303 81206918 87487393 94583602 102646032 111867132 122451035
58136A22451035J2157027J3965618J6003721J8199573K0494294K2923691K5574694
$$ 122451035 134608062 148573680 164577401 182776974 203271268 226194959 251769653
58129B51769653K8529829L1889623L5588242L8793724L9501894L5297880K5143943
$$ 251769653 280299482 312189105 347777347 386571071 426072965 461370845 486514788
58122D86514788J0594310m896231j7983672k6953090l1778972l3328510l2683417
$$ 486514788 497109098 492212867 474229195 447276105 415497133 382168623 349485206
58115C49485206l0829350k8487653k6040057k3628450k1318024j9146286j7095847
$$ 349485206 318655856 290168203 264128146 240499696 219181672 200035386 182939539
58108A82939539j5123980j3221235j1400637r657869p992523o445210n067693
$$ 182939539 167815559 154594324 143193687 133535818 125543295 119098085 114030392
58101A14030392l886024k950954k399431k382331k900763l745850m614461n270723
$$ 114030392 110144368 107193414 104793983 102411652 99510889 95765039 91150578 85879855
58093H5879855n617245n673273n519469n243200m903591m532439m154131l790085
$$ 85879855 80262610 74589337 69069868 63826668 58923077 54390638 50236507 46446422
58085D6446422l448856l128824k831509k561455k316481k091026j887016j709939
$$ 46446422 42997566 39868742 37037233 34475778 32159297 30068271 28181255 26471316
58077B6471316j557107j420934j300277j197421j107917j024947r50174q88805
$$ 26471316 24914209 23493275 22192998 20995577 19887660 18862713 17912539 17023734
58069A7023734q37286p87162p37785o94201o55459o16125n76605n41180n08237
$$ 17023734 16186448 15399286 14661501 13967300 13311841 12695716 12119111 11577931 11069694
58060A1069694m72898m37283m08186l86488l68215l53623l45616l41159l33715
$$ 11069694 10596796 10159513 9751327 9364839 8996624 8643001 8297385 7956226 7622511
58051G622511l22611l11432k99378k83156k65313k51576k41381k29628k16068
$$ 7622511 7299900 6988468 6689090 6405934 6140621 5889045 5647664 5418036 5201968
58042E201968k04608j95024j84057j73076j66032j61237j53662j44244j38330
$$ 5201968 4997360 4802336 4618279 4445203 4279171 4117934 3964272 3820028 3681698
58033C681698j35701j30653j21631j12701j05712r8688r1937q8169q6446q2886
$$ 3681698 3545997 3415344 3293713 3181012 3075300 2976612 2884675 2796506 2710060 2627174
58023B627174p7488p3633p1296o7352o2154n8888n6979n2956m7504m4695m4497
$$ 2627174 2549686 2476053 2404757 2337405 2275251 2216363 2159384 2106428 2058924 2014229 1969732
58012A969732m3012l9957l8779l9268l7301l2589k9612k9808k9413k6237k2439
$$ 1969732 1926720 1886763 1847984 1808716 1771415 1738826 1709214 1679406 1649993 1623756 1601317
58001A601317j9440j6090j2987j2729j4602j4647j2166j0670j1397j1544j0130
$$ 1601317 1581877 1565787 1552800 1540071 1525469 1510822 1498656 1487986 1476589 1465045 1454915
57990A454915r894j1722j2630j1225j0153j1179j2441j2429j2410j3037j2668
$$ 1454915 1445021 1433299 1420669 1409444 1399291 1388112 1375671 1363242 1350832 1337795 1325127
57979A325127j0664q654p277n345l193k884m121l995j795j09k74p34q84k212m562
$$ 1325127 1314463 1305809 1298532 1293187 1289994 1287110 1282989 1278994 1277199 1277090 1276816 1276082 1275198 1272986 1268424
57964A268424n403m210l503m349m780m044m219o078p309o651o020o710p090o051
$$ 1268424 1263021 1258811 1255308 1250959 1246179 1242135 1237916 1231838 1224529 1217878 1211858 1205148 1198058 1192007
57950A192007n328o377p927q510q675r063q948q117p731q073q067p719q237q933
$$ 1192007 1186679 1180302 1172375 1163865 1155190 1146127 1137179 1129062 1121331 1113258 1105191 1097472 1089235 1080302
57936A080302p464m073k144l201m741m566l780l828l758k504r59O3J246K508K185
$$ 1080302 1072838 1068765 1066621 1063420 1058679 1054113 1050333 1046505 1042747 1040243 1039284 1039347 1040593 1043101 1045286
57921A045286K48n26J409L855M352L493K829K087Q04K81J353K234R71j590l480
$$ 1045286 1045534 1045008 1046417 1050272 1054624 1058117 1060946 1063033 1063837 1064118 1065471 1067705 1068676 1067086 1063606
57906A063606m607n918p083p109o101m658k706n02N32l11j541j486o85o86j631
$$ 1063606 1058999 1053081 1045998 1038889 1032788 1028130 1025424 1024922 1025454 1025143 1023602 1022116 1021431 1020745 1019114
57891A019114k558l206l926m515m440l757k812j647m41K60M36Q69J833K380J587
$$ 1019114 1016556 1013350 1009424 1004909 1000469 996712 993900 992253 991812 992072 992508 993377 995210 997590 999177
57876I99177j48j664k278k211k412l865o307p949p570o500p021r109j0582j0290
$$ 999177 999029 997365 995087 992876 990464 986599 980292 972343 964773 958273 951252 942143 931561 921271
57862I21271r296q768q532q058p204n781l832k281j769j270L70K112K260J757
$$ 921271 911975 903207 894675 886617 879413 873632 869800 867519 865750 864480 864850 866962 869222 870979
57848H70979L120O245Q263P895O901O709O668O411O911P947P420M661J892J029
$$ 870979 874099 880344 888607 896502 903403 910112 916780 923191 930102 938049 945469 950130 952022 953051
57834I53051J393J850K685L710L027l93m720p564q617q675q006p084o992p638
$$ 953051 954444 956294 958979 962689 965716 965323 960603 953039 944422 935747 927741 920657 913665 906027
57820I06027p335n592m346m975o064n797m645l896l350k344j394r13J60K521M690
$$ 906027 898692 893100 888754 883779 877715 871918 867273 863377 860027 857683 856289 855376 855536 858057 862747
57805H62747N071M560N176P102Q880R597R194P501M760K330J313J030J94j116
$$ 862747 867818 872378 877554 884656 893536 903133 912327 919828 924588 926918 928231 929261 929455 928339
57791I28339j907j968j849j772j709j948k650l476m327n668p387q348p813o453
$$ 928339 926432 924464 922615 920843 919134 917186 914536 911060 906733 901065 893678 885330 877517 871064
57777H71064n251m345l583l172l309m068n759q115r305p756n116m950p931j0863
$$ 871064 865813 861468 857885 854713 851404 847336 841577 833462 824157 816401 811285 806335 798404 787541
57763G87541j1401j0967j1573j2398j1694r931q824q688q816q985q861p415m667
$$ 787541 776140 765173 753600 741202 729508 719577 710753 702065 693249 684264 675403 667988 663321
57750F63321k588k483k945k150o18J75M15J187K454L729N380P325P871N959L302
$$ 663321 660733 658250 655305 653155 652537 652712 653127 654314 656768 660497 665877 673202 681073 687032 690334
57735F90334K174K335K270K102K845L907L962L497L966N123N605N579O320P473
$$ 690334 692508 694843 697113 699215 702060 705967 709929 713426 717392 722515 728120 733699 740019 747492
57721G47492P215N073K496N43j173l103m971o334o793o043m726m364n236n509
$$ 747492 754707 759780 762276 762819 761646 758543 753572 747238 740445 734402 729676 725312 720076 714567
57707G14567l989k339k565l745l670k479j798j325O33L589N084M612M298N247
$$ 714567 710578 708239 705674 701929 698259 695780 693982 692657 693290 696879 701963 706575 710873 716120
57693G16120O011N491M700M622M550L751K996L198L939M350M265L830L123K753
$$ 716120 722131 727622 732322 736944 741494 745245 748241 751439 755378 759728 763993 767823 770946 773699
57679G73699L623N443O561N870M096K756K755M165O492Q805J0367J1281J1902
$$ 773699 777322 782765 789326 795196 799292 802048 804803 808968 815460 824265 834632 845913 857815
57666H57815J1904J0891R619R395J0396J1696J2784J3864J4810J5118J4989J5250
$$ 857815 869719 880610 890229 899624 910020 921716 934500 948364 963174 978292 993281 1008531
57654A008531J6205J7565J9295K1404K3153K3767K3807K4535K6094K7618K8972
$$ 1008531 1024736 1042301 1061596 1083000 1106153 1129920 1153727 1178262 1204356 1231974 1260946
57643A260946L1049L4279L8156M2184M6121M9425N1616N3100N4618N6306N8404
$$ 1260946 1291995 1326274 1364430 1406614 1452735 1502160 1553776 1606876 1661494 1717800 1776204
57632A776204O2151O8258P5163Q0756Q5615R2338J01811J12333J22760J34170
$$ 1776204 1838355 1906613 1981776 2062532 2148147 2240485 2342296 2454629 2577389 2711559
57622B711559J47652J62427J77313J92637K09645K28852K49492K69729K87167
$$ 2711559 2859211 3021638 3198951 3391588 3601233 3830085 4079577 4349306 4636473
57613D636473L00253L09323L15299L17224L12258K97617K70917K29022J69314
$$ 4636473 4936726 5246049 5561348 5878572 6190830 6488447 6759364 6988386 7157700
57604G157700R3445Q611p5670j51203k12147k55296k81038k92913k94871k89352
$$ 7157700 7251145 7259756 7184086 7032883 6820736 6565440 6284402 5991489 5696618 5407266
57594E407266k78100k63341k47096k30152k12467j94120j75655j58117j42612
$$ 5407266 5129166 4865825 4618729 4388577 4176110 3981990 3806335 3648218 3505606
57585C505606j28995j15359j00174q4707p1676o1719n2990m4149l5601k7521j8945
$$ 3505606 3376611 3261252 3161078 3076371 3004695 2942976 2889986 2845837 2810236 2782715 2763770
57574B763770r744j342N522J2025J9224K6522L3174L9749M7070N5206O4424P5387
$$ 2763770 2754026 2752684 2758206 2770231 2789455 2815977 2849151 2888900 2935970 2991176 3055600 3130987
57562C130987Q7421R8469J08133J18804J32191J46521J59074J69782J79976J88849
$$ 3130987 3218408 3316877 3425010 3543814 3676005 3822526 3981600 4151382 4331358 4520207
57552D520207J93815J93679J88917J78935J61433J34998J00744O1057J8189k5468
$$ 4520207 4714022 4907701 5096618 5275553 5436986 5571984 5672728 5733785 5751974 5726506
57542E726506o7084j04275j35939j61978j82551j97610k06782k09922k08086k03489
$$ 5726506 5659422 5555147 5419208 5257230 5074679 4877069 4670287 4460365 4252279 4048790
57532D048790j97904j91446j83361j73525j62601j51295j40080j29342j19247
$$ 4048790 3850886 3659440 3476079 3302554 3139953 2988658 2848578 2719236 2599989
57523B599989j09859j01641r5140q9781q3992p7186p0620o5329o0275n3921m6936
$$ 2599989 2490130 2388489 2293349 2203568 2119576 2042390 1971770 1906441 1846166 1792245 1745309
57512A745309m1634l8874l6950l3799k9308k5056k2526k1870k1925k1230j9208
$$ 1745309 1703675 1664801 1627851 1594052 1564744 1539688 1517162 1495292 1473367 1452137 1432929
57501A432929j6385j3405j0284o901l700j350N5R73J871K996M453O222Q343J1067
$$ 1432929 1416544 1403139 1392855 1385954 1382254 1380904 1380959 1381932 1383803 1386799 1391252 1397474 1405817 1416884
57487A416884J4377J7446J9364K0530K2337K5251K8264L0671L3109L6112L8849
$$ 1416884 1431261 1448707 1468071 1488601 1510938 1536189 1564453 1595124 1628233 1664345 1703194
57476A703194M0431M1503M3394M6453N0335N5164O1207O7880P4316Q0510Q6914
$$ 1703194 1743625 1785128 1828522 1874975 1925310 1980474 2041681 2109561 2183877 2264387 2351301
57465B351301R3445J00079J07794J17406J27766J36571J42919J47599J50822J51115
$$ 2351301 2444746 2544825 2652619 2770025 2897791 3034362 3177281 3324880 3475702 3626817
57455C626817J46883J37736J23725J04346P9196M9097J6065j7528m9444p7744
$$ 3626817 3773700 3911436 4035161 4139507 4218703 4267800 4283865 4266337 4216893 4139149
57445D139149j01031j18583j30364j37133j40235j40671j38433j33226j25740
$$ 4139149 4038118 3919535 3789171 3652038 3511803 3371132 3232699 3099473 2973733
57436B973733j17609j10097j03298r6685q9798q2383p4425o6268n8388n0987m4058
$$ 2973733 2856124 2746027 2642729 2546044 2456246 2373863 2299438 2233170 2174782 2123795 2079737
57425B079737l7644l1628k5483j8857j2244o402j159M341J0117J5063J8628K2042
$$ 2079737 2042093 2010465 1984982 1966125 1953881 1947479 1946320 1950661 1960778 1975841 1994469 2016511
57413B016511K7089L4093M1844M9267N6316O3245O9891P6170Q2708R0245R8619
$$ 2016511 2043600 2077693 2119537 2168804 2225120 2288365 2358256 2434426 2517134 2607379 2705998
57402B705998J06941J14740J22295J29611J35707J39335J39895J37140J30451
$$ 2705998 2812939 2927679 3049974 3179585 3315292 3454627 3594522 3731662 3862113
57393C862113J18935J02049P9619N1797J9696j4226m7312p8048j05593j28462
$$ 3862113 3981048 4083097 4162716 4214513 4234209 4219983 4172671 4094623 3989030 3860568
57383C860568j44972j54987j60079j61735j60507j57060j52576j47432j40621
$$ 3860568 3715596 3560609 3400530 3238795 3078288 2921228 2768652 2621220 2480599
57374B480599j31395j20815j10862j02564r5660q9435q3214p6592o9920o4257
$$ 2480599 2349204 2228389 2117527 2014963 1919303 1829868 1746654 1670062 1600142 1535885
57364A535885o0224n7186n3951m9882m5115m0184l5884l2856l0902k9128k7078
$$ 1535885 1475661 1418475 1364524 1314642 1269527 1229343 1193459 1160603 1129701 1100573 1073495
57353A073495k5134k3648k2460k1602k1469k1802k1424j9680j7324j5324j3700
$$ 1073495 1048361 1024713 1002253 980651 959182 937380 915956 896276 878952 863628 849928
57342H49928j2210j1247j1153j1429j1573j1919j2637j2844j1853j0562j0229
$$ 849928 837718 826471 815318 803889 792316 780397 767760 754916 743063 732501 722272
57331G22272j0377r397p061n023m651n432n753m584k273k91p6j569l153l588l535
$$ 722272 711895 702498 695437 690414 685763 680331 674578 669994 667721 667430 667354 665785 662632 659044 655509
57316F55509m344n856o616o017m968m337l912l289k792k850l158l151k932l132
$$ 655509 651165 645309 638693 632676 627708 623371 619459 616170 613378 610528 607370 604219 601287 598155
57302E98155l861m317l636j921q8J167J831J849P51j430l364l534j853N78L027
$$ 598155 594294 589977 586341 584420 584332 585499 587330 589179 589930 588500 585136 581602 579749 580327 583354
57287E83354N255O541O129M752M086M425M496L914L907M849N117L696K166K533
$$ 583354 588609 595150 601279 606031 610117 614542 619038 622952 626859 631708 636825 640521 642687 645220
57273F45220M464O324P728R285J0820J1632J1860J2060J2065J1723J1999J3710
$$ 645220 649684 656008 663736 673021 683841 695473 707333 719393 731458 743181 755180 768890
57261G68890J5898J7005J7169J7692J8860J9913K0642K1248K1105J9515J7495
$$ 768890 784788 801793 818962 836654 855514 875427 896069 917317 938422 957937 975432
57250I75432J6904J7775J8217J7097J5321J4242J4218J4975J6139J7168J7666
$$ 975432 992336 1010111 1028328 1045425 1060746 1074988 1089206 1104181 1120320 1137488 1155154
57239A155154J7899J8352J9051K0042K1835K4389K6440K7180K7882L0239L3747
$$ 1155154 1173053 1191405 1210456 1230498 1252333 1276722 1303162 1330342 1358224 1388463 1422210
57228A422210L6404L7648L8919M1445M5000M8692N1592N2906N2737N2334N2347
$$ 1422210 1458614 1496262 1535181 1576626 1621626 1670318 1721910 1774816 1827553 1879887 1932234
57217A932234N1710M9500M6695M4210M0541L3802K5117J7191J0239K341o575j4362
$$ 1932234 1983944 2033444 2080139 2124349 2164890 2198692 2223809 2241000 2251239 2253580 2247005 2232643
57205B232643k0277k5676l0666l3401l3609l3680l4947l5667l4045l0781k7192
$$ 2232643 2212366 2186690 2156024 2122623 2089014 2055334 2020387 1984720 1950675 1919894 1892702
57194A892702k3187j8655j4620j1443p869l523k80N53N76J874L917M855M751N327
$$ 1892702 1869515 1850860 1836240 1824797 1816928 1813405 1813125 1813678 1814254 1816128 1820045 1824900 1829651 1834978
57180A834978P296R704J1556J2744J3601J4492J5617J6725J7568J8645K0620K2967
$$ 1834978 1842274 1851978 1863534 1876278 1889879 1904371 1919988 1936713 1954281 1972926 1993546 2016513
57168B016513K4489K5335K6898K9579L2408L5202L8979M3598M7113M8502M9136
$$ 2016513 2041002 2066337 2093235 2122814 2155222 2190424 2229403 2273001 2320114 2368616 2417752
57157B417752N0495N2246N3644N4980N6476N7444N7742N8472O0137O1811O2939
$$ 2417752 2468247 2520493 2574137 2629117 2685593 2743037 2800779 2859251 2919388 2981199 3044138
57146C044138O4120O5226O5024O3666O3130O3662O2489N8060N3124N1105N1474
$$ 3044138 3108258 3173484 3238508 3302174 3365304 3428966 3491455 3549515 3602639 3653744 3705218
57135C705218N1432N0410M9946N0283N0028M8737M7343M6309M5301M4484M4429
$$ 3705218 3756650 3807060 3857006 3907289 3957317 4006054 4053397 4099706 4145007 4189491 4233920
57124D233920M5071M6058M7506M9257N0253M9923M9304M9541N0210N0283M9666
$$ 4233920 4278991 4325049 4372555 4421812 4472065 4521988 4571292 4620833 4671043 4721326 4770992
57113D770992M8706M7422M6289M6115M6072M3744L8763L4384L3625L5646L7910
$$ 4770992 4819698 4867120 4913409 4959524 5005596 5049340 5088103 5122487 5156112 5191758 5229668
57102E229668M0030M3066M6776N0201N3848N8727O4115O8432P1354P3116P2919
$$ 5229668 5269698 5312764 5359540 5409741 5463589 5522316 5586431 5654863 5726217 5799333 5872252
57091E872252P0106O5750O0986N4973M6573L6791K7404J8534R593J179o196j3832
$$ 5872252 5942358 6008108 6069094 6124067 6170640 6207431 6234835 6253369 6262962 6264141 6257945 6244113
57079F244113k3016l2885m2334n2390o4538p8509r4047j12659j34885j58209j80762
$$ 6244113 6221097 6188212 6145878 6093488 6028950 5950441 5856394 5743735 5608850 5450641 5269879
57068E269879k04979k34046k66750k99570l32016l66153m02619m41126m83388
$$ 5269879 5064900 4830854 4564104 4264534 3932518 3566365 3163746 2722620 2239232
57059B239232n31442n84641D80727b27800p88152q82142r88398j107262j240819
$$ 2239232 1707790 1123149 480727 -227800 -1015952 -1898094 -2886492 -3993754 -5234573
57050e234573j388313j547624j720830j913715k130431k373029k645257k952558
$$ -5234573 -6622886 -8170510 -9891340 -11805055 -13935486 -16308515 -18953772 -21906330
57042b1906330l299728l693107m143764m664703n267566n966296o779714p723442
$$ -21906330 -25206058 -28899165 -33042929 -37707632 -42975198 -48941494 -55721208 -63444650
57034f3444650q801445j0010280j1346384j2800431j4343532j5917778j7435468
$$ -63444650 -72246095 -82256375 -93602759 -106403190 -120746722 -136664500 -154099968
57027a54099968j8806827k0021014k1222462k2632752k4272977k5717757k6194939
$$ -154099968 -172906795 -192927809 -214150271 -236783023 -261056000 -286773757 -312968696
57020c12968696k5020406k1975543j7301832j1432137m818119K026390Q472935
$$ -312968696 -337989102 -359964645 -377266477 -388698614 -393516733 -391490343 -383017408
57013c83017408J3895999J7874171K0290690K1293993K1203187K0412220J9292884
$$ -383017408 -369121409 -351247238 -330956548 -309662555 -288459368 -268047148 -248754264
57006b48754264J8119052J7050485J6162891J5471896J4936027J4469479J3978389
$$ -248754264 -230635212 -213584727 -197421836 -181949940 -167013913 -152544434 -138566045
56999a38566045J3395474J2691261J1868923J0955315R990000R013940Q063556
$$ -138566045 -125170571 -112479310 -100610387 -89655072 -79665072 -70651132 -62587576
56992f2587576P168682O348361N607688M942961M350745L829747L376262K983124
$$ -62587576 -55418894 -49070533 -43462845 -38519884 -34169139 -30339392 -26963130 -23980006
56984b3980006K643436K351661K101168J884476J696087J532196J387938J258172
$$ -23980006 -21336570 -18984909 -16883741 -14999265 -13303178 -11770982 -10383044 -9124872
56976i124872J140890J036643R44503Q61331P85115P16245O55074O00532N51546
$$ -9124872 -7983982 -6947339 -6002836 -5141505 -4356390 -3640145 -2985071 -2384539 -1832993
56967a832993N07830M69012d21677a7755C58830L50329L23134K95081K67333K40214
$$ -1832993 -1325163 -856151 -421677 -17755 358830 709159 1032293 1327374 1594707 1834921
56957A834921K14178J91479J74345J62086J52322J44426J38989J34367J27145
$$ 1834921 2049099 2240578 2414923 2577009 2729331 2873757 3012746 3147113 3274258
56948C274258J16804J07203J02062J00414R6901Q4900N9317J9122l0988q2556
$$ 3274258 3391062 3498265 3600327 3700741 3797642 3882542 3941859 3960981 3929993 3847437
56938C847437j28260j64780j91418k08189k16320k18958k19508k19446k18614
$$ 3847437 3719177 3554397 3362979 3154790 2938470 2719512 2500004 2280558 2061944
56929B061944k17100k15816k15140k13764k09290k00204j87329j73232j60148
$$ 2061944 1844844 1629028 1413888 1200124 990834 790630 603301 430069 269921
56920B69921A21237a7244j29267j20734j12351j04084r6806r1185q6536q1516
$$ 269921 121237 -17244 -146511 -267245 -379596 -483680 -580486 -671671 -758207 -839723
56910h39723p5485o8511o0674n2281m4048l6182k7942j9235j1742o933l683L96
$$ -839723 -915208 -983719 -1044393 -1096674 -1140722 -1176904 -1204846 -1224081 -1235823 -1242756 -1246439 -1246043
56898a246043N623J0030J2247J2592J1227P425J463m501q489j0477j1351j1392
$$ -1246043 -1240420 -1230390 -1218143 -1205551 -1194324 -1186899 -1185436 -1189937 -1198426 -1208903 -1220254 -1231646
56886a231646j0750j0250j0467j0522q881n050M9N091R320J2833J6145J9219K1165
$$ -1231646 -1242396 -1252646 -1263113 -1273635 -1282516 -1287566 -1287517 -1282426 -1273106 -1260273 -1244128 -1224909 -1203744
56873a203744K1663K2303K5079K9388L1964L0291K4698J6737P438j661p799r515
$$ -1203744 -1182081 -1159778 -1134699 -1105311 -1073347 -1043056 -1018358 -1001621 -994183 -995844 -1003643 -1013158
56861a013158q879r128j0583j0943r182o885n486m411k734q16Q24K763N446P791
$$ -1013158 -1022037 -1031165 -1041748 -1052691 -1061873 -1068758 -1074244 -1078655 -1081389 -1082205 -1081381 -1078618 -1073172 -1065381
56847a065381Q464P949Q003R305J0916J1875J2180J2096J1637J1154J1563J3397
$$ -1065381 -1056917 -1048968 -1040965 -1031660 -1020744 -1008869 -996689 -984593 -972956 -961802 -950239 -936842
56835i36842J6043J8365J9750K0325K0528K0868K1869K3787K6414K9129L1024
$$ -936842 -920799 -902434 -882684 -862359 -841831 -820963 -799094 -775307 -748893 -719764 -688740
56824f88740L0973K8131K2694J5919R171L140j841n362p248p936p812o583l965
$$ -688740 -657767 -629636 -606942 -591023 -581852 -578712 -580553 -585915 -593163 -601099 -608911 -615494 -619459
56811f19459p82J660L406O014J0469J5843K0636K4669K8745L3065L7021M0214
$$ -619459 -620241 -618581 -615175 -609161 -598692 -582849 -562213 -537544 -508799 -475734 -438713 -398499
56799c98499M2602M3508M1610L6189K7726J7245N983m054j0548j2844j2665j1953
$$ -398499 -355897 -312389 -270779 -234590 -206864 -189619 -183636 -187690 -198238 -211082 -223747 -235700
56787b35700j0712p928l910j8L674Q607J5156K1428K5662K8714L2780L8411c9735
$$ -235700 -246412 -254340 -258250 -258268 -254594 -245987 -230831 -209403 -183741 -155027 -122247 -83836 -39735
56773H809N1788N3732N2737M6410L3779J6532j645j6987k7565l3592l6057l5473
$$ 8809 60597 114329 167066 213476 247255 263787 262142 245155 217590 183998 147941 112468
56761A12468l2309k7965k4142F927a0609j2187n541Q23N727R204b80A6009K1542
$$ 112468 80159 52194 28052 6927 -10609 -22796 -28337 -27514 -21787 -12583 -280 16009 37551
56748C7551K7082L1512L4257L5092L2697K5091J2176l022j6413k5656l0615l2283
$$ 37551 64633 96145 130402 165494 198191 223282 235458 232436 216023 190367 159752 127469
56736A27469l2068l1307l0274E784a8317j9598j5890j2814r362n549k220N12L149
$$ 127469 95401 64094 33820 5784 -18317 -37915 -53805 -66619 -75981 -81530 -83750 -83238 -80089
56723h0089N449O972Q826J2686J7401a0009C938N012l942f193j7489k2535k4498
$$ -80089 -74640 -67668 -58842 -46156 -28755 -10009 3938 8950 5008 -6193 -23682 -46217 -70715
56710g0715k3059k0780k0118k0580k0094j8143j5945j4090j1777q639n853m592
$$ -70715 -93774 -114554 -134672 -155252 -175346 -193489 -209434 -223524 -235301 -243940 -249793 -254385
56698b54385m240l146p82J628K586J742j27j968l044l094k232p38R00J850J394
$$ -254385 -258625 -261771 -262553 -260925 -258339 -256597 -256724 -258692 -261736 -264830 -267062 -267800 -266900 -265050 -263656
56683b63656q4j015k91J359K345K271K051K194K206J832J551J409P17m80p79O28
$$ -263656 -263740 -264755 -265046 -263687 -261342 -259071 -257020 -254826 -252620 -250788 -249237 -247828 -247111 -247591 -248370 -247742
56667b47742K461K961K176J435J153O26l77j168j261q01K6R72J214J62j219j094
$$ -247742 -245281 -242320 -240144 -238709 -237556 -236930 -237307 -238475 -239736 -240537 -240511 -239539 -238325 -238163 -239382 -240476
56651b40476Q43K744K841J335k97j017o79L25J175R34m91j922k051r24K4o41l083
$$ -240476 -239633 -236889 -234048 -232713 -233010 -234027 -234706 -234381 -233206 -232272 -232763 -234685 -236736 -237660 -237636 -238277 -241360
56634b41360o071p911p718n939l716j838l94Q06J825K459K254R42p75j339N3K266
$$ -241360 -247431 -255342 -263060 -268999 -272715 -274553 -274947 -274141 -272316 -269857 -267603 -266661 -267436 -268775 -268722 -266456
56618b66456L467L404L558M956O693P107N794M074L722N445Q353J0707J1329J0317
$$ -266456 -262989 -259585 -256027 -251071 -244378 -237271 -231477 -227403 -223681 -218236 -209883 -199176 -187847 -177530
56604a77530Q473O449M755L922L893L629K139k42k290l363l649l385k796k790
$$ -177530 -169057 -162608 -157853 -153931 -150038 -146409 -144270 -144512 -146802 -150165 -153814 -157199 -159995 -162785
56590a62785m388p280r899j1265j1866j2590j3551j4362j4653j4016j2208r764
$$ -162785 -167173 -174453 -184352 -195617 -207483 -220073 -233624 -247986 -262639 -276655 -288863 -298627
56578b98627p757o635n818m667l153j465K57J686K604L516N034O498O436M752
$$ -298627 -306384 -313019 -318837 -323504 -326657 -328122 -327865 -326179 -323575 -320059 -315025 -308527 -302091 -297339
56564b97339L188L021L547L698L844M750N691N317M029L791N334O908O411L998
$$ -297339 -294151 -291130 -287583 -283885 -280041 -275291 -269600 -264283 -260254 -256463 -251129 -244221 -237810 -233812
56550b33812J757J143J528J501R79J258K925M537M280K458J231J730K604K015
$$ -233812 -232055 -230912 -229384 -227883 -226904 -225646 -222721 -218184 -213904 -211446 -210215 -208485 -205881 -203866
56536b03866J67r78o8K325M626N746N648M951M216L598K998K446K179K391L046
$$ -203866 -203699 -204677 -204745 -202420 -197794 -192048 -186400 -181449 -177233 -173635 -170637 -168191 -166012 -163621 -160575
56521a60575L820M085L406K302K101L476N482O723P101P551Q339Q704Q198P297
$$ -160575 -156755 -152670 -149264 -146962 -144861 -141385 -135903 -129180 -122079 -114528 -106189 -97485 -89287 -81990
56507h1990O516N909N739O728R102J2090J4702d792A2103J5909J3893J2128J1676
$$ -81990 -75474 -69565 -63826 -57098 -47996 -35906 -21204 -4792 12103 28012 41905 54033 65709
56494F5709J2394J3158J2833J1128Q927P622P617P660O322L799J441r9j190k058
$$ 65709 78103 91261 104094 115222 124149 131771 139388 147048 153370 157169 158610 158511 157321 155263
56480A55263k630l346m771o364p024o860o987p484p294o457o556q148r520r060
$$ 155263 152633 149287 144516 138152 131128 124268 117281 109797 102503 96046 89490 81342 71822 62762
56466F2762p398o147n712n494n222m964m643m384m478m456l285j217j53j221H36
$$ 62762 55364 49217 43505 38011 32789 27825 23182 18798 14320 9864 6579 5362 5209 3988 836
56450c211l578k415r67K38J61j271k459k282j802k319l049k556j412j241j871
$$ -3211 -6789 -9204 -10171 -9933 -9772 -11043 -13502 -15784 -17586 -19905 -22954 -25510 -26922 -28163 -30034
56435c0034j758q58o73j384j324J38J269M87j417k608k545j913j124q4R56J366
$$ -30034 -31792 -32650 -33323 -34707 -36031 -35893 -34624 -34137 -35554 -38162 -40707 -42620 -43744 -43828 -42872 -41506
56419d1506J033P52J495L318N084N521M675L954M447N604D65N589M923M660M524
$$ -41506 -40473 -39721 -38226 -34908 -29824 -24303 -19628 -15674 -11227 -5623 465 6054 10977 15637 20161
56404B0161M399N004O913R291J0308Q983O276M109L450L717L982M102M361M568
$$ 20161 24560 29564 36477 45768 56076 65059 71335 75444 78894 82611 86593 90695 95056 99624
56390I9624M197L110J618M5j296k010k048j763j077N57K551K795L05k697l333
$$ 99624 103821 106931 108549 108594 107298 105288 103240 101477 100400 100957 103508 106303 106608 103911 100578
56375A00578j948j256k091k633j918j335j903k575k341j761j321m02Q60P69j360
$$ 100578 98630 97374 95283 92650 90732 89397 87494 84919 82578 80817 79496 79094 79954 80723 79363
56360G9363l582l815k351n96R31J887J302q38k684k951k744l324l711k443k57
$$ 79363 75781 71966 69615 69019 69950 71837 73139 72301 69617 66666 63922 60598 56887 54444 54187
56345E4187J072J478K053K715K430J136k33j072j090Q0J920K697J524l59j437
$$ 54187 55259 56737 58790 61505 63935 65071 64838 63766 62676 62756 64676 67373 68897 68538 67101
56330F7101j734j579m35J405J917K20j501j227l21r85k275j796J6O48k73p33J34
$$ 67101 65367 63788 63353 64758 66675 66895 65394 64167 63846 62861 60586 58790 58806 59454 59181 58448 58582
56313E8582J276K159L144L726L050K082K541L967M394L689L506M151M301L804
$$ 58582 59858 62017 65161 68887 71937 74019 76560 80527 84921 88610 92116 96267 100568 104372
56299A04372L911M595M389L231K846L747M372L733K720K334K611L639N540P292
$$ 104372 108283 112878 117267 120498 123344 127091 131463 135196 137916 140250 142861 146500 152040 159332
56285A59332P627P167P568Q632Q600P264O242N984N190L510K221J708Q79l22k51
$$ 159332 166959 174126 181694 190326 198926 206190 212432 218416 223606 227116 229337 231045 231924 231602 231351
56270B31351J832M677P170R280J0539J0034Q529Q153R243R915R482R747J1811
$$ 231351 233183 237860 245030 254310 264849 274883 283412 291565 300808 310723 320205 329952 341763
56257C41763J4121J4945J4688J4435J4192J3851J4106J5044J5438J4645J3848
$$ 341763 355884 370829 385517 399952 414144 427995 442101 457145 472583 487228 501076
56246E01076J4375J5981J7522J8093J7115J4687J2224J1114J0630Q958O432N510
$$ 501076 515451 531432 548954 567047 584162 598849 611073 622187 632817 641775 648207 653717
56234F53717P003Q766R075R056J0544J3298J5761J7244J8215J9397K1324K3897
$$ 653717 660720 669486 678561 687617 698161 711459 727220 744464 762679 782076 803400 827297
56222H27297K6130K7306K8393L1009L5197L9535M3222M6513M9629N2975N7723
$$ 827297 853427 880733 909126 940135 975332 1014867 1058089 1104602 1154231 1207206 1264929
56211A264929O4193P0471P5007P9550Q6783R5949J04250J11737J20992J32274
$$ 1264929 1329122 1399593 1474600 1554150 1640933 1736882 1841132 1952869 2073861 2206135
56201B206135J43254J53686J65885J79847J92440K02739K13760K27096K39821
$$ 2206135 2349389 2503075 2668960 2848807 3041247 3243986 3457746 3684842 3924663
56192C924663K48814K54338K57087K55383K48023K36688K22735K04341J79553
$$ 3924663 4173477 4427815 4684902 4940285 5188308 5424996 5647731 5852072 6031625
56183F031625J49850J18146Q5466N2012J9361j0806l8333o3084q3808j00314j14584
$$ 6031625 6181475 6299621 6385087 6437099 6456460 6445654 6407321 6344237 6260429 6160115 6045531
56172F045531j27862j38689j45692j50059j53523j56115j57798j60037j63708
$$ 6045531 5917669 5778980 5633288 5483229 5329706 5173591 5015793 4855756 4692048
56163D692048j67504j70082j71751j72614j71655j69295j67962j68142j66697
$$ 4692048 4524544 4354462 4182711 4010097 3838442 3669147 3501185 3333043 3166346
56154C166346j61376j54216j48055j42391j35419j27637j20509j13683j06265
$$ 3166346 3004970 2850754 2702699 2560308 2424889 2297252 2176743 2063060 1956795
56145A956795r8940r2328q5258p7007o9268o3461n8347n2757m8249m6225m4646
$$ 1956795 1857855 1765527 1680269 1603262 1533994 1470533 1412186 1359429 1311180 1264955 1220309
56134A220309m0842l5781l2397l1074k9758k7342k4340k1159j8065j5793j4347
$$ 1220309 1179467 1143686 1111289 1080215 1050457 1023115 998775 977616 959551 943758 929411
56123I29411j2330r118o120m488l496k613k621l046j323L229P380Q542Q675J0952
$$ 929411 917081 907963 901843 897355 893859 891246 888625 885579 884256 887485 894865 903407 912082 923034
56109I23034J4982J8113J9423J9684J9522J9981K2659K6880K9275K8389K6930
$$ 923034 938016 956129 975552 995236 1014758 1034739 1057398 1084278 1113553 1141942 1168872
56098A168872K7166K7366K5699K4047K4460K5126K3804K2296K3385K6090K8057
$$ 1168872 1196038 1223404 1249103 1273150 1297610 1322736 1346540 1368836 1392221 1418311 1446368
56087A446368L0086L4066L8884M2837M7805N6515O7630P8071Q8277J00679J14586
$$ 1446368 1476454 1510520 1549404 1592241 1640046 1696561 1764191 1842262 1930539 2031218 2145804
56076B145804J27064J37265J45601J50146J48383J41189J31169J18674J03674
$$ 2145804 2272868 2410133 2555734 2705880 2854263 2995452 3126621 3245295 3348969
56067C348969Q9518P9993P3972O7473N9485N1149M0984K6348Q854o764j8770k9063
$$ 3348969 3438487 3518480 3592452 3659925 3719410 3770559 3811543 3837891 3846745 3839981 3821211 3792148
56055C792148l8756m7843n8461p3387r1428j08520j22907j35009j43258j44970
$$ 3792148 3753392 3705549 3647088 3573701 3482273 3373753 3250846 3115837 2972579 2827609
56045B827609j40969j34658j26741j15502j02003r0056q0789p1636o1239n1266
$$ 2827609 2686640 2551982 2425241 2309739 2207736 2117680 2036891 1965255 1904016 1852750
56035A852750m2853l5139k7821k1942j7629j3832j0305p543n400l921m166n996
$$ 1852750 1809897 1774758 1746937 1724995 1707366 1693534 1683229 1675686 1670286 1666365 1662199 1656203
56023A656203p087o603p042r434j0215o870l063l070m546k490K523O276Q507J1935
$$ 1656203 1649116 1642513 1635471 1626037 1615822 1608952 1605889 1602819 1598273 1595783 1598306 1604582 1613089 1625024
56009A625024J5624J6279J4922J5710J8857K0937K1362K2428K3786K3170K1954
$$ 1625024 1640648 1656927 1671849 1687559 1706416 1727353 1748715 1771143 1794929 1818099 1840053
55998A840053K3742K7851L0244L0282L0806L2276L2933L3724L6949M0812M1651
$$ 1840053 1863795 1891646 1921890 1952172 1982978 2015254 2048187 2081911 2118860 2159672 2201323
55987B201323M0582M1642M4493M5556M5194M6713M9428M9950M9393N1785N6133
$$ 2201323 2241905 2283547 2328040 2373596 2418790 2465503 2514931 2564881 2614274 2666059 2722192
55976B722192N7754N6927N8457O3152O7496P1346P7827Q5773R0333R1232R2724
$$ 2722192 2779946 2836873 2895330 2958482 3025978 3097324 3175151 3260924 3351257 3442489 3535213
55965C535213R5761R8122J01566J10168J21837J30307J35459J42788J52991J61356
$$ 3535213 3630974 3729096 3830662 3940830 4062667 4192974 4328433 4471221 4624212 4785568
55955D785568J67470J75815J86414J94626K00752K10113K22939K34046K43198
$$ 4785568 4953038 5128853 5315267 5509893 5710645 5920758 6143697 6377743 6620941
55946F620941K55860K72794K88936L03371L20504L40690L59713L77922L99787
$$ 6620941 6876801 7149595 7438531 7741902 8062406 8403096 8762809 9140731 9540518
55937I540518M24524M47838M72301N04339N41575N75446O05865O40473O80300
$$ 9540518 9965042 10412880 10885181 11389520 11931095 12506541 13112406 13752879 14433179
55928A4433179P20024P61742Q13540Q74759R38122J005911J087195J179062J268655
$$ 14433179 15153203 15914945 16728485 17603244 18541366 19547277 20634472 21813534 23082189
55919B3082189J354714J448570J552752J657742J761501J872319J991162K112378
$$ 23082189 24436903 25885473 27438225 29095967 30857468 32729787 34720949 36833327
55911C6833327K243442K401797K590367K799154L031317L302487L615454L965963
$$ 36833327 39076769 41478566 44068933 46868087 49899404 53201891 56817345 60783308
55903F0783308M374508M879360N495785O217180P058077Q056665R233485J0592475
$$ 60783308 65157816 70037176 75532961 81750141 88808218 96864883 106098368 116690843
55895A16690843J2162353J3982125J6045185J8323953K0850359K3686013K6803609
$$ 116690843 128853196 142835321 158880506 177204459 198054818 221740831 248544440
55888B48544440L0085179L3370263L6195485L7310606L4780617K7169765J4948224
$$ 248544440 278629619 311999882 348195367 385505973 420286590 447456355 462404579
55881D62404579O40901j2579617k2555670k8721223l1591933l2057408l1004474
$$ 462404579 463045480 450465863 427910193 399188970 367597037 335539629 304535155
55874C04535155k9156363k6970511k4659762k2332977k0086445j7982100j6029360
$$ 304535155 275378792 248408281 223748519 201415542 181329097 163346997 147317637
55867A47317637j4230030j2604117j1158610r872812q730061p730579o863494
$$ 147317637 133087607 120483490 109324880 99452068 90722007 82991428 76127934
55860G6127934o099725n423100m839007m343628l912670l528983l194849k908343
$$ 76127934 70028209 64605109 59766102 55422474 51509804 47980821 44785972 41877629
55852D1877629k652459k416624k206391k023086j854807j696185j557330j444131
$$ 41877629 39225170 36808546 34602155 32579069 30724262 29028077 27470747 26026616
55844B6026616j346850j256284j174962j104786j038993r74164r16426q68576
$$ 26026616 24679766 23423482 22248520 21143734 20104741 19130577 18214151 17345575
55836A7345575q23471p76254p31279o91475o52382o11914n75143n44685n16563
$$ 17345575 16522104 15745850 15014571 14323096 13670714 13058800 12483657 11938972 11422409
55827A1422409m89355m67052m49358m29578m05709l83574l65789l47694l27253
$$ 11422409 10933054 10466002 10016644 9587066 9181357 8797783 8431994 8084300 7757047
55818G757047l08932k94417k79360k62561k48839k39713k30533k19706k11274
$$ 7757047 7448115 7153698 6874338 6611777 6362938 6123225 5892692 5672986 5461712
55809E461712k05618j97262j85002j74592j68150j60422j49002j38816j32598
$$ 5461712 5256094 5058832 4873830 4699238 4531088 4370666 4221664 4082848 3950250
55800C950250j26436j18976j15792j19600j24557j25337j24073j23450j20676
$$ 3950250 3823814 3704838 3589046 3469446 3344889 3219552 3095479 2972029 2851353
55791B851353j13723j06616j02944r9973r4103q6682p9978p2740o4130n6987n3190
$$ 2851353 2737630 2631014 2528070 2428097 2333994 2247312 2167334 2094594 2030464 1973477 1920287
55780A920287n0271m6020m1831l8538l4029k7847k3150k1267j9365j6165j4725
$$ 1920287 1870016 1823996 1782165 1743627 1709598 1681751 1658601 1637334 1617969 1601804 1587079
55769A587079j6568j8326j7285j5377j4824j4851j5448j9108k5735l0704l1267
$$ 1587079 1570511 1552185 1534900 1519523 1504699 1489848 1474400 1455292 1429557 1398853 1367586
55758A367586l0266l0625l0893k9303k7530k7135k6547k4673k3436k3928k4020
$$ 1367586 1337320 1306695 1275802 1246499 1218969 1191834 1165287 1140614 1117178 1093250 1069230
55747A069230k2426k1001k0663j9342j6366j4342j4189j2922r106n812n172m568
$$ 1069230 1046804 1025803 1005140 985798 969432 955090 940901 927979 918873 913061 907889 903321
55735I03321j500K106L692M005L990J913k977p686r801j1078j3483j5255j4300
$$ 903321 901821 903927 907619 911624 915614 917527 914550 906864 897063 885985 872502 857247 842947
55722H42947j2076j0755r574p288n332n441o799q311j0885j4793j7728j8119j7521
$$ 842947 830871 820116 810542 803254 797922 792481 785682 777371 766486 751693 733965 715846 698325
55709F98325j7298j6081j3075j0489r857r123o548m474n933j0100j4110j7020
$$ 698325 681027 664946 651871 641382 631525 622402 615854 611380 605447 595347 581237 564217
55697E64217j8990j9039j6672j3846j2689j2925j3518j4642j5977j5522j2314
$$ 564217 545227 526188 509516 495670 482981 470056 456538 441896 425919 410397 398083
55686C98083q279n373l315j709j544k694k775q76M19j020l518m526m296m249m097
$$ 398083 389804 384431 381116 379407 377863 375169 372394 371518 371937 370917 367399 362873 358577 354328 350231
55671C50231l059j869j434j413j631k840m705n605n483o033p050o140l317j857
$$ 350231 347172 345303 343869 342456 340825 337985 333280 327675 322192 316159 309109 302969 299652 297795
55657B97795k900l414j764q73k875m903l780j135j62l61O39K733M407N710O895
$$ 297795 294895 291481 289717 288844 285969 281066 277286 276151 275989 275628 276267 279000 283407 289117 296012
55642B96012O522M031J679J057K91k354n063n641n151n107m189j357R52N17n31
$$ 296012 302534 306565 308244 309301 309592 307238 302175 296534 291383 286276 282087 280730 281682 282199 281668
55627B81668O38K666K898K478M017O508P294P003P845Q841P534M885L561K664
$$ 281668 282306 284972 287870 290348 294365 300873 308167 315170 323015 331856 339390 344275 347836 350500
55613C50500p34n689q155p420o796p751p973o045l902l537m522n698o485n949
$$ 350500 349766 344077 335922 328502 321706 313955 305982 299937 296035 292498 287976 282278 275793 269844
55599B69844l162Q27L615M216L461K098N88J47J510L198L258K115J424J074j32
$$ 269844 266682 267509 271124 275340 278801 280899 281487 281634 283144 286342 289600 291715 293139 294213 294081
55584B94081j730k403k631l802n348n584m718m286m378m253m732o791q632p642
$$ 294081 292351 289948 287317 283515 278167 272583 267865 263579 259201 254948 250216 243425 234793 227151
55570B27151m867l981n877p713p412n927m758m334n189p794j0656j1296r497p199
$$ 227151 222284 218303 212426 204713 197301 191374 186616 182282 177093 169299 158643 147347 137850 130651
55556A30651n212k815o15o54k928m704m193k459j040m8N91L70m56p68m71o45j403
$$ 130651 125439 122624 122009 121355 118427 113723 109530 107071 106031 105983 106574 106944 106488 105720 105249 104604 103201
55539A03201j548p87k78n28p46o61r22j349r33m3m06k303l826l642k496j334q6
$$ 103201 101653 100866 100588 100060 99314 98653 97731 96382 95449 95406 95000 92697 88871 85229 82733 81399 81313
55522H1313Q77K52j960l621l242k046j948k810l139k472j619j207j232j614k049
$$ 81313 82190 82442 80482 76861 73619 71573 69625 66815 63676 61204 59585 58378 57146 55532 53483
55507E3483j567P28M136O278N171J479j819k482j322o60j006q39K82O27q11k316
$$ 53483 51916 52644 56780 63058 68229 69708 67889 65407 64085 63425 62419 61580 61862 62489 61678 59362
55491E9362j985o65m71j586k408k030q11P70K156K399J328K61J61K09l75n65N28
$$ 59362 57377 56712 56241 54655 52247 50217 49406 50176 52332 54731 56059 56320 56481 56690 56315 55750 56278
55474E6278J512Q64j61N86K526L503L538M278N246M145R31j579j646l36J103K844
$$ 56278 57790 58654 58493 59079 61605 65108 68646 72924 78170 82315 83246 81667 80021 79685 80788 83632
55458H3632M727N520M962M484N053N915O050N266L508Q84j557k789l603n426p511
$$ 83632 88359 93879 98841 103325 108378 114293 120343 125609 129117 130001 128444 125655 122052 116626 109115
55443A09115p661n967n179o741q841r313q312p046n880m788m144l907l359k326
$$ 109115 101454 95487 90308 83567 74726 65413 57101 50055 44175 39387 35243 31336 27977 25651
55429B5651j491j052n59k63r30j930j470N52J853Q38j317k602k716k627k864l226
$$ 25651 24160 23108 22549 22286 21356 19426 17956 18508 20361 21199 19882 17280 14564 11937 9073 5847
55413E847B554b3j057J67j76j723k806k679k013j108N09K323K633R43j003j467
$$ 5847 2554 -23 -1080 -913 -1089 -2812 -5618 -8297 -10310 -11418 -10909 -8586 -5953 -5010 -6013 -7480
55397g480o80K54J005J658J901J563f18E52J416J599J609J132j02j479j886j207
$$ -7480 -8160 -7906 -6901 -5243 -3342 -1779 -618 552 1968 3567 5176 6308 6206 4727 2841 1634
55381A634m73m97e21k068k445j305J382a394A581J75a49j501M85A277L630L548
$$ 1634 1161 664 -521 -2589 -5034 -6339 -4957 -1394 1581 1756 -149 -1650 -1165 1277 4907 8455
55365H455J853m77j593j046k20j02k55l78j078k411d68k759j659o08M56J436J741
$$ 8455 10308 9831 8238 7192 6972 6870 6615 6237 5159 2748 -468 -3227 -4886 -5494 -5038 -3602 -1861
55348a861e01D47N34l94g32j027J09J61j388k581j825j36O07J20n97q53n23K60
$$ -1861 -501 447 981 587 -732 -1759 -1650 -1489 -2877 -5458 -7283 -7419 -6812 -6692 -7289 -8142 -8665 -8405
55330h405Q87P10J51K85J037J161L33k82M0O53R47J147a97F2a129j957j880k107
$$ -8405 -7518 -6808 -6657 -6372 -5335 -4174 -3841 -4123 -4083 -3430 -2483 -1336 -197 62 -1129 -3086 -4966 -7073
55312g073k638j887L04J424l47l279m306k799o83J76o56k383l419k484j57J526
$$ -7073 -9711 -11598 -11294 -9870 -10217 -13496 -17802 -20601 -21284 -21108 -21764 -24147 -27566 -30050 -30207 -28681
55296b8681J637J262J327J173K24o03l60M47J027J538K015J540j28j454j095K03
$$ -28681 -27044 -25782 -24455 -23282 -23058 -23661 -24021 -23574 -22547 -21009 -18994 -17454 -17582 -19036 -20131 -19928
55280a9928R54J087J406J944K237K224J743K32j844k591j157O16O11n68q66j15
$$ -19928 -18974 -17887 -16481 -14537 -12300 -10076 -8333 -8101 -9945 -12536 -13693 -13077 -12466 -13034 -13900 -14015
55264a4015rj201k407k492j825j226q23l71mo0n49q57k41J173K061J331k26p25
$$ -14015 -14024 -15225 -17632 -20124 -21949 -23175 -23998 -24369 -24373 -24433 -24982 -25839 -26080 -24907 -22846 -21515 -21741 -22466
55246b2466L06J404J341M69l02n29J86K055L973M152K581J213R99N55j106k522
$$ -22466 -22160 -20756 -19415 -18946 -19248 -19777 -19591 -17536 -13563 -9411 -6830 -5617 -4618 -4063 -5169 -7691
55230g691k053n86j64j092k165k720k700j634O21K645K706J032n79j067q32n89
$$ -7691 -9744 -10330 -10494 -11586 -13751 -16471 -19171 -20805 -20184 -17539 -14833 -13801 -14380 -15447 -16279 -16868
55214a6868o17r22j088k63J707L464L326J147j620l290l078j436J87M59m70j301
$$ -16868 -17485 -18407 -19495 -19758 -18051 -14587 -11261 -10114 -11734 -15024 -18102 -19538 -19351 -18892 -19362 -20663
55198b0663j315r47n14K70J236J517Q36k05j334k593k936r68K403M158L062J249
$$ -20663 -21978 -22925 -23439 -23169 -21933 -20416 -19580 -19785 -21119 -23712 -26648 -27616 -25213 -21055 -17993 -16744
55182a6744P69Q05j02j319j602j482j934k192j051P88J737J631J229N50m44p26
$$ -16744 -15975 -15170 -15272 -16591 -18193 -19675 -21609 -23801 -24852 -24064 -22327 -20696 -19467 -18917 -19361 -20087
55166b0087L18J405J179L79L51O58L19LP05J401O75m08K05J945K374J066r3k70
$$ -20087 -19769 -18364 -17185 -16806 -16455 -15797 -15478 -15475 -14770 -13369 -12694 -13102 -12897 -10952 -8578 -7512 -7605 -7875
55148g875m44p62K1J926L151a228F53J534J134Nj362c27k768k759j932n55N60
$$ -7875 -8319 -9081 -9060 -7134 -3983 -1228 653 2187 3321 3326 1964 -327 -3095 -5854 -7786 -8341 -7781
55131g781J219J858K306f59J91j153j313m28O88J166N51n14n91O27A11R51j13
$$ -7781 -6562 -4704 -2398 -659 -468 -1621 -2934 -3362 -2674 -1508 -957 -1471 -2062 -1435 111 1062 949
55114I49k34j70g58k661k075Q5J139P8j374j886k125k652k664j714o48k8N39Q23
$$ 949 715 545 -758 -3419 -5494 -5409 -4270 -4192 -5566 -7452 -9577 -12229 -14893 -16607 -17255 -17283 -16744 -15921
55096a5921k53k399l492k377m32P33J493K771L921L584J822R5l42O25J985K099
$$ -15921 -16174 -18573 -22065 -24442 -24874 -24141 -22648 -19877 -15956 -12372 -10550 -10455 -10797 -10172 -8187 -6088
55080f088J14k588l490k002k79k81j255j089P02K502K562P40j405j890j95J948
$$ -6088 -5974 -8562 -12052 -14054 -14333 -14614 -15869 -16958 -16256 -13754 -11192 -10452 -11857 -13747 -13942 -11994
55064a1994K336R53j43K54J113J161Q02J031J621a179A69J502K213K510J798O96
$$ -11994 -9658 -8705 -8848 -8594 -7481 -6320 -5518 -4487 -2866 -1179 169 1671 3884 6394 8192 8888
55048H888K33P59J851K952L800M224L793K138k95k234k763k219j528r93j93J064
$$ 8888 9121 9880 11731 14683 18483 22707 26500 28638 28343 26109 23346 21127 19599 18606 18413 19477
55032A9477K275K632J763K87l58O58K242K431R96k29n8N85P77J348K916L829K291
$$ 19477 21752 24384 26147 26434 26076 26734 28976 31407 32403 32174 32116 32701 33478 34826 37742 41571 43862
55015D3862m34j422j42J252J492J525K000J805k7k477l674k809o12J255J217p60
$$ 43862 43428 42006 41864 43116 44608 46133 48133 49938 49911 47434 43760 40951 40339 41594 42811 42051
54999D2051k779l072k084j379j172n31M69P54J58n62j355k562l238k075P1J003
$$ 42051 39272 36200 34116 32737 31565 31034 31503 32257 32415 31853 30498 27936 24698 22623 22694 23697
54983B3697N87Q31K235K823J517j45p77j031j477j087N97J930J601P67J000J735
$$ 23697 24284 25115 27350 30173 31690 31545 30768 29737 28260 27173 27770 29700 31301 32068 33068 34803
54967C4803J505L00j005k271l508l840k725j098Q4J246K728L262J754m73j118
$$ 34803 36308 36608 35603 33332 29824 25984 23259 22161 22245 23491 26219 29481 31235 30762 29644
54952B9644J14J617K218J843O03j034j766p99O90J052O25J060K497L184K086K37
$$ 29644 29758 31375 33593 35436 36039 35005 33239 32440 33130 34182 34807 35867 38364 41548 43634 43871
54936D3871q33q31m62l40n38o30q9R66J558R53l29j154j170q95o62j69R01K289
$$ 43871 43038 42207 41745 41405 40867 40237 40148 41114 42672 43625 43296 42142 40972 40077 39415 39246 40147 42436
54918D2436L179K791J262K3N29K437L791L334J722J80r57j662j482l96M46O5q85
$$ 42436 45615 48406 49668 49691 50220 52657 56448 59782 61504 61684 60727 59065 57583 57187 57633 57698 56813
54901E6813j003Q1J728L454M985N737N382M709M848N835O758P103P137P185P340
$$ 56813 55810 55891 57619 61073 66058 71795 77177 81886 86734 92569 99327 106430 113567 120752 128092
54886A28092P779Q688R940J1369J3061J4793J5657J4978J3269J1621J0278Q470
$$ 128092 135871 144559 154499 165868 178929 193722 209379 224357 237626 249247 259525 267995
54874B67995N530J641k304n284o996q324j0578j3762j6225j6545j5174j3599j2418
$$ 267995 273525 275166 272862 267578 260582 252258 241680 227918 211693 195148 179974 166375 153957
54861A53957j1046r079p117o130o301o648n917l973k002q43K11J981L417K739
$$ 153957 142911 133832 126715 120585 114284 107636 101719 97746 95744 94901 95112 97093 100510 103249
54847A03249M77o34P50L061M655O084Q276J0367J1290J2046J4182J6839J7477
$$ 103249 103726 103092 103842 106903 111558 117642 125918 136285 147575 159621 173803 190642 208119
54834B08119J5265J1885R053O738M040M37l928q332j1735j3623j4433j4688j4274
$$ 208119 223384 235269 244322 251060 255100 255537 251609 243277 231542 217919 203486 188798 174524
54821A74524j3173j2093j1609j1305j0626r644q285n948l122j926l400n425n309
$$ 174524 161351 149258 137649 126344 115718 106074 97789 91841 88719 86793 83393 77968 72659
54808G2659l509k495k695k146o7J847K149J370L62j066k905m149m216l831l566
$$ 72659 69150 66655 63960 61814 61747 63594 65743 67113 67475 66409 63504 59355 55139 51308 47742
54793D7742k784j008Q32J489R59J9r67k062l081l652l512k550j056j1j98q67n11
$$ 47742 44958 43950 44782 46271 47230 47249 46282 44220 41139 37487 33975 31425 30369 30358 30160 29293 28782
54776B8782P98J279K90l34R54K629J965j033l453l151r25J270K721L731M197L558
$$ 28782 29580 30859 31149 30815 31769 34398 36363 35330 31877 28726 27801 29071 31792 35523 39720 43278
54760D3278J880O3j051j226n52Q77K818M671N659N242L530J422J34J40O15M63
$$ 43278 45158 45221 44170 42944 42392 43269 46087 50758 56417 61659 65189 66611 66745 66885 67500 67963
54744F7963j18K32K144M475N688N615N137M799M701N265O838Q655R429R130R074
$$ 67963 67845 68077 70221 74696 80384 85999 91136 95935 100636 105901 112739 121394 130823 139953 149027
54729A49027J0076J1608J2961J4042J4785J4966J4921J5168J4921J2526P986L505
$$ 149027 159103 170711 183672 197714 212499 227465 242386 257554 272475 285001 292987 296492
54717B96492O01j697m622p285q204p960q240r015q764p158n636n267n617n921
$$ 296492 297093 295396 290774 283489 275285 267325 259085 250070 241306 234148 228512 223245 217628 211707
54703B11707n982n683m812l666k809k107q75R36K590L672M645O191Q556J1335
$$ 211707 205725 200042 195230 191564 188755 186648 185773 186709 189299 192971 197616 203807 212363 223698
54689B23698J3480J4036J3542J4040J6765K0475K3066K4143K4690K4896K3910
$$ 223698 237178 251214 264756 278796 295561 316036 339102 363245 387935 412831 436741
54678D36741K1302J7278J1685M480k971q795j2914j6799k0785k3361k3548k2467
$$ 436741 458043 475321 487006 491486 488515 479720 466806 450007 429222 405861 382313 359846
54666C59846k1776k1741k1381j9723j6584j3054j1083j1562j2896j2859j1523
$$ 359846 338070 316329 294948 275225 258641 245587 234504 222942 210046 197187 185664
54655A85664j0683j0533r281o428m049l736m372m259l541l041k415j246o14j541
$$ 185664 174981 164448 155167 148739 144690 140954 136582 132323 128782 125741 123326 122080 121466 119925
54641A19925k993l326k840k860k988j661P27J726L66j276j006N83J396Q68L32
$$ 119925 116932 113606 110766 107906 104918 103257 103984 105710 106076 104800 103794 104377 105773 106641 106973
54626A06973Q41J940K664K746K548K354K199K139K218K208J763R46L64O10J812
$$ 106973 107814 109754 112418 115164 117712 120066 122265 124404 126622 128830 130593 131539 131903 132513 134325
54611A34325L699N731O964O542M946M085N165O833O640M381K578L267N472O643
$$ 134325 138024 143755 150719 157261 162207 166292 171457 178290 184930 189311 191889 195156 200628 207271
54597B07271N659L583K122K195L546M937M992L597K207K166L079L582L430L826
$$ 207271 212930 216513 218635 220830 224376 229313 234305 237902 240109 242275 245354 248936 252366 256192
54583B56192N633Q090R795J0450J1144J3018J5954J8741K0395K1126K1823K2791
$$ 256192 261825 269915 279710 290160 301304 314322 330276 349017 369412 390538 412361 435152
54571D35152K3380K2949K1598J9638J6709J2072N681j416p852j2835j6397j9035
$$ 435152 458532 481481 503079 522717 539426 551498 557179 555763 547911 535076 518679 499644
54559D99644k1241k3021k3783k2833k0328j7549j5893j5449j4884j3078j0619
$$ 499644 478403 455382 431599 408766 388438 370889 354996 339547 324663 311585 300966
54548C00966r146r319j0041r904q726p278o129n402n226n546n700n045m082m065
$$ 300966 291820 282501 272460 262556 253830 246552 240423 235021 229795 224249 218549 213504 209422 205357
54534B05357n214o100n336l397k053k304l503m526n117n602n889n588n078n380
$$ 205357 200143 194043 188707 185310 183257 180953 177450 172924 167807 162205 156316 150728 145650 140270
54520A40270o448o535m379j422m22j938l713l800k808k334k691l192l543l639
$$ 140270 133822 127287 122908 121486 121064 119126 115413 111613 108805 106471 103780 100588 97045 93406
54506I3406k994j715j174k206l296k289L97K073J282n63j333n32R29K135K770
$$ 93406 90412 88697 87523 85317 82021 79732 80129 82202 83484 82921 81588 81056 81985 84120 86890
54491H6890L040L378L751L390J828m0q84o32j71L46J487K937L487K951K661L504
$$ 86890 89930 93308 97059 100449 102277 102237 101353 100721 100550 100896 102383 105320 108807 111758 114419 117923
54475A17923M698N117M827M699N255O398P626Q241Q033P774Q308R225R485R172
$$ 117923 122621 127738 132565 137264 142519 148917 156543 164784 172817 180591 188899 198124 207609 216781
54461B16781R370J0210J0460R270P014M166Q47k239m126n300p402j0415j2061
$$ 216781 226151 236361 246821 256091 263105 267271 268118 265879 261753 256453 249051 238636 226575
54448B26575j0987q887q053q419q559q264q263q303p470n978n042n048n270n174
$$ 226575 215588 206701 198648 190229 181670 173406 165143 156840 149370 143392 138350 133302 128032 122858
54434A22858m864m284l138j578j98O34Q74N65j3l28l75p31j362j172L87K125K635
$$ 122858 117994 113710 110572 108994 108796 109430 110304 110869 110856 110528 110153 109422 108060 106888 107275 109400 112035
54417A12035K145J719J424P91M38J420L189L978L389K919L458L815K600L81j058
$$ 112035 114180 115899 117323 118114 118552 119972 123161 127139 130528 133447 136905 140720 143320 143701 142643
54402A42643r08J91J411K442L060K802J574P8p81q98r73j401j718j455j031j096
$$ 142643 141735 141926 143337 145779 148839 151641 153215 153293 152512 151614 150641 149240 147522 146067 145036 143940
54386A43940j411j328j120j691k858l326k673k127k598l208k675j156K61J008
$$ 143940 142529 141201 140081 138390 135532 132206 129533 127406 124808 121600 118925 117769 118030 119038
54372A19038R58j41j927k801j525R32K277J508m04k063k799k554j640o67P6R46
$$ 119038 119996 119855 117928 115127 113602 114534 116811 118319 117915 115852 113053 110499 108859 108192 108268 109214
54356A09214K003K416J700R84J779L832N421N589M827L755K542J643J732K565
$$ 109214 111217 113633 115333 116317 118096 121928 127349 132938 137765 141520 144062 145705 147437 150002
54342A50002L109L136L553M794N911N903N110M730N424O721P388O231L150l58
$$ 150002 153111 156247 159800 164594 170505 176408 181518 186248 191672 198393 205781 212012 215162 214804
54328B14804k395k479j783j560k038k873l867m857n544n752n575n128m549m164
$$ 214804 212409 209930 208147 206587 204549 201676 197809 192952 187408 181656 176081 170953 166404 162240
54314A62240m161m113l481k504k009k349l076l646l772l153j726k18L51j22p44
$$ 162240 158079 153966 150485 147981 145972 143623 140547 136901 133129 129976 128250 128032 128383 128261 127517
54299A27517r01q76j110j554j912j866r78Q38K609K942J753N27N78J659K733L334
$$ 127517 126616 125740 124630 123076 121164 119298 118320 119158 121767 124709 126462 126989 127567 129226 131959 135293
54283A35293L631L766L759L731L725L511K927K174J513R67N15K34P4k12p34j387
$$ 135293 138924 142690 146449 150180 153905 157416 160343 162517 164030 164997 165512 165746 165820 165608 164874 163487
54267A63487k221l434m880n974o320o097n610m849l658k215j140j196k718n073
$$ 163487 161266 157832 152952 146978 140658 134561 128951 124102 120444 118229 117089 115893 113175 108102
54253A08102o903p294o478n063l146q46P88O59p50j827j980k102k766l286l163
$$ 108102 101199 93905 87427 82364 79218 78372 79160 79819 79069 77242 75262 73160 70394 67108 63945
54238F3945l015l219k856j183P01J039k14j429j466n90N98J903L019L326K658
$$ 63945 60930 57711 54855 53672 54373 55412 55198 53769 52303 51713 52311 54214 57233 60559 63217
54223F3217J659R52M84r9q56j608k159k261j664m85P40J564J976K133K034J721
$$ 63217 64876 65828 66312 66213 65357 63749 61590 59329 57665 57180 57920 59484 61460 63593 65627 67348
54207F7348J485J528J637J534J423J803K687L443L573L317L159L066K592J638
$$ 67348 68833 70361 71998 73532 74955 76758 79445 82888 86461 89778 92937 96003 98595 100233
54193A00233N71m52j697l145m000l439j685N1Q12P19M91L76n0r79j598q45R83
$$ 100233 100804 100352 98655 95510 91510 88071 86386 86437 87249 87968 88459 88835 88785 87806 86208 85363 86346
54176H6346K056J119p16j226K2J257J164N83P78J346J091J20m84o31j117j595
$$ 86346 88402 89521 88805 87579 87601 88858 90022 90605 91383 92729 93820 93940 93456 92825 91708 90113
54160I0113m96K384M752M405J997L7k30K73L96K69M82Q21O18j0k08K37L30p67
$$ 90113 89617 92001 96753 101158 103155 103192 102962 103235 103631 103900 104382 105203 105821 105811 105603 105840 106170 105403
54142A05403k238k357p15J112J501N97m23j138j919k596k343j121j74n70j860
$$ 105403 103165 100808 100093 101205 102706 103303 102880 101742 99823 97227 94884 93763 93589 93019 91159
54127I1159k682k319j264n64q98k025k864k487j266o79j523k683k277q8J861J570
$$ 91159 88477 86158 84894 84330 83432 81407 78543 76056 74790 74111 72588 69905 67628 67540 69401 70971
54111G0971m44j594k53K395L952L592K431J507P07j79o87o79j001k193l377l465
$$ 70971 70527 68933 68680 71075 75027 78619 81050 82557 83264 83085 82398 81719 80718 78525 75148 71683
54095G1683k809k450k277j293N11J864J864P16j074l077m375m037k474j214r05
$$ 71683 68874 66424 64147 62854 63365 65229 67093 67809 66735 63658 59283 55246 52772 51558 50653
54080E0653o34L32J292J267M28m85j303k137k565k023p19N83J404J752J755J612
$$ 50653 50019 50351 51643 52910 53338 52853 51550 49413 46848 44825 44106 44689 46093 47845 49600 51212
54064E1212J467J044j48j874l005k728j426L8J258J970J683L97q43j100p70q00
$$ 51212 52679 53723 53575 51701 48696 45968 44542 44580 45838 47808 49491 49888 49045 47945 47175 46375
54048D6375j100q28O1O45N37L68O26R26Q50O60O94P00L23j79k92K8M26P20R59
$$ 46375 45275 44447 44508 45153 45690 46058 46684 47610 48460 49120 49814 50514 50837 50658 50366 50394 50820 51540 52499
54029E2499J082R70P33N61L72k4n01o66m43j31K02R63K295L406L107J103j521
$$ 52499 53581 54551 55284 55845 56217 56193 55692 55026 54583 54452 54654 55617 57912 61318 64425 65528 64007
54012F4007l114k699o43J603K540J840N72k8J53M19O73J668L591N182M890K614
$$ 64007 60893 58194 57551 59154 61694 63534 64106 64078 64231 64650 65323 66991 70582 75764 80654 83268
53996H3268q0j332m19J735L343L432K811K864L460L162J753J061K388M361M841
$$ 83268 83188 81856 81437 83172 86515 89947 92758 95622 99082 102244 103997 105058 107446 111807 116648
53981A16648L994L761M820N917O018N395M425L143K394L631O715R352R727Q624
$$ 116648 120642 124403 129223 135140 141158 146553 150978 154121 156515 160146 166861 176213 185940 194564
53967A94564P998Q430R061R149Q572P318N646M432M404N117N397M648L189J544
$$ 194564 202562 210992 220053 229202 237774 245092 250738 255170 259574 264691 270088 274736 277925 279469
53953B79469J32o11m92m2j38j079k405l553m384n029n502n590n114m269l606l545
$$ 279469 279601 278990 278498 278456 278318 277239 274834 271281 266897 261868 256366 250776 245662 241393 237787 234242
53937B34242l986m564n055n175m525l307k665l331m223l577j471L5l18j495j941
$$ 234242 230256 225692 220637 215462 210937 207630 204965 201634 197411 193834 192363 192398 192080 190585 188644
53922A88644j571j095n84Q5K59o15j633j329K03J318R76p4n37j44L16R7p07j233
$$ 188644 187073 185978 185394 185479 185738 185123 183490 182161 182364 183682 184658 184584 184047 183903 184219 184316 183609 182376
53904A82376o93O57J522Q22j164l034l506k384n89O05O59K25J07N6p25j923k083
$$ 182376 181683 182340 183862 184684 183520 180486 176980 174596 174007 174612 175271 175496 175603 175659 174934 173011 170928
53887A70928n83J491K974M015N092N737N426M804M844N432N937O421O980O698
$$ 170928 170345 171836 174810 178825 183917 189654 195080 199884 204728 210160 216097 222518 229498 236196
53873B36196N017L538M425O951P836N564K502J685L051M139L484J836O51O53J798
$$ 236196 241213 244751 249176 256127 263963 269527 272029 273714 276765 280904 284388 286224 286875 287528 289326
53858B89326L504M858N185M643L944L656L985M985O474P895Q714Q885Q598P792
$$ 289326 292830 297688 302873 307516 311460 315116 319101 324086 330560 338455 347169 356054 364652 372444
53844C72444O422N038M517M981N358M395J994o22k035j967j541k234m346o604
$$ 372444 378866 383904 388421 393402 398760 403155 405149 404527 402492 400525 398984 396750 392404 385800
53830C85800p476o935o486p201q295q171o605m986m403m564m997o180q468j0652
$$ 385800 378324 371389 364903 357702 349407 341236 334631 329645 325242 320678 315681 309501 301033 290381
53816B90381j0980r453p886p577p977p936p110n762m195l015l073m342n488n304
$$ 290381 279401 269948 262062 254485 246508 238572 231462 225700 221505 218490 215417 211075 205587 200283
53802B00283m076k944k425k276k362k830l633m473n041n008m184l155l118m449
$$ 200283 196207 193263 190838 188562 186200 183370 179737 175264 170223 165215 161031 157876 154758 150309
53788A50309n860n814m344k746j742r18J80J219J529P67q42k510l214k535j107
$$ 150309 144449 138635 134291 131545 129803 128885 129065 130284 131813 132580 131738 129228 126014 123479 122372
53773A22372K1L38l0o87j053o02M17J053J003J276K618M000L769J888j22j227
$$ 122372 122393 122731 122701 122014 120961 120359 120776 121829 122832 124108 126726 130726 134495 136383 136261 135034
53757A35034j525j117K28K055L213L358L365L864M287L924K914J767P57L39J229
$$ 135034 133509 132392 132620 134675 137888 141246 144611 148475 152762 156686 159600 161367 162124 162463 163692
53742A63692L305N088N163L759K327J969K753M133N415O119O329O429O256N215
$$ 163692 166997 172085 177248 181007 183334 185303 188056 192189 197604 203723 210052 216481 222737 227952
53728B27952L611L009M335O277O708N483M466M731N063L859J523p9j07M19K00
$$ 227952 231563 234572 238907 245184 251892 257375 261841 266572 271635 275494 277017 276938 276831 277250 277450
53713B77450p67j518j443p37M2M22J17q79k174l332m250m959n144m348k830j706
$$ 277450 276683 275165 273722 272985 273027 273449 273566 272687 270513 267181 262931 257972 252828 248480 245650 243944
53697B43944j853k882l579l257k409k031k550l460l893l440k429j422p80p32j429
$$ 243944 242091 239209 235630 232373 229964 227933 225383 221923 218030 214590 212161 210739 209959 209227 207798
53682B07798k515l084k721k298k890m103m544l955l549l899l900k699j308j094
$$ 207798 205283 202199 199478 197180 194290 190187 185643 181688 178139 174240 170340 167641 166333 165239
53668A65239j640j619j059j077j577j041J065L168L504K205P80K89P04J574K639
$$ 165239 163599 161980 160921 159844 158267 157226 158291 161459 164963 167168 167948 168237 168941 170515 173154
53653A73154L818M972N740N744N069M296L779L147K076J196J488K873M188M644
$$ 173154 176972 181944 187684 193428 198497 202793 206572 209719 211795 212991 214479 217352 221540 226184
53639B26184M627M823N208N197M517L652L486M359N440N343L734J863J080J313
$$ 226184 230811 235634 240842 246039 250556 254208 257694 262053 267493 272836 276570 278433 279513 280826
53625B80826J664J904K380K887K870K622L064M170M723L838J944j7j436j938j387
$$ 280826 282490 284394 286774 289661 292531 295153 298217 302387 307110 310948 312892 312875 311439 309501 308114
53610C08114k70O86J427K159K205O12j831k861j781o65j420k972k952j273l1k76
$$ 308114 307844 308530 309957 312116 314321 314933 313102 310241 308460 307795 306375 303403 300451 299178 299147 298871
53594B98871p46j64Q53R77J69m86m59m21j223k746l897l596j727P08K402K757
$$ 298871 298125 297961 298814 299791 299960 299474 299015 298594 297371 294625 290728 287132 285405 286113 288515 291272
53578B91272K141J280O13K34K40P62J695K602L135L373L517L445K874J968J326
$$ 291272 293413 294693 295306 295540 295780 296542 298237 300839 303974 307347 310864 314309 317183 319151 320477
53563C20477J333J896K887M215N390N722N344N255N781N849M610L053K857M100
$$ 320477 321810 323706 326593 330808 336198 341920 347264 352519 358300 364149 368759 371812 374669 378769
53549C78769N413O046O490P015P090O503N870N608N475N505O254P588Q378Q116
$$ 378769 384182 390228 396718 403733 410823 417326 423196 428804 434279 439784 446038 453626 462004 470120
53535D70120P805Q423R363R398Q427P270O319N497N106N500O091N852M868M394
$$ 470120 477925 486348 495711 505109 513536 520806 527125 532622 537728 543228 549319 555171 560039 564433
53521E64433N118O270O753O263M864K390p78k952k492m4J752J360K07M69J808
$$ 564433 569551 575821 582574 588837 593701 596091 595313 592361 589869 589825 591577 592937 593144 593613 595421
53506E95421J792m82k846k822p15J193J533Q06l1m85k00J008K485L072K418J428
$$ 595421 597213 596731 593885 591063 590348 591541 593074 593880 593849 593364 593164 594172 596657 599729 602147 603575
53490F03575J241K191L757M999N189M407L432K715K070J697K429M113M927L887
$$ 603575 604816 607007 610764 615763 620952 625359 628791 631506 633576 635273 637702 641815 646742 650629
53476F50629K924M384P240Q277O909N968P328R522J0772J1588J2713J2971J1403
$$ 650629 653553 657937 665177 673454 680363 686331 693659 703181 713953 725541 738254 751225 762628
53463G62628R680R923J1456J2331J3020J5716K0372K4185K5380K5152K5226K5640
$$ 762628 772308 782231 793687 806018 819038 834754 855126 879311 904691 929843 955069 980709
53451I80709K5928K6668K8430L0344L1188L1298L2162L4295L6604L7938L8485
$$ 980709 1006637 1033305 1061735 1092079 1123267 1154565 1186727 1221022 1257626 1295564 1334049
53440A334049L9304M0969M3148M5298M7201M8653M9180M8622M7737M7548M8097
$$ 1334049 1373353 1414322 1457470 1502768 1549969 1598622 1647802 1696424 1744161 1791709 1839806
53429A839806M8530M8392M8104M8068M8137M8244M8576M8821M8185M6697M5549
$$ 1839806 1888336 1936728 1984832 2032900 2081037 2129281 2177857 2226678 2274863 2321560 2367109
53418B367109M5415M5474M4984M4726M5608M6676M6035M3427M0338L7788L5473
$$ 2367109 2412524 2457998 2502982 2547708 2593316 2639992 2686027 2729454 2769792 2807580 2843053
53407B843053L3160L1441L0465K9133K6336K2371J8554J5829J4036J2096Q762
$$ 2843053 2876213 2907654 2938119 2967252 2993588 3015959 3034513 3050342 3064378 3076474 3085236
53396C085236L679k032o745j0011j2721j5569j8084j9691k1042k3457k7216l1099
$$ 3085236 3088915 3086883 3080138 3070127 3057406 3041837 3023753 3004062 2983020 2959563 2932347 2901248
53384B901248l3664l4614l4747l5064l6105l7857l9834m1300m1803m1607m1313
$$ 2901248 2867584 2832970 2798223 2763159 2727054 2689197 2649363 2608063 2566260 2524653 2483340
53373B483340m1025m0204l8497l6141l3425l0386k7432k5448k4496k3139k0140
$$ 2483340 2442315 2402111 2363614 2327473 2294048 2263662 2236230 2210782 2186286 2163147 2143007
53362B143007j6341j3621j2366j1273r395o749l109J885P006R914J0257J0584
$$ 2143007 2126666 2113045 2100679 2089406 2080011 2073262 2070153 2072038 2079044 2088958 2099215 2109799
53350B109799J3035J6788K0122K3375K7857L2963L6586L8131L9173M1107M3695
$$ 2109799 2122834 2139622 2159744 2183119 2210976 2243939 2280525 2318656 2357829 2398936 2442631
53339B442631M6167M8441N0819N3432N6270N9262O2202O4988O7781P0624P3340
$$ 2442631 2488798 2537239 2588058 2641490 2697760 2757022 2819224 2884212 2951993 3022617 3095957
53328C095957P6172P9859Q4441Q8765R1862R4003R5727R6799R7236R8175J00154
$$ 3095957 3172129 3251988 3336429 3425194 3517056 3611059 3706786 3803585 3900821 3998996 4099150
53317D099150J01499J00231R7065R4610R3814R3092R0993Q7737Q3754P8545P1812
$$ 4099150 4200649 4300880 4397945 4492555 4586369 4679461 4770454 4858191 4941945 5020490 5092302
53306E092302O4502N7842N2105M6628M0367L2421K3039J4075P177J454n742j5293
$$ 5092302 5156804 5214646 5266751 5313379 5353746 5386167 5409206 5423281 5430458 5431912 5426170 5410877
53294E410877k5062l2677l8251m3550m9555n5929o2155o8148p3998p9804q5476
$$ 5410877 5385815 5353138 5314887 5271337 5221782 5165853 5103698 5035550 4961552 4881748 4796272
53283D796272r0428r3720r4919r4502r3305r1895r0626q9749q9283q8976q8444
$$ 4796272 4705844 4612124 4517205 4422703 4329398 4237503 4146877 4057128 3967845 3878869 3790425
53272C790425q7156q4652q1248p8074p5797p3705p0840o7433o4278o1228n7663
$$ 3790425 3703269 3618617 3537369 3459295 3383498 3309793 3238953 3171520 3107242 3046014 2988351
53261B988351n4005n1132m8541m4880m0477l7414l6503l6013l4266l1912l0383
$$ 2988351 2934346 2883214 2834673 2789793 2749316 2711902 2675399 2639386 2605120 2573208 2542825
53250B542825k9418k7606k4658k1707j9695j8368j6775j4178j0740p569n707m856
$$ 2542825 2513407 2485801 2461143 2439436 2419741 2401373 2384598 2370420 2359680 2352111 2346404 2341548
53238B341548l701j592R16L355O056R111J1751J3472J4857J6579J8518K0515K3001
$$ 2341548 2337847 2336255 2337171 2340526 2346582 2355693 2367444 2380916 2395773 2412352 2430870 2451385 2474386
53225B474386K6087K8902L0866L2807L5777L9422M2491M4339M4961M4231M2274
$$ 2474386 2500473 2529375 2560241 2593048 2628825 2668247 2710738 2755077 2800038 2844269 2886543
53214B886543M0088L8559L7185L4922L2062K9961K8835K7059K3088J7338J1760
$$ 2886543 2926631 2965190 3002375 3037297 3069359 3099320 3128155 3155214 3178302 3195640 3207400
53203C207400P960N913M099Q68m053r338j3627j6932k0192k3719k6943k9536l2041
$$ 3207400 3215360 3221273 3225372 3226240 3222187 3212849 3199222 3182290 3162098 3138379 3111436 3081900 3049859
53190C049859l5179l8998m2870m6026m7973m8728m8854m9110m9963n1312n2584
$$ 3049859 3014680 2975682 2932812 2886786 2838813 2790085 2741231 2692121 2642158 2590846 2538262
53179B538262n3112n2654n1680n0901n0485m9994m9094m7929m6747m5575m4311
$$ 2538262 2485150 2432496 2380816 2329915 2279430 2229436 2180342 2132413 2085666 2040091 1995780
53168A995780m2731m0381l7012l3299l0463k8989k8282k7703k7188k6540k5153
$$ 1995780 1953049 1912668 1875656 1842357 1811894 1782905 1754623 1726920 1699732 1673192 1648039
53157A648039k3069k1485k1326k1835k1499j9982j8306j7367j7149j7255j7428
$$ 1648039 1624970 1603485 1582159 1560324 1538825 1518843 1500537 1483170 1466021 1448766 1431338
53146A431338j7540j7681j8274j9507k0705k0913k0085j9136j8684j8415j7861
$$ 1431338 1413798 1396117 1377843 1358336 1337631 1316718 1296633 1277497 1258813 1240398 1222537
53135A222537j7218j7065j7597j8582j9750k0805k1243k0794k0147k0563k2275
$$ 1222537 1205319 1188254 1170657 1152075 1132325 1111520 1090277 1069483 1049336 1028773 1006498
53124A006498k3816k3669k2273k1280k0935j9674j6870j4436j4341j5729j6210
$$ 1006498 982682 959013 936740 915460 894525 874851 857981 843545 829204 813475 797265
53113G97265j5271j4515j4918j5872j6938j8328j9293j8232j5232j2539j1429
$$ 797265 781994 767479 752561 736689 719751 701423 682130 663898 648666 636127 624698
53102F24698j0624r018p993r105j1115j1559j0225q881q288p817p600q509r870
$$ 624698 614074 605056 597063 587958 576843 565284 555059 546178 537890 530073 522473 513964 504094
53089E04094r616p432n747o532q625r415q119o115m817m416m549n051n791o316
$$ 504094 494478 487046 481299 474767 466142 456727 448608 442493 437676 433260 428711 423660 417869 411553
53075D11553o049m841l200j847j054o52p24j755l769n693o216n102l271j876j662
$$ 411553 405504 400663 397463 395616 394562 393910 393186 391431 387662 381969 375753 370651 367380 365504 363842
53060C63842k830m828o380o355m691k323m54k7j193k807l149j874o90j254l032
$$ 363842 361012 356184 349804 343449 338758 336435 335981 335954 334761 331954 328805 326931 326241 324987 321955
53045C21955m222m232l929l858l634l122k775k552j829o66j6j62j26P74J789J950
$$ 321955 317733 313501 309572 305714 302080 298958 296183 293631 291802 291136 291120 290958 290832 291606 293395 295345
53029B95345J550J585K295L116L692M144M476M422L896L214K801K744K664J964
$$ 295345 296895 298480 300775 303891 307583 311727 316203 320625 324521 327735 330536 333280 335944 337908
53015C37908M94j049j677j237o82j077k538m123m739m201l611m285n992o840n569
$$ 337908 338402 337353 335676 334439 333757 332680 330142 326019 321280 317079 313468 309183 303191 296351 290782
53000B90782l422k668l628m499m110l348l327l640l397k926l187m055m444l864
$$ 290782 287360 284692 281064 276565 272455 269107 265780 262140 258743 255817 252630 248575 244131 240267
52986B40267k896k224k004k137k488k855l205l755m319l979k162J65J224L70j472
$$ 240267 237371 235147 233143 231006 228518 225663 222458 218703 214384 210405 208243 208408 209632 210002 208530
52971B08530l123l974l646k074l82l50k117l436k328K45J667J139K26N0l07j838
$$ 208530 205407 201433 197787 195713 195331 194981 192864 189428 187100 187345 189012 190151 190377 190427 190120 188282
52955A88282l615l991k880j463k73R80J934J590O6j101j053q49j679k821k585
$$ 188282 184667 180676 177796 176333 176060 177040 178974 180564 180630 179529 178476 177627 175948 173127 170542
52940A70542p86J006J623J573J816K228J952Q30k96p24p87j220j939k056j221
$$ 170542 169756 170762 172385 173958 175774 178002 179954 180784 180488 179764 178977 177757 175818 173762 172541
52925A72541m04p12j687j579M54L004L748J959p22j904p60J228J791K74j689k114
$$ 172541 172137 171425 169738 168159 168613 171617 175365 177324 176602 174698 173938 175166 176957 177231 175542 173428
52909A73428r07M32R78J160J377J126J75m71K39J829K872K766K104J589J405J526
$$ 173428 172521 172953 173931 175091 176468 177594 177769 177298 177537 179366 182238 185004 187108 188697 190102 191628
52893A91628J863K057J826J551J941L016L890L811L127L009M182N920O606N531
$$ 191628 193491 195548 197374 198925 200866 203882 207772 211583 214710 217719 221901 227821 234427 239958
52879B39958L968L792N143O314O118N287N063N436N523M960M070L216K668K550
$$ 239958 243926 247718 252861 259175 265293 270580 275643 281079 286602 291562 295632 298848 301516 304066
52865C04066K400J452Po08j21j35j627k932k074p2K05j801l634l389j961j220
$$ 304066 306466 307918 307925 307317 307196 307061 305434 302502 300428 300356 300561 298760 295126 291737 289776 288556
52849B88556j704k861m094m807m500l509k832k859l095l135k899k054n48M06l44
$$ 288556 286852 283991 279897 275090 270590 267081 264249 261390 258295 255160 252261 250207 249659 250065 249721
52834B49721j581q37J855L642L093K188K663L043J570k09K09J831J474j068k594
$$ 249721 248140 247303 249158 252800 255893 258081 260744 263787 265357 265148 265357 267188 268662 267594 265000
52819B65000j435L69P36N05J199K103J633J82m25L87J543K170K288J869O58q72
$$ 265000 263565 263934 264670 265175 266374 268477 270110 270292 269867 270254 271797 273967 276255 278124 278782 277910
52803B77910j539p89O40J644J758J098O9o81n56L27J230J747K292L292M293M391
$$ 277910 276371 275582 276222 277866 279624 280722 280791 280110 279554 279881 281111 282858 285150 288442 292735 297126
52787B97126L273J501j16j001p76O03K610M223M555L398J360m04r10k10N08K09
$$ 297126 300399 301900 301784 300783 300007 300610 303220 307443 311998 315396 316756 316352 315442 315232 315740 315949
52771C15949p07r53j13Q30R78P00P56R24L20j144k457k764k277j667j067q8J305
$$ 315949 315242 314289 314176 315006 315984 316684 317440 318364 318684 317540 315083 312319 310042 308375 307308 307220 308525
52754C08525K435K633K216K210K962L502K729R76m69j160j840k841l267k394j018
$$ 308525 310960 313593 315809 318019 320981 324483 327212 328188 327719 326559 324719 321878 318611 316217 315199
52739C15199n56j414k938m452n511n715n146m670m958n506n435m853m512m448
$$ 315199 314643 313229 310291 305839 300328 294613 289467 284797 279839 274333 268898 264045 259533 255085
52725B55085m076l408l164l605m203m526m525l985k610q73J24j18j081k112k965
$$ 255085 251009 247601 244437 240832 236629 232103 227578 223593 220983 220110 220234 220116 219035 216923 213958
52710B13958l440l324k933l022l811m652m821m183l137k331k270k551j979j62
$$ 213958 210518 207194 204261 201239 197428 192776 187955 183772 180635 178304 176034 173483 171504 171342
52696A71342J387R44r99k400k578k790l645l879k513p37l47j315k095j816j114
$$ 171342 172729 173673 172674 170274 167696 164906 161261 157382 154869 154132 153785 152470 150375 148559 147445
52681A47445j043j991l418m291l942k734j507n12M28Q50n4j810k598j500K23P85
$$ 147445 146402 144411 140993 136702 132760 130026 128519 128007 128435 129285 129231 127421 124823 123323 123546 124331
52665A24331r8j490k548k844k266j380j061j079j50J765K435J46l488n150l876
$$ 124331 124233 122743 120195 117351 115085 113705 112644 111565 111415 113180 115615 115761 112273 107123 103247
52650A03247j843j199j688j757p41P37J785K045J676R30j39j438k379k224j048
$$ 103247 101404 100205 98517 96760 96019 96756 98541 100586 102262 103192 103053 101615 99236 97012 95964
52635I5964J96Q90J321J781J904J481J068R91O46l09q49oJ323J416L61N0J425
$$ 95964 96160 97050 98371 100152 102056 103537 104605 105596 106242 105933 105084 105078 106401 107817 108178 108228 109653
52618A09653L172L568K594J542J320J769K254K372K194K168K669L578M361M476
$$ 109653 112825 116393 118987 120529 121849 123618 125872 128244 130438 132606 135275 138853 143214 147690
52604A47690L798K780K238K566L148L038K265J687J409M78j366k797k682j784
$$ 147690 151488 154268 156506 159072 162220 165258 167523 169210 170619 171097 169731 166934 164252 162468
52590A62468j503j840j885j612j615j592r14m23j741m541o297n398l022j191m66
$$ 162468 160965 159125 157240 155628 154013 152421 151507 151084 149343 144802 138505 133107 130085 128894 128428
52575A28428m21j002k062k541j533J91R60L24o64j109j160j210j231j266j779
$$ 128428 128007 127005 124943 122402 120869 121060 122020 122344 121680 120571 119411 118201 116970 115704 113925
52560A13925k826l453k616n54J372K177K069J657J023L3r31j275j017o15j54N54
$$ 113925 111099 107646 105030 104476 105848 108025 110094 111751 112774 112807 111876 110601 109584 108969 108815 109369
52544A09369J078O11n73q80P00L113M331L419J011j604l125k646m48J845K781
$$ 109369 110447 111058 110485 109605 110305 113418 117749 121168 122179 120575 117450 114804 114356 116201 118982
52529A18982K519K022J346j48k083k885j663O09K246K457J540J62j025j495j048
$$ 118982 121501 123523 124869 124721 122638 119753 118090 118699 120945 123402 124942 125104 124079 122584 121536
52514A21536J22J613K895L444L167K666K561K637K130Q60m62j091p97L67K246
$$ 121536 121658 123271 126166 129610 132777 135443 138004 140641 142771 143631 143169 142078 141281 141648 143894
52499A43894M292N630N736M701K812L93j662k038l32J989K802J697M85Q99K277
$$ 143894 148186 153816 159552 164253 167065 167458 165796 163758 163426 165415 168217 169914 170399 171298 173575
52484A73575K367L73j856k228r61K92J043K100L371L511K237J205J565K249J892
$$ 173575 175942 176315 174459 172231 171270 171562 172605 174705 178076 181587 183824 185029 186594 188843 190735
52469A90735J068R84J202O49J02J289L676M477K507L2l51Q95J235l76k390k910
$$ 190735 191803 192787 193989 194638 194740 196029 199705 204182 206689 206721 206370 207265 208500 208124 205734 202824
52453B02824j912q33n93o60j74N46M52m88r87l58M18L56J17P04J381O52j120j840
$$ 202824 200912 200079 199486 198826 198652 199198 199650 199162 198175 197817 198235 198591 198708 199412 200793 201445 200325 198485
52435A98485o15J132J806J370M33r39k510l164k068m4J173Q70m1j87Q81K433L446
$$ 198485 197870 199002 200808 202178 202611 201672 199162 195998 193930 193886 195059 195929 195888 195701 196582 199015 202461
52418B02461L637L472L131K214Q13J0M12J020P74N74K040M571N538L777J075m36
$$ 202461 206098 209570 212701 214915 215728 215738 216150 217170 217944 218518 220558 225129 230667 234444 235519 235083
52402B35083q20j336k192k414j350N09J922J742oj762j892o24L64K95M7M54J191
$$ 235083 234263 232927 230735 228321 226971 227480 229402 231144 231138 229376 227484 226860 227224 227519 227566 228020 229211
52385B29211J869K828M210N270N308M381K688M34j391j539l81K07m79j058o61
$$ 229211 231080 233908 238118 243388 248696 253077 255765 256199 254808 253269 252888 253095 252616 251558 250897
52370B50897n34j714k823k111m03J5j320k793l112k261n85J378K510K239J694
$$ 250897 250363 248649 245826 243715 243312 243327 242007 239214 236102 233841 233256 234634 237144 239383 241077
52355B41077K209L130K855J612J164J912K445K198K324L258L554K348J230K049
$$ 241077 243286 246416 249271 250883 252047 253959 256404 258602 260926 264184 267738 270086 271316 273365
$$ [...]
##END NTUPLES=NMR SPECTRUM
##END=
