
##TITLE=AC1108_Colombia_5835691_q6k7dCIauJ
##JCAMPDX= 6.0         $$ Bruker NMR JCAMP-DX V2.0
##DATA TYPE= NMR SPECTRUM
##DATA CLASS= NTUPLES
##ORIGIN= BRUKER
##OWNER= Administrator
$$ 1.72 TOPSPIN		Version 2.1
$$ 2012-03-28 11:05:46.859 -0500  Administrator@TOPSPIN
$$ Compression mode = diff/dup
##.OBSERVE FREQUENCY= 400.13188235
##.OBSERVE NUCLEUS= ^1H
##.ACQUISITION MODE= SIMULTANEOUS (DQD)
##.ACQUISITION SCHEME= undefined
##.AVERAGES= 8
##.DIGITISER RES= 22
##SPECTROMETER/DATA SYSTEM= spect
##.PULSE SEQUENCE= zg30
##.SOLVENT NAME= COFFEE_meoh
##.SHIFT REFERENCE= INTERNAL, COFFEE_meoh, 1, 14.98061
##AUDIT TRAIL= $$ (NUMBER, WHEN, WHO, WHERE, PROCESS, VERSION, WHAT)
$$ ##TITLE= Audit trail, TOPSPIN		Version 2.1
$$ ##JCAMPDX= 5.01
$$ ##ORIGIN= Bruker BioSpin GmbH
$$ ##OWNER= Administrator
$$ $$ C:\Bruker\TOPSPIN/data/COFFEE/nmr/AC1108_Colombia_5835691_q6k7dCIauJ/10/pdata/1/auditp.txt
$$ ##AUDIT TRAIL=  $$ (NUMBER, WHEN, WHO, WHERE, PROCESS, VERSION, WHAT)
(   1,<2012-03-27 21:27:23.453 -0500>,<Administrator>,<TOPSPIN>,<go>,<TOPSPIN 2.1>,
      <created by zg
	started at 2012-03-27 21:26:16.453 -0500,
	POWCHK enabled, PULCHK disabled,
       configuration hash MD5:
       1A 1E CE 29 27 FD 77 03 67 4E F0 E3 C4 B2 CB 90
       data hash MD5: 64K
       7B 5B D9 C3 D0 FA DD 89 34 4A 93 35 BC 77 C9 BB>)
(   2,<2012-03-27 21:27:31.453 -0500>,<Administrator>,<TOPSPIN>,<proc1d>,<TOPSPIN 2.1>,
      <Start of raw data processing
       efp LB = 0 FT_mod = 6 PKNL = 1 PHC0 = 0 PHC1 = 0 SI = 32K 
       data hash MD5: 32K
       BC 0C B7 0F D1 A9 B0 77 31 21 A6 16 3D 63 AE 91>)
(   3,<2012-03-27 21:27:31.812 -0500>,<Administrator>,<TOPSPIN>,<proc1d>,<TOPSPIN 2.1>,
      <pk PHC0 = 215.7385 PHC1 = 0 
       data hash MD5: 32K
       7A 98 B8 7B 64 EB 48 C8 E5 38 90 14 56 46 3A A5>)
(   4,<2012-03-27 21:27:31.890 -0500>,<Administrator>,<TOPSPIN>,<proc1d>,<TOPSPIN 2.1>,
      <abs ABSG = 1 
       data hash MD5: 32K
       7A C9 46 21 09 53 A5 CF 20 28 66 82 36 D8 11 81>)
(   5,<2012-03-27 21:27:31.921 -0500>,<Administrator>,<TOPSPIN>,<proc1d>,<TOPSPIN 2.1>,
      <abs ABSG = 2 
       data hash MD5: 32K
       95 7A AD 82 70 65 80 C6 BC 25 8F E4 5E 39 43 A4>)
(   6,<2012-03-27 21:27:31.953 -0500>,<Administrator>,<TOPSPIN>,<proc1d>,<TOPSPIN 2.1>,
      <abs ABSG = 3 
       data hash MD5: 32K
       2D 6E 5E F0 6F F8 6C 0A FF 46 65 78 C9 B3 D9 91>)
(   7,<2012-03-27 21:27:32.000 -0500>,<Administrator>,<TOPSPIN>,<proc1d>,<TOPSPIN 2.1>,
      <abs ABSG = 4 
       data hash MD5: 32K
       DE 5B 47 3C 62 24 70 E9 D6 2E 13 29 E4 9F 0B 4A>)
(   8,<2012-03-27 21:27:32.031 -0500>,<Administrator>,<TOPSPIN>,<proc1d>,<TOPSPIN 2.1>,
      <abs ABSG = 5 
       data hash MD5: 32K
       19 70 46 38 D6 2B 2C 0E B2 BF E2 56 52 56 4C A3>)
(   9,<2012-03-27 21:27:36.625 -0500>,<Administrator>,<TOPSPIN>,<audit>,<TOPSPIN 2.1>,
      <user comment:
       ICON-NMR User ID: COFFEE
       data hash MD5: 32K
       19 70 46 38 D6 2B 2C 0E B2 BF E2 56 52 56 4C A3>)
$$ [...]
##$TP= (0..7)
150 150 150 150 150 150 150 150
##$TP07= 0
##$TPNAME0= <>
##$TPNAME1= <>
##$TPNAME2= <>
##$TPNAME3= <>
##$TPNAME4= <>
##$TPNAME5= <>
##$TPNAME6= <>
##$TPNAME7= <>
##$TPOAL= (0..7)
0.5 0.5 0.5 0.5 0.5 0.5 0.5 0.5
##$TPOFFS= (0..7)
0 0 0 0 0 0 0 0
##$TUNHIN= 0
##$TUNHOUT= 0
##$TUNXOUT= 0
##$USERA1= <user>
##$USERA2= <user>
##$USERA3= <user>
##$USERA4= <user>
##$USERA5= <user>
##$V9= 5
##$VALIST= <valist>
##$VCLIST= <CCCCCCCCCCCCCCC>
##$VD= 0
##$VDLIST= <DDDDDDDDDDDDDDD>
##$VPLIST= <PPPPPPPPPPPPPPP>
##$VTLIST= <TTTTTTTTTTTTTTT>
##$WBST= 2048
##$WBSW= 25
##$XGAIN= (0..3)
0 0 0 0
##$XL= 0
##$YL= 0
##$YMAX_a= 528304
##$YMIN_a= -631155
##$ZGOPTNS= <>
##$ZL1= 120
##$ZL2= 120
##$ZL3= 120
##$ZL4= 120
##$ABSF1= 14.98061
##$ABSF2= -5.57192
##$ABSG= 5
##$ABSL= 3
##$ALPHA= 0
##$AQORDER= 0
##$ASSFAC= 0
##$ASSFACI= 0
##$ASSFACX= 0
##$ASSWID= 0
##$AUNMP= <proc_prof1d_extract_pilot.lims>
##$AXLEFT= 0
##$AXNAME= <>
##$AXNUC= <1H>
##$AXRIGHT= 0
##$AXTYPE= 0
##$AXUNIT= <>
##$AZFE= 0.1
##$AZFW= 0.1
##$BCFW= 0
##$BC_mod= 0
##$BYTORDP= 0
##$COROFFS= 0
##$CY= 15
##$DATMOD= 1
##$DC= 0
##$DFILT= <>
##$DTYPP= 0
##$F1P= 0
##$F2P= 0
##$FCOR= 0.5
##$FTSIZE= 32768
##$FT_mod= 6
##$GAMMA= 0
##$GB= 0
##$INTBC= 1
##$INTSCL= 1
##$ISEN= 128
##$LB= 0
##$LEV0= 0
##$LPBIN= 0
##$MAXI= 10000
##$MC2= 0
##$MEAN= 0
##$ME_mod= 0
##$MI= 0
##$NCOEF= 0
##$NC_proc= -8
##$NLEV= 6
##$NOISF1= 0
##$NOISF2= 0
##$NSP= 0
##$NTH_PI= 0
##$NZP= 0
##$OFFSET= 14.98061
##$PC= 1
##$PHC0= 215.7385
##$PHC1= 0
##$PH_mod= 1
##$PKNL= yes
##$PPARMOD= 0
##$PPDIAG= 0
##$PPIPTYP= 0
##$PPMPNUM= 2147483647
##$PPRESOL= 1
##$PSCAL= 4
##$PSIGN= 0
##$PYNMP= <proc.py>
##$REVERSE= no
##$SF= 400.13
##$SI= 32768
##$SIGF1= 0
##$SIGF2= 0
##$SINO= 400
##$SIOLD= 32768
##$SPECTYP= <>
##$SREGLST= <1H.CDCl3>
##$SSB= 0
##$STSI= 32768
##$STSR= 0
##$SW_p= 8223.68421052632
##$SYMM= 0
##$S_DEV= 0
##$TDeff= 65536
##$TDoff= 0
##$TI= <>
##$TILT= no
##$TM1= 0
##$TM2= 0
##$TOPLEV= 0
##$USERP1= <user>
##$USERP2= <user>
##$USERP3= <user>
##$USERP4= <user>
##$USERP5= <user>
##$WDW= 1
##$XDIM= 32768
##$YMAX_p= 462079595
##$YMIN_p= -689492
##$CURPLOT= <Network HP LaserJet P1505>
##$CURPRIN= <$Network HP LaserJet P1505>
##$DFORMAT= <normdp>
##$LAYOUT= <+/1D_H.xwp>
##$LFORMAT= <normlp>
##$PFORMAT= <normpl>
##$SURQMSG= 1
$$ End of Bruker specific parameters
$$ ---------------------------------
##NTUPLES= NMR SPECTRUM
##VAR_NAME=  FREQUENCY,     SPECTRUM/REAL,   SPECTRUM/IMAG
##SYMBOL=    X,             R,               I
##VAR_TYPE=  INDEPENDENT,   DEPENDENT,       DEPENDENT
##VAR_FORM=  AFFN,          ASDF,            ASDF
##VAR_DIM=   32768,         32768,           32768
##UNITS=     HZ,            ARBITRARY UNITS, ARBITRARY UNITS
##FACTOR=    0.250966925370066, 1,           1
##FIRST=     8223.43324360095, -102748,      67084
##LAST=      0,             150458,          70448
##MIN=       0,             -689492,         0
##MAX=       8223.43324360095, 462079595,    0
$$ Real data points
##PAGE= N=1
##DATA TABLE= (X++(R..R)), XYDATA
$$ [...]
19469I94a19540I3365J92802a47292f1248b5070k61293a03667b6574k05112a6264
19457a87847p5925C00127b52027d1606F2017k1243a05225K6703j95947d3232A9944
19445A60539p8119K04220a13994H1308c085A5806Q554a21774p1144F5564b08775
19433E2295h305F856a23586c0901I832b10733C7523a21554B7411K637K08026D6259
19420b31375C10641a66578B89196g2866k6158j32410A15202d2423C1770J09350
19410A41120b44267b4314F8096j8568a04424m0896r9184J2760i9683r917k21869
19399c31469A76960C4401d8071k69222A16452g4172j0092G588L23439a28540K8153
19388a00387A72061a63348k07341a48171A86516G7670e9158q844b4402J022j49257
$$ y = [994, -119540, 93365, 286167, -147292, -61248, -25070, -286363, -103667, -26574, -231686, -16264, -187847, -263772, 300127, -252027, -41606, 62017, 40774, -105225, -78522, -274469, -43232, 19944, 160539, 82420, 286640, -113994, 81308, -3085, 15806, 24360, -121774, -192918, 65564, -208775, 52295, -8305, 6856, -123586, -30901, 9832, -210733, 37523, -121554, 27411, 30048, 238074, 46259, -231375, 310641, -166578, 289196, -72866, -99024, -231434, 115202, -42423, 31770, 141120, -244267, -24314, 68096, 49528, -104424, -145320, -244504, -231744, -99683, -109600, -331469, 176960, 34401, -48071, -317293, 116452, -74172, -84264, 7588, 331027, -128540, -100387, 172061, -163348, -370689, -148171, 186516, 77670, -59158, -68002, -24402, -23380, -172637]
19377a72637K6449e869B2724M1063g1760j48754k6688m9466J04090F542f2955
19365a6063k78986j89587g3103j00141e4317l8777a2999q9529j88957J4544M3632
19354b33309C33009D472J76727l1731J75577b18100C18724n0111a8019L051j16217
19343a31185A22312b48691a08076c5366j97740C9672c71926i8294B89157A10718
19332A452b35497J16844j82839a25047H0473a2080n4177j29586m332j9406K1681
19321a97900p2707g9774k01071J12077B05565b72937a6521g46j95388f5964k0717
19310h6681B620b01625B51757d14790f9136A51132D8325b82006N3235R8338n3451
19299a83884L9394N6947A01013a60887b0366k31734M8866l6235J04832M582E6070
$$ y = [-172637, -146188, -5869, 22724, 63787, -71760, -220514, -247202, -296668, -192578, 6542, -62955, -16063, -295049, -484636, -73103, -173244, -54317, -93094, -12999, -102528, -291485, -276941, -233309, 333009, 4472, 181199, 149468, 325045, -218100, 318724, 268613, -18019, -14968, -131185, 122312, -248691, -108076, -35366, -233106, 39672, -371926, -98294, 289157, 110718, 1452, -235497, -118653, -301492, -125047, 80473, -12080, -66257, -195843, -200175, -219581, -197900, -270607, -79774, -280845, -168768, 205565, -272937, -16521, -746, -196134, -65964, -86681, 2620, -201625, 251757, -414790, -69136, 151132, 48325, -282006, -228771, -130433, -183884, -144490, -87543, 101013, -160887, -20366, -252100, -203234, -239469, -134637, -130055, 56070]
19287B9998e5706I3072a10615A54102G6674e3893l53657a21087L3422C654J59730
19276A63384a62275p6485k97978a38192r8764B04903b04014L9261b5987j46896
19266a72883p0094J10901p0680l9737E7877h3248c5957B3481a57141B88830c7235
19254d2565m2593j61285I2531b02462P4295E8050r374g0077K1792G2824a34499
19242b40861D3223a01642J8174o0330N0905A41861d1134A13916c62963E6965a82461
19230c13813r653a16318o1998h5087j64366r746A45433B699a8280j87365O5265
19219a40380J616L0267B1269A631K18755h961j58184P7869A14314a32681k226
19208a34907o4440Q3837j42930O2859h5405j52279D7285N2175B4720L2995N8718
$$ y = [29998, -55706, 93072, -110615, 154102, 76674, -53893, -407550, -121087, -87665, 3654, 163384, -162275, -238760, -536738, -138192, -236956, 204903, -204014, -164753, -25987, -172883, -242977, -132076, -202756, -242493, 57877, -83248, -35957, 23481, -157141, 288830, -37235, -42565, -85158, -246443, 92531, -202462, -128167, 58050, 48676, -70077, -48285, 72824, -134499, -240861, 43223, -101642, -83468, -143798, -92893, 141861, -41134, 113916, -362963, 56965, -182461, -313813, -323466, -116318, -178316, -85087, -249453, -259199, 145433, 2699, -18280, -205645, -140380, -138764, -108497, 21269, 1631, 220386, -8961, -167145, -89276, 114314, -132681, -134907, -199347, -115510, -258440, -195581, -85405, -237684, 47285, 99460, 24720, 57715, 116433]
19197A16433a2756p3933j0681j71524B5672e2557r4012j99930J20068B23805C1853
19185B4597a49533j7713j24533R8849d5712j16007n9696o1689b1387j0814k47401
19174b79602Q2873c0900k80596J22416B84723a742C03632a40577A68646D2916
19163g2918A14173c37754F025b1034B8050g7278l63908e2633j65676K596f1794
19151c13860B26701a88400I2530k8017J45859c07432J01496d8064D24238a28116
19140a88145G1093a26945E4440j8726b4085j47965k16077a70330r9374j460g7034
19128A73888K1668c55801D8873O9071d278l2288A13252a49656F5013b41101C37873
19116F919K4917k199c57540O6032e3077E2736c32474A09540h1437o7735B48457
$$ y = [116433, -12756, -86689, -97370, -268894, 25672, -52557, -146569, -346499, -226431, 223805, 31853, 24597, -149533, -167246, -291779, -192930, -45712, -161719, -221415, -283104, -21387, -32201, -279602, -196729, -30900, -311496, -189080, 284723, -1742, 303632, -140577, 168646, 42916, -72918, 114173, -337754, 6025, -21034, 28050, -77278, -441186, -52633, -218309, -215713, -61794, -313860, 226701, -188400, 92530, 64513, 210372, -307432, -205936, -48064, 424238, -128116, -188145, 71093, -126945, 54440, 35714, -24085, -172050, -388127, -170330, -269704, -271164, -77034, 173888, 195556, -355801, 48873, 117944, -4278, -36566, 113252, -149656, 65013, -241101, 337873, 6919, 31836, 29637, -357540, -291508, -53077, 52736, -332474, 109540, -81437, -149172, 248457]
19104A49409J94612A29123B0618R996a90779P2364G8403h8914j58864r9997J47779
19093a99996I462a03805k9768o0844G7712O515a32252k6719g4208o9171j18337
19082b61716N0081B8010J30804K70563E5513A4460b514H9903i6623l00177a77965
19070a44512b1199j51996h6129A29552a59528J2639a2138k00415F999J95877e6619
19058f2739A65805j0079l8498e4809a5426j95600J03680q4573d6083H2088i2453
19046b01318B95486A42741a58659n3212a7667A24588C695c91098f1767j24235
19036a86002B02383H7116f4788k12183C2659d7588A6693L42229a65703A21397
19025A939K9115h0081j0302K1282D0228b74845d5799k9061A10337g8114C87824
$$ y = [149409, 344021, 129123, 20618, 30614, -190779, -118415, 78403, -88914, -247778, -347775, -199996, 9462, -103805, -133573, -194417, 77712, 84227, -132252, -158971, -74208, -143379, -261716, -211635, 28010, 158814, 429377, 55513, 14460, -2514, 89903, -96623, -396800, -177965, -144512, -21199, -173195, -86129, 129552, -159528, -146889, -12138, -212553, 6999, 202876, -56619, -62739, 165805, 155726, 117228, -54809, -15426, -211026, -107346, -191919, -46083, 82088, -92453, -201318, 295486, 142741, -158659, -211871, -17667, 124588, 3695, -391098, -61767, -186002, 202383, 87116, -64788, -276971, 32659, -47588, 16693, 358922, -165703, 121397, 1939, 31054, -80081, -90383, -69101, 40228, -274845, -45799, -74860, 110337, -78114, 387824]
19013A53342F4919L444a72241G3330d903j59786c5127A36190a26113A00693e7245
19001b7675A63103a63856c1733j79218h950l41722B94353b29595I6619c94951
18990A39188a1362F8917J52133c22791f3541k48606A08442c18968C9835b62482
18979B71175b4479I0043R7820D6380b61082B6898a80333c7370n405j27756A57040
18967C35247b08083j7378O7399k2698A1679J8031c1645j06441A30502b6870C11173
18955B68729m0556I3407l5570M6555b82741C332J25682b54256i693j53310L0975
18944a32028j60825i368j93788I7041a94431k25985A48886i5994j78730A68236
18933c19034C5822c37859J40665M5407A5729a60116I7842a12525B1511J48969
$$ y = [153342, 64919, 68363, -172241, 73330, -4903, -164689, -35127, 136190, -126113, 100693, -57245, -27675, 163103, -163856, -31733, -210951, -8950, -350672, 294353, -229595, 96619, -394951, 139188, -11362, 68917, 221050, -322791, -63541, -312147, 108442, -318968, 39835, -262482, 271175, -24479, 90043, 187863, 46380, -261082, 26898, -180333, -37370, -42775, -170531, 157040, 335247, -208083, -225461, -158062, -180760, 11679, 29710, -31645, -138086, 130502, -26870, 311173, 268729, 228173, 93407, 57837, 104392, -282741, 3332, 129014, -254256, -9693, -163003, -132028, -292853, -9368, -203156, 97041, -194431, -420416, 148886, -95994, -274724, 168236, -319034, 35822, -337859, -197194, -151787, 15729, -160116, 97842, -112525, 21511, 170480]
18923A70480G1519d8348j74200D2190a06126A31827F5323J03407G1973a61483
18912A23586n5764c33833A00330b22174A33272a11211K780f707A91678h7658A03394
18900a44428j30042B5471b49464J4467C77661F1192J79440N76268B13358b572
18889e3162j08682k50575D0962a07549j5972p0437D9449a38799j62676O3839b6059
18877a99877h462k4382k0085n6218A51456g7042I5388O214D7010j2787d1038j73279
18865b14317A59654b09780M3840K8073e3063K1158n7632D6984N6299a72007n7270
18854b29277k4926n5171A0881c25139a14048O689E87O0579a38017a2391j49286
18843a61677G2177c3629B88857a7632k71435B9440a64804D8809F507a57417B1165
$$ y = [170480, 71519, -48348, -222548, 42190, -106126, 131827, 65323, 168730, 71973, -161483, 123586, 67822, -333833, 100330, -222174, 133272, -111211, -108431, -6707, 191678, -87658, 103394, -144428, -274470, 25471, -249464, -234997, 377661, 61192, 240632, 816900, 213358, -2572, -53162, -161844, -412419, 40962, -107549, -123521, -193958, 49449, -138799, -301475, -237636, -26059, -199877, -8462, -32844, -52929, -109147, 151456, -77042, 95388, 101602, 47010, 34223, -41038, -214317, 159654, -209780, -165940, -137867, -53063, -31905, -89537, 46984, 103283, -172007, -229277, -254203, -309374, 10881, -325139, -114048, -107359, 587, 61166, -138017, -12391, -161677, 72177, -33629, 288857, -17632, -289067, 29440, -164804, 48809, 6507, -157417, 21165]
18831a81335j35028A21082d1836A37394f5652K3904a4101A4598a31199A24208
18820c03627A52640h0866n7867d407l28761p1833J12139L5379A89472a9714C1806
18808B02873a81730H2848i8282a2384l19964B09985l0068p1425a12688K5453B88799
18796A46131d02418B73181j19930f276A16820n940O0332A1178a64744j16667B86737
18784a38610O5956j28064k5820A24464J20175J47273B3177J9663g1590B40452
18773G5923l0174J3318E818a96284A02024l1560K1760C4378c06517A18829o872
18762A11957b96473G6224g5424H063G95P6178b0100k91437O2282D1003e5922a0699
18749a29A5247b12349A16248a52643B00211a44540f7176K1755o5904J7366A68123
$$ y = [-181335, -316363, 121082, -41836, 137394, -65652, -41748, -14101, 14598, -131199, 124208, -303627, 152640, -80866, -138733, -4407, -333168, -405001, -292862, -257483, 189472, -19714, 31806, 202873, -181730, 82848, -98282, -12384, -332348, 209985, 179917, 108492, -112688, -87235, 288799, 146131, -402418, 273181, 153251, -6276, 116820, 110880, 171212, 11178, -164744, -281411, 286737, -138610, -72654, -200718, -226538, 124464, 244639, 391912, 23177, 42840, -71590, 240452, 75923, 45749, 59067, 5818, -196284, 102024, 70464, 92224, 34378, -306517, 118829, 111957, -296473, 76224, -75424, 8063, 795, 76973, -20100, -311537, -249255, 41003, -55922, -10699, -129, 15247, -212349, 116248, -152643, 200211, -144540, -67176, -45421, -111325, -93959, 168123]
18737A0936J84802i7555j39680N1871L6929H8081J08623b33441a10126j13256
18727b23382C63197B5883c4872k27439A8042J11992J19709c42439E593J18115
18717A23708D0056J4591J6232a47141L8411j24125a6521F8887a92015j54423B03729
18705h9974j79642a9088q3335b625B63a35170k75102J21642e8497A37886l3014
18694A04872B2712g1873I6937b54627e581j57774a6769j44860B2083b72932c1483
18682g9m214B9717g0282J1808m1630j21442B1069b7929p2618k66100f4397j93621
18670b58018A15454g183r7164n1247g6403B9183c141A36219a39160A80667l1119
18659A49548B1237J2814O2283a870j45025k17594f7344k02212N1062n1101J08872
$$ y = [10936, 195738, -97555, -237235, -185364, -148435, 88081, 196704, -233441, -110126, -223382, 363197, 25883, -34872, -262311, 18042, 130034, 249743, -342439, 5593, 123708, 40056, 54647, 70879, -147141, -108730, -232855, -16521, 68887, -192015, -346438, 203729, -89974, -269616, -19088, -102423, -2625, 263, -135170, -410272, -288630, -58497, 137886, 104872, 22712, -71873, 96937, -254627, -5581, -163355, -16769, -161629, 22083, -272932, -31483, -79, -4293, 29717, -70282, -58474, -100104, -221546, 21069, -27929, -100547, -366647, -64397, -258018, 115454, -7183, -104347, -155594, -76403, 29183, -3141, 136219, -139160, 180667, 149548, 21237, 34051, 96334, -1870, -146895, -364489, -67344, -269556, -218494, -269595, -160723]
18648a60723D4699e8136B02509b21338A25347O7261p0614b86355B98301A19843
18637B43772J60614b37473A40646E2954A3395b32535R2605j2149J5219a166j55993
18626a57159N1863D1156J50185f2894J711C06151H40c36757a10639A63709a6275
18614a55292o8447q0771C9396i6409A41213f1769F6162g17l00232I376b6946E38230
18601c65947A05463b07576C57472a85470A91438i7275b3444j2145G2313a93898
18590a07895C8066Q4699n9004K9109a46870k50899J83581B34672g4106m4261D9625
18578A96661j7988a16314E2951a23127K9982A79873a52635A29850i759A21490
18567A46052J26036G8509h8608n7080K2410q054C7991b6662p9925D9352a14498
$$ y = [-160723, 44699, -58136, 202509, -221338, 125347, 192608, 121994, -286355, 298301, 119843, 243772, 404386, -237473, 140646, 52954, 13395, -232535, -139930, -152079, -136860, -1166, -157159, -105296, 41156, 191341, -62894, -61183, 306151, 840, -336757, -110639, 163709, -16275, -155292, -223739, -304510, 39396, -96409, 141213, -61769, 66162, -717, -300949, 9376, -26946, 538230, -365947, 105463, -207576, 357472, -185470, 191438, -97275, -23444, -35589, 72313, -193898, -107895, 38066, 122765, 63761, 92870, -146870, -397769, -214188, 234672, -74106, -118367, 49625, 196661, 178673, -116314, 52951, -123127, -93145, 179873, -152635, 129850, -9759, 121490, 146052, 272088, 78509, -88608, -145688, -123278, -131332, 37991, -26662, -106587, 49352, -114498]
18555A1450b5448A16015a19878j521A40721D9243J4363O2413d5356m1116J8561
18544f7911j37716P1573C0237e1433A92109i2999F3468a00124c7362k0556F6250
18532h1841A82699c4874m78244J90125B27452b1693k60407a8980m25939e1716
18521c36124J47167C2234P1129a16463A21744a86357l4743d1122F0491K42961
18511C03452b45087A82812f4498b4575a1949A89491K3243I631M5691l225b00751
18499d10990A7843B510g1189b7198I078b22855D08883C7482a8191A5394g5657
18487A5947b86708c8204l08931J70263g02l38436B16548b20352C13175A49109
18476a41262A58175n3395k2322K1857k3853C864b44382E989Q1868a25138N2974
$$ y = [11450, -25448, 116015, -119878, -121399, 140721, 49243, 63606, 126019, -45356, -86472, -67911, -205627, -134054, 30237, -51433, 192109, -92999, 63468, -100124, -37362, -57918, 66250, -81841, 182699, -34874, -513118, -322993, 227452, -21693, -282100, -18980, -444919, -51716, -336124, -188957, 32234, 103363, -116463, 121744, -186357, -221100, -41122, 60491, 303452, -245087, 182812, -64498, -24575, -11949, 189491, 212734, 9631, 55322, 52097, -200751, -410990, 17843, 2510, -71189, -27198, 9078, -222855, 408883, 37482, -18191, 15394, -75657, 15947, -286708, -38204, -347135, -176872, -702, -339138, 216548, -220352, 313175, 149109, -141262, 158175, 104780, 82458, 104315, 80462, 3864, -244382, 5989, 87857, -125138, -72164]
18465g2164A03946M8713K97198k23187h7182j96650A50948g3774q7965A11780
18454I5688J86853b61166a5933B3038b01453B62405L9931c0203j11863m8651e3452
18442c6318A81667J6384r0693a63549c9985q1649D9198K10359a82376I1407d4917
18430C6481c05551i1279A15394a15656q6868A21638d72967d2924F6365a01409
18419A7974M8972a12872m757B9558L24824a38102l7855L1183D9268l86b84667
18407c7693j12205k25296F2602C0032a25535A08664a07655I4548a78239A13042
18396f2219j38725B9048b03067L1953h2080J6190n1468A17786b47411d295A47093
18384a62464p6973j8472g3434A49633c62966G8140a74670M0444a6140A48120G535
$$ y = [-72164, 103946, 152659, 449857, 226670, -87182, -283832, 150948, -73774, -161739, 111780, 95688, 282541, -261166, -15933, 23038, -201453, 262405, 302336, -30203, -142066, -190717, -53452, -36318, 181667, 198051, 107358, -163549, -39985, -121634, 49198, 259557, -182376, 91407, -44917, 36481, -305551, -91279, 115394, -115656, -202524, 121638, -472967, -42924, 66365, -101409, 17974, 66946, -112872, -117629, 29558, 354382, -138102, -175957, -144774, 49268, 48882, -284667, -37693, -149898, -375194, 62602, 30032, -125535, 108664, -107655, 94548, -178239, 113042, -62219, -200944, 29048, -203067, -171114, -82080, -65890, -117358, 117786, -247411, -4295, 147093, -162464, -239437, -257909, -73434, 149633, -362966, 78140, -174670, -134226, -16140, 148120, 7535]
18372c07668b6583C9708c73214J82097A50544a52541D8773K47493j04433h3005
18361e8439J6247C9280b85726B25218a852j848l9471B24285a125j37651M4397
18350i4379p2261O6545o8100e1924A57007A9580a56656j10441G8356B5459B528
18338F9798K3528B3509J36423C2682c1417G0330a83229f3227B23178f4635j03566
18327a68201g8009D3288c8035G7520a12121K3691b4706q0177r1956Q9043p045
18316a14841k24669e8352q3119B75753l6850r4945a47649M7762d0064C22101e38
18304B43298K4800a27490M0436I9682Q9213l2896c3680j48345C87475b20808M8007
18293a72801K5667j84022A55417q360l5592a99061Q9446l1264b9752j98914B92572
$$ y = [-307668, -26583, 39708, -373214, -191117, 150544, -152541, 48773, 296266, 191833, -83005, -58439, -42192, 39280, -285726, 225218, -1852, -3700, -43171, 224285, -1125, -138776, -94379, -166640, -100095, -168195, -51924, 157007, 19580, -156656, -267097, 78356, 25459, 2528, 69798, 93326, 23509, 159932, 32682, -31417, 70330, -183229, -63227, 223178, -64635, -168201, -78009, 43288, -38035, 77520, -112121, -88430, -24706, -104883, -196839, -107796, -114841, -339510, -58352, -141471, 275753, 238903, 143958, -147649, -99887, -40064, 322101, -538, 243298, 268098, -127490, -87054, 99682, 188895, 155999, -33680, -182025, 387475, -220808, -172801, -147134, -331156, 155417, 147057, 111465, -199061, -109615, -140879, -29752, -228666, 292572]
18281b16424A57834o5642B0542a9185A02511B8527b13248B76826b23553f0682
18270f1879B55248a17608A04481a85524j8582K4306R383m3025G0148J22146a71946
18258a69405A48545a80613k0154b6436l24878d4936A32913a13957A04070b67147
18247B96690F408Q9368b50115A35143a5151j12205H6539K7556a90667G8895a29593
18235D0099c74386a33549A5042a44154a6296D3511K9464M2680a29960c1085q4438
18224a15523j12010E3555b16843A49790a25461m4281e0081a2812L669C00354f8175
18212a272n2012j62802A12703a30826e1314k36334D0532b88600J01514O0121H7732
18200a55161E4086a45451j48098a41857M7570L0687j53445m2854d3956C32513
$$ y = [-216424, 157834, 92192, 20542, -19185, 102511, 28527, -213248, 276826, -223553, -60682, -61879, 255248, -117608, 104481, -185524, -204106, -179800, -170417, -213442, 70148, 192294, -171946, -169405, 148545, -180613, -200767, -26436, -351314, -44936, 132913, -113957, 104070, -267147, 296690, 6408, 95776, -250115, 135143, -15151, -127356, 86539, 114095, -190667, 78895, -129593, 40099, -374386, -133549, 15042, -144154, -16296, 43511, 72975, 115655, -129960, -31085, -115523, -227533, 53555, -216843, 149790, -125461, -169742, -50081, -12812, -9143, 300354, -68175, -1272, -53284, -216086, 112703, -130826, -51314, -287648, 40532, -288600, -187086, -126965, 87732, -155161, 54086, -145451, -293549, -141857, -94287, -63600, -217045, -259899, -43956, 332513]
18189b9058r6900B51903b7950H8894J82806F2920b24911L2092A9810Q0190J24371
18178B24371j06604q720a77579Q8656A53355h8466C9284K49073B6355d8177A44323
18166B11762b04054P2792B05761N4176h6195k4641C8729J6649D898a18971B1760
18154A6816a88839A52340c15339A5871R0601K57007a22534j69970D52805a37880
18143H4816i172A69268c97214a54278N3784n6572B80214b30361q173B60141k150
18132B57991h97B0132a27153C1584g4857j09339c9300r3255D8066h683k26681
18121b35364j6804a0684C8220K07902a06710b3756j21824B07363c64298D1289
18110A0411J69056a49011k2744P7339j28135d5146B51674N5503a07525A10248
$$ y = [-29058, -125958, 251903, -27950, 88894, 271700, 62920, -224911, -192819, 19810, 100000, 224371, 117767, 109047, -177579, -88923, 153355, -88466, 39284, 288357, 26355, -48177, 144323, 211762, -204054, -131262, 205761, 259937, -86195, -110836, 38729, 55378, 4898, -118971, 21760, 16816, -188839, 152340, -315339, 15871, 106472, 363479, -122534, -292504, 452805, -137880, 84816, -9172, 169268, -397214, -154278, -100494, -157066, 280214, -230361, -238534, 260141, 257991, -897, 20132, -127153, 31584, -74857, -184196, -39300, -132555, 48066, -8683, -235364, -252168, -10684, 38220, 246122, -106710, -23756, -145580, 207363, -364298, 41289, 10411, 179467, -149011, -171755, -94416, -222551, -45146, 251674, 307177, -107525, 110248]
18099f06198b14586B25415a31566o435B13354b16317E2740e420j96992B65359
18088b23589F1356J18399l471b95324B92254C8075h701k6863D2819a27303A59309
18076a08786m7245J1959B08894j0633J43976r0448g2078o5186a3144D60629a11242
18064I432Q6987c13971B1491J22123D9977a53902E0311k0340h558E5813P4500
18053A30313A8419a23630A27604Q1390a48451A09903M2501n3463K78220r5411
18043B81750L3581j29685f35A15878a11911g923E7305K86454H6182c24017R4629
18032b29388f1378J2368l62006J68405i9140p95A48030a32498G360d721j7215
18021b1936k6094B40896h6711B29490a6575j15443e8218E3614O0787K1026b21415
$$ y = [-606198, -214586, 225415, -131566, -138001, 213354, -216317, 52740, -5420, -202412, 265359, -223589, 61356, 179755, 176284, -295324, 292254, 38075, -8701, -35564, 42819, -127303, 159309, -108786, -156031, -144072, 208894, 198261, 342237, 251789, -72078, -137264, -13144, 460629, -111242, 9432, 96419, -313971, 21491, 143614, 49977, -153902, 50311, 29971, -8558, 55813, 130313, 18419, -123630, 127604, 208994, -148451, 109903, 152404, 98941, 377161, 281750, 315331, 185646, -635, 115878, -111911, -7923, 57305, 343759, 86182, -324017, -229388, -61378, -49010, -411016, -242611, -99140, -99935, 148030, -132498, 7360, -4721, -21936, -48030, 240896, -86711, 229490, -16575, -132018, -58218, 53614, 114401, 135427, -221415]
18009a26273B16949j0353J3817b45716k4658E554a9307j15476M357A4802N9L3211
17997D8072b63061A08439a24080e6308A1055J32643R9718M2612n8130c1647k44370
17986b76017C9098K8118a4642j83951A03239f2502j18204E3168P2836e38344A61482
17974G7563N3023c49161h173A98258d2701B0774K08181H0394A0870J67679i8538
17962A8670b07202H3671A7941p577J47644a75741k38583C86674d33514a01928
17951E2004b73613c9343J8764l15950F5755a3682r6622j25639f7823G6062b8444
17939E9652E375c25006R6247e4867R784B39793b58825E3926M5145M4568J32335
17928B75974l6775j14247J92125b11496H9854J4896h5494A00653b8047C9067b1040
$$ y = [-126273, 216949, 206596, 220413, -245716, -270374, 5554, -19307, -134783, -130426, 14802, 14861, 48072, -263061, 108439, -124080, -56308, 11055, 143698, 243416, 286028, 227898, -31647, -276017, 39098, 67216, -14642, -198593, 103239, -62502, -180706, 53168, 126004, -538344, 161482, 77563, 130586, -349161, -8173, 198258, -42701, 20774, 228955, 80394, 10870, 178549, -98538, 18670, -207202, 83671, 17941, 10364, 158008, -175741, -414324, 386674, -433514, -101928, 52004, -273613, -39343, -20579, -336529, 65755, -13682, -110304, -235943, -67823, 76062, -28444, 59652, 5375, -325006, -228759, -54867, -45083, 239793, -258825, 53926, 99071, 143639, 275974, 239199, 124952, 317077, -211496, 89854, 104750, -85494, 100653, -28047, 39067, -21040]
17916A0545K24355g3692L6637C9636M633G318a20429A79991m7201J52535A981
17904i8747I8202g8648b7329j77268G493g8468B16170f6256A86474H4641c93637
17892A6977O856K40601A31861g9902a542L15B28651n1019A1674N9041K5538l4493
17880F1760M6016i8426I7793C5759J97013q4484a25143G2886J07308P6743j4636
17869B42301a62727e9558j01288I1912k6483a9287B12070J61992b2994j23056
17859a46050B01374G504c26385A12755a73736M5394A82249l296e7077A70670J0023
17848A80693b42797p5751l5423B90737a09387L1266C7793O1613J10696P711M6263
17837B64076J01671A54972o8066a40797M769A63932i243C04832c3521F8972e606
$$ y = [10545, 234900, -73692, -37055, 39636, 44269, 7318, -120429, 179991, 132790, 285325, 1981, -98747, 98202, -78648, -27329, -204597, 7493, -78468, 216170, -66256, 186474, 84641, -393637, 16977, 23833, 264434, 131861, -79902, -1542, -1227, 228651, 177632, 11674, 70715, 96253, 61760, 107776, -98426, 97793, 35759, 232772, 148288, -125143, 72886, 180194, 256937, 242301, -162727, -59558, -160846, 91912, 65429, -19287, 212070, 374062, -22994, -146050, 201374, 7504, -326385, 112755, -173736, -128342, 182249, 178953, -57077, 170670, 180693, -242797, -318548, -353971, 290737, -109387, -78121, 37793, 99406, 210102, 217813, 264076, 365747, 154972, 86906, -140797, -136028, 163932, -9243, 304832, -33521, 68972, -5606]
17825i6486C20221a38881M4775L8820B18146L56355q7413H3830J09758n2829M243
17814A45002m4343f0338E685a17150C39385C3664J11028A1039K69164A7561a04882
17802A70858q3050J14273r4229b35133k165i2807r4533A98192a23026c7915B05491
17790b26072E2953a01182o305C33979H2171a2151A48620m0288a15124I125J22722
17779A31847A3793K31748a35589C23676a94196i0214B86273a48816A63061k0773
17769A42288m433d5176B90306n3026A0100R7379c4459D3507a62857g9552B2781
17757c10256A85825G2179J2224C0252K0585b13217d0629J3393A66942a30740A53932
17745C7512a40570C44829j14407a61601A80084a41314A87992f4078F04641D007
$$ y = [-96486, 320221, -138881, -94106, -55286, 218146, 574501, 487088, 83830, 193588, 140759, 145002, 100659, -60338, 5685, -117150, 339385, 33664, 144692, 11039, 280203, 17561, -104882, 170858, 87808, 202081, 107852, -235133, -237298, -92807, -187340, 198192, -123026, -37915, 205491, -226072, 52953, -101182, -107487, 333979, 82171, -12151, 148620, 108332, -115124, 9125, 131847, 13793, 245541, -135589, 323676, -194196, -90214, 286273, -148816, 163061, 142288, 137855, -45176, 290306, 237280, 10100, 107479, -34459, 43507, -162857, -79552, 22781, -310256, 185825, 72179, 84403, 30252, 50837, -213217, -40629, -27236, 166942, -130740, 153932, 37512, -140570, 344829, 230422, -161601, 180084, -141314, 187992, -64078, 604641, 4007]
17734A10286a30070A58465J22439o6623f1052r5580a2614C38972E3195L11611
17724C64806j21191r5752a49186J1862a6465p6644F1785K95657C3054J56381D9156
17712A19877a19008k16843d152m2053A40209A8305b76403A83621R1935j8247A05047
17700c0450B51165a2492B38942c4980h286H1568L8805K06031b26693B36064q5717
17689A50347C2565b47258k3816d2267l5340A3248B584J56031l1408b4350A39589
17677b55189A7927g4891F5838J239J17390c1129D0326a28717k8747D5391R6133
17666A41524J31051K9123b04191A95921a19550C8849b80891A98480H0907a17465
17655H0743a17668C32324n8618D123J70869a7205j1749A36564h6386A23157B6163
$$ y = [110286, -130070, 158465, 280904, 214281, -61052, -156632, -12614, 338972, 53195, 364806, 243615, 147863, -149186, -137324, -16465, -93109, 61785, 357442, 33054, 189435, 49156, 119877, -119008, -335851, -4152, -46205, 140209, 18305, -276403, 183621, 275556, 257309, 105047, -30450, 251165, -12492, 238942, -34980, -8286, 81568, 120373, 326404, -226693, 236064, 150347, 32565, -247258, -271074, -42267, -77607, 13248, 2584, 158615, 127207, -24350, 139589, -255189, 17927, -74891, 65838, 67077, 184467, -31129, 40326, -128717, -157464, 45391, 141524, 272575, 301698, -204191, 195921, -119550, 38849, -280891, 198480, 80907, -117465, 80743, -117668, 332324, 273706, 4123, 174992, -17205, -28954, 136564, -86386, 123157, 26163]
17643A25423f157B1344e8098H3380K45214a92141E2980J56773c0777B73612h1637
17631B22222C2768J26980J6197D6008a64999A22597Q6141C272N753a26832j20268
17620b47100N8429A36149Q998a91110C97715i2523A04532D1198c4580A23294a32517
17608G2620N450K62308P1681A55408J808a0853C19522b72193E1915J22111L17730
17597D91756G4137K410c876B6590Q1946d538A80871J24026A343g9550L5902j1293
17585e4941A69584N3356b0802B88725J35386L7256C9916J69700p245l4703J10672
17574B78340j11539n5895K53437m361A73701P12L9892K7195N7660k9084O5407
17563C35483o7481B9958c72217B32616Q3319M5124A36708Q793J8477J66672d3705
$$ y = [125423, -6157, 21344, -58098, 83380, 328594, -192141, 52980, 209753, -30777, 273612, -81637, 222222, 32768, 159748, 175945, 46008, -164999, 122597, 208738, 3272, 9025, -126832, -247100, -188671, 136149, 145147, -191110, 397715, -92523, 104532, 41198, -34580, 123294, -132517, 72620, 78070, 340378, 412059, 155408, 157216, -10853, 319522, -272193, 51915, 174026, 491756, 74137, 76547, -3876, 26590, 108536, -4538, 180871, 304897, 1343, -79550, -43648, -54941, 169584, 222940, -20802, 288725, 424111, 461367, 39916, 209616, 202371, 167668, 278340, 166801, 110906, 364343, 359982, 173701, 174413, 214305, 241500, 299160, 270076, 335483, 268002, 29958, -372217, 232616, 315935, 361059, 136708, 145501, 163978, 330650, -43705]
17551E9287J97628g6588B90243B8668M0939A8312J03916M7838a1526C00745j40398
17540A60347b39030C44320A19268R6163R311E4648P8569B5289K72308M7283j16990
17529B27890R3547j18629O4309e7708B20215k8073M0632o8997J63913N954j7314
17518C16330J00801J8915A73722D321K01522K91878l1010L93085k21307L25552
17508I64041N4230l56565J74566j34126m3818j79152j36593R7735l3977J70715
17498E77056j83482K1964M057M6361K95841Q8359k72989K19964l81871o968A26463
17486C61970r789k9833o396J47768k1896j50345A07649A0167M60815r9730K42542
17475F13794B57570j01334M8521O3764o2668l4197K25996b1370D32538j76159
$$ y = [59287, 256915, -76588, 290243, 28668, 69607, 18312, 122228, 170066, -11526, 300745, 160347, -239030, 344320, 119268, 215431, 224742, 54648, 133217, 25289, 297597, 344880, 227890, 321437, 202808, 267117, -57708, 220215, 192142, 232774, 163777, 327690, 333644, 316330, 417131, 436046, 173722, 4321, 205843, 497721, 466711, 859796, 638489, 964041, 1018271, 661706, 836272, 702146, 658328, 479176, 342583, 440318, 406341, 577056, 393574, 415538, 419595, 465956, 761797, 850156, 577167, 797131, 415260, 408292, 126463, 361970, 352181, 322348, 315952, 463720, 441824, 291479, 107649, 10167, 470982, 371252, 613794, 257570, 156236, 204757, 268521, 205853, 171656, 397652, -21370, 432538, 256379]
17465B56379P9431m6106b1694A63913J77539A67094n9741M01214B33858m4493
17455A89365K67160B17753R0306m0051A16114K3409a45E76858A11884Q5712n2075
17444A45521J88819O2646A73884K44285A07872a5318D67575M5512b7382B15215
17433A15841P2640L35520k2266D5539J69465Q476P1831J40257k16946J53340K19199
17422E91161k61593N2359N2173m6770K5949j17574K04409B40961K71268q6999
17412D25230A87154q7156K60871A77703H5414M87786A59659L32450k09346J4591
17402B97354J82836A10947P7195J99254J42041k28865j5931J7559J06932p4315
17392C34817J50534I7716J28400k7607o0802J72968A17226B458L98627A31682
$$ y = [256379, 335810, 289704, -21694, 163913, 341452, 167094, 107353, 508567, 233858, 189365, 456525, 217753, 308059, 268008, 116114, 139523, -145, 576858, 111884, 197596, 145521, 334340, 396986, 173884, 418169, 107872, -15318, 467575, 513087, -27382, 215215, 115841, 188481, 524001, 501735, 45539, 215004, 223480, 295311, 435568, 218622, 371962, 591161, 329568, 381927, 434100, 387330, 413279, 295705, 500114, 240961, 512229, 425230, 187154, 99998, 360869, 177703, 85414, 573200, 159659, 492109, 282763, 297354, 480190, 110947, 188142, 387396, 529437, 300572, 284641, 302200, 409132, 334817, 485351, 97716, 226116, 198509, 137707, 310675, 117226, 2458, 401085, 131682]
17381A03241Q8286J46373A38186J47405O9425J56127k54335i0828B44025o1137
17371A82888L12888J01514C8001N50265A27880M3296J53484j08775J81315j87811
17361B09389L92667E334M67203k07291J4184l1403o7932c0278o086J3728B27179
17349B92410j36483p0650J01439M9677J06258j34104D1842L30550r3858Q6946
17339C65480n798j38056A2210L59188P7852j16480K0713C1315L11427j54363M94779
17328F83158A23050M9749R7595L9329o9226d5177b0337B21463G5081L94764A97399
17316B38024J3264d438A49335J79839j36620G8759N2476K0555k8419N5029H1002
17304A10209L31035j37065L395j23880j1444F3235J28220j3130L9235j05576m9366
$$ y = [103241, 191527, 337900, 138186, 285591, 355016, 511143, 256808, -90828, 244025, 182888, 495776, 597290, 38001, 588266, 127880, 171176, 324660, 215885, 397200, 209389, 602056, 5334, 472537, 265246, 279430, 248027, 180095, -30278, -36364, -22636, 227179, 292410, 155927, 85277, 186716, 236393, 342651, 208547, 41842, 372392, 278534, 365480, 359682, 221626, 12210, 371398, 449250, 332770, 353483, 31315, 342742, 188379, 683158, 123050, 172799, 270394, 309723, 240497, -45177, -20337, 221463, 75081, 469845, 197399, 238024, 251288, -4438, 149335, 329174, 192554, 78759, 131235, 151790, 123371, 178400, 81002, 110209, 441244, 304179, 307574, 183694, 172250, 63235, 191455, 178325, 217560, 111984, 62618]
17293F2618L71001a84252G21517B27666M3598L68950B68936J59362A44942J94295
17283C39237G0402M78085B63807K6791Q7838C7301M00433j75322N05185C43109
17272G0003a04031p020A59315K46006Q6312b9710A41068J69529k4256J43458j67812
17261B61987N0358j16800F1630j7406M44782j12150M8782l0478q4696K05058B22985
17249A05952J37091J47209r2526n5888J26145j6326p2851F0712O58663k12176
17239E07199l5995J17599k4677J5618A2886K27850a02829E89714j2292B80418
17228D50396A52212M9665M83522l38939K61637k20045j80456J716q5203L34224
17218D58333j70829L23834j54403j75730N3285J64902B27606K80489A63381L95703
$$ y = [62618, 433619, -184252, 721517, 227666, 271264, 640214, 268936, 428298, 144942, 339237, 70402, 548487, 263807, 290598, 378436, 37301, 437734, 262412, 767597, 343109, 70003, -104031, -111051, 159315, 405321, 491633, -29710, 141068, 310597, 286341, 429799, 261987, 312345, 195545, 61630, 44224, 489006, 376856, 425638, 395160, 310464, 515522, 222985, 105952, 243043, 390252, 297726, 241838, 367983, 351657, 278806, 60712, 719375, 507199, 471204, 588803, 564126, 579744, 12886, 240736, -102829, 589714, 577422, 280418, 450396, 152212, 201877, 685399, 346460, 608097, 388052, 207596, 209312, 124109, 458333, 287504, 611338, 456935, 281205, 334490, 499392, 227606, 508095, 163381, 559084]
17208E59084k59979L19016B54191J77939B14540J61426m5644k3914N2985j71023
17198A88370K6266J36082H3793J45217K12132P1201M502j22834L1679j45565L44461
17187F24586k09290J83118j56879B17612L66315a28874C61833H9136K17966J10212
17177D17314A95850K98365F6248N11357r7101j01965j71393L07734K90533k73023
17167E32390B36075J44612A60553P8554N38051C47842L4251j18182o5503J57274
17157C55682L00721J018l17644N2179J15507J94886k48309K5208k1822I2670K17778
17146C10448J70160L615L78402C39675J87233A20150N05557j74476K18833r6986
17136E73078j48015J62421j33946C5973M01097O3679K26756j22872j65079k05767
$$ y = [559084, 299105, 618121, 254191, 432130, 214540, 375966, 330322, 306408, 359393, 188370, 214636, 350718, 83793, 229010, 441142, 512343, 516845, 394011, 425690, 280125, 624586, 415296, 598414, 441535, 217612, 583927, -128874, 361833, 89136, 307102, 417314, 195850, 494215, 66248, 577605, 480504, 378539, 207146, 514880, 805413, 532390, 236075, 380687, 160553, 239107, 777158, 347842, 382093, 263911, 198408, 355682, 656403, 657421, 339777, 391956, 507463, 702349, 454040, 479248, 457426, 92670, 310448, 480608, 484223, 862625, 339675, 526908, 120150, 625707, 451231, 670064, 573078, 425063, 587484, 453538, 35973, 437070, 500749, 727505, 604633, 439554, 233787]
17126B33787Q9552J85946K0086P0263J08934B24266L52152N5830O2435j52801
17116E41882k20730P6939K48449O9794O6086l05302P3871M9058l3225o0093o7504
17105D39225L03245k24797L52670C79126Q5920J76469q3439J52482j09772p8865
17095E21921K00259k88764k0679O8682O2800N32546E24763J55497J13801C11949
17084G19949J50647J12627k00434B87871Q0510L35575j90477K82699B66937J63210
17074D30147L35563m8918J45251l59071K10991j26391j50778N57377m41529j01661
17064D50981J32234m5481N46196m66255L71259k44639n6873j65502J10430L6817
17054F69167l2240P1879j47575j4266J66418m6713K29944D43151Q6853L14891
$$ y = [233787, 323339, 509285, 529371, 599634, 708568, 224266, 576418, 632248, 694683, 541882, 321152, 398091, 646540, 716334, 782420, 477118, 550989, 600047, 566822, 506729, 439225, 742470, 517673, 870343, 379126, 465046, 641515, 558076, 710558, 600786, 521921, 722180, 433416, 412737, 481419, 544219, 1076765, 524763, 680260, 794061, 311949, 719949, 870596, 983223, 782789, 287871, 368381, 703956, 513479, 796178, 266937, 430147, 765710, 716792, 862043, 502972, 713963, 587572, 436794, 994171, 552642, 450981, 583215, 537734, 1083930, 617675, 988934, 744295, 687422, 521920, 632350, 669167, 636927, 708806, 561231, 546965, 713383, 666670, 896614, 443151, 530004, 844895]
17044H44895j24640K67457k62123P6821R1454J58340k87949j02250M04548j86189
17034H80364O9627l06282M00076l90896M1269J70445p7513l92098O23510k87923
17024G30579J37453k94857J19635J89758j09803n5897J44564Q1885k1573l36540
17014E85204J33510m423k5540M6889K38004m5007j04490K03075J41663m06080
17004G62805K07218L1425K86725k74423P4280J51095J6225k26190K00644j11566
16994A118238J4905J77586j74346L9132j99420L34415l20996n1351J990q9615
16984H50538K80041J856K05022j02974k73666K17395k4131m3992L05971n40438
16974H75622L44698J3725j78809J53938K40245n25001M06175J90369l59986J87974
$$ y = [844895, 720255, 987712, 725589, 802410, 893864, 1052204, 764255, 662005, 1066553, 880364, 949991, 643709, 1043785, 652889, 694158, 864603, 787090, 394992, 1018502, 730579, 868032, 573175, 692810, 882568, 772765, 716868, 861432, 943317, 921744, 585204, 718714, 714291, 688751, 735640, 973644, 928637, 824147, 1027222, 1168885, 762805, 970023, 1001448, 1288173, 1013750, 1088030, 1239125, 1255350, 1029160, 1229804, 1118238, 1133143, 1310729, 1136383, 1175515, 976095, 1310510, 989514, 938163, 940153, 850538, 1130579, 1132435, 1337457, 1234483, 960817, 1178212, 1154081, 1110089, 1416060, 875622, 1220320, 1234045, 1055236, 1209174, 1449419, 924418, 1330593, 1520962, 1160976, 1348950]
16964A348950j92959N4350L25365o08017L77622k38117P0510J30766L27489k51040
16954A344919K6805K75324m22382J76614L82968m26226l5526J83673m017l00535
16944A201617M97258k99252J72631o7692J37136n5070L9980k11033J84903N3738
16934A654216K14132l21144k07368L20861o5466L568q4186J53756L0382q8523
16924A610228L84745k96989K09343j09088k20956M21280n3324R6882r1425K03288
16914B153984K17761m18958j26846K67274L29447l72506J32885L0613R043n1708
16904B170989r3410J89212L5171j25542M8573j12443K1611J14008K5077M40010
16894B713256j97027l97955K49169K07614n2156J65941p8489j28441l2992m4904
$$ y = [1348950, 1155991, 1210341, 1535706, 927689, 1305311, 1067194, 1137704, 1268470, 1595959, 1344919, 1371724, 1647048, 1224666, 1401280, 1784248, 1358022, 1322496, 1506169, 1502152, 1201617, 1698875, 1399623, 1572254, 1504562, 1641698, 1586628, 1626608, 1415575, 1600478, 1654216, 1868348, 1547204, 1339836, 1660697, 1595231, 1598799, 1514613, 1668369, 1698751, 1610228, 1994973, 1697984, 1907327, 1798239, 1577283, 1998563, 1945239, 2042121, 1950696, 2153984, 2371745, 1952787, 1825941, 2093215, 2422662, 2050156, 2183041, 2213654, 2222697, 2170989, 2077579, 2266791, 2301962, 2176420, 2224993, 2112550, 2134161, 2248169, 2273246, 2713256, 2516229, 2118274, 2367443, 2575057, 2522901, 2688842, 2610353, 2481912, 2448920, 2404016]
16884B404016M61463o04419K81366R4802j09079M09564j96518J87064J3865j80632
16874B761492J0075J15858J68402j22808K51184k3050k20267L38991L01511k39665
16864C341723J3506J01235j00785J22982o6434O7204O9521k0696J07106L87318
16854D022680j32233j93703O9901K82617k5888j89076M56300j17545j05873q3072
16844C984108M11798k64611K04719K69426j57060K65654k52902j3614J78601j10460
16834D515659L80266K03945N25659m43213J46833N95245l62474j56349K87351
16825E692922j42295O56683m63430M77989l31249J16983k2755M63286P5874K50294
16815F774302j73223J94609k65303N79488L50355j84693J97693n9884O11036Q0723
$$ y = [2404016, 2865479, 2261060, 2542426, 2637228, 2528149, 2937713, 2741195, 2928259, 2942124, 2761492, 2771567, 2887425, 3055827, 2933019, 3184203, 3161153, 2940886, 3279877, 3581388, 3341723, 3355229, 3456464, 3355679, 3478661, 3412227, 3479431, 3548952, 3528256, 3635362, 4022680, 3890447, 3696744, 3766645, 4049262, 4023374, 3834298, 4290598, 4173053, 4067180, 3984108, 4395906, 4131295, 4336014, 4605440, 4448380, 4714034, 4461132, 4447518, 4626119, 4515659, 4895925, 5099870, 5625529, 5182316, 5329149, 5924394, 5561920, 5405571, 5692922, 5550627, 6207310, 5743880, 6221869, 5890620, 6007603, 5984848, 6448134, 6524008, 6774302, 6601079, 6795688, 6530385, 7109873, 7460228, 7275535, 7473228, 7413344, 8024380, 8105103]
16805H105103j00777J32569K69083M94L29490L04977M4327J33674J08869P6095
16795I403904L44189O92340j86418K33894J61237K51255K79864L65775O7132O64806
16785A2277978j44990N89976J15315J75168M16152M62984N00657j19010P83450
16776A5057680q5176O54781J44335P13712L17404K02906Q53077K44759L35445
16767A8438923R04204M79878M72450P80129M93488Q55560Q68408K77859J005544
16758B4576443O26926R31009O22103Q39339R79598J036881J037368Q07793J155519
16749C2612979J320064R54855J206978J673619J354217J386466J749792J626550
16741D3885520J609256J623559J732744J991068K350697K093420K129354K218292
$$ y = [8105103, 8004326, 8136895, 8405978, 8406472, 8735962, 9040939, 9085266, 9218940, 9327809, 9403904, 9748093, 10440433, 10254015, 10487909, 10649146, 10900401, 11180265, 11546040, 11613172, 12277978, 12132988, 12722964, 12838279, 13013447, 13429599, 13892583, 14393240, 14274230, 15057680, 14972504, 15627285, 15771620, 16485332, 16802736, 17005642, 17858719, 18103478, 18438923, 19343127, 19823005, 20295455, 21075584, 21569072, 22424632, 23293040, 23570899, 24576443, 25203369, 26134378, 26756481, 27595820, 28575418, 29612299, 30649667, 31457460, 32612979, 33933043, 34887898, 36094876, 37768495, 39122712, 40509178, 42258970, 43885520, 45494776, 47118335, 48851079, 50842147, 53192844, 55286264, 57415618, 59633910]
16733E9633910K447476K581899K767928K469572K951832L074011L200387K974316
16725H2101331L708140L060488L563479L425046L503732L381454L426845L692895
16717A09863410L282077L189476L217154L100203K947031K354574K505489J757691
16709A32217105J588329J506588M45849P65932o0909r5269j075835j279523j373966
16700A32638301j853992k539659k776547k589398l054521l161039l415669l422452
16692A09825024l150257l727861l515855l617431l736983l449274l294537l019970
16684H2312856l317037l558966k789665l152180k393155k783829k647302k458355
16676E9212367k644684j825917k251388k351294j629490j938278j812836j832999
$$ y = [59633910, 62081386, 64663285, 67431213, 69900785, 72852617, 75926628, 79127015, 82101331, 85809471, 88869959, 92433438, 95858484, 99362216, 102743670, 106170515, 109863410, 113145487, 116334963, 119552117, 122652320, 125599351, 127953925, 130459414, 132217105, 133805434, 135312022, 135757871, 136523803, 136462894, 136367625, 135291790, 134012267, 132638301, 130784309, 128244650, 125468103, 122878705, 119824184, 116663145, 113247476, 109825024, 106674767, 102946906, 99431051, 95813620, 92076637, 88627363, 85332826, 82312856, 78995819, 75436853, 72647188, 69495008, 67101853, 64318024, 61670722, 59212367, 56567683, 54741766, 52490378, 50139084, 48509594, 46571316, 44758480, 42925481]
16668D2925481j338735j742706j763664r39757j466394j152761j460480j243214
16660C1817770j022988j078717r15287j180387o70103r22712q73589q01298p42742
16651B3609947o90231p33967j009433l52394p45258m58040l36954r52015j60061
16642A8171594q14385k86588m72535k75402q05425j30614m50602m09855m60765
16633A4065423k85002n80021k04298r1273n20345k98574k98293n33684k20633
16624A1033300K04273l95245o9678m52960k04628m57158L2682m22717J7012o3644
16614I221237j65183k76716j4463r91643O20520m77207K21270p82025K29508k3529
16604G561769l04870k34548j24305N1987k46573o3893K7982k54634o7041l02655
$$ y = [42925481, 41586746, 39844040, 38080376, 37140619, 35674225, 34521464, 33060984, 31817770, 30794782, 29716065, 28800778, 27620391, 26950288, 26027576, 25153987, 24352689, 23609947, 22919716, 22185749, 21176316, 20823922, 20078664, 19620624, 19283670, 18331655, 18171594, 17357209, 17070621, 16598086, 16322684, 15517259, 15386645, 14936043, 14526188, 14065423, 13780421, 13200400, 12996102, 12904829, 12384484, 12085910, 11787617, 11253933, 11033300, 11237573, 10842328, 10772650, 10319690, 10115062, 9657904, 9690586, 9267869, 9284881, 9221237, 9056054, 8779338, 8764875, 7773232, 8393752, 7916545, 8137815, 7355790, 7585298, 7561769, 7256899, 7022351, 6898046, 6950033, 6703460, 6639567, 6667549, 6412915, 6345874, 6043219]
16594F043219Q5391K403l54933L27408n41088o5675o8953j30644Q4626J22204
16584E503958n25260q3861P8589N8228k64646J29345m7799k10766J8075j67047
16574D488816K32434l69444k322l30979k23710K08923K6159l47653K19118J07044
16564D008386l05003j12555j158L27255j26335l93758k24551J83182M27111n5220
16554C727354m52565J00589j4209m58507K66636J56497j74285l1466j33558m755
16544B981731n34248M15848P1583n1513O714Q1523j99407j7336j93531M20710
16534B982074m39106K6303J85346l14956P9396N4659r7096q3589o6802J11480
16524B437709j58361n6557Q0927j01569n5929k26261M95932j21067m58212L68222
$$ y = [6043219, 6128610, 6131013, 5776080, 6103488, 5562400, 5496725, 5427772, 5297128, 5381754, 5503958, 4978698, 4894837, 4973426, 5031654, 4767008, 4896353, 4848554, 4637788, 4655863, 4488816, 4721250, 4351806, 4349484, 4018505, 3794795, 4003718, 4029877, 3682224, 3901342, 4008386, 3703383, 3590828, 3589670, 3916925, 3790590, 3396832, 3172281, 3355463, 3782574, 3727354, 3274789, 3375378, 3361169, 2902662, 3169298, 3325795, 3151510, 3120044, 2986486, 2981731, 2447483, 2863331, 2934914, 2883401, 2890115, 2971638, 2772231, 2754895, 2561364, 2982074, 2542968, 2569271, 2754617, 2439661, 2519057, 2573716, 2476620, 2393031, 2326229, 2437709, 2279348, 2222791, 2303718, 2202149, 2146220, 1919959, 2415891, 2294824, 1836612, 2204834]
16514B204834j22729Q0095o0499k24768j08825K27125r3077J27118J8790P367
16504B055431j8866o0204l60525O08562n04002j07361K37478J03771k95977j10340
16494A547967J63008P9287l31070J97290o3375m5520j23801L42570r2695k0179
16484A653482j07994m7490n9214K4509j70902J35029J97489l6653l34663K37107
16474A490700m51136O98144l65432K46850m20846l5718K0137K92637j84939J09379
16464A399776m53526M69733l083j76339L9705K31795m55919j8729M90044n16333
16454A007124N37026l01682R7976l39423L22767l57059K93793k2284j27039M8132
16444A159331R0006r2069K10201l03221n4125K86102n36452J94378K08205r1445
$$ y = [2204834, 2082105, 2162200, 2101701, 1876933, 1768108, 1995233, 1902156, 2029274, 2048064, 2055431, 2036565, 1976361, 1615836, 2224398, 1720396, 1613035, 1850513, 1954284, 1658307, 1547967, 1710975, 1790262, 1459192, 1656482, 1593107, 1547587, 1423786, 1766356, 1673661, 1653482, 1545488, 1497998, 1438784, 1463293, 1292391, 1427420, 1624909, 1588256, 1253593, 1490700, 1039564, 1737708, 1372276, 1619126, 1198280, 1162562, 1182699, 1475336, 1290397, 1399776, 946250, 1415983, 1412900, 1236561, 1276266, 1508061, 1052142, 1033413, 1523457, 1007124, 1544150, 1242468, 1340444, 1001021, 1323788, 966729, 1260522, 1238238, 1111199, 1159331, 1249337, 1157268, 1367469, 1064248, 1010123, 1296225, 759773, 954151, 1162356, 1070911]
16434A070911k1506k36721L16467J31605k91325L40113k73613q0811J25552k31776
16424H48896J83517J07933p8951K3091P6289m13678J32040K54883j40551m4853
16414I48616k162L2241k42320K80270j97067J61627J23070j07939L066j93357
16404H06045K11022k11799k05392L39849j57686O8235J33203D77065L00893K05299
16394I83257j883N513R7571j19756k90780O1666K60265D55247K80977n1637M40071
16383A124658k50435j35864P4520J07728l65666P544K34743J49265m6084L0827
16373I31236O5420k90033o4969L58451l13642J55798j05934q3393L5555l13175
16363C75314L57219k4719j16187K38423j89824k17779J63817n8472R8797l2604
$$ y = [1070911, 1049405, 812684, 1129151, 1260756, 969431, 1309544, 1035931, 955120, 1080672, 848896, 1032413, 1140346, 1061395, 1084486, 1160775, 747097, 879137, 1134020, 993469, 948616, 946454, 978695, 736375, 1016645, 819578, 981205, 1104275, 996336, 999402, 806045, 1017067, 805268, 599876, 939725, 782039, 850274, 983477, 477065, 777958, 983257, 981374, 986887, 1084458, 964702, 673922, 735588, 995853, 455247, 736224, 684587, 1124658, 874223, 738359, 812879, 920607, 554941, 562485, 797228, 946493, 900409, 931236, 996656, 706623, 641654, 1000105, 686463, 842261, 736327, 652934, 688489, 375314, 732533, 707814, 591627, 830050, 640226, 422447, 586264, 527792, 626589, 593985]
16353E93985K75100k52255J53746l75469J95759j72047J21175k06068J22072r298
16343D46700M2748L05841C16271P5849M8053J836j6668K27263n7907k2883n0805
16332E21009L51723k77971j86209K12412P6766k35492K01573l12945j01406J4089
16322B63549L95419k47613j59657K8060q3290K57726K25953j93582J65389K48367
16312I00321m39177m887K35660j11541B32576M5033J31368N3847k05700J40223
16302C97347J20742j25904K99266k85117k8545K90435j96326j25110K4402K47592
16292F18782n9436p4192A38963K96023j54248J85905E7744O08705j79871R4204
16282E80782r4877K6122J89593B69437L14075H8630K40524e113D13660J10998
$$ y = [593985, 869085, 616830, 770576, 395107, 590866, 418819, 539994, 333926, 455998, 446700, 489448, 795289, 316271, 392120, 440173, 442009, 425341, 652604, 594697, 571814, 521009, 872732, 594761, 408552, 620964, 697730, 462238, 663811, 350866, 249460, 263549, 658968, 411355, 251698, 279758, 196468, 454194, 680147, 486565, 651954, 900321, 461144, 456257, 691917, 580376, 232576, 277609, 408977, 462824, 257124, 397347, 518089, 392185, 691451, 406334, 377789, 668224, 471898, 346788, 371190, 618782, 559346, 485154, 138963, 434986, 280738, 466643, 57744, 666449, 486578, 580782, 485905, 512027, 701620, 269437, 583512, 88630, 329154, -5113, 413660, 524658]
16272E24658L6914B56011O6579L5495J08438J7895M0673B52671H2042K61501j32543
16261B11000K44485K9734B16831J11124j36806G8951L33824O3440j41991L03038
16251F37262B99184J6672K3594J40659j81928n1705O5008j9010N6935A10505K52921
16240C63426j5419N4352J21589B34595K68600J64890B87859K33162j66264O5316
16230D20073j60370e6153D51036K4848A46353J17693J97443J14387A23850M05331
16220E29181k56182J25819J64143j57522j18425H4441L01340j42166K64796F4229
16209B88792j1824p0489J6028j8763J16673j48445J09661J35177L3342B9367K84180
16198C13547R0066j24360K32612n5795r2593j43609J21867A49149O8732K49953
$$ y = [524658, 561572, 256011, 322590, 358085, 466523, 484418, 525091, 252671, 82042, 343543, 211000, 455485, 485219, 216831, 327955, 191149, 78951, 412775, 476215, 334224, 637262, 299184, 315856, 339450, 480109, 298181, 246476, 311484, 292474, 349409, 110505, 363426, 348007, 402359, 523948, 234595, 503195, 668085, 287859, 521021, 354757, 420073, 259703, -56153, 451036, 475884, 146353, 264046, 461489, 575876, 123850, 529181, 272999, 398818, 562961, 405439, 287014, 84441, 385781, 243615, 508411, 64229, 288792, 276968, 206479, 222507, 203744, 320417, 171972, 281633, 416810, 450152, 29367, 313547, 403613, 279253, 511865, 456070, 363477, 219868, 341735, 149149, 217881, 467834]
16188D67834K3687L9329A34671J10507L4804R6702C581M06092p4933a300D62130
16176a6794B06289a21870B37210D1897Q4040m1504J13818H1084K7529l0460R1984
16165A70137N8738r8416O4200J05981r2301j3524b12440b7663B01427I1455o19
16154I0836J0936J89702I0743K07406K18637H1354K0947b39971A27581E1415M56663
16143E08078H6487J23097r2636K05496N2962E437a07174A15499j3159g5012j07697
16132a82709A64184K63280j02764N3304C8050J6465K34436f6319b791j42459d43
16120D36515F2160J28396l1595P0602H2424J33266r3996b5572C2738M40879A98744
16108c04909A06134e5444j7074K7973A65581D0994Q8100J59518b39877A29931
$$ y = [467834, 491521, 530850, 134671, 245178, 279982, 376684, 3581, 409673, 334740, -1300, 462130, -16794, 206289, -121870, 237210, 41897, 125937, 84433, 198251, 81084, 108613, 78153, 170137, 228875, 130459, 194659, 300640, 208339, 194815, -212440, -27663, 201427, 91455, 90836, 101772, 291474, 90743, 298149, 516786, 81354, 102301, -239971, 127581, 51415, 508078, 86487, 209584, 116948, 322444, 375406, 5437, -107174, 115499, 102340, -75012, -182709, 164184, 427464, 324700, 378004, 38050, 54515, 288951, -66319, -2791, -145250, -443, 436515, 62160, 190556, 158961, 229563, 82424, 215690, 121694, -25572, 32738, 473617, 198744, -304909, 106134, -55444, -72518, -44545, 165581, 40994, 129094, 288612, -239877, 129931]
16097B50638k8440o81K9335H7594P9795J1120B867K23951j11038d7464C16628
16085C05202C3903K06749Q2103j54094b6157C42729a18776B77855a787A66908
16074C6134b49507D88574A32236j7779l2034a1145D54605A62812e4605l2096c3449
16062D19863a94981P604K5021F9450G832N684K14177r3605J40498a76933a1020
16050A77736m9705J46350A28233j168j9632a66226f9392B69182b39172N0199A35584
16038E7256a5164C08380C2421M7936J33782a84739d5231j4141A33077e7749D3779
16026A85313k3069J71968A44179P9655A06256A5260a48293P062I4270j9461J64582
16015B39391H2905a45776B5114c88422a41788j64366A20907D464J73910c20593
$$ y = [250638, 222198, 221517, 250852, 87594, 167389, 178509, 2867, 226818, 115780, -47464, 316628, 305202, 33903, 240652, 322755, 168661, -26157, 342729, -118776, 277855, -1787, 166908, 36134, -249507, 488574, 132236, 114457, 82423, -11145, 454605, 162812, -54605, -86701, -33449, 419863, -194981, -187377, -162356, 69450, 7832, 13516, 227693, 134088, 274586, -176933, -11020, 177736, 128031, 274381, 128233, 127065, 107433, -166226, -69392, 269182, -239172, -188973, 135584, 57256, -15164, 308380, 32421, 80357, 214139, -184739, -45231, -59372, 133077, -57749, 43779, 185313, 162244, 334212, 144179, 223834, 106256, 15260, -148293, -141231, 94270, 74809, 239391, 82905, -145776, 25114, -388422, -141788, -306154, 120907, 4464, 178374, -320593]
16004E0100G142i5091G5004d4648A40714K08461a75314B37182G3651A657J71097
15993A72754H4156a0641j18212L6330j01815j57279D12333g0864C48912a73814
15982A70082D5242J80792b74559B50027L61264G9979M0663J55521j04478N21496
15972F93181J57034q2125K59043l05780L3125L04369C87105j87577m6935f4262
15961c5738A37594O7932F027N4351A0966d1021q935n923l7062B8708D882a3598
15948C9772g4169A11866B0201M7597K94732G9080a67154B11624c11209j61028
15938d72237A3950a22645j49658e424r4305c3082j75373O6035C31353A30017a60442
15926f3644E9389J35520o2243b09676p2706P9432A33145b30162A46756M7206a8605
$$ y = [50100, 7142, -95091, 75004, -44648, 140714, 349175, -175314, 237182, 73651, 1657, 172754, 84156, -10641, -128853, -92523, -194338, -351617, 412333, -70864, 348912, -173814, 170082, 45242, 226034, -274559, 250027, 611291, 79979, 120642, 276163, 171685, 693181, 850215, 768090, 1027133, 721353, 754478, 1058847, 387105, 199528, 152593, -64262, -35738, 137594, 205526, 6027, 60378, 10966, -41021, -49956, -55879, -92941, 28708, 4882, -13598, 39772, -74169, 111866, 20201, 67798, 362530, 79080, -167154, 211624, -311209, -472237, 13950, -122645, -272303, -5424, -99729, -33082, -208455, -142420, 331353, 130017, -160442, -63644, 59389, 194909, 132666, -209676, -282382, -202950, 133145, -230162, 146756, 193962, -18605]
15914b45843e4132A36494a78082h968F2004P8230J674a93611R0526j85052J16696
15903a71441Q0713R138k17186B6826O87Q8867c0949j77948A70717h5857A10209
15891b7205l96729B25234a81030C34109C6701Q217H089c73392A81479C003c82971
15879h8980D2746a8094A3012O6217P2170o1232K21017b57711J14077C70759c52621
15867g6733I2647K25648G6060g4724I4581B9045c38723A30565b03785D3549e1369
15855d91881B3442a1654B92374c9763n19028d0715j12667H378K7786c48378a09722
15843E6148O304h7567B13576n9308J45142I9665a00692c9935A24616J4438O246
15832A45300b11918g3826C47a11279F1684c65930F653l046a20249I0019L5858
$$ y = [-245843, -54132, 136494, -178082, -8968, 62004, 140234, 141908, -193611, -103085, -288137, -171441, -90728, -81590, -298776, 26826, 27513, 116380, -30949, -208897, 170717, -85857, 110209, -27205, -423934, 225234, -181030, 334109, 36701, 44918, 8089, -373392, 181479, 3003, -382971, -88980, 42746, -18094, 13012, 79229, 151399, 90167, 311184, -257711, -143634, 370759, -352621, -76733, 92647, 318295, 76060, -74724, 94581, 29045, -338723, 130565, -203785, 43549, -51369, -491881, 23442, -11654, 292374, -39763, -558791, -40715, -153382, 8378, 36164, -348378, -109722, 56148, 62452, -87567, 213576, 154268, 299410, 99665, -100692, -39935, 124616, 139054, 145300, -211918, -73826, 347, -111279, 61684, -365930, 6653, 3607, -120249, 90019, 125877]
15821A25877a0546C3812G644M11872h552E5680b81090a08203q7258C6774J95303
15810B32077c80463d2136A23154b04933A44893a11762M0041G2858a92002j35040
15800c27042o777a4802p8956k01505a14101B6248a33862j60775i5426B25032b12914
15788A25092a05576n8806M2841J0904d7835E4223J06958G542a94474P8650B26705
15776e8394j22802j21350g6914j37241g6370j74723h8784C68601j71415A5932
15765d0522k40188I4706c3747A49360B6461a37108B9100a4368C2055Q1228m6047
15754F7236j9047d7661j67224a874j81960H710J78247d11210A91519d4391G2663
15742B20732a79253o8531A90708K9361E9949P7041M1444i351j24546l4892B5244
$$ y = [125877, -10546, 33812, 7644, 419516, -8552, 55680, -281090, -108203, -195461, 36774, 232077, -380463, -42136, 123154, -204933, 144893, -111762, -71721, 72858, -192002, -327042, -333819, -14802, -93758, -295263, -114101, 26248, -133862, -294637, -95426, 225032, -212914, 125092, -105576, -164382, -121541, -110637, -47835, 54223, 161181, 7542, -194474, -115824, 226705, -58394, -181196, -302546, -76914, -214155, -76370, -251093, -88784, 368601, 197186, 15932, -40522, -280710, 94706, -33747, 149360, 26461, -137108, 29100, -14368, 32055, 113283, 67236, 48189, -47661, -214885, -1874, -183834, 8710, 186957, -411210, 191519, -44391, 72663, 220732, -179253, -247784, 190708, 220069, 59949, 136990, 178434, -9351, -133897, -168789, 25244]
15730A51670B7996b39695B0887b62736h3104A26705q130A1553b07741Q7801B34089
15718E2912d5008j12319L3828B36836g0990B03840a59401K4016B43502E9579b40643
15706b17272l2848G108J3639b70381e5228j07705A99497a37743A3175f3862A74530
15694A3440c44j4022j31878I1814P4108K2501a15780j57986M8972C9739P5155
15683A14894f6278r7262k8856r2069A20011B1790K22462A08577D0115a46932A07017
15671i1129b043B65401a08516A602O5153b28714N7767A1317b70186A10408e6417
15659a9889j08588M8403A47740E0001o267J65551P6768c2834l56332a10893K1864
15648h9029b6574J1981m3052A22160m5098b65274a861F7805J4386P8085a63791
$$ y = [151670, 27996, -239695, 20887, -262736, -83104, 126705, 118575, 11553, -207741, -119940, 234089, 52912, -45008, -157327, -123499, 236836, -70990, 203840, -159401, -135385, 243502, 59579, -240643, -217272, -250120, 7108, 20747, -270381, -55228, -162933, 199497, -137743, 13175, -63862, 174530, 13440, -344, -14366, -146244, 91814, 165922, 188423, -115780, -273766, -224794, 39739, 114894, -66278, -163540, -192396, -284465, 120011, 21790, 244252, 108577, 40115, -146932, 107017, -91129, -2043, 265401, -108516, 1602, 66755, -228714, -170947, 11317, -270186, 110408, -56417, -19889, -128477, -80074, 147740, 50001, 43734, 209285, 286053, -32834, -389166, -110893, -89029, -26574, -14593, -57645, 122160, 77062, -265274, -1861, 67805, 82191, 160276, -163791]
15636e0384n19094a77172F2962J66582b16380F996a37645m1694L0096A3085K4798
15625C7883a1985B63044H0079J20230f7184k52769a2577j27024M68F4513L6265
15614A00778D9631J0620a29052n0342j73208c4877k18396d8882r7502l0460C16995
15602A52178a08827A35525b88374j19938j331A19060R0257D125L15225a51890
15591G0061J89193j16690m7313J80997A03158a60223N1231o0986d6562p3215A65248
15579f8283k52321A63155q0936d7778k1620D8933K24195a97038K1173B7941J44399
15568A72340L3509a85600a2178n6339j6349B77581D1976h6464H9512b60845J08510
15557a52335j09370Q783A7094h267B41047n6521h0978B3940a71540P849C10328
$$ y = [-50384, -569478, -177172, 62962, 229544, -216380, 6996, -137645, -179339, -149243, 13085, 37883, -11985, 263044, 80079, 200309, -67184, -319953, -12577, -139601, -139133, 64513, 100778, 49631, 60251, -129052, -179394, -352602, -34877, -253273, -48882, -146384, -176844, 316995, 152178, -108827, 135525, -288374, -408312, -409643, 119060, 209317, 4125, 319350, -151890, 70061, 259254, 142564, 95251, 276248, 103158, -160223, -108992, -169978, -46562, -119777, 165248, -68283, -320604, 163155, 82219, -47778, -69398, 48933, 273128, -197038, -175865, 27941, 172340, 205849, -185600, -12178, -68517, -84866, 277581, 41976, -86464, 89512, -260845, -152335, -261705, -252922, 17094, -8267, 241047, 184526, -80978, 23940, -171540, -163691, 310328]
15545d4813j47140M4483A04466b4255C9248a25590c5659A62995m4821a2996j51741
15534a64737B34176a53192A1334i0291b0112j19462m2039n1255A34719O480J82064
15523C23263d6822j02845B33557A4077C059J22243b05923r4511K3535A28312b75511
15511a00953A4186J43006R0030a18413r9127C20878c79672G2793N2500Q2227o7226
15500A40294n6660k9651c4051A01487L0153l8066K20410J29067c08938B49143
15489a0692B87187A01526j4897J17872P0028C1256K56494m0215f9039C69968N2967
15478D22935A18287a73567C6011a95489B11811q6074B0654K52288L7346B10M21774
15467D21984A61483L8893I4003d7239r20B5735c7474C4562L26008L05845j35449
$$ y = [-44813, -191953, -147470, 104466, -24255, 39248, -125590, -35659, 162995, 118174, -12996, -164737, 234176, -153192, 11334, -90291, -20112, -139574, -181613, -232868, 134719, 141199, 323263, -46822, -149667, 233557, 14077, 3059, 125302, -205923, -300434, -276899, 128312, -275511, -100953, 14186, 157192, 247222, -118413, -217540, 320878, -379672, 72793, 125293, 207520, 140294, 83634, 53983, -34051, 101487, 131640, 93574, 313984, 443051, -308938, 249143, -10692, 287187, 101526, 86629, 204501, 274529, 31256, 287750, 247535, -69039, 369968, 422935, 118287, -173567, 36011, -195489, 211811, 125737, 20654, 272942, 310288, 210, 421984, 161483, 200376, 94003, -47239, -48159, 25735, -37474, 34562, 360570, 666415, 530966]
15456E30966m9722m860A53896J78535K99866l16097G9882K66923o1370A27444
15445A24414a53367J9204E222K51172a02785j2858B08204a48990j69869A33215
15434B98708j10610o8305j6261M0702g469F05052k66631P0345M2803l5900O34772
15423A050441l57652A33096K00516D1662d4881E56177a58185H9455a40223A14192
15412B2323J45208l1576J78958a8332m9131B4232a58828B49412b6967A23137a68410
15400b33189J09359B6680a47191O6325k20975I5524a01575j9837B95277A8479
15389A20351b7997C4662a39530C14982B3906J2179c6100D09296a3181j21292A33082
15377h6978j98462h8053A43002a35016B43435a22887D5652J74581l7320l5511
$$ y = [530966, 481244, 476384, 153896, 332431, 632297, 316200, 79882, 346805, 285435, 127444, 124414, -153367, -134163, 5222, 256394, -102785, -115643, 208204, -148990, -318859, 133215, 298708, 188098, 119793, 103532, 144234, -7469, 605052, 338421, 408766, 451569, 415669, 1050441, 692789, 133096, 333612, 41662, -44881, 556177, -158185, 89455, -140223, 114192, 22323, 167531, 135955, 314913, -18332, -67463, 24232, -158828, 249412, -26967, 123137, -168410, -233189, -123830, 26680, -147191, -80866, -301841, 95524, -101575, -121412, 295277, 18479, 120351, -27997, 34662, -139530, 314982, 23906, 36085, -36100, 409296, -13181, -134473, 133082, -86978, -285440, -88053, 143002, -135016, 243435, -122887, 45652, 220233, 182913, 147402]
15367A47402K01762b5810j36622a1180A03962r629L6764k8088B4737L54764b08923
15355B17802b154A79986J88355A37128k9010c7833B74897k9280J56920J73208
15345E75745B73687k6720Q2302r3298j09163b14936C01498I8681k8488R7846J23282
15334B91321I0852K87580C4309J68646H5440f2122B62273K06028j16070J33008
15324D85239I8276j9379L30591a85877A29961k9680A0850j630K21992H1954J1775
15313I3729J38515h8581A28726J9374e7921A08167Q3957a67992A32597a98651
15302A69107J57825A05211j3092d3461D17291a41900A95604a68040G5464L98673
15292D74137H5591h6222k9445C9933K07155l0033l0431b0745A79830e0461B63339
$$ y = [147402, 349164, -25810, -162432, -11180, 103962, 94333, 131097, 103009, 24737, 379501, -208923, 217802, -2154, 179986, 368341, 137128, 108118, -37833, 274897, 245617, 402537, 575745, 273687, 246967, 329269, 235971, 126808, -214936, 301498, 98681, 70193, 168039, 291321, 90852, 378432, 34309, 202955, 85440, -62122, 262273, 468301, 352231, 485239, 98276, 78897, 409488, -185877, 129961, 100281, 10850, 9220, 231212, 81954, 93729, 232244, -88581, 128726, 148100, -57921, 108167, 192124, -167992, 132597, -198651, 169107, 326932, 105211, 92119, -43461, 417291, -141900, 195604, -168040, 75464, 474137, 85591, -86222, -115667, 39933, 247088, 217055, 186624, -20745, 179830, -50461, 263339]
15280b9748A74651b09285B59118I0370b6013k39789E2391b8771L209k22784A92714
15268G405a78039H6304a02454C32074i5065H5641a59674A20950D1814O1499L19822
15257D23135k04497o8167a34455j5225B9050J15315a66276D17733B03748a63417
15246A836M5649J72987b0688C23162J57054b3997B62575a02250A78695j0588m4508
15235A23599J43683p4033c6569F37209l02969K49516O27285Q0868r1081K28620
15225A429448m31082l38464B20193p1683K36125j90910G8824R4332C5802K24355
15215B60157g0698H8949B0078L1246a2301B64933C2286P977P6212a86320Q0631
15204a05689g161q0793b010A85435b21970i9129A71276P9123r7816K20543R126
$$ y = [-29748, 174651, -209285, 259118, 90370, -26013, -265802, 52391, -28771, -25562, -248346, 192714, 7405, -178039, 86304, -102454, 332074, -95065, 85641, -159674, 120950, 41814, 103313, 423135, 218638, 150471, -134455, -149680, 29050, 144365, -166276, 417733, 203748, -163417, 1836, 47485, 220472, -20688, 323162, 480216, -23997, 262575, -102250, 178695, 168107, 123599, 267282, 193249, -36569, 637209, 334240, 583756, 1211041, 1291909, 1200828, 1429448, 998366, 659902, 220193, 148510, 384635, 193725, 78824, 173156, 35802, 260157, -70698, 88949, 20078, 51324, -12301, 264933, 32286, 40263, 116475, -186320, -105689, -7161, -87954, -2010, 185435, -221970, -99129, 171276, 250399, 152583, 373126, 382252]
15193C82252j01166C6083c32560A87931a63762M6022c0514A93423a08623A69638
15182A48395a8111A49780I259a81940G6070h95I1413J8676b02186b4480A36652
15170a08367A47462k9634f3448B36799J7096Q4625m2518E6704J02364N9478B3971
15158a70189F8395a04192A88889H5561K6308M1855i8264D1953J57340e1452A32160
15146a033j03555B12634K11429A13653j4809g8238C40761l5560G0747i8923D17705
15134I1075a14622H6560a33894I7135K77226D8791e673k8383o4211A90739J51489
15123C42228A30411d0888C53009a11638A27864M4881K33529A32128f248D28692
15112A30513K18406A70313K17714C9533K3532K72118P6608B00758j2326P578d4724
$$ y = [382252, 281086, 36083, -332560, 187931, -163762, -117740, -30514, 193423, -108623, 169638, 148395, -18111, 149780, 9259, -181940, 76070, -895, 91413, 110089, -202186, -24480, 136652, -108367, 147462, 117828, -63448, 236799, 253895, 338520, 296002, 56704, 159068, 218546, 23971, -170189, 68395, -104192, 188889, 85561, 111869, 153724, -98264, 41953, 199293, -51452, 132160, -1033, -104588, 212634, 424063, 113653, 98844, -78238, 340761, 305201, 70747, -98923, 417705, 91075, -114622, 86560, -133894, 97135, 374361, 48791, -5673, -34056, -98267, 190739, 342228, 130411, -40888, 353009, -111638, 127864, 172745, 406274, 132128, -6248, 428692, 130513, 348919, 170313, 388027, 39533, 63065, 335183, 411791, 200758, 188432, 196010, -44724]
15100B82496j4006J11257C0993K87241A17487d1033J2830A94781i480A35369O1674
15089A97043N0701l9052p1784P770F5033L30476a0049n9141A40786A0441L49089
15078C59530p3242a25225I9215d3283B14209J54462j10940J60704j15539A34240
15067B85280A06210J25021p1546h17A13616L63387a29124j00191A54689K2094
15057A76783j8705K09556j60270a8116C82018o304R007a4427B93210K2717G3966
15045i7421I5248m126K9368L710b20708C55176G2330M01722j61965K79781B08977
15033D21738j97315J519H6151K96301j73324J56070H2025J97629K79312j07214
15023D51752q9458J53532k44982J19200j07615J44732l5419J82098k00494K14241
$$ y = [282496, 268490, 379747, 30993, 318234, 117487, -41033, -28203, 194781, -9480, 135369, 197043, 247744, 208692, 136908, 144678, 65033, 395509, -10049, -69190, 140786, 10441, 359530, 286288, -125225, 99215, -43283, 214209, 368671, 257731, 418435, 302896, 134240, 285280, 106210, 231231, 159685, -817, 113616, 477003, -129124, -229315, 154689, 176783, 158078, 367634, 207364, -18116, 382018, 375714, 384721, -14427, 293210, 315927, 73966, -97421, 95248, 91122, 120490, 124200, -220708, 355176, 72330, 474052, 312087, 591868, 208977, 421738, 224423, 225942, 86151, 382452, 209128, 365198, 82025, 279654, 558966, 451752, 362294, 515826, 270844, 390044, 282429, 427161, 391742, 573840, 373346, 587587]
15013E87587j51680L00456j26337J24316B39349j0213J43655L42816C24274J74986
15003D99260A43550N03834j33213M7490j20152J1910K65215j53050k35875R815
14993C39524L60979B87864j5426D6805K75377K32115A3287R1039K25118J95053
14983E24497j74467K96949A90540J68756j4136j245R6171E2221N26710j45275
14973D33656o6046J29446L13620B51235J46551J20420J11110K13183k87713J77822
14963G32608O5203J30754D14265J14047J40574B61221K23143j3071K92627k07940
14953E55980q4044J88458k35015A87945L70834B14152J10053p5740R8046K268
14943C48779J1868A9838R7785L19699j41818K2614n203l8833K65704k35507o4873
$$ y = [587587, 435907, 736363, 610026, 734342, 239349, 229136, 372791, 715607, 324274, 499260, 143550, 647384, 514171, 561661, 441509, 453419, 718634, 565584, 329709, 339524, 700503, 287864, 272438, 46805, 322182, 554297, 13287, 104326, 329444, 524497, 350030, 646979, 190540, 359296, 345160, 343915, 440086, 52221, 578931, 433656, 367610, 497056, 810676, 251235, 397786, 518206, 629316, 842499, 554786, 732608, 797811, 928565, 414265, 528312, 668886, 261221, 484364, 471293, 763920, 555980, 471936, 660394, 425379, 187945, 558779, 214152, 324205, 248465, 346511, 348779, 360647, 19838, 117623, 437322, 295504, 318118, 312915, 274082, 539786, 304279, 239406]
14932B39406I8284M45182m9500q7035r6691N52063o5481l37856j96117M07736
14922F70585n6668j97539j33088K99222J46497K22373k97128L90741k8432P807
14912A024370J75395L55836k91166L93932O896k65111J09980o4232J50165J27232
14902A723297k48058M36026m4644K29353n53344k91692J19200j07696n69270j13034
14892E80138L88020j81586k15475j47912R528J75203j58800P1476k53654J34685
14882D01623N7798R6227n6632J23097B07146J92299A69261R1395N54501k66591
14872E48566J06598J68945m0237k01088L30924o6343C15044L40978J48217N6887
14862H61126k38119M25976m15344j9942O279j31959N5277q1745k7090K19572k57039
$$ y = [239406, 98284, 543466, 493966, 406931, 310240, 862303, 796822, 458966, 262849, 670585, 613917, 416378, 283290, 582512, 729009, 951382, 654254, 1044995, 1016563, 1024370, 1199765, 1555601, 1264435, 1658367, 1665263, 1400152, 1510132, 1445900, 1596065, 1723297, 1475239, 1911265, 1866621, 2095974, 1542630, 1250938, 1370138, 1262442, 693172, 580138, 968158, 786572, 571097, 423185, 432713, 607916, 449116, 520592, 266938, 401623, 459421, 555648, 499016, 622113, 207146, 399445, 169261, 260656, 815157, 548566, 655164, 824109, 783872, 582784, 913708, 847365, 315044, 656022, 804239, 861126, 623007, 1048983, 633639, 613697, 619976, 488017, 543294, 461549, 434459, 654031, 396992]
14851C96992P6957J98153J62355l77015K07354K7123l17223K32679N0496k99058
14841C58813j27330K67774B34553K72451j32645j33090N06284j85618j72466q3208
14831C06261K72572q1644N2489j45803M77246o0403N3712J81017k81252R2407
14821H66602K84894j04092k08690K3453J8378j75887B57520K10846J16080M6506
14811F30952C04204m0258L79027O6623m7983k10223K3206Q5445J88214k20205
14801E28050M53147l38553K71293k76259m6561J57708j12457K27870l10832L29962
14791H83368r0754K59506n9805J83752m12009K73679p9372k46759K9464j35407
14781F05663j15387P9404J43690A37219L36069J70331R5688j22177K26202l08932
$$ y = [396992, 473949, 672102, 834457, 457442, 664796, 691919, 374696, 607375, 657871, 358813, 231483, 499257, 234553, 507004, 374359, 241269, 747553, 561935, 389469, 306261, 578833, 497189, 549678, 403875, 881121, 820718, 874430, 1055447, 774195, 866602, 1151496, 1047404, 838714, 862167, 880545, 704658, 257520, 468366, 584446, 630952, 304204, 263946, 642973, 709596, 661613, 451390, 474596, 560041, 748255, 528050, 981197, 642644, 913937, 637678, 591117, 748825, 636368, 864238, 553406, 883368, 792614, 1052120, 992315, 1176067, 764058, 1037737, 958365, 711606, 741070, 605663, 490276, 569680, 713370, 137219, 473288, 643619, 739307, 617130, 843332, 534400]
14771E34400j27222L85146N9992k27618J96522B48340J31487M31228o7003k85799
14761D58253M61837k95400J39250K70348k99001K11537O26N1719k3820l48529
14751F26820r3435O7623J23393k70601K0128k954O1283J38583j02385K58590M886
14740H31931r3428k00836J92867J4234j96512M9489J51510J5678j8605K9285k52616
14729E22997J68893j5339K0706Q2747J29274R5213D40952L32156l0502K2444K92323
14718A057373J02037J2407l27406J1329J91942J22680L18918j55602j37335L13981
14708A510324J38467k36098J84724o84674K30623l65610J5332K52626k45678J65567
14698I65603j36735o0198L73587j86441J93345E18791N08121O6532k4420j36327
$$ y = [534400, 407178, 792324, 852316, 624698, 821220, 248340, 379827, 811055, 744052, 458253, 920090, 624690, 763940, 1034288, 735287, 946824, 947450, 999169, 975349, 626820, 533385, 601008, 724401, 453800, 473928, 470974, 532257, 670840, 568455, 827045, 831931, 738503, 537667, 730534, 744768, 548256, 597745, 749255, 764933, 746328, 775613, 522997, 691890, 676551, 697257, 780004, 909278, 1004491, 440952, 773108, 742606, 765050, 1057373, 1159410, 1171817, 844411, 855740, 1047682, 1170362, 1489280, 1333678, 1196343, 1510324, 1648791, 1412693, 1597417, 912743, 1143366, 777756, 793088, 1045714, 800036, 965603, 828868, 768670, 1142257, 955816, 1149161, 518791, 1026912, 1093444, 1069024, 932697]
14688I32697P4360P7668j2387N10038P0525m3491l3318k30193o2998J70784j57819
14677A295866N3028n83324L63909k28289Q0396n2366P1169j14080M17270k20185
14667A083394j30006M1792Q595J41059J74149M2900l59698K46065L1389k18849
14657A060790j77503K82573k99008J69296j83542K41997m9413L3476J64011j92062
14647A050615J13232l11926K90806q0061O2192K97763m56244N41446o22638L62995
14637A248180J57096o1768J00302j51503J52249j79236K09090k46369Q1720m40097
14627H69664L31516J88481K3352k42981K95910J9112j25630N0270j29401k71962
14617A008331L71325k95495K98156R8732k71707J35140J93594r6434j34344M31866
$$ y = [932697, 1007057, 1084725, 1072338, 1582376, 1652901, 1609410, 1576092, 1345899, 1282901, 1453685, 1295866, 1348894, 765570, 1129479, 901190, 981586, 929220, 1000389, 886309, 1303579, 1083394, 953388, 995180, 1003775, 1144834, 1318983, 1361883, 1002185, 1248250, 1279639, 1060790, 883287, 1165860, 866852, 1036148, 852606, 1094603, 1045190, 1078666, 1242677, 1050615, 1163847, 851921, 1142727, 1062666, 1124858, 1422621, 966377, 1507823, 885185, 1248180, 1405276, 1343508, 1443810, 1292307, 1444556, 1265320, 1474410, 1228041, 1309761, 869664, 1201180, 1389661, 1413013, 1170032, 1465942, 1485054, 1359424, 1409694, 1280293, 1008331, 1379656, 1084161, 1382317, 1481049, 1209342, 1344482, 1538076, 1441642, 1307298, 1739164]
14607A739164l22063K73427l74498K6639r3936M19028m26288J41986J05145k81419
14597A207185l0960M35031J75473k72876k35666J43585J98402K3045p6640Q5737
14587A652316k84252K56083K71072m94645K60122k0150q2568P7277J0098K68226
14577A913579j49078J58641Q653j0801k63837K24830P8018N8343j85402j44886
14567A688060K03052J83787j2458k85988J89689K12906M3497l83878K53578K48289
14557B340534O4056m50794J1043R8483K30057K0064j6662J33276J17328p1413
14547B475972K41813J17973k28261N11199O2106Q4590M7543O39698N46496K5101
14537D524230J148934N69121J193110K118033M346486O172812R707754K047518
$$ y = [1739164, 1417101, 1690528, 1316030, 1342669, 1248733, 1667761, 1241473, 1383459, 1488604, 1207185, 1176225, 1611256, 1786729, 1513853, 1278187, 1421772, 1620174, 1643219, 1566579, 1652316, 1368064, 1624147, 1895219, 1400574, 1660696, 1640546, 1557978, 1635255, 1645353, 1913579, 1764501, 1923142, 1931795, 1920994, 1657157, 1881987, 1960005, 2018348, 1832946, 1688060, 1891112, 2074899, 2062441, 1776453, 1966142, 2179048, 2222545, 1838667, 2092245, 2340534, 2404590, 1953796, 1964839, 2063322, 2293379, 2313443, 2296781, 2430057, 2547385, 2475972, 2717785, 2835758, 2607497, 3118696, 3180802, 3265392, 3312935, 3952633, 4499129, 4524230, 5673164, 6242285, 7435395, 9553428, 13899914, 20072726, 29780480, 31827998]
14529C1827998j3697105o596722m039360j777577l17413J9259j531549q22205
14521C065326K82860r38377J04129n2762K04019l46056m1835j9098j51665L02866
14511B409407q2217n5661P235K3544M6448J67275j97987L01972L2256k85997L70348
14500B736623N6008l19685k874O7732N72999j65300K16565l90954j41725J54253
14490B783642R9305J52413n2376o6946J74173L31604k34442j39727P3595P3074
14480C194315K65924k1163k01781L06614n22879O74422o4859l5107o8836L59792
14470C886442k98029j19444O23265l69954M65126k62568J52350n40023L54711
14461C891876J47382K13941k57109P6685K78315j34018J77429N339l05342L26914
$$ y = [31827998, 18130893, 11534171, 7494811, 5717234, 5399821, 5419080, 3887531, 3065326, 3348186, 2409809, 2513938, 2461176, 2665195, 2319139, 2277304, 2258206, 2106541, 2409407, 2327190, 2271529, 2278764, 2302308, 2348756, 2516031, 2318044, 2620016, 2652272, 2366275, 2736623, 2792631, 2472946, 2470072, 2537804, 3110803, 2945503, 3162068, 2771114, 2629389, 2783642, 2882947, 3035360, 2982984, 2916038, 3090211, 3421815, 3187373, 3047646, 3121241, 3194315, 3460239, 3439076, 3237295, 3543909, 3021030, 3695452, 3630593, 3595486, 3526650, 3886442, 3588413, 3468969, 4092234, 3722280, 4187406, 3924838, 4077188, 3537165, 3891876, 4039258, 4253199, 3996090, 4072775, 4351090, 4217072, 4394501, 4399840, 4094498, 4421412]
14451D421412L05571P1234m30880M90003K4742k41426M32158K7123l66539K93627
14441E027025J76841L0939J56413k47206J12673j5811J24284K27423k14226K34749
14431E613104J56707q2350J53706J28585J39798j33216N75004j31623M25732o83893
14421F161554M66758p7676q43L15373K19068j07023J32843K20985l09540J85493
14411G206992K8698N64210k80159J31591J18354L33198R5678J31440M54387j55787
14401H628602L83049k48834J17749K17088j62602L32674p1024K05717P7036O18309
14391A0097764j68247K73406M9709J67622L44371K11981j13312n0549M37770L0585
14381A1281100K82229J73198L20884j48006L69945K16961J90081K78587l4919
$$ y = [4421412, 4726983, 4798217, 4367337, 4857340, 4882082, 4640656, 5072814, 5099937, 4733398, 5027025, 5203866, 5234805, 5391218, 5144012, 5256685, 5240874, 5365158, 5592581, 5378355, 5613104, 5769811, 5687461, 5841167, 5969752, 6109550, 5976334, 6551338, 6419715, 6845447, 6161554, 6628312, 6550636, 6549793, 6865166, 7084234, 6977211, 7110054, 7331039, 7021499, 7206992, 7235690, 7799900, 7519741, 7651332, 7769686, 8102884, 8198562, 8330002, 8784389, 8628602, 9011651, 8762817, 8880566, 9097654, 8935052, 9267726, 9196702, 9402419, 9479455, 10097764, 9929517, 10202923, 10252632, 10420254, 10764625, 10976606, 10863294, 10812745, 11250515, 11281100, 11563329, 11736527, 12057411, 11909405, 12279350, 12496311, 12686392, 12964979, 12930060]
14372A2930060N24523J56609K13261J02352N64531m7305O42475K52165K96182
14363A5634853P1904M34646K25974K75633N74776J79050P5782J40249P78913N7378
14353A8449158P61892P9114M31580K75065O99883L83009O45966N01440J44760
14344B2371867M28088N16737O50299M16454N26815O66723M24042P42560L62262
14335B7105847P08414Q80943R97109P27354N43106Q41629R40153P74916R40503
14326C4459974Q28888J049861Q12391J214800J485533K84989J943372J026935
14318D3106743R52396J735237J268997J471691J633836J478029K287432J814880
14310E5749241J376484K102037K162501J957928K290818K307683K489892K842540
$$ y = [12930060, 13454583, 13611192, 13824453, 13926805, 14491336, 14444031, 15086506, 15338671, 15634853, 15706757, 16141403, 16367377, 16643010, 17217786, 17396836, 17472618, 17612867, 18391780, 18449158, 19211050, 19290164, 19721744, 19996809, 20696692, 21079701, 21725667, 22227107, 22371867, 22799955, 23316692, 23966991, 24383445, 24910260, 25576983, 26001025, 26743585, 27105847, 27814261, 28695204, 29692313, 30419667, 30962773, 31804402, 32744555, 33519471, 34459974, 35288862, 36338723, 37151114, 38365914, 39851447, 40136436, 42079808, 43106743, 44059139, 45794376, 47063373, 48535064, 50168900, 51646929, 53934361, 55749241, 57125725, 59227762, 61390263, 63348191, 65639009, 67946692, 70436584, 73279124]
14302G3279124K405001K994377L294706L128047K575913L978778L899854M238577
14294I9794377M222279M205587M959962N450909M786849N848509N847929O649094
14286A41765495O975887O946268P473752Q067824Q788667R037227R819775R465254
14278B08340149J0855230J1264630J2101171J2532392J3089264J3201153J3358307
14271B94742296J4100897J4315562J4025517J4341534J3810859J2975495J2774255
14264C91086415J2179104J0126768R895369Q917693Q788698Q196851N930529L113424
14256D58234851J363916K480828m42480o692949n523093n277052q320231j1081445
14248D24742345j1547763j2747253j3161798j3755903j3795603j3541641j3590470
$$ y = [73279124, 75684125, 78678502, 81973208, 85101255, 87677168, 91655946, 95555800, 99794377, 104016656, 108222243, 113182205, 118633114, 123419963, 129268472, 135116401, 141765495, 148741382, 155687650, 163161402, 171229226, 180017893, 189055120, 198874895, 208340149, 219195379, 230460009, 242561180, 255093572, 268182836, 281383989, 294742296, 308843193, 323158755, 337184272, 351525806, 365336665, 378312160, 391086415, 403265519, 413392287, 423287656, 432205349, 440994047, 449190898, 455121427, 458234851, 459598767, 462079595, 461637115, 454944166, 449421073, 444144021, 435823790, 424742345, 413194582, 400447329, 387285531, 373529628, 359734025, 346192384, 332601914]
14241C32601914j4407923j3164556j3482457j3301422j2340625j2172778j1623768
14234B42108385j1125082j1414583j1027101j1085332r728900r547165q802930
14227A69377292p825743q074048p293934o796443o296597n854718n732508n507032
14219A15996269m850739m664939m652880l639248m203537l767175l522989l223841
14211H3470921l216149l398609k595653k720883k787555k296901k206118k123638
14203F2125415k152829j859955k024648j628672j501514j596640j909776j612297
14195D7839084j280429j477614r37247j247239j029443j103049j327407j291752
14187C8144904q64284j153213q43174m59363j224998q14219q46904p19534p85877
$$ y = [332601914, 318193991, 305029435, 291546978, 278245556, 265904931, 253732153, 242108385, 230983303, 219568720, 208541619, 197456287, 187727387, 178180222, 169377292, 161551549, 153477501, 146183567, 139387124, 133090527, 127235809, 121503301, 115996269, 111145530, 106480591, 101827711, 98188463, 93984926, 90217751, 86694762, 83470921, 80254772, 76856163, 74260510, 71539627, 68752072, 66455171, 64249053, 62125415, 59972586, 58112631, 56087983, 54459311, 52957797, 51361157, 49451381, 47839084, 46558655, 45081041, 44143794, 42896555, 41867112, 40764063, 39436656, 38144904, 37280620, 36127407, 35284233, 34824870, 33599872, 32785653, 31938749, 31219215, 30433338]
14178C0433338r04523p88112r14942m74724j85597r50859q01561l90025p05454
14169B4317541k87646o50935p71807q7985n35941l93231p20088k73466n55399
14160B0041043m76531l58339j22129m81556k15297m35701q01778j11846k03299
14151A6834567m07632K2160o19000p5765m45552n94334J96447l24550k16478m03230
14141A3966633j06293j93043l98386k45997j12474n28894p432P5427l15255J6337
14131A2150623m91309Q5439n12932j88400K3315k92642K15585p00304j31329k09879
14121I948167K83358j39288l94855k30775O0998l96508J55301l29320J87627l71143
14111H773562j03864J44148m03613k681l78681J12115j71932J30578k59553O0494
$$ y = [30433338, 29528815, 28740703, 27825761, 27351037, 27165440, 26214581, 25413020, 25022995, 24317541, 24029895, 23378960, 22607153, 22519168, 21983227, 21589996, 20869908, 20596442, 20041043, 19564512, 19206173, 19084044, 18602488, 18387191, 17951490, 17149712, 17037866, 16834567, 16426935, 16449095, 15830095, 15754330, 15308778, 14714444, 14910891, 14586341, 14369863, 13966633, 13860340, 13667297, 13268911, 13022914, 12910440, 12381546, 12374114, 12449541, 12134286, 12150623, 11659314, 11744753, 11231821, 11043421, 11066736, 10774094, 10989679, 10289375, 10158046, 9948167, 10231525, 10092237, 9697382, 9466607, 9527605, 9131097, 9286398, 8957078, 9144705, 8773562, 8669698, 8813846, 8410233, 8407552, 8028871, 8140986, 7969054, 8099632, 7840079, 7900573]
14101G900573l59250J29213j92998l55153L8457k19901n5875k0943K91808m73953
14091F681978j64182Q552j57286K5258Q1823k03778L1402j15308k92489L33410
14081F229380k54256m56413N62921m70808J13049J52267m02590q8849P4376N6705
14071E515782M7418p05836J08448K97771l29050M12024j58353N7766o23328J11708
14061D734350J54059l5911k86970p1365J69724k00150N864k97885K02296P1764
14051D445776l18222O9552L31348j08435l06164R0823L03796k51488j72437q9691
14041C994858j2559J10012m7514n56625R4474J44563J80929K24572n91763Q3828
14031C624775k06857L57345m22439O4932Q2476J21021k07588j68477p7253K15173
$$ y = [7900573, 7541323, 7670536, 7477538, 7122385, 7160842, 6940941, 6885066, 6864123, 7155931, 6681978, 6517796, 6526348, 6369062, 6394320, 6476143, 6272365, 6303767, 6188459, 5895970, 6229380, 5975124, 5518711, 6081632, 5610824, 5723873, 5876140, 5473550, 5384701, 5459077, 5515782, 5563200, 4857364, 4965812, 5263583, 4934533, 5346557, 5188204, 5245970, 4622642, 4734350, 4888409, 4852498, 4565528, 4494163, 4663887, 4463737, 4469601, 4171716, 4374012, 4445776, 4127554, 4197106, 4528454, 4420019, 4113855, 4204678, 4508474, 4256986, 4084549, 3994858, 3982299, 4092311, 4044797, 3488172, 3582646, 3727209, 3908138, 4132710, 3540947, 3624775, 3417918, 3775263, 3352824, 3417756, 3500232, 3621253, 3413665, 3245188, 3167935, 3383108]
14021C383108j58390O2525n6457o4548J99335j27984m514N792j14625K33390k02130
14010C155502l08501P3679j79404P7465N5074k69556k5435Q0142J26546q4428
14000B701084n9220J78157k78602O8695J13968R3301m72975J08171l70785N85292
13990B667086m64908L94060m28079K61447k15351N5840o8389P4741J71622K5848
13980B473917M8241L96655K69895M65253L58363Q65918J556568L126513O107770
13971A5669093R264105Q619970j0945051p364454m790196k725700j484008j421304
13963D822455n92469j49413k64227m40611J3712k11852l74335O4149L0607k11063
13953B686953q4729Q5110k04817k05548L88665m44436P1293j03568j22884L1149
$$ y = [3383108, 3224718, 3287243, 3230786, 3166238, 3365573, 3237589, 3233075, 3238867, 3124242, 3357632, 3155502, 2847001, 2920680, 2741276, 2818741, 2873815, 2604259, 2578824, 2658966, 2785512, 2701084, 2641864, 2820021, 2541419, 2610114, 2724082, 2817383, 2344408, 2452579, 2081794, 2667086, 2202178, 2596238, 2168159, 2429606, 2214255, 2270095, 2201706, 2276447, 2448069, 2473917, 2522158, 2918813, 3188708, 3653961, 4012324, 4878242, 6434810, 9561323, 15669093, 24933198, 33553168, 22608117, 15243663, 10453467, 7727767, 6243759, 4822455, 4229986, 4080573, 3816346, 3375735, 3389447, 3177595, 2803260, 2867409, 2898016, 2686953, 2602224, 2687334, 2482517, 2276969, 2665634, 2221198, 2292491, 2188923, 2066039, 2097188]
13943B097188K48768j35067k09120J25379R2418l58348J72989j34415J85605N2897
13933B138294m97848L8251K51642q1935k42878J71809k2972N9594j5512K18510
13923B016955k95605p6834J03357J51347J46413p73349K45863L49804l66090L7385
13913A539246n768l69741O32836l45824M50825o54318L11776J51214k90499K38680
13903A658427j16366K5252k44153J98941J12537k03310l5843L26450k39775J74921
13893A657081j84123J26825j03424p7091j3560J64421j77820n79034M10071M10299
13883A633645K25589n37880L39087k90865o7805o3442m218n0604J97418l19786
13873A061139J64198K49808m14746M46018J47002m82175j69615M78456l65719
$$ y = [2097188, 2345956, 2210889, 2001769, 2127148, 2219566, 1861218, 2034207, 1899792, 2085397, 2138294, 1640446, 1678697, 1930339, 1848404, 1605526, 1777335, 1754363, 1813957, 1798445, 2016955, 1721350, 1644516, 1747873, 1899220, 2045633, 1272284, 1518147, 1867951, 1501861, 1539246, 1533478, 1163737, 1796573, 1450749, 1901574, 1247256, 1559032, 1710246, 1419747, 1658427, 1542061, 1567313, 1323160, 1522101, 1634638, 1431328, 1395485, 1721935, 1482160, 1657081, 1472958, 1599783, 1496359, 1419268, 1405708, 1570129, 1392309, 813275, 1223346, 1633645, 1859234, 1321354, 1660441, 1369576, 1301771, 1238329, 1234111, 1183507, 1380925, 1061139, 1225337, 1475145, 1060399, 1506417, 1653419, 1171244, 1001629, 1480085, 1114366]
13864A114366J8611P6668k17413J70383J61857p432k42786P4515J45708k30315
13854A064162l130q7772M11763O0562J1326l05627J11057N9644n6740k24085j92711
13843H48449K33408R6467l702k24511J24841n7723L1272R1651j51034k28836M72894
13832A233176m11532J31018J66420J96754m33276J08780O0367k1412r0834J96372
13822A135833k94477j42634L25939k75934N40630m93095J03039K02495k13961
13813H87835k05536L24065m3824k7155O5003N6433l5383J84391l39022j11464
13803G55343R0567k61322J7367J41556j09804K53949L4650n9289L1182j79526
13793G14673M98637m9166j21865k94827j15474j15360L51017l00336M03042k27265
$$ y = [1114366, 1132977, 1209645, 992232, 1162615, 1324472, 1317040, 1074254, 1148769, 1294477, 1064162, 1061032, 973260, 1385023, 1445585, 1456911, 1151284, 1262341, 1321985, 1265245, 1041160, 848449, 1081857, 1178324, 1174622, 950111, 1074952, 1017229, 1048501, 1140152, 989118, 760282, 1233176, 821644, 952662, 1119082, 1315836, 882560, 991340, 1051707, 1030295, 939461, 1135833, 841356, 698722, 1024661, 748727, 1289357, 796262, 899301, 1101796, 887835, 682299, 1006364, 962540, 935385, 1000388, 1056821, 1021438, 1205829, 866807, 755343, 845910, 584588, 601955, 743511, 633707, 887656, 922306, 863017, 894199, 714673, 1213310, 1164144, 1042279, 747452, 631978, 516618, 867635, 567299, 970341, 743076]
13783G43076n5089p8044J41372O1505L10323j78404k55672J33963k60536L96226
13773I58720k26656k93212O42229k84100j52023K44426k1930J9763k02592M6857
13763G31482j63930J11308Q4260j82180K8595K7480p0761J60361k33975J05195
13753E97835M5446j9131K19274j46584r9167J40793P3107k8320J06898J08908
13743I99059D98112L83131L4792k87708m1070J79337j35997K22068o1943j13531
13733F77191K0077j25585K42951p2819M9299B61846L69799q8835K35890j02978
13723F75722J78292o7114J04888r5541j66992C10494K50499K15735J50587l4179
13713H93136l12231J73359M2482l89754J50662N6447K56355l18467J45833k70625
$$ y = [743076, 687987, 609943, 751315, 812820, 1123143, 944739, 689067, 823030, 562494, 958720, 732064, 438852, 1081081, 796981, 644958, 889384, 867454, 887217, 684625, 731482, 567552, 678860, 763120, 580940, 609535, 637015, 566254, 726615, 492640, 597835, 643281, 624150, 843424, 696840, 597673, 738466, 811573, 783253, 890151, 999059, 498112, 881243, 916035, 628327, 587257, 766594, 630597, 852665, 790722, 677191, 697268, 571683, 814634, 741815, 791114, 261846, 631645, 542810, 778700, 675722, 854014, 786900, 891788, 796247, 629255, 310494, 560993, 776728, 927315, 893136, 580905, 754264, 796746, 406992, 557654, 614101, 870456, 551989, 697822, 427197]
13703D27197L88659l81222J80511J59491k21973B65832K61834P3807A60756L93388
13693E54144j96261J65383J99545j1893j68656k1723M999m868K56015l80626J78023
13682E74082j5247k05792M23396A93782K14898F2940J77322K28982L37738j50024
13672F56958j67634m9949J53080k01958A66576J36545N4436j31913L75470P7758
13662F78872B39372J12580k5904K66004A88569J30161J63078P6146k58953J58549
13652D57550A35288J97081L0784m2960L63555l06982K22295o196j93253n5403
13642C44209m5783M28606o9480j68204L0939J03767l5263B6831N48255j60283
13632D14803J58390j81266j87216J23215L1105L37880k38490A45933J59418A39453
$$ y = [427197, 815856, 434634, 615145, 774636, 552663, 265832, 527666, 601473, 160756, 554144, 357883, 523266, 722811, 710918, 542262, 520539, 525538, 520670, 776685, 396059, 574082, 558835, 353043, 776439, 193782, 408680, 62940, 240262, 469244, 806982, 656958, 489324, 439375, 592455, 390497, 166576, 303121, 357557, 225644, 601114, 678872, 239372, 351952, 326048, 592052, 188569, 318730, 481808, 557954, 299001, 457550, 135288, 332369, 363153, 320193, 683748, 376766, 599061, 592865, 399612, 344209, 298426, 727032, 657552, 489348, 520287, 624054, 588791, 26831, 575086, 414803, 573193, 391927, 204711, 327926, 359031, 696911, 458421, 145933, 305351, 139453]
13621C84989A37399L15355j12073J88125J97207B29779L35666A91938K42412J9245
13611D53595N3745j83170l2600K97251p4020P3527k00385j17750l6160O7112j9218
13600B81927k5617J46483F0580M37327b28431D80744p0543j17849p7025J00030
13590C15357j31875R8898N9977p0844j24708L35109j00137O3703A43280K17509
13580C60789o53o6933N810A31798M73769K3939C11500o3457M98140C35099Q4800
13569D19899J68355B32138K00834r9050j46982M07077P7090C19174B2208N11348
13559E33556A98124K15012A02284L28779N7358k25953J31710K06192r2477J8673
13549E26566F1348J73224J78933A22276K79445O5669n7533j57054o5113J23489
$$ y = [384989, 137399, 452754, 340681, 528806, 726013, 229779, 565445, 191938, 434350, 453595, 507340, 324170, 291570, 588821, 514801, 588328, 387943, 270193, 234033, 301145, 281927, 256310, 402793, 60580, 497907, -228431, 480744, 410201, 292352, 215327, 315357, 183482, 282380, 342357, 271513, 146805, 481914, 381777, 445480, 143280, 360789, 360136, 293203, 299013, 131798, 605567, 629506, 311500, 248043, 746183, 335099, 419899, 588254, 232138, 432972, 333922, 186940, 594017, 671107, 319174, 22208, 533556, 198124, 413136, 102284, 431063, 488421, 262468, 394178, 600370, 507893, 526566, 61348, 234572, 413505, 122276, 401721, 467390, 409857, 252803, 187690, 311179]
13539C11179j39711G8779L15204N0647l9788j31356m3031D7489L94766r1428M12808
13528G63635B74005K0759j38074J96564K7369E6501K65363q6480r9159P7745j03206
13517A10764C455L21398j09412o7475J29285J08846J75507A99065K20690j51375
13507B68380e3242D17591M49829m16906J72010A83156K20080K23317B50782L07362
13497E58144j59021l8833o0476n4114J14534Q7851A41488N1798K34683j48744
13487B79225k2890J01521I1068L27117j36630p593h1872G5581J82237J59414j19975
13476B97257C4040L51894A51829F6342K30274i6419B82545L3313J43005D0632
13465A36528J24511K97561k36938q5434A15076Q4504D3290M31885e4980A49740
$$ y = [311179, 171468, 78779, 393983, 444630, 404842, 273486, 230455, 47489, 442255, 350827, 763635, 274005, 294764, 156690, 353254, 380623, 56501, 321864, 235384, 136225, 213970, 110764, 3455, 324853, 215441, 147966, 277251, 386097, 561604, 199065, 419755, 268380, -53242, 417591, 867420, 450514, 622524, 183156, 403236, 626553, 250782, 558144, 399123, 360290, 299814, 245700, 360234, 448085, 141488, 193286, 427969, 279225, 256335, 357856, 91068, 418185, 281555, 273962, -81872, 75581, 257818, 417232, 297257, 34040, 385934, 151829, 66342, 296616, -96419, 282545, 315858, 458863, 40632, 136528, 261039, 558600, 321662, 236228, 115076, 199580, 43290, 475175, -54980, 149740]
13454D30969H6428O1676c6729A64824L5469Q584C7754J01449I504N34960l7461
13443E07003j96730f4781C07578j45675K03947m797A03778D8586Q9195J89591
13433C27372J9059E1954R0720j5764l0605a0778p5502D08342a30668A02207a02297
13421D22990A05553J8277D5224K14981A4649O2558J79080O8208o9918J86765b4534
13409B99378P0631F6698J62566A03584D1485M3414J04772f8187A40549K03137
13399C43686j06718m1019e593A97669K2211p723p271L64899G1656a7449C60194
13387B93921q4238K57321B3041K98022F7152P2256E7764O7986K26176D5041J95224
13376B40265A17447K34054a51578A37081J84213F2921M1111L59733A33615a55774
$$ y = [430969, 86428, 148104, -36729, 164824, 200293, 208877, 37754, 139203, 9504, 544464, 507003, 310273, -64781, 307578, 161903, 365850, 361053, 103778, 48586, 137781, 327372, 346431, 51954, 142674, 126910, 96305, -10778, -86280, 408342, -130668, 102207, -102297, 422990, 105553, 123830, 45224, 260205, 14649, 77207, 256287, 324495, 254577, 441342, -24534, 299378, 370009, 66698, 229264, 103584, 41485, 84899, 189671, -68187, 140549, 343686, 236968, 195949, -5593, 197669, 219880, 212157, 204886, 569785, 71656, -17449, 360194, 293921, 209683, 467004, 23041, 321063, 67152, 139408, 57764, 125750, 351926, 45041, 240265, 117447, 351501, -151578, 137081, 321294, 62921, 104032, 463765, 133615, -155774]
13365a96330D21574K32679B56878j24329K9286K45992j33679j11551C3290a3508
13354A15997g5414C99035P6923j94109M7696o112m0398M2189K26769A90540O5777
13343B56317J2007b59096B18880L51535B59017I2133J86390j10176J90562q9082
13333B69827a3672D04673l4940H9353P1078J3384B4051R4016k5880J4106L59789
13322D66082r6233M2855J4106q5531A07053R0552i5128E4224o350L43302A89376
13310B72578J01953A37101e3671H850M17789A55680R6500j00832B4617Q9619J808
13299A16044K2483L61351j3690G4988M29986R1262A47935L65595A88795J351m0278
13288A49868l4730d7045I9664J05284J11628B0554N5679a02841A47517m5705J42539
$$ y = [-196330, 421574, 654253, 256878, 132549, 161835, 407827, 274148, 162597, 33290, -13508, 115997, -75414, 399035, 475958, 281849, 329545, 323433, 283035, 325224, 551993, 190540, 256317, 268324, -259096, 218880, 570415, 259017, 92133, 278523, 168347, 358909, 269827, -13672, 404673, 369733, 89353, 160431, 173815, 24051, 118067, 92187, 106293, 466082, 369849, 412704, 426810, 341279, 107053, 197605, -95128, 54224, 47874, 391176, 189376, 272578, 374531, 137101, -53671, 8850, 426639, 155680, 252180, 151348, 24617, 114236, 116044, 138527, 499878, 486188, 74988, 504974, 596236, 147935, 513530, 188795, 190146, 149868, 115138, -47045, 99664, 204948, 316576, 20554, 76233, -102841, 147517, 101812, 244351]
13277B44351b0180A00502E066J33746K340J4110c04820f303B13758D2405J74000
13266B16405M8081F1518L6545O9626o9667l8262a21888A26887B8104b92412Q5180
13255b07232E3170K97203A50750J56042G8087J83134l0551H7649Q4122F2272J06011
13244A68283K71332H3819O8042d3917A70104M2118C2434g486k5848D48216a67742
13232B24036f6405A38624m3713d0126j48640B6969L2716L12601m0923j35749F229
13220B24832j09871J23203b46980C69096M8269f6910A86282a05817d2359C49319
13209C32138L4906j16887l7133N060a33201j002A61135a04132A09526d0242B05296
13197b27211A12782D3463b5862j76634a1883H6408J29473c879H2818c9540B79198
$$ y = [244351, -20180, 100502, 5066, 138812, 141152, 155262, -304820, -6303, 213758, 42405, 216405, 264486, 61518, 98063, 167689, 98022, 59760, -121888, 126887, 28104, -292412, -207232, 53170, 350373, 150750, 306792, 78087, 261221, 230670, 87649, 171771, 62272, 168283, 439615, 83819, 151861, -43917, 170104, 212222, 32434, -7486, -33334, 448216, -167742, 224036, -66405, 138624, 94911, -40126, -188766, 26969, 59685, 372286, 331363, 195614, 6229, 224832, 114961, 238164, -246980, 369096, 417365, -66910, 186282, -105817, -42359, 349319, 332138, 367044, 250157, 213024, 218084, -133201, -134203, 161135, -104132, 109526, -40242, 205296, -227211, 112782, 43463, -25862, -202496, -11883, 86408, 215881, -3879, 82818, -39540, 279198]
13185B54655I9073O8569C8600h0747A47586l4712A8567J17254L039n8227a10061
13173a86005A26415l7986g961l10443A17170i7432F7378M85804a08948B59825
13162B32630a13496A70282K8209L07015D6470J78438K363r834a51570A03398M00371
13151E03769A44734K24442p9907f9720J3584G8951c2943A79967o0770l6877Q8226
13140A70546J60166J55974g3670k09407E2698J24163o74D0837J46852k2438Q1434
13129B46685k7870E2994c6999r7534A37156K70630E6748E179a43397Q906A25937
13117a32481A3408M1197J11629i1068H3531f1666A28779J65130n0540b34098Q8278
13106a45820E7978J12238j7086b22523C52852A10083f6801C74329A64251a35042
$$ y = [254655, 99073, 167642, 38600, -80747, 147586, 112874, 18567, 135821, 138860, 80633, -110061, -186005, 126415, 88429, -7961, -318404, 117170, -97432, 67378, 553182, -108948, 259825, 232630, -113496, 170282, 198491, 505506, 46470, 224908, 227271, 217437, -151570, 103398, 503769, 144734, 369176, 289269, -69720, -56136, 78951, -32943, 179967, 119197, 82320, 170546, 330712, 486686, -73670, -283077, 52698, 176861, 176187, 40837, 187689, 165251, 246685, 218815, 52994, -36999, -134533, 137156, 407786, 56748, 5179, -143397, -134491, 125937, -132481, 13408, 54605, 166234, -91068, 83531, -61666, 128779, 293909, 243369, -234098, -145820, 57978, 170216, 153130, -222523, 352852, 110083, -66801, 374329, 164251, -135042]
13095A88849P7918R5873n245B7197b24731A47758A7249J56555n5562n7055a83400
13083a10065A3155N0444K2211J11408k1555F8413a17283D7191b1058C3842q351
13072B5491J89946E5156J3545a31495n6719O4599A9515K05588H6762c72489Q7120
13061b85369G1856b93003B27404C7683b15179A0775K29233p0094b6191A42553
13050a28547B72119b9767B29086d2700q1242A93239M2624a12286A7677d989p1866
13039g6855B74977a12349B03417H2258E002a03920H1658b04013e8388A75856E030
13027B06695a9072D7964M3694b0012B54019C1213a38933O6445J1672A68796N0254
13016B19050P8066N2509b05826E09826b14300c0775I6430a67524d2334B71172
$$ y = [188849, 266767, 362640, 357395, 27197, -224731, 147758, 17249, 173804, 118242, 61187, -183400, -110065, 13155, 63599, 85810, 197218, 175663, 68413, -117283, 47191, -21058, 33842, 25491, 215437, 55156, 68701, -131495, -188214, -123615, 19515, 225103, 86762, -372489, -285369, 71856, -293003, 227404, 37683, -215179, 10775, 240008, 169914, -26191, 142553, -128547, 272119, -29767, 229086, -42700, -123942, 193239, 235863, -112286, 17677, -4989, -76855, 274977, -112349, 203417, 82258, 5002, -103920, 81658, -204013, -58388, 175856, 5030, 206695, -19072, 47964, 91658, -20012, 254019, 31213, -138933, -72488, -60816, 168796, 219050, 297116, 349625, -205826, 509826, -214300, -30775, 96430, -167524, -42334, 271172]
13005A44803k1610L4208Q0614p9195a13689M2616C9525K55692b57585Q3585P2611
12994a01389G9381J02387f2112q690A89180c3656C97187A94443b05515F1232B0743
12982f9145j81308C1699a5177G6404C07J65407L2583K22971a39958k02004F1236
12970c9303B03835o2263E4239M5318b83081H8005a85450A70960b76780B39017
12959b8321j29290c1379k69326B78022b8949E5650J43097e2438A11932D5625d3271
12947H0356i4107d0150H8605J34607H0651M361J97814A18822m681a91068A93422
12935h7077k22359B10773a31148c2886C96637d56062i7638B79535d8374A13858
12924D2219K81765a90702C1093K47077d4686k18019C69331A65826a9399j67409
$$ y = [144803, 123193, 157401, 238015, 158820, -113689, -71073, 39525, 295217, -257585, -174000, -101389, 79381, 181768, -62112, -70802, 189180, -33656, 397187, 194443, -205515, 61232, 20743, -69145, -250453, 31699, -15177, 76404, 307, 165714, 198297, 421268, -139958, -341962, 61236, -39303, 203835, 141572, 54239, 99557, -283081, 88005, -185450, 170960, -276780, 239017, -28321, -157611, -31379, -300705, 278022, -28949, 55650, 198747, -52438, 111932, 45625, -43271, 80356, -94107, -40150, 88605, 223212, 80651, 85012, 282826, 118822, 114141, -191068, 193422, -87077, -309436, 210773, -131148, -32886, 396637, -456062, -97638, 279535, -48374, 113858, 42219, 323984, -190702, 31093, 278170, -44686, -262705, 369331, 165826, -19399, -186808]
12914a86808E1626B5531a47697e4652j06132D03887j27096j27660B3123Q8700
12904A11823J6633a13789A38507a35056H1301m559J08303a0483B17525F6110h4604
12892C9649R7251c3230o1980j30491a09300e087A14099i3588B44721a31080A17597
12880a86310B8173d8341A68119G6619e6021A11215l5023C6952a51524j54470c4047
12868i8555C18970d6226l72704a86592m9911g4762H4416a27334L6566L4863A81896
12856a64692j48443i124B30843c38743a54175A78096o2603a14716C2708J13269
12846A45977c48812A56142e0783A59752N2232a49610G4872i3133D6028b35337
12835H2269d3168q4546j09050H8723P8067r794a3556k12608e0511E9248K6192
$$ y = [-186808, 51626, 25531, -147697, -54652, -160784, 403887, 276791, 149131, 23123, 111823, 128456, -113789, 138507, -135056, 81301, 76742, 185045, -10483, 217525, 66110, -84604, 39649, 136900, -33230, -95210, -225701, -109300, -5087, 114099, -93588, 244721, -131080, 117597, -186310, 28173, -48341, 168119, 76619, -56021, 111215, 76192, 36952, -151524, -305994, -34047, -98555, 318970, -46226, -418930, -186592, -236503, -74762, 84416, -127334, -90768, -55905, 181896, -164692, -313135, -9124, 230843, -338743, -154175, 178096, 115493, -114716, 32708, 145977, -348812, 156142, -50783, 159752, 211984, -149610, 74872, -93133, 46028, -235337, 82269, -43168, -127714, -236764, 88723, 166790, 156996, -13556, -226164, -50511, 59248, 85440]
12824H5440J74219B8990i2894n6257A2736J18467a03356B2086J44429K31371a39920
12812C8320J62381a49631B18198a22912A84902c02530a12566C82352C0173J1601
12802D1774N815K0312k4645a34483d6776k54990j6061C9139J3932J75889F7303
12790B34984c74717B81930A14301N3641c4847l0658A43426k7579e8358b3189j49169
12779a72358B9371J4579a65G7248a79616B60790M2480j44508d03837H3100P672
12768I0772a89678D6737b3881k42376B87104a90754A40141j8639a20389j31603
12758b51992n5178B1235c34695g798A97306A0371Q719a66347K5544N5935C31148
12746h7920k7024A4370J27534J46150A19497b62661a3208C3751q595a25267N2634
$$ y = [85440, 259659, 28990, -92894, -149151, 12736, 131203, -103356, 22086, 166515, 397886, -139920, 38320, 200701, -149631, 218198, -122912, 184902, -302530, -112566, 382352, 30173, 41774, 47589, 67901, 43256, -134483, -46776, -301766, -317827, 39139, 53071, 228960, 67303, 234984, -374717, 281930, 114301, 167942, -34847, -65505, 143426, 115847, -58358, -23189, -172358, 29371, 43950, -165, 77248, -179616, 260790, 303270, 158762, -403837, 83100, 90772, -189678, 46737, -23881, -266257, 287104, -190754, 140141, 121502, -120389, -251992, -307170, 21235, -334695, -7798, 197306, 10371, 19090, -166347, -140803, -84868, 331148, -87920, -114944, 14370, 141904, 288054, 119497, -262661, -13208, 33751, 25156, -125267, -72633]
12735g2633E292J5594h098j26312A30002A8029L90403l9266A07836a80371j70187
12724c50558A39035K790A2455n563a87353j5689F4194K10265b14488b9623A25386
12712b15243E6084E817M00842j07249j20305f7402C7681K38622A20291a90547
12701A35831g2734C88207A64203J77758A10094R6781g9072C11149q6395D1146
12690C95701a03519b0571D01540a14263e3773A36626E9342K08825G8076a6809
12679a57727p4833m6700C19802k8125a55528L327J9015M477B03573f0977B5937
12667F9022c7690B48695b62385H4385K91041j15021b74601c3809j32847B28978
12656A53682G0382b8500C39952a71329E8447P2316J81328a5487j37524F6727f4686
$$ y = [-72633, 5292, 20886, -8098, -134410, 130002, 18029, 408432, 369166, 107836, -180371, -350558, 139035, 141825, 12455, 6892, -187353, -203042, 64194, 274459, -214488, -29623, 125386, -215243, 56084, 5817, 406659, 299410, 179105, -67402, 37681, 276303, 120291, -190547, 135831, -72734, 388207, 164203, 341961, 110094, 206875, -79072, 311149, 224754, 41146, 395701, -103519, -20571, 401540, -114263, -53773, 136626, 59342, 268167, 78076, -16809, -157727, -232560, -279260, 319802, 291677, -155528, -152201, -133186, -128709, 203573, -60977, 25937, 69022, -37690, 248695, -262385, 84385, 375426, 260405, -274601, -33809, -166656, 228978, 153682, 70382, -28500, 339952, -171329, 58447, 130763, 312091, -15487, -153011, 66727, -64686]
12644A09835a16894A12448a78210A11843J21563A07689b8976B05035J29687l8948
12634B95774A02217J90824a04652C6728O2339d5538B86824a71782H8409K00627
12624B89036j24088a04207k47568B84183H015a87115F8149K3833B7836r294C862
12612A36845l4003N0344P7936C3674O2112c5702B1568K27962A18438J04869f4069
12600I7243f8106A03616g4900A50125K04615a55304G3972f487C6390b19672L9121
12589a80551E8321J86515f7913B34463G8968j2494K89015A76488l686H4389l7910
12578D6479K0794a04957j44431p6602A24854A5820c27366A87168m4305F9144a47627
12566A06069b33213R4601e6269A2272a7542B31411f1920H203a12351A46890n4408
$$ y = [109835, -116894, 112448, -178210, 111843, 233406, 107689, -28976, 205035, 334722, 295774, 102217, 293041, -104652, 36728, 99067, -45538, 286824, -171782, 88409, 289036, 164948, -104207, -351775, 284183, 8015, -187115, 68149, 91982, 27836, 18542, 3862, 136845, 102842, 153186, 231122, 33674, 95786, -35702, 21568, 249530, 118438, 223307, -64069, 97243, -68106, 103616, -74900, 150125, 354740, -155304, 73972, -6487, 36390, -219672, -180551, 58321, 244836, -67913, 234463, 78968, 66474, 355489, 176488, 172802, 84389, 46479, 67273, -104957, -249388, -325990, 124854, 15820, -327366, 187168, 142863, 69144, -147627, 106069, -233213, -138612, -56269, 12272, -17542, 231411, -61920, 8203, -112351, 146890, 92482]
12555I2482K3319a27293B77633q3975a63198A28242J8022C885b6141l9129j18453
12544a83723A27227e8807j0359F0731c5750A0498d7302J5712p9689j21726i1799
12532B60336c85646B61555d50833e3674j72763C0254a26264G4624b80667P2538
12522b08129C5007E570c00897A54064D9658b89360G5948a57562A23637K5246o2977
12511H5906Q9126a92485g4115k14587A4360o701L4503a49984B6140a0099B61424
12499a72383H9380a4363B63419m9871p6650c08395D3115J29228a91824G6150J43974
12488B20124j5886d7470k27525A90983a30259D79511G8964L7931c0314A26610
12477e4418j38582J5866B3721c7526k7340A89990f5440E2556i6045B27806A224
$$ y = [92482, 115801, -127293, 277633, 193658, -163198, 128242, 146264, 3885, -26141, -65270, -183723, 127227, -58807, -69166, 60731, -35750, 10498, -47302, -31590, -111279, -233005, -91799, 260336, -385646, 261555, -450833, -53674, -226437, 30254, -126264, 74624, -280667, -208129, 35007, 5570, -300897, 154064, 49658, -289360, 75948, -157562, 123637, 148883, 85906, 175032, -192485, -74115, -288702, 14360, 7659, 42162, -149984, 26140, -10099, 261424, -172383, 89380, -14363, 263419, 213548, 136898, -308395, 43115, 172343, -191824, 76150, 220124, 204238, -47470, -274995, 190983, -130259, 479511, 78964, 116895, -30314, 126610, -54418, -193000, -177134, 23721, -37526, -64866, 189990, -65440, 52556, -96045, 227806, 1224]
12465a32534e6635D72343I4509f1392E7732a58844I9060B3631K66421r5311e7649
12453h6573l5789D63161i2708A84581b3124l51731a38353B84913q2910a13124
12442B1056N2814e7209D66c02151A8577a58151m4882F9322J98784c15143a00420
12430b00399g5160B04297A106K48055d06004B4769c4847A63161E6716J4022J68052
12419B38790a27685C50912a99773h1333C26359A45742a88011B6827P7246a22435
12408B9382b1B89712N5244h8062B75945B3174b50720B8663K41370b26376a08109
12396C64394D3100j7622K77824b27982A19217b69578C3235a86999C1790M8096
12386G9886N3932o2948c05428F9602J39340G2181b6950k63763I9216b20j28484
$$ y = [-132534, -56635, 472343, 94509, -61392, 57732, -158844, 99060, 23631, 290052, 194741, -57649, -86573, -122362, 463161, -92708, 184581, -23124, -374855, -138353, 284913, 202003, -113124, 21056, 73870, -57209, 466, -302151, 18577, -158151, -203033, 69322, 268106, -315143, -100420, -200399, -75160, 204297, 1106, 249161, -406004, 24769, -34847, 163161, 56716, 70738, 238790, -127685, 350912, -199773, -81333, 326359, 145742, -188011, 26827, 104073, -122435, 29382, -21, 289712, 344956, -88062, 275945, 23174, -250720, 28663, 270033, -226376, -108109, 364394, 43100, 25478, 303302, -227982, 119217, -269578, 33235, -186999, 31790, 79886, 133818, 70870, -305428, 69602, 208942, 72181, -26950, -290713, 99216, -220, -128704]
12375a28704F6766b46359A73545J53309d5910m23034a4890A41154K0249C7195
12364a12582A39980C0596r200b734F0947A3438J78813a28970j58427F3696b33077
12352e5221B12195a9839k09247A84083G0455K24154j14148a61026K4807A41232
12341f7391g751I8985a2150p0320o8991B21098b73766k4481I2813a2876E87713
12329H3121e1412a949j02841C5847c986l68949A80826a32284D22106A52587e9206
12317A65180o7017a35429c5207E27171F8173R4005b3320C35447F8410Q1699J89103
12306C39212p3582G4481K62722b52596B94257o2533l4818J9651F2859A3324L07856
12295C21180D4485a25142C42572F9997J23332e5837j21641A62860e9809C0889
$$ y = [-128704, 66766, -246359, 173545, 326854, -45910, -468944, -14890, 141154, 161403, 37195, -112582, 139980, 30596, 21396, -2734, 60947, 13438, 192251, -128970, -287397, 63696, -233077, -55221, 212195, -19839, -229086, 184083, 70455, 294609, 180461, -161026, -136219, 141232, -67391, -7751, 98985, -12150, -82470, -151461, 221098, -273766, -298247, 92813, -12876, 587713, 83121, -51412, -1949, -104790, 35847, -3986, -372935, 180826, -132284, 422106, 152587, -59206, 165180, 98163, -135429, -35207, 527171, 68173, 162178, -23320, 335447, 68410, 150109, 339212, 265630, 74481, 337203, -252596, 294257, 231724, 196906, 216557, 62859, 13324, 321180, 44485, -125142, 342572, 69997, 193329, -55837, -177478, 162860, -59809, 30889]
12284i9054F4053a18299k7463m0766A26412j65n4087k6060K26051a59195D2269
12272C62940F4774c3029F0293h3437A25429a11077B7258a9077A16021J905a08881
12260A06416a84533d0485m779A22652m8717j4457i8135B01197p2421a33759d7295
12248A28953N8873b3421l8542B371h1010H5604J88149A1839J04851d2203F7090
12236C79112p849A42893o1881J66123i8886B54208L42178a38444k3225O9265A38772
12224e2538m5358C24060j50421b02546R3349A37174o6564M28108d8787k38406
12214b87193B20293E3007L28299o7098Q917A73J82005m9666h8397C48363j28142
12203B20221j01810M02405F0282M1513B8063C996J23939J07883a69030K6792D09703
$$ y = [-99054, 64053, -118299, -145762, -186528, 126412, 126247, 72160, 46100, 272151, -159195, 42269, 362940, 64774, -33029, 60293, -83437, 125429, -111077, 27258, -19077, 116021, 117926, -108881, 106416, -184533, -40485, -45264, 122652, 73935, 59478, -98135, 201197, 128776, -133759, -47295, 128953, 187826, -23421, -61963, 2371, -81010, 85604, 273753, 11839, 116690, -42203, 67090, 379112, 371263, 142893, 81012, 247135, -98886, 254208, 596386, -138444, -161669, -92404, 138772, -52538, -97896, 324060, 173639, -202546, -109197, 137174, 70610, 498718, -48787, -287193, 220293, 53007, 381306, 314208, 323125, 173, 182178, 132512, -88397, 348363, 220221, 118411, 520816, 60282, 101795, 28063, 3996, 127935, 235818, -169030, -142238, 409703]
12191B45851h1097q8622B05416E8427A4544L47563a6439f116F0803k2077M06041
12180D44767A41530K12641H2985N02381A95260L13046j68585b9730j32684B7278
12169A44437a89419A96366B6800K70824I0268J97172F7208J08965K25314C7242
12158B73259P422b09713i9645R797A08067K21200r0532I6102L3699J17585G5702
12146C12313n7181C7494K81538A03257K35652f1826m6937A08670j1303J66334
12136B63701j4281j24561m8854J29612R669n8753C2830K14950h8890C82762g5395
12124g9763B16647L5915d85194A10693J91363A05668J18282q1113a1590A3578
12113B84824a21262E3042K13930j09163b60937B10473A242L03517f5973k20849
$$ y = [245851, -81097, -169719, 205416, 58427, 14544, 362107, -16439, -6116, 60803, 38726, 444767, 141530, 354171, 82985, 585366, 195260, 508306, 339721, -29730, -162414, 27278, 144437, -189419, 196366, 26800, 297624, 90268, 287440, 67208, 176173, 401487, 37242, 273259, 280681, -209713, -99645, -89848, 108067, 329267, 238735, 96102, 129801, 247386, 75702, 312313, 255132, 37494, 319032, 103257, 338909, -61826, -108763, 108670, 97367, 263701, 249420, 124859, 76005, 205617, 215286, 156533, 32830, 247780, -88890, 382762, -75395, -79763, 216647, 252562, -485194, 110693, 302056, 105668, 223950, 142837, -11590, 13578, 284824, -121262, 53042, 266972, 157809, -260937, 210473, 1242, 304759, -65973, -286822]
12103b86822A20325J71440j24297F9905a98925L0514C92956j4204i710A1150J64097
12092A75247K65388I7041m8231d7324D5555J41146K6606i9755k7090j46756I8715
12080E32071I6207B8919c1123B10411n9206F7066a51265A16359Q960P6913a01234
12068e9969A70052P5108H7765J0150J42879B9131L5592d5166F4308b1628C47256
12056B6721J581L59318A39117M677D7828N7743r749o952l1989J48371b04193P3138
12044a31055H8541a55117K4660j27759f1547A4782b37824A32553D8405c703B51281
12032G7561a12015f257k56795I6407L6929b49105e1075j7531J4268a8474A64831
12020a9775j62864A38095J8972n0553A7896J33262B0312K22677h4498c2183A61587
$$ y = [-286822, 120325, 291765, 167468, 69905, -198925, -168411, 392956, 378752, -9710, 11150, 175247, 440635, 97041, 48810, -47324, 45555, 186701, 213307, -99755, -126845, -273601, 98715, 532071, 96207, 28919, -31123, 210411, 151205, 67066, -151265, 116359, 125319, 202232, -101234, -59969, 170052, 245160, 87765, 97915, 240794, 29131, 64723, -45166, 64308, -21628, 347256, 26721, 28302, 387620, 139117, 143794, 47828, 105571, 95822, 88870, 56881, 205252, -204193, -131055, 88541, -155117, -130457, -258216, -61547, 14782, -237824, 132553, 48405, -3703, 251281, 77561, -112015, -6257, -263052, 96407, 133336, -249105, -51075, -68606, -54338, -18474, 164831, -19775, -182639, 138095, 157067, 106514, 17896, 151158, 20312, 242989, -84498, -32183, 161587]
12008a13479B00724j2132b69329B91252j17509a04151A20578d38193B47609b3759
11997C6092N2434j4467L42991A49516b3042B07491I2902a3395A4561b6811k29504
11986b56315i0585C5471i8185B07341j5869a83764B46993D4504k0973J17600a68528
11974C5228O2045J61577D3707I197J23658M2867c22457a32199d5961j62668A95559
11962a27765K1342A87318J46862A0413J20913C4786h2571F6008k2548c54679N8750
11951b95929C12664f5002F3747e2761b1583m9971k98668D32667C1179J12400K1558
11940A65137g3565A90928h5055D6312h4672j0142A02759c54915A92434p9241a07108
11928D8741O1497b02231E8876I692a32681E4447a1008l53419C45639e3266A1948
$$ y = [-113479, 200724, 188592, -269329, 291252, 173743, -104151, 120578, -438193, 247609, -23759, 36092, 88526, 74059, 417050, 149516, -23042, 207491, 92902, -13395, 14561, -26811, -256315, -90585, 35471, -98185, 207341, 191472, -183764, 246993, 44504, 23531, 141131, -168528, 35228, 97273, 258850, 43707, 9197, 132855, 175722, -322457, -132199, -45961, -208629, 195559, -127765, -106423, 187318, 334180, 10413, 131326, 34786, -82571, 66008, 43460, -354679, -295929, 312664, -65002, 63747, -52761, -21583, -71554, -370222, 432667, 31179, 143579, 165137, -73565, 190928, -85055, 46312, -84672, -94814, 102759, -354915, 192434, 113193, -107108, 48741, 110238, -202231, 58876, 9692, -132681, 54447, -11008, -364427, 345639, -53266, 11948]
11916A11907B3995P5976a09835e0747E9458a71662f5558r5791a0454A18374I419
11904E8043L5428A4772h3250A26509Q7151C3519A3031a38560G8025a01046L1771
11893f9275j04480G6700a71811l3141j67296h622A19865D6392Q2809a28576j83370
11882c11946N4338d1451A97610a15538j29911d6611a3460A2601a50865j67097
11872c17962C55955A59402c42721F6076a06820L0185j42187K4486J1091A105L0568
11861C1673c64502b5553q8010C23173a17039F5621J7846j6240b25982A03239D4843
11849B9667P0035l4924a95515c4749m1366C08637A41724a03910A08282D0990h2406
11837h1154m4097N8720F314b94488B2120d2646k02435D63809I6915b60014D4366
$$ y = [111907, 23995, 99971, -109835, -50747, 59458, -171662, -65558, -161349, -10454, 118374, 9419, 58043, 93471, 14772, -83250, 126509, 213660, 33519, 13031, -138560, 78025, -101046, -69275, -173755, 76700, -171811, -204952, -372248, -8622, 119865, 46392, 129201, -128576, -311946, -257608, -41451, 197610, -115538, -245449, -46611, -13460, 12601, -150865, -317962, 355955, 159402, -342721, 66076, -106820, -76635, -218822, -194336, -183245, 1105, 31673, -364502, -25553, -113563, 323173, -117039, 65621, 83467, 67227, -225982, 103239, 44843, 29667, 99702, 64778, -195515, -34749, -76115, 308637, 141724, -103910, 108282, 40990, -82406, -81154, -125251, -66531, 6314, -294488, 22120, -42646, -245081, 463809, 96915, -260014, 44366]
11825a47428A81101b13292A67605g8010A56631A4978h6977l1643o1271A0425L4827
11814D5252g2212b5058j45886F7844O9995D6791a76930j10211B25430J30088b31663
11802a31281n4896g4974l8851o0057q8507B49442a7661C1002J19629b83006k15849
11791d98855J65034c6961k9567j34112P975N159Q2080q1846i1166l12998h2277
11779b4400j73988g3336q173l07525J53108f632B83221b46708h9399H9898L0404
11768A20302M2961b0276C22042A08643d0721l54397F8443c8040o4951A14962l0008
11757H4954d3195a6642k10503H8328R957P0064a55558A18584a28027C12877b99722
11745d4250F7438b17942A25929a44622A29080C520b319p0235B56148I6231N2240
$$ y = [-147428, 181101, -213292, 167605, -78010, 156631, 14978, -86977, -118620, -179891, 10425, 45252, -72212, -25058, -170944, 67844, 137839, 46791, -176930, -287141, 225430, 355518, -231663, -131281, -186177, -74974, -113825, -173882, -262389, 249442, -17661, 31002, 150631, -283006, -498855, -333821, -36961, -66528, -200640, -192665, -187506, -105426, -187272, -91166, -404164, -82277, -24400, -198388, -73336, -81509, -389034, -235926, -6632, 283221, -246708, -89399, 89898, 120302, 163263, -20276, 322042, 108643, -40721, -395118, 68443, -38040, -102991, 114962, 84954, -43195, -16642, -227145, 88328, 98285, 168349, -155558, 118584, -128027, 312877, -299722, -44250, 67438, -217942, 125929, -144622, 129080, 3520, -2319, -72554, 256148, 96231, 148471]
11734A48471a55444A23752J75419q5329f4458n6565b6826E7623J48227D1478c43215
11722d5970B08597I642b59072B19043A3462g0615p1493c8571j34020B43649H9481
11710b91772d2059C70306b81397B06076i4185b3247o3481l36596a27703A32457
11699I9814m4321Q9360N5179J02401c32359a4349J183B51642b7434B2735J1260
11688C3995J96716b41545a8111B26395K1587j04623a3502B95885O7963a33374
11677D9195d27360B47233a26367C8277h9953H2548a8296k1085B12210L2618a55039
11665E7871B278K44772j02381h59F7347i0323k01278A04147b09876D6673M5058
11654I1731c64991e3272o4392D2523c82380B45830i8151M4968A47289e3272j22539
$$ y = [148471, -155444, 123752, 299171, 213842, -64458, -121023, -26826, 57623, 205850, 41478, -343215, -45970, 208597, 9642, -259072, 219043, 13462, -70615, -142108, -38571, -172591, 243649, 89481, -291772, -42059, 370306, -281397, 206076, -94185, -23247, -86728, -423324, -127703, 132457, 99814, 55493, 144853, 200032, 302433, -332359, -14349, -13166, 251642, -27434, 22735, 33995, 230711, -241545, -18111, 226395, 247982, 143359, -13502, 295885, 363848, -133374, 49195, -427360, 247233, -126367, 38277, -89953, 82548, -18296, -39381, 212210, 244828, -155039, 57871, 2278, 247050, 144669, -859, 67347, -90323, -291601, 104147, -209876, 46673, 91731, -364991, -53272, -117664, 42523, -382380, 245830, -98151, -53183, 147289, -53272, -175811]
11643a75811B4874K38562n5740F8534h990A4404L55120a02526d9373K0485B18796
11631A70068f5476k06004j20795B51809b32198R7023J2990p9079B4608K6577b5573
11619b9952A01998e4232I7084A2830Q2755I441d0517j05644L6797b5386k86143
11608c11529D24278G9372a09910G6380J56666d0889A22230P5501a5628F9303a82776
11596a58882F8901B5902a72595h5243j7389E6069a87353j02333J05933h9904a0514
11584F080M6656a53871B49429j11548j2046a10342L6255A9134L6707j7371g2471
11572e324G8657A8380g5373a7716I295J73108a86116c812N13j60362M6421a4740
11559A23365N5504F2106J13728F7357j3143K91919E5085K23796A2970K33420F9675
$$ y = [-175811, 24874, 263436, 207696, 68534, -8990, 14404, 369524, -102526, -49373, -28888, 218796, 170068, -65476, -271480, -392275, 251809, -232198, -135175, -122185, -201264, 24608, 51185, -25573, -29952, 101998, -54232, 97084, 12830, 95585, 9441, -40517, -146161, -109364, -25386, -311529, 424278, 79372, -109910, 76380, 233046, -40889, 122230, 197731, -15628, 69303, -182776, -158882, 68901, 25902, -172595, -85243, -102632, 56069, -187353, -289686, -183753, -89904, -10514, 6080, 52736, -153871, 249429, 137881, 125835, -110342, -74087, 19134, 55841, 38470, -72471, -5324, 78657, 18380, -75373, -17716, 9295, 182403, -186116, -3812, -3299, -163661, -117240, -14740, 123365, 178869, 62106, 175834, 67357, 54214, 346133, 55085, 278881, 12970, 246390, 69675]
11547a44451C39986I3923M22655I4729a39033G9035K87988d3941b1430l074A01820
11535a38715j73245B71906b4581m580J4360D8359q178J62007q6358E2081l487
11524D8594c9061k74257B17938m7770a85610A02170m3313L4958j6333b09835A61372
11512B4874Q4670E4324a22498A60948b057p98k8103G4305j9747J28684b4182A54706
11499D7850J78434H0474J24335B7371L67048G8228b54126A18596m1172K74995
11489C52419b0262m0372G227J3763J84256a8199A50579a25240A1446M26786p9621
11478C58611f2775J8617A48842E8166M7016a0779D8580L543b07956A54583G95
11466A18401K6029D531L02026A06334N1290L6214a51187O4420B87038I2310J10060
$$ y = [-144451, 339986, 93923, 516578, 94729, -139033, 79035, 367023, -43941, -21430, -24504, 101820, -138715, -311960, 271906, -24581, -29161, -14801, 48359, 40181, 202188, 115830, 52081, 48594, -39061, -313318, 217938, 170168, -185610, 102170, 58857, 93815, 77482, -209835, 161372, 24874, 109544, 54324, -122498, 160948, -2057, -2855, -30958, 74305, 54558, 183242, -24182, 154706, 47850, 226284, 80474, 204809, 27371, 394419, 78228, -254126, 118596, 77424, 352419, -20262, -60634, 7227, 20990, 205246, -18199, 150579, -125240, 11446, 438232, 358611, -62775, -44158, 148842, 58166, 105182, -10779, 48580, 52123, -207956, 154583, 795, 118401, 144430, 4531, 306557, 106334, 157624, 193838, -151187, -86767, 287038, 92310, 202370]
11455B02370J31467e2276K0980B4735A1730f3331A60678m913G3216J32323k1228
11444A84311E6964a80645A38347B2942Q3175J09624M2841E4851L04286j7414c509
11432A48769O2987I4293K14139j4880C3931l563a81587A34275R2175A09507b01895
11420F3124M2487a14238l6134E9438P5033a48871A16282J6551i138I1192g1723
11408e009k79900D8074P9834J43156G0048b0677I9997b36080A65202E417L50352
11397C55769A28151M0168g3417G7768n319J16590f1168n1468b3138k00496B73456
11385a85797A14506N6438g5913F903c9102A31503J49693b72300k2332E545a11983
11373H5016C1813h58k46762R2647f365D45933a01667C2661e6800A58418p5121
$$ y = [202370, 333837, -52276, -31296, 24735, 11730, -63331, 160678, 155765, 73216, 205539, 184311, 56964, -180645, 138347, 22942, 106117, 215741, 258582, 54851, 359137, 341723, -3509, 148769, 211756, 94293, 308432, 293552, 33931, 30368, -181587, 134275, 226450, 109507, -201895, 63124, 105611, -114238, -150372, 59438, 134471, -148871, 116282, 132833, -9138, 91192, -71723, -5009, -284909, 48074, 127908, 271064, 70048, -20677, 99997, -236080, 165202, 5417, 355769, 128151, 168319, -73417, 77768, 72449, 189039, -61168, -112636, -23138, -223634, 273456, -185797, 114506, 170944, -75913, 6903, -39102, 131503, 281196, -272300, -294632, 5545, -111983, 85016, 31813, -858, -247620, -154973, -6365, 445933, -101667, 32661, -56800, 158418, 83297]
11362H3297R3372F9227J04088m7303b25935R9000B310c33087A03989J0134a86269
11350i1026j6908j26153A85480b03664f3928n6747b734l2867r3557n7587D5165
11338c22588H9985L181b7794j36014C814h9171j34050C631a23991k5648B18038
11326A7553a02671A77471A3436a30162q5248P1401B03421r7329g7113l64329C586
11314b57497O1665e0945a9700r469o1353L8850b5339n7898a8957H2246K32702
11303C14948A24739J72774a33858o8785h9691i150j81524A75827G5872a11066
11292A28040h7467c3041B42560c39592J66010f4070B06186b06247C7143c16082
11281a6327B3826c88451b7578j16000k99713a47120L1258k45650A71106G3595
$$ y = [83297, 176669, 69227, 173315, 126012, -225935, -126935, 2310, -333087, 103989, 114123, -186269, -91026, -107934, -234087, 185480, -203664, -63928, -120675, -2734, -35601, -129158, -186745, 45165, -322588, 89985, 93166, -27794, -163808, 3814, -89171, -223221, 3631, -123991, -149639, 218038, 17553, -102671, 177471, 13436, -130162, -215410, -144009, 203421, 106092, -77113, -441442, 3586, -257497, -195832, -50945, -19700, -29169, -90522, -51672, -25339, -83237, -18957, 82246, 314948, 124739, 297513, -133858, -202643, -89691, -9150, -190674, 175827, 75872, -111066, 128040, -87467, -33041, 242560, -339592, -173582, -64070, 206186, -206247, 37143, -316082, -16327, 23826, -388451, -27578, -143578, -443291, -147120, -115862, -361512, 171106, 73595]
11270i4509o5610A34903c83846i5262d5882A38351c19864f6070A04289J71851
11260B76140b91503C9588Q0352m5039R8488a76323C909h6351a5951k0555m4105
11249h0611J576I8134J54531b05163I184Q2822b15086a0175J706r9548K1122E591
11236a59128L6425L6213l735B46895e3379j3219F7972c5439G8789a7773F5383
11224B08601C6182Q61G259a09943F0034c25027J12554C64326a79748A16776b43237
11212a33755A08092c8911l31602B61607a02593C6340a36994l0615Q1396B2416
11201c11747J07262i8114o8029J8237l5919B2245e8642j59488Q0006F7271b30188
11189C47883a47456J2052n3477c8638k30776P1308h534j00338k12041d4285B1945
$$ y = [-94509, -160119, 134903, -383846, -95262, -45882, 138351, -319864, -66070, 104289, 276140, -291503, 39588, 119940, 74901, 173389, -176323, 3909, -86351, -15951, -36506, -80611, -79035, 98134, 252665, -205163, 9184, 92006, -215086, -10175, -8469, -108017, -86895, 5591, -159128, -122703, -86490, -90225, 246895, -53379, -66598, 67972, -35439, 78789, -17773, 65383, 208601, 36182, 37043, 7259, -109943, 60034, -325027, -212473, 364326, -179748, 116776, -243237, -133755, 108092, -38911, -370513, 261607, -102593, 36340, -136994, -167609, -86213, 22416, -311747, -204485, -98114, -166143, -147906, -183825, 22245, -58642, -218130, -138124, 67271, -230188, 347883, -147456, -135404, -188881, -38638, -269414, -198106, -8534, -108872, -320913, -44285, 21945]
11177a32639b1545j55499A76214b75904d9289a8276j36760L8991j35747e7421
11166a41631A71586C0394c35713A15215h1687r8050I891c88978k3523b6576j06985
11155a33561k7725g9003l6697D23548b81407e06B3819b54582B84850b85975E6000
11143c8940j43500C46602q9921J06667D677Q3320g1085j58007M0577H0438b1992
11131b234E9853n004i2253K7522A40748d0167I0432g4926B53384A05249a32944
11119I051O1371M2917n5230J45982m9886g2528b8781F66166a43770O5422b0442
11107e334n3096B50696N5783a76429E1730K24404o4878h9178a078B09883F9763
11095B18441E7328K57355E5788P2125m0267b17000B99138a98523B96788b10065
$$ y = [-132639, -21545, -177044, 176214, -275904, -49289, -18276, -155036, -116045, -251792, -57421, -141631, 171586, 30394, -335713, 115215, -81687, -179737, 9891, -388978, -412501, -26576, -133561, -161286, -79003, -115700, 423548, -281407, -506, 23819, -254582, 284850, -285975, 56000, -38940, -182440, 346602, 256681, 363348, 4677, 87997, -71085, -229092, -188515, 80438, -21992, -2234, 59853, 54849, -92253, -64731, 140748, -40167, 90432, -74926, 253384, 105249, -132944, 9051, 70422, 113339, 58109, 204091, 154205, -72528, -28781, 666166, -143770, -78348, -20442, -5334, -58430, 250696, 306479, -176429, 51730, 276134, 211256, -89178, -1078, 209883, 69763, 218441, 57328, 314683, 55788, 127913, 87646, -217000, 299138, -198523, 296788, -210065]
11084B05711R0169A47612j1632a22013B74632o8364a33717A06472E810K07581
11074B13391k0993p4333J60250c4704A05659A1267M82144k43676R9261G3596M3130
11063A16726L21423K714k07605E1706L95214j92777r62J36100j08576A12454J79147
11052B91601N2649o8610M7005m7213L19812p1321M7212N527P4o224P6279j01192
11040E45599l667J42200l22876L00749K4492M9299j06047k58764M30964l81667
11030D20282M60208m9952l16081R2449j0809M93270m76325j00804Q4525J63967
11020G60730k85331J48285J56758k1567j50517L63133l06096J97447j42995p1164
11010F48683L78270k05650M758k56229K76810n5203j97015q995j57990P8367M07894
$$ y = [205711, 295880, 147612, 135980, -122013, 274632, 206268, -133717, 106472, 5810, 213391, 192398, 118065, 278315, -34704, 105659, 11267, 493411, 249735, 348996, 73596, 116726, 438149, 440863, 233258, 51706, 446920, 254143, 253181, 389281, 280705, 112454, 291601, 344250, 275640, 322645, 275432, 595244, 523923, 571135, 576662, 576736, 570512, 646791, 545599, 541932, 684132, 361256, 662005, 686497, 735796, 629749, 370985, 801949, 420282, 880490, 830538, 514457, 606906, 596097, 1089367, 613042, 512238, 596763, 760730, 475399, 623684, 780442, 758875, 608358, 971491, 665395, 862842, 719847, 648683, 1026953, 821303, 826061, 569832, 846642, 791439, 594424, 585429, 427439, 505806, 913700]
10999I13700D40915K68777l09658L50294j70528K09022n9009k19969K36967k05300
10989E41511A76326N12059B87683L32125j69859J08518j59026p0254M93408k00859
10979F21736j34629n5021L22448K16452k98380j29590M37925k97878M00107j49676
10969I33494j55369L64360p5137J30259o478l44081K03232J97800n0184k853L59922
10958A554965J69060J14551k46218M63003R3701L74214K54381m44294j06563o1958
10948B164842J08265j77725k75213l61845L1921l41069K49594p4743K04616k08340
10938A320303j19861K19173R996l78040K38664j51118k18884j56553q8434j18686
10928E56560j29292K7013k15378L1466N5588q3807j3515J8826q8067D4000a57617
$$ y = [913700, 440915, 709692, 400034, 750328, 579800, 788822, 729813, 509844, 746811, 541511, 176326, 688385, 287683, 619808, 449949, 558467, 399441, 329187, 822595, 621736, 487107, 432086, 754534, 970986, 672606, 543016, 980941, 683063, 1083170, 933494, 778125, 1142485, 1067348, 1197607, 1191129, 847048, 1050280, 1248080, 1197896, 1195043, 1554965, 1724025, 1838576, 1592358, 2055361, 2149062, 2523276, 2777657, 2333363, 2226800, 2164842, 2273107, 2095382, 1820169, 1458324, 1490245, 1149176, 1398770, 1324027, 1528643, 1320303, 1200442, 1419615, 1429611, 1051571, 1290235, 1139117, 920233, 763680, 675246, 556560, 427268, 454281, 238903, 270369, 325957, 242150, 228635, 247461, 159394, 44000, -157617]
10916a57393A27584a20334B09963i7017D2955k0830K99149A13834J26921a84442
10905a87650p3965A86572a45798k27152B51973b55497f1538F0039a00275A16810
10894A86341a05312q381H3081P2059j4472c6277D5774P1890f9278k29870A55751
10882A4112a83477B97769c4399D55490h2950A11789J6393Q4596e4629k31570D9815
10870b08261R0070A19216A600a92048o8050Q4289J7729A75375R63f566D702A109
10857b22788c626k15964K6564l4324f2651o2413a0172j77477h9363j50404A89314
10845A672a00980A47954a03644d1454j11540k50719i6719B19610G4345O9479Q719
10834A52543i2649k7422m053k0911C1274R3341b5673r1207B76606m6757g0320
$$ y = [-157393, 127584, -120334, 209963, -97017, 42955, 22125, 321274, 113834, 240755, -184442, -187650, -261615, 186572, -145798, -372950, 251973, -255497, -61538, 60039, -100275, 116810, 186341, -105312, -113693, 83081, 155140, 140668, -36277, 45774, 117664, -69278, -299148, 155751, 14112, -183477, 297769, -34399, 455490, -82950, 111789, 128182, 212778, -54629, -286199, 49815, -208261, -118191, 119216, 1600, -192048, -260098, -175809, -158080, 175375, 176338, -6566, 4702, 1109, -222788, -3626, -219590, -193026, -227350, -62651, -125064, -10172, -187649, -89363, -239767, 189314, 1672, -100980, 147954, -103644, -41454, -152994, -403713, -96719, 219610, 74345, 143824, 152543, -92649, -120071, -124124, -145035, 31274, 124615, -25673, -116880, 276606, 229849, -70320]
10822a85869G7530A5013K37934b1583B1800b6873n2818j47654i974l551C03738
10810a35665c5175B13754j01071B93a92813A8275b0651j37159f7801k2458l15802
10799d06061a7575n6798p2414k4934C9162b63539D4827J07197K6904a6550P0l32497
10787c48977a35596j54285E4110K9006i6289l75619d6545m258H8514b01872q6367
10776b88239I7718a60144K5871B50110A04210k8435k9963h2004q0802C57062b62546
10764b64412B95226f83G0838a6425l8318n7393C1993J10114A0129K1392b31506
10752A72509a28025A7758a67159E7491f3963G95L62458A49966n6925B1002c01244
10740A2452J12849a33208I6328b17789g1871k30316a02607K9820D4695j0073f4666
$$ y = [-185869, 77530, 15013, 252947, -21583, 21800, -26873, -79691, -227345, -9974, -13525, 303738, -135665, -35175, 213754, 112683, 293, -192813, 18275, -20651, -157810, -67801, -90259, -406061, -17575, -74373, -146787, -171721, 39162, -263539, 44827, 152024, 178928, -16550, -16480, -348977, -135596, -289881, 54110, 83116, -96289, -471908, -46545, -50803, 88514, -201872, -288239, 97718, -160144, -134273, 250110, 104210, 75775, 45812, -82004, -162806, 357062, -262546, -264412, 295226, -683, 70838, -16425, -54743, -112136, 31993, 142107, 10129, 31521, -231506, 172509, -128025, 17758, -167159, 57491, -63963, 795, 363253, 149966, 93041, 21002, -301244, 12452, 125301, -133208, 96328, -217789, -71871, -302187, -102607, -72787, 44695, 34622, -64666]
10728h7582l89895K21486a275B30390a37836A58327b66497o3655A52621b39381
10717I5559a47351L2349E5360c6137f93k57422l5869R9682g2842j51620H119c82261
10704D47148G2061c58605B32383I7818b79519i4257j73182C9205e801j62512A17732
10692C0987d6968A60236e0420l4370L8541D4517M009i908B1501P9590k9573l2571
10680C8947d9746j82117E6183K19585b89527f2572A74547a05210M0186A35623
10669a6087k3649F3958J42941c93144J15446N3213j01064d2760o1746N360k35309
10658c34455h6880C05111a14115A47103m0348c81999A31339f4722A4654a37103
10647B2842a56770K8577n1155n526h8423a3002j66978G7882b76239A14922J7560
$$ y = [-87582, -477477, -255991, -1275, 230390, -137836, 158327, -266497, -330152, 152621, -239381, 95559, -147351, -115002, 55360, -36137, -693, -258115, -293984, -194302, -72842, -224462, 8119, -382261, 447148, 72061, -358605, 232383, 97818, -279519, -94257, -267439, 39205, -5801, -168313, 117732, 30987, -46968, 160236, -50420, -84790, -46249, 44517, 48526, -9908, 21501, 101091, 71518, 38947, -49746, -231863, 56183, 275768, -289527, -62572, 174547, -105210, -65024, 135623, -16087, -39736, 63958, 206899, -393144, -277698, -224485, -325549, -42760, -104506, -99146, -334455, -86880, 305111, -114115, 147103, 106755, -381999, 131339, -64722, 14654, -137103, 22842, -156770, -128193, -179348, -184874, -88423, -13002, -179980, 77882, -276239, 114922, 132482]
10636A32482F4207a46873A68219b03264e2742k33424C08023c19514a21000D1677
10625A30367b29009f3882J4023j18586P7784j9554o3493q0496f3322j51122k65000
10614d79444a28611G1078a81738O8271H288b64417g1482G6059j8394b01840g1363
10602B8268J32479g071I5169a91017A86387a74021b4889D0678f7689l3444l03130
10591d04263a48324A05055b12421j11590a40221p040A60282a364B95117j22735
10581A72382H3495d7577j22506j93434a79782j88438B20938E8315j033b32273
10570e2034l16537A15321a80020a3538A95616a18250l7571D0518R9143C3485c0443
10558a35549j45338C1675f2518L0562N084C67811a33318A27330c0435k84905c574
$$ y = [132482, 64207, -146873, 168219, -203264, -52742, -286166, 308023, -319514, -121000, 41677, 130367, -229009, -63882, -49859, -168445, -90661, -110215, -173708, -254204, -63322, -214444, -479444, -128611, 71078, -181738, -113467, 8288, -264417, -71482, 76059, 57665, -201840, -71363, 28268, 160747, -7071, 95169, -191017, 186387, -174021, -24889, 40678, -67689, -101133, -404263, -148324, 105055, -212421, -324011, -140221, -147261, 160282, -1364, 295117, 172382, 83495, -47577, -170083, -363517, -179782, -368220, 220938, 58315, 57282, -232273, -52034, -368571, 115321, -180020, -13538, 195616, -118250, -155821, 40518, 139661, 33485, -30443, -135549, -280887, 31675, -62518, -31956, -26872, 367811, -133318, 127330, -30435, -315340, -3574]
10546c4309n776A3055h2872F1518a36535b6046A80202k2655a34729L0173A59331
10534e3837B52654b26120J03885A01002a92762j73347Q7051J30862p5556D2525
10523a14591c0915F688K95937a68969d8531q7879M2962m6362r8256a12031k40644
10512c52675E13J01144C9866i4171F5815D31d8645j69262D5531K04006a70636
10500e6382j17683A25608d84710J84629G9402h3167B38456a10902l26615J95467
10490b42050A23247b00439k38505a15959B35218b5004C5688P7696A9896J69710
10480A89606C3473j5465b0677g435A48498B0769J87098F9886K05843j19486c1254
10468b45239f7587j29734d2536j21687B72153e4942B40230J43916P4580m9375
$$ y = [-34309, -40085, 13055, -82872, 61518, -136535, -26046, 180202, 157547, -134729, -104556, 159331, -53837, 252654, -226120, -122235, 101002, -192762, -366109, -279058, -148196, -223752, 42525, -114591, -30915, 6688, 302625, -168969, -48531, -136410, -93448, -139810, -238066, -112031, -352675, 513, 101657, 39866, -94171, 65815, 431, -48645, -217907, 45531, 249537, -170636, -56382, -174065, 125608, -484710, -300081, 79402, -83167, 238456, -110902, -437517, -242050, 123247, -200439, -438944, -115959, 235218, -25004, 35688, 113384, 19896, 189606, 33473, 18008, -20677, -7435, 148498, 20769, 207867, 69886, 275729, 156243, -31254, -245239, -67587, -197321, -42536, -164223, 272153, -54942, 240230, 384146, 458726, 409351]
10458D09351P2074j55570b1411C15769A15302c89214E6756N4086P9925E2247L03669
10447C55916f7558C6214P943N5316O5210G8864J11861e2381j94580d0680j417
10436d2097k245j0020q6559G8808J14915a55233J2607M0337m5132K315m7970D1235
10423A35997c3621a0718G3545E03h9646A4502b05581D2648b92394A03313b30381
10411H2427a57563A34997P257d00573a44475B2250a89208E8459f8746C2896f6787
10399c64404a03198A19559a16195e1535A91373p7874m6110K2536C8241G800a41885
10387A1274d28053J94010A13111a1161A9849i6338k38331E3213b77703B13775
10376A05841b51676a08034A18912c00120a46559A39162a63023d9798F4295J87499
$$ y = [409351, 481425, 325855, -21411, 315769, 115302, -389214, 56756, 110842, 190767, 52247, 355916, -67558, 36214, 44157, 99473, 164683, 78864, 190725, -52381, -246961, -40680, -42097, -44342, -54362, -140921, 78808, 193723, -155233, -142626, -102289, -147421, -145106, -193076, 41235, 135997, -33621, -10718, 73545, 503, -89646, 14502, -205581, 42648, -292394, 103313, -230381, 82427, -157563, 134997, 142254, -400573, -144475, 22250, -189208, 58459, -68746, 32896, -66787, -364404, -103198, 119559, -116195, -51535, 191373, 113499, 67389, 89925, 38241, 7800, -141885, 11274, -428053, -234043, 113111, -11161, 19849, -96338, -334669, 53213, -277703, 213775, 105841, -251676, -108034, 118912, -300120, -146559, 139162, -163023, -49798, 64295, 251794]
10366B51794F8695J99536J51846A96281E8679J09519C2602K65138J50564A99683
10355G1708K60552l1089j30209C9802L78494A50128N04772k89458j35155J9211
10345B49498K47651G7350M44328f70B21824N8556a409B34811I573J18054L74959
10334E02586H9127P7619K88006r3748j42410N7374L56600A65519K50808j27025
10324B89302j18897E7035M76464A54115N0890b8320F5138P2592q964g0929A91783
10312f3259B62351a92135i704B49150J3649A6300L10078A49769J75422L10680
10302F35871A24542a76016C03740c0375G8972j3337J30548O735A4551a65765C8818
10290A7753g8770j20891A36005L0674p7359D1793J3789a63859O0247A6676a50501
$$ y = [251794, 68695, 268231, 420077, 196281, 58679, 168198, 32602, 297740, 448304, 199683, 71708, 332260, 301171, 170962, 39802, 418296, 150128, 654900, 365442, 230287, 249498, 497149, 77350, 521678, -670, 221824, 280380, -1409, 234811, 9573, 127627, 502586, 89127, 166746, 454752, 361004, 218594, 275968, 632568, 165519, 416327, 289302, 170405, 57035, 533499, 154115, 205005, -28320, 65138, 137730, 128766, -70929, 191783, -63259, 262351, -192135, -9704, 249150, 262799, 16300, 326378, 149769, 325191, 635871, 124542, -176016, 303740, -30375, 78972, 65635, 196183, 202918, 14551, -165765, 38818, 17753, -78770, -199661, 136005, 166679, 89320, 41793, 55582, -163859, -103612, 16676, -150501]
10278B23796G0578b59847L8935H1812a80062K6767A50746e1791j21566A40333
10267C2442f4960l7215d3711H4798J50236A6229J04927a23173d9116l9154C08433
10255c7565j69284A72844M4083c29931a5392o1988A12712a63178e1397k14142
10245b65539i7831j66076B32980A7638Q6435j1104a39380k3318A14766J81350
10235B96116b8790l480B95302D9134J60284J47452a7597j66742N9708A56270d9741
10223A82245a4771p0010C16351a10838j17761K9297n3515b0339D8182b30299A48015
10211d01075A3497b61237r9966A53173a88924C6246J56693b81657h9697A02661
10200a57440c1415k7973H7245b09454B0919K82252c9982j45903o5256J2803A348
$$ y = [223796, 70578, -259847, -220912, 81812, -180062, -153295, 150746, -51791, -173357, 140333, 32442, -64960, -102175, -43711, 84798, 235034, 16229, 121156, -123173, -49116, -88270, 308433, -37565, -206849, 172844, 216927, -329931, -15392, -77380, 112712, -163178, -51397, -265539, -97831, -263907, 232980, 17638, 104073, 92969, -139380, -162698, 114766, 296116, -28790, -32270, 295302, 49134, 209418, 356870, -17597, -184339, -124631, 156270, -49741, 182245, -14771, -84781, 316351, -110838, -228599, -199302, -252817, -20339, 48182, -230299, 148015, -401075, 13497, -261237, -361203, 153173, -188924, 36246, 192939, -281657, -89697, 102661, -157440, -31415, -59388, 87245, -209454, 20919, 303171, -39982, -185885, -251141, -238338, 1348]
10188h8912j01307b881D136J70011J44115A38642E8692a06429L5666j64326H4722
10176a73540j04402c7025j6351k57632C238J11681c49360J20431G4835Q3231c12083
10164b45222J19804k4387m3770f7409A3493a95755M8487B0990b54562I0795P3554
10153A64349P1093A16941a97010D3356b25185f6367B87653b3569H2924a66207
10142b21010M8434Q3381k15603I5346a48777m9964j41870E9440K026a01146G022
10130a8742r5922K8191j54008J05749j5626F07b06784J3125c2280j82609J238
10119b13651J03209j10214K0777i7893m1557k2241d4769j20597b0390J393E7593
10107c2187B32753a22788A99758a34022A74205P1756a16389N6430K511j12554
$$ y = [-88912, -190219, -2881, 4136, 174147, 318262, 138642, 58692, -106429, -70763, -235089, 84722, -173540, -277942, -37025, -53376, -311008, 3238, 114919, -349360, -228929, 74835, 158066, -312083, -245222, -125418, -149805, -193575, -67409, 13493, -195755, -147268, 20990, -254562, 90795, 164349, 235442, 116941, -197010, 43356, -225185, -66367, 287653, -23569, 82924, -166207, -221010, -172576, -89195, -304798, 95346, -148777, -198741, -340611, 59440, 61466, -101146, 7022, -18742, -114664, -86473, -240481, -134732, -150358, 607, -206784, -193659, -32280, -214889, -213651, -110442, -220656, -199879, -97893, -139450, -161691, -44769, -165366, -20390, -18997, 57593, -32187, 232753, -122788, 199758, -134022, 174205, 245961, -116389, -59959, -57448, -170002]
10097a70002m3345B4758a01675m3374c0259j5948n9623k24442P3882A41911b50317
10085a11004G8494J1163b20283D715g1302E5947g7754r3625e7958R821j56339
10074b04476h4038D4459J1968b78658B94766g7698B2517Q9705j6091a25986N9622
10063f6364o1079A1204a13285A45912E0486A9364i6933A31956N5930a57222J958
10052a55264A06050a97591A1066a3719q114G1781b61973m3210j473Q1447h4536
10040g0393j46680D9660J93819D0607a20652e946A67879c0702l0396D173c23509
10028C4591b72371C20910b94220M7939Q5697F7757P6946a77583O3633j67882h1469
10016a64949g6100o6834j8484N1256m609E8254B4543a73544K8390l0159I9183
$$ y = [-170002, -213347, 24758, -101675, -145049, -30259, -46207, -105830, -330272, -256390, 141911, -250317, -111004, 78494, 89657, -220283, 4715, -71302, 55947, -77754, -171379, -57958, -48137, -204476, -84038, 44459, 56427, -278658, 294766, -77698, 22517, 112222, 96131, -125986, -66364, -127443, 11204, -113285, 145912, 50486, 19364, -96933, 131956, 187886, -157222, -155264, 106050, -197591, 11066, -13719, -21833, 71781, -261973, -305183, -306656, -225209, -84536, -70393, -217073, 49660, 243479, 40607, -120652, -5946, 167879, -30702, -61098, 4173, -323509, 34591, -272371, 320910, -294220, -246281, -160584, 67757, 144703, -177583, -113950, -281832, -81469, -164949, -76100, -142934, -161418, -110162, -114771, 58254, 24543, -173544, -145154, -175313, 99183]
10004a62455A5212K59586b6240j5963k61494i4815A58663R3059b48967K9429b5214
9992a42255A91713a63856O4548D3235b31764n1478C6984J00116a56711j10560
9982b67271E1500K14028b33626A95678b644k3384l3479j65864L5250A08546M4910
9971A53456a9857o8804k22077b7321k12960J08396A61937b25573B5943a70329
9960b13717D6044K22614a1211k41056A55897l4449a78877g8420q0756j9658m7634
9949b26468J1343C8368c27944A17005i5746j49866D6985a07408M7207l71615B15665
9937A74931n2555d1798B96389i2092k04614Q8935B84724R18c7357j0264A02341
9925b32461A72526l7263C1097J17062a41340k00185d1788j4990J2275k8114j73936
$$ y = [-162455, 15212, 274798, -26240, -42203, -303697, -94815, 158663, 251722, -248967, -219538, -25214, -142255, 191713, -163856, -99308, 43235, -231764, -283242, 36984, 137100, -156711, -267271, 51500, 265528, -233626, 195678, -2644, -26028, -59507, -225371, -190121, 108546, 153456, -19857, -88661, -310738, -27321, -240281, -131885, 161937, -225573, 25943, -170329, -213717, 46044, 268658, -11211, -252267, 155897, 121448, -178877, -78420, -159176, -178834, -226468, -215125, 38368, -327944, 117005, -95746, -245612, 46985, -107408, -60201, -431816, 215665, 174931, 122376, -41798, 296389, -92092, -296706, -207771, 284724, 285642, -37357, -47621, 102341, -232461, 172526, 135263, 31097, 148159, -141340, -341525, -41788, -56778, -44503, -72617, -246553]
9914b46553C4733d26562J23190M3396e1253E4867J30944c06404I4771e42I5581
9902C54787j65180d13252a4311A24929b5773I6868c62639g534r1998J3481k57522
9891c43573B40784A17360h870A89940G415b4204B88086a22519D9134J5932a36067
9879f8167l5464p4121o4847a09138d3696j45107j58919a64692I3690b0029l2574
9868e2603l18971a26595r9675C26325E3068b5509j38390K8245A07802a34331e0637
9856A64586h8288F4663a43411g049k8819l18299B5719a60843A98393a06982C8540
9844b03081A24593J01c09791B85784d2980r5167A7766e7104j68313d6656k26076
9833b72732h5754j8536J2914J2008j82406o1820a46111I5677e9370k75746R7030
$$ y = [-246553, 34733, -426562, -303372, -259976, -51253, 54867, 185811, -306404, 94771, -542, 95581, 354787, 189607, -413252, -14311, 124929, -25773, 96868, -362639, -7534, -99532, -86051, -343573, 240784, 117360, -8870, 189940, 7415, -24204, 288086, -122519, 49134, 65066, -136067, -68167, -103631, -177752, -242599, -109138, -43696, -188803, -347722, -164692, 93690, -20029, -52603, -371574, -126595, -226270, 326325, 53068, -25509, -163899, -135654, 107802, -134331, -50637, 164586, -88288, 64663, -143411, -7049, -35868, -354167, 25719, -160843, 198393, -106982, 38540, -203081, 124593, 124694, -309791, 285784, -42980, -138147, 17766, -57104, -225417, -46656, -272732, -85754, -104290, -91376, -79368, -261774, -323594, -146111, 95677, -59370, -335116, -238086]
9822b38086n6416J34536j26307a3998j40799h746A25262k2133c09875A25625b78417
9810a38775M2736B12115E7766k0089a73125C6548e2416B98179A05152a32185L8509
9799i3676A14012h6789c1716j50819j19259J47361a5661k19991A96916b14664
9788H4b11008P52M3462G9269a93731I4451b21691G282a60683j26343J29134f0029
9775e1744D8318h051k53157A25876h5000p0818A471L473a77104J9668A31361b01312
9762b77872R9565F1269M5869K02453a57822N3848L7012k40125e3562l4987A92292
9750i1715M3015j40716A42974a91559g5280J6246I4929b5109H281i9950j84649
9739b84599h3167j37998A20719j2381B765a18525G3536e2086k22657B60896c40995
$$ y = [-238086, -294502, -159966, -286273, -13998, -154797, -8746, 125262, 103129, -309875, 125625, -278417, -138775, -96039, 212115, 57766, 37677, -173125, 36548, -52416, 298179, 105152, -132185, -93676, 114012, -86789, -31716, -182535, -301794, -154433, -15661, -235652, 196916, -214664, 84, -211008, -210256, -166794, 79269, -193731, 94451, -221691, 7282, -160683, -287026, -157892, -60029, -51744, 48318, -8051, -261208, 125876, -85000, -155818, 1471, 4944, -177104, -157436, 131361, -201312, -277872, -178307, 61269, 107138, 309591, -157822, -103974, -66962, -307087, -53562, -88549, 192292, -91715, -48700, -189416, 142974, -191559, -75280, -59034, 94929, -25109, 8281, -99950, -284599, -83167, -221165, 120719, 108338, 2765, -118525, 73536, -52086, -274743, 260896, -340995]
9727D6438h1802A60028J5729b98169k9749c4311B32746a30720o8171E4004L0454
9716H4458b32655R6826O6475K1358H6094b21498K7851i2j40753D2751R1645c27268
9703b2996C5835b34259B36340a78566J8032j08709B14220I1837c5819A90765b24112
9691a7885k33317Q6574j67858G9808a42351c9440A70136d0872f684I49b27259
9679b2856l27521f5071f608l11089A61652b72564N5318A0677c69692C85709E7172
9667b45174A66083a77897C4206b83533f376l9620r8569p9109o334J14665k9232
9656a44575B1877h4249B25919a79584F9816R2857a10568k04699h452r6175C8216
9644A47772n5013f5739D7452Q7457m8983O8327c26221l1477c1866A48443h1403
$$ y = [46438, -81802, 160028, 175757, -298169, -327918, -34311, 232746, -130720, -198891, 54004, 84458, -232655, -135829, -69354, -47996, 86094, -221498, -193647, -92, -140845, 42751, 134396, -327268, -22996, 35835, -234259, 236340, -178566, -160534, -269243, 214220, 91837, -35819, 190765, -224112, -17885, -251202, -164628, -332486, 79808, -142351, -39440, 170136, -40872, -6684, 949, -227259, -22856, -350377, -65071, -6608, -317697, 161652, -272564, -217246, 10677, -369692, 385709, 57172, -245174, 166083, -177897, 34206, -283533, -6376, -45996, -144565, -223674, -230008, -115343, -144575, 21877, -84249, 225919, -179584, 69816, 162673, -110568, -315267, -8452, -104627, 38216, 147772, 92759, -65739, 47452, 134909, 85926, 154253, -326221, -357698, -31866, 148443, -81403]
9632A0143b309A6990Q7602a48239e4953j9721A99948b15261E0471e41164a20310
9620b67158G5452b8239E7498i3832K0425B0628f0308k16912J00414j6200A21172
9608a50024f2264j83124J1458i4664b3528p1131I5049B7235o817N5369a98651
9596B51059C2994L89K11449K9042A4119g7062j70851D948a86340G5551b42959
9584b25532D6816b07167R4940e5816j00190f3481E5435F86a35639e0164A12187
9572c05210B18937a56274e9800A3823b61318B56205a51734d7468j70133b4317
9561B250b08587e1430l2111o4057A5730a24430B65795e304A56129a33585c3864
9549A51912B7951a54465B4251c81438a51731H3488e5478I4483J77831E1662b53285
$$ y = [10143, -2309, 16990, 104592, -148239, -54953, -74674, 199948, -215261, 50471, -541164, -120310, -267158, 75452, -28239, 57498, -93832, -73407, 20628, -60308, -277220, -176806, -193006, 121172, -150024, -62264, -245388, -233930, -94664, -23528, -94659, 95049, 27235, 20418, 75787, -198651, 251059, 32994, 33383, 244832, 273874, 14119, -77062, -247913, 4948, -186340, 75551, -242959, -225532, 46816, -207167, -112227, -55816, -156006, -63481, 55435, 686, -135639, -50164, 112187, -305210, 218937, -156274, -59800, 13823, -261318, 256205, -151734, -47468, -217601, -24317, 2250, -208587, -51430, -83541, -147598, 15730, -124430, 265795, -5304, 156129, -133585, -33864, 151912, 27951, -154465, 24251, -381438, -151731, 83488, -55478, 94483, 272314, 51662, -253285]
9537c3449k22428d5896A54377o1535a47420r3946r4133C050d9083b3605A00199
9525A04674a27596b8165j38979a3405k28979M3046r4578h7211D9237b34255A44566
9513d3464H0510a257j3336m09214h5352j4527D6439b05271a1229j23269o2521
9502a97019A98342c57129F9913J84980b03924E4669b5153C8037a8159j48882f4427
9490B43873b83559L1568n2842h0025c9587j60744A33770C4345J08967a9665k24206
9479b43871j691M9478E1331b8930k52615J01538j0753c3115Q27k04988B2032P8039
9467A00071d1096A55077D8504c23033A3937a90605A76229a76006B0951K3157a45498
9455d8725j05365f8885a1245B11213a56251A69858f8814D1056i2655K804A32130
$$ y = [-33449, -255877, -45896, 154377, 92842, -147420, -241366, -335499, 3050, -49083, -23605, 100199, 104674, -127596, -28165, -167144, -13405, -242384, -199338, -293916, -87211, 49237, -234255, 144566, -43464, 80510, -1257, -14593, -423807, -85352, -99879, 46439, -205271, -11229, -134498, -197019, 198342, -357129, 69913, 254893, -203924, 54669, -25153, 38037, -18159, -167041, -64427, 243873, -283559, -251991, -304833, -80025, -39587, -200331, 133770, 34345, 143312, -19665, -243871, -245562, -196084, 51331, -28930, -281545, -180007, -190760, -33115, -32288, -237276, 22032, 100071, -41096, 155077, 48504, -323033, 13937, -190605, 176229, -176006, 20951, 44108, -145498, -48725, -154090, -68885, -11245, 211213, -156251, 169858, -68814, 41056, -92655, -89851, 132130]
9443E5903c02898J10088A4768a85336n6463A30316a04772B35737G9498b53752
9432c3834k4538A7563B884m12c03405B47940a17353B09668P1865g7540j24259
9421b01799A65842p8964a15951A80293A0702b05502B0261a19125j40391J13071
9411a46445A14126a6385j40511j17610A29157f9159j01112B5411b53611H6030
9400A36610d23623d6048A62745a88312L2325j13890m6156C19745o9823D1693f4728
9388c6340J7590B78386b97709a21781B1818K20033g8037K166A01693K51965b7111
9376A56806G6954J4329J54929k4014a58481B3441L0690B3241O5616c6694l73057
9365d09751a50433A0477N3991a32244k20297I5485K19804a27747b6386k29797
$$ y = [55903, -302898, -192810, 14768, -185336, -241799, 130316, -104772, 235737, 79498, -253752, -33834, -58372, 17563, 2884, 2472, -303405, 247940, -117353, 209668, 281533, -77540, -201799, 165842, 86878, -115951, 180293, 10702, -205502, 20261, -119125, -259516, -146445, 114126, -16385, -156896, -274506, 129157, -69159, -170271, 25411, -253611, 86030, 136610, -423623, -46048, 162745, -188312, -155987, -269877, -316033, 319745, 249922, 41693, -64728, -36340, -18750, 278386, -297709, -121781, 21818, 241851, -78037, -75871, 101693, 353658, -27111, 156806, 76954, 91283, 246212, 222198, -158481, 23441, 54131, 23241, 88857, -36694, -409751, -150433, 10477, 64468, -132244, -352541, 95485, 315289, -127747, -26386, -256183]
9355b56183O3356R2742p5172A99994a40006L2845d4838k61628B4008a84829H274
9343a23714d6480j77705o3858d8337A7390J68669b27502B4707Q1149a59729B34015
9331a90696b5413j63924m720f5603F2035K24503D72J00020o828A3442a58506G0347
9318a279A59187a2959j99875B0129O281e8219B60939b35621a6273O969n3844j20365
9306a83513p5284E1635b21942b4950A85464E2553P8024a94928A14463e0409l35801
9295c86210a59642A12272c93147J54576B45115A09104a78180h3021K644m8661
9285a29038O3381A64718a42923c5428I8770J02377a50473G778K39771c0202B14532
9273a57701k4745j44487A60362a55450B3873f729r7704L9431F6297A0953a35007
$$ y = [-256183, -192827, -100085, -175257, 199994, -140006, -107161, -44838, -306466, 24008, -184829, 8274, -123714, -46480, -224185, -288043, -48337, 17390, 186059, -227502, 24707, 105856, -159729, 234015, -190696, -25413, -189337, -194057, -65603, 62035, 286538, 472, 100492, 93664, 13442, -158506, 70347, -1279, 159187, -12959, -212834, 20129, 26410, -58219, 260939, -235621, -16273, -9304, -63148, -183513, -258797, 51635, -221942, -24950, 185464, 52553, 130577, -194928, 114463, -50409, -386210, -159642, 112272, -393147, -238571, 245115, 109104, -178180, -83021, -80377, -129038, -65657, 164718, -142923, -35428, 98770, 201147, -150473, 7778, 247549, -30202, 214532, -157701, -182446, -326933, 160362, -155450, 23873, -6729, -104433, -65002, 66297, 10953, -135007]
9261D659c45344a52911n5472e3508l7776I0041B9992b33740q9867A18146b29115
9249a39870d7503k56239H8198J52224a98293C8583d21078F9811b43442c6673A88629
9237b164j05075k3756d9236A4402P8562C1160a07900A65021e0548A30394a3554
9225D2570b61958k9332A88521m9747a81201k5240p5823O0004j71445f092j24694
9214a30786c712q7388p9581K491k05440A64275h8337j01427m21184i1168E1389
9202D9565e2438A45453m0649g5315B67118A02102D9729A7091b94336k1854Q8972
9191b27218k04714b9619A6095a20538E4311c78487B92095a66627l1379c2400p3854
9180a06254J4232D552b99893j35632a51121g1856A82161c42846L8663B79430a07460
$$ y = [4659, -345344, -152911, -208383, -53508, -91284, 90041, 29992, -233740, -323607, 118146, -229115, -139870, -47503, -303742, 88198, 240422, -198293, 38583, -421078, 69811, -243442, -36673, 188629, -2164, -107239, -130995, -49236, 14402, 92964, 31160, -107900, 165021, -50548, 130394, -13554, 42570, -261958, -291290, 188521, 138774, -181201, -206441, -282264, -222260, -393705, -6092, -130786, -3712, -91100, -170681, -168190, -373630, 164275, -88337, -189764, -610948, -91168, 51389, 49565, -52438, 145453, 104804, -75315, 267118, 102102, 49729, 17091, -294336, -316190, -227218, -431932, -29619, 16095, -120538, 54311, -378487, 292095, -166627, -198006, -32400, -106254, -92022, 4552, -299893, -435525, -151121, -71856, 182161, -342846, -304183, 279430, -107460]
9168a52403g4715C48566a36175k00698a5309r7593A97324e4947B47067A03457
9157b7710j67077R3268A8311J79618d9880C7766a8559k19275g8692n2805j25273
9146b56770A73809e3348I3063J12654a39102e4230B54377h0931K8311r2035j29303
9135b73958M3931B02759b58912h2759A50566a517A96254b01016H5923b41752B3772
9123B55674a65264f0925j46738D0888d7036k21382B56306b73535G2837a88361
9112a3147j22086a2917l03225a52919I3923b52569A39330a6928j81992A22089
9101a22525p6047c777j98778F3206a14066L6996N86A95493b5054j31746d1251
9089A50461a92472A78527P645b53871E6764l68b13710B33411b49615P9972p2130
$$ y = [-152403, -74715, 348566, -136175, -336873, -15309, -112902, 197324, -54947, 247067, 103457, -27710, -194787, -101519, 18311, 197929, -49880, 37766, -18559, -237834, -78692, -131497, -256770, 173809, -53348, 93063, 205717, -139102, -54230, 254377, -80931, -52620, -144655, -273958, -230027, 202759, -258912, -82759, 150566, -1517, 196254, -201016, 85923, -241752, 23772, 255674, -165264, -60925, -207663, 40888, -47036, -268418, 256306, -273535, 72837, -188361, -13147, -135233, -12917, -316142, -152919, 93923, -252569, 139330, -16928, -198920, 122089, -122525, -198572, -3777, -202555, 63206, -114066, -77070, -76484, 195493, -25054, -156800, -41251, 150461, -192472, 178527, 186172, -253871, 56764, 56396, -213710, 233411, -249615, -169643, -241773]
9078b41773B9743h0883E5453e7492B11028a06454k20689G7240l1754a37036F157
9066i4184p6348k77300K18553n227L6503H054b04703I6331i2286m79742A59334
9054e6001r8645j4381k5650e3444G8463K72305A13843L8669c68166H8107b03318
9042a33145o4196D2376J67011b6297A07120l1661h1180B21666L9636f9135a9112
9030A9295a31330k46484G3638K4976h1841o0485c0853o599o8997B89103A36868
9018c17895d6069j98824A51036b24816q8618f0179G3308g7360k92890A1012j692
9007I320a41201I5066c30492k02138e011D1990A853b33405N8262q3883n9097A13811
8994B99880a68669j1715A00067l1281c4227K080C64036b82496A29403a43474P426
$$ y = [-241773, 29743, -80883, 55453, -57492, 211028, -106454, -327143, 77240, 45486, -137036, 6157, -94184, -170532, -447832, -229279, -234506, -198003, 8054, -204703, 96331, -92286, -572028, 159334, -56001, -154646, -169027, -194677, -53444, 78463, 350768, 113843, 152512, -368166, 88107, -203318, -133145, -197341, 42376, 209387, -26297, 107120, 75459, -81180, 221666, 261302, -69135, -19112, 19295, -131330, -377814, 73638, 98614, -81841, -142326, -30853, -37452, -106449, 289103, 136868, -317895, -46069, -244893, 151036, -224816, -313434, -60179, 73308, -77360, -370250, 11012, 9320, -141201, 95066, -330492, -532630, -5011, 41990, 1853, -233405, -175143, -259026, -318123, 113811, 299880, -168669, -180384, 100067, 68786, -34227, -32147, 364036, -282496, 129403, -143474, -136048]
8983a36048A50323d9450E5818J38633f6006B27767H7281i2746j50996h2848D110
8971b9298r9984j09005f2114J6383D8197J51224b01361k24880b6548A58279i1760
8959b4483B80753d38172a01429j4918A32697f0674k26988A95359a6420k57763
8949b74183n7126B19295i1781j37661j08494K2661c1382j39139j15716d9922G7475
8937a72729J1014Q0752j19822B2001O3150a08661j42233A9818h9113d735A59109
8925d8881A3377a5802j27246m9587j3758A99150a22064c409k43930B65571L26564
8914E92135a3416A98751C0014L65674D2671M45966l138K73482O91285P25315J692854
8903C868435M011864C684867j833306q89493k10487C19113N5730E4611a12232
$$ y = [-136048, 150323, -49450, 55818, 194451, -66006, 227767, 87281, -92746, -243742, -82848, 4110, -29298, -129282, -238287, -62114, -45731, 48197, 199421, -201361, -426241, -26548, 158279, -91760, -24483, 280753, -438172, -101429, -116347, 132697, -60674, -287662, 195359, -16420, -274183, -331309, 219295, -91781, -229442, -337936, -315275, -31382, -170521, -286237, -49922, 77475, -172729, -161715, -80963, -200785, 22001, 85151, -108661, -250894, 19818, -89113, -4735, 159109, -48881, 13377, -15802, -143048, -192635, -206393, 199150, -122064, -3409, -247339, 265571, 592135, -13416, 198751, 30014, 395688, 42671, 488637, 485499, 758981, 1450266, 2175581, 3868435, 7880299, 3684867, 1851561, 962068, 751581, 319113, 374843, 54611, -112232]
8893b07138A84927Q9019G2141J4748R3786i6723j99310c962A24301O6625a1156
8881b87550J26875Q0222a6725k23755J00697j20747A70468c20269c1380k60400
8871b91780B3202g7497K0669J4798A34568b57119A46769f995j09340j25855e0758
8859g98k56467P0224g8679k21395A66205c3498k18917A77303C4463a89472B95025
8847b48632A56012b12396P9186c4091j26525j468l3729d5171H4114C7217h6951
$$ y = [-207138, 184927, 273946, 72141, 86889, 180675, -96723, -296033, -3962, 124301, 190926, -11156, -287550, -160675, -80453, -16725, -240480, -139783, -260530, 170468, -320269, -31380, -291780, 23202, -77497, -56828, -42030, 134568, -257119, 146769, -6995, -116335, -242190, -50758, -798, -257265, -187041, -78679, -300074, 166205, -33498, -252415, 177303, 34463, -189472, 295025, -248632, 156012, -212396, -133210, -34091, -160616, -162084, -195813, -45171, 84114, 37217, -86951]
$$ [...]
##END NTUPLES=NMR SPECTRUM
##END=
