
##TITLE=AC1108_Colombia_5835691_q6k7dCIauJ
##JCAMPDX= 6.0         $$ Bruker NMR JCAMP-DX V2.0
##DATA TYPE= NMR SPECTRUM
##DATA CLASS= NTUPLES
##ORIGIN= BRUKER
##OWNER= Administrator
$$ 1.72 TOPSPIN		Version 2.1
$$ 2012-04-16 19:08:06.203 -0500  Administrator@TOPSPIN
$$ Compression mode = diff/dup
##.OBSERVE FREQUENCY= 400.13188235
##.OBSERVE NUCLEUS= ^1H
##.ACQUISITION MODE= SIMULTANEOUS (DQD)
##.ACQUISITION SCHEME= undefined
##.AVERAGES= 64
##.DIGITISER RES= 22
##SPECTROMETER/DATA SYSTEM= spect
##.PULSE SEQUENCE= noesygpps1d.comp
##.SOLVENT NAME= COFFEE_meoh
##.SHIFT REFERENCE= INTERNAL, COFFEE_meoh, 1, 14.96813
##AUDIT TRAIL= $$ (NUMBER, WHEN, WHO, WHERE, PROCESS, VERSION, WHAT)
$$ ##TITLE= Audit trail, TOPSPIN		Version 2.1
$$ ##JCAMPDX= 5.01
$$ ##ORIGIN= Bruker BioSpin GmbH
$$ ##OWNER= Administrator
$$ $$ C:\Bruker\TOPSPIN/data/COFFEE/nmr/AC1108_Colombia_5835691_q6k7dCIauJ/22/pdata/1/auditp.txt
$$ ##AUDIT TRAIL=  $$ (NUMBER, WHEN, WHO, WHERE, PROCESS, VERSION, WHAT)
(   1,<2012-04-15 16:12:47.937 -0500>,<Administrator>,<TOPSPIN>,<go>,<TOPSPIN 2.1>,
      <created by zg
	started at 2012-04-15 16:01:16.359 -0500,
	POWCHK enabled, PULCHK disabled,
       configuration hash MD5:
       1A 1E CE 29 27 FD 77 03 67 4E F0 E3 C4 B2 CB 90
       data hash MD5: 64K
       AD 6C 33 F7 F7 70 5D 11 8F 79 B3 F6 3E B7 A8 3F>)
(   2,<2012-04-15 16:12:50.640 -0500>,<Administrator>,<TOPSPIN>,<proc1d>,<TOPSPIN 2.1>,
      <Start of raw data processing
       efp LB = 0.3 FT_mod = 6 PKNL = 1 PHC0 = 0 PHC1 = 0 SI = 128K 
       data hash MD5: 128K
       A2 68 AE D8 99 F7 83 3D A9 EF D9 25 19 84 6E CF>)
(   3,<2012-04-15 16:12:51.828 -0500>,<Administrator>,<TOPSPIN>,<proc1d>,<TOPSPIN 2.1>,
      <pk PHC0 = 36.0791 PHC1 = 0 
       data hash MD5: 128K
       03 55 44 16 C4 EC C6 D7 A4 61 B6 A4 60 26 A8 E0>)
(   4,<2012-04-15 16:12:52.109 -0500>,<Administrator>,<TOPSPIN>,<proc1d>,<TOPSPIN 2.1>,
      <abs ABSG = 1 
       data hash MD5: 128K
       05 E8 B4 67 28 4C 04 B8 D7 10 9B B8 71 7C 6A 31>)
(   5,<2012-04-15 16:12:52.187 -0500>,<Administrator>,<TOPSPIN>,<proc1d>,<TOPSPIN 2.1>,
      <abs ABSG = 2 
       data hash MD5: 128K
       DE E0 C6 9D 32 8E 78 72 E0 C7 97 BA C6 91 BF 05>)
(   6,<2012-04-15 16:12:52.281 -0500>,<Administrator>,<TOPSPIN>,<proc1d>,<TOPSPIN 2.1>,
      <abs ABSG = 3 
       data hash MD5: 128K
       CA CC 9D DC 60 B2 D0 69 75 03 1D 21 B3 0B 64 6E>)
(   7,<2012-04-15 16:12:52.500 -0500>,<Administrator>,<TOPSPIN>,<proc1d>,<TOPSPIN 2.1>,
      <abs ABSG = 4 
       data hash MD5: 128K
       85 B5 04 5D 82 32 36 A3 00 0F 3C 7D 43 48 76 A1>)
(   8,<2012-04-15 16:12:52.562 -0500>,<Administrator>,<TOPSPIN>,<proc1d>,<TOPSPIN 2.1>,
      <abs ABSG = 5 
       data hash MD5: 128K
       4C A4 39 82 B8 41 B4 79 94 40 56 78 A4 CC B0 A4>)
(   9,<2012-04-15 16:12:52.781 -0500>,<Administrator>,<TOPSPIN>,<audit>,<TOPSPIN 2.1>,
      <user comment:
       ICON-NMR User ID: COFFEE
       data hash MD5: 128K
$$ [...]
150 150 150 150 150 150 150 150
##$TP07= 0
##$TPNAME0= <>
##$TPNAME1= <>
##$TPNAME2= <>
##$TPNAME3= <>
##$TPNAME4= <>
##$TPNAME5= <>
##$TPNAME6= <>
##$TPNAME7= <>
##$TPOAL= (0..7)
0.5 0.5 0.5 0.5 0.5 0.5 0.5 0.5
##$TPOFFS= (0..7)
0 0 0 0 0 0 0 0
##$TUNHIN= 0
##$TUNHOUT= 0
##$TUNXOUT= 0
##$USERA1= <user>
##$USERA2= <user>
##$USERA3= <user>
##$USERA4= <user>
##$USERA5= <user>
##$V9= 5
##$VALIST= <valist>
##$VCLIST= <CCCCCCCCCCCCCCC>
##$VD= 0
##$VDLIST= <DDDDDDDDDDDDDDD>
##$VPLIST= <PPPPPPPPPPPPPPP>
##$VTLIST= <TTTTTTTTTTTTTTT>
##$WBST= 2048
##$WBSW= 25
##$XGAIN= (0..3)
0 0 0 0
##$XL= 0
##$YL= 0
##$YMAX_a= 11673993
##$YMIN_a= -6701306
##$ZGOPTNS= <>
##$ZL1= 120
##$ZL2= 120
##$ZL3= 120
##$ZL4= 120
##$ABSF1= 14.96813
##$ABSF2= -5.5844
##$ABSG= 5
##$ABSL= 3
##$ALPHA= 0
##$AQORDER= 0
##$ASSFAC= 0
##$ASSFACI= 0
##$ASSFACX= 0
##$ASSWID= 0
##$AUNMP= <proc_prof1d_extract.lims>
##$AXLEFT= 0
##$AXNAME= <>
##$AXNUC= <1H>
##$AXRIGHT= 0
##$AXTYPE= 0
##$AXUNIT= <>
##$AZFE= 0.1
##$AZFW= 0.1
##$BCFW= 0
##$BC_mod= 0
##$BYTORDP= 0
##$COROFFS= 0
##$CY= 15
##$DATMOD= 1
##$DC= 0
##$DFILT= <>
##$DTYPP= 0
##$F1P= 0
##$F2P= 0
##$FCOR= 0.5
##$FTSIZE= 131072
##$FT_mod= 6
##$GAMMA= 0
##$GB= 0
##$INTBC= 1
##$INTSCL= 1
##$ISEN= 128
##$LB= 0.3
##$LEV0= 0
##$LPBIN= 0
##$MAXI= 10000
##$MC2= 0
##$MEAN= 0
##$ME_mod= 0
##$MI= 0
##$NCOEF= 0
##$NC_proc= -2
##$NLEV= 6
##$NOISF1= 0
##$NOISF2= 0
##$NSP= 0
##$NTH_PI= 0
##$NZP= 0
##$OFFSET= 14.96813
##$PC= 1
##$PHC0= 36.0791
##$PHC1= 0
##$PH_mod= 1
##$PKNL= yes
##$PPARMOD= 0
##$PPDIAG= 0
##$PPIPTYP= 0
##$PPMPNUM= 2147483647
##$PPRESOL= 1
##$PSCAL= 4
##$PSIGN= 0
##$PYNMP= <proc.py>
##$REVERSE= no
##$SF= 400.1300049925
##$SI= 131072
##$SIGF1= 0
##$SIGF2= 0
##$SINO= 400
##$SIOLD= 131072
##$SPECTYP= <>
##$SREGLST= <1H.CDCl3>
##$SSB= 0
##$STSI= 131072
##$STSR= 0
##$SW_p= 8223.68421052632
##$SYMM= 0
##$S_DEV= 0
##$TDeff= 65536
##$TDoff= 0
##$TI= <>
##$TILT= no
##$TM1= 0
##$TM2= 0
##$TOPLEV= 0
##$USERP1= <user>
##$USERP2= <user>
##$USERP3= <user>
##$USERP4= <user>
##$USERP5= <user>
##$WDW= 1
##$XDIM= 131072
##$YMAX_p= 212010073
##$YMIN_p= -314230731
##$CURPLOT= <Network HP LaserJet P1505>
##$CURPRIN= <$Network HP LaserJet P1505>
##$DFORMAT= <normdp>
##$LAYOUT= <+/1D_H.xwp>
##$LFORMAT= <normlp>
##$PFORMAT= <normpl>
##$SURQMSG= 1
$$ End of Bruker specific parameters
$$ ---------------------------------
##NTUPLES= NMR SPECTRUM
##VAR_NAME=  FREQUENCY,     SPECTRUM/REAL,   SPECTRUM/IMAG
##SYMBOL=    X,             R,               I
##VAR_TYPE=  INDEPENDENT,   DEPENDENT,       DEPENDENT
##VAR_FORM=  AFFN,          ASDF,            ASDF
##VAR_DIM=   131072,        131072,          131072
##UNITS=     HZ,            ARBITRARY UNITS, ARBITRARY UNITS
##FACTOR=    0.0627417313425165, 1,          1
##FIRST=     8223.62146879498, 1363,         -44921
##LAST=      0,             2372,            -44821
##MIN=       0,             -314230731,      0
##MAX=       8223.62146879498, 212010073,    0
$$ Real data points
##PAGE= N=1
##DATA TABLE= (X++(R..R)), XYDATA
$$ [...]
62035A763249K6718K6719K7752K9308L0244L0035K9322K9145K9804L0657L0928
62024B083881L0575L0337L1010L2609L4299L5219L5346L5384L5825L6341L6232
62013B457058L5293L3945L2741L1995L1786L2010L2319L2282L1705L0673K9268
62002B811075K7343K4764K1708J8662J6050J3891J1836R576P167M829K499j52
61990B969248l166o096q521j0544j2412j3914j4579j4351j3771j3438j3574j3986
61978B830896j4183j3703j2637j1741j1557j1658j1259j0402r759r385q525o977
61966B699110n696n544o092o344o102n861n725n215m102k768j708j121j008j217
61952B640607j397j259r50p79o48r3J024K230K988L240L280L224K778J534m99
$$ plain form
62035 1763249 1789967 1816686 1844438 1873746 1903990 1934025 1963347 1992492 2022296 2052953 2083881
62024 2083881 2114456 2144793 2175803 2208412 2242711 2277930 2313276 2348660 2384485 2420826 2457058
62013 2457058 2492351 2526296 2559037 2591032 2622818 2654828 2687147 2719429 2751134 2781807 2811075
62002 2811075 2838418 2863182 2884890 2903552 2919602 2933493 2945329 2954905 2962072 2966901 2969400 2969248
61990 2969248 2966082 2959986 2951465 2940921 2928509 2914595 2900016 2885665 2871894 2858456 2844882 2830896
61978 2830896 2816713 2803010 2790373 2778632 2767075 2755417 2744158 2733756 2723997 2714612 2706087 2699110
61966 2699110 2693414 2687870 2681778 2675434 2669332 2663471 2657746 2652531 2648429 2645661 2643953 2642832 2641824 2640607
61952 2640607 2639210 2637951 2637001 2636222 2635574 2635481 2636505 2638735 2641723 2644963 2648243 2651467 2654245 2655779 2655280
61937B655280k771m805o877r682j3218j6512j8828k0616k2726k5085k6840k7670
61925B459650k8145k8739k9164k9002k8460k8158k8415k8919k8922k7769k5552
61914B148405k3253k1859k1285k0607j9413j8311j7872j7640j6756j5239j3968
61903A942202j3459j3220j2505j1277j0105r317q629p680o632n890n376m490k967
61890A830655j312j47O58J685L039M210M891N467O489Q048R819J1476J2864J3970
61876A911812J4932J5986J7272J8760K0319K1759K2917K3859K4973K6659K8977
61865B148225L1744L4848L8226M1733M5367M9502N4576O0606O7456P5316Q4472
61854B732071R4715J05621J17392J30733J45810J61998J78807J96437K15171K34888
$$ plain form
61937 2655280 2652509 2647704 2640827 2631145 2617927 2601415 2582587 2561971 2539245 2514160 2487320 2459650
61925 2459650 2431505 2402766 2373602 2344600 2316140 2287982 2259567 2230648 2201726 2173957 2148405
61914 2148405 2125152 2103293 2082008 2061401 2041988 2023677 2005805 1988165 1971409 1956170 1942202
61903 1942202 1928743 1915523 1903018 1891741 1881636 1872319 1863690 1856010 1849378 1843488 1838112 1833622 1830655
61890 1830655 1829343 1829196 1829854 1831539 1834578 1838788 1843679 1849146 1855635 1863683 1873502 1884978 1897842 1911812
61876 1911812 1926744 1942730 1960002 1978762 1999081 2020840 2043757 2067616 2092589 2119248 2148225
61865 2148225 2179969 2214817 2253043 2294776 2340143 2389645 2444221 2504827 2572283 2647599 2732071
61854 2732071 2826786 2932407 3049799 3180532 3326342 3488340 3667147 3863584 4078755 4313643
61844D313643K55434K76774K98239L18283L35432L48803L57102L57843L48393
61835G209946L27544K95361K52058J98103J35374O7282k429p0464j33838j90041
61825H088896k37701k76519l06388l27183l39595l45291l45775l41564l32906
61816E235974l20703l06160k89845k71855k52685k33415k14918j97352j80464
61807B968577j64064j48179j33036j19047j06573r5595q5755p6707o8323o0505
61797A910793n3092m6039l9526l3719k8554k3933k0065j7311j5601j4205j2286
61786A606462r754p428o308o607p552q093p796p014o240n462m241k359j86J645
61772A529067K880L820M919O251P393P874P741P488P307O691N210L503K791L285
$$ plain form
61844 4313643 4569077 4845851 5144090 5462373 5797805 6146608 6503710 6861553 7209946
61835 7209946 7537490 7832851 8084909 8283012 8418386 8485668 8483239 8412775 8278937 8088896
61825 8088896 7851195 7574676 7268288 6941105 6601510 6256219 5910444 5568880 5235974
61816 5235974 4915271 4609111 4319266 4047411 3794726 3561311 3346393 3149041 2968577
61807 2968577 2804513 2656334 2523298 2404251 2297678 2202083 2116328 2039621 1971298 1910793
61797 1910793 1857701 1811662 1772136 1738417 1709863 1685930 1665865 1648554 1632953 1618748 1606462
61786 1606462 1596708 1589280 1582972 1576365 1568813 1560720 1552924 1545910 1539670 1534208 1529967 1527608 1527422 1529067
61772 1529067 1531947 1535767 1540686 1546937 1554330 1562204 1569945 1577433 1584740 1591431 1596641 1600144 1602935 1606220
61758A606220L804L511L258M307O322P834Q558R874J2576J5541J7502J9173K2322
61745A740802K7272L2577L7055M0890M4598M8114N1450N5361O0493O6407P2219
61734B277238P7903Q4252R1630R9507J07341J15368J24340J34799J46914J60598
61724C419890J75652J91981K09974K30387K53596K79141L06382L35438L67039
61715E769480M01533M38346M76445N14836N52440N87794O18907O43048O56458
61706A0659287O54885O34850N94520N33432M52135L52649K38956J16500q731j30614
61696A4097869k43316l42463m26026m93651n45321n81343o03212o13321o13565
61687I635651o04969n88687n66482n39894n09848m77487m44488m11944l79693
$$ plain form
61758 1606220 1610024 1613535 1616793 1621100 1627422 1635256 1643814 1653688 1666264 1681805 1699307 1718480 1740802
61745 1740802 1768074 1800651 1837706 1878596 1923194 1971308 2022758 2078119 2138612 2205019 2277238
61734 2277238 2355141 2439393 2531023 2630530 2737871 2853239 2977579 3112378 3259292 3419890
61724 3419890 3595542 3787523 3997497 4227884 4481480 4760621 5067003 5402441 5769480
61715 5769480 6171013 6609359 7085804 7600640 8153080 8740874 9359781 10002829 10659287
61706 10659287 11314172 11949022 12543542 13076974 13529109 13881758 14120714 14237214 14228483 14097869
61696 14097869 13854553 13512090 13086064 12592413 12047092 11465749 10862537 10249216 9635651
61687 9635651 9030682 8441995 7875513 7335619 6825771 6348284 5903796 5491852 5112159
61678E112159l47442l16014k86759k60208k36066k14183j94695j77413j61745
61669B917634j47231j33693j21093j09677r9979r2146q5482p9185p3222o8004
61659A907922o3470n9288n5596n2729n0227m7147m3422m0081l7843l6283l4702
61648A387134l3082l1643l0045k7766k5022k2701k1363k0645j9794j8543j7331
61637A119199j6687j6519j6225j5492j4717j4400j4435j4320j3849j3211j2532
61626I56812j1801j1158j0774j0445r839r174r051r484r595q663p083n920n711
61613H38114n999o026n587n153n223n755o345o822p315p740p753p469p589q356
61599G44982q850q106o465n037m106l040j733r42r84j086m63O57J581K084K253
$$ plain form
61678 5112159 4764717 4448703 4161944 3901736 3665670 3451487 3256792 3079379 2917634
61669 2917634 2770403 2636710 2515617 2405940 2305961 2213815 2128333 2049148 1975926 1907922
61659 1907922 1844452 1785164 1729568 1676839 1626612 1579465 1536043 1495962 1458119 1421836 1387134
61648 1387134 1354052 1322409 1292364 1264598 1239576 1216875 1195512 1174867 1155073 1136530 1119199
61637 1119199 1102512 1085993 1069768 1054276 1039559 1025159 1010724 996404 982555 969344 956812
61626 956812 945011 933853 923079 912634 902795 893621 884570 875086 865491 856828 849745 843825 838114
61613 838114 832115 826089 820502 815349 810126 804371 798026 791204 783889 776149 768396 760927 753338 744982
61599 744982 736132 728026 721561 716524 712418 709378 707645 706703 705719 704633 704170 704827 706408 708492 710745
61584G10745K115J869K012K649L120K854K204J889J974J948J593J250J318J861
61570G39401K646L201L093K394J704J410J223O74k51j320k497l693m440m403m057
61555G35085m269n261o437p183p378p167o759o501o688p105p111o363n223m343
61541F47297l993l940l806l420k831k131j352n87n6J58L69R59J822K490K883L476
61525F37338M514N527O038O325P048Q276R384R886R966J0248J1292J3211J5532
61512G54585J7473J8678J9497K0380K1202K1534K1370K1116K0973K0743K0286
61501I77837J9741J9269J8868J8518J8239J7952J7526J6911J6117J5067J3760
61490A169805J2565J1940J1780J1266R642P041M394K466J138k06j718k843l216
$$ plain form
61584 710745 712860 714729 716741 719390 722510 725364 727568 729457 731431 733379 734972 736222 737540 739401
61570 739401 742047 745248 748341 750735 752439 753849 755072 755746 755495 754175 751678 747985 743545 739142 735085
61555 735085 730816 725555 719118 711935 704557 697390 690631 684130 677442 670337 663226 656863 651640 647297
61541 647297 643304 639364 635558 632138 629307 627176 625824 625237 625181 625339 625708 626667 628489 630979 633862 637338
61525 637338 641852 647379 653417 659742 666790 675066 684450 694336 704302 714550 725842 739053 754585
61512 754585 772058 790736 810233 830613 851815 873349 894719 915835 936808 957551 977837
61501 977837 997578 1016847 1035715 1054233 1072472 1090424 1107950 1124861 1140978 1156045 1169805
61490 1169805 1182370 1194310 1206090 1217356 1226998 1234039 1238433 1240899 1242037 1241831 1240113 1237270 1234054
61477A234054l393m230n661o733o818o124m998l452j679k03R16K384M617P078
61463A205758R276J1739J5116J8881K2016K4614K7731L1798L6297M0988M6350
61452A490564N2552N9043O5481P2225P9498Q6870R4026J01361J09350J17828J26271
61441B455069J34164J40562J44048J43760J40157J34139J25689J13984R8645Q0294
61431C710511N9955L8510J6809m130k3341m0259n4801o7059p6977q4352q9178
61420C385688r1750r2323r0945q7933q4128q0036p5053o8286o0088n1860m4301
61409B558985l6862k9174k1866j5386r040k118M804J0713J5734K0689K5476K9060
61397B551015L1145L2746L4832L7200L9004L9812L9793L9347L8816L8322L7772
$$ plain form
61477 1234054 1230661 1226431 1220770 1214037 1207219 1201095 1196097 1192645 1190966 1190763 1191679 1194063 1198680 1205758
61463 1205758 1215034 1226773 1241889 1260770 1282786 1307400 1335131 1366929 1403226 1444214 1490564
61452 1490564 1543116 1602159 1667640 1739865 1819363 1906233 2000259 2101620 2210970 2328798 2455069
61441 2455069 2589233 2729795 2873843 3017603 3157760 3291899 3417588 3531572 3630217 3710511
61431 3710511 3770466 3808976 3825785 3821655 3798314 3758055 3703254 3636195 3559218 3474866 3385688
61420 3385688 3293938 3201615 3110670 3022737 2938609 2858573 2783520 2715234 2655146 2603286 2558985
61409 2558985 2522123 2492949 2471083 2455697 2446657 2444539 2449343 2460056 2475790 2496479 2521955 2551015
61397 2551015 2582160 2614906 2649738 2686938 2725942 2765754 2805547 2844894 2883710 2922032 2959804
61386B959804L7127L6611L6280L5647L4302L2647L1444L0599K9193K6793K3975
61375C314422K1280J8467J5217J1969R350P153M491Q87l272p163j0121j1966j3142
61362C357572j4448j6310j8307j9692k0139j9750j8533j6436j3951j2147j1724
61351C176135j2165j2160j0913q925p459p297q173r334j0416j1490j2418j2609
61339C052776j1581r510o998m447j819J221N140J0402J7161K5085L3651M2596
61327C153677N1951O1758P1903Q2266R2849J03655J14535J25103J34768J42817
61317D135282J48620J51732J51773J48351J41161J30150J15528R7707P7342N5322
61307E352968L2530R680j2671l4043n4152p2915r0104j05183j17711j27804j35925
$$ plain form
61386 2959804 2996931 3033542 3069822 3105469 3139771 3172418 3203862 3234461 3263654 3290447 3314422
61375 3314422 3335702 3354169 3369386 3381355 3390705 3397858 3402349 3403236 3399964 3392801 3382680 3370714 3357572
61362 3357572 3343124 3326814 3308507 3288815 3268676 3248926 3230393 3213957 3200006 3187859 3176135
61351 3176135 3163970 3151810 3140897 3131972 3124513 3117216 3109043 3099709 3089293 3077803 3065385 3052776
61339 3052776 3041195 3031685 3024687 3020240 3018421 3019642 3024782 3035184 3052345 3077430 3111081 3153677
61327 3153677 3205628 3267386 3339289 3421555 3514404 3618059 3732594 3857697 3992465 4135282
61317 4135282 4283902 4435634 4587407 4735758 4876919 5007069 5122597 5220304 5297646 5352968
61307 5352968 5385498 5395178 5382507 5348464 5294312 5221397 5131293 5026110 4908399 4780595 4644670
61296D644670j42242j46552j48804j49326j48374j45819j41528j35826j29296
61287C356903j22238j14567j06223r7545q9072q1085p3310o5179n6513m7864m0006
61276B463301l3112k6582j9749j2567n556O43N645R523J2850J6283J9864K2966
61264B453509K5124K6700K8344K9974L0703K9884K7869K5647K3917K2621K1283
61253B745575J9608J7705J5667J3216J0055O545L479J053j480m701q120j0930
61241B807672j3277j6011j9358k2653k5390k7698k9613l0818l1403l2154l3468
61230B525829l4605l4622l3556l2086l0459k8509k6401k4524k2767k0633j8171
61219B219496j6108j4941j4474j4311j4248j3975j3064j1618j0461j0256j0658
$$ plain form
61296 4644670 4502428 4355876 4207072 4057746 3909372 3763553 3622025 3486199 3356903
61287 3356903 3234665 3120098 3013875 2916330 2827258 2746173 2672863 2607684 2551171 2503307 2463301
61276 2463301 2430189 2403607 2383858 2371291 2365735 2366378 2372023 2381546 2394396 2410679 2430543 2453509
61264 2453509 2478633 2505333 2533677 2563651 2594354 2624238 2652107 2677754 2701671 2724292 2745575
61253 2745575 2765183 2782888 2798555 2811771 2821826 2828371 2831850 2832903 2831423 2826722 2818602 2807672
61241 2807672 2794395 2778384 2759026 2736373 2710983 2683285 2653672 2622854 2591451 2559297 2525829
61230 2525829 2491224 2456602 2423046 2390960 2360501 2331992 2305591 2281067 2258300 2237667 2219496
61219 2219496 2203388 2188447 2173973 2159662 2145414 2131439 2118375 2106757 2096296 2086040 2075382
61208B075382j0733r982q594o873m842k444J86K757N076P268R776J3093J7363
61195B087433K2322K7606L3002L8380M3553M8385N2864N6911O0110O1846O1675
61184B594087N9453N5187M8827M0295K9567J6805K599j1980k5744l8042m8986
61173B722068n8917o7683p4620p9193q1547q2341q2159q1159p9147p5972p1895
61162A887435o7645o3853o0386n6465n1672m6609m2223l8672l5290l1557k7614
61151A365449k3807k0261j7014j4119j1415q594n729l235j115J191L832N972O742
61138A277897O389N854N572N299M854M315L566K344P47q95k580m516o422p684
61124A294740q283q915r950j0953j1521j1960j2764j3808j4658j5307j6138j7264
$$ plain form
61208 2075382 2064649 2054667 2046073 2039200 2034358 2031914 2032100 2034857 2039933 2047201 2056977 2070070 2087433
61195 2087433 2109755 2137361 2170363 2208743 2252296 2300681 2353545 2410456 2470566 2532412 2594087
61184 2594087 2653540 2708727 2757554 2797849 2827416 2844221 2846820 2834840 2809096 2771054 2722068
61173 2722068 2663151 2595468 2520848 2441655 2360108 2277767 2195608 2114449 2035302 1959330 1887435
61162 1887435 1819790 1755937 1695551 1639086 1587414 1540805 1498582 1459910 1424620 1393063 1365449
61151 1365449 1341642 1321381 1304367 1290248 1278833 1270239 1264510 1261275 1260160 1261351 1265183 1271155 1277897
61138 1277897 1284286 1290140 1295712 1301011 1305865 1310180 1313746 1316090 1316837 1315942 1313362 1308846 1302424 1294740
61124 1294740 1286457 1277542 1267592 1256639 1245118 1233158 1220394 1206586 1191928 1176621 1160483 1143219
61112A143219j8289j8750j8625j8421j8762j9805k1020k1782k2024k2028k1757
61101I21956k0910j9659j8639j8015j7269j6129j5136j4860j5096j5339j5482
61090G35422j5575j5302j4456j3570j3341j3617j3581j2903j2031j1369j0728
61079E88949r803q625p374o095m826l733k908k197j360k50J108K492L555M109
61065E53042M277M297M345M688N649P004P780P213N883N252O005P392Q352Q665
61051F39844Q695Q458P577N991M268L111K707K581K025O95j098k681l589l784
61037F74800l557l359l597m268m833m799m451m542n211n654n099l758k491j882
61023F17299j992k685l712m562m721m184l382k602j789j005p31j403k776l935
$$ plain form
61112 1143219 1124930 1106180 1087555 1069134 1050372 1030567 1009547 987765 965741 943713 921956
61101 921956 901046 881387 862748 844733 827464 811335 796199 781339 766243 750904 735422
61090 735422 719847 704545 690089 676519 663178 649561 635980 623077 611046 599677 588949
61079 588949 579146 570521 563147 557052 552226 548493 545585 543388 542028 541778 542886 545378 548933 553042
61065 553042 557319 561616 565961 570649 576298 583302 591082 598295 604178 609430 615435 622827 631179 639844
61051 639844 648539 656997 664574 670565 674833 677944 680651 683232 685257 685952 684854 682173 678584 674800
61037 674800 671243 667884 664287 660019 655186 650387 645936 641394 636183 630529 625430 621672 619181 617299
61023 617299 615307 612622 608910 604348 599627 595443 592061 589459 587670 586665 585934 584531 581755 577820
61009E77820m031l003j629q43r03j202r36J5J008J382J161Q93R57J200J294J252
60993E74435J464K216L359M513N533O541P541Q237Q486Q712R610J1334J3214J4408
60979F79603J4744J4827J5364J6456J7537J8052J8162J8663K0073K2001K3684
60968H79166K5016K6601K8697L0723L2084L3052L4256L5689L6951L8331M0768
60957A241334M4425M8116N0644N2283N4267N7099O0090O2628O5249O9003P4156
60946A879294Q0001Q6015R2694J00997J11160J22616J35030J48931J65128J84144
60936C106010K06614K33676K66182L03949L46537L94329M47901N06945N71644
60927F383787O45057P32252Q36390R56737J089047J222264J331428J378899J332715
$$ plain form
61009 577820 573789 570786 569157 568314 567411 566209 565273 565288 566296 567678 568839 569732 570689 571889 573183 574435
60993 574435 575899 578115 581474 585987 591520 598061 605602 613839 622325 631037 640647 651981 665195 679603
60979 679603 694347 709174 724538 740994 758531 776583 794745 813408 833481 855482 879166
60968 879166 904182 930783 959480 990203 1022287 1055339 1089595 1125284 1162235 1200566 1241334
60957 1241334 1285759 1333875 1384519 1436802 1491069 1548168 1608258 1670886 1736135 1805138 1879294
60946 1879294 1959295 2045310 2138004 2239001 2350161 2472777 2607807 2756738 2921866 3106010
60936 3106010 3312624 3546300 3812482 4116431 4462968 4857297 5305198 5812143 6383787
60927 6383787 7028844 7761096 8597486 9554223 10643270 11865534 13196962 14575861 15908576
60918A5908576J189629R80003P49856N39839L78384K83030K54535K66078K66073
60909B0816003K02347N0608j76068m40688p02452r28157j094843j191796j223422
60900A5311532j206888j162470j104083j037923r67282q95583q25135p56056o88060
60891F668052o22158n59704n01023m46055l95388l49555l08126k70490k37021
60882B978532k08400j84274j63420j44925j28464j13941j01625r2107q5277p9835
60872A676264p4650o9931o6159o2679n8575n4371n1272m9086m6413m2881l9680
60861A060567l7638l6156l4447l2610l0986k9490k8012k6654k5210k3244k0974
60850G35146j9188j8017j6721j5051j3763j3349j3233j2696j1757j0578r002p275
$$ plain form
60918 15908576 17098205 18078208 18828064 19367903 19746287 20029317 20283852 20549930 20816003
60909 20816003 21018350 21068958 20892890 20452202 19749750 18821593 17726750 16534954 15311532
60900 15311532 14104644 12942174 11838091 10800168 9832886 8937303 8112168 7356112 6668052
60891 6668052 6045894 5486190 4985167 4539112 4143724 3794169 3486043 3215553 2978532
60882 2978532 2770132 2585858 2422438 2277513 2149049 2035108 1933483 1841376 1756099 1676264
60872 1676264 1601614 1531683 1465524 1402845 1344270 1289899 1238627 1189541 1143128 1100247 1060567
60861 1060567 1022929 986773 952326 919716 888730 859240 831228 804574 779364 756120 735146
60850 735146 715958 697941 681220 666169 652406 639057 625824 613128 601371 590793 581791 574516
60838E74516o272o266o251n323l973l163k881k505j989j632j211l73M40N71M15
60823E34103R66K141K651J792M46j47R4K52l66j556k624l100l118l161l528m023
60807E20822m280m145l735l296l104l261l399k980j966q92r7N99J285J628J659
60792D94838K182L727N532O380O197O025O604P710Q807R552R748R448R172R354
60778E95276R531Q819P254N901N458N495N371N146N106N001M347L185K015J162
60764F69067O54M10K36k11j027j818k179k275k549k959k943k331j894k680m768
60749F42733o917p644o714n326m724m866m855m443m431n357o484o673n789m651
60735E63859l811l159k603k337k200j543j97R97J251R78J225K147K918L163L637
$$ plain form
60838 574516 568244 561978 555727 550404 546431 543268 540387 537882 535893 534261 533050 532677 533117 533688 534103
60823 534103 535069 537210 539861 541653 542099 541952 542046 542298 541932 540376 537752 534652 531534 528373 524845 520822
60807 520822 516542 512397 508662 505366 502262 499001 495602 492622 490656 489764 489667 490266 491551 493179 494838
60792 494838 497020 500747 506279 512659 518856 524881 531485 539195 548002 557554 567302 576750 585922 595276
60778 595276 604807 613626 620880 626781 632239 637734 643105 648251 653357 658358 662705 665890 667905 669067
60764 669067 669721 670131 670367 670156 669129 667311 665132 662857 660308 657349 654406 652075 650181 647501 642733
60749 642733 635816 628172 621458 616132 611408 606542 601687 597244 592813 587456 580972 574299 568510 563859
60735 563859 560048 556889 554286 551949 549749 548206 548009 549006 550257 551235 552460 554607 557525 560688 564325
60720E64325N084P040Q389Q657Q314Q011Q053Q511R286J0051J0441J0390J0029
60707F76581R396Q544P761P271O826O067N213M818M888M804M241L566L093K587
60693G55656J846J244J149J240R35K28m20q27j166j496j760k184l103m279m922
60678G42141m652m050l924m298m523m278m034m368n107n544n377n032m926m814
60664F77214m194l073j919r99k51K27J60l36o20k36N50J087J014M63j37l79k01
60647F68370j0j89o30r92j316j866k449k572k309k242k425k218j469r98j453k380
60631F42852l054l539m220m924n239n316n559n908o121o352o803p109o892o557
60617E65259o704p032o762n938n365n266m979m104l101k499k144j574o43M15J236
$$ plain form
60720 564325 569409 576449 584838 593495 601809 609820 617873 626384 635670 645721 656162 666552 676581
60707 676581 685977 694521 702282 709553 716379 722446 727659 732477 737365 742169 746410 749976 753069 755656
60693 755656 757502 758746 759895 761135 762070 762298 761878 761051 759885 758389 756629 754445 751342 747063 742141
60678 742141 737489 733439 729515 725217 720694 716416 712382 708014 702907 697363 691986 686954 682028 677214
60664 677214 673020 669947 668028 667029 666778 667005 667165 666829 666209 665973 666523 667610 668624 669087 668950 668571 668370
60647 668370 668360 668171 667541 666549 665233 663367 660918 658346 656037 653795 651370 649152 647683 646685 645232 642852
60631 642852 639798 636259 632039 627115 621876 616560 611001 605093 598972 592620 585817 578708 571816 565259
60617 565259 558555 551523 544761 538823 533458 528192 523213 519109 516008 513509 511365 509791 509148 509563 510799
60602E10799J626J913K751M172N193M996M135L765M006M119L987M245M869M960
60588E65536M238L650L910M416M163K995J468K50M9J326L449M917N010M587M679
60573F14643N059M951M484M500N277O261O910P145P150P257P832Q795R487R402
60559G09153Q791Q186P726P366P239P259O813N520L914K728J826N92r38k142k865
60544G71168l598m661n896p205q666j0061j0886j1023j0823j0493r892r008q067
60531F60889p039n588l730k079j214j118j407j715j706j085J33J518K602L161
60517F41622L182K837K569K793L339L536L050K373K204K598L052L314L669M343
60503F84481M932M754L758K699K229K125J821J424J594K323K694K247J861K612
$$ plain form
60602 510799 512425 514338 517089 521261 526454 531450 535585 539350 543356 547475 551462 555707 560576 565536
60588 565536 569774 573424 577334 581750 585913 588908 590376 590626 590675 592001 595450 600367 605377 609964 614643
60573 614643 619702 624653 629137 633637 638914 645175 652085 659230 666380 673637 681469 690264 699751 709153
60559 709153 717944 726130 733856 741222 748461 755720 762533 768053 771967 774695 776521 777113 776175 774033 771168
60544 771168 767570 762909 757013 749808 741142 731081 720195 709172 698349 687856 677964 668956 660889
60531 660889 653850 648262 644532 642453 641239 640121 638714 636999 635293 634208 634341 635859 638461 641622
60517 641622 644804 647641 650210 653003 656342 659878 662928 665301 667505 670103 673155 676469 680138 684481
60503 684481 689413 694167 697925 700624 702853 704978 706799 708223 709817 712140 714834 717081 718942 721554
60489G21554M201N378N628N625O063O954Q144R706J1562J3361J5010J6720J8353
60476H48259J9313J9429J9157J8531J6605J2668P537K863n09k861m587n739o490
60463I44176p180p682p404o202m738l667k867j849n06R31K384L946N591P232Q992
60448I31157J1040J3192J5099J6848J9006K1880K5096K8191L1427L5604M1009
60437A189549M6912N2332N7142O2132O8014P4666Q1541Q8524R6117J04761J14313
60426B036003J24357J34733J45534J56485J66470J73474J75095J69227J54737
60417C436115J31605J00654O3378K2195j9570n8553r2479j20390j41964j57034
60407C163957j65882j69583j69667j67348j63122j57001j49093j40007j30622
$$ plain form
60489 721554 725755 731133 736761 742386 748449 755403 763547 773253 784815 798176 813186 829906 848259
60476 848259 867572 887001 906158 924689 941294 953962 961499 964362 963853 960992 956405 950666 944176
60463 944176 936996 929314 921910 915708 910970 907303 904436 902587 902081 903012 905396 909342 914933 922165 931157
60448 931157 942197 955389 970488 987336 1006342 1028222 1053318 1081509 1112936 1148540 1189549
60437 1189549 1236461 1288793 1345935 1408067 1476081 1550747 1632288 1720812 1816929 1921690 2036003
60426 2036003 2160360 2295093 2440627 2597112 2763582 2937056 3112151 3281378 3436115
60417 3436115 3567720 3668374 3731752 3753947 3734377 3675824 3583345 3462955 3320991 3163957
60407 3163957 2998075 2828492 2658825 2491477 2328355 2171354 2022261 1882254 1751632
60398A751632j21376j11992j02172r2313q3112p4681o6680n9231n2934m7800m3057
60387H96284l8307l4039l0542k7149k3347j9882j7784j6795j5802j4440j3222
60376F44975j2346j1434j0456r747r091p878o289n286n167n161m834m766n310
60363E47210n675m993l557k285j581j358j516j771j510n67L47N75M27N69J059
60348E25374J617K331L291L976L795K993K315K065K109K480L211L894M135M155
60334E67741M324M418M125L835M080M464M205L451L046L075K798K024J481J478
60320F14545J332N06m81q09l99K21N60M01j85p78r72q40p00m87Q2P81J081J092
60302F14950J473K355L115L380L447L546L574L746M494N442N567M781M317M873
$$ plain form
60398 1751632 1630256 1518264 1416092 1323779 1240667 1165986 1099306 1040075 987141 939341 896284
60387 896284 857977 823938 793396 766247 742900 723018 705234 688439 672637 658197 644975
60376 644975 632629 621195 610739 600992 591901 584023 577734 572448 567281 562120 557286 552520 547210
60363 547210 541535 536542 532985 530700 529119 527761 526245 524474 522964 522397 522744 523319 523746 524315 525374
60348 525374 526991 529322 532613 536589 540384 543377 545692 547757 549866 552346 555557 559451 563586 567741
60334 567741 572065 576483 580608 584443 588523 592987 597192 600643 603689 606764 609562 611586 613067 614545
60320 614545 615877 616383 615902 615093 614694 614915 615475 615876 615691 614913 613941 613101 612401 611914 611996 612777 613858 614950
60302 614950 616423 618778 621893 625273 628720 632266 635840 639586 644080 649522 655089 659870 664187 669060
60288F69060N574N585N611O600P829P782O445N291N075N000M167K755J377K59
60274G38410n09o15Q6J220K256K955L238L030K407J699J196Q58L59o56k273m087
60258G49574n384n738n357m721m112l685l595l760l787l526l379l612l764l286
60244F91868k434j874j631j240p77q32j342j393n29N19Q78O11L19J81lj94j52
60227F81975J23N19J171K209L217L548L201K961L460M441N159N301N228N404N865
60212G33782O311O528O540O422O242O247O754P712Q569Q893Q986R480J0396J1061
60198H43923J1078J1046J1965J4183J7096J9777K1725K3140K4683K6910K9840
60187A055366L3088L6432L9964M3651M7114N0147N3197N6912O1308O5762O9769
$$ plain form
60288 669060 674634 680219 685830 692430 700259 708041 714486 719777 724852 729852 734019 736774 738151 738410
60274 738410 737901 737286 737372 738592 740848 743803 747041 750071 752478 754177 755373 756231 756590 755934 753661 749574
60258 749574 744190 738452 733095 728374 724262 720577 716982 713222 709435 705909 702530 698918 695154 691868
60244 691868 689434 687560 685929 684689 683912 683080 681738 680345 679816 680335 681213 681824 682143 682324 682321 682127 681975
60227 681975 682098 682617 683788 685997 689214 692762 695963 698924 702384 706825 711984 717285 722513 727917 733782
60212 733782 740093 746621 753161 759583 765825 772072 778826 786538 795107 804000 812986 822466 832862 843923
60198 843923 855001 866047 878012 892195 909291 929068 950793 973933 998616 1025526 1055366
60187 1055366 1088454 1124886 1164850 1208501 1255615 1305762 1358959 1415871 1477179 1542941 1612710
60176A612710P3306P6388P8709Q0028Q0542Q0550P9809P7569P3391O7684O1393
60165B442079N5141M8731M1483L3105K4244J6017Q987K774l135q466j2382j4517
60153B634061j5330j5392j4727j3115j0577p234k947K448Q713J5357K2218K9455
60141B632930L7041M4568N1539N7594O2513O6369O9555P2168P3384P2047O8026
60130C307734O2447N6348M9606M1545L2079K1770J1136N32r531j8538k6437l3476
60118C495215l9547m4087m6690m7443m6593m4172m0171l4830k8549k1584j3877
60107C087672n343L663J2284J9835K6498L2877L8839M3310M5528M5858M4991M2901
60095C438913L9300L4648K9826K5018J9872J4614J0050O377L010p2j773j148J621
$$ plain form
60176 1612710 1686016 1762404 1841113 1921141 2001683 2082233 2162042 2239611 2313002 2380686 2442079
60165 2442079 2497220 2545951 2587434 2620539 2644783 2660800 2669787 2672561 2669426 2660960 2648578 2634061
60153 2634061 2618731 2603339 2588612 2575497 2564920 2557686 2554739 2557187 2565900 2581257 2603475 2632930
60141 2632930 2669971 2714539 2766078 2823672 2886185 2952554 3022109 3094277 3167661 3239708 3307734
60130 3307734 3370181 3426529 3476135 3517680 3549759 3571529 3582665 3583197 3573666 3555128 3528691 3495215
60118 3495215 3455668 3411581 3364891 3317448 3270855 3226683 3186512 3151682 3123133 3101549 3087672
60107 3087672 3082329 3085992 3098276 3118111 3144609 3177486 3216325 3259635 3305163 3351021 3396012 3438913
60095 3438913 3478213 3512861 3542687 3567705 3587577 3602191 3612241 3618618 3621628 3621556 3619783 3618635 3620256
60082C620256N933J1673J8753K6499L4414M2990N2937O4031P5669Q8141J02220
60071D143516J17572J32737J46905J60743J75012J89236K02281K13617K23358
60062E704977K31461K37443K40608K40186K35519K26634K14326J99164J80692
60053G711010J58200J32099J03828P4400M3804J2015k0009n0816p9537j05999
60043G978995j30031j51123j68675j82168j91089j95051j94114j88859j80121
60034F397764j68696j55208j39942j22894j04201q4596o5139m6543k9050j2997
60024E468498R43J2331K1380K8431L3241L5232L4293L0864K5287J7556P826l212
60012E712670j4735k6238l7474m8252n8510o8338p7716q6411r4311j01495j07685
$$ plain form
60082 3620256 3626189 3637862 3656615 3683114 3717528 3760518 3813455 3877486 3953155 4041296 4143516
60071 4143516 4261088 4393825 4540730 4701473 4876485 5065721 5268002 5481619 5704977
60062 5704977 5936438 6173881 6414489 6654675 6890194 7116828 7331154 7530318 7711010
60053 7711010 7869210 8001309 8105137 8179537 8223341 8235356 8215347 8164531 8084994 7978995
60043 7978995 7848964 7697841 7529166 7346998 7155909 6960858 6766744 6577885 6397764
60034 6397764 6229068 6073860 5933918 5811024 5706823 5622227 5557088 5510545 5481495 5468498
60024 5468498 5469441 5481772 5503152 5531583 5564824 5600056 5634349 5665213 5690500 5708056 5715882 5712670
60012 5712670 5697935 5671697 5634223 5585971 5527461 5459123 5381407 5294996 5200685 5099190 4991505
60001D991505j11972j13590j12836j10677j07507j02837r6275q8198p9253o9627
59991C998733n9235m8239l6926k5277j3110o06J1657K3231L4014M3914N2576N9594
59979D040326O4758O8009O9260O8320O4987N9199N1225M1626L0885J9177O618
59968D584390o380j9290l1934m4329n6075o6225p4008p9426q2885q4535q4223
59957C955080q1957p8016p2604o5676n7211m7544l7285k6865j6171m766P474K0045
59945C494504L2313M4161N5775O6998P7361Q6848R5864J04172J10486J13668J13794
59934D395944J11476J06606R8653Q7920P5497O1943M6908L0276J2813m637k1825
59923E001574l8419n3311o5310p4175q0432q4427q6074q5285q2089p6394o8252
$$ plain form
60001 4991505 4879533 4765943 4653107 4542430 4434923 4332086 4235811 4147613 4068360 3998733
59991 3998733 3939498 3891259 3854333 3829056 3815946 3815340 3826997 3850228 3884242 3928156 3980732 4040326
59979 4040326 4105084 4173093 4242353 4310673 4375660 4434859 4486084 4527710 4558595 4577772 4584390
59968 4584390 4578010 4558720 4526786 4482457 4426382 4360157 4286149 4206723 4123838 4039303 3955080
59957 3955080 3873123 3795107 3722503 3656827 3599616 3552072 3514787 3487922 3471751 3466985 3474459 3494504
59945 3494504 3526817 3570978 3626753 3693751 3771112 3857960 3953824 4057996 4168482 4282150 4395944
59934 4395944 4507420 4614026 4712679 4800599 4876096 4938039 4984947 5015223 5028036 5023399 5001574
59923 5001574 4963155 4909844 4844534 4770359 4689927 4605500 4519426 4434141 4352052 4275658 4207406
59912D207406n8307m7620l6880k6054j4803l043Q836K0115L0176L8997M7104N4827
59900D220754O1712O6853O9649P0099O8696O6313O3910O1730N8963N4692M9152
59889D912523M3587L8895L5002L1644K9138K8150K9057L1930L6827M3813N2902
59878E313468O4124P7496R2753J09359J26919J45325J64306J83094K00757K16513
59868F694114K29462K38365K42146K40459K33227K19826J99298J71631J38251
59859H606779J01021O1106J9253k3185o4022j01202j33685j61310j84093k01810
59849G918852k14107k20838k22322k19256k12368k02096j88664j72443j54021
59840F112737j33911j12538r0557o8806m7687k6917o365J3157L0464M5224N7901
$$ plain form
59912 4207406 4149099 4101479 4064599 4038545 4023742 4020699 4029535 4049650 4079826 4118823 4165927 4220754
59900 4220754 4282466 4349319 4418968 4489067 4557763 4624076 4687986 4749716 4808679 4863371 4912523
59889 4912523 4956110 4995005 5030007 5061651 5090789 5118939 5147996 5179926 5216753 5260566 5313468
59878 5313468 5377592 5455088 5547841 5657200 5784119 5929444 6093750 6276844 6477601 6694114
59868 6694114 6923576 7161941 7404087 7644546 7877773 8097599 8296897 8468528 8606779
59859 8606779 8707800 8768906 8788159 8764974 8700952 8599750 8466065 8304755 8120662 7918852
59849 7918852 7704745 7483907 7261585 7042329 6829961 6627865 6439201 6266758 6112737
59840 6112737 5978826 5866288 5775731 5706925 5659238 5632321 5625956 5639113 5669577 5714801 5772702
59829E772702O8338P5244P7465P5220O9430O0248M6975K9385Q458j4339l7998
59818F231128o1928q5390j07372j26986j43811j57718j68541j75974j79878j80619
59808D842911j78921j75371j70159j63329j55006j45389j34719j23440j12135
59799C484442j01151r0531q0452p1443o3884n7515n1818m6647m2190l8492l5433
59788B804886l2949l0939k9039k6878k4493k2160k0019j8220j7201j7266j8023
59777B547699j8754j9305k0077k1142k2077k2661k3150k3677k3968k3911k3808
59766B305169k3699k3000k1220j8617j5741j2753r618o601m062j864N26L415O708
59753B178643J0272J4143J8306K2543K6495K9868L2627L5003L7155L8803L9506
$$ plain form
59829 5772702 5841040 5916284 5993749 6068969 6138399 6198647 6245622 6275007 6283465 6269126 6231128
59818 6231128 6169200 6083810 5976438 5849452 5705641 5547923 5379382 5203408 5023530 4842911
59808 4842911 4663990 4488619 4318460 4155131 4000125 3854736 3720017 3596577 3484442
59799 3484442 3383291 3292760 3212308 3140865 3076981 3019466 2967648 2921001 2878811 2840319 2804886
59788 2804886 2771937 2740998 2711959 2685081 2660588 2638428 2618409 2600189 2582988 2565722 2547699
59777 2547699 2528945 2509640 2489563 2468421 2446344 2423683 2400533 2376856 2352888 2328977 2305169
59766 2305169 2281470 2258470 2237250 2218633 2202892 2190139 2180521 2173920 2169858 2167994 2168520 2171935 2178643
59753 2178643 2188915 2203058 2221364 2243907 2270402 2300270 2332897 2367900 2405055 2443858 2483364
59742B483364L9219L8267L6723L4346L1296K8379K6178K4421K2673K1212K0692
59731B806770K1237K2528K4618K8067L3236L9917M7645N6039O4927P4510Q5320
59720C304814R7582J10835J24621J39374J55809J73375J90051K03988K14613K21607
59710D936669K23381K17427K02198J78171J47080J10725P0761K9321j0668m6060
59700F059005p4642r5922j10853j20656j25903j26730j23724j18100j10808j01803
59690D949864r0586p7369o3260m9135l4850j9889m380J1001K5977M0896N5972
59679D744241P0921Q5538J00186J15353J31114J47322J64078J81640K00039K19186
59669F159618K39203K60318K82442L05246L28550L52347L76343L99687M21365
$$ plain form
59742 2483364 2522583 2560850 2597573 2631919 2663215 2691594 2717772 2742193 2764866 2786078 2806770
59731 2806770 2828007 2850535 2875153 2903220 2936456 2976373 3024018 3080057 3144984 3219494 3304814
59720 3304814 3402396 3513231 3637852 3777226 3933035 4106410 4296461 4500449 4715062 4936669
59710 4936669 5160050 5377477 5579675 5757846 5904926 6015651 6086412 6115733 6105065 6059005
59700 6059005 5984363 5888441 5777588 5656932 5531029 5404299 5280575 5162475 5051667 4949864
59690 4949864 4859278 4781909 4718649 4669514 4634664 4614775 4610395 4621396 4647373 4688269 4744241
59679 4744241 4815162 4900700 5000886 5116239 5247353 5394675 5558753 5740393 5940432 6159618
59669 6159618 6398821 6659139 6941581 7246827 7575377 7927724 8304067 8703754 9125119
59660I125119M40713M57463M71355M81755M87829M89151M86087M79444M69924
59651A3388840M58248M45620M33626M23410M15290M09157M04681M00964L96573
59642A7176409L90251L81257L68742L51432L28501L00265K67492K30528J89844
59633A9984721J47026J04349O3570K5829p504l4895n5506o9188p5571p4044o4666
59622A9944121m8157k4816N622M2669Q4622J29882J77940K28373K79645L29665
59612B1149566L76858M19779M55947M82013M95020M92882M73780M36035L78983
59603B5160863L03719K12928J10240k16j13930k26045l31622m26392n07626n74089
59593B3607830o25164o60463o80626o87940o85649o76783o64004o50087o37640
$$ plain form
59660 9125119 9565832 10023295 10494650 10976405 11464234 11953385 12439472 12918916 13388840
59651 13388840 13847088 14292708 14726334 15149744 15565034 15974191 16378872 16779836 17176409
59642 17176409 17566660 17947917 18316659 18668091 18996592 19296857 19564349 19794877 19984721
59633 19984721 20131747 20236096 20299666 20325495 20317991 20283096 20227590 20158402 20082831 20008787 19944121
59622 19944121 19895964 19871148 19876770 19919439 20004061 20133943 20311883 20540256 20819901 21149566
59612 21149566 21526424 21946203 22402150 22884163 23379183 23872065 24345845 24781880 25160863
59603 25160863 25464582 25677510 25787750 25787534 25673604 25447559 25115937 24689545 24181919 23607830
59593 23607830 22982666 22322203 21641577 20953637 20267988 19591205 18927201 18277114 17639474
59584A7639474o28313o22618o20433o21120o23264o24951o24485o20582o12119
59575A2041589n98435n79966n58002n33590n07108m78946m50037m21334l93185
59566G520986l65502l38279l11641k85704k60713k37111k15151j94650j75371
59557E136864j57504j41467j27365j14893j03774r4001q5660p8656p2767o7905
59547D092872o4303o2333o2030o2813o3845o4631o5180o5635o5912o5751o4910
59536C385529o3300o1096n8685n6248n3472m9968m5929m1958l8153l3895k8774
59525B854051k3254j8111j3508r116m870j035K384N787R387J2826J5595J7679
59513B847815J9561K1609K3587K5004K5949K7307K9816L3085L6134L8903M2466
$$ plain form
59584 17639474 17011161 16388543 15768110 15146990 14523726 13898775 13274290 12653708 12041589
59575 12041589 11443154 10863188 10305186 9771596 9264488 8785542 8335505 7914171 7520986
59566 7520986 7155484 6817205 6505564 6219860 5959147 5722036 5506885 5312235 5136864
59557 5136864 4979360 4837893 4710528 4595635 4491861 4397860 4312200 4233544 4160777 4092872
59547 4092872 4028569 3966236 3904206 3841393 3777548 3712917 3647737 3582102 3516190 3450439 3385529
59536 3385529 3322229 3261133 3202448 3146200 3092728 3042760 2996831 2954873 2916720 2882825 2854051
59525 2854051 2830797 2812686 2799178 2790062 2785192 2784157 2786541 2792328 2801715 2814541 2830136 2847815
59513 2847815 2867376 2888985 2912572 2937576 2963525 2990832 3020648 3053733 3089867 3128770 3171236
59502C171236M7501N3232N8541O3597O9507P6751Q4776R3022J01421J09896J18230
59491D047710J26651J35713J45315J54570J62960J70833J78288J84308J87685
59482E494033J88267J86671J83211J77755J70281J60823J49190J35382J20093
59473F965706J04128Q7684P0955N5079M1451L0125K0009J0775L558n71j834q61
59461G386204K532Q930J8226K9658M2483N5948O8805P9578Q7207R1070R0651Q5641
59449H046933P6018O1481M1281J5391j4383m5420p6335j07250j37909j66596j91299
59438G501912k11210k26469k37048k42737k43899k41491k36253k28314k17705
59429E416786k04841j90311j74485j57540j39789j21814j04166q7016p0184n3534
$$ plain form
59502 3171236 3218737 3271969 3330510 3394107 3463614 3540365 3625141 3718163 3819584 3929480 4047710
59491 4047710 4174361 4310074 4455389 4609959 4772919 4943752 5122040 5306348 5494033
59482 5494033 5682300 5868971 6052182 6229937 6400218 6561041 6710231 6845613 6965706
59473 6965706 7069834 7157518 7228473 7283552 7325003 7355128 7375137 7385912 7389470 7388899 7387065 7386204
59461 7386204 7388736 7397666 7415892 7445550 7488033 7543981 7612786 7692364 7779571 7870641 7961292 8046933
59449 8046933 8122951 8184432 8225713 8241104 8226721 8181301 8104966 7997716 7859807 7693211 7501912
59438 7501912 7290702 7064233 6827185 6584448 6340549 6099058 5862805 5634491 5416786
59429 5416786 5211945 5021634 4847149 4689609 4549820 4428006 4323840 4236824 4166640 4113106
59419D113106l7248k1529o260Q796K3512L7504N0793O3965P7388R0562J02503
59408D503092J12650J21005J27496J31639J32855J30839J25482J16606J04073
59399E605737Q8078O9187M8029K5029M76k5122n0800p5270r7353j16410j32449
59388E339132j45837j56819j65245j70817j73572j73931j72251j68537j62885
59379C849238j55976j48688j41273j33288j24454j15155j05945r6939q8026p9401
59369B660093p1381o3849n6330m8644m1167l4397k8523k3501j9163j5178j1061
59358B246899o498j632L063P066J0045J2055J3602J5206J6729J7359J6616J5226
59346B365736J4589J5454J7493K0202K3619K7776L1937L5082L7078L8841M1181
$$ plain form
59419 4113106 4075858 4054329 4048069 4056865 4080377 4117881 4168674 4232639 4310027 4400589 4503092
59408 4503092 4615742 4736747 4864243 4995882 5128737 5259576 5385058 5501664 5605737
59399 5605737 5693815 5763002 5811031 5836060 5836536 5811414 5760614 5685344 5587991 5471581 5339132
59388 5339132 5193295 5036476 4871231 4700414 4526842 4352911 4180660 4012123 3849238
59379 3849238 3693262 3544574 3403301 3270013 3145559 3030404 2924459 2827520 2739494 2660093
59369 2660093 2588712 2524863 2468533 2419889 2378722 2344325 2315802 2292301 2273138 2257960 2246899
59358 2246899 2240401 2238769 2241832 2248898 2258943 2270998 2284600 2299806 2316535 2333894 2350510 2365736
59346 2365736 2380325 2395779 2413272 2433474 2457093 2484869 2516806 2551888 2588966 2627807 2668988
59335B668988M4029M6995N0200N4151N9155O5338P2956Q2094R2182J02449J13020
59324C451557J24964J39004J54612J70804J87438K05237K24706K45508K66939
59315E170769K88510L09919L30703L50166L67528L81977L92674L98906M00257
59306H391409L96616L88070L74951L57954L38150L16597K93860K69884K44430
59297A1371921K17610J89935J61805J33075J03119P1289L7303J321l6196p4683
59287A2176499j13606j52393j90269k26178k58992k87958l12959l34200l51562
59278I948382l64324l71882l74677l74024l70722l64252l53727l39460l22997
59269F712317l05691k87810k69217k50237k31451k12967j94499j76045j58180
$$ plain form
59335 2668988 2713017 2760012 2810212 2864363 2923518 2988856 3061812 3143906 3236088 3338537 3451557
59324 3451557 3576521 3715525 3870137 4040941 4228379 4433616 4658322 4903830 5170769
59315 5170769 5459279 5769198 6099901 6450067 6817595 7199572 7592246 7991152 8391409
59306 8391409 8788025 9176095 9551046 9909000 10247150 10563747 10857607 11127491 11371921
59297 11371921 11589531 11779466 11941271 12074346 12177465 12248754 12286057 12287378 12251182 12176499
59287 12176499 12062893 11910500 11720231 11494053 11235061 10947103 10634144 10299944 9948382
59278 9948382 9584058 9212176 8837499 8463475 8092753 7728501 7374774 7035314 6712317
59269 6712317 6406626 6118816 5849599 5599362 5367911 5154944 4960445 4784400 4626220
59260D626220j41510j26079j11409r7030q3037p0097n8805m9053m0116l1404k2956
59249C794724j5243q702l468P21M421P959J0967J2724J3104J2770J2376J1958
59237C854311J1225R982Q021N258K307M30L33J451K871M525O901J0160J4273J9635
59223C951683K6546L4304M1727M8495N5024O1067O5611O8365P0289P2158P3538
59212D568807P3720P2759P0814O7188O1025N2592M3081L3272K3121J2467J461
59201E080307r656k0530l0440l8590m4789m9440n2885n5165n6511n7531n8620
59190D606150n9518n9687n8990n7798n6442n4852n2866n0728m8949m7574m5870
59179D012876m3072l9226l4873l0113k4583j8314j1838n186K530J2066K3195L5350
$$ plain form
59260 4626220 4484710 4358631 4247222 4150192 4067155 3997058 3938253 3889200 3849084 3817680 3794724
59249 3794724 3779481 3770779 3767311 3768032 3772453 3780412 3791379 3804103 3817207 3829977 3842353 3854311
59237 3854311 3865536 3875518 3883539 3888797 3891104 3891534 3891867 3893318 3896189 3900714 3907615 3917775 3932048 3951683
59223 3951683 3978229 4012533 4054260 4102755 4157779 4218846 4284457 4352822 4423111 4495269 4568807
59212 4568807 4642527 4715286 4786100 4853288 4914313 4966905 5009986 5043258 5066379 5078846 5080307
59201 5080307 5070651 5050121 5019681 4981091 4936302 4886862 4833977 4778812 4722301 4664770 4606150
59190 4606150 4546632 4486945 4427955 4370157 4313715 4258863 4205997 4155269 4106320 4058746 4012876
59179 4012876 3969804 3930578 3895705 3865592 3841009 3822695 3810857 3805671 3808201 3820267 3843462 3878812
59167C878812M8529O2969P8430R4472J11189J28917J47424J65929J83741K00221
59157E100633K14313K24885K31408K33705K31066K22305K06645J84033J54734
59148G003727J19424P9699L7660n121m7679q8818j27112j61773j92565k18582
59138F398860k38236k50915k57782k60300k58861k53534k45324k35640k24948
59129D173320k12923j99597j85545j71120j56414j41939j28539j16526j05498
59120B755219r5014q4936p5190o5779n7095m9671m3524l8147l3140k8378k3655
59109B160690j8723j3759r279n374j608K256N906R101J2202J5685J9446K2894
59097B199437K5671K8024L0519L3422L6337L8550L9889M1028M2542M3877M3850
$$ plain form
59167 3878812 3927341 3990310 4068740 4163212 4274401 4403318 4550742 4716671 4900412 5100633
59157 5100633 5314946 5539831 5771239 6004944 6236010 6458315 6664960 6848993 7003727
59148 7003727 7123151 7202850 7240510 7235389 7187710 7098892 6971780 6810007 6617442 6398860
59138 6398860 6160624 5909709 5651927 5391627 5132766 4879232 4633908 4398268 4173320
59129 4173320 3960397 3760800 3575255 3404135 3247721 3105782 2977243 2860717 2755219
59120 2755219 2660205 2575269 2500079 2434300 2377205 2327534 2284010 2245863 2212723 2184345 2160690
59109 2160690 2141967 2128208 2118929 2113555 2111947 2114203 2120109 2129210 2141412 2157097 2176543 2199437
59097 2199437 2225108 2253132 2283651 2317073 2353410 2391960 2431849 2472877 2515419 2559296 2603146
59086B603146M2135L9673L7400L5173L2291K8574K4471K0358J6192J1787P143
59075B898343K565j408m354o287p475p948p529o406n101l652j307K521P398J2380
59061B871740J7090K1793K6712L1861L7395M3482M9857N6033O2051O8449P5446
59050C361909Q2547Q9166R5186J00825J06342J12024J17979J23724J28367J31508
59040D449577J33577J34931J34914J32274J26233J16777J04116Q8435P0073M9471
59030E540378K6830K263k3608m9601p4633r8002j18962j36563j50325j60754j68721
59019D588302j74499j77791j78513j77065j73912j69326j63582j57039j49926
59010C066649j42345j34484j26493j18216j09510j00896r3292q6879q0825p4489
$$ plain form
59086 2603146 2645281 2684954 2722354 2757527 2789818 2818392 2842863 2863221 2879413 2891200 2898343
59075 2898343 2900908 2899500 2895146 2888859 2881384 2873436 2865907 2859501 2854400 2850748 2849441 2851962 2859360 2871740
59061 2871740 2888830 2910623 2937335 2969196 3006591 3050073 3099930 3155963 3218014 3286463 3361909
59050 3361909 3444456 3533622 3628808 3729633 3835975 3947999 4065978 4189702 4318069 4449577
59040 4449577 4583154 4718085 4852999 4985273 5111506 5228283 5332399 5420834 5490907 5540378
59030 5540378 5567208 5569471 5545863 5496262 5421629 5323627 5204665 5068102 4917777 4757023 4588302
59019 4588302 4413803 4236012 4057499 3880434 3706522 3537196 3373614 3216575 3066649
59010 3066649 2924304 2789820 2663327 2545111 2435601 2334705 2241413 2154534 2073709 1999220
59000A999220o8326o3042n8313n3204m7670m2822l9515l7267l4874l1694k8096
58989A494397k4932k2759k1398k0133j8517j6883j5845j5448j5235j5011j4987
58978A293249j5047j4552j3137j1270r626q341p182o034m826l299j391M19J594
58965A200557K265L015M052M988N381N155M453L487K542J844J393J095R96J147
58951A242370J362J467J718K565L956N174N600N356N062N079N131M613L199J203
58937A293855o20j723k186k463k882l455m016m336m251l925l772l836l424j925
58923A251041J51J493J612J512K388M114N583O274O774P755R042J0091J0905J1932
58909A330667J3267J4482J5315J6062J7028J8025J8799J9571K0720K2070K3095
$$ plain form
59000 1999220 1930894 1867852 1809539 1756335 1708665 1665843 1626328 1589061 1554187 1522493 1494397
58989 1494397 1469465 1446706 1425308 1405175 1386658 1369775 1353930 1338482 1323247 1308236 1293249
58978 1293249 1278202 1263650 1250513 1239243 1229617 1221276 1214094 1208060 1203234 1199935 1198544 1198963 1200557
58965 1200557 1202822 1205837 1209889 1214877 1220258 1225413 1229866 1233353 1235895 1237739 1239132 1240227 1241223 1242370
58951 1242370 1243732 1245199 1246917 1249482 1253438 1258612 1264212 1269568 1274630 1279709 1284840 1289453 1292652 1293855
58937 1293855 1293235 1291512 1289326 1286863 1283981 1280526 1276510 1272174 1267923 1263998 1260226 1256390 1252966 1251041
58923 1251041 1251192 1252685 1254297 1255809 1258197 1262311 1267894 1274168 1280942 1288697 1297739 1307830 1318735 1330667
58909 1330667 1343934 1358416 1373731 1389793 1406821 1424846 1443645 1463216 1483936 1506006 1529101
58898A529101K3767K4595K5727K6667K7166K7854K9407L1503L3207L4212L5155
58887A848361L6668L8663M0561M1999M3162M4693M7183N0606N4351N7995O1777
58876B366019O5995P0241P3881P7203Q1435Q7377R4546J01936J09143J16459J24207
58865C368442J32534J41711J52117J63694J75818J87996K00635K14769K30864
58856D968580K48246K66027K84318L03842L24454L44923L64487L83724M03107
58847G891708M21359M36198M46344M51662M51534M44281M28579M04452L72362
58838A1748479L32175K83647K27471J65303R9163L1243l6149j01047j62065k17996
58828A2370224k67577l10047l45436l73818l94707m07759m13835m14586m11097
$$ plain form
58898 1529101 1552868 1577463 1603190 1629857 1657023 1684877 1714284 1745787 1778994 1813206 1848361
58887 1848361 1885029 1923692 1964253 2006252 2049414 2094107 2141290 2191896 2246247 2304242 2366019
58876 2366019 2432014 2502255 2576136 2653339 2734774 2822151 2916697 3018633 3127776 3244235 3368442
58865 3368442 3500976 3642687 3794804 3958498 4134316 4322312 4522947 4737716 4968580
58856 4968580 5216826 5482853 5767171 6071013 6395467 6740390 7104877 7488601 7891708
58847 7891708 8313067 8749265 9195609 9647271 10098805 10543086 10971665 11376117 11748479
58838 11748479 12080654 12364301 12591772 12757075 12856238 12887481 12851332 12750285 12588220 12370224
58828 12370224 12102647 11792600 11447164 11073346 10678639 10270880 9857045 9442459 9031362
58819I031362m03581l92342l78368l62719l45926l28218l10054k91985k74266
58810E943903k56886k39964k23888k09050j95603j83452j72295j61594j50729
58801D150442j39512j28581j18926j10760j03111r4880q6122p7914p0912o4599
58791C155125n8054n1073m4202l7903l2033k6139k0003j3859q075k662K791Q562
58779B872475J4328J9530K4087K8504L3267L8482M4015M9700N5326O0755O6138
58768C306607P1823P8101Q5191R3268J02062J10746J18828J27054J36778J48384
58758D378842J61046J74066J87648K02219K17769K34302K52104K71152K90885
58749F370033L10976L31617L52531L72386L89885M04772M17030M25534M28387
$$ plain form
58819 9031362 8627781 8235439 7857071 7494352 7148426 6820208 6510154 6218169 5943903
58810 5943903 5687017 5447053 5223165 5014115 4818512 4635060 4462765 4301171 4150442
58801 4150442 4010930 3882349 3763423 3652663 3549552 3454672 3368550 3290636 3219724 3155125
58791 3155125 3097071 3045998 3001796 2963893 2931860 2905721 2885718 2871859 2863784 2861122 2863913 2872475
58779 2872475 2886803 2906333 2930420 2958924 2992191 3030673 3074688 3124388 3179714 3240469 3306607
58768 3306607 3378430 3456531 3541722 3634990 3737052 3847798 3966626 4093680 4230458 4378842
58758 4378842 4539888 4713954 4901602 5103821 5321590 5555892 5807996 6079148 6370033
58749 6370033 6681009 7012626 7365157 7737543 8127428 8532200 8949230 9374764 9803151
58740I803151M24214M12401L92362L63431L25552K79496K26390J67390J03706
58731A2498093L6661l1891r9086j61697k17901k67865l12015l49485l79125m01290
58721A0314399m17279m27411m31103m28740m22059m12362l99685l84211l67317
58712F624232l50436l33684l16361k98243k79793k61532k43932k27526k12557
58703D100168j98650j85282j72455j60553j49707j39597j29891j20546j11772
58694B731715j03716r6185q8827q1631p5124o9712o5009o0254n5296n0682m6756
58683A938523m3292m0083l7299l4989l2756l0314k8000k6345k5335k4457k3374
58672A592279k2252k1445k1008k0674k0263j9950j9911j9836j9281j8607j8911
$$ plain form
58740 9803151 10227365 10639766 11032128 11395559 11721111 12000607 12226997 12394387 12498093
58731 12498093 12534754 12502863 12403777 12242080 12024179 11756314 11444299 11094814 10715689 10314399
58721 10314399 9897120 9469709 9038606 8609866 8187807 7775445 7375760 6991549 6624232
58712 6624232 6273796 5940112 5623751 5325508 5045715 4784183 4540251 4312725 4100168
58703 4100168 3901518 3716236 3543781 3383228 3233521 3093924 2964033 2843487 2731715
58694 2731715 2627999 2531814 2442987 2361356 2286232 2216520 2151511 2091257 2035961 1985279 1938523
58683 1938523 1895231 1855148 1817849 1782860 1750104 1719790 1691790 1665445 1640110 1615653 1592279
58672 1592279 1570027 1548582 1527574 1506900 1486637 1466687 1446776 1426940 1407659 1389052 1370141
58661A370141k0555k2414k3193k3059k3084k3525k3632k3116k2717k3141k4191
58650A117514k5173k5394k4268k1876j9515j8708j9377j9874j9161j7883j6920
58639H89365j6054j4843j3750j3413j3456j3167j2718j2691j2787j2205j1026
58628G43255j0130r751r205q192p344p107o909n987m478l190k550k200j487n6
58614F64669J907L811N060N518N516N341M891L923K571J373P29M67O9o99j581
58599G03565k251k678k987l118k917k394j738j157q37q13p12K7J339K369K630
58584F88328K892M105N850O839O872P184Q637J0681J2498J4127J5826J7253J8154
58571H19246J9148K0976K3375K5514K7213K8990L1162L3657L6475L9649M2844
$$ plain form
58661 1370141 1349586 1327172 1303979 1280920 1257836 1234311 1210679 1187563 1164846 1141705 1117514
58650 1117514 1092341 1066947 1042679 1020803 1001288 982580 963203 943329 924168 906285 889365
58639 889365 873311 858468 844718 831305 817849 804682 791964 779273 766486 754281 743255
58628 743255 733125 723374 714169 705977 698633 691526 684617 678630 674152 670962 668412 666212 664725 664669
58614 664669 666576 670387 675447 680965 686481 691822 696713 700636 703207 704580 705309 705776 705845 705146 703565
58599 703565 701314 698636 695649 692531 689614 687220 685482 684325 683488 682675 681963 681990 683329 685698 688328
58584 688328 691220 695325 701175 708014 714886 722070 730707 741388 753886 768013 783839 801092 819246
58571 819246 838394 859370 882745 908259 935472 964462 995624 1029281 1065756 1105405 1148249
58560A148249M5713M8672N2722N8341O4930P1409P7204Q2660Q8626R5516J02706
58549A936748J09071J14203J18532J22207J24449J24410J21962J17127J09387
58540B998096R8256Q4084O7580M9046K8897Q434j0920k8954m6217o2426p6369
58529C109507q7396r5937j02300j06021j06882j05755j03766j01201r7754r3359
58519B109136q8230q2445p6155p0012o4820o0632n6610n1977m6919m2373l8993
58508A429970l6495l4152l1730k9667k8266k7116k5538k3423k1346j9945j9394
58497A132898j9370j9378j9171j8982j9165j9648j9976j9983k0000k0205k0278
58486I16742j9917j9202j8167j6568j4624j3319j3228j3531j3040j1857j1011
$$ plain form
58560 1148249 1193962 1242634 1295356 1353697 1418627 1490036 1567240 1649900 1738526 1834042 1936748
58549 1936748 2045819 2160022 2278554 2400761 2525210 2649620 2771582 2888709 2998096
58540 2998096 3096352 3180436 3248016 3297062 3325959 3334393 3323473 3294519 3248302 3185876 3109507
58529 3109507 3022111 2926174 2823874 2717853 2610971 2505216 2401450 2300249 2202495 2109136
58519 2109136 2020906 1938461 1862306 1792294 1727474 1666842 1610232 1558255 1511336 1468963 1429970
58508 1429970 1393475 1359323 1327593 1297926 1269660 1242544 1217006 1193583 1172237 1152292 1132898
58497 1132898 1113528 1094150 1074979 1055997 1036832 1017184 997208 977225 957225 937020 916742
58486 916742 896825 877623 859456 842888 828264 814945 801717 788186 775146 763289 752278
58475G52278j0706j0020q471o807n853n439m982m440m217m486n110n825o190n810
58461F63922m994m761n600o652o777o168o128p151q187q166p512p302p471o917
58447E70136n430m276m397m994m785l872l262l028k371j293p38q63o53K64Q81
58432E31319O25N15J409K334J920O16j3M50J151J626K054K123J234j48p75m53
58416E45987l01r12j554j500j024n48N1P55J000O16L92R69J835K032J389M89j46
58399E49530l77k76n6P6J83M07M99K2q85j531j638j628j776j772j383r23o43l37
58381E37492J80O88J108J767K769L619L958M073M261M261L815L270K958K480J318
58366E78017j40r80r79p77r22j310j606j597j102j0J354K310K483K241K290K964
$$ plain form
58475 752278 741572 731552 723081 716274 710421 704982 700000 695560 691343 686857 681747 675922 669732 663922
58461 663922 658928 654167 648567 641915 635138 628970 622842 615691 607504 599338 591826 584524 577053 570136
58447 570136 564706 560430 556033 551039 546254 542382 539120 536092 533721 532428 531690 530827 530174 530438 531319
58432 531319 531944 532459 533868 536202 538122 538738 538725 539175 540326 541952 544006 546129 547363 547215 546440 545987
58416 545987 545686 544774 543220 541720 540696 540148 540199 540954 541954 542570 542962 543931 545766 547798 549187 549676 549530
58399 549530 549153 548877 548821 548897 549080 549487 549986 550008 549123 547592 545954 544326 542550 540778 539395 538472 537829 537492
58381 537492 537672 538360 539468 541235 544004 547623 551581 555654 559915 564176 567991 571261 574219 576699 578017
58366 578017 577877 576897 575918 575141 574219 572909 571303 569706 568604 568594 569948 572258 574741 576982 579272 582236
58350E82236M098N447O929Q382R367R570R283R087R022Q480P127N518M426L932
58336F82904L559L001K250J279Q0j093j961k517k786k588k010j738k255l054l251
58321F69820k801k391k360k440k363k026j227n0P35N31K5M71J887L038L250L238
58305F67337L869N070O295P227P714P711P580P818Q250Q259P832P586P669P554
58291G67771P128P010P463P850P648P119O632O096N477N091M981M653L869L044
58277H51832K548K251K040K125K581L211M060N330O674P431P697Q287R452J0585
58263I26104J1350J2084J2825J3079J2910J3152J4113J5110J5677J6135J6505
58252A079044J6105J4849J3838J3912J4564J4937J4919J4683J4118J3412J3234
$$ plain form
58350 582236 586334 591781 598710 607092 616459 626029 635312 644399 653421 661901 669028 674546 678972 682904
58336 682904 686463 689464 691714 692993 693073 691980 690019 687502 684716 682128 680118 678380 676125 673071 669820
58321 669820 667019 664628 662268 659828 657465 655439 654212 654162 654897 655428 655453 655924 657811 660849 664099 667337
58305 667337 671206 676276 682571 689798 697512 705223 712803 720621 728871 737130 744962 752548 760217 767771
58291 767771 774899 781909 789372 797222 804870 811989 818621 824717 830194 835285 840266 844919 848788 851832
58277 851832 854380 856631 858671 860796 863377 866588 870648 875978 882652 890083 897780 906067 915519 926104
58263 926104 937454 949538 962363 975442 988352 1001504 1015617 1030727 1046404 1062539 1079044
58252 1079044 1095149 1109998 1123836 1137748 1152312 1167249 1182168 1196851 1210969 1224381 1237615
58241A237615J3710J4119J4145J4448J5428J6433J6867J6990J7099J6981J6808
58230A410643J7333J8561J9500J9816K0481K1913K3031K3135K3268K4495K6125
58219A648301K7008K7458K8511L0264L2302L4847L8137M1393M3692M5296M7016
58208B044225M9014N1156N3825N7312O1150O4845O8658P2842P7134Q1530Q6636
58197B768327R2460R8147J03511J09579J16805J24236J31187J38192J45457J52108
58187C980009J58037J64641J72558J80469J87400J94417K02696K11799K21214
58178E673240K31647K43223K54525K64986K76327K89887L04671L19689L35938
58169H194133L54363L74148L94981M18424M44969M72472M99793N29210N62779
$$ plain form
58241 1237615 1251325 1265444 1279589 1294037 1309465 1325898 1342765 1359755 1376854 1393835 1410643
58230 1410643 1427976 1446537 1466037 1485853 1506334 1528247 1551278 1574413 1597681 1622176 1648301
58219 1648301 1675309 1702767 1731278 1761542 1793844 1828691 1866828 1908221 1951913 1997209 2044225
58208 2044225 2093239 2144395 2198220 2255532 2316682 2381527 2450185 2523027 2600161 2681691 2768327
58197 2768327 2860787 2958934 3062445 3172024 3288829 3413065 3544252 3682444 3827901 3980009
58187 3980009 4138046 4302687 4475245 4655714 4843114 5037531 5240227 5452026 5673240
58178 5673240 5904887 6148110 6402635 6667621 6943948 7233835 7538506 7858195 8194133
58169 8194133 8548496 8922644 9317625 9736049 10181018 10653490 11153283 11682493 12245272
58160A2245272N99199O36934O77471P22601P71516Q23690Q81590R47506J021065
58151A9326844J102994J197660J308696J436438J583401J757708J967456K217067
58143C1898264K513048K865875L280225L751131M277722M874165N560201O349863
58135F5370494P256733Q295840R464656J0729756J2035576J3290492J4308245
58128A40751792J4797520J4493040J3329374J1441511Q969764N923354K303718
58121B12010073j657377n456199q547228j0615557j1664593j1920180j1683764
58114A50465175j1219597j0692468j0161560r620629r042935q401103p675333
58107H3651550o865841n995788n099280m220803l434110k839467k511382k440835
$$ plain form
58160 12245272 12844471 13481405 14158876 14881477 15652993 16476683 17358273 18305779 19326844
58151 19326844 20429838 21627498 22936194 24372632 25956033 27713741 29681197 31898264
58143 31898264 34411312 37277187 40557412 44308543 48586265 53460430 59020631 65370494
58135 65370494 72627227 80923067 90387723 101117479 113153055 126443547 140751792
58128 140751792 155549312 170042352 183371726 194813237 203783001 209706355 212010073
58121 212010073 210352696 204896497 196349269 185733712 174069119 162148939 150465175
58114 150465175 139245578 128553110 118391550 108770921 99727986 91326883 83651550
58107 83651550 76785709 70789921 65690641 61469838 58035728 55196261 52684879 50244044
58099E0244044k535659k676746k772822k779932k697589k556592k397902k249543
58091B9577259k119244k004063j899366j798884j694922j583309j465357j344051
58083A5668063j221912j102853r91791q90903p99101p15712o41613n76582n18929
58074H208667m68383m26202l91691l61493l33266l07586k85335k65499k46564
58065E122648k28259k10999j95017j80770j68907j59343j51256j44115j37849
58056C546133j32161j26696j21583j16887j12042j06747j01753r7637r3675q9101
58046B447851q4561q0855p7321p3130o9177o6761o5135o2535n9032n6283n4715
58035A698346n3113n0892m8825m7333m5860m4144m2551m1034l9164l7295l6236
$$ plain form
58099 50244044 47708385 45031639 42258817 39478885 36781296 34224704 31826802 29577259
58091 29577259 27458015 25453952 23554586 21755702 20060780 18477471 17012114 15668063
58083 15668063 14446151 13343298 12351507 11460604 10661503 9945791 9304178 8727596 8208667
58074 8208667 7740284 7314082 6922391 6560898 6227632 5920046 5634711 5369212 5122648
58065 5122648 4894389 4683390 4488373 4307603 4138696 3979353 3828097 3683982 3546133
58056 3546133 3413972 3287276 3165693 3048806 2936764 2830017 2728264 2630627 2536952 2447851
58046 2447851 2363290 2282435 2205114 2131984 2062807 1996046 1930911 1868376 1809344 1753061 1698346
58035 1698346 1645233 1594341 1545516 1498183 1452323 1408179 1365628 1324594 1285430 1248135 1211899
58024A211899l5771l4947l3789l3230l3250l2686l1150k9634k8773k7803k5871
58013H64995k3304k1038j9504j8513j7682j6694j5533j4517j3750j2850j1603
58002F80007j0426r651q998q443q718j0045j1150j0783r530q787q651q308p863
57989E58654q129q854q911q144p423o938o034m860m426m822m869m014l136l044
57975D75050l370l488l377l141k717k494l134m396n060m462l280k419k079k135
57961D29498k527k927k845k352j995j823j438j090j597k903l840l763l373l425
57947C93600l662l647l768m609n895o790o825o077m833l549k767k635k808k863
57933C32872k615k098j620j694k314k599j897r13p80j231j014m6L01o33j724j852
$$ plain form
58024 1211899 1176128 1141181 1107392 1074162 1040912 1008226 977076 947442 918669 890866 864995
58013 864995 841691 820653 801149 782636 764954 748260 732727 718210 704460 691610 680007
58002 680007 669581 659930 650932 642489 633771 623726 612576 601793 592263 583476 574825 566517 558654
57989 558654 550525 541671 532760 524616 517193 510255 504221 499361 494935 490113 485244 481230 478094 475050
57975 475050 471680 468192 464815 461674 458957 456463 453329 448933 443873 439411 436131 433712 431633 429498
57961 429498 426971 424044 421199 418847 416852 415029 413591 412501 410904 408001 404161 400398 397025 393600
57947 393600 389938 386291 382523 377914 372019 365229 358404 352327 347494 343945 341178 338543 335735 332872
57933 332872 330257 328159 326539 324845 322531 319932 318035 317122 316342 315111 314097 314051 314352 313719 311995 310143
57917C10143j428j391j720j905j962k014j595m05P90R77K42m90p76r00j053j057
57901B95456q85q50j202j955k953l831m107l625k839k375k416k690k863k786k543
57886B57536k384k401k264j579n05L58O62M85p7r23j543j369o31k31o00j299j918
57869B41317k567l235l521l415l551m222m778m615m112l958m081l936l377k572
57855A89377j489j19J095J638J598J388J180J031J293K201L281L806L693L453
57841B13426L346L144K723K364K363K696L136L453L393K751J573K22q10j250j293
57826B41237j506k285l505m765n803o410o192n068l762l069k720j810l52N62M07
57811A94959n8j39j83m89l25R38K446K899K439K326K982L569L462K978K442J591
$$ plain form
57917 310143 308715 307324 305604 303699 301737 299723 298128 297723 298513 299490 299732 299242 298466 297566 296513 295456
57901 295456 294571 293721 292519 290564 287611 283780 279673 276048 273209 270834 268418 265728 262865 260079 257536
57886 257536 255152 252751 250487 248908 248403 248761 249423 249908 249831 248908 247365 245996 245365 245134 244534 243235 241317
57869 241317 238750 235515 231994 228579 225028 220806 216028 211413 207301 203343 199262 195326 191949 189377
57855 189377 187888 187769 188864 190502 192100 193488 194668 195699 196992 199193 202474 206280 209973 213426
57841 213426 216772 219916 222639 225003 227366 230062 233198 236651 240044 242795 244368 244590 243780 242530 241237
57826 241237 239731 237446 233941 229176 223373 216963 210771 205703 201941 198872 196152 194342 193990 194552 194959
57811 194959 194901 194762 194579 194090 193765 194703 197149 200048 202487 204813 207795 211364 214826 217804 220246 221837
57795B21837L27p71j172j094j100j367j689j853j797j640j687k102k557k535k092
57780A98708j824k042k394k523k619k959l275l053k338j844k147l029l795m092
57766A60774m276m812n480n511m601l448k962l175l341l025k542k340k401k527
57752A10333k734l027l068k500j437l40N29J213J633J550J051O95Q43J109Q97
57737A06747K54k08j90N4L65R63J834K408K321K078K365L005L144K427J320M04
57721A29291j48l44k09j1j62p54j503k163k648k801k555k257k229k117j324k49
57705A07817p5j062j912j439j43O61O22M49O04Q52R98J225J582J803J865K189
57689A16036L044M054M529M169L355K801K875L279L427L156K818K718K838L128
$$ plain form
57795 221837 222164 221393 220221 219127 218027 216660 214971 213118 211321 209681 207994 205892 203335 200800 198708
57780 198708 196884 194842 192448 189925 187306 184347 181072 178019 175681 173837 171690 168661 164866 160774
57766 160774 156498 151686 146206 140695 136094 132646 129684 126509 123168 120143 117601 115261 112860 110333
57752 110333 107599 104572 101504 99004 97567 97227 97756 98969 100602 102152 103203 103898 104741 105850 106747
57737 106747 107001 106793 106603 106657 107022 107985 109819 112227 114548 116626 118991 121996 125140 127567 128887 129291
57721 129291 129143 128799 128590 128579 128417 127663 126160 123997 121349 118548 115993 113736 111507 109390 108066 107817
57705 107817 107742 106680 104768 103329 103186 103847 104469 104918 105522 106374 107372 108597 110179 111982 113847 116036
57689 116036 119080 123134 127663 131832 135187 137988 140863 144142 147569 150725 153543 156261 159099 162227
57675A62227L593L930L646K908K635L236L792L239K011J583K512L853M563M700
57661B08428M860N197N489N831O565P724Q855R470R481R146Q806Q703Q974R668
57647C17197J0750J2070J3373J4434J5104J5376J5471J5775J6535J7676J9043
57636D82804K0692K2687K4723K6386K7802K9618L2250L5580L9442M3903M8841
57625H34728N3781N8512O3532O9518P6618Q4489R2722J00938J08812J16305J23593
57614A783548J30489J36227J40007J41271J39245J32757J20987J03945Q1944N5330
57604B965750K5389n116l3180n7191p6787r1831j02413j09490j14250j16805j16492
57593B167584j13577j09555j05500j00998r5195q8222q0939p3813o6673n9377
$$ plain form
57675 162227 165820 169750 173396 176304 178939 182175 185967 189206 191217 192800 195312 199165 203728 208428
57661 208428 213288 218485 223974 229805 236370 244094 252949 262419 271900 281046 289852 298555 307529 317197
57647 317197 327947 340017 353390 367824 382928 398304 413775 429550 446085 463761 482804
57636 482804 503496 526183 550906 577292 605094 634712 666962 702542 741984 785887 834728
57625 834728 888509 947021 1010553 1080071 1156689 1241178 1333900 1434838 1543650 1659955 1783548
57614 1783548 1914037 2050264 2190271 2331542 2470787 2603544 2724531 2828476 2910420 2965750
57604 2965750 2991139 2986023 2952843 2895652 2818865 2727034 2624621 2515131 2400881 2284076 2167584
57593 2167584 2054007 1944452 1838952 1737954 1642759 1554537 1473598 1399785 1333112 1273735
57583A273735n2192m5529l9559l4149k9063k4224j9694j5386j0975o356j952J777
57571I96433M978Q240J1875J5711J9529K3334K7301L1712L6781M2281M7586N2452
57559A318213N7402O2845O8285P3005P7097Q0947Q3902Q4553Q2306P7676P1017
57548B137248O1999N0646L7836K4241R689n851k1418l5818m8600n9703o8828p5840
57536B005601q1246q5420q7859q8074q6839q5494q4125q1513p7097p2006o7611
57525A108317o3880n9847n5268n0936m7375m4049m0173l5817l1741k8410k5742
57514F25079k3591k1928k0449j8651j6530j4654j3217j1637r566p725o961o891
57502D53279o361n017l571k573j839j176p59m91J89J475K849L890M786N703O304
$$ plain form
57583 1273735 1221543 1176014 1136455 1102306 1073243 1049019 1029325 1013939 1002964 996608 994656 996433
57571 996433 1001411 1009651 1021526 1037237 1056766 1080100 1107401 1139113 1175894 1218175 1265761 1318213
57559 1318213 1375615 1438460 1506745 1579750 1656847 1737794 1821696 1906249 1988555 2066231 2137248
57548 2137248 2199247 2249893 2287729 2311970 2321659 2315808 2294390 2258572 2209972 2150269 2081441 2005601
57536 2005601 1924355 1838935 1751076 1663002 1576163 1490669 1406544 1325031 1247934 1175928 1108317
57525 1108317 1044437 984590 929322 878386 831011 786962 746789 710972 679231 650821 625079
57514 625079 601488 579560 559111 540460 523930 509276 496059 484422 474856 467131 460170 453279
57502 453279 446918 441901 438330 435757 433918 432742 431983 431492 431681 433156 436005 439895 444681 450384 456688
57487D56688O409O503P124Q148R225J0387J1721J2935J3876J5102J7251K0088
57475E95457K2774K4898K6642K8173K9631L1614L4878L9320M3849M7596N0782
57464I75614N4147N7875O1510O4682O7454O9796P1082P0467O7724O3375N7862
57453A681588N0924M2050L1371J9658P607m451j6186k7112l6909m5454n2391n7215
57441A593480n9944o1290o1933o2005o1453o0340n8474n5309n0770m5800m1598
57430I74564l8393l5449l2070k8210k4177k0180j6262j2449q912n904l430j056
57418G48072J620M390O727Q656J0747J3238J5809J8407K1486K5076K8457L1325
57406I34010L4509L8722M3318M7157N0226N3372N6806N9866O2035O3121O2470
$$ plain form
57487 456688 463097 469600 476724 484872 494097 504484 516205 529140 543016 558118 575369 595457
57475 595457 618231 643129 669771 697944 727575 759189 794067 833387 877236 924832 975614
57464 975614 1029761 1087636 1149146 1213828 1281282 1351078 1422160 1492627 1560351 1623726 1681588
57453 1681588 1732512 1774562 1805933 1825591 1833198 1828747 1812561 1785449 1748540 1703086 1650695 1593480
57441 1593480 1533536 1472246 1410313 1348308 1286855 1226515 1168041 1112732 1061962 1016162 974564
57430 974564 936171 900722 868652 840442 816265 796085 779823 767374 758462 752558 749128 748072
57418 748072 749692 754082 760809 769465 780212 793450 809259 827666 849152 874228 902685 934010
57406 934010 968519 1007241 1050559 1097716 1147942 1201314 1258120 1317986 1380021 1443142 1505612
57395A505612N9159N3154M5477L6985K7742J7674P014m109j5678k7080l7169m5405
57383A623376n2277n8222o2856o5699o6958o7075o6131o4287o2229o0423n8372
57372I38847n5342n1501m7616m3874l9860l5615l1837k8893k6309k3580k0903
57361E33517j8796j7411j6580j6091j5539j4283j2093r738q339q117q166p609
57349C80755o556n659n146m652l896l041k327j781j390j243j284j194p40j27K76
57334C41995L97M60O23R01J292J746K046K074K158K811L993M997N246M948M719
57319C80406M781M789M392L679L041K805L056L639M231M541M538M510M779N369
57305D38556N938N985N229L965L009L111M149N126N224M765M757N546O406O536
$$ plain form
57395 1505612 1564771 1617925 1663402 1700387 1728129 1745803 1752817 1748708 1733030 1705950 1668781 1623376
57383 1623376 1571099 1512877 1450021 1384322 1317364 1250289 1184158 1119871 1057642 997219 938847
57372 938847 883505 832004 784388 740514 700654 665039 633202 604309 578000 554420 533517
57361 533517 514721 497310 480730 464639 449100 434817 422724 412986 404647 396530 388364 380755
57349 380755 374199 368540 363394 358742 354846 351805 349478 347697 346307 345064 343780 342586 341846 341719 341995
57334 341995 342392 342852 343475 344376 345668 347414 349460 351534 353692 356503 360496 365493 370739 375687 380406
57319 380406 385187 389976 394368 398047 401088 403893 406949 410588 414819 419360 423898 428408 433187 438556
57305 438556 444494 450479 455708 459673 462682 465793 469942 475068 480292 485057 489814 495360 501766 508302
57291E08302O045N597N555N841O335O840O949O515O142O539P393P636O903O114
57277E98706O230P077P773P853P547P267P340P904Q718R255R330R344R625R849
57263G13818R593R126R101R594J0063J0247J0548J1390J2531J3289J3224J2520
57251H45044J1791J1573J1917J2469J2882J3046J2876J2290J1459J0803J0486
57240I76636J0188R733R542J0135J1334J2478J3309J4179J5371J6658J7608J8118
57228A135289J8432J8815J9275J9503J9138J8118J6731J5327J4058J2928J1817
57217A319431J0484Q898P507O762O299N209L267J252k52j581l098m398n140n909
57203A348731p355q998r904j0112j0296j0391r806q879q722r457r919r454q778
$$ plain form
57291 508302 514347 519944 525499 531340 537675 544515 551464 557979 564121 570660 578053 585689 592592 598706
57277 598706 604936 612013 619786 627639 635186 642453 649793 657697 666415 675670 685000 694344 703969 713818
57263 713818 723411 732537 741638 751232 761295 771542 782090 793480 806011 819300 832524 845044
57251 845044 856835 868408 880325 892794 905676 918722 931598 943888 955347 966150 976636
57240 976636 986824 996557 1006099 1016234 1027568 1040046 1053355 1067534 1082905 1099563 1117171 1135289
57228 1135289 1153721 1172536 1191811 1211314 1230452 1248570 1265301 1280628 1294686 1307614 1319431
57217 1319431 1329915 1338813 1346320 1353082 1359381 1364590 1367857 1369109 1368857 1367276 1364178 1359780 1354640 1348731
57203 1348731 1341376 1332378 1322474 1312362 1302066 1291675 1281869 1272990 1264268 1254811 1244892 1235438 1226660
57190A226660q506q064o860n557n109n163m556l034j509n55L40J888L965N862
57176A189802P170Q060Q779R211R100Q584Q182Q112P961P314O470N970N671M885
57162A295271L464K072J246P97L73k5m08j111k339l708m747n459o072o539o686
57147A266129o620o591o679o885p319p989q682r300j0126j1374j2675j3366j3255
57134A145268j2823j2751j3368j4415j5239j5365j5013j4847j5091j5231j4823
57123I86302j4217j4111j4624j5183j5326j5266j5627j6813j8707k0853k2749
57112H02826k4025k4517k4501k4822k6298k8669l0641l1397l1654l2536l3808
57101D89958l4298l3909l3919l4945l5805l5160l3348l1628l0255k8332k5412
$$ plain form
57190 1226660 1218154 1210090 1203230 1197673 1192564 1187401 1182845 1179811 1178302 1177747 1178087 1179975 1183940 1189802
57176 1189802 1196972 1205032 1213811 1223022 1232122 1240706 1248888 1257000 1264961 1272275 1278745 1284715 1290386 1295271
57162 1295271 1298735 1300807 1302053 1302850 1303223 1303198 1302790 1301679 1299340 1295632 1290885 1285426 1279354 1272815 1266129
57147 1266129 1259509 1252918 1246239 1239354 1232035 1224046 1215364 1206064 1195938 1184564 1171889 1158523 1145268
57134 1145268 1132445 1119694 1106326 1091911 1076672 1061307 1046294 1031447 1016356 1001125 986302
57123 986302 972085 957974 943350 928167 912841 897575 881948 865135 846428 825575 802826
57112 802826 778801 754284 729783 704961 678663 649994 619353 587956 556302 523766 489958
57101 489958 455660 421751 387832 352887 317082 281922 248574 216946 186691 158359 132947
57090A32947k2249k0013j9435k0771k4063b828l6438m6062n8346p2689q7818j02606
57078d06787j16646j30009j42803j55003j66674j78433j91547k07243k25716k46083
57068b166944k67523k90205l15014l42693l73410m06958m43149m82272n25114
57059e613282n72289o23669o79110p39617q06936q81803r63498j051677j147897
57050a3079778j254808j374641j509307j661524j835056k034291k264354k531596
57042b7545355k843840l210881l645399m162690m778775n509155o368517p367080
57034f5431692q501644r749547j1076018j2450396j3849903j5236581j6523680
57027a52819461j7569403j8219313j8374167j8031596j7268740j6180437j4817592
$$ plain form
57090 132947 110698 90685 71250 50479 26416 -2828 -39266 -85328 -143674 -216363 -304181 -406787
57078 -406787 -523433 -653442 -796245 -951248 -1117922 -1296355 -1487902 -1695145 -1920861 -2166944
57068 -2166944 -2434467 -2724672 -3039686 -3382379 -3755789 -4162747 -4605896 -5088168 -5613282
57059 -5613282 -6185571 -6809240 -7488350 -8227967 -9034903 -9916706 -10880204 -11931881 -13079778
57050 -13079778 -14334586 -15709227 -17218534 -18880058 -20715114 -22749405 -25013759 -27545355
57042 -27545355 -30389195 -33600076 -37245475 -41408165 -46186940 -51696095 -58064612 -65431692
57034 -65431692 -73933336 -83682883 -94758901 -107209297 -121059200 -136295781 -152819461
57027 -152819461 -170388864 -188608177 -206982344 -225013940 -242282680 -258463117 -273280709
57020b73280709j3160431j1133480q652528n687675k315908J270090M810062Q054521
57012c00096058J0826307J3039167J4682574J5795688J6443933J6701901J6644170
57005a95962318J6342672J5864347J5265023J4582994J3837794J3034289J2169303
56998i4865896J1240185J0254237R233788Q212322P224742O299464N455855M704608
56990c2240695M048584L484175L003469K596268K251687J959729J712248J502503
56982a1682032J324171J171449J039939R26649Q29007P44346O70303O05213N47998
56973c822957M97981M54673M17340L84830L56117L30774L08501K88508K69937
56964e14296K52685b4415A98974K10565J98246J86783J76734J68123J60530J53620
$$ plain form
57020 -273280709 -286441140 -297574620 -306227148 -311914823 -314230731 -312960641 -308150579 -300096058
57012 -300096058 -289269751 -276230584 -261548010 -245752322 -229308389 -212606488 -195962318
57005 -195962318 -179619646 -163755299 -148490276 -133907282 -120069488 -107035199 -94865896
56998 -94865896 -83625711 -73371474 -64137686 -55925364 -48700622 -42401158 -36945303 -32240695
56990 -32240695 -28192111 -24707936 -21704467 -19108199 -16856512 -14896783 -13184535 -11682032
56982 -11682032 -10357861 -9186412 -8146473 -7219824 -6390817 -5646471 -4976168 -4370955 -3822957
56973 -3822957 -3324976 -2870303 -2452963 -2068133 -1712016 -1381242 -1072741 -784233 -514296
56964 -514296 -261611 -24415 198974 409539 607785 794568 971302 1139425 1299955 1453575
56954A453575J47403J42006J37233J32471J27271J22138J18280J16121J14224
56945B610722J10079J01915Q9695P4814N9306M4987L2630K1866J2215M021j957
56934C160293n565p286p580o859o009o032p052q245q945r215r303r191q962q943
56920C051106r229r569j0104j1585j4320j7297j8968j8710j7167j5363j3854j2583
56908B882357j1137r218p083n390m477m081l969m375n402o454p048p897j0307
56895B795519j4345j8497k1429k3450k5640k8134l0031l0809l1030l1450l2010
56884B508694l2092l1424l0374k9408k8571k7576k6228k4640k3054k1594k0247
56873B213486j8974j7792j6716j5854j5502j5957j7192j8855k0692k2699k4698
$$ plain form
56954 1453575 1600978 1742984 1880217 2012688 2139959 2262097 2380377 2496498 2610722
56945 2610722 2720801 2822716 2912411 2987225 3046531 3091518 3124148 3146014 3158229 3162250 3160293
56934 3160293 3154728 3147442 3139862 3133003 3126994 3120962 3113910 3105665 3096720 3087505 3078202 3069011 3060049 3051106
56920 3051106 3041877 3032308 3022204 3010619 2996299 2979002 2960034 2941324 2924157 2908794 2894940 2882357
56908 2882357 2871220 2862002 2854919 2849529 2845052 2840971 2837002 2832627 2827225 2820771 2813723 2805826 2795519
56895 2795519 2781174 2762677 2741248 2717798 2692158 2664024 2633993 2603184 2572154 2540704 2508694
56884 2508694 2476602 2445178 2414804 2385396 2356825 2329249 2303021 2278381 2255327 2233733 2213486
56873 2213486 2194512 2176720 2160004 2144150 2128648 2112691 2095499 2076644 2055952 2033253 2008555
56862B008555k6139k6614k6367k5877k5200k4209k3273k2967k3080k2697k1485
56851A740647k0218j9624j9434j9133j8945j9272j9631j9224j8382j8440k0003
56840A528341k2177k3798k4648k5120k5296k4987k4241k3269k2040k0351j8228
56829A274186j5990j3932j2119j0346q264n680k859l97J271K054K036J445P77
56816A212182M69K95m81k126m005n353o089o528o651o081m611k476j40J926L461
56801A173792M549N380N788N352M013K227K30k325n622q980j1418j2701j3322
56788A146963j3633j3480j2654j1200r286p132n064l289j580N74L482P012J0653
56775A091366J3518J4626J3631J1169Q097M542J21n072j0323j5035j8982k1802
$$ plain form
56862 2008555 1982416 1955802 1929435 1903558 1878358 1854149 1830876 1807909 1784829 1762132 1740647
56851 1740647 1720429 1700805 1681371 1662238 1643293 1624021 1604390 1585166 1566784 1548344 1528341
56840 1528341 1506164 1482366 1457718 1432598 1407302 1382315 1358074 1334805 1312765 1292414 1274186
56829 1274186 1258196 1244264 1232145 1221799 1213535 1207855 1204996 1204599 1205870 1207924 1209960 1211405 1212182
56816 1212182 1212651 1212946 1212465 1210339 1206334 1200981 1194892 1188364 1181713 1175632 1171021 1168545 1168405 1170331 1173792
56801 1173792 1178341 1183721 1189509 1194861 1198874 1201101 1201331 1199006 1193384 1184404 1172986 1160285 1146963
56788 1146963 1133330 1119850 1107196 1095996 1086710 1079578 1074514 1071225 1069645 1070219 1073701 1080713 1091366
56775 1091366 1104884 1119510 1133141 1144310 1152407 1156949 1157070 1151998 1141675 1126640 1107658 1085856
56763A085856k2978k2689k2001k1750k1567k0503j8371j5876j3654j1606r334
56752H85527o717l926j121J518L568M412L678J498j675n423r384j3014j5692j7160
56738H26089j7764j8042j8192j8022j7372j6346j5225j4220j3315j2241j0735
56727F54615q883p055n412l673j616L78J515J303j19k204m328o030p222q203r297
56712E93769j0501j1687j2856j3856j4077j3016j1240j0134j0411j1251j1293
56701D63447j0212q860q071p807p594p192o597n696m451l324l023l587m113l739
56687C79181k677j923k028k580k901k835k679k716k995l295l237k693k183k430
56673C42009l334l887l425k446j817j683j677j735k046k437k524k368k309k272
$$ plain form
56763 1085856 1062878 1040189 1018188 996438 974871 954368 935997 920121 906467 894861 885527
56752 885527 878810 874884 873763 875281 878849 883261 886939 888437 886762 881339 871955 858941 843249 826089
56738 826089 808325 790283 772091 754069 736697 720351 705126 690906 677591 665350 654615
56727 654615 645732 638677 633265 629592 627976 628354 629869 631172 631053 628849 624521 618491 611269 603066 593769
56712 593769 583268 571581 558725 544869 530792 517776 506536 496402 485991 474740 463447
56701 463447 453235 444375 436304 428497 420903 413711 407114 401418 396967 393643 390620 387033 382920 379181
56687 379181 376504 374581 372553 369973 367072 364237 361558 358842 355847 352552 349315 346622 344439 342009
56673 342009 338675 334788 331363 328917 327100 325417 323740 322005 319959 317522 314998 312630 310321 308049
56659C08049j881j235q27p79p66q36j452k566l368l311k753k214j651q80k33k13
56643B83084q09j619k370k949l190l029k644k208j706j246j145j365j335p35p8
56628B56656k5m75r03j249j746k113j789r23l47l70l77J05N87L68l97r29q72o37
56610B44564p65j306j836j890j393o91j87O8K15J66k78q61r05j75O43P26N1p30
56592B35416j107r94m73K20N85K46m78q74o91l34j63j20j23l23p15r30p48m69
56574B27925m99q16j149j363j447j409j438j858k534k712j972r70o56r91j084
56559B07027n23J87N01M57K48j54n89n31K09J008J133O89M27P98J529K104K323
56542B16843K304K135J700R97M54O67J515J973J270K9l72M22J368J439P49k9o27
$$ plain form
56659 308049 306168 304933 304106 303327 302561 301725 300273 297707 294339 291028 288275 286061 284410 283530 283297 283084
56643 283084 282275 280656 278286 275337 272147 269118 266474 264266 262560 261314 260169 258804 257469 256734 256656
56628 256656 256631 256156 255253 254004 252258 250145 248356 247433 247086 246716 246339 246444 247031 247399 247002 246073 245201 244564
56610 244564 243799 242493 240657 238767 237374 236683 236496 236564 236779 236945 236667 235806 234901 234726 235369 236095 236146 235416
56592 235416 234309 233315 232842 233062 233647 233893 233415 232541 231850 231516 231353 231233 231110 230787 230072 229142 228394 227925
56574 227925 227426 226610 225461 224098 222651 221242 219804 217946 215412 212700 210728 209758 209102 208111 207027
56559 207027 206504 206691 207192 207649 207897 207743 207154 206623 206832 207840 208973 209662 210089 210887 212416 214520 216843
56542 216843 219147 221282 222982 223979 224433 225100 226615 228588 229858 229887 229515 229937 231305 232744 233493 233464 232837
56525B32837j153j602j907k071j941j239j52O18Q11J071J936K895L072K444J756
56510B37375J519J732K264K870L105K886K879L683M807N221M821M549N081O036
56496B88828O605O379N534M681M474M929N195M484L105K024J573J231N71k65j010
56481C38338j526j682j564j691k382l114l301l399m233n402n590m614l817m086
56467B91937m654m545l987l662l525l249l080l270l345k839k251k313k803k987
56453B45427k879l037l385l218k406j653j418j384j196j050j237j589j674j353
56439B17948q51m98l60j85K84Q21Q04k8j153j795j685j056k35M11M53j80q76q48
56421B10971K5J122J688J382M91j28L36J704K764K663J938J705K095K246J738
$$ plain form
56525 232837 231684 230082 228175 226104 224163 222924 222772 223390 224201 225272 227208 230103 233175 235619 237375
56510 237375 238894 240626 242890 245760 248865 251751 254630 258313 263120 268341 273162 277711 282792 288828
56496 288828 295433 301812 307346 312027 316501 321430 326625 331109 334214 336238 337811 339042 339613 339348 338338
56481 338338 336812 335130 333566 331875 329493 326379 323078 319679 315446 310044 304454 299840 296023 291937
56467 291937 287283 282738 278751 275089 271564 268315 265235 261965 258620 255781 253530 251217 248414 245427
56453 245427 242548 239511 236126 232908 230502 228849 227431 226047 224851 223801 222564 220975 219301 217948
56439 217948 217097 216599 216239 216054 216338 217159 217963 217935 216782 214987 213302 212246 212011 212422 212875 212695 211819 210971
56421 210971 210996 212118 213806 215188 215679 215551 215887 217591 220355 223018 224956 226661 228756 231002 232740
56406B32740J250J598K704L764M153L908L541L455L468K990J826O31K52P46J372
56391B68398J472J015L55j59l65l80n21q98j178j058p38o29p17p27p36j063j613
56374B60458j886j748j628j798j948j741j332j109j161j275j174o60K29J050J218
56359B45495O41j19m85m32k97k65l33m85o98q72r44r58q82n86j05K43K72K57N39
56340B39986R51R70M38k25o36r05j221j260n15Q13J687J296j3j156j573j620j707
56323B35310j628r77JN59M18J39L81J070J582J573J326J249J368J445J386J288
56307B46490J235J320J791K735L624L642K674J603J331J812K339K479K279J933
56293B77287J706J971K739L272K863J886J442J916K595K808K701K643K587K391
$$ plain form
56406 232740 233990 235588 238292 242056 246209 250117 253658 257113 260581 263571 265397 266028 266280 267026 268398
56391 268398 269870 270885 271240 271081 270716 270336 269815 268917 267739 266681 265943 265314 264597 263870 263134 262071 260458
56374 260458 258572 256824 255196 253398 251450 249709 248377 247268 246107 244832 243658 242998 243227 244277 245495
56359 245495 246136 246017 245532 245100 244803 244538 244205 243720 243022 242150 241206 240248 239366 238780 238675 238918 239190 239447 239986
56340 239986 240937 241907 242345 242120 241484 240579 239358 238098 237583 238396 240083 241379 241366 240210 238637 237017 235310
56323 235310 233682 232705 232706 233265 233683 233822 234203 235273 236855 238428 239754 241003 242371 243816 245202 246490
56307 246490 247725 249045 250836 253571 257195 260837 263511 265114 266445 268257 270596 273075 275354 277287
56293 277287 278993 280964 283703 286975 289838 291724 293166 295082 297677 300485 303186 305829 308416 310807
56279C10807K229K198J994J442R29Q82J133J252J232J387J851K505L241L906M203
56264C41191M050L807L868M122M164L945L909M543N854P264P992P778P164O843
56250D16494O810O564O088N942O329O774O973P230P705P932P551O874O251N496
56236E11013M498L803L916M477M763M674M630M878N445O350P346P911Q041Q600
56222E90345J0203J2284J3901J5088J6509J8283J9973K1460K2959K4441K5838
56211G91284K7642L0447L4019L7589M0949M4515M8517N2889N7777O3275O8813
56200A297716P3705P8308Q3647Q9781R5501R9891J03393J06905J10363J12596
56190B251806J12354J09283J04069R7647R0181Q1055P0014N7775M5181L2308J9110
$$ plain form
56279 310807 313036 315234 317228 318670 319599 320481 321614 322866 324098 325485 327336 329841 333082 336988 341191
56264 341191 345241 349048 352916 357038 361202 365147 369056 373599 379453 386717 394709 402487 409651 416494
56250 416494 423304 429868 435956 441898 448227 455001 461974 469204 476909 484841 492392 499266 505517 511013
56236 511013 515511 519314 523230 527707 532470 537144 541774 546652 552097 558447 565793 573704 581745 590345
56222 590345 600548 612832 626733 641821 658330 676613 696586 718046 741005 765446 791284
56211 791284 818926 849373 883392 920981 961930 1006445 1054962 1107851 1165628 1228903 1297716
56200 1297716 1371421 1449729 1533376 1623157 1718658 1818549 1921942 2028847 2139210 2251806
56190 2251806 2364160 2473443 2577512 2675159 2765340 2846395 2916409 2974184 3019365 3051673 3070783
56179C070783O255n447j6062k6076l5287m3061m9414n4965o0065o4713o8941p2488
56167B580519p4664p5513p6454p8476q0376q0364p8945p8304p9001p9287p7987
56156A721148p5951p4083p1862o8761o5495o2700n9744n6047n2392m9691m7388
56145A037034m4352m0560l6812l3365l0042k7119k4992k3267k1197j8760j6509
56134G20059j4606j2850j1396j0644j0383r800q423o655n310m777m693m311l375
56121F12836k442k035j741q26M34J030R63J579L665O228P813Q252Q332Q422Q335
56106F60845Q130Q203Q723R539J0553J1701J2774J3516J3853J3835J3578J3309
56094G98559J3179J3077J2971J3242J4104J4988J5305J5642J7182J9952K2877
$$ plain form
56179 3070783 3077038 3071591 3055529 3029453 2994166 2951105 2901691 2846726 2786661 2721948 2653007 2580519
56167 2580519 2505855 2430342 2353888 2275412 2195036 2114672 2035727 1957423 1878422 1799135 1721148
56156 1721148 1645197 1571114 1499252 1430491 1364996 1302296 1242552 1186505 1134113 1084422 1037034
56145 1037034 992682 952122 915310 881945 851903 824784 799792 776525 755328 736568 720059
56134 720059 705453 692603 681207 670563 660180 650380 641957 635302 629992 625215 620522 616211 612836
56121 612836 610394 608359 606618 605792 606226 607256 608219 609798 613463 619691 627504 635756 644088 652510 660845
56106 660845 668975 677178 685901 695440 705993 717694 730468 743984 757837 771672 785250 798559
56094 798559 811738 824815 837786 851028 865132 880120 895425 911067 928249 948201 971078
56083I71078K5593K8914L3165L7526M1526M5889N0960N5542N8268N9211N9118
56072A466790N7981N5407N1828M8247M5168M2484L9985L7260L3622K8837K3447
56061A931056J7873J1802N040j743p912j3791k0037k6640l3248l9815m6160n1487
56049A724938n5080n7047n7840n7631n6636n5286n3470n0394m5868m0949l6585
56038A158152l2502k8244k4327k1367j8820j5748j2177q798n907l578k197j787
56026I82700j466o28j4n02j466j563o99O7L29P46J749K868L497L617L662M141
56010I97038N217O344O782O732P284Q867J0564J1484J1929J2512J3120J3563J4313
55997A125749J5654J6891J7369J7444J7628J7642J7229J6989J7358J7664J7315
$$ plain form
56083 971078 996671 1025585 1058750 1096276 1137802 1183691 1234651 1290193 1348461 1407672 1466790
56072 1466790 1524771 1580178 1632006 1680253 1725421 1767905 1807890 1845150 1878772 1907609 1931056
56061 1931056 1948929 1960731 1965771 1964028 1956116 1942325 1922288 1895648 1862400 1822585 1776425 1724938
56049 1724938 1669858 1612811 1554971 1497340 1440704 1385418 1331948 1281554 1235686 1194737 1158152
56038 1158152 1125650 1097406 1073079 1051712 1032892 1017144 1004967 996169 990262 986684 984487 982700
56026 982700 981234 980606 980592 980090 978624 977061 976362 976429 976758 977504 979253 982121 985618 989235 992897 997038
56010 997038 1002255 1008599 1015381 1022113 1029397 1038264 1048828 1060312 1072241 1084753 1097873 1111436 1125749
55997 1125749 1141403 1158294 1175663 1193107 1210735 1228377 1245606 1262595 1279953 1297617 1314932
55986A314932J6968J7408J8192J8554J8819J9678K0897K1928K3033K4560K5958
55975A540927K6775K7821L0068L3069L5674L7651L9536M1673M4295M7710N1473
55964A956672N4501N6819N9912O4389O8963P2887P7475Q3719R0301R5812J01053
55953B782503J07124J13063J17763J22466J28790J35799J41575J46438J51930
55944C947451J57938J63511J69384J76875J85323J93301K01299K10636K20762
55935E626480K30447K40337K51675K63732K75387K87918L03180L20407L37912
55926H137475L56497L77952M01661M26080M51966M80712N11348N42895N77616
55917A2264202O17907O62049P07524P56328Q12373Q76068R46688J027515J123003
$$ plain form
55986 1314932 1331900 1349308 1367500 1386054 1404873 1424551 1445448 1467376 1490409 1514969 1540927
55975 1540927 1567702 1595523 1625591 1658660 1694334 1731985 1771521 1813194 1857489 1905199 1956672
55964 1956672 2011173 2067992 2127904 2192293 2261256 2334143 2411618 2495337 2585638 2681450 2782503
55953 2782503 2889627 3002690 3120453 3242919 3371709 3507508 3649083 3795521 3947451
55944 3947451 4105389 4268900 4438284 4615159 4800482 4993783 5195082 5405718 5626480
55935 5626480 5856927 6097264 6348939 6612671 6888058 7175976 7479156 7799563 8137475
55926 8137475 8493972 8871924 9273585 9699665 10151631 10632343 11143691 11686586 12264202
55917 12264202 12882109 13544158 14251682 15008010 15820383 16696451 17643139 18670654 19793657
55908A9793657J233575J359498J507281J685867J899961K154219K459177K823320
55900C4916555L243308L713087M239281M836446N512828O276289P149200Q157378
55892G8044372R302983J0557227J1852761J3031160J3799944J3822538J2922789
55885A63333774J1190468Q847734O037362K804037p19598m186164p147230r287878
55877A70872505j0551435j1088845j1135449j0911476j0565629j0160028r697766
55870I6761877r168477q573896p927593p250591o569563n908416n278586m682723
55862D1402032m126452l619732l168271k771151k426501k132837j884695j673130
55854A9599263j491397j335914j202224j084925r81466q91575q13061p42129o77447
$$ plain form
55908 19793657 21027232 22386730 23894011 25579878 27479839 29634058 32093235 34916555
55900 34916555 38159863 41872950 46112231 50948677 56461505 62737794 69886994 78044372
55892 78044372 87347355 97904582 109757343 122788503 136588447 150410985 163333774
55885 163333774 174524242 183371976 189409338 192213375 191493777 187307613 180160383 170872505
55877 170872505 160321070 149232225 138096776 127185300 116619671 106459643 96761877
55870 96761877 87593400 79019504 71091911 63841320 57271757 51363341 46084755 41402032
55862 41402032 37275580 33655848 30487577 27716426 25289925 23157088 21272393 19599263
55854 19599263 18107866 16771952 15569728 14484803 13503337 12611762 11798701 11056572 10379125
55845A0379125o19927n68805n21698m78170m39568m05570l74367l45822l21048
55836F304150k99223k78260k58252k41005k26387k12352j98338j85517j74007
55827D230809j62921j52867j45214j39005j31769j23385j16089j10614j05382
55818C043563r9706r4681r0525q5925q0664p6192p2968o9734o6018o2885o0530
55807B183735n7535n3325m9292m6641m4988m3833m3495m3877m4067m3931m4415
55796A668336m5674m6443m5935m4840m3819m2512m0763l9395l8968l8829l8081
55785A203077l6580l4612l2455l0537k9027k7260k4589k1708j9856j8843j7283
55774I10327j4845j2692j1463j0445r120q084p863q095q445r115j0016j0523j0603
$$ plain form
55845 10379125 9759198 9190393 8668695 8190525 7750957 7345387 6971020 6625198 6304150
55836 6304150 6004927 5726667 5468415 5227410 5001023 4788671 4590333 4404816 4230809
55827 4230809 4067888 3915021 3769807 3630802 3499033 3375648 3259559 3148945 3043563
55818 3043563 2943857 2849176 2758651 2672726 2592062 2515870 2442902 2373168 2307150 2244265 2183735
55807 2183735 2126200 2072875 2023583 1976942 1931954 1888121 1844626 1800749 1756682 1712751 1668336
55796 1668336 1622662 1576219 1530284 1485444 1441625 1399113 1358350 1318955 1279987 1241158 1203077
55785 1203077 1166497 1131885 1099430 1068893 1039866 1012606 988017 966309 946453 927610 910327
55774 910327 895482 882790 871327 860882 851762 843678 835815 827720 819275 810160 800144 789621 779018
55761G79018j1083j2366j3811j4804j5477j6030j6287j6277j6292j6129j5206
55750F15256j3714j2649j2389j2216j1549j0614r632q381o984o102n821n315m047
55737D95843k545j495r24o83j027k119l460m324m387l882l426l658m481m886m182
55722D50364l134l008l794m447m698n284o399p243p416p478p796p998p940q046
55708C65683q237p711o333n180n087n592n938o128o329o156n438m888n146n713
55694B81807n669n021m572m745n215n506n452n137m756m441m142l823l672l783
55680B15873l801l324k595k165k067j984k036k536l080k938k328k205k637k591
55666A79586j663q45j048j902k650l206l649l567k729j729j276j368j715k284
$$ plain form
55761 779018 767935 755569 741758 726954 711477 695447 679160 662883 646591 630462 615256
55750 615256 601542 588893 576504 564288 552739 542125 532493 524112 517128 511026 505205 499890 495843
55737 495843 493298 491803 490879 490196 489169 487050 483590 479266 474879 470997 467571 463913 459432 454546 450364
55722 450364 447230 444222 440428 435981 431283 425999 419600 412357 404941 397463 389667 381669 373729 365683
55708 365683 357446 349735 343402 338222 333135 327543 321605 315477 309148 302992 297554 292666 287520 281807
55694 281807 276138 271117 266545 261800 256585 251079 245627 240490 235734 231293 227151 223328 219656 215873
55680 215873 212072 208748 206153 203988 201921 199937 197901 195365 192285 189347 187019 184814 182177 179586
55666 179586 177923 177078 176030 174128 171478 168272 164623 161056 158327 156598 155322 153954 152239 149955
55652A49955k867k793j792n57K10O72J217J540J203N68L15L68J24m64p95n53j44
55635A46207j00m94r61j062o32J36R87J922K920L520L242K418J923K104K560L035
55619A67725L600L801K770O53r94r70J38R33Q91L06o62j961l074l428l194k975
55603A63559k875k454j488k92O20Q65M99K16P77J873K175J095k01k48P39J283
55587A66143O80l11p36n15j25M3j37n95j064j329j496j786k193k561k899l270
55571A47849l554l623l624l725l797l596l139k647k291k227k550k996k977k298
55557A04805j491j110j045r32q92j244j791j971j654j248j033q78o35m10l66m84
55541H7621o18n72k11K93M74M0p16j182j047n45j58j95n15o47l75r8l61j047j546
$$ plain form
55652 149955 147088 144295 142503 141946 142156 142828 144045 145585 146788 147356 147671 148039 148163 147699 146904 146351 146207
55635 146207 146107 145613 144652 143590 142958 143094 144081 146003 148923 152443 155685 158103 160026 162130 164690 167725
55619 167725 171325 175126 177896 178549 177555 176585 176723 177656 178547 178853 178191 176230 173156 169728 166534 163559
55603 163559 160684 158230 156742 156450 157070 157935 158434 158650 159427 161300 163475 164570 164369 164121 164860 166143
55587 166143 166823 166512 165776 165261 165136 165179 165042 164447 163383 162054 160558 158772 156579 154018 151119 147849
55571 147849 144295 140672 137048 133323 129526 125930 122791 120144 117853 115626 113076 110080 107103 104805
55557 104805 103314 102204 101159 100227 99335 98091 96300 94329 92675 91427 90394 89516 88881 88471 88105 87621
55541 87621 87003 86431 86220 86513 86987 87027 86311 85129 84082 83537 83379 83184 82669 82022 81647 81549 81188 80141 78595
55522G8595j646j745j981j937j413q98p43n10K85J238J494Q92J04k42p1L22N80
55505G2324M58j0n37r08j050q57l50p3o38j717k163j505o10l83n60n15l89n96
55487E9921p25j16Q86J225O29k09q51j506k110j974p80P26J503J308P37M70P31
55470E9865J271J745K034K217K210J747R01K41J95N24Q05J049J460J849J830J414
55454H1357R48O20M11L06K07j51q37j500j814j876j823j505j007q81j378j870
55438F9207j768j425j432j518j088m30l28o83o98k85k50q88j538j718j739j846
55422E1573j659r33j52P7k81r33j623k003j723j009o40j020j627j652r32PN15
55405C5985L86K1R0P14J175Q36N2l77l89m70n51j07O67Q76L57L7M43Q63N26k63
$$ plain form
55522 78595 76949 75204 73223 71286 69873 68975 68232 67722 68007 69245 70739 71631 71735 71493 71422 71744 72324
55505 72324 72782 72772 72235 71327 70277 69420 69070 68997 68359 66642 64479 62974 62364 61981 61421 60906 60517 59921
55487 59921 59196 59080 59966 61191 61820 61611 60760 59254 57144 55170 54390 55116 56619 57927 58664 59134 59865
55470 59865 61136 62881 64915 67132 69342 71089 71990 72231 72426 72950 73755 74804 76264 78113 79943 81357
55454 81357 82305 82925 83336 83642 83849 83698 82861 81361 79547 77671 75848 74343 73336 72455 71077 69207
55438 69207 67439 66014 64582 63064 61976 61546 61218 60535 59837 59552 59302 58414 56876 55158 53419 51573
55422 51573 49914 48981 48829 48906 48625 47692 46069 44066 42343 41334 40694 39674 38047 36395 35463 35470 35985
55405 35985 36371 36392 36482 37196 38371 39207 39259 38882 38493 38023 37472 37365 38032 38908 39265 39302 39745 40608 41134 40871
55385D0871q40j168j379j046J63J540J977J330L99j92n10p60r22r70r13o65j80
55368C6735K38J88l05p55p96n35l45m74p96q78l97M82J247J556J385Q00k0m95
55350C6835j4J168J895J373J30o96p01l25J4L48P12Q44N23q2n97q44r52j101j223
55331C7307j067o37l49n12p90n62K49J050J414J548J741J767J197Q6r82j499j478
55314C8483j328j372j449j088k07N69O09J05k11q6J15J88L30M93K03o40j412j579
55296C1723j342j071o55J06Q67J090P54K70p2j63R6N48O13j42j322j968j484o7
55278B7781J525K399J979M75j195k191k317j757o48P35J764J929J347M98l10q52
55262C1162q11j39O35R62R21Q68P39K89k11k12K47N73N35N44Q33R81N54k06o49
$$ plain form
55385 40871 40031 38863 37484 36438 36601 38141 40118 41448 41847 41655 41145 40385 39463 38493 37580 36915 36735
55368 36735 36973 37161 36856 36101 35305 34770 34425 33951 33155 32277 31880 32362 33609 35165 36550 37350 37330 36835
55350 36835 36821 37989 39884 41257 41387 40691 39990 39665 39679 40027 40739 41583 42106 42024 41427 40583 39631 38530 37307
55331 37307 36240 35603 35254 34742 33952 33390 33639 34689 36103 37651 39392 41159 42356 42442 41460 39961 38483
55314 38483 37155 35783 34334 33246 33039 33608 34217 34322 34111 34025 34140 34328 34658 35151 35354 34714 33302 31723
55296 31723 30381 29310 28655 28761 29628 30718 31472 31742 31670 31507 31603 32151 32764 32622 31300 29332 27848 27781
55278 27781 29306 31705 33684 34159 32964 30773 28456 26699 26051 26786 28550 30479 31826 32324 32014 31162
55262 31162 30351 30212 30847 31809 32730 33598 34337 34626 34415 34203 34450 35023 35558 36102 36935 37916 38470 38264 37615
55243C7615n08j24jl23q35j127j028o64j53M96J118J334J010N36L70N03O60P79
55225C9658R35R72O60O1n58j051j311j090l51L43L58k17p51r09q65p50m89j76
55207C4469r3j95j52R4K55K37K97N30P15P37P16N75R1n50p84m84j69j46p7K68
55187C6334M68J58k99m60n69j010j375r50R4P78O16J21o1J00L76P53J277J767
55169C8118K027K035J758J085J27o83r76p57k08M28P16K39p44j312r20j08L08
55152D1133L34M62N64Nj092j596q20M94J104P27L0l57k48L89J273J603P69o58
55134D4116j345q33p2m9n34o77k90Q0J11L8R3J73J80K59N01P14O62L54j2k78m19
55113D2772m79n29n66n00l16j94l49o98q45m95K43R66J337J293J000O81M54K77
$$ plain form
55243 37615 37107 36983 36982 36659 35824 34697 33669 33005 32852 33348 34466 35800 36810 37346 37716 38219 38879 39658
55225 39658 40593 41565 42225 42286 41728 40677 39366 38276 37925 38268 38626 38409 37658 36749 35884 35134 34645 34469
55207 34469 34376 34181 34029 34123 34378 34615 34912 35442 36157 36894 37610 38185 38276 37726 36942 36458 36289 36143 36066 36334
55187 36334 36802 36960 36661 36201 35632 34622 33247 32297 32391 33169 33785 33906 33845 33945 34321 35074 36351 38118
55169 38118 40145 42180 43938 45023 45150 44467 43491 42734 42526 42954 43670 43909 43165 41853 40933 40825 41133
55152 41133 41467 41929 42493 42498 41406 39810 38990 39484 40588 41315 41345 40988 40740 41129 42402 44005 44774 44116
55134 44116 42771 41938 41866 41817 41283 40606 40316 40396 40507 40545 40638 40811 40991 41250 41751 42465 43127 43481 43469 43191 42772
55113 42772 42293 41764 41198 40698 40382 40188 39839 39141 38296 37801 38044 39010 40347 41640 42640 43321 43775 44052
55095D4052L8k78n63p15p35o80n66l77j37O0J59K29L76N47N08J04m95q82q21n48
55075C9276n87j121j619j282m5J159J431J000Q37J227J432R33K75J23K17n1l94
55058D2811l7Q43J084J53j048j358o87K47R87J570K055K290K104J481O11j14m12
55041E2580m06m10m10j54L39P72J091J454J657J219K69l63j86L54O54O90O72N41
55023F0363K74J46K65L50K97M18P27P46L63J59K83o3j221k023j266M42J463J314
55005F3037P94L82k05r20j229j098j074j253j179q75r05j245j207o84l81n53n24
54988E0881M0M92L00j39l24m25o41o21j51K60K09J16M71R80J132J072J196J357
54970E6205J172P59M62J81l60r37j039n49K21R63J411J284P00K74L33M08l7o77
$$ plain form
55095 44052 44090 43812 43249 42534 41799 41119 40553 40176 40039 40099 40258 40487 40863 41410 41918 42022 41527 40645 39824 39276
55075 39276 38689 37568 35949 34667 34622 35781 37212 38212 39049 40276 41708 42641 42916 43039 43256 43205 42811
55058 42811 42774 43617 44701 44854 43806 42448 41761 42008 42995 44565 46620 48910 51014 52495 53106 52992 52580
55041 52580 52174 51764 51354 51200 51539 52311 53402 54856 56513 57732 58001 57638 57452 57806 58460 59150 59822 60363
55023 60363 60637 60783 61048 61398 61695 62113 62840 63586 63949 64108 64391 64328 63107 61084 59818 60260 61723 63037
55005 63037 63831 64213 64008 63088 61859 60761 59687 58434 57255 56380 55475 54230 53023 52339 51958 51405 50881
54988 50881 50921 51413 51713 51574 51250 50825 50184 49563 49412 49672 49881 49997 50468 51448 52580 53652 54848 56205
54970 56205 57377 58136 58598 58779 58419 57482 56443 55894 56115 57078 58489 59773 60473 60747 61080 61488 61451 60774
54952F0774q14l81R4L61N60P04O45M90M77M78J45n13j119j392j298q63j77N56
54934E8727J186J652J658Q22n21j297j035n54o40p18J28J368J574N73k80q8N50
54917F3105P50M91J05l34n78o6J175K166K157J590J217R69L66m52q81p92n02r7
54899G0389N49J184J286Q31M11N22J106J842K496K991L369L760M141M270M157
54884A03304M380N472P025P923P579O531N613M969M160K981J731P19j84j277k588
54869A58338l756m460m816n230n894o541o711o252n422m639m213m164m219l963
54855H8058l176k007p29M71J383J674J225N55N42J498K787L539L662L827M535
54840A07844N499O105O184O048N826N183L947K699K210K306J795r8k583m077m031
$$ plain form
54952 60774 59960 59579 59673 60034 60594 61298 61943 62433 62910 63388 63533 63020 61901 60509 59211 58348 58171 58727
54934 58727 59913 61565 63223 64045 63524 62227 61192 60638 59998 59280 59408 60776 62350 62923 62643 62555 63105
54917 63105 63855 64346 64451 64117 63539 63473 64648 66814 68971 70561 71778 72747 73113 72661 71780 70988 70486 70389
54899 70389 70938 72122 73408 74239 74650 75172 76278 78120 80616 83607 86976 90736 94877 99147 103304
54884 103304 107684 113156 120181 128104 135683 142214 147827 152796 156956 159937 161668 162387 162203 160926 158338
54869 158338 154582 150122 145306 140076 134182 127641 120930 114678 109256 104617 100404 96240 92021 88058
54855 88058 84882 82875 82146 82617 84000 85674 86899 87454 87996 89494 92281 95820 99482 103309 107844
54840 107844 113343 119448 125632 131680 137506 142689 146636 149335 151545 153851 155646 155548 152965 148888 144857
54825A44857l415l373m031m867n620o292o534n901m697l891l946m258m056l397
54811H0579k855k614k398k066j743j384p51L0L68q5r26j426j295q47n27m62m75
54794F1123l71j78q5j28j24M8K06J03k19n32p54q96q18m17Jk0m45p58p00n24m64
54773E4048l85j88q7j92k16P5M71O82P39P26M90K1k37P8P21J260J705K144K100
54754F3955J038n57j377p85M73J241J155P43O14Q93J211J173Q93R68J709K618
54738G5965K995K894K925L269L502L364L185L328L890M944O511Q011Q500P812
54724A41095O888O497O149M914K905J251O56O69L89n08j619k430k913l466m309
54709A56168n029n020m323l614l267k950k359j799j581j378o89L25J107J476J689
$$ plain form
54825 144857 141442 138069 134038 129171 123551 117259 110725 104824 100127 96236 92290 88032 83976 80579
54811 80579 77724 75110 72712 70646 68903 67519 66768 66798 67166 67081 66155 64729 63434 62587 62060 61598 61123
54794 61123 60752 60574 60489 60361 60237 60285 60491 60594 60375 59843 59089 58193 57375 56958 56959 56939 56494 55736 55036 54512 54048
54773 54048 53663 53475 53388 53196 52980 53055 53526 54208 54947 55673 56163 56184 55947 56025 56746 58006 59711 61855 63955
54754 63955 64993 64436 63059 62274 62747 63988 65143 65886 66500 67393 68604 69777 70670 71638 73347 75965
54738 75965 78960 81854 84779 88048 91550 94914 98099 101427 105317 110261 116772 124783 133283 141095
54724 141095 147983 154480 160629 165543 168448 169699 170355 171024 171413 170905 169286 166856 163943 160477 156168
54709 156168 151139 146119 141796 138182 134915 131965 129606 127807 126226 124848 124159 124484 125591 127067 128756
54694A28756J904K260L210N016O962P843P458O903P168Q065Q796R001Q809Q297
54680B20448P493O600N761M673K926O25j625l425m963o627q341r497r595q941
54666A95512q465q724r235r091q116o976o241n864n652n597n516m950l881l013
54652A04191k802k709k068j267j206j808k015j394p47p90j079q35j99P8j31j57
54636H5062M30J188J357P54l4k19L87J109J101L13m98p70p14o34k57P11J789K169
54618I3244J808J396J341J485J742K278K859K813J971J073Q88J378J995K294K054
54603A20619J380J022J838L450M132K827O75l61J20R12J219J495K142K648K414
54588A46532J680J024O63O73J347K747M338N546O390P160P799Q080Q140Q275Q492
$$ plain form
54694 128756 130660 132920 136130 141146 148108 155951 163409 170312 177480 185545 194341 203342 212151 220448
54680 220448 227941 234541 240302 244975 247901 248526 246901 243476 238513 231886 223545 214048 204453 195512
54666 195512 187047 178323 169088 159997 151881 144905 138664 132800 127148 121551 116035 111085 107204 104191
54652 104191 101389 98680 96612 95345 94139 92331 90316 88922 88175 87385 86306 85471 85272 85350 85219 85062
54636 85062 85492 86680 88037 88791 88757 88538 88925 90034 91135 91448 90950 90180 89466 88832 88575 89286 91075 93244
54618 93244 95052 96448 97789 99274 101016 103294 106153 108966 110937 112010 112898 114276 116271 118565 120619
54603 120619 121999 123021 124859 128309 132441 135268 135943 135582 135702 136614 137833 139328 141470 144118 146532
54588 146532 148212 149236 149899 150572 151919 154666 159004 164550 170940 178100 185899 193979 202119 210394 218886
54573B18886Q623Q699Q787Q587P658O006M050K079J13j723l173m282n468o964
54559B51878q387r090q900q323q012q070q010p381o423n793n734n753n302m470
54545A52230l815l661l742l557k835j834j153j151j511j629j410j355j711k067
54531A20799k031j906k161k649k846k638k366k190j954j670j575j727j893j927
54517I1266j880j771j616j587j761j809j383p52n21p35q59o00k54j34k88q02j689
54500G2825k318j758r6J287J353O64M24P84Q36Q5q69j080k23J174K120J922R21
54483G8051K53N57J224J304Q19N63Q86J452J998K563K995K990K802L160M231N262
54467A11110N571N317M965M533L889L336L283L531L400K592J522P67M15M5p57
$$ plain form
54573 218886 227509 236208 244995 253582 261240 267246 271296 273375 273488 271765 268592 264310 258842 251878
54559 251878 243491 234401 225501 217178 209166 201096 193086 185705 179282 173489 167755 162002 156700 152230
54545 152230 148415 144754 141012 137455 134620 132786 131633 130482 128971 127342 125932 124577 122866 120799
54531 120799 118768 116862 114701 112052 109206 106568 104202 102012 100058 98388 96813 95086 93193 91266
54517 91266 89386 87615 85999 84412 82651 80842 79459 78707 78186 77451 76592 75992 75738 75604 75316 74514 72825
54500 72825 70507 68749 68653 69940 71293 71957 72381 73165 74001 74086 73217 72137 71914 73088 75208 77130 78051
54483 78051 78304 78861 80085 81389 82208 82771 83657 85109 87107 89670 92665 95655 98457 101617 105848 111110
54467 111110 116681 121998 126963 131496 135385 138721 142004 145535 148935 151527 153049 153816 154231 154276 153519
54452A53519j952l092l815m157m367m536m676m931n298n278m392l044k323k642
54438I9016l181k980k098j305j027j093j211j201r35m53j4K88O47J041R75J94
54422H6663o61p46q7N99R61J212J347J041L24k26j84L55J169K045K465J920P75
54405I8972J62N73J239J294R27P89P98L66m57r18o33p0J68K3k18m24o72j046j469
54386I9404j683j360m83M05N69j44j031j176l53P26J099N54j78k93J17K76k19
54369I6230r37j298j201q00j75M22M50k70j060j093l86M04R42J374J684J581J107
54352I6974P38P31Q45Q95J055J422J692J592J307J223J445J765J909J715J281
54337A16589J025J324K038K644K867K838K610J981R41j28q93j381j692j788j803
$$ plain form
54452 153519 151567 148475 144660 140503 136136 131600 126924 121993 116695 111417 107025 103981 101658 99016
54438 99016 95835 92855 90757 89452 88425 87332 86121 84920 83985 83532 83518 83806 84453 85494 86469 86663
54422 86663 86002 85256 85169 85768 86729 87941 89288 90329 90653 90427 90243 90598 91767 93812 96277 98197 98972
54405 98972 99134 99707 100946 102240 103167 103956 104754 105120 104663 103745 103112 103042 103210 103233 103015 102591 101919 100873 99404
54386 99404 97721 96361 95878 96283 96852 96708 95677 94501 94148 94874 95973 96527 96349 96056 96173 96449 96230
54369 96230 95293 93995 92794 91994 91819 92241 92691 92421 91361 90268 89882 90286 91228 92602 94286 95867 96974
54352 96974 97712 98443 99288 100183 101238 102660 104352 105944 107251 108474 109919 111684 113593 115308 116589
54337 116589 117614 118938 120976 123620 126487 129325 131935 133916 134857 134729 133836 132455 130763 128975 127172
54322A27172k035k407k301j472o83r54k251l447l505k348p66K53J07j034k247
54307A02082k556j770n93Rm24j539k460k541j898j146o55l36p7J05L92J094J989
54290H9676K336J893J401J504J791J549J017J025J662K165K071J680J342J038
54276A12150P85P38P39L90k66p38q83j034j260j193q79r99j816k621k719k366
54260I8028k163k070j717j290j317j756j987j641r69l92j73m15j001j501j529
54245G8107j184q95q62r69j061j071r37o53l10M7L91L95l45j516k031j318k42
54228F5546k1o06r44o11k07j29M2O42J300J615J681J498O06j043k435k408j052
54211F3474M35J071Q35L43K28P44J545J900J458O05p4m36n51k52N32J309J461
$$ plain form
54322 127172 125137 122730 120429 118957 118274 117320 115069 111622 108117 105769 105003 105256 105363 104329 102082
54307 102082 99526 97756 97163 97172 96748 95209 92749 90208 88310 87164 86509 86173 86096 86201 86593 87687 89676
54290 89676 92012 93905 95306 96810 98601 100150 101167 102192 103854 106019 108090 109770 111112 112150
54276 112150 112935 113673 114412 114802 114536 113798 112915 111881 110621 109428 108549 107550 105734 103113 100394 98028
54260 98028 95865 93795 92078 90788 89471 87715 85728 84087 83118 82726 82553 82138 81137 79636 78107
54245 78107 76923 76028 75166 74197 73136 72065 71128 70475 70165 70212 70603 70998 70653 69137 67106 65788 65546
54228 65546 65525 64919 63975 63364 63157 63028 63070 63712 65012 66627 68308 69806 70412 69369 66934 64526 63474
54211 63474 63909 64980 65815 66158 66386 67130 68675 70575 72033 72638 72564 72128 71577 71325 71857 73166 74627
54194G4627J073P48O91N67K30j5j7o5m14r55j482j885j926j338l66K85K74nj05
54175F9922r2j54j32J19L12J62q1k1K36L94O58J389K216K241J275K42jL20L68
54156G9373j10n86n29NN65Q11P60O39N50L66k4m54o29n24l58k01J10O25J048R91
54136H2428L14p93j898k434k064j137m71n25r74j197r27l09L60O61K13q50j772
54119F8625j926j524j197j112r68o81m92l65J19J025J756J806J396R95N94m9o60
54102F7342n71L15J152J083K11o51j030j156j320j372j136r55j250j677j337m
54086E7644J370J678Q65k44r78j244j176r56q61r93r75m02M09O69J90l57m55l96
54068E3788o19r53r34n22JN17R78J125P88L18J74K27j5n22p01k89K17K92N6q1
$$ plain form
54194 74627 75700 76448 77139 77706 77936 77921 77904 77839 77425 76470 74988 73103 71177 69839 69473 69758 70032 70027 69922
54175 69922 69830 69676 69544 69663 69975 70137 70056 70035 70271 70665 71323 72712 74928 77169 78444 78686 78685 79005 79373
54156 79373 79263 78677 78148 78153 78718 79529 80289 80928 81478 81844 81820 81366 80737 80213 79855 79654 79764 80389 81437 82428
54136 82428 82742 81949 80051 77617 75553 74416 73945 73420 72446 71249 70322 70013 70373 71034 71247 70397 68625
54119 68625 66699 65175 63978 62866 61898 61217 60725 60360 60479 61504 63260 65066 66462 67457 68051 68002 67342
54102 67342 66771 67086 68238 69321 69532 68881 67851 66695 65375 64003 62867 61912 60662 58985 57648 57644
54086 57644 59014 60692 61557 61313 60335 59091 57915 56959 56098 55105 54130 53728 54137 54806 54996 54639 54184 53788
54068 53788 53169 52216 51282 50760 50761 51278 52256 53381 54169 54487 54661 54888 54873 54351 53650 53361 53578 53870 53926 53845
54048E3845q4k26n20o24k82M29J233J807J798J036j03p90m75M63J068Q43J44m50
54030E9112q32j154j268r06k82J9j73m27l91j85J19P27J564J953J467P32O82J269
54012F2026J556J007Pq56j393j530j127l25L92P31Q93J067J063P01K71K67Q21
53995F5571J638K350K776K949L012K927K371J203n2n95l03K25O31J263K353L388
53979I1707L730L443L049K807K728K926L323L365K662J756J562K154K739K859
53965A30810K896L239L687L915L961L836L225K004Q14M83J053J639J341N1j509
53950A61445k404k220j391p96r12j445j828j921j975k085j984j481q59o43r80
53935A38521j447j666j877k579l569l852k834j269m81q10j411j502j176q66o36
$$ plain form
54048 53845 53761 53535 53015 52391 52109 52538 53771 55578 57376 58412 58309 57519 57044 57507 58575 59418 59562 59112
54030 59112 58280 57126 55858 54952 54670 54689 54516 54089 53698 53513 53632 54359 55923 57876 59343 60075 60757 62026
54012 62026 63582 64589 64596 63740 62347 60817 59690 59365 59757 60488 61381 62448 63511 64212 64483 64750 65571
53995 65571 67209 69559 72335 75284 78296 81223 83594 84797 84745 84150 83847 84072 84703 85966 88319 91707
53979 91707 95437 98880 101929 104736 107464 110390 113713 117078 119740 121496 123058 125212 127951 130810
53965 130810 133706 136945 140632 144547 148508 152344 155569 157573 158387 158870 159923 161562 162903 162954 161445
53950 161445 159041 156821 155430 154634 153722 152277 150449 148528 146553 144468 142484 141003 140144 139501 138521
53935 138521 137074 135408 133531 130952 127383 123531 120697 119428 118947 118137 116726 115224 114048 113182 112546
53920A12546l64j01J12M22Q02Q40L45k20l02k8J00O5L14R46J418J156P9j446k787
53901A13897l242k552j291l47L3K64N15L81k89q38o20Q4N19N31O47J188J873K388
53883A13141K810L184L206K710K205K375L061L324K747K195K746M108M760L817
53869A56389K076R08O20N43L11K00L61M76M76P75J511K079J974J537J420J667
53853A73323J880K021K359K829L077L091L182L381L375L112K873K710K414K058
53839B11685J977K014J503L36o47q02o36r74j696k099k168k614l691m712m946
53824A92530m398l620l160l325m003m617m705m528m674n059m950m152l398l240
53810A34701l228k694j830j346j461j828k166k381k269j804j489j769k221k111
$$ plain form
53920 112546 112182 112081 112193 112615 113417 114257 114602 114382 114080 114052 114152 114217 114531 115477 116895 118051 118130 116684 113897
53901 113897 110655 108103 106812 106465 106498 106762 107277 107658 107369 106531 105911 105995 106514 107045 107692 108880 110753 113141
53883 113141 115951 119135 122341 125051 127256 129631 132692 136016 138763 140958 143704 147812 152572 156389
53869 156389 158465 159373 159993 160536 160847 161047 161408 161884 162360 163135 164646 166725 168699 170236 171656 173323
53853 173323 175203 177224 179583 182412 185489 188580 191762 195143 198518 201630 204503 207213 209627 211685
53839 211685 213662 215676 217179 217515 216868 216066 215430 214456 212760 210661 208493 205879 202188 197476 192530
53824 192530 188132 184512 181352 178027 174024 169407 164702 160174 155500 150441 145491 141339 137941 134701
53810 134701 131473 128779 126949 125603 124142 122314 120148 117767 115498 113694 112205 110436 108215 106104
53796A06104j689j988l135l812k929j099K33N91N97O48L88m24j243j297m88N68
53780I1025J215J226P80J39n79j345j994k140j523l42Q34J494J474Q52j22r94
53764I0000j235p14O4L96K03J78R25K056K489J739N52j3J75M19L38L36Q01J441
53746A00150J740J670J625J816K159K489K668K595K414K527L050L499L368K869
53732A34639K613K700K614K107J604J616K089K567K714K493K089J727J426Q83
53718A63881q1j034j273p47j42J8j25l25p70j560k190k122j612j370j560j737
53702A47251j716j854k314k655k419j753j091n36J7L78R2q76j875k169j759j352
53686A25369j483j902j986j605j235j275j533j598j376j064q05o70p61r82r04
$$ plain form
53796 106104 104415 102427 99292 95480 92551 91452 91685 92276 92873 93521 93909 93485 92242 90945 90457 91025
53780 91025 92240 93466 94246 94385 93806 92461 90467 88327 86804 86462 87296 88790 90264 91116 90994 90000
53764 90000 88765 88051 88115 88511 88714 88892 89817 91873 94362 96101 96653 96640 96815 97234 97572 97908 98709 100150
53746 100150 101890 103560 105185 107001 109160 111649 114317 116912 119326 121853 124903 128402 131770 134639
53732 134639 137252 139952 142566 144673 146277 147893 149982 152549 155263 157756 159845 161572 162998 163881
53718 163881 163800 162766 161493 160746 160604 160622 160497 160172 159402 157842 155652 153530 151918 150548 148988 147251
53702 147251 145535 143681 141367 138712 136293 134540 133449 132913 132930 133308 133400 132524 130649 128480 126721 125369
53686 125369 123886 121984 119998 118393 117158 115883 114350 112752 111376 110312 109507 108837 108076 107094 106190
53671A06190k83M20M94J7j58M33J157J106K75m45k98O64J778K350K092J316O91
53654A17799O85J168J624J670J292P61M50O09J129J606J872K177K722L188L109
53639A41861K554K046J818J636J411J453J912K373K332J812J229Q70P74Q94J058
53624A66033R81O58N99J228K232K874K879K551K106J497Q67N61M47j35j348k353
53608A81677k295j401n12J22P87J316J043q6j127j279q54p20j118j578j695j516
53592A70764j194p06m3O17R98R21L99k81o33l25M57J096J121O23J36J08N20R68
53574A75546J067P67L29O3J41M54O02J83o48j060l45J195K489K918K860K935L112
53557A92608K952K369J696J238J105J425K224L167L790M000M044M015L784L443
$$ plain form
53671 106190 105907 106327 106821 106838 106680 107113 108270 109376 109651 109206 108908 109572 111350 113700 115792 117108 117799
53654 117799 118484 119652 121276 122946 124238 124999 125449 126058 127187 128793 130665 132842 135564 138752 141861
53639 141861 144415 146461 148279 149915 151326 152779 154691 157064 159396 161208 162437 163307 164081 164975 166033
53624 166033 167014 167672 168271 169499 171731 174605 177484 180035 182141 183638 184505 185066 185513 185378 184030 181677
53608 181677 179382 177981 177469 177591 178378 179694 180737 180651 179524 178245 177391 176671 175553 173975 172280 170764
53592 170764 169570 168864 168821 169438 170436 171357 171756 171475 170842 170517 170974 172070 173191 173814 173950 174058 174578 175546
53574 175546 176613 177380 177709 177772 177913 178367 178969 179152 178504 177444 177099 178294 180783 183701 186561 189496 192608
53557 192608 195560 197929 199625 200863 201968 203393 205617 208784 212574 216574 220618 224633 228417 231860
53543B31860L386L765M258M527M572M455L976L021K013J622K036K780L247L203
53529B78721K810K392K249K502L008L455L597L341K702J802R40M52L76L92K09
53514C08948L1L27J191K087K405K065J329K92j017k117k291j553q41q02q37K9
53498C09246J620K710K584J738Q94J58m60n05K54J081J083N09M50J250K060K185
53482C26857K053K322K705K442J640J294J899K761K962K577K427K918L621M022
53468C62500M193M572N309O092O552O650O707P056P723Q332Q468Q142P887Q317
53454D58500R637J1517J3295J4341J4497J4261J4375J5100J6110J7113J8223J9403
53442F36372K0035J9682J9003J9168K0303K1339K1622K1824K2712K3776K3928
$$ plain form
53543 231860 235246 239011 243269 247796 252368 256823 260799 263820 265833 267455 269491 272271 275518 278721
53529 278721 281531 283923 286172 288674 291682 295137 298734 302075 304777 306579 307519 307971 308347 308739 308948
53514 308948 308979 309306 310497 312584 314989 317054 318383 318675 317658 315541 313250 311697 310856 310054 309217 309246
53498 309246 310866 313576 316160 317898 318792 318950 318490 317985 318239 319320 320403 320912 321362 322612 324672 326857
53482 326857 328910 331232 333937 336379 338019 339313 341212 343973 346935 349512 351939 354857 358478 362500
53468 362500 366693 371265 376574 382666 389218 395868 402575 409631 417354 425686 434154 442296 450183 458500
53454 458500 468137 479654 492949 507290 521787 536048 550423 565523 581633 598746 616969 636372
53442 636372 656407 676089 695092 714260 734563 755902 777524 799348 822060 845836 869764
53431H69764K3255K2951K3537K4086K3638K2535K1775K1652K1781K2072K2822
53420A119868K3827K4279K3842K3097K2581K1922K0600J9136J8665J9356K0023
53409A357196J9540J8081J6563J5359J4070J2321J0273Q354O905O014N399M485
53397A494560K866P68j212k802m243n839p604r368j0893j1972j2635j3299j4399
53384A403928j5849j7154j8059j8665j8953j8684j8011j7647j8079j8916j9369
53373A204542j9145j8563j8028j7672j7337j6581j4979j2645j0379q872q032p291
53361A035018o361n291m063k597j087J61J193K368L853N509P148Q585R549J0074
53347A064059J0840J2581J5056J7203J8484J9469K0851K2497K3913K5090K6338
$$ plain form
53431 869764 893019 915970 939507 963593 987231 1009766 1031541 1053193 1074974 1097046 1119868
53420 1119868 1143695 1167974 1191816 1214913 1237494 1259416 1280016 1299152 1317817 1337173 1357196
53409 1357196 1376736 1394817 1411380 1426739 1440809 1453130 1463403 1471757 1478662 1484676 1490075 1494560
53397 1494560 1497426 1498194 1496982 1494180 1489937 1484098 1476494 1467126 1456233 1444261 1431626 1418327 1403928
53384 1403928 1388079 1370925 1352866 1334201 1315248 1296564 1278553 1260906 1242827 1223911 1204542
53373 1204542 1185397 1166834 1148806 1131134 1113797 1097216 1082237 1069592 1059213 1050341 1042309 1035018
53361 1035018 1028657 1023366 1019303 1016706 1015619 1015780 1016973 1019341 1023194 1028703 1035851 1044436 1053985 1064059
53347 1064059 1074899 1087480 1102536 1119739 1138223 1157692 1178543 1201040 1224953 1250043 1276381
53336A276381K7555K8363K8904K9936L1973L4647L7073L8669L9536M0233M1250
53325A654520M2613M3955M5012M5944M7041M8231M9049M9125M8557M7804M7233
53314B169084M6770M5922M4261M1903L9475L7448L5631L3446L0544K7044K3273
53303B574801J9518J5981J2717R624O578L525L28l322p591j2145j6430k0219k3629
53290B559736k6639k9142l1500l4469l8208m1804m4199m5348m5969m6434m6524
53279B129500m6161m5736m5473m5105m4377m3528m2866m2255m1333m0082l8849
53268A653735l7903l7235l6612l5620l3847l1371k8871k6950k5463k3842k1906
53257A314115j9978j8338j7021j6121j5699j5407j4680j3475j2331j1485j0492
$$ plain form
53336 1276381 1303936 1332299 1361203 1391139 1423112 1457759 1494832 1533501 1573037 1613270 1654520
53325 1654520 1697133 1741088 1786100 1832044 1879085 1927316 1976365 2025490 2074047 2121851 2169084
53314 2169084 2215854 2261776 2306037 2347940 2387415 2424863 2460494 2493940 2524484 2551528 2574801
53303 2574801 2594319 2610300 2623017 2632641 2639219 2642744 2643072 2639750 2632159 2620014 2603584 2583365 2559736
53290 2559736 2533097 2503955 2472455 2437986 2399778 2357974 2313775 2268427 2222458 2176024 2129500
53279 2129500 2083339 2037603 1992130 1947025 1902648 1859120 1816254 1773999 1732666 1692584 1653735
53268 1653735 1615832 1578597 1541985 1506365 1472518 1441147 1412276 1385326 1359863 1336021 1314115
53257 1314115 1294137 1275799 1258778 1242657 1226958 1211551 1196871 1183396 1171065 1159580 1149088
53246A149088q972p284o029n258m571l703k611j352k00M56P44J490L198N161O309
53231A126466O719P468R075J0900J2291J3451J4831J6289J7422J8252J9080J9968
53219A292212K0783K1431K1678K1138J9869J8674J8249J8242J7771J6606J5189
53208A501842J3641J1619R244P290O047M690K437j96k012k767l466n058p429r863
53194A526019j1892j3570j5147j6827j8517j9814k0439k0810k1748k3437k5098
53183A318720k5988k6338k6812k7411k7511k6955k6362k6187k6071k5421k4268
53172A029396k3109k2181k1327k0486j9911j9758j9731j9269j8098j6540j5224
53161H13762j4447j3944j3331j2635j2155j1857j1325j0370r333q648q366q293
$$ plain form
53246 1149088 1140116 1132832 1126803 1121545 1116974 1113271 1110660 1109308 1109108 1109564 1110308 1111798 1114996 1120157 1126466
53231 1126466 1133185 1140653 1149728 1160628 1172919 1186370 1201201 1217490 1234912 1253164 1272244 1292212
53219 1292212 1312995 1334426 1356104 1377242 1397111 1415785 1434034 1452276 1470047 1486653 1501842
53208 1501842 1515483 1527102 1536346 1543636 1549683 1554373 1556810 1556614 1554602 1551835 1548369 1543311 1535882 1526019
53194 1526019 1514127 1500557 1485410 1468583 1450066 1430252 1409813 1389003 1367255 1343818 1318720
53183 1318720 1292732 1266394 1239582 1212171 1184660 1157705 1131343 1105156 1079085 1053664 1029396
53172 1029396 1006287 984106 962779 942293 922382 902624 882893 863624 845526 828986 813762
53161 813762 799315 785371 772040 759405 747250 735393 724068 713698 704365 695717 687351 679058
53149F79058q298q300q255q384r052j0113j0709j0152q827p740p348p305p272
53136E67303p356p699q073q215q224q343q558q645q510q355q512r172j0153j0927
53122D46561j0980j0250r150q154p420o820o261n871n842o132o468o729p113p642
53108C41729p745o883n493m704m884n181m883m448m574m974m967m826n347o257
53094B66563o254m834l071k220k367k916l565m176m316l642k503j649j482j892
53080B21676k566l129l300l177l080l001k529j553n70m8Q3L1k26n88o65m08l98
53063A96552r80j595j601j269j282j650j898j962k047j841q73M01Q15J2j113j713
53047A77956j913k160k373k263j894j458q96j94L42N00N14N85M35k20j018j338
$$ plain form
53149 679058 670760 662460 654205 645821 636769 626656 615947 605795 596968 589228 581880 574575 567303
53136 567303 559947 552248 544175 535960 527736 519393 510835 502190 493680 485325 476813 467641 457488 446561
53122 446561 435581 425331 416181 408027 400607 393787 387526 381655 375813 369681 363213 356484 349371 341729
53108 341729 333984 327101 321608 316904 312020 306839 301956 297508 292934 287960 282993 278167 272820 266563
53094 266563 260309 255475 252404 250184 247817 244901 241336 237160 232844 229202 226699 225050 223568 221676
53080 221676 219110 215981 212681 209504 206424 203423 200894 199341 198771 198723 198806 198837 198611 198023 197358 196950 196552
53063 196552 195572 193977 192376 191107 189825 188175 186277 184315 182268 180427 179554 179955 180770 180782 179669 177956
53047 177956 176043 173883 171510 169247 167353 165895 164999 164805 165147 165647 166161 166746 167181 166961 165943 164605
53031A64605j086o14n0P20J446J583J051M70L32M10K31j95m47k72K51R83J770
53014A71188K261K033J038k76j346j878j875j593j458j737k144k091j471r00r74
52999A58777j583k254k784l206l336k998k474k214k151j856j360j155j322j324
52985A28760q57l65l40o43r46j310j908k505k670k275j450m02M04L46o15j576
52969A11648j604p83J13N98O52K14p29j654j803j092k26J81K03J71J52ml35o58
52951A05044o84l05J59K07k37o51o72n99q04r79n80J74M39j30q43p38M79K114
52933A01394K908K032M8j428j456q18p68j340j668j544j485j432p19N27J238J089
52917I6578J140K122L139K888J476J42l47k20J8P4r3k43o0K97K62k06l69J64O57
$$ plain form
53031 164605 163519 162905 162855 163575 165021 166604 167655 168125 168457 168867 169098 168903 168456 168184 168435 169418 171188
53014 171188 173449 175482 176520 176244 174898 173020 171145 169552 168094 166357 164213 162122 160651 159751 158777
52999 158777 157194 154940 152156 148950 145614 142616 140142 137928 135777 133921 132561 131406 130084 128760
52985 128760 127903 127538 127198 126555 125609 124299 122391 119886 117216 114941 113491 113089 113493 113839 113224 111648
52969 111648 110044 109261 109374 109972 110624 110838 110109 108455 106652 105560 105334 105515 105718 105889 106041 106037 105702 105044
52951 105044 104360 104055 104214 104421 104184 103533 102861 102262 101458 100479 99899 100073 100512 100382 99539 98801 99280 101394
52933 101394 104302 106334 106382 104954 103498 102680 101912 100572 98904 97360 95875 94443 93724 94251 95489 96578
52917 96578 97718 99840 102979 105867 107343 107485 107138 106918 106936 107010 106917 106674 106614 106911 107173 106967 106598 106762 107419
52898A07419L27l56l15N31J255J328J152J215J432J502J298Q31L24L10J145K324
52882A21722K864K472J799J514J601J795K070K425K622K470K164K029K111K264
52868A51922K363K318K001J462R74P52O61M25J4l53o05r45j470j814j473n24K14
52851A55922K1q40j356r35m6L88j4q57j464j464j032p16q48j093q45j21L27Lo52
52832A44378r24p95q14j203j605j620j188m52L33Q37R49J016J451K058K098J196
52816A45715j43j014j008m74k9J19K97Q10J352J312O45K2o8R0L1j14N7M48O27
52797A48675N24M69O00P73J042J619K289K359J460Qj197j608j138j44P11R69Q39
52780A58250Q68J187J420J348J188J093Q62L34k79o22n33N1J047J930J915P74
$$ plain form
52898 107419 107746 107390 107075 107606 108861 110189 111341 112556 113988 115490 116788 117619 117943 118253 119398 121722
52882 121722 124586 127058 128857 130371 131972 133767 135837 138262 140884 143354 145518 147547 149658 151922
52868 151922 154285 156603 158604 160066 161040 161792 162453 162878 162892 162539 161934 160989 159519 157705 156232 155708 155922
52851 155922 155943 155103 153747 152812 152766 153154 153140 152283 150819 149355 148323 147607 146759 145666 144821 144700 145027 145030 144378
52832 144378 143454 142659 141845 140642 139037 137417 136229 135777 136110 136947 137896 138912 140363 142421 144519 145715
52816 145715 145572 144558 143550 143076 143047 143166 143463 144273 145625 146937 147582 147604 147536 147626 147657 147543 147600 148048 148675
52797 148675 149199 149668 150268 151041 152083 153702 155991 158350 159810 159818 158621 157013 155875 155731 156442 157411 158250
52780 158250 159118 160305 161725 163073 164261 165354 166216 166550 166271 165649 165116 165167 166214 168144 170059 170833
52764A70833p16j544j503j138q41m03M54J398J672R37k48r94r90o42l20N5N43
52747A66553P64M09j96n10n67p84j193j520j827k404k934k622j428l67k80q56
52731A50238j317j515j806k280k675k842k785k461j970j712j898k107j755r40
52717A22175l39l56p50j102j243j194j008q01p21q42j159j624k055k082j446m03
52701A05050L36K17n95j304j234n37l8k65q16j038j014j360k079k329j614o00
52685I0780k48o06r49q10m01j98n36j393k215k194j171k7K38l44r48j121j098
52668G6759j081q65l40K03M50M48M39N75Q77J148J008K58o93j177j046p80q17
52651G5366j099j332j324r90m17Oq3m52m52O7M60J47o08j104j043o65l14j81k82
$$ plain form
52764 170833 170117 168573 167070 165932 165091 164688 165142 166540 168212 169149 168901 167907 166917 166275 165955 166010 166553
52747 166553 167317 167726 167530 167020 166453 165669 164476 162956 161129 158725 155791 153169 151741 151374 151094 150238
52731 150238 148921 147406 145600 143320 140645 137803 135018 132557 130587 128875 126977 124870 123115 122175
52717 122175 121836 121480 120730 119628 118385 117191 116183 115382 114661 113819 112660 111036 108981 106899 105453 105050
52701 105050 105386 105603 105008 103704 102470 101933 101895 101630 100814 99776 98762 97402 95323 92994 91380 90780
52685 90780 90532 89926 88977 88167 87766 87568 87032 85639 83424 81230 80059 80032 80270 79926 78978 77857 76759
52668 76759 75678 74813 74473 74676 75126 75574 76013 76588 77465 78613 79621 79879 79186 78009 76963 76183 75366
52651 75366 74267 72935 71611 70621 70204 70210 70127 69675 69223 69290 69750 69897 69289 68185 67142 66477 66163 65982 65700
52632F5700l84r4O96J558J964J835J470J081P33N42N47M76Oo71r16m12L88P78
52614G5297O42N28R18J617J954J587R34P15J165J815K097J911J532J147P61M54
52598I5074M09O46Q93Q63N98M28M85M59n4r21j443j121l47J1l73r49j048o46k31
52579I2733k26p12j503k173k283j842j398j322j298q34j06K87K00K8r6m46r04
52562G8105p96N4P65N46j23k14K62L21m10j145j190q86q50r53p21k34K3m1j45
52543G2368k24l98m09J67J075J478J095O80R39J531J605J026M64M34P62J022J024
52526H4639Q29O12N82P89R02N35j72n69l11J76K25k07n38k89M06J043J227R80
52508I0859P04Q19J263J452R52J46j04M57J101J056M52j4j01j97m82n43j0Q10
$$ plain form
52632 65700 65316 65222 65918 67476 69440 71275 72745 73826 74559 75101 75648 76124 76130 75459 74543 74131 74519 75297
52614 75297 75939 76467 77385 79002 80956 82543 83477 84192 85357 87172 89269 91180 92712 93859 94620 95074
52598 95074 95483 96129 97022 97885 98483 98911 99396 99855 99801 98880 97437 96316 95969 95980 95607 94658 93610 92964 92733
52579 92733 92507 91795 90292 88119 85836 83994 82596 81274 79976 79142 79036 79323 79523 79551 79455 79009 78105
52562 78105 77309 77363 78128 78674 78551 78337 78599 78920 78510 77365 76175 75289 74439 73486 72765 72531 72554 72513 72368
52543 72368 72144 71746 71337 71504 72579 74057 75152 75832 76771 78302 79907 80933 81397 81831 82593 83615 84639
52526 84639 85468 86080 86662 87451 88353 88888 88716 88147 87836 88012 88237 88030 87492 87203 87609 88652 89879 90859
52508 90859 91563 92382 93645 95097 96049 96195 96091 96548 97649 98705 99157 99143 99042 98845 98363 97820 97810 98620
52490I8620J346J521J736K109K165J398K7j009q42M19J658J755P03m20o66j05
52474A10415N75R11Q62M17l13q26o03K17R57J289J479J654J434O01l30p03n53
52457A17483l84l33l6O81J401J586J159N72L12L99L55j87r20j169q41n93q38j002
52439A17645l37Q08J242M68o38r51m34L4j02m44k16P42J701J769Q41k39n44j6
52421A21329O43Q88Q05O60M10k6k97Q7R71J497J072J29l81j15M26P64J012J334
52403A31208J332N65n48j020n13L14Q09J046J315J479J286Q69M14k25j055j467
52387A35809q87L03J144J264J056P94L61j13j56L18P16N65N1m21p25q15n44n0
52369A38670J89K5r3J53L65O7m40m39K44J086J575J612J327R53P66Q57R34P29
$$ plain form
52490 98620 99966 101487 103223 105332 107497 108895 108922 107913 107071 107490 109148 110903 111606 111186 110520 110415
52474 110415 110990 111901 112763 113180 112867 112041 111438 111655 112612 113901 115380 117034 118468 119069 118739 118036 117483
52457 117483 117099 116766 116730 117411 118812 120398 121557 122129 122441 122840 123195 123008 122088 120919 120078 119485 118647 117645
52439 117645 117308 118116 119358 119826 119188 118237 117803 117837 117735 117291 117075 117817 119518 121287 122128 121889 121345 121329
52421 121329 121972 122860 123665 124325 124735 124709 124412 124499 125470 126967 128039 128168 127787 127672 128098 128862 129874 131208
52403 131208 132540 133105 132557 131537 131024 131338 132147 133193 134508 135987 137273 138142 138556 138331 137276 135809
52387 135809 134922 135225 136369 137633 138689 139483 139844 139731 139575 139893 140609 141174 141225 140804 140079 139264 138720 138670
52369 138670 138859 138884 138791 138944 139309 139376 138936 138497 138741 139827 141402 143014 144341 145294 146060 146917 147851 148580
52351A48580M54N31R52J245J036M01k96o11k78M57Q82N92P4Q7N88Q27N16K22M55
52332A56714R38J139J015Q34O07J54m40q32q54n93j66L69Q75J162J145Q45L65
52315A63277j2J10P96J535J770J615J664K071K243J650O18p0r7J73L55M94P68
52298A78960J077J185J126J146J328J554J879K593L631M226L577J887L54k5O12
52283B05110J430J927K152K228K126J961J989K196K271K103J986K103K194K035
52269B33811J830J796J732J498J595K545L879M493M084L536L675M386N196O071
52255B80127P103P932Q094P666P124O816O974P818R189J0415J1035J1340J1666
52242C93299J1655J0987J0414J1032J2613J3713J3591J3082J3259J4075J4775
$$ plain form
52351 148580 149034 149565 150517 151762 152798 153199 152903 152292 152014 152471 153353 153945 154019 154106 154694 155521 156037 156259 156714
52332 156714 157652 158791 159806 160640 161247 161401 160961 160129 159275 158682 158516 158885 159760 160922 162067 162912 163277
52315 163277 163265 163375 164171 165706 167476 169091 170755 172826 175069 176719 177337 177267 177170 177343 177698 178192 178960
52298 178960 180037 181222 182348 183494 184822 186376 188255 190848 194479 198705 202282 204169 204523 204498 205110
52283 205110 206540 208467 210619 212847 214973 216934 218923 221119 223390 225493 227479 229582 231776 233811
52269 233811 235641 237437 239169 240667 242262 244807 248686 253179 257263 260799 264474 268860 274056 280127
52255 280127 287230 295162 303256 310922 318046 324862 331836 339654 348843 359258 370293 381633 393299
52242 393299 404954 415941 426355 437387 450000 463713 477304 490386 503645 517720 532495
52231E32495J4959J4726J4280J3916J3936J4207J4170J3605J2983J2678J2303
52220F84258J1276R729Q327P461O937O282N116L487K005J248R76M18n26j065p98
52205G45131m17o71j363j985k599l248l272k187p55m8J26P66J909K570K405K235
52189G38597K746L737M876O161P302P684P365P335Q278R670J0530J0456R612Q325
52175H42674P067O243N677M863L902L494L762L852L107J842N67p52k156l246l891
52160H77005m683n963p127p606p847q532r413r862r990j0297j0669j0715j0644
52147G63657j0824j0834j0076r006q631q868q663p711o844o524o187n375m517
52134F59597m064l827l565l462l495l164k376j805j903k191k102j832j699j417
$$ plain form
52231 532495 547454 562180 576460 590376 604312 618519 632689 646294 659277 671955 684258
52220 684258 695534 705263 713590 721051 727988 734270 739386 742873 744878 746126 747102 747520 746994 745929 745131
52205 745131 744714 744043 742680 740695 738096 734848 731576 729389 728634 728586 728712 729478 731387 733957 736362 738597
52189 738597 741343 745080 749956 756117 763419 771103 778468 785803 794081 803751 814281 824737 834349 842674
52175 842674 849741 855984 861661 866524 870426 873920 877682 881534 884641 886483 887050 886298 884142 880896 877005
52160 877005 872322 866359 859232 851626 843779 835247 825834 815972 805982 795685 785016 774301 763657
52147 763657 752833 741999 731923 722917 714286 705418 696755 689044 682200 675676 669489 664114 659597
52134 659597 655533 651706 648141 644679 641184 638020 635644 633839 631936 629745 627643 625811 624112 622695
52120F22695p92m82j139k141k198j094K3Q6q80k181l205l529k918j637m53j27
52104F00028q85k337l720m275l753k632j694j373j549j817j788j349q98j065j918
52089E68975k672k612k057j868k142k068j224l10k12p82j110p73k60j88n68j016
52073E49113j337j527j447q86q2K31l95j456j949j478n99k3J75L80Q22J383J914
52056E42839K470L230M260N335O072O388O726P556Q644R324R541J0062J1367J2917
52042F46731J3939J4488J5072J5665J5821J5657J5855J6651J7487J7814J7683
52031H22863J7315J6691J5839J4997J4240J3328J2200J1227J0521R503P555M976
52019I71255K797J650J133L43j164k994m319m685m461m456n138o374p761q916
$$ plain form
52120 622695 621903 621421 620282 618141 615943 614849 614872 614958 614078 611897 608692 605163 602245 600608 600155 600028
52104 600028 599143 596806 593086 588811 585058 582426 580732 579359 577810 575993 574205 572856 571958 570893 568975
52089 568975 566303 563691 561634 559766 557624 555556 554332 554022 553810 553028 551918 551145 550885 550697 550129 549113
52073 549113 547776 546249 544802 543916 543834 544065 543670 542214 540265 538787 538188 538165 538340 538720 539542 540925 542839
52056 542839 545309 548539 552799 558134 564206 570594 577320 584876 593520 602844 612385 622447 633814 646731
52042 646731 660670 675158 690230 705895 721716 737373 753228 769879 787366 805180 822863
52031 822863 840178 856869 872708 887705 901945 915273 927473 938700 949221 958724 966279 971255
52019 971255 974052 975702 976835 977178 976014 973020 968701 964016 959555 955099 949961 943587 935826 926910
52005I26910r425r010p971p070o691o363n446m009k698j905j437r15j91N99J160
51990H65538J263J053J111J873L168M465N517O417P171P535P332O717O022N547
51976I30729N410N454N242M425L135J872R42J85p58j996l249m111m512m935n966
51961I31867p578r059r865j0303j1078j2433j3995j5260j5842j5564j4849j4732
51949G81309j5810j7261j7716j7065j6554j6872j7205j6734j6050j6170j6829
51938E97043j6938j6366j6068j6355j6265j5025j3268j2159j1994j2231j2425
51927D37949j2445j2122j1356j0467r914r728r626r512r475r373q970q406q052
51914C08503p820p267o403n801n645n359m538l713l571l900m020l899m042m412
$$ plain form
52005 926910 917485 908475 900504 893434 886743 880380 874934 870925 868227 866322 864885 863970 863779 864378 865538
51990 865538 866801 867854 868965 870838 874006 878471 883988 890405 897576 905111 912443 919160 925182 930729
51976 930729 936139 941593 946835 951260 954395 956267 957209 957394 956636 954640 951391 947280 942768 937833 931867
51961 931867 924289 915230 905365 895062 883984 871551 857556 842296 826454 810890 796041 781309
51949 781309 765499 748238 730522 713457 696903 680031 662826 646092 630042 613872 597043
51938 597043 580105 563739 547671 531316 515051 500026 486758 474599 462605 450374 437949
51927 437949 425504 413382 402026 391559 381645 371917 362291 352779 343304 333931 324961 316555 308503
51914 308503 300683 293416 287013 281212 275567 270208 265670 261957 258386 254486 250466 246567 242525 238113
51900B38113m352l706l161l179l292k973k582k789l462l759l267k421j829j668
51886A95673j756j857j839j770j875k157k237j806j224j191j853k601k812k445
51872A68250j847j342j156j363j726j850j644j425j441j535j463j219r30o07k96
51857A48406k20n10r54j199j165j010q46o61m25j31J89M07L83J74j1k26q19j811
51839A39571k524k255j196k83r4l13l27k7K26J76l8j95l32o68j179j464j221p24
51821A27133n13o42o01r5M88O82O12O72Q39Q42P25P48P95M88r1l66p6L97O48P15
51801A33400P70P88P92R68J301J481J442J539J884K009J571R55O73N56J67l22
51785A49974m28k89n15j117j374r43l16L1K55N40N98K54M4M84J201J353P84J26
$$ plain form
51900 238113 233761 230055 226894 223715 220423 217450 214868 212079 208617 204858 201591 199170 197341 195673
51886 195673 193917 192060 190221 188451 186576 184419 182182 180376 179152 177961 176108 173507 170695 168250
51872 168250 166403 165061 163905 162542 160816 158966 157322 155897 154456 152921 151458 150239 149309 148702 148406
51857 148406 148186 147676 146722 145523 144358 143348 142502 141841 141416 141285 141474 141881 142264 142438 142427 142201 141382 139571
51839 139571 137047 134792 133596 133313 133219 132906 132579 132552 132778 132954 132916 132721 132389 131721 130542 129078 127857 127133
51821 127133 126620 125978 125377 125282 125770 126452 127064 127736 128575 129417 130142 130890 131685 132173 132082 131716 131640 132037 132685 133400
51801 133400 134170 134958 135750 136718 138019 139500 140942 142481 144365 146374 147945 148900 149573 150129 150296 149974
51785 149974 149546 149257 148742 147625 146251 145308 144992 145023 145278 145818 146416 146670 146714 147198 148399 149752 150536 150662
51767A50662j60k21l17m61n87o46m33K27R83J151N56k12n63m95j91M14J258J752
51749A52717J374M50k19m27p35j469k117j977j077j39K31R5m5J04K72%o27q67
51731A45544k53O19O77k12r72o39N18J521J882J815J550J056M64J77L70P20Q53
51714A55690Q22Q79J024J071J066J291J754J997J643J025R63J792K920L498L312
51699A80747K789K260J742J365J504K233L075L600L912M195M162L455K369J579
51685B18987J233R36N72M84P20P76L89j0m4n0m64r58q94l60q7l71p43q00p15p34
51665B17867o79l90j67l73q27j014p96n27m43l42J0M74P04N89L40J75J19R9J24
51646B14943K67M94O10M64J56OK59Q53J454J707J488J011O74P29J093J502J823
$$ plain form
51767 150662 150502 150281 149964 149503 148916 148270 147837 148064 149047 150198 150754 150542 149979 149484 149293 149707 150965 152717
51749 152717 154091 154541 154322 153895 153160 151691 149574 147597 146520 146381 146612 146707 146662 146766 147038 147038 146411 145544
51731 145544 145291 145910 146587 146375 145403 144764 145282 146803 148685 150500 152050 153106 153570 153747 154117 154837 155690
51714 155690 156512 157391 158415 159486 160552 161843 163597 165594 167237 168262 169225 171017 173937 177435 180747
51699 180747 183536 185796 187538 188903 190407 192640 195715 199315 203227 207422 211584 215039 217408 218987
51685 218987 220220 221156 221728 222212 222932 223708 224097 224087 224043 223993 223529 222571 221677 221317 221230 220859 220116 219316 218601 217867
51665 217867 217188 216798 216631 216258 215431 214417 213621 213094 212651 212309 212319 212793 213497 214086 214426 214601 214720 214819 214943
51646 214943 215210 215704 216314 216778 216934 216940 217199 218052 219506 221213 222701 223712 224386 225115 226208 227710 229533
51629B29533K086K258K204J967J889K269K973L543L643L315K851K577K646K830
51615B66584K590J643M17l51m91n55r68j493j790k068k659l309l475l294l490
51600B47291m188m579m093l322l156l434l236k382j809k242l149l504l111k663
51586B02423k643k777k626k256k024j960j775j443j351j702k017j617n19M72P04
51571A78889K98k59q19j423j774j428n35J70K63J09J25P1m79j255j466q80j70
51554A69437l0l30m26n9M85R38J379J874K083J585N60j69Q0J093K006K209J883
51537A84598J590J560J565J399J254J481K104K736L023L046L109L180K866K049
51523B15560J329J442K288K912K527J297m7j033j662k064k279k331k242j955j491
$$ plain form
51629 229533 231619 233877 236081 238048 239937 242206 245179 248722 252365 255680 258531 261108 263754 266584
51615 266584 269174 270817 271234 270883 270392 269837 268869 267376 265586 263518 260859 257550 254075 250781 247291
51600 247291 243103 238524 234431 231109 227953 224519 221283 218901 217092 214850 211701 208197 205086 202423
51586 202423 199780 197003 194377 192121 190097 188137 186362 184919 183568 181866 179849 178232 177713 178185 178889
51571 178889 179187 178928 178109 176686 174912 173484 172949 173119 173382 173491 173616 173687 173208 171953 170487 169607 169437
51554 169437 169407 169077 168651 168592 169077 170015 171394 173268 175351 176936 177496 177327 177407 178500 180506 182715 184598
51537 184598 186188 187748 189313 190712 191966 193447 195551 198287 201310 204356 207465 210645 213511 215560
51523 215560 216889 218331 220619 223531 226058 227355 227308 226275 224613 222549 220270 217939 215697 213742 212251
51508B12251j110j039j084p47J29J097J594J555J406J563K054K559K678K274J616
51493B26796J207J339J801K027J572M98n79r66n50Qk6n54p88l17K94L34l2l1N28
51474B32561R74P86L18J59K83L15L10O26J092J017K11n70o12k29k97j046j840
51457B34058k146k203k556l302m012m217l801l001k129j353p31m60q36j732k347
51442A99232j972r68l98o00p25p8P39O38l06q81l66O63J281J342J241J147J013
51425B01002J029J459K097K441K461K731L561M382M424L791L419L841M428M247
51411B45313L389K924L414M120M001L180K776L354M134L953K616J051L16O46J340
51396B86527J476Q43J94L34J038J265N37l85n05J78Q86J166J192J164J010P27
$$ plain form
51508 212251 211141 210102 209018 208271 208400 209497 211091 212646 214052 215615 217669 220228 222906 225180 226796
51493 226796 228003 229342 231143 233170 234742 235240 234661 233695 233145 233153 233127 232573 231785 231468 231762 232096 232064 232033 232561
51474 232561 233535 234321 234639 234798 235081 235396 235706 236332 237424 238441 238652 238082 237470 237241 236944 235898 234058
51457 234058 231912 229709 227153 223851 219839 215622 211821 208820 206691 205338 204607 204147 203311 201579 199232
51442 199232 197260 196292 195894 195294 194569 194491 195230 195868 195562 194681 194315 194978 196259 197601 198842 199989 201002
51425 201002 202031 203490 205587 208028 210489 213220 216781 221163 225587 229378 232797 236638 241066 245313
51411 245313 248702 251626 255040 259160 263161 266341 269117 272471 276605 280558 283174 284225 284541 285187 286527
51396 286527 288003 288846 289040 289374 290412 291677 292214 291829 291324 291502 292388 293554 294746 295910 296920 297647
51380B97647M85K18m63j655k835l386l250k900k789l029l441l779l871l714l394
51365B59844k966k500k129j904j685j368j152j267j502j370p71j44J30O5k31p11
51349B40339j036o02O54J880K222J771J224Q34L18l51p69p45o85j114k121l337
51333B38482m229m444m121l849l989m176l897l391l404m016m383l880k936k400
51319A85367k504k858l055k920k487k073k100k565k886k693k337k302k438k286
51305A49863j918j820k062k193j983j669j459j256j013q80q74p97o21n94p74q09
51289A29141m06K79Q41J004P11J29l14k08L75R99J515K126K725K704J838Q19M41
51272A44719N88O24M35M12O23P99J127K146L623M351L582K121J367J614J990J808
$$ plain form
51380 297647 298132 298350 297887 296232 293397 290011 286761 283861 281072 278043 274602 270823 266952 263238 259844
51365 259844 256878 254378 252249 250345 248660 247292 246140 244873 243371 242001 241230 241086 241216 241281 241050 240339
51349 240339 239303 238701 239355 241235 243457 245228 246452 247286 247604 247253 246484 245739 245054 243940 241819 238482
51333 238482 234253 229809 225688 221839 217850 213674 209777 206386 202982 198966 194583 190703 187767 185367
51319 185367 182863 180005 176950 174030 171543 169470 167370 164805 161919 159226 156889 154587 152149 149863
51305 149863 147945 146125 144063 141870 139887 138218 136759 135503 134490 133610 132736 131939 131318 130724 129950 129141
51289 129141 128735 129014 129855 130859 131570 131699 131385 131177 131552 132551 134066 136192 138917 141621 143459 144278 144719
51272 144719 145307 145931 146366 146778 147401 148200 149327 151473 155096 159447 163029 165150 166517 168131 170121 171929
51256A71929J267O96q0j266k427k919k744k524k604k636k185j453j033j188j661
51241A49172k113k418k528k331j877j478j416j646j963k306k638k648k012j010
51227A20788m64q13j468j492p99k19l17o36m32K08N39L51L15Q91J460J097k8o83
51209A18298j40Q80J185N85l3ML84M89L27L61O18M65n20j769k253j640o10O1K54
51190A16946K13r7p59j344j210m74j3k58o04m03J2p0m75l57L87Q43M19k94m82
51171A11980k49j20J1O51J598J945J310L67j27j94k16k10l1J40O3k4K94Q99J272
51152A19359J235J043P55J70n24o20J76J173J437Q42Nm79m05J89J048J692J783
51135A28879J480J207J083Q66M03j98p47j115j231j126r36o56j44M60O41K13k27
$$ plain form
51256 171929 173196 173892 173812 172546 170119 167200 164456 161932 159328 156692 154507 153054 152021 150833 149172
51241 149172 147059 144641 142113 139782 137905 136427 135011 133365 131402 129096 126458 123810 121798 120788
51227 120788 120324 119511 118043 116551 115752 115533 115216 114580 114148 114356 114895 115246 115561 116452 117912 119009 118981 118298
51209 118298 118158 119038 120223 120808 120775 120779 121163 121652 121979 122340 122958 123423 122903 121134 118881 117241 116631 116692 116946
51190 116946 117159 117062 116303 114959 113749 113275 113262 113004 112400 111997 112009 111939 111464 111107 111494 112337 112756 112462 111980
51171 111980 111731 111611 111622 112273 113871 115816 117126 117493 117366 117172 116956 116746 116715 116855 116918 116894 117188 118087 119359
51152 119359 120594 121637 122392 122562 122038 121418 121594 122767 124204 125046 125051 124572 124167 124356 125404 127096 128879
51135 128879 130359 131566 132649 133515 133918 133720 132973 131858 130627 129501 128565 127909 127765 128225 128866 129079 128852
51118A28852o6L52K07n04r87r40r65j452j889j677j040n18k47j54l93q97j085
51101A16597o39k41o54j417j353l15N01J99o79j004n09J65M04J73k44n95p51o70
51083A08968l57J80Q75J527J858J656R10j51j010j083k54R10J688J911J870J643
51067A21141R67j29j039j148n41J32L29L1m60q44r63q09m67j53r1k97n12m99l67
51048A14281l59m05k24R9J23j30J2Q56J656J596R61O15O39M94K67O59J516J673
51030A24329O50m55n02J56N08M69O83J183J367J140J048J243J268R31O28N08J72
51013A35326m75p75k59N73R78R82J042J129Q48L47K94Q65J389J273P33L22J70
50996A44762R0J45N27J053J220R02N32M90O44P04P09Q24Q67M53l94j122j260r40
$$ plain form
51118 128852 128786 129138 129345 128841 127854 126914 125949 124497 122608 120931 119891 119373 119126 118972 118579 117682 116597
51101 116597 115958 115717 115063 113646 112293 111978 112479 112678 111999 110995 110486 110651 111055 111228 110984 110389 109638 108968
51083 108968 108611 108791 109666 111193 113051 114707 115617 115466 114456 113373 113119 114029 115717 117628 119498 121141
51067 121141 122108 121979 120940 119792 119251 119383 119712 119743 119283 118439 117476 116667 116200 116047 115956 115659 115147 114648 114281
51048 114281 113922 113517 113293 113392 113515 113385 113397 114253 115909 117505 118466 119081 119720 120214 120481 121140 122656 124329
51030 124329 124979 124524 124022 124178 124686 125155 125838 127021 128388 129528 130576 131819 133087 134018 134646 135154 135326
51013 135326 134851 134076 133817 134390 135368 136350 137392 138521 139369 139716 140010 140875 142264 143537 144270 144592 144762
50996 144762 144852 144997 145524 146577 147797 148699 149231 149721 150365 151069 151778 152602 153469 153922 153528 152406 151146 150206
50978A50206n94l35P5O78J021O63j12m18K63J353J745J064R3j99K68P93Q69P22
50960A58155Q12J171J475J568J670K025K476K547J958J003L10K78Q51J702K464
50945A80465K802K622K365K784M081N488N992N439M556M033L917L973M205M765
50931B37487N559O219O506O563O760P344Q338R656J1174J2574J3422J3660J3963
50918C59225J5078J6858J8395J9292K0269K2115K4587K6830K8517K9978L1517
50907F12661L3302L5692L8888M2287M4907M6560M7866M9078M9623M9159M8198
50896A098221M7203M5681M2846L8795L4351K9964K5341K0207J4805R541M510l50
50884A411115m853q593j1399j3528j5200j6239j6462j6466j7329j9274k1200k2012
$$ plain form
50978 150206 149612 149277 149352 150030 151051 151714 151602 151184 151447 152800 154545 155609 155702 155503 155771 156564 157433 158155
50960 158155 158967 160138 161613 163181 164851 166876 169352 171899 173857 174860 175170 175448 176299 178001 180465
50945 180465 183267 185889 188254 191038 195119 200607 206599 212038 216594 220627 224544 228517 232722 237487
50931 237487 243046 249265 255771 262334 269094 276438 284776 294432 305606 318180 331602 345262 359225
50918 359225 374303 391161 409556 428848 449117 471232 495819 522649 551166 581144 612661
50907 612661 645963 681655 720543 762830 807737 854297 902163 951241 1000864 1050023 1098221
50896 1098221 1145424 1191105 1233951 1272746 1307097 1337061 1362402 1382609 1397414 1406955 1411465 1411115
50884 1411115 1406262 1397669 1386270 1372742 1357542 1341303 1324841 1308375 1291046 1271772 1250572 1228560
50872A228560k1968k2101k2728k3379k3925k4735k5745k6446k6911k7955k9842
50861I52825l1766l2963l3451l3380l2503l0924k9507k8741k7912k6162k3808
50850F21708k1862k0643j9698j8625j7286j5480j3146j0685q529o687n189m463
50838D59415m590m671l842k471j543j155n98L13J064J544K259L321M121M247M015
50823D61429L869L906M164M771N591O244O672P230Q151R329J0603J1817J2644
50810E56420J2938J3202J4134J5751J7480J9095K0842K2747K4579K6489K9020
50799G72697L2284L5832L9403M3199M7327N1708N6577O2260O8326P3796P8436
50788A361845Q2994Q7958R2885R7340J01588J05671J08681J09655J08621J06109
$$ plain form
50872 1228560 1206592 1184491 1161763 1138384 1114459 1089724 1063979 1037533 1010622 982667 952825
50861 952825 921059 888096 854645 821265 788762 757838 728331 699590 671678 645516 621708
50850 621708 599846 579203 559505 540880 523594 508114 494968 484283 475754 469067 463878 459415
50838 459415 454825 450154 446312 443841 442298 441143 440545 440858 441922 443466 445725 449046 453167 457414 461429
50823 461429 465298 469204 473368 478139 483730 489974 496646 503876 512027 521356 531959 543776 556420
50810 556420 569358 582560 596694 612445 629925 649020 669862 692609 717188 743677 772697
50799 772697 804981 840813 880216 923415 970742 1022450 1079027 1141287 1209613 1283409 1361845
50788 1361845 1444839 1532797 1625682 1723022 1824610 1930281 2038962 2148617 2257238 2363347
50778B363347J02020R5729Q7053P6562O5012N2876M0243K6967J3207n7j1457k0469
50766B891033k7802l4330m0010m4074m5954m5776m4394m3129m2928m3584m4204
50755B434848m4526m5234m6797m8848n0961n3289n6027n8926o1777o4680o7368
50744A836415o9011o9191o8433o7287o5678o3600o1523n9458n6519n2250m7528
50733A155937m3226l8903l3879k8734k4462k0851j7046j3201j0089p572m994k755
50721I10225j851j876j301J18R25L66n12q06j177k363l666m155m285n055o304
50706H78283p107p368p767q405q698q520q420q549q211o780m496k131j96J293
50692G92928K625M123N875P742R629J1719J4201J6946J9561K1740K3444K4969
$$ plain form
50778 2363347 2465367 2561096 2648149 2724711 2789723 2842599 2882842 2909809 2923016 2922959 2911502 2891033
50766 2891033 2863231 2828901 2788891 2744817 2698863 2653087 2608693 2565564 2522636 2479052 2434848
50755 2434848 2390322 2345088 2298291 2249443 2198482 2145193 2089166 2030240 1968463 1903783 1836415
50744 1836415 1767404 1698213 1629780 1562493 1496815 1433215 1371692 1312234 1255715 1203465 1155937
50733 1155937 1112711 1073808 1039929 1011195 986733 965882 948836 935635 925546 917974 912980 910225
50721 910225 908374 906498 905197 905315 906240 906606 906094 905288 904111 901748 898082 893927 889642 884587 878283
50706 878283 871176 863808 856041 847636 838938 830418 821998 813449 805238 798458 793962 791831 791635 792928
50692 792928 795553 799676 805551 813293 822922 834641 848842 865788 885349 907089 930533 955502
50680I55502K6906K9798L3572L7514M1043M4293M7720N1352N4821N7976O0989
50669A441486O3823O5980O6948O6739O5739O4124O1599N7731N2434M5971L8602
50658B091176L0445K1660J2557L372n806j4627k2328k8362l3057l7182m0894m3484
50646A933470m4218m3076m0688l7880l5353l3373l1683l0019k8777k8729l0011
$$ plain form
50680 955502 982408 1012206 1045778 1083292 1124335 1168628 1216348 1267700 1322521 1380497 1441486
50669 1441486 1505309 1571289 1638237 1704976 1770715 1834839 1896438 1954169 2006603 2052574 2091176
50658 2091176 2121621 2143281 2155838 2159210 2153404 2138777 2116449 2088087 2055030 2017848 1976954 1933470
50646 1933470 1889252 1846176 1805488 1767608 1732255 1698882 1667199 1637180 1608403 1579674 1549663
$$ [...]
##END NTUPLES=NMR SPECTRUM
##END=
