
##TITLE=AC1108_Colombia_5835691_q6k7dCIauJ
##JCAMPDX= 6.0         $$ Bruker NMR JCAMP-DX V2.0
##DATA TYPE= NMR SPECTRUM
##DATA CLASS= NTUPLES
##ORIGIN= BRUKER
##OWNER= Administrator
$$ 1.72 TOPSPIN		Version 2.1
$$ 2012-04-16 19:07:56.187 -0500  Administrator@TOPSPIN
$$ Compression mode = diff/dup
##.OBSERVE FREQUENCY= 400.13188235
##.OBSERVE NUCLEUS= ^1H
##.ACQUISITION MODE= SIMULTANEOUS (DQD)
##.ACQUISITION SCHEME= undefined
##.AVERAGES= 8
##.DIGITISER RES= 22
##SPECTROMETER/DATA SYSTEM= spect
##.PULSE SEQUENCE= zg30
##.SOLVENT NAME= COFFEE_meoh
##.SHIFT REFERENCE= INTERNAL, COFFEE_meoh, 1, 14.98061
##AUDIT TRAIL= $$ (NUMBER, WHEN, WHO, WHERE, PROCESS, VERSION, WHAT)
$$ ##TITLE= Audit trail, TOPSPIN		Version 2.1
$$ ##JCAMPDX= 5.01
$$ ##ORIGIN= Bruker BioSpin GmbH
$$ ##OWNER= Administrator
$$ $$ C:\Bruker\TOPSPIN/data/COFFEE/nmr/AC1108_Colombia_5835691_q6k7dCIauJ/20/pdata/1/auditp.txt
$$ ##AUDIT TRAIL=  $$ (NUMBER, WHEN, WHO, WHERE, PROCESS, VERSION, WHAT)
(   1,<2012-04-15 15:59:10.796 -0500>,<Administrator>,<TOPSPIN>,<go>,<TOPSPIN 2.1>,
      <created by zg
	started at 2012-04-15 15:58:04.265 -0500,
	POWCHK enabled, PULCHK disabled,
       configuration hash MD5:
       1A 1E CE 29 27 FD 77 03 67 4E F0 E3 C4 B2 CB 90
       data hash MD5: 64K
       10 34 D4 9B DC C9 65 5F 0B A0 D1 19 5B AD 65 E9>)
(   2,<2012-04-15 15:59:13.406 -0500>,<Administrator>,<TOPSPIN>,<proc1d>,<TOPSPIN 2.1>,
      <Start of raw data processing
       efp LB = 0 FT_mod = 6 PKNL = 1 PHC0 = 0 PHC1 = 0 SI = 32K 
       data hash MD5: 32K
       7C 33 65 E9 27 10 1F 48 6C E3 36 8B E8 8C 21 FC>)
(   3,<2012-04-15 15:59:13.843 -0500>,<Administrator>,<TOPSPIN>,<proc1d>,<TOPSPIN 2.1>,
      <pk PHC0 = 214.7772 PHC1 = 0 
       data hash MD5: 32K
       49 3F 8C FA E2 5C B9 25 F8 6F 53 C0 A2 F9 F2 FF>)
(   4,<2012-04-15 15:59:13.937 -0500>,<Administrator>,<TOPSPIN>,<proc1d>,<TOPSPIN 2.1>,
      <abs ABSG = 1 
       data hash MD5: 32K
       0B 05 3A 7C 26 F2 88 51 CB EB F5 EB 92 3B 73 CF>)
(   5,<2012-04-15 15:59:13.968 -0500>,<Administrator>,<TOPSPIN>,<proc1d>,<TOPSPIN 2.1>,
      <abs ABSG = 2 
       data hash MD5: 32K
       98 4A 71 57 6A 28 24 6A 47 76 9B 51 53 77 28 A5>)
(   6,<2012-04-15 15:59:14.000 -0500>,<Administrator>,<TOPSPIN>,<proc1d>,<TOPSPIN 2.1>,
      <abs ABSG = 3 
       data hash MD5: 32K
       A5 E6 9A 78 5B 99 0D 20 57 9D 44 2B 22 07 EF C5>)
(   7,<2012-04-15 15:59:14.031 -0500>,<Administrator>,<TOPSPIN>,<proc1d>,<TOPSPIN 2.1>,
      <abs ABSG = 4 
       data hash MD5: 32K
       18 98 67 37 4C 91 03 ED EC D9 38 86 79 99 9F 93>)
(   8,<2012-04-15 15:59:14.062 -0500>,<Administrator>,<TOPSPIN>,<proc1d>,<TOPSPIN 2.1>,
      <abs ABSG = 5 
       data hash MD5: 32K
       0E A1 82 6D 92 2D E2 AC 27 50 AB 17 E4 19 CA C6>)
(   9,<2012-04-15 15:59:17.687 -0500>,<Administrator>,<TOPSPIN>,<audit>,<TOPSPIN 2.1>,
      <user comment:
       ICON-NMR User ID: COFFEE
       data hash MD5: 32K
       0E A1 82 6D 92 2D E2 AC 27 50 AB 17 E4 19 CA C6>)
$$ ##END=
$$ 
$$ [...]
150 150 150 150 150 150 150 150
##$TP07= 0
##$TPNAME0= <>
##$TPNAME1= <>
##$TPNAME2= <>
##$TPNAME3= <>
##$TPNAME4= <>
##$TPNAME5= <>
##$TPNAME6= <>
##$TPNAME7= <>
##$TPOAL= (0..7)
0.5 0.5 0.5 0.5 0.5 0.5 0.5 0.5
##$TPOFFS= (0..7)
0 0 0 0 0 0 0 0
##$TUNHIN= 0
##$TUNHOUT= 0
##$TUNXOUT= 0
##$USERA1= <user>
##$USERA2= <user>
##$USERA3= <user>
##$USERA4= <user>
##$USERA5= <user>
##$V9= 5
##$VALIST= <valist>
##$VCLIST= <CCCCCCCCCCCCCCC>
##$VD= 0
##$VDLIST= <DDDDDDDDDDDDDDD>
##$VPLIST= <PPPPPPPPPPPPPPP>
##$VTLIST= <TTTTTTTTTTTTTTT>
##$WBST= 2048
##$WBSW= 25
##$XGAIN= (0..3)
0 0 0 0
##$XL= 0
##$YL= 0
##$YMAX_a= 493680
##$YMIN_a= -588472
##$ZGOPTNS= <>
##$ZL1= 120
##$ZL2= 120
##$ZL3= 120
##$ZL4= 120
##$ABSF1= 14.98061
##$ABSF2= -5.57192
##$ABSG= 5
##$ABSL= 3
##$ALPHA= 0
##$AQORDER= 0
##$ASSFAC= 0
##$ASSFACI= 0
##$ASSFACX= 0
##$ASSWID= 0
##$AUNMP= <proc_prof1d_extract_pilot.lims>
##$AXLEFT= 0
##$AXNAME= <>
##$AXNUC= <1H>
##$AXRIGHT= 0
##$AXTYPE= 0
##$AXUNIT= <>
##$AZFE= 0.1
##$AZFW= 0.1
##$BCFW= 0
##$BC_mod= 0
##$BYTORDP= 0
##$COROFFS= 0
##$CY= 15
##$DATMOD= 1
##$DC= 0
##$DFILT= <>
##$DTYPP= 0
##$F1P= 0
##$F2P= 0
##$FCOR= 0.5
##$FTSIZE= 32768
##$FT_mod= 6
##$GAMMA= 0
##$GB= 0
##$INTBC= 1
##$INTSCL= 1
##$ISEN= 128
##$LB= 0
##$LEV0= 0
##$LPBIN= 0
##$MAXI= 10000
##$MC2= 0
##$MEAN= 0
##$ME_mod= 0
##$MI= 0
##$NCOEF= 0
##$NC_proc= -8
##$NLEV= 6
##$NOISF1= 0
##$NOISF2= 0
##$NSP= 0
##$NTH_PI= 0
##$NZP= 0
##$OFFSET= 14.98061
##$PC= 1
##$PHC0= 214.7772
##$PHC1= 0
##$PH_mod= 1
##$PKNL= yes
##$PPARMOD= 0
##$PPDIAG= 0
##$PPIPTYP= 0
##$PPMPNUM= 2147483647
##$PPRESOL= 1
##$PSCAL= 4
##$PSIGN= 0
##$PYNMP= <proc.py>
##$REVERSE= no
##$SF= 400.13
##$SI= 32768
##$SIGF1= 0
##$SIGF2= 0
##$SINO= 400
##$SIOLD= 32768
##$SPECTYP= <>
##$SREGLST= <1H.CDCl3>
##$SSB= 0
##$STSI= 32768
##$STSR= 0
##$SW_p= 8223.68421052632
##$SYMM= 0
##$S_DEV= 0
##$TDeff= 65536
##$TDoff= 0
##$TI= <>
##$TILT= no
##$TM1= 0
##$TM2= 0
##$TOPLEV= 0
##$USERP1= <user>
##$USERP2= <user>
##$USERP3= <user>
##$USERP4= <user>
##$USERP5= <user>
##$WDW= 1
##$XDIM= 32768
##$YMAX_p= 462107142
##$YMIN_p= -651513
##$CURPLOT= <Network HP LaserJet P1505>
##$CURPRIN= <$Network HP LaserJet P1505>
##$DFORMAT= <normdp>
##$LAYOUT= <+/1D_H.xwp>
##$LFORMAT= <normlp>
##$PFORMAT= <normpl>
##$SURQMSG= 1
$$ End of Bruker specific parameters
$$ ---------------------------------
##NTUPLES= NMR SPECTRUM
##VAR_NAME=  FREQUENCY,     SPECTRUM/REAL,   SPECTRUM/IMAG
##SYMBOL=    X,             R,               I
##VAR_TYPE=  INDEPENDENT,   DEPENDENT,       DEPENDENT
##VAR_FORM=  AFFN,          ASDF,            ASDF
##VAR_DIM=   32768,         32768,           32768
##UNITS=     HZ,            ARBITRARY UNITS, ARBITRARY UNITS
##FACTOR=    0.250966925370066, 1,           1
##FIRST=     8223.43324360095, -73372,       -121897
##LAST=      0,             -224766,         -264901
##MIN=       0,             -651513,         0
##MAX=       8223.43324360095, 462107142,    0
$$ Real data points
##PAGE= N=1
##DATA TABLE= (X++(R..R)), XYDATA
$$ [...]
19498i0768k8215A0990b46579a18850k26216N5903n6958B6915a20569L268j97534
$$ -90768 -118983 10990 -246579 -118850 -345066 -289163 -346121 26915 -120569 -117301 -314835
19487c14835E8949P4935K34122h7894j65274A51209A4079a22626B42552C4644
$$ -314835 58949 133884 368006 -87894 -253168 151209 14079 -122626 242552 34644
19476E0301b9521p6738A03601a8356j24607B0930J75880c45517b7318n0443A76471
$$ 50301 -29521 -106259 103601 -18356 -142963 20930 196810 -345517 -27318 -77761 176471
19464I4686a37392N5111l27801c4314b502C2373b45404c707j68350Q090j3810
$$ 94686 -137392 -82281 -410082 -34314 -2502 32373 -245404 -3707 -172057 -163967 -177777
19453a77777L5161e4733B50871d53773c128j99314B46094a34410E8481c0203l86704
$$ -177777 -142616 -54733 250871 -453773 -3128 -202442 246094 -134410 58481 -30203 -416907
19442d16907J60937F7916a40584r6257n1517a3810m1340b3764j85453C1611J85594
$$ -416907 -255970 67916 -140584 -236841 -288358 -13810 -55150 -23764 -209217 31611 217205
19431B17205D305c03866f3669r6836O7829L0165F5638a0951B93081f1817A27249
$$ 217205 4305 -303866 -63669 -160505 -92676 -62511 65638 -10951 293081 -61817 127249
19419a72065g3090D79940b91727g0704j13639H5929b19033A22150d143j55338
$$ -172065 -73090 479940 -291727 -70704 -184343 85929 -219033 122150 -4143 -159481
19409a59481e9262n9340H1575b54474A24613J40614A8350b09052g1419j81540
$$ -159481 -59262 -118602 81575 -254474 124613 265227 18350 -209052 -71419 -252959
19399b52959L0265B22097A08003P5089j504h472B2951a80819e8126C4677a71375
$$ -252959 -222694 222097 108003 183092 181588 -8472 22951 -180819 -58126 34677 -171375
19387F0122i6494B2222b86731A49185B6143b12785q454n8414A02480a86545b9645
$$ 60122 -96494 22222 -286731 149185 26143 -212785 -221239 -279653 102480 -186545 -29645
19375A05636R8580d52791a05069C04943h1094B71948f597r6287F1882b12958G0883
$$ 105636 204216 -452791 -105069 304943 -81094 271948 -6597 -102884 61882 -212958 70883
19363A10684C900J53327o9729c65033A33077l2948a38129b2612m17589a76981
$$ 110684 3900 157227 87498 -365033 133077 100129 -138129 -22612 -440201 -176981
19352C5618L7499L8634E279J0057b96175K0489f6285A7450b04919h5272j87233
$$ 35618 73117 111751 5279 15336 -296175 -275686 -66285 17450 -204919 -85272 -272505
19341b72505h7484A55527F1697a8124j55457A68828g870p7870j53694A9409K42632
$$ -272505 -87484 155527 61697 -18124 -173581 168828 -7870 -85740 -239434 19409 262041
19330B62041a83241P2197m9047f2463Q738l31158J81401D29505e6671b0571A9383
$$ 262041 -183241 -111044 -160091 -62463 -53725 -384883 -203482 429505 -56671 -20571 19383
19318a3447l4167l16076J69958a6325k4858m6538p7620J5240K1006E6114i4150
$$ -13447 -47614 -363690 -193732 -16325 -41183 -87721 -165341 -150101 -129095 56114 -94150
19306a02052M806A48891N3815a15289A6438O7819N179a50942C3343a86146J196
$$ -102052 -97246 148891 202706 -115289 16438 84257 89436 -150942 33343 -186146 -184950
19295a84950P3542B05520d7046k84617j5590b5732j63146G5727a63278f2371C80085
$$ -184950 -111408 205520 -47046 -331663 -347253 -25732 -188878 75727 -163278 -62371 380085
19283a33279F1684a25185o4612j0955b3462D0403a36863K5726M0015J945k69534
$$ -133279 61684 -125185 -189797 -200752 -23462 40403 -136863 -111137 -71122 -69177 -338711
19272c38711B6324d9224j90030L7746h2856M394q7016e0203j66732A90210i8672
$$ -338711 26324 -49224 -239254 -201508 -82856 -78462 -165478 -50203 -216935 190210 -98672
19260e1794j07272C04021a28992N5289l89337d7852i331j66003j82745n8826F7213
$$ -51794 -159066 304021 -128992 -73703 -463040 -47852 -9331 -175334 -358079 -416905 67213
19248F1921A0708J2029J61117K37375F2953G163d07291b1305B15695a27994G1031
$$ 61921 10708 22737 183854 421229 62953 7163 -407291 -21305 215695 -127994 71031
19236B06181a93980A13689M2024F5010d23075J58873e8125k11134r255A9583a29349
$$ 206181 -193980 113689 155713 65010 -423075 -264202 -58125 -269259 -278514 19583 -129349
19224a34635j77680M8116A9782h7507I8142b52291J16499e4827j61200A93930
$$ -134635 -312315 -264199 19782 -87507 98142 -252291 -135792 -54827 -216027 193930
19213I2874g1938L0164r9786b9487j78261G1060d30481g2947a8780A07019b86367
$$ 92874 -71938 -41774 -141560 -29487 -207748 71060 -430481 -72947 -18780 107019 -286367
19201a79678a1557I715e0573B5744a6520A17489a06471B1366c31701B8795c29395
$$ -179678 -11557 9715 -50573 25744 -16520 117489 -106471 21366 -331701 28795 -329395
19189D1487a3878k27401k8202f8988k1107E9848O4688a53077d421j69486I0430
$$ 41487 -13878 -241279 -269481 -68988 -90095 59848 124536 -153077 -4421 -173907 90430
19177e1148l08799i9896B1794J71379a45999j56317D9615a7243o8783j50031d1078
$$ -51148 -359947 -99896 21794 193173 -145999 -302316 49615 -17243 -86026 -236057 -41078
19165b7536n2961I6621A1701f0366j84121c4372A15794c38758A2819J36784a03894
$$ -27536 -80497 96621 11701 -60366 -244487 -34372 115794 -338758 12819 149603 -103894
19153d5350q5156K9861A45178c96067a35951A81143E6289L0197c21981a48679
$$ -45350 -130506 -100645 145178 -396067 -135951 181143 56289 86486 -321981 -148679
19142A1213a05991j08368A00986g8714k7865j13850C7803j706J8218b63275G7466
$$ 11213 -105991 -214359 100986 -78714 -106579 -220429 37803 36097 54315 -263275 77466
19130G4235a9296p4880c4601n5341I3950F258i3426A9930a13455G0857a82124
$$ 74235 -19296 -94176 -34601 -89942 93950 6258 -93426 19930 -113455 70857 -182124
19118b28978j35659e8132k28118E933h8864L5415A19722f8189m8631B05033i5844
$$ -228978 -364637 -58132 -286250 5933 -88864 -53449 119722 -68189 -116820 205033 -95844
19106A15458e0380F8031a33973A09793a00872D5247K06264L2512b49971j23519
$$ 115458 -50380 68031 -133973 109793 -100872 45247 251511 284023 -249971 -373490
19096c73490h2701k43077R8678b2492m7113K223n6725l38240b5674A2645g9159
$$ -373490 -82701 -325778 -227100 -22492 -69605 -67382 -124107 -462347 -25674 12645 -79159
19084G546h387j65643C31811b69335D03064q3829D098e2371F1818D638b45279
$$ 7546 -8387 -174030 331811 -269335 403064 319235 4098 -52371 61818 4638 -245279
19072g2418l21496a42765j09362L6508i110j44551A15341b07922B37226f7952
$$ -72418 -393914 -142765 -252127 -215619 -9110 -153661 115341 -207922 237226 -67952
19061a03703A7301a01612E09002A6152Q7232h9070M006k25156d5024B62573b25354
$$ -103703 17301 -101612 509002 16152 103384 -89070 -85064 -310220 -45024 262573 -225354
19049a34035E4967a84224L9382o0516A56727H682g8095A48604c71353i050r4278
$$ -134035 54967 -184224 -144842 -205358 156727 8682 -78095 148604 -371353 -9050 -103328
19038a03328B54574c41937a36586K5182j55489d4832o697k74685a6687o8159k12989
$$ -103328 254574 -341937 -136586 -111404 -266893 -44832 -51529 -326214 -16687 -84846 -297835
19027b97835c2104l34261D9645a42929N6908q1738k08700h3220A78203i4167G4254
$$ -297835 -32104 -366365 49645 -142929 -86021 -167759 -376459 -83220 178203 -94167 74254
19015E0485a03994C62662a52732D96453a7364A85101A6554J00280c0594A82640
$$ 50485 -103994 362662 -152732 496453 -17364 185101 16554 116834 -30594 182640
19004a66179M7765j22737l3463I4551e2064k01209a20375A96660F2118K6597K11802
$$ -166179 -118414 -241151 -274614 94551 -52064 -253273 -120375 196660 62118 88715 300517
18993C00517a22000d5975A20715a28403B17427i0485M0538k32088a887j21657
$$ 300517 -122000 -45975 120715 -128403 217427 -90485 -49947 -282035 -1887 -123544
18983a23544A09507c60413A48836D9008K01558b45587O8360g1867B24442D1752
$$ -123544 109507 -360413 148836 49008 250566 -245587 -177227 -71867 224442 41752
18972a48385B7941A1906a34831A24128m6889a94098H3292n752a07253B75690b7076
$$ -148385 27941 11906 -134831 124128 77239 -194098 83292 77540 -107253 275690 -27076
18960H5754K9363A9421L5438N60950C4745J70718J42574f1519L172j10012b9084
$$ 85754 115117 19421 54859 615809 34745 205463 348037 -61519 -58347 -168359 -29084
18948d7492n7403r7971e9847F3911f3705J9001A00289n09Q6685E2539d31062A88865
$$ -47492 -104895 -202866 -59847 63911 -63705 -44704 100289 99780 186465 52539 -431062 188865
18935a51387G0398b16366Q3933o0657g0893L4676l48558a06235l51521a57573
$$ -151387 70398 -216366 -132433 -193090 -70893 -36217 -384775 -106235 -457756 -157573
18924d24084H643a97195b346I6724O4694M5622a95090i5080M4301B20572n5244
$$ -424084 8643 -197195 -2346 96724 161418 207040 -195090 -95080 -50779 220572 165328
18913A65328b46883m075A92407l9596a43365E9070a50300A42417a88202p031c6688
$$ 165328 -246883 -250958 192407 152811 -143365 59070 -150300 142417 -188202 -195233 -36688
18901A6481a39930B8385b33373e7845q753n8224I3875R1290P9494J10291i1818
$$ 16481 -139930 28385 -233373 -57845 -66598 -124822 93875 185165 264659 374950 -91818
18889C86939a26174m2618r1357b5139L167A05568A1895O7807b22141B8561b7406
$$ 386939 -126174 -168792 -260149 -25139 -21972 105568 11895 79702 -222141 28561 -27406
18877C36851a62995b5117q133J246o640A85120b47797g2092A2031a08154r978
$$ 336851 -162995 -25117 -33250 -32004 -38644 185120 -247797 -72092 12031 -108154 -118132
18866a18132E81f0024A5061b55748A35703C6522f8026A93949F5590a51426k41485
$$ -118132 581 -60024 15061 -255748 135703 36522 -68026 193949 65590 -151426 -392911
18855c92911M0868i1681k31387A21206a59352j6719m6035c5568n8383K1002D80077
$$ -392911 -352043 -91681 -323068 121206 -159352 -176071 -222106 -35568 -93951 -72949 480077
18843d7216k62365a01368c8149k55983J03193b3113E62386b47988J03932E4321
$$ -47216 -309581 -101368 -38149 -294132 -190939 -23113 562386 -247988 -144056 54321
18832a07760A66677n4932c61149e4923A40407e3962B51366g5199e82B0780D949
$$ -107760 166677 111745 -361149 -54923 140407 -53962 251366 -75199 -582 20780 4949
18820c807o886I8425b89294c964A74700B4621a90080c4031A8090L9536k8777N8970
$$ -3807 -10693 98425 -289294 -3964 174700 24621 -190080 -34031 18090 57626 28849 87819
18808H7819c8640p9838B36958A8385h946j00149M8441g424B34125A9047M3163
$$ 87819 -38640 -118478 236958 18385 -8946 -109095 -60654 -7424 234125 19047 62210
18797F2210M2143j2165r703L4517L03412j84272b5226A22138q603h9269l52843
$$ 62210 104353 92188 82485 117002 420414 236142 -25226 122138 113535 -89269 -442112
18786d42112a56783D6547J30772A6458J00872m6653Q569g4623j15579L0367N249
$$ -442112 -156783 46547 177319 16458 117330 70677 79246 -74623 -190202 -159835 -154586
18775a54586j26235A7276a25743M5359a2581E4209c28236B87637a55169q9616
$$ -154586 -280821 17276 -125743 -80384 -12581 54209 -328236 287637 -155169 -244785
18765b44785P7134K951J948J7609F6099c07313B47011b60257a6047j28741A67782
$$ -244785 -167651 -164700 -162752 -145143 66099 -307313 247011 -260257 -16047 -144788 167782
18753a9699D8591J25104o6747l7806C0562M5736b44263A02880c78579a68322q2179
$$ -19699 48591 173695 106948 69142 30562 76298 -244263 102880 -378579 -168322 -250501
18742b50501F7003b10454H0582a45458A1683K145K67333d10291a64326K5994P701
$$ -250501 67003 -210454 80582 -145458 11683 13828 281161 -410291 -164326 -138332 -130631
18731a30631N1009L3714j19990l64560b29602a12932r8262i3273k13935d1005
$$ -130631 -79622 -45908 -165898 -530458 -229602 -112932 -211194 -93273 -307208 -41005
18720g3328J1386j6252h451j83186A3208A280a59878d2338j51040D3578L0926
$$ -73328 -61942 -78194 -8451 -191637 13208 1280 -159878 -42338 -193378 43578 74504
18709G4504A4677P5888m0498L9552a00212J3621k33009H209J41438a36545j095
$$ 74504 14677 90565 50067 89619 -100212 -86591 -319600 8209 149647 -136545 -137640
18698a37640p2604j22173B03478B5985b5404A88642c25123A02947b54390J25602
$$ -137640 -210244 -332417 203478 25985 -25404 188642 -325123 102947 -254390 -128788
18688a28788A11109g0564A63428d01158J00041a18847c597A47412l2855c4619
$$ -128788 111109 -70564 163428 -401158 -301117 -118847 -3597 147412 114557 -34619
18677c73903a47618l9626I187e8599o4008K5848J212l05334I5347H532J66626
$$ -373903 -147618 -187244 9187 -58599 -122607 -96759 -95547 -400881 95347 8532 175158
18666A75158d4167j4041A9554a46065A8023M4197a00674H2238a03341j18186d6918
$$ 175158 -44167 -58208 19554 -146065 18023 62220 -100674 82238 -103341 -221527 -46918
18654G9630l0773d87032i5893B18377b716n3940j20614o1037B15141p4514a41387
$$ 79630 48857 -487032 -95893 218377 -2716 -56656 -177270 -238307 215141 140627 -141387
18642h7440A4680f089F1286g1945j15867J7909a5838I3006a34123c0820k33124
$$ -87440 14680 -6089 61286 -71945 -187812 -169903 -15838 93006 -134123 -30820 -263944
18631b63944e0990j41478b9955D1933c32368A6405M6353g4120j40171A6057K38065
$$ -263944 -50990 -192468 -29955 41933 -332368 16405 62758 -74120 -214291 16057 254122
18620B54122a37957j04355j5390j05610C61559a2949A43018h6418a1387C61129
$$ 254122 -137957 -242312 -257702 -363312 361559 -12949 143018 -86418 -11387 361129
18609F9699a16327r928c5700j21329A50855A9395c02729c6300A0999a92913f7129
$$ 69699 -116327 -126255 -35700 -157029 150855 19395 -302729 -36300 10999 -192913 -67129
18597a37835q2903d7224A97775m3468J45279e9343m8112a2015B10324b61017a1625
$$ -137835 -220738 -47224 197775 154307 299586 -59343 -107455 -12015 210324 -261017 -11625
18585d5908F4879J11305a64080g8233A9098L20a1417e557j70045A37604a55476
$$ -45908 64879 176184 -164080 -78233 19098 19418 -11417 -5557 -175602 137604 -155476
18573e8558j22712j20351G8128k0146B7122K69220d16642d5821j79047B09622
$$ -58558 -181270 -301621 78128 57982 27122 296342 -416642 -45821 -224868 209622
18562a36739H4740a7615F8801a40151p762k70801H1495R9807n9506b05542B61686
$$ -136739 84740 -17615 68801 -140151 -147913 -418714 81495 181302 121796 -205542 261686
18550b82945H2001i9465A87858c8359k6096j67907J899k92345J38605A23775c63722
$$ -282945 82001 -99465 187858 -38359 -64455 -232362 -230463 -522808 -384203 123775 -363722
18538d286l10058g8494j4047C5230P5721b48091B4887g525r5873B72651i241j09209
$$ -4286 -314344 -78494 -92541 35230 110951 -248091 24887 -7525 -103398 272651 -9241 -118450
18526a18450j9183N2706A24095j18b41387c4433G7763f1298A3339i3475k75150
$$ -118450 -137633 -84927 124095 123977 -241387 -34433 77763 -61298 13339 -93475 -368625
18515c68625A85107J25843A0654i1807l2942k9571l40288g4229C9244c10787q8218
$$ -368625 185107 310950 10654 -91807 -124749 -154320 -494608 -74229 39244 -310787 -399005
18504c99005a51793j86458a14750A90635a42664b6052j73323A45132Q508b06453
$$ -399005 -151793 -338251 -114750 190635 -142664 -26052 -199375 145132 153640 -206453
18493B67895A9683O2012a66878G6082a3678A07052a01155j8479K5338k18005D6588
$$ 267895 19683 81695 -166878 76082 -13678 107052 -101155 -119634 -94296 -312301 46588
18481D2870a25685d3842k12128G430a0581A97963h461l24705A98590d4495A92894
$$ 42870 -125685 -43842 -255970 7430 -10581 197963 -8461 -333166 198590 -44495 192894
18469a9799G9616b50136c5338k63627g7836B83671d16306A54826a61540P805j87687
$$ -19799 79616 -250136 -35338 -298965 -77836 283671 -416306 154826 -161540 -153735 -341422
18458c41422J33088A12313M5585K07189a79836g7127q753C050a83125J2385L2344
$$ -341422 -208334 112313 157898 365087 -179836 -77127 -85880 3050 -183125 -170740 -138396
18447a38396c2824A3492P8329N1976M3465b83176d2331K00j02154H1015a23149
$$ -138396 -32824 13492 91821 143797 187262 -283176 -42331 -42131 -144285 81015 -123149
18435b7274Q939k80926M0585A56120q138a33911M6034B87537a69181g5990r396
$$ -27274 -18335 -299261 -258676 156120 147982 -133911 -87877 287537 -169181 -75990 -85386
18424h5386j1020r1810E9204M9550a5248A03781b52315Q8076l2111B29610a59968
$$ -85386 -96406 -188216 59204 108754 -15248 103781 -252315 -164239 -196350 229610 -159968
18412a70670H7808L0127e22802A23197b8353j72019K6012A79364G4456K1014d40584
$$ -170670 87808 117935 -522802 123197 -28353 -200372 -174360 179364 74456 95470 -440584
18400I9920a46774q6924B45867j616d6020m45949G2210m219a18983j09349a13330
$$ 99920 -146774 -233698 245867 244251 -46020 -491969 72210 67991 -118983 -228332 -113330
18388a28063j21435a4078F0848J11752M839i0835B87783M978b7963n1866k59240
$$ -128063 -249498 -14078 60848 172600 177439 -90835 287783 292761 -27963 -79829 -339069
18377c39069b5526C0665c05546J13788L3499F647R307b16346A298d1525j18389
$$ -339069 -25526 30665 -305546 -191758 -158259 6647 15954 -216346 1298 -41525 -159914
18366a59914L8759j79025A80773J59577j55677H7769g476C61321e5B42197d9462
$$ -159914 -121155 -300180 180773 340350 184673 87769 -7476 361321 -55 242197 -49462
18354a95514O5369l15382a99920B59038I3549m1196N3024J06891c8389B18174
$$ -195514 -130145 -445527 -199920 259038 93549 52353 105377 212268 -38389 218174
18343A99608C6064j427a89310A80162c11124J25845B24533c01944P6861A50273
$$ 199608 36064 34637 -189310 180162 -311124 -185279 224533 -301944 -225083 150273
18332a82979R647Q2909B9199J47174a86168P2137K7314k60507C5537a08567J7825
$$ -182979 -173332 -90423 29199 176373 -186168 -114031 -86717 -347224 35537 -108567 -90742
18321i0742k4247E4739g2520j07404B15950G3523a47126I0828c49671G8543h8136
$$ -90742 -114989 54739 -72520 -179924 215950 73523 -147126 90828 -349671 78543 -88136
18309b43797A70737A522a0528l35101f8478j82078a9726p6385C686b7371l1203
$$ -243797 170737 1522 -10528 -345629 -68478 -250556 -19726 -96111 3686 -27371 -58574
18298e8574A6301K21373b4506C71418c58970a61725m1535A52896a04320H1778
$$ -58574 16301 237674 -24506 371418 -358970 -161725 -203260 152896 -104320 81778
18287b40537J06271N1639o4076D8393A058f2916j70061q253d7061o136n7228e0303
$$ -240537 -134266 -82627 -146703 48393 1058 -62916 -232977 -241230 -47061 -53197 -110425 -50303
18274E9491d2477D3954a4654n6568r9730j0355J4737j97023B28602D3525b32793
$$ 59491 -42477 43954 -14654 -71222 -170952 -181307 -166570 -363593 228602 43525 -232793
18262A27154a10310j23337R7723R701c8353B1636a67296d4081B45214j4271g5440
$$ 127154 -110310 -233647 -135924 -126223 -38353 21636 -167296 -44081 245214 230943 -75440
18250G1280B6059f1523J3255B03349b327A14129b07722A78937d9657E2494f5208
$$ 71280 26059 -61523 -48268 203349 -2327 114129 -207722 178937 -49657 52494 -65208
18238b36610b6615q5422j53297g4038B30306A0044c17470F6546a42244a9273n4581
$$ -236610 -26615 -112037 -265334 -74038 230306 10044 -317470 66546 -142244 -19273 -73854
18227g3854H9796a18806J283N2220A13719a52155A23232a56305P3048j74650P2605
$$ -73854 89796 -118806 -117523 -65303 113719 -152155 123232 -156305 -83257 -257907 -185302
18216a85302C5133e3953o4395L6201A72060b31088A42801a48551B8815b8855B54269
$$ -185302 35133 -53953 -118348 -82147 172060 -231088 142801 -148551 28815 -28855 254269
18204A21492C2497K1887c613k15275k05783A21764B775e5478B80811A05602J26706
$$ 121492 32497 54384 -3613 -218888 -424671 121764 2775 -55478 280811 105602 232308
18193B32308A11087R9086J54264a33460j78576A82763b12257B1065a74232B27401
$$ 232308 111087 210173 364437 -133460 -312036 182763 -212257 21065 -174232 227401
18182E4884O8698b374k18488A96047D6691P1480P4507p7017c3022F5016b31307
$$ 54884 123582 -2374 -220862 196047 46691 118171 192678 115661 -33022 65016 -231307
18170c37817i7400B73015a0548F7462A7006D415b01138A59323b8201B17751c2640
$$ -337817 -97400 273015 -10548 67462 17006 4415 -201138 159323 -28201 217751 -32640
18158B7901J88935c196A1145a51335k14175J49785C72053a58642n1453A91068
$$ 27901 216836 -3196 11145 -151335 -365510 -215725 372053 -158642 -210095 191068
18147b4655E5487f8234A04561J44699b49264a14385D2535a3167n6210c1570j05225
$$ -24655 55487 -68234 104561 249260 -249264 -114385 42535 -13167 -69377 -31570 -136795
18136a36795G1368k7059J25360c59563B04480f6904A65238K16168i651C8036Q6329
$$ -136795 71368 44309 169669 -359563 204480 -66904 165238 381406 -9651 38036 124365
18125A24365a1596E1381a72496A860J9279J35612G6400A1338N0447c73794e1834
$$ 124365 -11596 51381 -172496 1860 21139 156751 76400 11338 61785 -373794 -51834
18113b01263A60598c7375d188k20451A5242i906A35342b20301d1356m7454j55897
$$ -201263 160598 -37375 -4188 -224639 15242 -9906 135342 -220301 -41356 -88810 -244707
18102b44707a15235a9148A95860n3783g068j01352B89154c5752A59059F4211c96387
$$ -244707 -115235 -19148 195860 142077 -7068 -108420 289154 -35752 159059 64211 -396387
18090b358H4242b03651A87953P6283E1490a4936A4587h7525m2439j0695A49824
$$ -2358 84242 -203651 187953 264236 51490 -14936 14587 -87525 -129964 -140659 149824
18078a46939j9273r8099N022M3237A43061a96646j10412R7476e4021j25894P7839
$$ -146939 -166212 -264311 -259289 -216052 143061 -196646 -307058 -209582 -54021 -179915 -102076
18067a02076J9098J605E9084a27088K3807M6931A273O2507J7707a14083N5560
$$ -102076 -82978 -81373 59084 -127088 -103281 -56350 1273 63780 81487 -114083 -58523
18056e8523C3475b88098e8049A66835a06716d0597A28739J96578b16308A04435
$$ -58523 33475 -288098 -58049 166835 -106716 -40597 128739 325317 -216308 104435
18045g0867k82100C49125e070j94936g7890j38706r76k6428b2121B60933C7149
$$ -70867 -352967 349125 -5070 -200006 -77890 -216596 -217572 -244000 -22121 260933 37149
18033D48448g8297j65799K036A61940a8334G187b4799m1791m7878e3722l3544
$$ 448448 -78297 -244096 -242060 161940 -18334 7187 -24799 -66590 -114468 -53722 -87266
18022h7266B10800E1119Q064a58884j07281A76601B4748l589Q8555n4476b93583
$$ -87266 210800 51119 59183 -158884 -266165 176601 24748 21159 109714 55238 -293583
18010h7622A50777b54765d3160k5499j961j00199A71130a88198B84399a51112
$$ -87622 150777 -254765 -43160 -68659 -70620 -170819 171130 -188198 284399 -151112
17999e5577j00614C4495a07148A00410R5332a7002j48916A75307o4540D5337h3476
$$ -55577 -156191 34495 -107148 100410 195742 -17002 -165918 175307 110767 45337 -83476
17987A84155c7392m38833a03253b0065A19560g724C29311D1864j383J54037j3064
$$ 184155 -37392 -476225 -103253 -20065 119560 -7724 329311 41864 40481 194518 181454
17976A81454o5612R6655F7392j9678J34145h0479k2910c768A721a65442G5058
$$ 181454 115842 212497 67392 47714 181859 -80479 -103389 -3768 1721 -165442 75058
17964g3602b4394A32763J94537a49483B70395O9828a50466o1370I016h077I2258
$$ -73602 -24394 132763 327300 -149483 270395 340223 -150466 -211836 9016 -8077 92258
17952B37137i3786Q48j2057n7266q5685B07498B6408Q5612n2661K08461b20197
$$ 237137 -93786 -92938 -104995 -162261 -247946 207498 26408 112020 59359 267820 -220197
17940a51254A98446J2763r8044O7678a63528K4272d1127N035E4917a33173H7835
$$ -151254 198446 211209 113165 180843 -163528 -139256 -41127 -36092 54917 -133173 87835
17928C6246b33617A70493a47378c7394l5407A60539a52136d454j1968B02865A1711
$$ 36246 -233617 170493 -147378 -37394 -72801 160539 -152136 -4454 -16422 202865 11711
17916B40698a15816C66899j45836C6369J37809F8298J2639K3358C180J60273a09108
$$ 240698 -115816 366899 221063 36369 174178 68298 80937 104295 3180 163453 -109108
17904H3416b80818d3275k36980A1040b148B71697O829b84B00240k6555f9753J637
$$ 83416 -280818 -43275 -280255 11040 -2148 271697 278526 -284 200240 173685 -69753 -68116
17892f8116G6395J22825H1581j6427b83297g9144H229a49581A07611B0294K6685
$$ -68116 76395 199220 81581 65154 -283297 -79144 8229 -149581 107611 20294 46979
17881D6979b36176B2874i1763E6689K79252D9155d8955A58961F3599d2616n0994
$$ 46979 -236176 22874 -91763 56689 335941 49155 -48955 158961 63599 -42616 -93610
17870i3610I6337Q7106n5223C8771K25268I6931J65474B4819c20676A35703J10233
$$ -93610 96337 183443 128220 38771 264039 96931 262405 24819 -320676 135703 245936
17859B45936M7847a39724a9672k18179l9714m670A66399A960O5562A35K39626
$$ 245936 293783 -139724 -19672 -237851 -277565 -282235 166399 1960 67522 135 239761
17848B39761A18924b09801D08123B01442b1566A97349h5800C4287d5864C01058
$$ 239761 118924 -209801 408123 201442 -21566 197349 -85800 34287 -45864 301058
17837B7531c17131a46406j6712A37494a30154D39760a0130j49725O3858c1793
$$ 27531 -317131 -146406 -163118 137494 -130154 439760 -10130 -159855 -95997 -31793
17826B18034G1008a12675n621b1357A99364K08756b14009D01141a78888k4433
$$ 218034 71008 -112675 -118296 -21357 199364 408120 -214009 401141 -178888 -203321
17816b03321A17646K6348m6663l658a91712A32547a14601L6553B8474b06186A28548
$$ -203321 117646 143994 97331 93673 -191712 132547 -114601 -78048 28474 -206186 128548
17804B04739A523P9101J23517I1031J88154A0639O2597M0841b61505A37213e877
$$ 204739 1523 80624 204141 91031 279185 10639 73236 114077 -261505 137213 -5877
17792b0384B46336d7028p9471M153M2331J5561k440n5611d144C3478N1178b6175
$$ -20384 246336 -47028 -126499 -122346 -80015 -64454 -66894 -122505 -4144 33478 84656 -26175
17779C92070e6174I6397a95620P8509A33479e89j34241k23915H6306g3745A49066
$$ 392070 -56174 96397 -195620 -117111 133479 -589 -134830 -358745 86306 -73745 149066
17767a78899c9955j70165a03818B15879b28538A21330m5915l7608J91469a20494
$$ -178899 -39955 -210120 -103818 215879 -228538 121330 75415 37807 229276 -120494
17756F859a42302E5627J22072c1339E9584b24808E5599h4718A09319f696I8265
$$ 6859 -142302 55627 177699 -31339 59584 -224808 55599 -84718 109319 -6696 98265
17744C09244A43568F3842K26545o0003e5690C76551A47399k2860J5769J2222k4715
$$ 309244 143568 63842 290387 230384 -55690 376551 147399 124539 140308 152530 127815
17733A27815J50363k600o7378d5137A03289b12565A21450L5172P6535a12239M3067
$$ 127815 278178 275578 208200 -45137 103289 -212565 121450 156622 233157 -112239 -69172
17722f9172J6993J0287i32l8679r8418c787j10941r3880B32643E337d3298j0052
$$ -69172 -52179 -41892 -932 -39611 -138029 -3787 -114728 -208608 232643 5337 -43298 -53350
17710e3350j92403L8604g3941A67958J03577C0057K50500a50003A90671p3799
$$ -53350 -245753 -207149 -73941 167958 271535 30057 280557 -150003 190671 116872
17700A16872J23337c1311B05810a47088B62155B4168d7107F5459J92829C6729
$$ 116872 240209 -31311 205810 -147088 262155 24168 -47107 65459 258288 36729
17689A4366g5642j41770B01715a0883B38225D6262J08561m1364n430J88188a01477
$$ 14366 -75642 -217412 201715 -10883 238225 46262 154823 113459 108029 296217 -101477
17677F4334J98785A25502J6125l5801a5729E4215c7869A3461K68502K24835b1300
$$ 64334 263119 125502 141627 105826 -15729 54215 -37869 13461 281963 506798 -21300
17665H8241Q6544F953L38662A9334f5430B2996L8589a07343B11431K76666j62370
$$ 88241 174785 6953 345615 19334 -65430 22996 61585 -107343 211431 488097 325727
17654C25727a41358C6406J02633a87515A43691b5922A12939J767m2373J02687
$$ 325727 -141358 36406 139039 -187515 143691 -25922 112939 114706 72333 175020
17644A75020N6362K02013A74372e3597F4909B6294P2855b13388A09026O1148b6914
$$ 175020 231382 433395 174372 -53597 64909 26294 99149 -213388 109026 170174 -26914
17632D0407J5277K00724e7939d525C0513O450a73707B15600o4626E6676B2100
$$ 40407 55684 256408 -57939 -4525 30513 36963 -173707 215600 150974 56676 22100
17620D49453G5758M4317B8912r950N17153b16617J0080B89638a45391C04773C5733
$$ 449453 75758 120075 28912 18962 536115 -216617 -206537 289638 -145391 304773 35733
17608C92602a65424A48837Q7460d9129A03767e5941H5081L09009B4333a24402
$$ 392602 -165424 148837 236297 -49129 103767 -55941 85081 394090 24333 -124402
17597d4007I3663b0240C27237H4044b50993A00741K04822a31442A94617a92624
$$ -44007 93663 -20240 327237 84044 -250993 100741 305563 -131442 194617 -192624
17586A23926e7439j94180B17199d558o8048A58004R6508A492J52531j4963K01077
$$ 123926 -57439 -251619 217199 -4558 -72606 158004 254512 1492 154023 139060 340137
17575C40137m9579d8312B94926b60812B64661B8303Q3289d02522H4815K24343
$$ 340137 290558 -48312 294926 -260812 264661 28303 111592 -402522 84815 309158
17565C09158A20251J13957k9641l0709d4051A55606J2369L39755f6722B04746
$$ 309158 120251 234208 204567 173858 -44051 155606 167975 507730 -66722 204746
17554a62540A8107K35478a76359A12456C6314j7586K68862j9280M3672j06219
$$ -162540 18107 253585 -176359 112456 36314 18728 287590 268310 311982 205763
17544B05763J68242G7806K5901f9047B81614H7569R57K49636e2436C11133P4532
$$ 205763 374005 77806 103707 -69047 281614 87569 88526 338162 -52436 311133 385665
17533C85665A79405J66899e4013E55647B64211f9212m5535A32357C4851K63351
$$ 385665 179405 346304 -54013 555647 264211 -69212 -114747 132357 34851 298202
17523B98202B0002L23091J13124b6493j0595C02903c17059A98614K59626A02861
$$ 298202 20002 343093 456217 -26493 -37088 302903 -317059 198614 458240 102861
17512H8632J91624M69744k15845r0596P87814l97696j86019k37201J8005p459
$$ 88632 280256 750000 534155 443559 1231373 833677 647658 410457 428462 421003
17502D21003j16284k5474J50636p7220J84869m5156J54296J47569r9837j26245
$$ 421003 304719 279245 429881 352661 537530 492374 646670 794239 694402 568157
17492E68157J99003l49618K80569N2953l30947k01256J58505Q6077A94136F8561
$$ 568157 767160 417542 698111 751064 420117 218861 377366 463443 194136 68561
17481B66378J895M4014e8136D81872j65904A29446N7972C1875L23753n2423j28889
$$ 266378 268273 312287 -58136 481872 315968 129446 187418 31875 355628 303205 174316
17470A74316E0992J60413J68182A39927Q0020K633k4568N8853J15165J20997B21003
$$ 174316 50992 211405 379587 139927 219947 222580 198012 256865 372030 493027 221003
17458C07468J7327E8217K69887j25183R9375A10068g292A7423J02655i750E7251
$$ 307468 324795 58217 328104 202921 302296 110068 -7292 17423 120078 -9750 57251
17446E0987L24382R0366A35303J30786A33034L0798L3741J90431j51794K90113
$$ 50987 375369 465735 135303 266089 133034 163832 197573 388004 236210 526323
17436E26323o4542O7153p4369k08515p9764l6146K38445o6871o4831J83903A98039
$$ 526323 461781 528934 454565 246050 166286 130140 368585 301714 236883 420786 198039
17424F53176A80903K10002j94847R5578K7053A13351J11438C2982K49016K38576
$$ 653176 180903 390905 196058 291636 318689 113351 224789 32982 281998 520574
17414E20574G2709K63156J00676j12940j61209J99799A30446K25826j37101M30176
$$ 520574 72709 335865 436541 323601 162392 362191 130446 356272 219171 649347
17404F49347C7988L5468J99331R8983r7618o4511n1049L96428k06621b1079B59424
$$ 649347 37988 73456 272787 371770 274152 209641 158592 555020 348399 -21079 259424
17392A53547R3001J02830K41025A40659C0236L0585q496J17589J67718A16665
$$ 153547 246548 349378 590403 140659 30236 60821 52325 169914 337632 116665
17381C81618A38376K94585l2389A85181J25954L1618c6307A91494p2108Q9678
$$ 381618 138376 432961 400572 185181 311135 342753 -36307 191494 119386 209064
17371B09064K13074A30721B5854K88064E550M61921B01227m4099J88958q294L18385
$$ 209064 422138 130721 25854 313918 5550 467471 201227 157128 346086 337792 656177
17360F56177B61812I5186K05438j00166a26021H1281M90447k53338J18478B9201
$$ 656177 261812 95186 300624 200458 -126021 81281 571728 318390 436868 29201
17349E43804j80149e1411A89790O4507b6632m986A78929n079b23662A37306J1851
$$ 543804 363655 -51411 189790 254297 -26632 -31618 178929 173850 -223662 137306 149157
17338A49157J06662K59070j87593k8665D4690K4374M15242B21471p5540Q9951
$$ 149157 255819 514889 327296 298631 44690 69064 484306 221471 145931 235882
17328B35882P481n9225L57720A43850A3814K927K93366K4180j46281o5940k1528
$$ 235882 243363 184138 541858 143850 13814 16741 310107 334287 188006 122066 100538
17317A00538J04927K70312A58376o6972M6673J24502K9049k5794k6236J23797
$$ 100538 205465 475777 158376 91404 138077 262579 291628 265834 239598 363395
17307C63395a30410B30379J8893p9163K41779I1179P5075R8950D6521J44443j0776
$$ 363395 -130410 230379 249272 170109 411888 91179 166254 265204 46521 190964 180188
17296A80188i203C27150j57204c7072D57338l6121H9134l8677N7786J63348J3351
$$ 180188 -9203 327150 169946 -37072 457338 421217 89134 50457 108243 271591 284942
17285B84942j39702D593J64847K05161H1020k7230M32679F7892J99621n6005K41969
$$ 284942 145240 4593 169440 374601 81020 53790 486469 67892 267513 211508 453477
17274D53477A05676M1171E3321L84313A97590K85735j38777H3614a84218F05356
$$ 453477 105676 146847 53321 437634 197590 483325 344548 83614 -184218 605356
17263A5371L04329q2507C158L67607j77746a05394I1747L38647n0012p7854J13863
$$ 15371 319700 237193 3158 370765 193019 -105394 91747 430394 380382 302528 416391
17252D16391j28244L62344c0801E78910B31739O3564o6156K41803B03179P9566
$$ 416391 288147 650491 -30801 578910 231739 295303 229147 470950 203179 282745
17242B82745j20331J28206N4280n587j64369L93596j40315m1820K18138B25426
$$ 282745 162414 290620 344900 339313 174944 568540 428225 386405 604543 225426
17231C96528j74853J12529E3559K76692A34945P3001O1414J08611m0889L17321
$$ 396528 221675 334204 53559 330251 134945 207946 269360 377971 337082 654403
17221F54403E451J37147K75921c6032D56214j86606l9477k4624J90964j92753
$$ 654403 5451 142598 418519 -36032 456214 269608 230131 205507 396471 203718
17211B03718K39567o6498A60501L24445o0913A71385K26755F2433j6554O20879
$$ 203718 443285 376787 160501 484946 424033 171385 398140 62433 45879 666758
17201F66758k48373j78003R5603A22805P6850B9731M02531j95157J41964L3415
$$ 666758 418385 240382 335985 122805 199655 29731 432262 237105 379069 412484
17191D12484A00768J52741R5324K91453A45792K17782J86365O5869G9340K65665
$$ 412484 100768 253509 348833 640286 145792 363574 549939 615808 79340 345005
17181C45005J04207j09918K23932j37751j81791L27308k65984J67848j3397Q39
$$ 345005 449212 339294 563226 425475 243684 570992 305008 472856 459459 460298
17171D60298A50866K55849L8545j76093L32863i885I5663N5140L06263o4114L9139
$$ 460298 150866 406715 445260 269167 602030 -9885 95663 150803 457066 392952 432091
17160D32091j98274L17446j22789k510j79058J12181A64764n66l3770R5780p9275
$$ 432091 233817 551263 428474 425964 246906 359087 164764 164198 130428 226208 146933
17149A46933K61751j84691K05885j4374J19327B09276K28838j37055A46372Q1263
$$ 146933 408684 223993 429878 415504 534831 209276 438114 301059 146372 227635
17139B27635K9984Q6306k5764R1219J38370r7463r6244J50178D5130J51638K94607
$$ 227635 257619 343925 318161 409380 547750 450287 354043 504221 45130 196768 491375
17128D91375j80110o5205J14792j07270A07811L32407A44572K80298m261K49373
$$ 491375 311265 246060 360852 253582 107811 440218 144572 424870 420609 669982
17118F69982j16622B59230Q4658j538d2937G18029A32343L33547J17254l0123
$$ 669982 553360 259230 343888 342350 -42937 718029 132343 465890 583144 553021
17108E53021A30764J73763K76041j33904J44035O0671J85323C25080J7409K25612
$$ 553021 130764 304527 580568 446664 590699 651370 836693 325080 342489 568101
17098E68101N3706j23814J90294j73527M7398j01634j55484J57409k13734J11458
$$ 568101 621807 497993 688287 514760 562158 460524 305040 462449 248715 360173
17088C60173L44633l20335L60083B71406L80782J0996L5877m6409J39843k62211
$$ 360173 704806 384471 744554 271406 652188 663184 699061 652652 792495 530284
17078E30284M63831D38144k7365K08423O5969l34304K12562Q4983j82349L02309
$$ 530284 994115 438144 410779 619202 685171 350867 563429 648412 466063 768372
17068G68372k53447L10827h235C67486K42675k94674O08374k80806r4942R9886
$$ 768372 514925 825752 -8235 367486 610161 315487 923861 643055 548113 647999
17058F47999K2346k10573J38600J15510K51228j87940k26255J70272N0539j82613
$$ 647999 670345 459772 598372 713882 965110 777170 550915 721187 771726 589113
17048E89113j1840o2767j25905L17402j56691K32857M2948l80972L79052k1462
$$ 589113 577273 514506 388601 706003 549312 782169 825117 444145 823197 801735
17038H01735J03928l5801k70705P9760O42487F45468K06055l9543R3186l06891
$$ 801735 905663 869862 599157 678917 1321404 645468 851523 811980 905166 598275
17028E98275O2441L40935A95601N15406L93500j66600j30914l22039J94791M5521
$$ 598275 660716 1001651 195601 711007 1104507 937907 806993 484954 679745 725266
17018G25266J18449N2966j02755k39275J67377r7229J33185J0176L6901k69034
$$ 725266 843715 896681 793926 554651 722028 624799 757984 768160 805061 536027
17008E36027q037L42713j65632L48740l08651K3037K2422R0748J24185k50597
$$ 536027 527990 870703 705071 1053811 745160 768197 790619 881367 1005552 754955
16998G54955K69877E00061N73219k63361L97993l85895J50003n6671J91431m2040
$$ 754955 1024832 500061 1073280 809919 1207912 822017 972020 915349 1106780 1064740
16988A064740j17556M57917F81608J3352R0459L52711m27361M40426R2451j94897
$$ 1064740 947184 1405101 681608 694960 785419 1138130 710769 1151195 1243646 1048749
16978A048749M8077M0519J55453Q5760j79411p1977k06720R2902N1028m31443
$$ 1048749 1096826 1137345 1292798 1378558 1199147 1127170 920450 1013352 1064380 632937
16968F32937N34672Q9807m47692J85364J28463k51310K10735J26610L01629l80649
$$ 632937 1167609 1257416 809724 995088 1123551 872241 1082976 1209586 1511215 1130566
16958A130566q8489J53011j74552J63399J01013k09868l55585P50600p716k77683
$$ 1130566 1042077 1195088 1020536 1183935 1284948 1075080 719495 1470095 1462379 1184696
16948A184696K65043j75069K45413q7704l54520K69090k8925n7181M42968n50932
$$ 1184696 1449739 1274670 1520083 1432379 1077859 1346949 1318024 1260843 1703811 1152879
16938A152879L90796R1083p2764m6566M9359J24375o2182k81444J52023Q8111
$$ 1152879 1543675 1634758 1561994 1515428 1564787 1689162 1626980 1345536 1497559 1585670
16928A585670j5980J50447k40268J2956m0262L54715k24749J04126n9798n4929
$$ 1585670 1569690 1720137 1479869 1492825 1452563 1807278 1582529 1686655 1626857 1571928
16918A571928J71143q2842o1146K55220J36229k46869j5832M140K4594j77514
$$ 1571928 1743071 1660229 1599083 1854303 1990532 1743663 1727831 1731971 1756565 1579051
16908A579051L52109j15348L9872k69359L89139k9485l05601N43222q1189j39717
$$ 1579051 1931160 1815812 1855684 1586325 1975464 1945979 1640378 2183600 2102411 1962694
16898A962694r0910M82365k33656k79079J81852r0931l114L95763k8698J83331
$$ 1962694 1871784 2354149 2120493 1841414 2023266 1932335 1929221 2324984 2296286 2479617
16888B479617j61245k59734J45557m5889K21291L03642o41400k77223Q27617j47477
$$ 2479617 2318372 2058638 2204195 2158306 2379597 2683239 2041839 1764616 2592233 2444756
16878B444756P2909q2696J38393J42991p9604P6138L8420L5661K19110j52226
$$ 2444756 2517665 2434969 2573362 2716353 2636749 2712887 2751307 2786968 3006078 2853852
16868B853852J4533K0949J16277k54159L36407m12385M91873j05653K66061l57080
$$ 2853852 2868385 2889334 3005611 2751452 3087859 2675474 3167347 3061694 3327755 2970675
16858B970675K83261Q0063p0957K67997Q2771j97406l4649k6140L67551K19340
$$ 2970675 3253936 3333999 3263042 3531039 3613810 3416404 3381755 3355615 3723166 3942506
16848C942506j67184J75315K8018K13701m20688K86241K38891j86312j94399J6596
$$ 3942506 3775322 3950637 3978655 4192356 3771668 4057909 4296800 4110488 3916089 3932685
16838C932685N00775n6751k82006L72168K02068J6370O8994M4650O8452j57555
$$ 3932685 4433460 4376709 4094703 4466871 4668939 4685309 4754303 4798953 4867405 4709850
16828D709850j6954J09361K99177K48589Q131k3227J97997l7702J21572K75246
$$ 4709850 4692896 4802257 5101434 5350023 5358154 5334927 5532924 5495222 5616794 5892040
16818E892040M6688j50621K49236m29184P54170l9000J13258j8050K35065N4252
$$ 5892040 5938728 5788107 6037343 5608159 6362329 6323329 6436587 6418537 6653602 6707854
16808F707854K59662L44736M475l47948O45128j35501N05317J21971O1617k58277
$$ 6707854 6967516 7312252 7316727 6968779 7613907 7478406 7983723 8105694 8167311 7909034
16798G909034N27836M28162J53377k07277L10723M25319k53744K06032P08291
$$ 7909034 8436870 8865032 9018409 8811132 9121855 9547174 9293430 9499462 10207753
16789A0207753K62771L52945j01987j03252L91571M20279M60649k71691P95820
$$ 10207753 10470524 10823469 10721482 10618230 11009801 11430080 11890729 11619038 12414858
16780A2414858M18286j39121N62674K16999M53105K86621L60035N33788N29762
$$ 12414858 12833144 12694023 13256697 13473696 13926801 14213422 14573457 15107245 15637007
16771A5637007K69164M98982N46484L35247M97729N15264L80769N89521L64922
$$ 15637007 15906171 16405153 16951637 17286884 17784613 18299877 18680646 19270167 19635089
16762A9635089P82098Q59638O18528L07717R49795R93165M39256J038885L63651
$$ 19635089 20417187 21276825 21895353 22203070 23152865 24146030 24585286 25624171 25987822
16753B5987822J222211J159227O31715J339131R24821J411321J236344N95321
$$ 25987822 27210033 28369260 29000975 30340106 31264927 32676248 33912592 34507913
16745C4507913J533649J521207J308167J699352J585453J519472J733827J682862
$$ 34507913 36041562 37562769 38870936 40570288 42155741 43675213 45409040 47091902
16737D7091902J862808K205616J979657K256863K328153K020067K771253K792899
$$ 47091902 48954710 51160326 53139983 55396846 57724999 59745066 62516319 65309218
16729F5309218K669442K585735L105105L089841K716564L202198L331933L470112
$$ 65309218 67978660 70564395 73669500 76759341 79475905 82678103 86010036 89480148
16721H9480148L006456L316643L633581L379430L103378L393446L003540K738883
$$ 89480148 92486604 95803247 99436828 102816258 105919636 109313082 112316622 115055505
16713A15055505K491956K659153J997811J553253J989567J343039N37939O54793
$$ 115055505 117547461 120206614 122204425 123757678 125747245 127090284 127628223 128283016
16705A28283016k80809k62843p82553j174213j687759k034163j961201k658214
$$ 128283016 128002207 127739364 126956811 125782598 124094839 122060676 120099475 117441261
16697A17441261k547468l357763l089518l048156l127354l515110l504831l419704
$$ 117441261 114893793 111536030 108446512 105398356 102271002 98755892 95251061 91831357
16689I1831357l248913l196140l413143l393848k986422k648901l308587k728490
$$ 91831357 88582444 85386304 81973161 78579313 75592891 72943990 69635403 66906913
16681F6906913k507635k650859k535869k548217k509818j747496j976550k220988
$$ 66906913 64399278 61748419 59212550 56664333 54154515 52407019 50430469 48209481
16673D8209481j761501k131160j473302j543556j450909j741199j501056j094937
$$ 48209481 46447980 44316820 42843518 41299962 39849053 38107854 36606798 35511861
16665C5511861j395781j035117j420718j162573j037294j210016p16549j099383
$$ 35511861 34116080 33080963 31660245 30497672 29460378 28250362 27533813 26434430
16657B6434430n21152r36107o34410j001827j000187o25418n39090r23745o06007
$$ 26434430 25913278 24977171 24342761 23340934 22340747 21715329 21176239 20252494 19646487
16648A9646487l47961m92242q24927j21821n84035q19488k0624o69010o54890
$$ 19646487 19298526 18806284 17981357 17859536 17275501 16456013 16435389 15766379 15111489
16639A5111489m57872Q0924m58361j61477q21120l0698n86297m76700J31195l63406
$$ 15111489 14653617 14734541 14276180 14114703 13293583 13262885 12676588 12199888 12331083 11967677
16629A1967677l44985l43257k75823q4891o16018p9994l19364j48318j79535k42811
$$ 11967677 11622692 11279435 11003612 10918721 10302703 10222709 9903345 9755027 9575492 9332681
16619I332681m9995n49570L4615q9506l0866m24011m55870j59673M04622n34126
$$ 9332681 9282686 8733116 8767731 8678225 8647359 8223348 7767478 7607805 8012427 7478301
16609G478301r8476J84099l95129Q4033n97901L27776k71834m38566L9682l29960
$$ 7478301 7379825 7563924 7168795 7252828 6654927 6982703 6710869 6272303 6311985 5982025
16599E982025M36008n37823K67569k93035O5267J45066o92895J40023m94949K97288
$$ 5982025 6418033 5880210 6147779 5854744 5920011 6065077 5372182 5512205 5017256 5314544
16589E314544n013l53763L6368n03026O50091k79037l51869J10937p5791j77477
$$ 5314544 5309531 4955768 4992136 4489110 5139201 4860164 4508295 4619232 4543441 4365964
16579D365964K70932k85336R4779k89152j71804M35642l40031j00970k474J31745
$$ 4365964 4636896 4351560 4446339 4157187 3985383 4421025 4080994 3980024 3977550 4109295
16569D109295l58686K21677j91648k59252J47940o1662k40022J95595j6493Q3034
$$ 4109295 3750609 3972286 3780638 3521386 3669326 3607664 3367642 3563237 3546744 3629778
16559C629778m27494K3840J9078J63227k05739j16783J46659Q3412l06576J03087
$$ 3629778 3202284 3226124 3245202 3408429 3202690 3085907 3232566 3315978 3009402 3112489
16549C112489l00000l3799K8231k69099O25157k76331l76252K6090L57703m05943
$$ 3112489 2812489 2778690 2806921 2537822 3162979 2886648 2510396 2536486 2894189 2488246
16539B488246K02590q8910k44984J97670l126j6254k8934k75655K13699O859k24290
$$ 2488246 2690836 2601926 2356942 2554612 2551486 2535232 2506298 2230643 2444342 2451201 2226911
16528B226911j70667L63033k15888k46402K26922j99370L9643J02251k29079j93153
$$ 2226911 2056244 2419277 2203389 1956987 2183909 1984539 2024182 2126433 1897354 1704201
16518A704201O24820q0437k39415j15460j00868N7789J43744k37311K23528m4087
$$ 1704201 2329021 2248584 2009169 1893709 1792841 1850630 1994374 1757063 1980591 1936504
16508A936504q6729J63952K8449j35132m30677N34268m62195M17285n05943K16852
$$ 1936504 1849775 2013727 2042176 1907044 1476367 2010635 1548440 1965725 1459782 1676634
16498A676634O5735j70064O0017j34166N422j39444L39138j3456J29616n64491
$$ 1676634 1742369 1572305 1632322 1498156 1503578 1364134 1703272 1689816 1819432 1254941
16488A254941O4100M01950k96828K16987j54093J61799r1316j70286J75258M9992
$$ 1254941 1319041 1720991 1424163 1641150 1487057 1648856 1557540 1387254 1562512 1612504
16478A612504n01300J95478R601M5626N9969k56138J56760j79855N36159m88914
$$ 1612504 1111204 1306682 1316283 1361909 1421878 1165740 1322500 1142645 1678804 1189890
16468A189890j26763K80532k26462K54569M0766m40935J76916J61945m35098L52726
$$ 1189890 1063127 1343659 1117197 1371766 1412532 971597 1148513 1310458 875360 1228086
16458A228086J02815l47135K03770j40607R0714K7399q2898q59L2975o265L0563
$$ 1228086 1330901 983766 1187536 1046929 1137643 1165042 1082144 1081285 1114260 1107995 1138558
16447A138558L7622j11330P9249j55139j41534J38634J34811K9207k61444J03359
$$ 1138558 1176180 1064850 1144099 988960 847426 986060 1120871 1150078 888634 991993
16437I91993l01358O30727k03420m99398K59495n3461k09569O85509l25389j12009
$$ 991993 690635 1321362 1117942 618544 878039 824578 615009 1300518 975129 863120
16427H63120k864K07210l95688N18206j41533j79435j39981J26364p0160J84965
$$ 863120 860256 1067466 671778 1189984 1048451 869016 729035 855399 785239 970204
16417I70204j79712K92723m13798K50786N9260k7136l84458J00434R1209L77128
$$ 970204 790492 1083215 669417 920203 979463 952327 567869 668303 759512 1136640
16407A136640m17968p3081K49358j98817Q0231J92587k26919q7536L0267J56508
$$ 1136640 718672 645591 894949 696132 776363 968950 742031 654495 684762 841270
16397H41270K90426l09040j26255R7765j68705K14976k95919L3783L29092k36417
$$ 841270 1131696 822656 696401 794166 625461 840437 544518 578301 907393 670976
16387F70976K37104j88825K36774k8779l30525j10423L24848j16819K0600J98645
$$ 670976 908080 719255 956029 927250 596725 486302 811150 694331 714931 913576
16377I13576C56081K90124J97402k47382M3185K22615j37572J63764l79104N5601
$$ 913576 356081 646205 843607 596225 639410 862025 724453 888217 509113 564714
16367E64714J31612j13548m0570Q57J01910B84901M75018o8107M3368j87869k15221
$$ 564714 696326 582778 542208 543065 644975 284901 759919 691812 735180 547311 332090
16356C32090M21557l26019L80577j58607K777k4384M6838k0397l20740M54834
$$ 332090 753647 427628 808205 649598 652375 627991 674829 654432 333692 788526
16346G88526l23927K20293l27890M1571K07347R9703j66759B30197L22785K2115
$$ 788526 464599 684892 357002 398573 605920 705623 538864 230197 552982 575097
16336E75097k7408K76820C82213M09677k73890K286M1342J16108l18413A0730
$$ 575097 547689 824509 382213 791890 518000 520286 561628 677736 359323 10730
16325E47673k16197K45135L0126J12842Q131j94137J0377K15539k41740N3535
$$ 547673 331476 576611 606737 719579 727710 533573 543950 759489 517749 571284
16315E71284k29156H1090K28505K39556L56112j44496j30489J10621J20622k69053
$$ 571284 342128 81090 309595 549151 905263 760767 630278 740899 861521 592468
16305E92468j12398J2664b6808E41891h683D11607j27960K9919L01219j68537
$$ 592468 480070 492734 -26808 541891 -8683 411607 283647 313566 614785 446248
16295D46248n6326j3090N3170L8384B23837K27268j76899J76967j58239J27987
$$ 446248 389922 376832 430002 468386 223837 451105 274206 451173 292934 420921
16285D20921J91o8243J7358P7477A22671J27045n7132K02550k478J78502k31220
$$ 420921 421112 352869 370227 447704 122671 249716 192584 395134 392656 571158 339938
16274C39938N2717n0637L23353l24093K11261l5341B09283P4520M7721L372A02255
$$ 339938 392655 342018 665371 341278 552539 517198 209283 283803 331524 334896 102255
16262a50390B02478L08467j31351j41969r5586K88091k14581r362J87428J35949
$$ -150390 202478 510945 379594 237625 142039 430130 215549 206187 393615 529564
16252E29564J39954e353C43936A62286J60801J74943j98088l9585J52722J40917
$$ 529564 669518 -5353 343936 162286 323087 498030 299942 260357 413079 553996
16242E53996k74980J59486j31657J64601A75319o1170J20308O2949L35420h6365
$$ 553996 279016 438502 306845 471446 175319 114149 234457 297406 632826 -86365
16231d3458E43922j4014B62953R280M80277B08270M26482p9819B53161k4877J40382
$$ -43458 543922 529908 262953 272233 752510 208270 634752 554933 253161 228284 368666
16220C68666O020A82075p2805C3473K65005M2986j50875l2429K80584p5734L59967
$$ 368666 374686 182075 109270 33473 298478 341464 190589 158160 438744 363010 722977
16209G22977r9081p6899A7564b38128A19524L00850B08615J96995A26578D4422
$$ 722977 623896 546997 17564 -238128 119524 420374 208615 405610 126578 44422
16198A63667l472M5845A01160J36367l7395j9874K36850A16463N13615C03641
$$ 163667 160195 206040 101160 237527 200132 180258 417108 116463 630078 303641
16187B04051l8814K28798q2972j21419p7313R6750j7985L65821B67887Q8166E4333
$$ 204051 165237 394035 311063 189644 112331 209081 191096 556917 267887 356053 54333
16175E4618L56966A64893Q5606J19505F6428J54440n5214l5476A0483J5999J57105
$$ 54618 411584 164893 250499 370004 66428 220868 165654 130178 10483 26482 183587
16164A83587M85712H1386R493L11193j58501p3076J80664I5945J884K72314A06091
$$ 183587 669299 81386 90879 402072 243571 170495 351159 95945 97829 370143 106091
16152B15047K28364a65872C22692a73914B37768p520J95187F8004Q0867K36591
$$ 215047 443411 -165872 322692 -173914 237768 230248 425435 68004 148871 385462
16142C85462j72877J07500a30723B41201n1798m3610a5776F9657J3883i5301A06902
$$ 385462 212585 320085 -130723 241201 189403 145793 -15776 69657 83540 -95301 106902
16130B39806J22733A28152P4698J19015C8062N375M56707k05082J4491A54581
$$ 239806 362539 128152 202850 321865 38062 43437 500144 295062 309553 154581
16119a34481C97975j83181D3685K67038m2812a79826B24970q8615J15051C0443
$$ -134481 397975 214794 43685 310723 267911 -179826 224970 136355 251406 30443
16108A13581j8944J74055a94796A35055E5759a8367k02036f9102A18113m5520
$$ 113581 94637 268692 -194796 135055 55759 -18367 -220403 -69102 118113 72593
16098G2593J61136b6036E7537h2504k21165A64090G0528C0193b5515A02713D5820
$$ 72593 233729 -26036 57537 -82504 -303669 164090 70528 30193 -25515 102713 45820
16086A38710a3442k66317g357k5555k2121F7615J32860B7570J09602J24107A02309
$$ 138710 -13442 -279759 -7357 -32912 -55033 67615 200475 27570 137172 261279 102309
16074G2158J51432A02276M1130o8400K6575m5405J10644J838F1925a65809J8900
$$ 72158 223590 102276 143406 75006 101581 56176 166820 168658 61925 -165809 -146909
16063a46909B9289a38566C09367a25717o2895G54e4486H6045g1588A85725e5976
$$ -146909 29289 -138566 309367 -125717 -188612 754 -54486 86045 -71588 185725 -55976
16051c63567D49176G3072a08027p1924B30942F2373B8230A1577J48691C4582J96023
$$ -363567 449176 73072 -108027 -179951 230942 62373 28230 11577 160268 34582 230605
16040B30605i6345C2566K54686I7941g3350B0440J03956i8097A47851B5085J63696
$$ 230605 -96345 32566 287252 97941 -73350 20440 124396 -98097 147851 25085 188781
16029A88781a13515B6010J10472c1903C74076B1806c47517B43675E1404a61626
$$ 188781 -113515 26010 136482 -31903 374076 21806 -347517 243675 51404 -161626
16018A02046K06395l1399d7697k47722B3381a38205I5102J65517a86310e4107
$$ 102046 308441 277042 -47697 -295419 23381 -138205 95102 260619 -186310 -54107
16007B57402a65317k5480H0196K5846c3814C8704L5313K71418a32330A49026C112
$$ 257402 -165317 -190797 80196 106042 -33814 38704 74017 345435 -132330 149026 3112
15995A16146a6939H101a21782E8934c82573C52590A68923F6266b39330A5181K42950
$$ 116146 -16939 8101 -121782 58934 -382573 352590 168923 66266 -239330 15181 258131
15984B58131F5908b14014i6357A45586d678C08673J49370i0851C65958A01656
$$ 258131 65908 -214014 -96357 145586 -4678 308673 458043 -90851 365958 101656
15973b2788D32394L73225j02734J0790J70613j40813j60053r2977A31049K8050
$$ -22788 432394 805619 702885 713675 884288 743475 583422 490445 131049 159099
15963A59099C3842J30660b04656g3139B19088k7850q164a53648F721a66813N3957
$$ 159099 33842 164502 -204656 -73139 219088 191238 183074 -153648 6721 -166813 -112856
15952a12856a7781b630B612J36205l259i1749k7641j23438H9034C6020J08868
$$ -112856 -17781 -2630 2612 138817 135558 -91749 -119390 -242828 89034 36020 144888
15941A44888L7294D4871a9192l8054B24243a03752D8078a47619j77598I840a40790
$$ 144888 182182 44871 -19192 -57246 224243 -103752 48078 -147619 -325217 9840 -140790
15929e706j18990e6523A78383b7384C0054J00606B5748g0547A37113g6777b578
$$ -5706 -124696 -56523 178383 -27384 30054 130660 25748 -70547 137113 -76777 -2578
15917a36535B46522a6050F627b2524k62025K8043A01532k1578A1763L48107A24968
$$ -136535 246522 -16050 6627 -22524 -284549 -256506 101532 79954 11763 359870 124968
15905f1406A81631D2546r925g8473k22294b3848q446A1599N5734L14396A10386
$$ -61406 181631 42546 32621 -78473 -300767 -23848 -32294 11599 67333 381729 110386
15893b64369B362c11881A0092b96302e1792p0782A52282a24082l6884L7234B04374
$$ -264369 2362 -311881 10092 -296302 -51792 -122574 152282 -124082 -160966 -123732 204374
15881g307D9800L02264a74706g9812A0835b50289B30159b55481G3913E592a6769
$$ -7307 49800 352064 -174706 -79812 10835 -250289 230159 -255481 73913 5592 -16769
15869A69165J85523A9379b31222c2423k40161A45314J82833a85864D1463a9018
$$ 169165 354688 19379 -231222 -32423 -272584 145314 328147 -185864 41463 -19018
15858a83716N2667J027k54328C5428a66591h2701j33071G4123a17595k9937r6395
$$ -183716 -131049 -130022 -384350 35428 -166591 -82701 -215772 74123 -117595 -147532 -243927
15847b43927A41794e7827A5452O8379C9576h5023b3992j05047I3503b26910C2536
$$ -243927 141794 -57827 15452 83831 39576 -85023 -23992 -129039 93503 -226910 32536
15835a78342I0044c7364G999M2148a85566O5238n1574A37776L7951h6309c5054
$$ -178342 90044 -37364 7999 50147 -185566 -120328 -171902 137776 175727 -86309 -35054
15823F0011J20196D0215L38823a05105k2948a9396l96441A96521C7257L6432b86835
$$ 60011 180207 40215 379038 -105105 -128053 -19396 -415837 196521 37257 73689 -286835
15811a01539n598k3249B8890d1306H3213k8681c15517D4176a65046k930a1052
$$ -101539 -107137 -130386 28890 -41306 83213 54532 -315517 44176 -165046 -167976 -11052
15799A35398b6573j21286A63587E7780b88022A21167j7126l336c49278b9791D836
$$ 135398 -26573 -147859 163587 57780 -288022 121167 104041 100705 -349278 -29791 4836
15787e7782B10479c6291n8348n6862C3020Q8544b07057I2642a35511a9348B70259
$$ -57782 210479 -36291 -94639 -151501 33020 121564 -207057 92642 -135511 -19348 270259
15775e6921A07300e5019A05118c79341a84510L7623B09959a32918c8816F3961
$$ -56921 107300 -55019 105118 -379341 -184510 -146887 209959 -132918 -38816 63961
15764d76033G2051C3324J18673C6418b84468k9010H1837i4805k1263a0016C9401
$$ -476033 72051 33324 151997 36418 -284468 -313478 81837 -94805 -116068 -10016 39401
15752i012B08009P2435a58765j65645f9243p0166A08588b94119a3190m32C69414
$$ -9012 208009 280444 -158765 -324410 -69243 -139409 108588 -294119 -13190 -13622 369414
15740a59608m9574P3949D97842d3656j20653m8105a8577K629A14645C9469a55881
$$ -159608 -209182 -135233 497842 -43656 -164309 -212414 -18577 -15948 114645 39469 -155881
15728G5881a0378A96547Q0090e9727F8716l2612e0115j38799h6399I4224c22449
$$ 75881 -10378 196547 276637 -59727 68716 36104 -50115 -188914 -86399 94224 -322449
15716B30026a53003L5107A55984C0641Q3280l1801Q9493e4114j59700l1467a00370
$$ 230026 -153003 -117896 155984 30641 113921 82120 171613 -54114 -213814 -245281 -100370
15704a08908j58595F9262A143J52995a85096r5306a27104A19154e4024C0262J50848
$$ -108908 -267503 69262 1143 154138 -185096 -280402 -127104 119154 -54024 30262 181110
15693A81110c05701R0331N6808j63799j02990e89I957J12841Q9504e6395E9653
$$ 181110 -305701 -215370 -158562 -322361 -425351 -589 9957 122798 212302 -56395 59653
15681a92703k01167f5191k06764a24046E1783b17233A01542C7090a19392c3452
$$ -192703 -393870 -65191 -271955 -124046 51783 -217233 101542 37090 -119392 -33452
15670A58200a77639l2406a9785I5781m4748b09807c9829C73084a64874b0533n957
$$ 158200 -177639 -210045 -19785 95781 51033 -209807 -39829 373084 -164874 -20533 -26490
15659b6490k86240k2979l801A17277L2311a09554A81363e8280j7888C7078R3815
$$ -26490 -312730 -335709 -339510 117277 149588 -109554 181363 -58280 -76168 37078 130893
15648A30893i9670m8878l4455k9474A90292b88224D11958a12940a8370k17416
$$ 130893 -99670 -148548 -183003 -212477 190292 -288224 411958 -112940 -18370 -235786
15638b35786m0267d4914j04432a9528j6157D9065L8322c4859k37305P7553A20766
$$ -235786 -276053 -44914 -149346 -19528 -35685 49065 87387 -34859 -272164 -194611 120766
15626h6168A55657K11889f10A04516M9166A3022g9383B5329i3631j11892B9535
$$ -86168 155657 367546 -610 104516 153682 13022 -79383 25329 -93631 -205523 29535
15614b47434B51134b28139E9602b06297H6005a04014j6813a5764k1880H0546i42
$$ -247434 251134 -228139 59602 -206297 86005 -104014 -120827 -15764 -37644 80546 -942
15602d6373A48593B8861b40184A03167b75791J01914A87006a80722H8426f7995
$$ -46373 148593 28861 -240184 103167 -275791 -173877 187006 -180722 88426 -67995
15591a9336j16786j30921E7780K00132d49281a90201B92531n7709j4395d8030
$$ -19336 -136122 -267043 57780 257912 -449281 -190201 292531 234822 220427 -48030
15580B4733J08390F0107j2308b11906F5955A3152a28570n7458A63019K69467a3223
$$ 24733 133123 60107 47799 -211906 65955 13152 -128570 -186028 163019 432486 -13223
15568f3273B01040a43885q9191C1520a48142B1295K1412J9584L07516A08672a96664
$$ -63273 201040 -143885 -233076 31520 -148142 21295 42707 62291 369807 108672 -196664
15556A55808a40540m358b5992A8481h7824B9583h6121j6727k39408c2961j003
$$ 155808 -140540 -144898 -25992 18481 -87824 29583 -86121 -102848 -342256 -32961 -33964
15545c3964E6686O0532k1353a68416A31751c9811j99789A43296a18565a6232j68064
$$ -33964 56686 117218 95865 -168416 131751 -39811 -239600 143296 -118565 -16232 -184296
15534a84296o334A50853D7807M1952j3018B3994d9953A78150l1920a85685m212
$$ -184296 -190630 150853 47807 89759 76741 23994 -49953 178150 146230 -185685 -189897
15523a89897A88412o868d72302a08363A74318B6696b03593A77465a56100e0011
$$ -189897 188412 181544 -472302 -108363 174318 26696 -203593 177465 -156100 -50011
15512D02875A18451A7662l284c9788A45629C3501a31027B24304e6587b0863G166
$$ 402875 118451 17662 14378 -39788 145629 33501 -131027 224304 -56587 -20863 7166
15500G6227i306j83466D34810f9208A8378M1932J58320J5263J8037I3195h1272
$$ 76227 -9306 -192772 434810 -69208 18378 60310 218630 233893 251930 93195 -81272
15488E7417K39045j38089k1403L9504Q5920p4984M3093L6384C1474J77548a45619
$$ 57417 296462 158373 136970 176474 262394 187410 230503 266887 31474 209022 -145619
15476H5780j0880J3528K7244e9582B82689G2986L69211j03091a2197D7334b27405
$$ 85780 74900 88428 115672 -59582 282689 72986 442197 339106 -12197 47334 -227405
15464A37927m1179L59014f5840B64616p0770M042J39273K84726B31392K13808
$$ 137927 96748 455762 -65840 264616 193846 197888 337161 621887 231392 445200
15454D45200k05797J09823b15673c8929A98566G7648J93552b18113e9991B343
$$ 445200 239403 349226 -215673 -38929 198566 77648 271200 -218113 -59991 2343
15443H8287h8944A32618d2140l09514A77562g9105B26008b41862f5461r3273G2638
$$ 88287 -88944 132618 -42140 -351654 177562 -79105 226008 -241862 -65461 -158734 72638
15431B42054B4313J91419m509n8788K80951K10999L77543C97584R7288B00920
$$ 242054 24313 215732 211223 152435 433386 644385 1021928 397584 494872 200920
15420C75239j25704a70617F5023a87941I0328a24709A02000d7549A69950i1268
$$ 375239 249535 -170617 65023 -187941 90328 -124709 102000 -47549 169950 -91268
15409A75289b28842j50315B16831E2954A2972M5343J109f414j4765j29524I4065
$$ 175289 -228842 -379157 216831 52954 12972 58315 59424 -6414 -21179 -150703 94065
15397B34294d95806I752K0174L5212A0278d800A46034j2046j0268J29340i6249
$$ 234294 -495806 9752 29926 65138 10278 -4800 146034 133988 123720 253060 -96249
15385C6632K70456a01741g442A5731g6045A99465a75244c9155G7333J03865A4631
$$ 36632 307088 -101741 -7442 15731 -76045 199465 -175244 -39155 77333 181198 14631
15373G8221Q1320L9567K8705b4681j0340A80962N684P9091f1923B5083J26863
$$ 78221 159541 199108 227813 -24681 -35021 180962 186646 265737 -61923 25083 151946
15362A51946h3563C76944D4642K38969G5700N03970B56227f7997A27858h4176
$$ 151946 -83563 376944 44642 283611 75700 579670 256227 -67997 127858 -84176
15351B16859D8650J8633A4928b9679F4144J00921B746i1327C56557A34844e5542
$$ 216859 48650 67283 14928 -29679 64144 165065 2746 -91327 356557 134844 -55542
15339B64969j01717M5444F7010J1426b0227B08188b14004B77331I1450d2613A87084
$$ 264969 163252 208696 67010 78436 -20227 208188 -214004 277331 91450 -42613 187084
15327G3329M00002A26965m4442O6246d156A32859l9085c0553A75083L31423b16907
$$ 73329 473331 126965 82523 148769 -4156 132859 93774 -30553 175083 506506 -216907
15315A48818F3604J56795F3093N001c3136A1327K79664H4679R7923b61218a9816
$$ 148818 63604 220399 63093 68094 -33136 11327 290991 84679 182602 -261218 -19816
15303A748b40066b7994j65089D05563A23040d1309j79813A23409K11470j34455
$$ 1748 -240066 -27994 -193083 405563 123040 -41309 -221122 123409 334879 200424
15293B00424l502q8890D8675M1644P718c8560o940j3307C06887a1120j49021O7622
$$ 200424 196922 108032 48675 90319 98037 -38560 -45500 -58807 306887 -11120 -160141 -92519
15281i2519D56885G6046J07811b21614C60957d6692F4689J63633l1404K20746
$$ -92519 456885 76046 183857 -221614 360957 -46692 64689 228322 196918 417664
15271D17664E1823b25715A6220J61091A5203R5694A7157K57366E4797K2920b18235
$$ 417664 51823 -225715 16220 177311 15203 110897 17157 274523 54797 77717 -218235
15259b30219d5059J8269B53944c782A15760b89820A1744K89945h9536B28060a88714
$$ -230219 -45059 -26790 253944 -3782 115760 -289820 11744 301689 -89536 228060 -188714
15247A033a06574L4566A18649b78740B31957P9874c9025A06312i5132D04409d5812
$$ 1033 -106574 -72008 118649 -278740 231957 311831 -39025 106312 -95132 404409 -45812
15235A29398Q0868c17408B72805k1620M81196J10106K71426J84119J33044n03655
$$ 129398 210266 -317408 272805 251185 732381 842487 1113913 1298032 1431076 927421
15225I27421p4446A47885J6195l3076d2248A60328a10133n9575A52058o7937a70483
$$ 927421 852975 147885 164080 131004 -42248 160328 -110133 -169708 152058 84121 -170483
15213C37676H8618a87091N8662B38596f2510D0856J76327L44306A60636c05318
$$ 337676 88618 -187091 -128429 238596 -62510 40856 217183 561489 160636 -305318
15202a84262C9451n703e0075B41923a06236C16083F3406J48446a50004p5413E70763
$$ -184262 39451 33748 -50075 241923 -106236 316083 63406 211852 -150004 -225417 570763
15190A26086a0798A90126r4286a00796C3492R3054J22289B3415a7263D4090h7746
$$ 126086 -10798 190126 95840 -100796 33492 126546 248835 23415 -17263 44090 -87746
15178b369A22722J09026k3609r5585a35083F5869J93940c3453B39948a47163d8379
$$ -2369 122722 231748 208139 112554 -135083 65869 259809 -33453 239948 -147163 -48379
15166f9484C53703o7228E1330A1707M30892b04j20227D4464J17894k7048G101
$$ -69484 353703 286475 51330 11707 442599 -204 -120431 44464 162358 135310 7101
15154B07787a10899A81070a4174A89942g0149a582k9610C073b14191j81606C84306
$$ 207787 -110899 181070 -14174 189942 -70149 -1582 -31192 3073 -214191 -395797 384306
15142a2784A57279a8324A82472a0987C10740l6764a1428r6425n8629d2132H8114
$$ -12784 157279 -18324 182472 -10987 310740 273976 -11428 -107853 -166482 -42132 88114
15130a2631D33830A2987J6835b69125g5260l2261E2643c97153A32944B7817J72493
$$ -12631 433830 12987 29822 -269125 -75260 -107521 52643 -397153 132944 27817 200310
15119B00310m2195J8869E168Q451J17830J07272H4735M8945K3515J36784b66593
$$ 200310 158115 176984 5168 13619 131449 238721 84735 133680 157195 293979 -266593
15107C23064e695j42617A67443L9390O9561f0190E1329L17112b9348A36796K87961
$$ 323064 -5695 -148312 167443 206833 276394 -60190 51329 368441 -29348 136796 424757
15096D24757A80150D0240c8717n2938d714B17635j06108a3853A87105i4334j91069
$$ 424757 180150 40240 -38717 -91655 -4714 217635 111527 -13853 187105 -94334 -285403
15085b85403A6048e7992B55253A24881R1069l6112K20977j51507I0680P9969c9188
$$ -285403 16048 -57992 255253 124881 215950 179838 400815 249308 90680 170649 -39188
15073C3829L2479L45131p3769b80206B04259k0244K8639a27576A49419i8587c0742
$$ 33829 66308 411439 337670 -280206 204259 184015 212654 -127576 149419 -98587 -30742
15061A34665d6788A75800J47362b12278D0308K14414C9754J03901a00109A40729
$$ 134665 -46788 175800 323162 -212278 40308 254722 39754 143655 -100109 140729
15050B5576K30026O4282A7394O1248K47836k3856J8462p9494J7353J72143O6191
$$ 25576 255602 319884 17394 78642 326478 302622 321084 241590 258943 431086 497277
15039D97277O635b0647E7097J17148M2176j01106a24113D44216J36717A54637
$$ 497277 503912 -20647 57097 174245 216421 115315 -124113 444216 580933 154637
15028A80785P6707o4498k9090M9756M2799D2299M65221j73792p3094k6707k2185
$$ 180785 257492 192994 163904 213660 256459 42299 507520 333728 260634 233927 211742
15017B11742p2476M35237L5202K17466k48993B48019M52149k08209m2983R0677
$$ 211742 139266 574503 609705 827171 578178 248019 700168 491959 448976 539653
15007E39653L0521j22029j46483N6705n6659A50403J80858J94038k36176M01578
$$ 539653 570174 448145 301662 358367 301708 150403 331261 525299 289123 690701
14997F90701C30882P1349n0324M5833j4445o5104j04203M59145B93981R7657K38366
$$ 690701 330882 402231 351907 397740 383295 318191 213988 673133 293981 391638 630004
14986F30004F4328J79890H5268O9100N6582K92698k10734M84865B49991J7902
$$ 630004 64328 244218 85268 154368 210950 503648 292914 777779 249991 267893
14976B67893h2679B64174K30316l4322j68008J90466O7593k32146K70417k41218
$$ 267893 -82679 264174 494490 460168 292160 482626 550219 318073 588490 347272
14966C47272N55918m34404K47143L1397m6317k9738K1821j01710m8903q2476L1522
$$ 347272 903190 468786 715929 747326 701009 671271 693092 591382 542479 460003 491525
14955D91525K3134k41995J24684J67590k81564K44442B28011L05179k17767L81846
$$ 491525 514659 272664 397348 564938 283374 527816 228011 533190 315423 697269
14945F97269B11087F9391M1186K11250C642K77775A28718J26486k2838M9799L6161
$$ 697269 211087 69391 110577 321827 3642 281417 128718 255204 232366 282165 318326
14934C18326R8626Q579J27281B75240l8423K48320A81617Q45661l66609k8046
$$ 318326 416952 425531 552812 275240 236817 485137 181617 1027278 660669 632623
14924F32623o0039j56353j549B7981M27821A34470M0043L74017j69913N38825
$$ 632623 572584 416231 414682 27981 455802 134470 174513 548530 378617 917442
14914I17442j6009j39354J96505L9193M18429j82534J41625r6387m01787R322
$$ 917442 901433 762079 958584 997777 1416206 1233672 1375297 1278910 877123 886445
14904H86445L90065P1486p1656M50236j81017k24771Q5254k748j83189k26633
$$ 886445 1276510 1347996 1276340 1726576 1545559 1320788 1406042 1403294 1220105 993472
14894I93472j65745C68729L78258j02521k35586J57773A32575J16598J16864R462
$$ 993472 827727 368729 746987 644466 408880 566653 132575 249173 366037 375499
14884C75499j49129K43159R303P9641L5693B22603K72044j42273j7665A48750
$$ 375499 226370 469529 478832 558473 594166 222603 494647 352374 334709 148750
14873D86135j13656A79543L11412M7165j84292K65533o0748J27303o6704J52142
$$ 486135 372479 179543 490955 538120 353828 619361 558613 685916 619212 771354
14863G71354l73966L39552M9726k64055L1362l4193j34464R5170O8820J3517k65082
$$ 771354 397388 736940 786666 522611 553973 519780 385316 480486 549306 562823 297741
14852B97741J86850p0176K45315L4416L07981D38299L49263C26732K49545r8891
$$ 297741 484591 414415 659730 694146 1002127 438299 787562 326732 576277 477386
14842D77386k19255M51410a0136A46271K35508e5956G13723B19395R0245R3503
$$ 477386 258131 709541 -10136 146271 381779 -55956 713723 219395 309640 403143
14832D03143J81516A32450N58485j83890J74360Q9356l9963K23427J13562j32003
$$ 403143 584659 132450 690935 507045 681405 770761 730798 954225 1067787 935784
14822I35784Q8847l94598j3678J02315j92875M9757j72369j96476L30935j12759
$$ 935784 1024631 630033 616355 718670 525795 575552 403183 206707 537642 424883
14812D24883o2494K09358j52683K99437j81546J02106O8223C05575N3085K11143
$$ 424883 362389 571747 419064 718501 536955 639061 707284 305575 358660 569803
14802E69803m549K31561k28205K58523j34318k4373R7626k93483K41309k7869
$$ 569803 565254 796815 568610 827133 692815 668442 766068 472585 713894 686025
14792F86025j20529O294L2414N0177K19620j31364k1462l16054K82797L48768
$$ 686025 565496 571790 604204 654381 874001 742637 721175 405121 687918 1036686
14782A036686j46939r4550B33540L63723k68645Q2384K30807k67033J72062J48430
$$ 1036686 889747 795197 233540 597263 328618 411002 641809 374776 546838 695268
14772F95268m9077k50242J95490j40715j5728M4585j88990L71438j48497J5355
$$ 695268 646191 395949 591439 450724 434996 479581 290591 662029 513532 528887
14762E28887O1687k41602K03720L55731C77750J66676K81275k61407M9056R9260
$$ 528887 590574 348972 552692 908423 377750 544426 825701 564294 613350 712610
14752G12610j85406j5019K10064m1332k19633p782N8370L73598k09429p5534L60076
$$ 712610 527204 512185 722249 680917 461284 453502 511872 885470 676041 600507 960583
14741I60583D49469o3844J84554K44773C11612J45956K35605J93713q5671p9575
$$ 960583 449469 385625 570179 814952 311612 457568 693173 886886 801215 721640
14731G21640j24691j828J54003n6152l05963M47613l43294J4623j76863K52290
$$ 721640 596949 595121 749124 692972 387009 834622 491328 505951 329088 581378
14721E81378B78865K72120J41626o3364Q1356C19701Q08784k68474J60603m0288
$$ 581378 278865 550985 692611 629247 710603 319701 1128485 860011 1020614 980326
14711I80326J13446j0319L07270k7514j03153K17282m20495q5338k31928N81546
$$ 980326 1093772 1083453 1390723 1363209 1260056 1477338 1056843 971505 739577 1321123
14701A321123r7289n25343n7696J61490N8438j90270Q846L26410r0981j8078j28346
$$ 1321123 1223834 698491 640795 802285 860723 670453 679299 1005709 914728 896650 768304
14690G68304M26176j77518j2061K22275m9501k31848L15025j01388L16654J24056
$$ 768304 1194480 1016962 1004901 1227176 1177675 945827 1260852 1159464 1476118 1600174
14680A600174m92919j91673J63934j93632K44035k75581j31718m3132J31301j28252
$$ 1600174 1107255 915582 1079516 885884 1129919 854338 722620 679488 810789 682537
14670F82537K01282j80170p1350P7632n888R073R819r811P4086p8796K01250k42091
$$ 682537 883819 703649 632299 709931 704043 713116 722935 713124 787210 708414 909664 667573
14658F67573K83817k71132K38402k68160J21858L47181k54672J29874j61323N4446
$$ 667573 951390 680258 918660 650500 772358 1119539 864867 994741 833418 887864
14648H87864k03537J68622o2396L9885K8660l08245O32101m31221k76868N74378
$$ 887864 684327 852949 790553 830438 859098 550853 1182954 751733 474865 1049243
14638A049243K55210k99188r1142r9582L28482J3169n6198l73023J07524K31228
$$ 1049243 1304453 1005265 914123 814541 1143023 1156192 1099994 726971 834495 1065723
14628A065723J12914k02410K3284R1623l38665N01564l2916m64556K8649L98174
$$ 1065723 1178637 976227 999511 1091134 752469 1254033 1221117 756561 785210 1183384
14618A183384j04948p8125R5824n4553L34495j69574m2803J73622k47225l05Q6031
$$ 1183384 1078436 1000311 1096135 1041582 1376077 1206503 1163700 1337322 1090097 1089792 1175823
14607A175823m5059K11991l48943L06713j88612n1639M65561k72012j32205R9890
$$ 1175823 1130764 1342755 993812 1300525 1111913 1060274 1525835 1253823 1121618 1221508
14597A221508J82652j72061K6978j79754N67074n41914M9638K08917j85070K78753
$$ 1221508 1404160 1232099 1259077 1079323 1646397 1104483 1154121 1363038 1177968 1456721
14587A456721o1957l09486K70451M09258j74441l09829J57270N9256k50722o5205
$$ 1456721 1394764 1085278 1355729 1764987 1590546 1280717 1437987 1497243 1246521 1181316
14577A181316K77371j36131n0751p3638J99378J5650o1766L61715k30096Q8501
$$ 1181316 1458687 1322556 1271805 1198167 1397545 1413195 1351429 1713144 1483048 1571549
14567A571549j7905p980L12932o07955J29890O30096J41731k69900r1627j47571
$$ 1571549 1553644 1545664 1858596 1250641 1380531 2010627 2152358 1882458 1790831 1643260
14557A643260M43568l60780L85032j89823O8591q5658M2749K46234k83781J88267
$$ 1643260 2086828 1726048 2111080 1921257 1989848 1904190 1946939 2193173 1909392 2097659
14547B097659M66533k57698p6133J86882M26948o7076L63029Q4039P10519K58690
$$ 2097659 2564192 2306494 2230361 2417243 2844191 2777115 3140144 3224183 3934702 4193392
14537D193392J13113J011612J246340K460012L569489P543283P158895j721870
$$ 4193392 4306505 5318117 6564457 9024469 12593958 20137241 27296136 25574266
14529B5574266p798052n798963m356204k273033k74395q64964q45606o51718l20525
$$ 25574266 17776214 11977251 7621047 5348014 5073619 4208655 3363049 2711331 2390806
14520B390806k85377J48711m22427K86679N7642m15609K08973K14583O3108k64891
$$ 2390806 2105429 2254140 1831713 2118392 2176034 1760425 1969398 2183981 2247089 1982198
14510A982198k98637Q09495j79547m18556K42311k77179q7798N91351l32996J81347
$$ 1982198 1683561 2493056 2313509 1894953 2137264 1860085 1772287 2363638 2030642 2211989
14500B211989O2996k32758N8042P955M67307J5054p0579j94770M71043m50152
$$ 2211989 2274985 2042227 2100269 2108224 2575531 2590585 2520006 2325236 2796279 2346127
14490B346127O4734L22192o1112j69967J53543J2993l04216M62256j47485K76370
$$ 2346127 2410861 2733053 2671941 2501974 2655517 2668510 2364294 2826550 2679065 2955435
14480B955435q4091k04021L17910J11530l03046J32609J91644j53216L33816J25863
$$ 2955435 2871344 2667323 2985233 3096763 2793717 2926326 3117970 2964754 3298570 3424433
14470C424433k90901J43768j76923K532J06409L94950j53569L0564j25896L35345
$$ 3424433 3133532 3277300 3100377 3102909 3209318 3604268 3450699 3481263 3355367 3690712
14460C690712L21638n46127Q6395J84348L9434l950k1313q0635J27340k4895k71067
$$ 3690712 4012350 3466223 3552618 3736966 3776400 3772450 3751137 3670502 3797842 3772947 3501880
14449C501880M43151J96622l5504J47996j93776L65905k03166L4490K32225J2936
$$ 3501880 3945031 4141653 4106149 4254145 4060369 4426274 4223108 4257598 4489823 4502759
14439D502759K00478l35026J07520Q8665o1006L21866L74326l67169K20308k30038
$$ 4502759 4703237 4368211 4475731 4564396 4503390 4825256 5199582 4832413 5052721 4822683
14429D822683K24945K74793m15829K49555L53949j19224j42905Q41084m72115
$$ 4822683 5047628 5322421 4906592 5156147 5510096 5390872 5247967 6089051 5616936
14420E616936k09370N03283J28119l10J34715l10075L10773L05958k97534M2203
$$ 5616936 5407566 5910849 6038968 6038658 6173373 5863298 6174071 6480029 6182495 6224698
14410F224698P9070L20938M7572L5111L55489J18988O5100L38995r2726M16316
$$ 6224698 6303768 6624706 6672278 6707389 7062878 7181866 7246966 7585961 7493235 7909551
14400G909551k39642K01926l01357K86148L6066K89068j56623K10344j3694K31057
$$ 7909551 7669909 7871835 7570478 7856626 7892692 8181760 8025137 8235481 8221787 8452844
14390H452844N04547j41057K64310N67253k64147J94719J70549l9339J6392J42688
$$ 8452844 8957391 8816334 9080644 9647897 9383750 9578469 9749018 9709679 9726071 9868759
14380I868759N65355n8753q3857L52202K03473Q8344M61168k41674K76655L85075
$$ 9868759 10434114 10375361 10291504 10643706 10847179 10935523 11396691 11155017 11431672 11816747
14370A1816747J10994K99851J89198M72423L07897l7969M24748J85174M97593
$$ 11816747 11927741 12227592 12416790 12889213 13197110 13159141 13583889 13769063 14266656
14361A4266656k8740M52812R7672K67461L93373K42506P38695k9777L00434L20624
$$ 14266656 14237916 14690728 14788400 15055861 15449234 15691740 16430435 16400658 16701092 17021716
14351A7021716O60057p1291O19922M03309M09156N43022P2985M53820O70731j68831
$$ 17021716 17681773 17610482 18230404 18633713 19042869 19585891 19658876 20112696 20783427 20614596
14341B0614596Q50493O95248J97519L86462J016831M25162K75608Q90791O99292
$$ 20614596 21465089 22160337 22357856 22744318 23761149 24186311 24461919 25352710 26052002
14332B6052002O21658N02499P07082P57530O92126R56763P47164Q43155J233416
$$ 26052002 26673660 27176159 27883241 28640771 29332897 30289660 31036824 31879979 33113395
14323C3113395Q78089P64208Q89279J410643Q08752J657082N36917J676670R49940
$$ 33113395 33991484 34755692 35644971 37055614 37864366 39521448 40058365 41735035 42684975
14314D2684975J738980J280405J457414J702176J608387J712035J891232K132857
$$ 42684975 44423955 45704360 47161774 48863950 50472337 52184372 54075604 56208461
14306E6208461J952561K293302K095942K365610K715398K292913K683370K882181
$$ 56208461 58161022 60454324 62550266 64915876 67631274 69924187 72607557 75489738
14298G5489738K886887L372825L251658L737387L832476M144608M303921M781483
$$ 75489738 78376625 81749450 85001108 88738495 92570971 96715579 101019500 105800983
14290A05800983M585373N329555N435216O031269O016185O706861O959654P610610
$$ 105800983 110386356 115715911 121151127 127182396 133198581 139905442 146865096 154475706
14282A54475706Q023908Q908164Q894299J0481906J0391849J1075733J2256552
$$ 154475706 162499614 171407778 180302077 190783983 201175832 212251565 224508117
14275B24508117J2999202J3767324J4210232J4601773J4555718J4774963J4670153
$$ 224508117 237507319 251274643 265484875 280086648 294642366 309417329 324087482
14268C24087482J4568435J4463212J4093461J4134465J3525572J3041106J2887000
$$ 324087482 338655917 353119129 367212590 381347055 394872627 407913733 420800733
14261D20800733J1687402J1410770R810900M777413K240809J379115m120525m093636
$$ 420800733 432488135 443898905 453709805 458487218 460728027 462107142 457986617 453892981
14253D53892981o596469l466617k217905p428440j2192123j4713677j5195979
$$ 453892981 447296512 443829895 441611990 434183550 421991427 407277750 392081771
14246C92081771j6184653j6130019j6721029j6563471j6240379j6122136j4564218
$$ 392081771 375897118 359767099 343046070 326482599 310242220 294120084 279555866
14239B79555866j4221321j3774444j2765679j2057034j1092161j0593253j0473625
$$ 279555866 265334545 251560101 238794422 226737388 215645227 205051974 194578349
14232A94578349r323001r586400q783023p666339q399199o965223p008542o862382
$$ 194578349 185255348 175668948 166885925 159219586 150820387 143855164 136846622 129984240
14224A29984240n803390n636141n490373m973178m804736m606648m130807l911415
$$ 129984240 124180850 118544709 113054336 108081158 103276422 98669774 94538967 90627552
14216I0627552l598650l382605l635872l297032k908515k947115k261691k805163
$$ 90627552 87028902 83646297 80010425 76713393 73804878 70857763 68596072 65790909
14208F5790909k669742k148609k244077j819145k121627j554230k292831j624834
$$ 65790909 63121167 60972558 58728481 56909336 54787709 53233479 50940648 49315814
14200D9315814j286705j606529j371419j200245j379168j428982j263602r91889
$$ 49315814 48029109 46422580 45051161 43850916 42471748 41042766 39779164 38787275
14192C8787275j026145j065396j139225j435290q74304p30125j086428l38570
$$ 38787275 37761130 36695734 35556509 34121219 33246915 32516790 31430362 31091792
14184C1091792j101981o62644o77782j171566q12236o67628m98974o95743l40532
$$ 31091792 29989811 29327167 28649385 27477819 26665583 25997955 25498981 24803238 24462706
14175B4462706q76696n96298m70088l77136n28403l06284p35895m74287l82835
$$ 24462706 23586010 22989712 22519624 22142488 21614085 21307801 20571906 20097619 19714784
14166A9714784n15200l74538n36391l36056l81098m12946l48418m54609Q2732
$$ 19714784 19199584 18825046 18288655 17952599 17571501 17158555 16810137 16355528 16438260
14157A6438260r32814J05393n58443n31630K18109k43330m94126R335p84299L70447
$$ 16438260 15505446 15610839 15052396 14520766 14738875 14495545 14001419 14010754 13226455 13596902
14147A3596902k98664n63638K2786l88282K0839J0411q60372J72290l85455m10636
$$ 13596902 13298238 12734600 12757386 12369104 12389943 12400354 11539982 11712272 11326817 10916181
14137A0916181K89492l13635n37859K48608m08076L91773m41225m9880k91435
$$ 10916181 11205673 10892038 10354179 10602787 10194711 10586484 10145259 10095379 9803944
14128I803944j67454k2770l61716R0965n49538J14280k57667j828m3908j62889
$$ 9803944 9636490 9613720 9252004 9342969 8793431 8907711 8650044 8648216 8604308 8441419
14118H441419j46243k60085J69164k26930k08914k21132R3600k10793J34519k68195
$$ 8441419 8295176 8035091 8204255 7977325 7768411 7547279 7640879 7430086 7564605 7296410
14108G296410L548m99251O8153J44140p3929l24607j18762N7613l02815J38241
$$ 7296410 7299958 6800707 6868860 7013000 6939071 6614464 6495702 6553315 6250500 6388741
14098F388741M2917o94372L06297o648j61818J06286l31072J06110j38412K83553
$$ 6388741 6431658 5737286 6043583 6036935 5875117 5981403 5650331 5756441 5618029 5901582
14088E901582m34730r0654j54364M05227n20814M7436K40352n69964J61260M1710
$$ 5901582 5466852 5376198 5221834 5627061 5106247 5153683 5394035 4824071 4985331 5027041
14078E027041l47337L77486m60797m3507J01046Q9016O0078m45402J16393j82307
$$ 5027041 4679704 5057190 4596393 4552886 4653932 4742948 4803026 4357624 4474017 4291710
14068D291710M4861j76336P745J50116k19306j2333J76229l18568Q8693Q3344
$$ 4291710 4336571 4160235 4167980 4318096 4098790 4086457 4262686 3944118 4032811 4116155
14058D116155m10094N69394n30942L89753L3136k21800m51504K00276j46622O6040
$$ 4116155 3706061 4275455 3744513 4134266 4167402 3945602 3494098 3694374 3547752 3613792
14048C613792K24236k01528K0069K42981l20788o2194q8303k28191K04264j22361
$$ 3613792 3838028 3636500 3656569 3899550 3578762 3516568 3428265 3200074 3404338 3281977
14038C281977O1908m9375K51284l69021M22114m92805j45220K5594J39051l33436
$$ 3281977 3343885 3294510 3545794 3176773 3598887 3106082 2960862 2986456 3125507 2792071
14028B792071J25440n5475l3360k9928J90487r1443N3241J32859j75219k01540
$$ 2792071 2917511 2862036 2828676 2798748 2989235 2897792 2951033 3083892 2908673 2707133
14018B707133K75j2201J0110l25246J59294K28473l08047R9913J18827j511k26811
$$ 2707133 2707408 2695207 2705317 2380071 2539365 2767838 2459791 2559704 2678531 2677020 2450209
14007B450209o7636j52390p8343N4416L26917p2340J15236k61535j39382j3742
$$ 2450209 2382573 2230183 2151840 2206256 2533173 2460833 2576069 2314534 2175152 2161410
13997B161410J10291J7787m3722k63719l0758M70833k22789m36221m7390L48635
$$ 2161410 2271701 2289488 2245766 1982047 1951289 2422122 2199333 1763112 1715722 2064357
13987B064357K51953l63570L14360l07132N3154J28149J40737K77550R3468J12520
$$ 2064357 2316310 1952740 2267100 1959968 2013122 2141271 2282008 2559558 2653026 2765546
13977B765546J74502J38856O60552J844613L006677P079265R192952J466915o117884
$$ 2765546 2940048 3078904 3739456 5584069 8590746 15670011 24862963 26329878 20211994
13968B0211994n139058m649678l374469j800644r11737q40091j72344j67001j20832
$$ 20211994 15072936 10423258 7048789 5248145 4336408 3496317 3323973 3156972 3036140
13959C036140l35679K4865k47144M5959l49450L81696j07834j55826j91480q5560
$$ 3036140 2700461 2725326 2478182 2524141 2174691 2556387 2448553 2292727 2101247 2015687
13949B015687j63769J58624k9744Q8616j77626k0368l387q3252j29495J09033
$$ 2015687 1851918 2010542 1980798 2069414 1891788 1871420 1868033 1784781 1655286 1764319
13939A764319j28087j2148o6931M959L44225j47157j85827J90043k35677N8190
$$ 1764319 1636232 1624084 1557153 1562112 1906337 1759180 1573353 1763396 1527719 1585909
13929A585909N5996n0559j33906J60452M8046k86346L0210J23743j624k17850
$$ 1585909 1641905 1591346 1457440 1617892 1665938 1379592 1409802 1533545 1531921 1314071
13919A314071L0820P9513K09146J1109j19000k05546J45638n5080j06730k06272
$$ 1314071 1344891 1424404 1633550 1644659 1525659 1320113 1465751 1410671 1303941 1097669
13909A097669L85941k21931J21743K48705n96736K31312l3431L1012K89775l41276
$$ 1097669 1483610 1261679 1383422 1632127 1035391 1266703 1233272 1264284 1554059 1212783
13899A212783n0925L49439k31148J21520r0080j72230L22917m5913q6821k87746
$$ 1212783 1161858 1511297 1280149 1401669 1311589 1139359 1462276 1416363 1329542 1041796
13889A041796J79775k32031L06808J67676k41556o537K73846n71634L83737k09086
$$ 1041796 1221571 989540 1296348 1464024 1222468 1215931 1489777 918143 1301880 1092794
13879A092794K27349j46889K20205k06438K0451O4687q9845k27764P6543O3235
$$ 1092794 1320143 1173254 1393459 1187021 1207472 1272159 1182314 954550 1031093 1094328
13869A094328J76379M4933j65268J03110q6421p6862k04901J33811P3611j30181
$$ 1094328 1270707 1315640 1150372 1253482 1167061 1090199 885298 1019109 1092720 962539
13859I62539J01862o5401R0408j3018j63894K10725j95932R3794l24871O3729
$$ 962539 1064401 999000 1089408 1076390 912496 1123221 927289 1021083 696212 759941
13849G59941J90393l2854M56048k03130k17694N9841J11964J12316l56925r3655
$$ 759941 950334 917480 1373528 1170398 952704 1012545 1124509 1236825 879900 786245
13839G86245q8569J26972J29086O4133q1064p6310L1109J88811j50832l9329k10138
$$ 786245 697676 824648 953734 1017867 936803 860493 891602 1080413 929581 890252 680114
13828F80114K56687k88572K93873j45889K70691P8259k42374k26985M80899l02698
$$ 680114 936801 648229 942102 796213 1066904 1145163 902789 675804 1156703 854005
13818H54005K05922l84834J12739j01891O3252K14834l06773N59519m67364q957
$$ 854005 1059927 675093 787832 685941 749193 964027 657254 1216773 749409 740452
13808G40452J89255m10159N7402L14280k62307L55466k61417k06975J08745J06595
$$ 740452 929707 519548 576950 891230 628923 984389 722972 515997 624742 731337
13798G31337L55222j60222p5585j92240J09634K16906r0797l46161M69502k81861
$$ 731337 1086559 926337 850752 658512 768146 985052 894255 548094 1017596 735735
13788G35735k74209K33101m5025M2706o9649K55178r6107r7021o763L49526C34658
$$ 735735 461526 694627 649602 692308 622659 877837 781730 684709 677946 1027472 334658
13776D70539J50350K87440C24522M16297l0843J13751l98418O0340J96700J27073
$$ 470539 620889 908329 324522 740819 709976 823727 425309 485649 682349 809422
13766H09422j68999k16563J82475J12947j99267J09333N4991C05376M23625r5683
$$ 809422 640423 423860 606335 719282 520015 629348 684339 305376 729001 633318
13756F33318k17988j24849M73432k30487J41483q6740j7181r4684L55128k25303
$$ 633318 415330 290481 763913 533426 674909 588169 570988 476304 831432 606129
13746F06129J24007j93295J98322j47924K95771m00108A82565L57654O5834O1923
$$ 606129 730136 536841 735163 587239 883010 482902 182565 540219 606053 667976
13736F67976l31094K35992O254J30754j31651j7422r7893J39171k1180O3951K9762
$$ 667976 336882 572874 579128 709882 578231 560809 462916 602087 580907 644858 674620
13725F74620n6960l8405J62583C47429p3277K36973K26337C42502L2919J04484
$$ 674620 617660 579255 741838 347429 274152 511125 737462 342502 375421 479905
13715D79905j33893L0190J15177J76521r5999p8934n3080J59743j87439p2802
$$ 479905 346012 376202 491379 667900 571901 492967 439887 599630 412191 339389
13705C39389r3022P492M98167k61914j08590J07704Q6626k77203J97626K6171
$$ 339389 246367 253859 752026 490112 381522 489226 575852 298649 496275 522446
13695E22446m9324L8877J4515B39395L05651A87630L96272j35876p0966M72118
$$ 522446 473122 511999 526514 239395 545046 187630 583902 448026 377060 849178
13685H49178k93164R5100k07784J46376J00489r5937n9611j62134A21528N40971
$$ 849178 556014 651114 443330 589706 690195 594258 534647 372513 121528 662499
13675F62499k10536j61391A08415J58713p5758K91425M5839p0100j36729M00508
$$ 662499 451963 290572 108415 267128 191370 482795 528634 458534 321805 722313
13665G22313j77258J66586B21594J35930A68961J76300J99819k0029j11978P617
$$ 722313 545055 711641 221594 357524 168961 345261 545080 525051 413073 420690
13655D20690n7382K57412j94902A22442K71936K02382j01826n752B38310K84303
$$ 420690 363308 620720 425818 122442 394378 596760 494934 489182 238310 522613
13645E22613o1056O484B17888J18058K21720n571j88091j07175J75991j51074
$$ 522613 461557 468041 217888 335946 557666 552095 364004 256829 432820 281746
13635B81746q2109J36759l4075J41825j54901q1464H4566K65618L29555G2400
$$ 281746 199637 336396 302321 444146 289245 207781 84566 350184 679739 72400
13624C32471A57339M18105J30000C12916Q1604Q8455k6706K11084B86010K06947
$$ 332471 157339 575444 705444 312916 394520 482975 456269 667353 286010 492957
13614D92957k33427R096J94716j79700n8249n3177K01051j5576j59155J92112
$$ 492957 259530 268626 463342 283642 225393 172216 373267 357691 198536 390648
13604C90648O0157J1522j80908o880K70404H9872L91384k40214K80535A49762
$$ 390648 450805 462327 281419 274539 544943 89872 481256 241042 521577 149762
13593B87327K98293j69212A96438L0288j09385L28905j61698L42422A51930Q076
$$ 287327 585620 416408 196438 226726 117341 446246 284548 626970 151930 160006
13583A60006J4189R5524K6588M0018K5515K48966B02050J55629j75735J61596
$$ 160006 174195 269719 296307 336325 361840 610806 202050 357679 181944 343540
13573C43540N6155J53586a26626C54978j7147A13581D4642K50692j02201A1948
$$ 343540 399695 553281 -126626 354978 337831 113581 44642 295334 193133 11948
13562C86501Q5439A14741k4597J39947a11554D06452j91604J37867J78592E3179
$$ 386501 471940 114741 90144 230091 -111554 406452 214848 352715 531307 53179
13551B22762D0289K72452J72085B40918J83558j83088A2868M25566m178A91297
$$ 222762 40289 312741 484826 240918 424476 241388 12868 438434 434256 191297
13540B25083N7954k7287L36569A21627K59389j09189J6925A14342M9123R8802
$$ 225083 283037 255750 592319 121627 381016 271827 288752 114342 163465 262267
13530B62267j20505Q1591L9251l9337K43425B32287K30319j91920K76639j67090
$$ 262267 141762 223353 262604 223267 466692 232287 462606 270686 547325 380235
13520C80235j70533L50392B43353L0074M0513D5636K32038m4721q5562Q7849m8180
$$ 380235 209702 560094 243353 273427 313940 45636 277674 232953 147391 235240 187060
13509A87060G3350L25497A25793O1341J62968m2157F5743a01387B0360O5065B4170
$$ 187060 73350 398847 125793 187134 350102 307945 65743 -101387 20360 85425 24170
13497B334Q3540K93086h541A75859a05447C68984p4987K04729I8193J93641o2179
$$ 2334 85874 378960 -8541 175859 -105447 368984 293997 498726 98193 291834 229655
13486B29655K86712A89715c00365C27697a6436q3921G5739J28498q2164M0356
$$ 229655 516367 189715 -300365 327697 -16436 -100357 75739 204237 122073 162429
13476A62429L88320k53369O1216a08263C24912J51509A88651J39480n587m7113
$$ 162429 550749 297380 358596 -108263 324912 476421 188651 328131 322544 275431
13466B75431L20724c08227A70023K12124r0674Q1541m2957a48410B49478k5186
$$ 275431 596155 -308227 170023 382147 291473 373014 330057 -148410 249478 224292
13456B24292O670N0566E9590c29781B49009K3953I1263J43715k7088n3674K47811
$$ 224292 230962 281528 59590 -329781 249009 272962 91263 234978 207890 154216 402027
13445D02027n5714J64430J60444A23171M1490C104O06055j89088A89405K95008
$$ 402027 346313 510743 671187 123171 164661 3104 609159 420071 189405 484413
13435D84413I4899a05398C7162Q8874J44489o1755M3593n3454D1000K56863f0568
$$ 484413 94899 -105398 37162 126036 270525 208770 252363 198909 41000 297863 -60568
13423B86135j25251J2386f7755B56966j07163o7832g2872B34324h581p5431A42327
$$ 286135 160884 173270 -67755 256966 149803 81971 -72872 234324 -8581 -84012 142327
13411a38899f5134D51953A96999K1592J10699A37050k0591Q7430i0889B96431
$$ -138899 -65134 451953 196999 218591 329290 137050 116459 203889 -90889 296431
13400g4996J7956A82798J83228c2756C50867C3314L49236l3673a5554m0779K6375
$$ -74996 -57040 182798 366026 -32756 350867 33314 382550 348877 -15554 -56333 -29958
13389b9958A7736J27706C0596M30192A54148P0529d1942D00273a8202C674J03883
$$ -29958 17736 145442 30596 460788 154148 224677 -41942 400273 -18202 3674 107557
13378A07557K15123A52281a25139B66122J39620A55627N277F0221P5694M9021
$$ 107557 322680 152281 -125139 266122 405742 155627 160904 60221 135915 184936
13368A84936H682B539i512A64253a83625B22731N7912C3986h6237B49309b0058
$$ 184936 8682 2539 -9512 164253 -183625 222731 280643 33986 -86237 249309 -20058
13356A22892K96632D0815K28761J159J20055a36132b7536D94044r8567A94125
$$ 122892 419524 40815 269576 270735 390790 -136132 -27536 494044 395477 194125
13345C00610F4454L036e7200C18428j8007e6152A80865l0454A6637L10357A44690
$$ 300610 64454 67490 -57200 318428 300421 -56152 180865 150411 16637 326994 144690
13333C35974A33030l7528B9004L47688j37786J47311a7601A89516A1917K63709
$$ 335974 133030 95502 29004 376692 238906 386217 -17601 189516 11917 275626
13323B75626G7531J48271l004Q464K23750p6127c44810B76393I9698A4245J23389
$$ 275626 77531 225802 222798 231262 455012 378885 -344810 276393 99698 14245 137634
13312A37634k6237l9979J75861K21487o4350i741C46182N7182b4773B67790J72850
$$ 137634 111397 71418 247279 468766 404416 -9741 346182 403364 -24773 267790 440640
13301D40640A18402a06129B83118A0101Q1330O7963K71578B7726J78874A9607
$$ 440640 118402 -106129 283118 10101 91431 159394 430972 27726 206600 19607
13290D89713A55648K27210g538j96586B40471G7629K67696J79199A83396k7990
$$ 489713 155648 382858 -7538 -204124 240471 77629 345325 524524 183396 155406
13280A55406g719B52973e7719B58317F3314K62247C0019K45377b97603h6038A11236
$$ 155406 -7719 252973 -57719 258317 63314 325561 30019 275396 -297603 -86038 111236
13268a585B73304A0266J18503P5869A9598b32497c1628B11655q092E8699P1354
$$ -1585 273304 10266 128769 204638 19598 -232497 -31628 211655 203563 58699 130053
13257A30053L4380a57039A69146J566p2905c9508B42170a26042B48717J64867
$$ 130053 164433 -157039 169146 170712 97807 -39508 242170 -126042 248717 413584
13247D13584B8602e9462D05496b03576D17350a0931C88021C1797O7498L26868
$$ 413584 28602 -59462 405496 -203576 417350 -10931 388021 31797 99295 426163
13237D26163A70849a87634A55092i4778o9301l79255B25360a35128A15163D4457
$$ 426163 170849 -187634 155092 -94778 -164079 -543334 225360 -135128 115163 44457
13226A42628b6724A03691J07553K33078E164b60760B53170K78331A50201e600
$$ 142628 -26724 103691 211244 444322 5164 -260760 253170 531501 150201 -5600
13215A83237G6429J47406e095j34665E22927k28206E6642N1039c44250R1221A83285
$$ 183237 76429 223835 -5095 -139760 522927 294721 56642 107681 -344250 -253029 183285
13203D233f3533j65119A59867J2540a99369D56778a2612A14223c9807D2077N5539
$$ 4233 -63533 -228652 159867 172407 -199369 456778 -12612 114223 -39807 42077 97616
13192I7616e6224A36661O097A5014g486A9922K47211K6873F181P7199C6064a1198
$$ 97616 -56224 136661 142758 15014 -7486 19922 267133 294006 6181 83380 36064 -11198
13179B12369h1124j19870A89033M9643L1680D7998l471M5210K81025A54899B1447
$$ 212369 -81124 -200994 189033 238676 270356 47998 44527 89737 370762 154899 21447
13167f7283A62377J48100o4125A07375J67196i1120B18445J35255j69673D3414
$$ -67283 162377 310477 246352 107375 274571 -91120 218445 353700 184027 43414
13156D68319a27756A32850K4608f9359B39251J68320m9852j18396L7031o818Q1844
$$ 468319 -127756 132850 157458 -69359 239251 407571 357719 239323 276354 269536 351380
13145C51380g7381F4666J88662b93669a6397F7341e6634b760j8249C50033a29912
$$ 351380 -77381 64666 253328 -293669 -16397 67341 -56634 -2760 -21009 350033 -129912
13133B69741a83766a9768j21173E986M603a39229H0211K35608b1693E308c42593
$$ 269741 -183766 -19768 -140941 5986 10589 -139229 80211 315819 -21693 5308 -342593
13121B17420E6522h2711B27057n5766D1718a01282A95297l9065J51810D979Q072
$$ 217420 56522 -82711 227057 171291 41718 -101282 195297 156232 308042 4979 13051
13110A3051a14415A98361a4753A71516F2886B5289J37663L9217a05690N1151j23541
$$ 13051 -114415 198361 -14753 171516 62886 25289 162952 202169 -105690 -54539 -178080
13099a78080D8363i3894A32871a37723A87617n7458n4745P9126a5449D5722H82
$$ -178080 48363 -93894 132871 -137723 187617 130159 75414 154540 -15449 45722 882
13087a39849M6053D03131a84619q7702E7729d5740j55584A08790P793j7842L19672
$$ -139849 -93796 403131 -184619 -272321 57729 -45740 -201324 108790 116583 98741 418413
13076D18413E5427a6709A89739j7306J898N4542D1582J9408Q7112J48114R0811
$$ 418413 55427 -16709 189739 172433 174331 228873 41582 60990 148102 296216 387027
13065C87027C7515K88492m7553f9658M346E7286j3664c0653B53637b0027C74456
$$ 387027 37515 326007 278454 -69658 -65312 57286 43622 -30653 253637 -20027 374456
13053b160A19698N2209b6048k20922E0769J353L8254n751O0768P006C6390j0432
$$ -2160 119698 171907 -26048 -246970 50769 52122 90376 84625 145393 152399 36390 25958
13041B5958M8810J01399a70358Q1776A95828c870C74389b40016R5070B46534A12572
$$ 25958 74768 176167 -170358 -88582 195828 -3870 374389 -240016 -144946 246534 112572
13029a52244I6965J9782A1213K081K06390j08976K81004B0107b2745B8637M32358
$$ -152244 96965 116747 11213 13294 219684 110708 391712 20107 -22745 28637 460995
13018D60995A54656R6030q1508a1431j32582G3338d1145C45749d8218k7947E8855
$$ 460995 154656 250686 169178 -11431 -144013 73338 -41145 345749 -48218 -76165 58855
13006E9964a3372j33332d6352A75205i7805C0926c402j16262C96405H6745L2294
$$ 59964 -13372 -146704 -46352 175205 -97805 30926 -3402 -119664 396405 86745 119039
12995A19039a82891h9048j88657B51679g643l526E027J66372c77864F5817O8640
$$ 119039 -182891 -89048 -277705 251679 -7643 -11169 5027 171399 -377864 65817 134457
12984A34457L208R959b6047G875N5365K0356M710M5568J67825j08839o7804d7263
$$ 134457 137665 147624 -26047 7875 63240 83596 88306 133874 301699 192860 125056 -47263
12971b10904i5965A10611B5478j725a42799B08664b16832Q9884F3379L6069A7035
$$ -210904 -95965 110611 25478 23753 -142799 208664 -216832 -126948 63379 99448 17035
12959C81562c0650B50690c52951a25168F7871M5819B4708c71140f9362b1527r0337
$$ 381562 -30650 250690 -352951 -125168 67871 113690 24708 -371140 -69362 -21527 -111864
12948a11864e780j17534c2498j3958I3762P502C7214J12876b31173C3372f6916
$$ -111864 -5780 -123314 -32498 -46456 93762 101264 37214 150090 -231173 33372 -66916
12936A54949a78250d0024B7882L09870j28110A9545L9544J0182b24185h6799G6095
$$ 154949 -178250 -40024 27882 337752 209642 19545 59089 69271 -224185 -86799 76095
12924a89695k1600R5831r134j07554A8216f4226j16433A0599J20975b20199a01376
$$ -189695 -211295 -115464 -124598 -232152 18216 -64226 -180659 10599 131574 -220199 -101376
12912d29706H7498k0864B0583a5998k1053D8623L8868J51551b56339e4592m3640
$$ -429706 87498 66634 20583 -15998 -37051 48623 87491 239042 -256339 -54592 -98232
12901i8232j32032A99758d5166C44312f4012B59482b5200r0734A83323e9546l38413
$$ -98232 -230264 199758 -45166 344312 -64012 259482 -25200 -115934 183323 -59546 -397959
12890c97959B17143J11139R579A15769m9555F704J72079J44641a16087j3178K7896
$$ -397959 217143 328282 337861 115769 66214 6704 178783 323424 -116087 -129265 -101369
12879a01369H0725e6388C02825g0414o9644B31519J38675g47m0688A62886b3994
$$ -101369 80725 -56388 302825 -70414 -140058 231519 370194 -747 -41435 162886 -23994
12867c1553o1133F8095f3910C32829j43327E0466a26265n8875G5419G106a03218
$$ -31553 -92686 68095 -63910 332829 189502 50466 -126265 -185140 75419 7106 -103218
12855B73789j7876J95117j94909l960d9246I1801R2573a77181b4639j12929B27332
$$ 273789 255913 451030 256121 252161 -49246 91801 184374 -177181 -24639 -137568 227332
12843E6616b43935G4934l3264R6612q414a51931j30810a10330B47352A13110m6040
$$ 56616 -243935 74934 41670 138282 129868 -151931 -282741 -110330 247352 113110 67070
12832F7070o631b14942A07282J3922c4639A02015a25733A7934O7007a93463A92381
$$ 67070 60439 -214942 107282 121204 -34639 102015 -125733 17934 84941 -193463 192381
12820b4401j51249A69240e2112l09101a18722A79213k2239G5171g475r5172k07932
$$ -24401 -175650 169240 -52112 -361213 -118722 179213 156974 75171 -7475 -102647 -310579
12809c10579J50983J181I8342a63678j20367J11850B70754c50858I4158g1939
$$ -310579 -159596 -158415 98342 -163678 -284045 -172195 270754 -350858 94158 -71939
12798I4314B9438R0675R529K4661a04274B67051g2370A00863b29068b732I8914
$$ 94314 29438 120113 129642 154303 -104274 267051 -72370 100863 -229068 -2732 98914
12786H5242a89320j46E8163P9504H884J72370c42794J02188B13462K71795j98865
$$ 85242 -189320 -189466 58163 137667 8884 181254 -342794 -240606 213462 485257 286392
12775B86392b8212A06249B6237L9664c7834k37328I4185b71379A39917b5961D4947
$$ 286392 -28212 106249 26237 65901 -37834 -275162 94185 -271379 139917 -25961 44947
12763b42256A30684C2406a27555A05812K83788j25847a18137j65013A99999a42767
$$ -242256 130684 32406 -127555 105812 389600 263753 -118137 -283150 199999 -142767
12752a3129A19668e8703k54117H1222K70227a33159E63h7964m9886F8327k259
$$ -13129 119668 -58703 -312820 81222 351449 -133159 563 -87964 -137850 68327 66068
12741F6068A4402K11378b29517q833A05656b79342A67627G8744j9389J57288B5213
$$ 66068 14402 225780 -229517 -238350 105656 -279342 167627 78744 59355 216643 25213
12729a86791A27310a12218E8448j6309K4978J57168c43692B09275a16399A17099
$$ -186791 127310 -112218 58448 42139 67117 224285 -343692 209275 -116399 117099
12718a95766D1993J15417J18683b3076p9299M1498k21459c4192A11680g8741d98
$$ -195766 41993 157410 276093 -23076 -102375 -60877 -282336 -34192 111680 -78741 -498
12706b20294d4836A7157K71829i7167a9408p3642A43236b05335r6625Q2693E4165
$$ -220294 -44836 17157 288986 -97167 -19408 -93050 143236 -205335 -301960 -219267 54165
12694A55862b54180A33615O0107P0736j15581Q8739K11438C3947c0692B47373
$$ 155862 -254180 133615 193722 264458 148877 237616 449054 33947 -30692 247373
12683b66935A8460J67431P6893c1823j23675A38157K6593f5259q7517A4462J6271
$$ -266935 18460 185891 262784 -31823 -155498 138157 164750 -65259 -152776 14462 30733
12672C0733e8442C22174J3088d5402B9414K66296A06471L56539A13920J10496
$$ 30733 -58442 322174 335262 -45402 29414 295710 106471 463010 113920 224416
12662B24416o5154b07008a6465A32090K81611H6297J95474o5414g9988C62654
$$ 224416 159262 -207008 -16465 132090 413701 86297 281771 216357 -79988 362654
12651B49243I046a39648j58119A12849e240G1205L01551j38331A15259G193R1617
$$ 249243 9046 -139648 -297767 112849 -5240 71205 372756 234425 115259 7193 98810
12640I8810C5168J89265a00983C39881A58100Q7985j9094q5874B0472i5416P627
$$ 98810 35168 224433 -100983 339881 158100 246085 226991 141117 20472 -95416 -87789
12629h7789j09941H5901d41172e9437j3997k6439B54396c27982f712B60387o6539
$$ -87789 -197730 85901 -441172 -59437 -73434 -99873 254396 -327982 -6712 260387 193848
12618A93848C078N938J49059J97952A52901b5112H4628A7544Q182L7921K80976
$$ 193848 3078 9016 158075 356027 152901 -25112 84628 17544 25726 63647 344623
12607C44623q3257f1007Q480A15185K42535G6834l0417a65050A08140a36174I117
$$ 344623 261366 -61007 -52527 115185 357720 76834 46417 -165050 108140 -136174 9117
12595a01551q560A1946b30384j16019G3014K30194A7804a64777H0645g3820j6106
$$ -101551 -110111 11946 -230384 -346403 73014 303208 17804 -164777 80645 -73820 -89926
12584h9926J1896l17773F530J13776a06841l3901C1404K32267m6975c08147a24016
$$ -89926 -78030 -395803 6530 120306 -106841 -140742 31404 263671 216696 -308147 -124016
12572e9648B78110B9085a33284A01149D1483b5644n9636F2060a54650F4054b75251
$$ -59648 278110 29085 -133284 101149 41483 -25644 -85280 62060 -154650 64054 -275251
12560a41781A52838a9723k62213C79129a35203C28334g9931J1189E0551a65837
$$ -141781 152838 -19723 -281936 379129 -135203 328334 -79931 -68742 50551 -165837
12549F6424N8336O7231G404b64058A977Q6095a5123l08455C78256b06224h9857
$$ 66424 124760 191991 7404 -264058 1977 88072 -15123 -323578 378256 -206224 -89857
12537A04702i3013l80154e4408j62820B3990e24230b18286B84392N0518e20924
$$ 104702 -93013 -473167 -54408 -217228 23990 -524230 -218286 284392 334910 -520924
12526b0943o0520C97223b71832a00999d938D3938K3366a02o7149A14625n0293
$$ -20943 -81463 397223 -271832 -100999 -4938 43938 67304 -102 -67251 114625 64332
12515F4332a64910f103C5559L3216a600o7576j5788a4908H8736a01691A36813
$$ 64332 -164910 -6103 35559 68775 -1600 -69176 -84964 -14908 88736 -101691 136813
12503g6408I338b12379N0467O2830A25753P9221C1281j1051L19572K83d5950h172
$$ -76408 9338 -212379 -161912 -99082 125753 204974 31281 20230 339802 340085 -45950 -8172
12490B68686a75547O7512B04204l9537p4470h3427r1790G7723b53482a10064A0108
$$ 268686 -175547 -108035 204204 164667 90197 -83427 -175217 77723 -253482 -110064 10108
12478I8276a45267A18824a98178j04872a21929G8558j3576F969a53420A20416
$$ 98276 -145267 118824 -198178 -303050 -121929 78558 64982 6969 -153420 120416
12467i5483B70623d425p6197k59132a59824A54525J11817F3688L4227K9532b10101
$$ -95483 270623 -4425 -80622 -339754 -159824 154525 266342 63688 97915 127447 -210101
12455F5318N3714J54189c2631L189B046b07495E4577c1620C0824a21044j8890
$$ 65318 119032 273221 -32631 -29442 2046 -207495 54577 -31620 30824 -121044 -139934
12444a39934B8069P6605e9017A12103b01116Q2110B25682b95410f3490B16937
$$ -139934 28069 104674 -59017 112103 -201116 -119006 225682 -295410 -63490 216937
12433i845c036j8383r5446A664K45960a0541A19145d2504r7563d5141o8924A10983
$$ -9845 -3036 -21419 -116865 1664 247624 -10541 119145 -42504 -140067 -45141 -114065 110983
12420A20416e4511n040k5756C88607b59779A41488a0032A28891K99180i7495b2838
$$ 120416 -54511 -59551 -85307 388607 -259779 141488 -10032 128891 428071 -97495 -22838
12408d13278B1568K28176b46285H4744b33942a05784l0876n3374J6058A93404
$$ -413278 21568 249744 -246285 84744 -233942 -105784 -136660 -190034 -173976 193404
12397B24990c49813b1463A3766e197A45228g7361A84008c2198H6516P8944A5128
$$ 224990 -349813 -21463 13766 -5197 145228 -77361 184008 -32198 86516 165460 15128
12385a42670D0962a79984B7376d3027j03118B493J50054d0638k6430B63651c90548
$$ -142670 40962 -179984 27376 -43027 -146145 2493 152547 -40638 -67068 263651 -390548
12373b61114a7103l16885a25182F8695N2372N5426P3602p8689N3977b07874J9415
$$ -261114 -17103 -333988 -125182 68695 121067 176493 250095 171406 225383 -207874 -188459
12362a88459A38089a31163C26030n4105M8129a4876N935A19755K68575B4270L4423
$$ -188459 138089 -131163 326030 271925 320054 -14876 -8941 119755 388330 24270 58693
12351E8693a46747k1515J5669B1113a66558A00211b68108R2927k3677q864l4077
$$ 58693 -146747 -168262 -152593 21113 -166558 100211 -268108 -175181 -198858 -207722 -241799
12340b41799A09241m5158L972L10551b72399C168Q1602L6905b36358A62385J0263
$$ -241799 109241 64083 68055 378606 -272399 3168 84770 121675 -236358 162385 172648
12329A72648a46994I8250c60823e5632A11988J7587m1429C6946e1425k78339A26379
$$ 172648 -146994 98250 -360823 -55632 111988 129575 88146 36946 -51425 -329764 126379
12317D4052J13394Q5937p8590P9881b55587D3282K52020H6378J35329d2766B82633
$$ 44052 157446 243383 164793 244674 -255587 43282 295302 86378 221707 -42766 282633
12305B08708a53881I1495K14633a1599B75958J4809j6877a5552j71008C5244a22549
$$ 208708 -153881 91495 306128 -11599 275958 290767 273890 -15552 -186560 35244 -122549
12293C84283e0077B7521J27190b42412B24669d646A48649F9835a04149M256H981
$$ 384283 -50077 27521 154711 -242412 224669 -4646 148649 69835 -104149 -99893 8981
12281A56149a99252a7136B8452N4417e2093j21636j200C31288a45545K0410A17297
$$ 156149 -199252 -17136 28452 82869 -52093 -173729 -174929 331288 -145545 -125135 117297
12269B36326A5779O7522m931l0978L0943b0094p3080B4322J87577F4459J51171
$$ 236326 15779 83301 78370 47392 78335 -20094 -93174 24322 211899 64459 215630
12258B15630r0771J40173o4257n2388J69157g5272C04010P0852A75014M8419d2472
$$ 215630 124859 265032 200775 148387 317544 -75272 304010 374862 175014 223433 -42472
12246b47520a01986A21889J90255h5147A85524l484O907F1459e9152j12276b2110
$$ -247520 -101986 121889 312144 -85147 185524 182040 188947 61459 -59152 -171428 -22110
12234A36639J90535A17727g3243B08588b05333A88896G3896J86770O7446F359
$$ 136639 327174 117727 -73243 208588 -205333 188896 73896 260666 328112 6359
12223A29109b06927f8473j06644e8911B22574a33317A37706J02054g63G1492a12430
$$ 129109 -206927 -68473 -175117 -58911 222574 -133317 137706 239760 -763 71492 -112430
12211C34405A51185j4433a23592D57921k25223H5415J77016k2786l0849i9185
$$ 334405 151185 136752 -123592 457921 232698 85415 262431 239645 208796 -99185
12200A70084J13054i8271C29360k5383d6419k5229m9536A44974i124A04465f4230
$$ 170084 283138 -98271 329360 303977 -46419 -71648 -121184 144974 -9124 104465 -64230
12188A46881j0597o2657Q7985B5767K24010j06216f0113B09829b532q5311E84413
$$ 146881 136284 73627 161612 25767 249777 143561 -60113 209829 -2532 -87843 584413
12176F6596J31440D0335L74902j06549A04528a44750A59679M5363n8145g4013
$$ 66596 198036 40335 415237 308688 104528 -144750 159679 205042 146897 -74013
12165B31141L6467o8112i2206I5507a80873C31834G3884h2226B09897D5065P9259
$$ 231141 267608 199496 -92206 95507 -180873 331834 73884 -82226 209897 45065 124324
12154A24324L08871b09I4579N4853m8648K17876N3520o3140j06140N3876j07300
$$ 124324 433195 -209 94579 149432 100784 318660 372180 309040 202900 256776 149476
12143A49476b18372A36141o6881M8711c8194C36040a09469L4983F6163a33327
$$ 149476 -218372 136141 69260 117971 -38194 336040 -109469 -74486 66163 -133327
12132H4204j8207i1181A82565M3780r6756B8410Q9894D2639Q5964k2020Q5041
$$ 84204 65997 -91181 182565 226345 129589 28410 118304 42639 128603 106583 191624
12121A91624i6045H8041a0812I4540e3604H2477L04277B0426f6664B7017b82267
$$ 191624 -96045 88041 -10812 94540 -53604 82477 386754 20426 -66664 27017 -282267
12109A17543F190J48888K04771b35908C78383g58H8311L854J16119N6451m9304
$$ 117543 6190 155078 359849 -235908 378383 -758 88311 92165 208284 264735 215431
12098B15431D9369a6174l05938D33341a65720b315A08500b8028j6567J1449A64827
$$ 215431 49369 -16174 -322112 433341 -165720 -2315 108500 -28028 -44595 -33146 164827
12086a38002D0913L9367N1484a555C56257j0794b01994C42038D4383G427O3794
$$ -138002 40913 80280 131764 -1555 356257 345463 -201994 342038 44383 7427 71221
12075G1221a26473j05041A93980b05651B89784a61617D1978P3310E3436K66032
$$ 71221 -126473 -231514 193980 -205651 289784 -161617 41978 115288 53436 319468
12065C19468a39874L7743D4339A3284f2190B69724A2112N7620a87783A18277l1194
$$ 319468 -139874 -102131 44339 13284 -62190 269724 12112 69732 -187783 118277 87083
12054H7083k8780Q6252c1203B46928j05169a01800B29513l111J70468C1040K8086
$$ 87083 58303 144555 -31203 246928 141759 -101800 229513 226402 396870 31040 59126
12043E9126a45988D91192a31968j03178A39582k0565c9071G3591g1628d762k68170
$$ 59126 -145988 491192 -131968 -235146 139582 119017 -39071 73591 -71628 -4762 -272932
12032b72932F8420a7526C84215B9025j3424a07594B5855O3379b19067B4096c4322
$$ -272932 68420 -17526 384215 29025 15601 -107594 25855 89234 -219067 24096 -34322
12020A57876j4147C4490P1531h4615A74005a35398c9948j2675A58431f6318K8624
$$ 157876 143729 34490 106021 -84615 174005 -135398 -39948 -52623 158431 -66318 -37694
12009c7694P114B94243A00771h37A521J96026a30772a5864j21289B04371p1537
$$ -37694 -30580 294243 100771 -837 1521 197547 -130772 -15864 -137153 204371 132834
11998A32834C7742c6106k75248Q135C7386c39817f9724e364A85227b8658B3569
$$ 132834 37742 -36106 -311354 -303219 37386 -339817 -69724 -5364 185227 -28658 23569
11986b67963I4569B3138c09419A52528o2207g8474p1307L0455B47344K3560A01440
$$ -267963 94569 23138 -309419 152528 90321 -78474 -149781 -119326 247344 270904 101440
11974a55503b1954p3208G859J57204o0894A6934a89822E3128B2119a35897A8608
$$ -155503 -21954 -95162 7859 165063 104169 16934 -189822 53128 22119 -135897 18608
11962F8681b80116n9832e7503k73947g3040q8236A08959c9490q084D5018a9760
$$ 68681 -280116 -339948 -57503 -331450 -73040 -161276 108959 -39490 -47574 45018 -19760
11950a68158e5851A6351G183h8597j29463f7431B63284a23374A32393j7978a21567
$$ -168158 -55851 16351 7183 -88597 -218060 -67431 263284 -123374 132393 114415 -121567
11938B36181a06630A10722J26419e0839C2635a32405M1883A99742a60391F1699
$$ 236181 -106630 110722 237141 -50839 32635 -132405 -90522 199742 -160391 61699
11927g7384D2487J40712e2597p6871L5446j37651b9073B06435n1496j0907D8632
$$ -77384 42487 183199 -52597 -129468 -94022 -231673 -29073 206435 154939 144032 48632
11915b0286k56996n4975a21875l16665i5412B65239B7528g8661j9526B63036m5721
$$ -20286 -277282 -332257 -121875 -438540 -95412 265239 27528 -78661 -98187 263036 217315
11904B17315b00978g9703A09870m5034b13629M0389B07439m8037l2745l972L0649
$$ 217315 -200978 -79703 109870 64836 -213629 -173240 207439 159402 126657 122685 153334
11893A53334a39199B01195q9149g1981l5195B20806a37862A03160d9216o1794
$$ 153334 -139199 201195 112046 -71981 -107176 220806 -137862 103160 -49216 -111010
11883a11010j02125Q9524M0699C40179g4353B776i3562m1553A94332b49566B21744
$$ -111010 -213135 -123611 -82912 340179 -74353 2776 -93562 -135115 194332 -249566 221744
11871a25224d7282B95727E5232D260b12382m3311E3862k0192K36783i4370j67596
$$ -125224 -47282 295727 55232 4260 -212382 -255693 53862 33670 270453 -94370 -261966
11860b61966Q7647P6868d8700k02325a24665o8182h3699l847B17236J125H511
$$ -261966 -174319 -97451 -48700 -251025 -124665 -192847 -83699 -87546 217236 218361 8511
11848h8173M0449j16372d8466j67762m218C8696b26700k986P1790b6986C14895
$$ -88173 -47724 -164096 -48466 -216228 -220446 38696 -226700 -229686 -157896 -26986 314895
11836A51743N6967g8209a8598p8072F8080d60708I7004P295J0223N7960c21656
$$ 151743 208710 -78209 -18598 -96670 68080 -460708 97004 104299 114522 172482 -321656
11824C9225A5172e9465C812a44432B40959b14787D4752c0090k98952A01498K6256
$$ 39225 15172 -59465 3812 -144432 240959 -214787 44752 -30090 -329042 101498 127754
11813A27754l2834O538i6887a4972A01112P5643q0652h4882j6072j04301i799
$$ 127754 94920 101458 -96887 -14972 101112 176755 96103 -84882 -100954 -205255 -9799
11801b63764B46739k8683B5685a60755B86402a01611A72683a0678j53696C37087
$$ -263764 246739 218056 25685 -160755 286402 -101611 172683 -10678 -164374 337087
11790A60725a79258A71626b82261G2844b5624n73988F6597f51513D7613a29285
$$ 160725 -179258 171626 -282261 72844 -25624 -599612 66597 -651513 47613 -129285
11779A037K19491E4094a3852p4201A97388B6961e2272k53843Q2719A46081b82501
$$ 1037 220528 54094 -13852 -88053 197388 26961 -52272 -306115 -223396 146081 -282501
11767b9254o0928F7173R927l3312J15089b84410a18237j25478E7344d5322A43136
$$ -29254 -90182 67173 77100 43788 158877 -284410 -118237 -243715 57344 -45322 143136
11755b70793j47953J57024a07620B65906b2538j32159o6897f6204A92102i6669
$$ -270793 -418746 -261722 -107620 265906 -22538 -154697 -221594 -66204 192102 -96669
11744C7367o957J4063b25726B29092c40088D6786O5411J62260c9903A27419f9513
$$ 37367 30410 44473 -225726 229092 -340088 46786 112197 274457 -39903 127419 -69513
11732h3488B40932G8465b69119A62948b53693g9498B6825J43497b35664b1856
$$ -83488 240932 78465 -269119 162948 -253693 -79498 26825 170322 -235664 -21856
11721C54084b94127D9237J63743h3394o0516e7432b7551l7288l6460j07101B70580
$$ 354084 -294127 49237 212980 -83394 -143910 -57432 -27551 -64839 -101299 -208400 270580
11709B16270H2820a54744o0954I5485I625J70403a20022A79569R979c77689Q2892
$$ 216270 82820 -154744 -215698 95485 9625 180028 -120022 179569 189548 -377689 -294797
11698b94797B53907K59500d1865C4097c86371a922j40317e3695G4069A9275c00526
$$ -294797 253907 513407 -41865 34097 -386371 -1922 -142239 -53695 74069 19275 -300526
11686d8873A58030g0985m0848C01103h8629B29721b79140a14816B48823r5171
$$ -48873 158030 -70985 -111833 301103 -88629 229721 -279140 -114816 248823 153652
11676A53652m7145i2678A08423c95765J46976A87077k6667l9338L00747A4217
$$ 153652 106507 -92678 108423 -395765 -248789 187077 160410 121072 421819 14217
11665B19108N7094D6335J997a11500j01947P0902O4364D1591p072N5984G711O284
$$ 219108 276202 46335 48332 -111500 -213447 -142545 -78181 41591 34519 90503 7711 13995
11653A3995b9865A39686a34419m1945A32205b9908A7201K71029b37618a06138
$$ 13995 -29865 139686 -134419 -176364 132205 -29908 17201 288230 -237618 -106138
11642A12607a76881A08832g759j911A95806d28607A8143e1794I9526P9805F4943
$$ 112607 -176881 108832 -7759 -9670 195806 -428607 18143 -51794 99526 179331 64943
11630G158a54504J0017F2322J92042F029O3234c56672a4458E9185b08032B55520
$$ 7158 -154504 -144487 62322 254364 6029 69263 -356672 -14458 59185 -208032 255520
11618h3604c8740j86269B57004K6882C6144K2278K13011d1991A11308K21672a12170
$$ -83604 -38740 -225009 257004 283886 36144 58422 271433 -41991 111308 332980 -112170
11606A80003M2674h1133j00539H0908J7867a38091H2665f589B36393O3739a20014
$$ 180003 222677 -81133 -181672 80908 98775 -138091 82665 -6589 236393 300132 -120014
11594E7983J1502K07724F4804J62720B6965a43099b4904a1073B2417Q1902a78499
$$ 57983 69485 277209 64804 227524 26965 -143099 -24904 -11073 22417 104319 -178499
11582a77053o4996H3114e8925k13752A6864b64422A81197m3825D4902e3342A08163
$$ -177053 -242049 83114 -58925 -272677 16864 -264422 181197 137372 44902 -53342 108163
11570F3093N9071a05629C6182e3637A8814a37405c2980C6059f1116m6614C7741
$$ 63093 122164 -105629 36182 -53637 18814 -137405 -32980 36059 -61116 -107730 37741
11558g7437A79902o431f3098j21101c3400j15613C5539b51090A71233P8909f6579
$$ -77437 179902 173471 -63098 -184199 -33400 -149013 35539 -251090 171233 250142 -66579
11546A01986b70321D11087b27832g714B16675l3204N4064f3808G4815f3774j73985
$$ 101986 -270321 411087 -227832 -7714 216675 183471 237535 -63808 74815 -63774 -237759
11535b37759A98535b71309A10518P345a07715B09953E1039J7739a4896r6856A32635
$$ -237759 198535 -271309 110518 117863 -107715 209953 51039 68778 -14896 -111752 132635
11523B85662A05679i6541B34253o9573f2421A27032K9839J7977a24439A84882
$$ 285662 105679 -96541 234253 164680 -62421 127032 156871 174848 -124439 184882
11512H4674a04096m5944A3614L31096A31652K0746g4624H2417O405J33666a66020
$$ 84674 -104096 -150040 13614 344710 131652 152398 -74624 82417 88822 222488 -166020
11500I1467K75556k9840b47737e3935H4183O431J88067r2493f1473A7026L03853
$$ 91467 367023 337183 -247737 -53935 84183 90614 278681 186188 -61473 17026 320879
11489C20879j35776b94653a8038C1240J61121l5167k2800b9891c375H7977a81543
$$ 320879 185103 -294653 -18038 31240 192361 157194 134394 -29891 -3375 87977 -181543
11477B04589c07112C29818D7802J03618J38305D2361c0711A18373n6848J37535
$$ 204589 -307112 329818 47802 151420 289725 42361 -30711 118373 61525 199060
11467A99060c74876A79435n8218a68261B4897K21742G5828R1878B7397g3803C4779
$$ 199060 -374876 179435 121217 -168261 24897 246639 75828 167706 27397 -73803 34779
11455E67909f304j51940B72465H7767K0223o793J14693n227J05734H0920c38074
$$ 567909 -6304 -158244 272465 87767 107990 101197 215890 210663 316397 80920 -338074
11443A62608J66747a04840F4467d6128C30147C7260M02440i2550B21976N2037
$$ 162608 329355 -104840 64467 -46128 330147 37260 439700 -92550 221976 274013
11433B74013I7745a4591j57905D9016J13038D2768R7179b64862A28155N8147p5831
$$ 274013 97745 -14591 -172496 49016 162054 42768 139947 -264862 128155 186302 110471
11422A10471B7364b22333k60421A54225K4175a3452j3593k89505b573k01071L3078
$$ 110471 27364 -222333 -482754 154225 178400 -13452 -27045 -316550 -2573 -203644 -170566
11411a70566O5479J83B5002K25831e9076B0834d94997A15267C0063a24596N802
$$ -170566 -105087 -104904 25002 250833 -59076 20834 -494997 115267 30063 -124596 -118794
11400a18794b3430j28197D19092A07169P0998i048H0244C468c59908A49334e35
$$ -118794 -23430 -151627 419092 107169 178167 -9048 80244 3468 -359908 149334 -535
11388b3463E1581K68294g9134B79618h8186B82238h2003a2290C21623a18236B1869
$$ -23463 51581 319875 -79134 279618 -88186 282238 -82003 -12290 321623 -118236 21869
11376a30425G1697B7315a37675q7849m13Q7937A04233f7209r9143n2310A00959
$$ -130425 71697 27315 -137675 -225524 -225937 -138000 104233 -67209 -166352 -218662 100959
11364B351d8435A84585C8352a96719C65059f0312C2822M1194a2470j17348j76039
$$ 2351 -48435 184585 38352 -196719 365059 -60312 32822 74016 -12470 -129818 -305857
11353c05857D8352a02242k6541k3314e6096A93578H1206a05232A31715C3015r819
$$ -305857 48352 -102242 -128783 -152097 -56096 193578 81206 -105232 131715 33015 23196
11342B3196a52908b2099A9671d2800A96999a49744M5497b3954A69173K19076e8286
$$ 23196 -152908 -22099 19671 -42800 196999 -149744 -104247 -23954 169173 388249 -58286
11330h0556H6656l7617a71512c2253A64853c91829H8743k389e8843k29139A0855
$$ -80556 86656 49039 -171512 -32253 164853 -391829 88743 86354 -58843 -287982 10855
11318d0425j54584k56978a6103m9602r9149A97185a36826J6706j2345l0453g7527
$$ -40425 -195009 -451987 -16103 -65705 -164854 197185 -136826 -120120 -132465 -162918 -77527
11306A18172J23074d4223j16049c5260F0886Q4177b52970D6593L02799F2306d02302
$$ 118172 241246 -44223 -160272 -35260 60886 145063 -252970 46593 349392 62306 -402302
11294b39594N4150E7324P9054a94361J6290B44226B9969a9719N965j33714m4248
$$ -239594 -185444 57324 136378 -194361 -178071 244226 29969 -19719 -13754 -147468 -191716
11283a91716F0338O555B7370J59762a56140L0131B32399b50041J08624O8561k80094
$$ -191716 60338 66893 27370 187132 -156140 -126009 232399 -250041 -141417 -72856 -352950
11272c52950a35492m2409g258C6489a77632B9310A4289J84129a95028e449A16676
$$ -352950 -135492 -177901 -7258 36489 -177632 29310 14289 198418 -195028 -5449 116676
11260b78222b0869B43088a52087D3091a89091L8861L2956E1956J71442b58300
$$ -278222 -20869 243088 -152087 43091 -189091 -150230 -117274 51956 223398 -258300
11249G7790a07294M7598k7135A96408b4737j62599A5724e04078a22522A71858
$$ 77790 -107294 -59696 -86831 196408 -24737 -187336 15724 -504078 -122522 171858
11238A26411h3501O38m6417F9216j5826Q4528K7204a73757d2968H5646b99581
$$ 126411 -83501 -82863 -129280 69216 53390 137918 165122 -173757 -42968 85646 -299581
11226E0136L5970e7702j76930F320B117L68306h160B09098r8618e48310a12852
$$ 50136 86106 -57702 -234632 6320 2117 370423 -8160 209098 110480 -548310 -112852
11214a46498l2478d8318k84408C15698a47177k68961B05839q6596n5848a31239
$$ -146498 -178976 -48318 -332726 315698 -147177 -416138 205839 119243 63395 -131239
11203B9927a05722A33850D8177g3679J685G9442e5287B4047J54948a75773B21640
$$ 29927 -105722 133850 48177 -73679 -71994 79442 -55287 24047 178995 -175773 221640
11191a51539o6530Q5507E2602b30059e2972A36776C6005L5063k6106a29808e383
$$ -151539 -218069 -132562 52602 -230059 -52972 136776 36005 71068 44962 -129808 -5383
11179b04064C23617a88454A01860a92347A41710J87873c21562J12503k4976A66432
$$ -204064 323617 -188454 101860 -192347 141710 329583 -321562 -209059 -234035 166432
11168b25037A13043a18979A15525a4671B44474c18407a39365j8783N3454j39059
$$ -225037 113043 -118979 115525 -14671 244474 -318407 -139365 -158148 -104694 -243753
11158b43753G9725g0950j14927B17462d9322A61897n3925b46883b7859o4602C63691
$$ -243753 79725 -70950 -185877 217462 -49322 161897 107972 -246883 -27859 -92461 363691
11146B21193A760b78428c4048F1855K4951b28201O0672h1965A96884k7c33102
$$ 221193 1760 -278428 -34048 61855 86806 -228201 -167529 -81965 196884 196857 -333102
11134A8601a10212h066a957G1858J20994b9156j7317C2035J19939b72228B29754
$$ 18601 -110212 -8066 -1957 71858 192852 -29156 -46473 32035 151974 -272228 229754
11122a48676I4799a76008p7996b4840i71H2486b23427E5093a23020G8593B7706
$$ -148676 94799 -176008 -254004 -24840 -971 82486 -223427 55093 -123020 78593 27706
11110B43465C8999J76212G0658c5578j77678d9604m0362B03469n1248A7321b53604
$$ 243465 38999 215211 70658 -35578 -213256 -49604 -89966 203469 152221 17321 -253604
11098B00487c2781k57914B7823a90588B59733j14530J8005C2116e8632B40447
$$ 200487 -32781 -290695 27823 -190588 259733 145203 163208 32116 -58632 240447
11087A8027J81786c4282B02342a7462C60930L0040a2609D1552J57813m0917F503
$$ 18027 199813 -34282 202342 -17462 360930 390970 -12609 41552 199365 158448 6503
11075h9708D1309L08773j51083l0973o5527e9290A70416J55981e4754F653K14455
$$ -89708 41309 350082 198999 168026 102499 -59290 170416 326397 -54754 6653 221108
11064B21108K0229K445d6803F3791J94258h167F05012d2459A62758J3696J34979
$$ 221108 241337 243782 -46803 63791 258049 -8167 605012 -42459 162758 176454 311433
11053C11433J22217J15954A98398L13147j98234p0720L48981j56996j47646p878
$$ 311433 433650 549604 198398 511545 313311 242591 591572 434576 286930 279052
11043B79052K67194j13818J09425J13501j11019j20886n2690J30963Q9687K15907
$$ 279052 546246 432428 541853 655354 544335 423449 370759 501722 591409 807316
11033H07316p1477J77787l28040J17647k49271M9711M40035k18536j84679N00872
$$ 807316 735839 913626 585586 703233 453962 503673 943708 725172 540493 1041365
11023A041365j32747l18677j37656P2272J7383J19686j01595j65203L65111l23119
$$ 1041365 908618 589941 452285 524557 541940 661626 560031 394828 759939 436820
11013D36820N00584B39319N13546P4564j55322J22970p205C84272J64628K31814
$$ 436820 937404 239319 752865 827429 672107 795077 787872 384272 548900 780714
11003G80714j72694j77906Q1577J92953N7689L0639l88614N7742L8901j94115
$$ 780714 608020 430114 511691 704644 762333 792972 404358 462100 501001 306886
10993C06886K48903j0842R9767n2930j71146K76699J60975l90136m9493J52984
$$ 306886 555789 544947 644714 591784 420638 697337 858312 468176 418683 571667
10983E71667o4332l810j09749R339J27677l6450J3906q0468N61183m52816K28123
$$ 571667 507335 503525 393776 403115 530792 494342 508248 427780 988963 536147 764270
10972G64270k65460L10029k76288N7858l5139J15344J5665N87701j72032l2896
$$ 764270 498810 808839 532551 590409 555270 670614 686279 1273980 1101948 1069052
10962A069052k2311R9824L38647J10834n7815j109N18918M9826l06242O93021
$$ 1069052 1046741 1146565 1485212 1596046 1538231 1537122 2056040 2105866 1799624 2492645
10952B492645k7392l01212j48354J61814J20951n60990k74695J41803J24246l9351
$$ 2492645 2465253 2164041 2015687 2177501 2298452 1737462 1462767 1604570 1728816 1689465
10942A689465l35712k36626M56170j98377R1166j19681j43211p5936j53245p3233
$$ 1689465 1353753 1117127 1573297 1374920 1466086 1346405 1203194 1127258 974013 900780
10932I00780J11350l96057k1851N5219B06897R2738K70585k16644K33035B83954
$$ 900780 1012130 616073 594222 649441 206897 299635 570220 353576 586611 283954
10921B45356C3411K2136a9760A30324J83099b3021j85610A14334l2744a6243q168
$$ 245356 33411 55547 -19760 130324 313423 -23021 -208631 114334 81590 -16243 -24411
10910b4411p4308B48543o9378M7113a02662H6816J60758e6974A08746a34490I8474
$$ -24411 -98719 248543 179165 226278 -102662 86816 247574 -56974 108746 -134490 98474
10898E4479O4124E2042K51270A39034J98078e9739j86552O6430E0955b42493J5395
$$ 54479 118603 52042 303312 139034 337112 -59739 -246291 -179861 50955 -242493 -227098
10887b27098e1890A26928a3303A01592j4956B652h8975L8345a8400o1489A51502
$$ -227098 -51890 126928 -13303 101592 86636 2652 -88975 -50630 -18400 -79889 151502
10875B18172h8758J5515j30009g7926D5a15425C14704b16955A93186a3656j58208
$$ 218172 -88758 -73243 -203252 -77926 45 -115425 314704 -216955 193186 -13656 -171864
10864a71864A54231a39969H9882a93994q0893F9788b37788A0350L8884d8351A17517
$$ -171864 154231 -139969 89882 -193994 -274887 69788 -237788 10350 49234 -48351 117517
10852a12861A07913a17740B0247a39299C04298a14269j67280f9374B450c04238
$$ -112861 107913 -117740 20247 -139299 304298 -114269 -281549 -69374 2450 -304238
10841A47726B1182O4115J84361b76254n1813a59280e5634B0529J19174b00298
$$ 147726 21182 85297 269658 -276254 -328067 -159280 -55634 20529 139703 -200298
10830B2691e2814J4212C7082K5878h7491j92634a13636I1303L29321a32807D4240
$$ 22691 -52814 -38602 37082 62960 -87491 -280125 -113636 91303 420624 -132807 44240
10818a86894f5412j74962i636A90786L451c1088C19260A20653C7566b21316C22201
$$ -186894 -65412 -240374 -9636 190786 194237 -31088 319260 120653 37566 -221316 322201
10806A21406a14601n5907A6047h9750E7778a96588E6495b49130r1011B23664c01573
$$ 121406 -114601 -170508 16047 -89750 57778 -196588 56495 -249130 -340141 223664 -301573
10794c28597d9283B42075c09060D3029M940j9889b041q8113H1212b725j29967
$$ -328597 -49283 242075 -309060 43029 47969 28080 -2041 -90154 81212 -2725 -132692
10783a32692p3591j6029A92971K2322a67691H0731b96105k2576a28071A11873
$$ -132692 -206283 -222312 192971 215293 -167691 80731 -296105 -318681 -128071 111873
10772b60375B9796a12680d0892E0108a62821j02581F4759b9029A58886c0876n8775
$$ -260375 29796 -112680 -40892 50108 -162821 -265402 64759 -29029 158886 -30876 -89651
10761h9651k43992C2262b23565c9455I6096g7009G6276a84144f445n0012k9703
$$ -89651 -333643 32262 -223565 -39455 96096 -77009 76276 -184144 -6445 -56457 -86160
10750h6160k1733k22986g5994Q183A59899F5983L3278J96059c92726D2165B037
$$ -86160 -107893 -330879 -75994 -67811 159899 65983 99261 295320 -392726 42165 2037
10738D68116F8598d1418A86610e4241F1715a03518d1490J1645M377D4650b51606
$$ 468116 68598 -41418 186610 -54241 61715 -103518 -41490 -29845 -25468 44650 -251606
10726g4877l24446a87986b6960k67928B6930b56165A51245m8918K67612g1246
$$ -74877 -399323 -187986 -26960 -294888 26930 -256165 151245 102327 369939 -71246
10715c74665B20760a27451m0850j9610A76896b70557A28795N2338C1169h6947
$$ -374665 220760 -127451 -168301 -187911 176896 -270557 128795 181133 31169 -86947
10704i3695r0777C4001R4283a01712a3676j32734k1240Q0505j16578b6010k11954
$$ -93695 -184472 34001 128284 -101712 -13676 -146410 -167650 -87145 -203723 -26010 -237964
10693b37964o3747A25786n0769b232A312a42489B11008K0124c23737h9266k23422
$$ -237964 -301711 125786 75017 -2232 1312 -142489 211008 231132 -323737 -89266 -312688
10682c12688I1828C8910a36636l38170a0494k81451D9432e5858C59878b51928
$$ -312688 91828 38910 -136636 -474806 -10494 -291945 49432 -55858 359878 -251928
10671F2503a14375a9963A8483a58610A79110k7344c93797H7081b63441J31192
$$ 62503 -114375 -19963 18483 -158610 179110 151766 -393797 87081 -263441 -132249
10661a32249j18426e4404l06080F7764K38354i4447F4604b20577M3097F5194a45530
$$ -132249 -250675 -54404 -360484 67764 306118 -94447 64604 -220577 -177480 65194 -145530
10649B13276o9002Q734b87937a28778i674l910n6475B25550b55720h4221j51981
$$ 213276 144274 153008 -287937 -128778 -9674 -13584 -70059 225550 -255720 -84221 -236202
10638b36202J5396N3252l45677C84034a62085M0454M5742H1640B4768J15126Q9511
$$ -236202 -220806 -167554 -513231 384034 -162085 -121631 -75889 81640 24768 139894 229405
10627B29405c13814a08055j33197C13857c4448G0627J35013I1068O7677e1967
$$ 229405 -313814 -108055 -241252 313857 -34448 70627 205640 91068 158745 -51967
10616C53497j50565L99747B7872K69911a52441I0652K19457a54007M1025j30199
$$ 353497 202932 602679 27872 297783 -152441 90652 310109 -154007 -112982 -243181
10606b43181l1933E7748b01302I6179a54770D10018a52386k82025a05059i814
$$ -243181 -275114 57748 -201302 96179 -154770 410018 -152386 -434411 -105059 -9814
10595A25893Q3963F3003c41686a35010A98031A46a23619c7438j21606f9902k36430
$$ 125893 209856 63003 -341686 -135010 198031 146 -123619 -37438 -159044 -69902 -306332
10584c06332J48079f2352C7767O4356g2255j26646f4923j93830O5553d9169A78131
$$ -306332 -158253 -62352 37767 102123 -72255 -198901 -64923 -258753 -193200 -49169 178131
10572a28242C42676b06410m3578J09695M7222I9803J59906m7209G3645e05631
$$ -128242 342676 -206410 -249988 -140293 -93071 99803 259709 212500 73645 -505631
10561a59994b1712A67059E3491J61435C7501K13926j19442i6525J8935A87212
$$ -159994 -21712 167059 53491 214926 37501 251427 131985 -96525 -77590 187212
10550A08380n1773a5422B0117g9056k44202C09194f6430B57687b67178A31258
$$ 108380 56607 -15422 20117 -79056 -323258 309194 -66430 257687 -267178 131258
10539B39411d54815J20417a54376n3378E9578N8724L7145K8120c1329C1060f6861
$$ 239411 -454815 -334398 -154376 -207754 59578 118302 155447 183567 -31329 31060 -66861
10527B1676a49775D1962e1727n9876I2438a45919E7445J08189c4683o5732j05256
$$ 21676 -149775 41962 -51727 -111603 92438 -145919 57445 165634 -34683 -100415 -205671
10516b05671e5035K6017B74399h5232D7081a37268A29621f1321G1284J42669c91414
$$ -205671 -55035 -29018 274399 -85232 47081 -137268 129621 -61321 71284 213953 -391414
10504A34999f7738j35022O9056j01296O1785N8309j05133i2136j35929A23710
$$ 134999 -67738 -202760 -133704 -235000 -173215 -114906 -220039 -92136 -228065 123710
10493A00975J7983b0456L334j69237P2351j15610j10138i8255n1820f2127B29133
$$ 100975 118958 -20456 -17122 -186359 -114008 -229618 -339756 -98255 -150075 -62127 229133
10481b11889j92883a89508A98955c769j86247j13740a12992k9598j22740a23305
$$ -211889 -404772 -189508 198955 -3769 -190016 -303756 -112992 -142590 -265330 -123305
10470A53964a3863B54722C057O7822a3270A98467b32804A40411M9961J78564A58153
$$ 153964 -13863 254722 3057 70879 -13270 198467 -232804 140411 190372 368936 158153
10458C89862j12565J53658j59364H3344Q671K35267E867b13112i5563E1238g1048
$$ 389862 277297 430955 271591 83344 92015 327282 5867 -213112 -95563 51238 -71048
10446a94483A66764l5771a44904a9299n5240A0923J55542a42803A44771g6961
$$ -194483 166764 130993 -144904 -19299 -74539 10923 166465 -142803 144771 -76961
10435a45305A51344l1688a22797C09900c20362E65a28096m9480r730B57721a5595
$$ -145305 151344 119656 -122797 309900 -320362 565 -128096 -177576 -187306 257721 -15595
10423C0520J33942i9081E0752Q6189a57159e1591k41406b4784A49114C6484a70691
$$ 30520 164462 -99081 50752 136941 -157159 -51591 -292997 -24784 149114 36484 -170691
10411c9482k61859j0776a45544c1593O535k17159c5995k75654d4063l7838A80951
$$ -39482 -301341 -312117 -145544 -31593 -25058 -242217 -35995 -311649 -44063 -81901 180951
10399A25870K9032h182l25731c5933D5497b25821F5078L2376B4748O6993l9832
$$ 125870 154902 -8182 -333913 -35933 45497 -225821 65078 97454 24748 91741 51909
10388E1909f8556B45261h1398A14585a39725k4820F4381C0168M4555b24865j03574
$$ 51909 -68556 245261 -81398 114585 -139725 -164545 64381 30168 74723 -224865 -328439
10377c28439A07865a10066A30959B5267c81692B18758H4354J68J2214D8317a14397
$$ -328439 107865 -110066 130959 25267 -381692 218758 84354 84522 96736 48317 -114397
10365a0926j78742A81963D5142L0318a33212B19554K7385C8997J43867J51068
$$ -10926 -189668 181963 45142 75460 -133212 219554 246939 38997 182864 333932
10355C33932A66190a07807B77132r3182K16341J37754p7262j73121J32522j58643
$$ 333932 166190 -107807 277132 183950 400291 538045 460783 287662 420184 261541
10345B61541A08952J91693K693m7715C299L27677j14683b99432A69420K21281
$$ 261541 108952 300645 303338 255623 3299 330976 216293 -299432 169420 390701
10335C90701k1296j28577N0647L36941B18403M7328K61350j69520H1016K3807
$$ 390701 369405 240828 291475 628416 218403 265731 527081 357561 81016 104823
10325A04823J84534j31363R0069l1851m8386J37367j14295N533B4986J13483a80693
$$ 104823 289357 157994 248063 216212 167826 305193 190898 196431 24986 138469 -180693
10313B08071l9053O5494J77889g5388a8524B71214b8460A1534K47875n4223E369
$$ 208071 169018 234512 412401 -75388 -18524 271214 -28460 11534 259409 205186 5369
10301A38187a83543C14701B6379P8056L0274A7623a08365c3467m2589p745j24147
$$ 138187 -183543 314701 26379 104435 134709 17623 -108365 -33467 -76056 -83801 -207948
10290b07948K132e3552k03454R5836b8723j90629J02069L3858b2167k78625A03692
$$ -207948 -205816 -53552 -257006 -161170 -28723 -219352 -117283 -83425 -22167 -300792 103692
10278a88366c4374A67909D2052a39290J9446A91108a26819A57721b9871j64854
$$ -188366 -34374 167909 42052 -139290 -119844 191108 -126819 157721 -29871 -194725
10268a94725B5288M6670J13138i6368F1772a60093I7589b41580B58846b1630j15537
$$ -194725 25288 71958 185096 -96368 61772 -160093 97589 -241580 258846 -21630 -137167
10257a37167A04616f9586k58905g5390j52548j9264c3628E9645c0033A06330d0322
$$ -137167 104616 -69586 -328491 -75390 -227938 -247202 -33628 59645 -30033 106330 -40322
10245A0456K2969P9542L12651H468K28944P2753a54922D6747J43299r2532h6120
$$ 10456 33425 112967 425618 8468 237412 310165 -154922 46747 190046 97514 -86120
10233C74457e05450a75068e0071B4311L2049O5339b81346C8570M6245f8594j80022
$$ 374457 -505450 -175068 -50071 24311 56360 121699 -281346 38570 84815 -68594 -248616
10222b48616A05221L594g6989C65664F2329d9861B86563B3920N3469b6260j05860
$$ -248616 105221 108815 -76989 365664 62329 -49861 286563 23920 77389 -26260 -132120
10211a32120B28869j08300b10864e3560a0527j28969M4752K8192b9971C8779a23584
$$ -132120 228869 120569 -210864 -53560 -10527 -139496 -94744 -66552 -29971 38779 -123584
10199B15617G819b74894M7360G0308l3313a20030A65565i7441B6505a09813K6706
$$ 215617 7819 -274894 -227534 70308 36995 -120030 165565 -97441 26505 -109813 -83107
10188h3107m2649N9838n2934r5723E2810b03915A74988D441c23335b2003k12624
$$ -83107 -125756 -65918 -118852 -214575 52810 -203915 174988 4441 -323335 -22003 -234627
10177b34627n3560d5894G0242J17684n5040b86271I6286C0225J50867b50203j4226
$$ -234627 -288187 -45894 70242 187926 132886 -286271 96286 30225 181092 -250203 -264429
10166b64429A33109e43585B5814a70621o5901c66B0180J66864a00477A4639J36623
$$ -264429 133109 -543585 25814 -170621 -236522 -366 20180 187044 -100477 14639 151262
10155A51262a00925j89054A22301J7414b02844c7137J5496A02930a55954j66298
$$ 151262 -100925 -289979 122301 139715 -202844 -37137 -21641 102930 -155954 -322252
10145c22252J21262A92300j3714b28475j38148A46660a84172o6644P0982A50618
$$ -322252 -200990 192300 178586 -228475 -366623 146660 -184172 -250816 -179834 150618
10134a76162j63374A47608J37163c06651O9668c1923J0918k82394A59394F0017
$$ -176162 -339536 147608 284771 -306651 -236983 -31923 -21005 -303399 159394 60017
10123a65788C6215a56633N5842j11096l4813A36292a26179C25729j44709i0642
$$ -165788 36215 -156633 -100791 -211887 -246700 136292 -126179 325729 181020 -90642
10112a31942N1704j0874B03931b43877g3046r4479E7888c0174I694j002a85609
$$ -131942 -80238 -91112 203931 -243877 -73046 -167525 57888 -30174 9694 8692 -185609
10100H2060a13381A75293a41315k62918r1970B62018j07431c85122J92532h2212
$$ 82060 -113381 175293 -141315 -404233 -496203 262018 154587 -385122 -192590 -82212
10089a20723j11114B67013G9989i2759E3772N6044D0722D164a23849N8654j23785
$$ -120723 -231837 267013 79989 -92759 53772 109816 40722 4164 -123849 -65195 -188980
10078a88980d2356j5202k5766C1860g1903A17766e1723B8450R072J04918b71708
$$ -188980 -42356 -57558 -83324 31860 -71903 117766 -51723 28450 37522 142440 -271708
10066c4009j75020g8573B3898J64867k9588b09329C5678b52309i6746A33674E5990
$$ -34009 -209029 -78573 23898 188765 159177 -209329 35678 -252309 -96746 133674 55990
10054b74781f3943A02384i710D2232M3178J05885r5152d8814l78562A42882R7238
$$ -274781 -63943 102384 -9710 42232 85410 191295 96143 -48814 -427376 142882 240120
10043B40120a0631l60961g748k10127A03530b90892J26655k1628i1394K6236n3795
$$ 240120 -10631 -371592 -7748 -217875 103530 -290892 -164237 -185865 -91394 -65158 -118953
10032a18953B60107b96379c4565j69936k33893g3056l8009F00180A06655a54801
$$ -118953 260107 -296379 -34565 -204501 -438394 -73056 -111065 600180 106655 -154801
10021e6638A73711n4534f1854l57892g6149j97605f1754j68500Q8672O9363m4758
$$ -56638 173711 119177 -61854 -419746 -76149 -273754 -61754 -230254 -141582 -72219 -116977
10010a16977j87362B47500g8830C4283a76980E15723b81749p2860R6265k8290
$$ -116977 -304339 247500 -78830 34283 -176980 515723 -281749 -354609 -258344 -286634
10000b86634P0072G6959e2287j61463a5416A12308d94407K36593g8936k68099
$$ -286634 -216562 76959 -52287 -213750 -15416 112308 -494407 -257814 -78936 -347035
9990c47035a16898q5848E0806a57797Q989j41209A1590a88482G1348e544n5433
$$ -347035 -116898 -202746 50806 -157797 -148808 -290017 11590 -188482 71348 -5544 -60977
9979f0977j01630q175q5551P2153m564E1096J0378e9705B48128C1163J37884a39484
$$ -60977 -162607 -170782 -256333 -184180 -188744 51096 61474 -59705 248128 31163 169047 -139484
9966B7030J21503a51614E4084a1919o3541p6611j35723H5631a11315c2595A42316
$$ 27030 148533 -151614 54084 -11919 -75460 -152071 -287794 85631 -111315 -32595 142316
9954d7684A02264O6804B8654a87861h8942A64444i8399m8195c4266l9951k27005
$$ -47684 102264 169068 28654 -187861 -88942 164444 -98399 -146594 -34266 -74217 -301222
9943c01222A69995b09968b5363A16213f074D5638b2750p4936M8682A00237c01440
$$ -301222 169995 -209968 -25363 116213 -6074 45638 -22750 -97686 -49004 100237 -301440
9931b57380f4455j30967d1651n5787j0546j02154O5447c2349j46337B40502d3140
$$ -257380 -64455 -195422 -41651 -97438 -107984 -210138 -144691 -32349 -178686 240502 -43140
9919F2177a966q8875J3209H2234C9585a84048A20009a22539D2887a01039D8568
$$ 62177 -1966 -90841 -77632 82234 39585 -184048 120009 -122539 42887 -101039 48568
9907C3645N5003a83711L4835j32540f0258A00158K6893d9933j08669M4041A5233
$$ 33645 88648 -183711 -148876 -281416 -60258 100158 127051 -49933 -158602 -114561 15233
9895a37348N2142l65j3923n1203C8854i0637B6881d1268A590a48710p1197a3052
$$ -137348 -85206 -85571 -99494 -150697 38854 -90637 26881 -41268 1590 -148710 -219907 -13052
9882b23265B50442M9857b7656j59928I4755o810e5050A43027a12354j45343A88036
$$ -223265 250442 300299 -27656 -187584 94755 87945 -55050 143027 -112354 -257697 188036
9870a45715e7077j60779B26100J37655b49057i6232k78177A48614a15550j98636
$$ -145715 -57077 -217856 226100 363755 -249057 -96232 -374409 148614 -115550 -314186
9860c14186b8603A69055b26962C7135a12710A56966a81442A61407b18321H6253
$$ -314186 -28603 169055 -226962 37135 -112710 156966 -181442 161407 -218321 86253
9849b77405A9331J03139f5611k25064a6760l11690D0706a89989j1618R8258J8562
$$ -277405 19331 122470 -65611 -290675 -16760 -328450 40706 -189989 -201607 -103349 -84787
9838h4787j53498C32456a18818q4662C7577b86056a15389n8873O6991m2453K1848
$$ -84787 -238285 332456 -118818 -203480 37577 -286056 -115389 -174262 -107271 -149724 -127876
9827a27876I8933m0117R3593E1214J19506e4447J6406A38584A9499d9978j01258
$$ -127876 98933 58816 152409 51214 170720 -54447 -38041 138584 19499 -49978 -151236
9816a51236A03186c05975A51454c11931I0186a17719j07297N9943n1688K0874
$$ -151236 103186 -305975 151454 -311931 90186 -117719 -225016 -165073 -216761 -195887
9806a95887J074K1732A83982a64082q8890h145E0362f8662A43700a80259l53233
$$ -195887 -194813 -173081 183982 -164082 -252972 -8145 50362 -68662 143700 -180259 -533492
9795e33492H4156a69751L9881D5299b20317k3739j33774D6315a5741m9851k2950
$$ -533492 84156 -169751 -129870 45299 -220317 -244056 -377830 46315 -15741 -65592 -88542
9784h8542e24l3776a5668C22513a78600h0042r3902q372D9387d4394j6644j63150
$$ -88542 -524 -34300 -15668 322513 -178600 -80042 -173944 -182316 49387 -44394 -61038 -224188
9772b24188C3662f5494A4486d3636m95746G8523J61554a74493J3086N7919j869
$$ -224188 33662 -65494 14486 -43636 -539382 78523 240077 -174493 -161407 -103488 -105357
9761a05357l0614D8715i9830A78764C4904R2971a65440M2142B7422J93830E4440
$$ -105357 -135971 48715 -99830 178764 34904 127875 -165440 -123298 27422 221252 54440
9749b04543N1889O3738m07357b16920A55926D6304a5894q4307C9442l454a13030
$$ -204543 -152654 -88916 -496273 -216920 155926 46304 -15894 -100201 39442 35988 -113030
9737a77106N1001K8471A02543b9236k79380J27990c1115j44383c335A59261M4320
$$ -177106 -126105 -97634 102543 -29236 -308616 -180626 -31115 -175498 -3335 159261 203581
9726B03581q0982P1680a94119F2861a79121O2269B050c61672i1648l21968a63938
$$ 203581 122599 194279 -194119 62861 -179121 -116852 2050 -361672 -91648 -413616 -163938
9714d43163J49120j08987G769b38829f1681C61966a58047a3358D4520h2474B62605
$$ -443163 -294043 -403030 7769 -238829 -61681 361966 -158047 -13358 44520 -82474 262605
9702b52936a7317l58921L7081E5132J17321b13920p3A62591f9576k86022A54121
$$ -252936 -17317 -376238 -339157 55132 172453 -213920 -213993 162591 -69576 -355598 154121
9690A57145a81609i661A7774b43913B01646a64883e1615A10297A5221a16403k5483
$$ 157145 -181609 -9661 17774 -243913 201646 -164883 -51615 110297 15221 -116403 -141886
9679a41886A40318a70074f3510a9978A73001b17570C63333a72902m3468M140g6045
$$ -141886 140318 -170074 -63510 -19978 173001 -217570 363333 -172902 -216370 -212230 -76045
9667A20059n9007a0118F3420a56898b2691m4895c3070j95437R6772A54820d3719
$$ 120059 61052 -10118 63420 -156898 -22691 -67586 -33070 -228507 -131735 154820 -43719
9655A97851h5916l82977I5612d2548q1709A96243q5172b58704o1504a19462K5523
$$ 197851 -85916 -468893 95612 -42548 -124257 196243 111071 -258704 -320208 -119462 -93939
9644i3939B9700J9604b45182d9113j12206H4815b26728A075a73000A72397a32563
$$ -93939 29700 49304 -245182 -49113 -161319 84815 -226728 1075 -173000 172397 -132563
9632b43312F312K75581c46702a45314l5543j40318a48806L7159A69213D9755a62088
$$ -243312 6312 281893 -346702 -145314 -180857 -321175 -148806 -111647 169213 49755 -162088
9620C43528d38515h745k57202F0095a63859a4580p3640j12828g9082N348j42946
$$ 343528 -438515 -8745 -265947 60095 -163859 -14580 -88220 -201048 -79082 -73734 -216680
9609b16680L6627M9523r4228A07891a67280E0120c37431A21557b28027Q1179B16578
$$ -216680 -180053 -130530 -224758 107891 -167280 50120 -337431 121557 -228027 -146848 216578
9597e9315D4152a20913N7639j01834k40651A29931b1851r7748B54665b30014J08654
$$ -59315 44152 -120913 -63274 -165108 -405759 129931 -21851 -119599 254665 -230014 -121360
9586a21360B81796A4132K83120e9298l03168e9220o0207c6236l96760i6241d7461
$$ -121360 281796 14132 297252 -59298 -362466 -59220 -119427 -36236 -432996 -96241 -47461
9574a74573b6911r9195N671n7604L7472B7218a17640l1159A94743a76617e5559
$$ -174573 -26911 -126106 -120435 -178039 -140567 27218 -117640 -148799 194743 -176617 -55559
9562A71618C2513b31810b1306h433k19811j39989C1950N6722O3591i8180j22968
$$ 171618 32513 -231810 -21306 -8433 -228244 -368233 31950 88672 152263 -98180 -221148
9551b21148H3788g9752C4668d3004l3411q825n1629A6078R1226b58316b4520p1589
$$ -221148 83788 -79752 34668 -43004 -76415 -85240 -136869 16078 107304 -258316 -24520 -96109
9539i6109j11983D0373i54m9307A26654D2745f7673J9899k49937C93464C7746
$$ -96109 -208092 40373 -954 -50261 126654 42745 -67673 -47774 -297711 393464 37746
9527c56119a7203F7324b08996a1671A09614b66034j8879A13935a81448N9984N8351
$$ -356119 -17203 67324 -208996 -11671 109614 -266034 -284913 113935 -181448 -121464 -63113
9516f3113F2614a81073P769A4800c81233c9781j13920j39758K1091a26671H790
$$ -63113 62614 -181073 -173304 14800 -381233 -39781 -153701 -293459 -272368 -126671 8790
9504h4871k28499C1015Q9156f3527k03794A90923n2081C2294i4823A20530c9670
$$ -84871 -313370 31015 120171 -63527 -267321 190923 138842 32294 -94823 120530 -39670
9492C28120j50366c29922a00912A1187c76026n6913a49895B24503A7707J39322
$$ 328120 177754 -329922 -100912 11187 -376026 -432939 -149895 224503 17707 157029
9482A57029B748a25674E059J67736a10975F5144g3900b162k11176H5274B7943
$$ 157029 2748 -125674 5059 172795 -110975 65144 -73900 -2162 -213338 85274 27943
9470b020j27661j56267C3694b58580N2287j51790C6944a17263d5567k05325d7014
$$ -2020 -129681 -285948 33694 -258580 -206293 -358083 36944 -117263 -45567 -250892 -47014
9458a33356j41898R0939m15B05875A64O4230j0723A0761D499f4625F8788b0976
$$ -133356 -275254 -184315 -184730 205875 164 64394 53671 10761 4499 -64625 68788 -20976
9445c72111g3782n8683b0929J807A63219J8093d1564k1608j7577j37031j2476
$$ -372111 -73782 -132465 -20929 -19122 163219 181312 -41564 -63172 -80749 -217780 -230256
9434b30256e8298l1437O578m4681F6138c69707H0382J24835c0376j53315k40514
$$ -230256 -58298 -89735 -83157 -127838 66138 -369707 80382 205217 -30376 -183691 -424205
9423d24205B06169h0292B4544a69173C4905P0040b38515R1065F1128Q7153b08603
$$ -424205 206169 -80292 24544 -169173 34905 104945 -238515 -147450 61128 148281 -208603
9411B2455J5136O880e6061B40238p8140B9215b61583d6261j56393A91935a55881
$$ 22455 37591 44471 -56061 240238 162098 29215 -261583 -46261 -202654 191935 -155881
9399A26207b38226c5583A27170a5371A31563A3598a27767A07398c25565J26516
$$ 126207 -238226 -35583 127170 -15371 131563 13598 -127767 107398 -325565 -199049
9389a99049M5763k40375f9932B09306f5792j30243K4664A0690f6616b954A28233
$$ -199049 -153286 -393661 -69932 209306 -65792 -196035 -171371 10690 -66616 -2954 128233
9377A56846m1428d2102G37K01487a77743j75537A94659n5686h1555j07325M7922
$$ 156846 115418 -42102 737 202224 -177743 -353280 194659 138973 -81555 -188880 -140958
9366a40958q1775d4320J4446C398b59542A25068a99095j41201C2511a77793Q155
$$ -140958 -222733 -44320 -29874 3398 -259542 125068 -199095 -340296 32511 -177793 -169638
9355a69638E5212b90465g3598A65383D1301p648J06919F0898c34486a64733f9448
$$ -169638 55212 -290465 -73598 165383 41301 33653 140572 60898 -334486 -164733 -69448
9343b25756h4520C3751a59090A5922b3638B706J00541d7050j53348G014c10819
$$ -225756 -84520 33751 -159090 15922 -23638 2706 103247 -47050 -200398 7014 -310819
9331D9364O8113l7862e9160b7496r3448b7466A4472b92064J31747F8172J12476
$$ 49364 117477 79615 -59160 -27496 -120944 -27466 14472 -292064 -160317 68172 180648
9320A80648J23218i7684q5869g543B0792e0155p1727k56221A89406a4314q3675
$$ 180648 303866 -97684 -183553 -7543 20792 -50155 -121882 -378103 189406 -14314 -97989
9309i7989C60228B7927R0628a43263B18618c3023A34780B6242L05951a09967A91957
$$ -97989 360228 27927 118555 -143263 218618 -33023 134780 26242 332193 -109967 191957
9297c37300A49948b33288P2177F3862L223b72737f3856Q98H6166J20120e20405
$$ -337300 149948 -233288 -161111 63862 67085 -272737 -63856 -62958 86166 206286 -520405
9285a4837E5950b94527A74755f210I454h2577j01610d3990j49354Q572j11553
$$ -14837 55950 -294527 174755 -6210 9454 -82577 -184187 -43990 -193344 -184772 -296325
9274b96325k7801a05308A20148J03289a98397F7911c39367b3915B1125A0048K5582
$$ -296325 -324126 -105308 120148 223437 -198397 67911 -339367 -23915 21125 10048 35630
9263C5630Q5706a15539C85026c2188o5924r8154j55700g5239I5342d6242k53555
$$ 35630 121336 -115539 385026 -32188 -98112 -196266 -351966 -75239 95342 -46242 -299797
9252b99797a6982A9912L4129a30387j24769B25307b01417i7767A63458a42551
$$ -299797 -16982 19912 54041 -130387 -255156 225307 -201417 -97767 163458 -142551
9241B1401K1189b3995E0640e4900A87022a91436p7089e4799j85467M5136g3493
$$ 21401 42590 -23995 50640 -54900 187022 -191436 -268525 -54799 -240266 -195130 -73493
9229b98202h132k46551N7275a3377o8129a2727k78907a975D4287a65082E1623
$$ -298202 -8132 -254683 -197408 -13377 -81506 -12727 -291634 -1975 44287 -165082 51623
9217b88407I118P7595h3325r1335b9875C9924P009L3498O8998a30517i882k8120
$$ -288407 9118 86713 -83325 -174660 -29875 39924 46933 80431 149429 -130517 -9882 -38002
9205c8002a6043p4649m545C6942g3484A6413a59916f45k2197j06395A80345a14844
$$ -38002 -16043 -90692 -95237 36942 -73484 16413 -159916 -645 -22842 -129237 180345 -114844
9192A39457b28478A24861K48713D2155j3517h8001I2091O0406C0875a20580j86823
$$ 139457 -228478 124861 373574 42155 28638 -88001 92091 152497 30875 -120580 -307403
9181c07403E4065b70652J33682c7472j50045E6788c32746c4627j07798m4183B55516
$$ -307403 54065 -270652 -136970 -37472 -187517 56788 -332746 -34627 -142425 -186608 255516
9169f1416k32123J05820A57439b64485H504a43448p539G04d05520d6740r2278
$$ -61416 -293539 -187719 157439 -264485 8504 -143448 -150987 704 -405520 -46740 -139018
9158a39018B42243b6159p5119r0215q5336A86182a51040A11855i8854c4060n90663
$$ -139018 242243 -26159 -101278 -191493 -276829 186182 -151040 111855 -98854 -34060 -624723
9147f24723K41716Q7430H5438L4695k0648Q2893a56644L1459C58098e2331A22070
$$ -624723 -383007 -295577 85438 120133 99485 182378 -156644 -125185 358098 -52331 122070
9135a15713N066c5314j2858j775k7200B10481a16191M8164k34670I0493c91158
$$ -115713 -110647 -35314 -48172 -49947 -77147 210481 -116191 -68027 -302697 90493 -391158
9123b83899a12126o390E0675a38016E9764J34010a04040A63736g4048j38244j40545
$$ -283899 -112126 -118516 50675 -138016 59764 193774 -104040 163736 -74048 -212292 -352837
9112c52837a35756A64165a71559B14974b76545p2212A55492J04875C4705i0814
$$ -352837 -135756 164165 -171559 214974 -276545 -348757 155492 260367 34705 -90814
9101I415a37196E0322K9674d05917J66313j40060a69715N7459A29750C7183c22256
$$ 9415 -137196 50322 79996 -405917 -239604 -379664 -169715 -112256 129750 37183 -322256
9089A41626P620a82727A58716f4895j66341F7872a07087M0336q434m1476C41606
$$ 141626 149246 -182727 158716 -64895 -231236 67872 -107087 -66751 -75185 -116661 341606
9077b31034a07169k7391L4409G6282B5260L9264a42576M6283a9105e211E8388
$$ -231034 -107169 -134560 -100151 76282 25260 64524 -142576 -96293 -19105 -5211 58388
9065A16752a88824B27441b04781D0973J11864h8951P196J9418q4517j34952a26843
$$ 116752 -188824 227441 -204781 40973 152837 -88951 -81755 -62337 -146854 -281806 -126843
9053A37111A1762a27464b9746A80264n0059i276D3328K39008a42354A74378a74130
$$ 137111 11762 -127464 -29746 180264 130205 -9276 43328 282336 -142354 174378 -174130
9041a27724E2230b97209B07601d914o3447m5043M2853F0965K52094A9003J20715
$$ -127724 52230 -297209 207601 -4914 -68361 -113404 -70551 60965 313059 19003 139718
9030A39718K14480j26146c94122J54632j92220a59357K1572d3081o2964j6052
$$ 139718 354198 228052 -394122 -239490 -431710 -159357 -137785 -43081 -106045 -122097
9020a22097A80377a74249H007b77115r3594A26736B4001a02587A3479b5615j44623
$$ -122097 180377 -174249 8007 -277115 -370709 126736 24001 -102587 13479 -25615 -170238
9009a70238j04682O3332L7045A19250K6473m2493K24907j07746d3103l49417I6268
$$ -170238 -274920 -211588 -174543 119250 145723 103230 328137 220391 -43103 -392520 96268
8997b02344L5514D9405b2865l2533C4080H511i2447G0814N301b30875d8623A74362
$$ -202344 -166830 49405 -22865 -55398 34080 8511 -92447 70814 76115 -230875 -48623 174362
8984D6257F110a05127c4123A85509C7305J08558b28892d8140n17516h1481m6117
$$ 46257 6110 -105127 -34123 185509 37305 145863 -228892 -48140 -565656 -81481 -127598
8973a27598n867a392C7843a10085e0562K4717l69463d470j24676k19864F1171
$$ -127598 -133465 -1392 37843 -110085 -50562 -25845 -395308 -4470 -129146 -349010 61171
8961c4434e039j0085B8596d7220A0510a11497M0679r687p2950H9957L6880b58424
$$ -34434 -5039 -15124 28596 -47220 10510 -111497 -70818 -80505 -153455 89957 126837 -258424
8948b34181M1889d6845j20953N8748I3730h5290A74017b5035B55071n7990j7658
$$ -234181 -192292 -46845 -167798 -109050 93730 -85290 174017 -25035 255071 197081 179423
8937A79423h5183J1742q926B2167f544E9457b39613A52788a39159A112f6733j5356
$$ 179423 -85183 -73441 -82367 22167 -6544 59457 -239613 152788 -139159 1112 -66733 -82089
8925h2089C113b8272E2250Q9180a52181B93853D6153e6496B10093a67569F6443
$$ -82089 3113 -28272 52250 141430 -152181 293853 46153 -56496 210093 -167569 66443
8913C45102c5917B02812E5694O8182K40765M5232K37798K05384J318181J869388
$$ 345102 -35917 202812 55694 123876 364641 409873 647671 853055 2171236 4040624
8903D040624L39617k065428p74885G23115k40874B39447b43982d6288B21893C6189
$$ 4040624 4380241 2314813 1539928 723115 482241 239447 -243982 -46288 221893 36189
8892I114N1011p452q951P6106C7694M4983N0631m3591O9639h3104k8941k7656
$$ 9114 60125 52673 43722 119828 37694 82677 133308 89717 159356 -83104 -112045 -139701
8880a39701N2311l39275a14477j33819H62J19363J20391a45661K4627j43500d893
$$ -139701 -87390 -426665 -114477 -248296 862 120225 240616 -145661 -121034 -264534 -4893
8868d9934k1986A8928b92447j17637C3069a00602k46351a71051A47263J49446
$$ -49934 -71920 18928 -292447 -410084 33069 -100602 -346953 -171051 147263 296709
8858B96709A00095J1309c49000a33170N8372B57958a19316a8244D7474b31762
$$ 296709 100095 111404 -349000 -133170 -74798 257958 -119316 -18244 47474 -231762
8847B0955a24204I5556a56387c3797D9596f4617p2332e2598m5986p147k1344A56448
$$ 20955 -124204 95556 -156387 -33797 49596 -64617 -136949 -52598 -98584 -105731 -127075 156448
$$ [...]
##END NTUPLES=NMR SPECTRUM
##END=
