
##TITLE=AC1108_Colombia_5867723_BWHFcMVOUX
##JCAMPDX= 6.0         $$ Bruker NMR JCAMP-DX V2.0
##DATA TYPE= NMR SPECTRUM
##DATA CLASS= NTUPLES
##ORIGIN= BRUKER
##OWNER= Administrator
$$ 1.72 TOPSPIN		Version 2.1
$$ 2012-03-30 23:41:15.234 -0500  Administrator@TOPSPIN
$$ Compression mode = diff/dup
##.OBSERVE FREQUENCY= 400.13188235
##.OBSERVE NUCLEUS= ^1H
##.ACQUISITION MODE= SIMULTANEOUS (DQD)
##.ACQUISITION SCHEME= undefined
##.AVERAGES= 8
##.DIGITISER RES= 22
##SPECTROMETER/DATA SYSTEM= spect
##.PULSE SEQUENCE= zg30
##.SOLVENT NAME= COFFEE_meoh
##.SHIFT REFERENCE= INTERNAL, COFFEE_meoh, 1, 14.98061
##AUDIT TRAIL= $$ (NUMBER, WHEN, WHO, WHERE, PROCESS, VERSION, WHAT)
$$ ##TITLE= Audit trail, TOPSPIN		Version 2.1
$$ ##JCAMPDX= 5.01
$$ ##ORIGIN= Bruker BioSpin GmbH
$$ ##OWNER= Administrator
$$ $$ C:\Bruker\TOPSPIN/data/COFFEE/nmr/AC1108_Colombia_5867723_BWHFcMVOUX/10/pdata/1/auditp.txt
$$ ##AUDIT TRAIL=  $$ (NUMBER, WHEN, WHO, WHERE, PROCESS, VERSION, WHAT)
(   1,<2012-03-30 23:41:08.250 -0500>,<Administrator>,<TOPSPIN>,<go>,<TOPSPIN 2.1>,
      <created by zg
	started at 2012-03-30 23:40:01.718 -0500,
	POWCHK enabled, PULCHK disabled,
       configuration hash MD5:
       1A 1E CE 29 27 FD 77 03 67 4E F0 E3 C4 B2 CB 90
       data hash MD5: 64K
       1B C0 42 33 D4 8B F2 05 2C D7 54 84 DF F1 FC CF>)
(   2,<2012-03-30 23:41:10.843 -0500>,<Administrator>,<TOPSPIN>,<proc1d>,<TOPSPIN 2.1>,
      <Start of raw data processing
       efp LB = 0 FT_mod = 6 PKNL = 1 PHC0 = 0 PHC1 = 0 SI = 32K 
       data hash MD5: 32K
       5D 00 B3 67 93 64 61 CA 10 B0 38 E4 2D 83 D5 3B>)
(   3,<2012-03-30 23:41:11.265 -0500>,<Administrator>,<TOPSPIN>,<proc1d>,<TOPSPIN 2.1>,
      <pk PHC0 = 208.8336 PHC1 = 0 
       data hash MD5: 32K
       B2 3F 0C 9A DD A5 52 BA 4C F2 AF 60 D3 86 81 05>)
(   4,<2012-03-30 23:41:11.359 -0500>,<Administrator>,<TOPSPIN>,<proc1d>,<TOPSPIN 2.1>,
      <abs ABSG = 1 
       data hash MD5: 32K
       D9 94 8B 04 41 DB F1 32 65 BC A7 D7 D3 28 C3 5F>)
(   5,<2012-03-30 23:41:11.390 -0500>,<Administrator>,<TOPSPIN>,<proc1d>,<TOPSPIN 2.1>,
      <abs ABSG = 2 
       data hash MD5: 32K
       75 DA 46 0C F2 C4 A9 4B BE FD 7E C3 8A 39 E2 66>)
(   6,<2012-03-30 23:41:11.421 -0500>,<Administrator>,<TOPSPIN>,<proc1d>,<TOPSPIN 2.1>,
      <abs ABSG = 3 
       data hash MD5: 32K
       27 D2 C6 CF 72 80 AB 13 81 68 DF 5B E7 DB 40 D4>)
(   7,<2012-03-30 23:41:11.453 -0500>,<Administrator>,<TOPSPIN>,<proc1d>,<TOPSPIN 2.1>,
      <abs ABSG = 4 
       data hash MD5: 32K
       79 3D 18 28 2D 70 06 4B 94 E8 01 D7 1A F8 99 7D>)
(   8,<2012-03-30 23:41:11.468 -0500>,<Administrator>,<TOPSPIN>,<proc1d>,<TOPSPIN 2.1>,
      <abs ABSG = 5 
       data hash MD5: 32K
       1B B8 F6 CA DA A4 3B CA 34 B5 9D 9C 5F C4 D2 D5>)
$$ ##END=
$$ 
$$ $$ hash MD5
$$ $$ B3 19 F6 C0 35 6B 08 C5 27 E7 89 5B A6 16 56 0A
##$RELAX= 
##$RELAX= 
##$RELAX= 
##$RELAX= 
##$RELAX= 
##$RELAX= 
##$RELAX= 
$$ Bruker specific parameters
$$ --------------------------
$$ [...]
150 150 150 150 150 150 150 150
##$TP07= 0
##$TPNAME0= <>
##$TPNAME1= <>
##$TPNAME2= <>
##$TPNAME3= <>
##$TPNAME4= <>
##$TPNAME5= <>
##$TPNAME6= <>
##$TPNAME7= <>
##$TPOAL= (0..7)
0.5 0.5 0.5 0.5 0.5 0.5 0.5 0.5
##$TPOFFS= (0..7)
0 0 0 0 0 0 0 0
##$TUNHIN= 0
##$TUNHOUT= 0
##$TUNXOUT= 0
##$USERA1= <user>
##$USERA2= <user>
##$USERA3= <user>
##$USERA4= <user>
##$USERA5= <user>
##$V9= 5
##$VALIST= <valist>
##$VCLIST= <CCCCCCCCCCCCCCC>
##$VD= 0
##$VDLIST= <DDDDDDDDDDDDDDD>
##$VPLIST= <PPPPPPPPPPPPPPP>
##$VTLIST= <TTTTTTTTTTTTTTT>
##$WBST= 2048
##$WBSW= 25
##$XGAIN= (0..3)
0 0 0 0
##$XL= 0
##$YL= 0
##$YMAX_a= 546071
##$YMIN_a= -665943
##$ZGOPTNS= <>
##$ZL1= 120
##$ZL2= 120
##$ZL3= 120
##$ZL4= 120
##$ABSF1= 14.98061
##$ABSF2= -5.57192
##$ABSG= 5
##$ABSL= 3
##$ALPHA= 0
##$AQORDER= 0
##$ASSFAC= 0
##$ASSFACI= 0
##$ASSFACX= 0
##$ASSWID= 0
##$AUNMP= <proc_prof1d_extract_pilot.lims>
##$AXLEFT= 0
##$AXNAME= <>
##$AXNUC= <1H>
##$AXRIGHT= 0
##$AXTYPE= 0
##$AXUNIT= <>
##$AZFE= 0.1
##$AZFW= 0.1
##$BCFW= 0
##$BC_mod= 0
##$BYTORDP= 0
##$COROFFS= 0
##$CY= 15
##$DATMOD= 1
##$DC= 0
##$DFILT= <>
##$DTYPP= 0
##$F1P= 0
##$F2P= 0
##$FCOR= 0.5
##$FTSIZE= 32768
##$FT_mod= 6
##$GAMMA= 0
##$GB= 0
##$INTBC= 1
##$INTSCL= 1
##$ISEN= 128
##$LB= 0
##$LEV0= 0
##$LPBIN= 0
##$MAXI= 10000
##$MC2= 0
##$MEAN= 0
##$ME_mod= 0
##$MI= 0
##$NCOEF= 0
##$NC_proc= -8
##$NLEV= 6
##$NOISF1= 0
##$NOISF2= 0
##$NSP= 0
##$NTH_PI= 0
##$NZP= 0
##$OFFSET= 14.98061
##$PC= 1
##$PHC0= 208.8336
##$PHC1= 0
##$PH_mod= 1
##$PKNL= yes
##$PPARMOD= 0
##$PPDIAG= 0
##$PPIPTYP= 0
##$PPMPNUM= 2147483647
##$PPRESOL= 1
##$PSCAL= 4
##$PSIGN= 0
##$PYNMP= <proc.py>
##$REVERSE= no
##$SF= 400.13
##$SI= 32768
##$SIGF1= 0
##$SIGF2= 0
##$SINO= 400
##$SIOLD= 32768
##$SPECTYP= <>
##$SREGLST= <1H.CDCl3>
##$SSB= 0
##$STSI= 32768
##$STSR= 0
##$SW_p= 8223.68421052632
##$SYMM= 0
##$S_DEV= 0
##$TDeff= 65536
##$TDoff= 0
##$TI= <>
##$TILT= no
##$TM1= 0
##$TM2= 0
##$TOPLEV= 0
##$USERP1= <user>
##$USERP2= <user>
##$USERP3= <user>
##$USERP4= <user>
##$USERP5= <user>
##$WDW= 1
##$XDIM= 32768
##$YMAX_p= 468159196
##$YMIN_p= -740256
##$CURPLOT= <Network HP LaserJet P1505>
##$CURPRIN= <$Network HP LaserJet P1505>
##$DFORMAT= <normdp>
##$LAYOUT= <+/1D_H.xwp>
##$LFORMAT= <normlp>
##$PFORMAT= <normpl>
##$SURQMSG= 1
$$ End of Bruker specific parameters
$$ ---------------------------------
##NTUPLES= NMR SPECTRUM
##VAR_NAME=  FREQUENCY,     SPECTRUM/REAL,   SPECTRUM/IMAG
##SYMBOL=    X,             R,               I
##VAR_TYPE=  INDEPENDENT,   DEPENDENT,       DEPENDENT
##VAR_FORM=  AFFN,          ASDF,            ASDF
##VAR_DIM=   32768,         32768,           32768
##UNITS=     HZ,            ARBITRARY UNITS, ARBITRARY UNITS
##FACTOR=    0.250966925370066, 1,           1
##FIRST=     8223.43324360095, -241515,      -54160
##LAST=      0,             153821,          -144546
##MIN=       0,             -740256,         0
##MAX=       8223.43324360095, 468159196,    0
$$ Real data points
##PAGE= N=1
##DATA TABLE= (X++(R..R)), XYDATA
$$ [...]
19555i1324E8725a34663k60150A25986a54995j43160f9839q3348H7557b68603
$$ -91324 58725 -134663 -394813 125986 -154995 -298155 -69839 -153187 87557 -268603
19544B3156g3723H1095d4769j14241A21075a39092j73884M3273b335m332A50222
$$ 23156 -73723 81095 -44769 -159010 121075 -139092 -312976 -269703 -2335 -6667 150222
19532C36411E6731c9041k06650Q0277b0446k07003C4720K60234a45231G2898a0977
$$ 336411 56731 -39041 -245691 -165414 -20446 -227449 34720 294954 -145231 72898 -10977
19520a53707m2546H2149J02214J03837f7571M96j01396j19907G709c20441f8729
$$ -153707 -196253 82149 184363 288200 -67571 -67075 -168471 -288378 7709 -320441 -68729
19508g3897k73862C27434a2931A9325a828B97232b3938J1937C4853Q5312i342
$$ -73897 -347759 327434 -12931 19325 -1828 297232 -23938 -12001 34853 120165 -9342
19496c1175j13627c4732q252A36321c59115b3735C00109F5229c1505A64084a52598
$$ -31175 -144802 -34732 -42984 136321 -359115 -23735 300109 65229 -31505 164084 -152598
19484A99145b11126R8211A55644d00955J92412j943a8418j64428M1901j26930
$$ 199145 -211126 -112915 155644 -400955 -208543 -210486 -18418 -182846 -140945 -267875
19474b67875a7841D281b26273B53088p3429q4202J49403a98585a5521j61612H7193
$$ -267875 -17841 4281 -226273 253088 179659 95457 244860 -198585 -15521 -177133 87193
19462a04310C88472A1725M0485J18371k1996M1664a87604N9243j03169a00059
$$ -104310 388472 11725 52210 170581 148585 190249 -187604 -128361 -231530 -100059
19451G624R8211a83398j75244A18264f6451D9398a29564d5202B100b65744j4072
$$ 7624 105835 -183398 -358642 118264 -66451 49398 -129564 -45202 2100 -265744 -279816
19440b79816A23366h109l40075D8887a44164c4400a4599G5759J18109h5622j39267
$$ -279816 123366 -8109 -348184 48887 -144164 -34400 -14599 75759 193868 -85622 -224889
19429b24889B57273E4818b72681e0929A01105J5641c1592A89840i7871A75914
$$ -224889 257273 54818 -272681 -50929 101105 116746 -31592 189840 -97871 175914
19418c8000j61135k64596b17953B4623J87008b47665a19327N0148H0433B317O4431
$$ -38000 -199135 -463731 -217953 24623 211631 -247665 -119327 -69179 80433 2317 66748
19407F6748d8257J2858R096l23692i4750A21862b8015A37538F7321d1976c243
$$ 66748 -48257 -35399 -26303 -349995 -94750 121862 -28015 137538 67321 -41976 -3243
19395D24478c82784B01261b93740f9003r5095Q0556B81010g8940A10939b30712
$$ 424478 -382784 201261 -293740 -69003 -164098 -83542 281010 -78940 110939 -230712
19384i7513j72952A20989a38631N4392j95773M6837A1839J69177d09051a16777
$$ -97513 -270465 120989 -138631 -84239 -280012 -233175 11839 181016 -409051 -116777
19373c17204q7691a16599j62459r9247E8151Q2559a02804c7434A99059B6622A0476
$$ -317204 -404895 -116599 -279058 -378305 58151 140710 -102804 -37434 199059 26622 10476
19361G3299i1367B2558h352k5193A30727b7125j06690C32191d80443J99500L8426
$$ 73299 -91367 22558 -8352 -33545 130727 -27125 -133815 332191 -480443 -280943 -242517
19350b42517e6592j3477m0605B11624q5875J4473m7247b5997k27965J2957O5540
$$ -242517 -56592 -70069 -110674 211624 125749 140222 92975 -25997 -253962 -241005 -175465
19339a75465o5572b1989j93678Q1068F2323e04895a6982j14670j048k46319h8239
$$ -175465 -241037 -21989 -215667 -134599 62323 -504895 -16982 -131652 -132700 -379019 -88239
19327A66610A445a4816l0488q5183B05765F2223J47124b76938r188C72722e0382
$$ 166610 1445 -14816 -45304 -130487 205765 62223 209347 -276938 -286126 372722 -50382
19315g2616D05676b15832P0820A08675l6547B0722g8879F8813a05651E8667P3937
$$ -72616 405676 -215832 -145012 108675 72128 20722 -78879 68813 -105651 58667 132604
19304A32604H39a30152A7964R0802a45480I2745B6622c14361H2410d07416G4362
$$ 132604 839 -130152 17964 108766 -145480 92745 26622 -314361 82410 -407416 74362
19292a96729c1979E298d4417k15671A94566a17998B33069H810a42294A24369e8565
$$ -196729 -31979 5298 -44417 -260088 194566 -117998 233069 8810 -142294 124369 -58565
19280a64768B61824A24752B3421a26148D3065J7869f8770r3649L3940A29357c8111
$$ -164768 261824 124752 23421 -126148 43065 60934 -68770 -162419 -128479 129357 -38111
19268d16916G5265J68206d13132C0656b43316i1670a3095j26526F8188B0492J87254
$$ -416916 75265 243471 -413132 30656 -243316 -91670 -13095 -139621 68188 20492 207746
19257B07746b36620C16550h9102j37015D01704A1014i4916o479A82273E6527a27195
$$ 207746 -236620 316550 -89102 -226117 401704 11014 -94916 -101395 182273 56527 -127195
19245c7845k03372Q7644o902o9313a09104p926A32458B884L17158c65139a54879
$$ -37845 -241217 -153573 -160475 -229788 -109104 -117030 132458 2884 320042 -365139 -154879
19233b88332C2897J5245K01815G4422c26033d1946A54878b8484A67826j1466Q9401
$$ -288332 32897 48142 249957 74422 -326033 -41946 154878 -28484 167826 156360 245761
19222B45761D0673b04963B6041J16114a65740a0858k67740J30899c1661k50839
$$ 245761 40673 -204963 26041 142155 -165740 -10858 -278598 -147699 -31661 -282500
19212b82500c0067A9410b56294k08337J16523J12255B78800a21207l9937A79933
$$ -282500 -30067 19410 -256294 -464631 -348108 -235853 278800 -121207 -161144 179933
19201g1699j41325d2425k70023J36559r6158b7640l7860o8172j52165B31015b48101
$$ -71699 -213024 -42425 -312448 -175889 -272047 -27640 -65500 -133672 -285837 231015 -248101
19189a35709A13116m7492h6615C6283e0563l26724A20655f8072K0515B86526b83594
$$ -135709 113116 65624 -86615 36283 -50563 -377287 120655 -68072 -47557 286526 -283594
19177B44251b500k74684A82340C6951j2358Q9094i3479A809g3089R076k8045I2274
$$ 244251 -2500 -277184 182340 36951 24593 113687 -93479 1809 -73089 -64013 -92058 92274
19164d7422A01274N30a42948H4320d1382C5981a75824P0200M7206k65475C24324
$$ -47422 101274 101804 -142948 84320 -41382 35981 -175824 -105624 -58418 -323893 324324
19152a60036A32255i4693D5415a27030L5202A0143J2478J33825d49719b05836
$$ -160036 132255 -94693 45415 -127030 -91828 10143 22621 156446 -449719 -205836
19141B65652I5388d15301A80283E6925c6525k06331A88143a15351A00252a95928
$$ 265652 95388 -415301 180283 56925 -36525 -242856 188143 -115351 100252 -195928
19130a48096f1418k04074E5582c11350H7998b35626c1189G0788J30620l8071a4486
$$ -148096 -61418 -265492 55582 -311350 87998 -235626 -31189 70788 201408 163337 -14486
19118i1419j3652k03978M949i0187K8876H1144M7963c44011A7434N2306a39841
$$ -91419 -105071 -309049 -304100 -90187 -61311 81144 129107 -344011 17434 69740 -139841
19106C7516d15804G7488P497h767k17193l014f8407B5959J07586i2308K114l63681
$$ 37516 -415804 77488 84985 -8767 -225960 -228974 -68407 25959 133545 -92308 -90194 -453875
19094d53875A24811E2703a63001B68413a52328A03466i2613j28967d2042E9416
$$ -453875 124811 52703 -163001 268413 -152328 103466 -92613 -221580 -42042 59416
19083F1897h4679k4404C936e2720Q519k00761B76557d8784j5746j43260B00897
$$ 61897 -84679 -109083 3936 -52720 -44201 -244962 276557 -48784 -64530 -207790 200897
19071A14542b39288A23913a54876A97410b4660o6142D578c98278A2382J42901
$$ 114542 -239288 123913 -154876 197410 -24660 -90802 4578 -398278 12382 155283
19061A55283a32901B8741a47730F5559a34149q9374a00548J8146a3228A19637
$$ 155283 -132901 28741 -147730 65559 -134149 -223523 -100548 -82402 -13228 119637
19050a11751j2653j17346Q5497b0786l2368K3036j25516m2890d6520j10423O6065
$$ -111751 -124404 -241750 -156253 -20786 -53154 -30118 -155634 -198524 -46520 -156943 -90878
19039i0878I5372b13464n0379d4199C1573Q8351J61526j01964F7781a6557A95659
$$ -90878 95372 -213464 -263843 -44199 31573 119924 281450 179486 67781 -16557 195659
19027a33095k35854B6367b4062k31669j4534C15032Q4936H0835C7854e8556p9469
$$ -133095 -368949 26367 -24062 -255731 -270265 315032 399968 80835 37854 -58556 -138025
19016a38025M1175A12481m0658Q2754J5877a89202B51631b47071B0944q504d45969
$$ -138025 -96850 112481 71823 154577 170454 -189202 251631 -247071 20944 12440 -445969
19004a24093j09848e5974B26589b18174J06706j41045H3504g8981A77061A9543
$$ -124093 -233941 -55974 226589 -218174 -111468 -252513 83504 -78981 177061 19543
18993b97867R6685C01560a92931r2742A67125A3511a24649A37940J4701h8112
$$ -297867 -201182 301560 -192931 -285673 167125 13511 -124649 137940 152641 -88112
18982E6261c41654i9670k00357C7907J58805q3016a15831B63908A07311a01378
$$ 56261 -341654 -99670 -300027 37907 196712 113696 -115831 263908 107311 -101378
18971b66396A42901c0900n1217K181k369B3786a6665I6157A5580J6109m829a80506
$$ -266396 142901 -30900 -82117 -79936 -82305 23786 -16665 96157 15580 31689 26860 -180506
18958a0189A8987b25997i1347c8264j73227j251A67885b84472G2542a50370O0424
$$ -10189 18987 -225997 -91347 -38264 -211491 -212742 167885 -284472 72542 -150370 -89946
18947h9946j95703E9641Q9471g1822A40960a93043b2188j02257A17734a01285
$$ -89946 -285649 59641 149112 -71822 140960 -193043 -22188 -124445 117734 -101285
18936B3956b62082i5187a1478k69368E6130d4643k58577B1876c46160Q4114a7417
$$ 23956 -262082 -95187 -11478 -280846 56130 -44643 -303220 21876 -346160 -262046 -17417
18924C03575a75271l5621k16038A20672a17123R56M4115p1322A17235a236j32553
$$ 303575 -175271 -210892 -426930 120672 -117123 -116167 -72052 -143374 117235 -1236 -133789
18913a33789G1856a57926O9805j14358j05334b9768o1950B21375J00290j25363
$$ -133789 71856 -157926 -88121 -202479 -307813 -29768 -91718 221375 321665 196302
18903A96302h8663L184j1843k83779b3259o3248E0861L21304a83688a6926A8308
$$ 196302 -88663 -85479 -97322 -381101 -23259 -86507 50861 372165 -183688 -16926 18308
18891b7304p3575j88861J28207p2302M8176A01479b78999A69922b53473B5326
$$ -27304 -100879 -289740 -161533 -233835 -185659 101479 -278999 169922 -253473 25326
18880c5850A39083c3459B8587L99255b61348k740B2119a58035B7679a47392N7391
$$ -35850 139083 -33459 28587 427842 -261348 -264088 22119 -158035 27679 -147392 -90001
18869i0001j20740e7460A63374a96556B6873J88588c95549G4302a04980Q397l171
$$ -90001 -210741 -57460 163374 -196556 26873 215461 -395549 74302 -104980 -96583 -99754
18858i9754j8269b4206l3198A81164c62350D46109I285a56191P6481q421q8665
$$ -99754 -118023 -24206 -57404 181164 -362350 446109 9285 -156191 -79710 -88131 -176796
18847a76796l4038k45760A33847d3468l09479N9588P1002h4501B22447a80209
$$ -176796 -210834 -456594 133847 -43468 -352947 -293359 -222357 -84501 222447 -180209
18836g9559j0466l78909I4437f0289r2856O9985L8803m2004A72764b26116B22450
$$ -79559 -90025 -468934 94437 -60289 -153145 -83160 -44357 -86361 172764 -226116 222450
18824c3037J4128q266j57538C93056f8045G5286J7218l9089g8266j77968D1348
$$ -33037 -18909 -27175 -184713 393056 -68045 75286 92504 53415 -78266 -256234 41348
18812a90830C5166b7616o640B8488J35682D8261J31423b42981i3324A87862B1463
$$ -190830 35166 -27616 -34256 28488 164170 48261 179684 -242981 -93324 187862 21463
18800a7970A14313b1671j8024C1717M559c5316A98254N1069h4078C2577e7820
$$ -17970 114313 -21671 -39695 31717 36276 -35316 198254 249323 -84078 32577 -57820
18788C0479J74418b07650g9685B62131d20563a56301j59627f7199F7723b01795
$$ 30479 204897 -207650 -79685 262131 -420563 -156301 -315928 -67199 67723 -201795
18777a51358M7606A93266a05150k5138A00619f9052A20684l2287a78493O5159
$$ -151358 -103752 193266 -105150 -130288 100619 -69052 120684 88397 -178493 -113334
18767a13334j85950B89977e4613k13031A47691a96371B3847a09659k7622M868
$$ -113334 -299284 289977 -54613 -267644 147691 -196371 23847 -109659 -137281 -132413
18757a32413N2804q6127l9835L4663j11493A04924b40237N6781K1116j27357g23
$$ -132413 -79609 -165736 -205571 -170908 -282401 104924 -240237 -183456 -162340 -289697 -723
18745A64867R8149J03320h8765j72358a08392P740k0014b4112j1665m5763A26301
$$ 164867 263016 366336 -88765 -261123 -108392 -100652 -120666 -24112 -35777 -81540 126301
18733E06219a4752p8695A77065k9746m4831d0936j82769B8570J88393H1209a26386
$$ 506219 -14752 -93447 177065 147319 102488 -40936 -223705 28570 216963 81209 -126386
18721A26113a42466A9631a07230A18813O5444a80286k2609A1827P2623b12976
$$ 126113 -142466 19631 -107230 118813 184257 -180286 -202895 11827 84450 -212976
18710a11159o847D7082K5080a35707k87392A9616J22199c1642A15956J0693a75796
$$ -111159 -118006 47082 72162 -135707 -423099 19616 141815 -31642 115956 126649 -175796
18698b37721R9439m8250d0262A27688J218a51794k9083G4148b4125I1032b67218
$$ -237721 -138282 -186532 -40262 127688 128906 -151794 -180877 74148 -24125 91032 -267218
18686f4706j58720j17527a27685j76809j4169h6974j11948A33552d68509A57770
$$ -64706 -223426 -340953 -127685 -304494 -318663 -86974 -198922 133552 -468509 157770
18675b00877j91746g9395L7831j99034C04210c8249c706j91923k26099G9309c18872
$$ -200877 -392623 -79395 -41564 -240598 304210 -38249 -3706 -195629 -421728 79309 -318872
18663a73980o1178f0922G7939a04659E6251a28001n9098B11417i8938D1027a17530
$$ -173980 -235158 -60922 77939 -104659 56251 -128001 -187099 211417 -98938 41027 -117530
18651a36384A96906c57927j75958F0857b11539l5949B7796L5162c3576k96619
$$ -136384 196906 -357927 -533885 60857 -211539 -247488 27796 62958 -33576 -330195
18641c30195c3867A22852h0896A56873b77527N1240m7658C75252a96306k0323
$$ -330195 -33867 122852 -80896 156873 -277527 -226287 -273945 375252 -196306 -216629
18631b16629C24204F8295a75209g6148C0505J7293P4986a00093A28445k4837i4497
$$ -216629 324204 68295 -175209 -76148 30505 47798 122784 -100093 128445 103608 -94497
18619c39051B12485i9497b4127E4441Q5738J6703g0253H7355g9232b0446j04953
$$ -339051 212485 -99497 -24127 54441 140179 156882 -70253 87355 -79232 -20446 -125399
18608a25399j22286c4433G9153a45814I7827A883J42008a85827H176K9492b12141
$$ -125399 -247685 -34433 79153 -145814 97827 1883 143891 -185827 8176 37668 -212141
18596C9261K42632c14934M2764a15805E013g4978B12723K7589a96522d5173p8129
$$ 39261 281893 -314934 -272170 -115805 5013 -74978 212723 240312 -196522 -45173 -123302
18585a23302a7565F4784m117L0599J5051l0944a68832P3647h588C2201J51650
$$ -123302 -17565 64784 60667 91266 106317 75373 -168832 -95185 -8588 32201 183851
18574A83851a66391P859C7686J266a74330e8319a5747q0368B2118J24402b69853
$$ 183851 -166391 -158532 37686 38952 -174330 -58319 -15747 -96115 22118 146520 -269853
18562i8995d6453k1698p308F3354d35321A24463b22871f7338k10005P5011B13942
$$ -98995 -46453 -68151 -75459 63354 -435321 124463 -222871 -67338 -277343 -202332 213942
18550A26130a40461q1630H781a99220l23373a20271A21628L048a40745H8007a23526
$$ 126130 -140461 -222091 8781 -199220 -522593 -120271 121628 124676 -140745 88007 -123526
18538a2795B03367h4573b1604j31759K9732H7907l1312a42096J9559A28937c5450
$$ -12795 203367 -84573 -21604 -153363 -123631 87907 56595 -142096 -122537 128937 -35450
18526F072J32624c09492a53472j7167b9858q9882j12691L7437A18143b37570k3697
$$ 6072 138696 -309492 -153472 -170639 -29858 -119740 -232431 -194994 118143 -237570 -261267
18515b61267j07153C3587b85870F3858a57517D6382a80272G7114K14464b14125
$$ -261267 -368420 33587 -285870 63858 -157517 46382 -180272 77114 291578 -214125
18504C9755O7992f3224I8820N1397c1902l47462A94465a8049A0814Q7343c70128
$$ 39755 107747 -63224 98820 150217 -31902 -379364 194465 -18049 10814 98157 -370128
18492A05718b22043R4924k5594B9369B040b05670A50239b44948e8144r451r3018
$$ 105718 -222043 -127119 -152713 29369 2040 -205670 150239 -244948 -58144 -67595 -160613
18481a60613l1117f3501k51369e5201j81200I6023K7650J0054R0140k9561a44774
$$ -160613 -191730 -63501 -314870 -55201 -236401 96023 123673 133727 223867 194306 -144774
18469A30320a30975k70933F2852k9530e9715j89535A46396d16558a85491f5851
$$ 130320 -130975 -401908 62852 33322 -59715 -249250 146396 -416558 -185491 -65851
18458b14063B49126k0943P7732a38610M935l419B56389O4137b8576g336A72883
$$ -214063 249126 228183 305915 -138610 -133675 -137094 256389 320526 -28576 -7336 172883
18446b72109m8753J58642c722j34751q5810R9705G6996j4137N542a25656j57816
$$ -272109 -320862 -162220 -3722 -138473 -224283 -124578 76996 62859 68401 -125656 -283472
18435b83472e9224A62410i3901k4109A16067h4418l519b4879E7695d00785A25795
$$ -283472 -59224 162410 -93901 -118010 116067 -84418 -87937 -24879 57695 -400785 125795
18423d66027A24706c13677N1256B18086c50883G0246P1325l7822o883c9476H5020
$$ -466027 124706 -313677 -262421 218086 -350883 70246 141571 103749 96866 -39476 85020
18411a82825J122a2621p9804j9424m8749k8377A27569a3375I7524a6488F7349
$$ -182825 -181703 -12621 -92425 -111849 -160598 -188975 127569 -13375 97524 -16488 67349
18399A0159a02555H499b54152D7748K05593c63617a57195E3812g970l2947E3873
$$ 10159 -102555 8499 -254152 47748 253341 -363617 -157195 53812 -7970 -40917 53873
18387b5555m3367A0978M317f0095C3325J40618e6668l777n0796l35046a28925
$$ -25555 -68922 10978 15295 -60095 33325 173943 -56668 -60445 -111241 -446287 -128925
18375a70781B39106c32243H069a37021I2379g5835O088C2137K13313K5890g7951
$$ -170781 239106 -332243 8069 -137021 92379 -75835 -69747 32137 245450 271340 -77951
18363a03059a5535C10330I3571b72F3121M4502f8188C3981K68699A2899a74143
$$ -103059 -15535 310330 93571 -272 63121 107623 -68188 33981 302680 12899 -174143
18351G7404K22945H2458l1742a45837A11177D9810B4645b09441D2495i2043o9753
$$ 77404 300349 82458 50716 -145837 111177 49810 24645 -209441 42495 -92043 -161796
18340a61796O7716o2678l3726C2190b53887c3104l04660A3159C128N1701a87656
$$ -161796 -94080 -156758 -190484 32190 -253887 -33104 -337764 13159 3128 54829 -187656
18328b54911H3789c34957A16732e808p500j53183C443L04887b22910j76798A21707
$$ -254911 83789 -334957 116732 -5808 -13308 -166491 3443 308330 -222910 -399708 121707
18316B5656b15880A25270b69155C08926c0582n0937k35523a2322j17042A00701
$$ 25656 -215880 125270 -269155 308926 -30582 -81519 -317042 -12322 -129364 100701
18305a71471e7762l70667f859N07r3780M9731k38550J26893j1713J0973C4048
$$ -171471 -57762 -428429 -6859 -6352 -100132 -50401 -288951 -162058 -173771 -162798 34048
18293A27389h6273G2472c40346g6010k19380K5266J13973F5969g0561b6060l3052
$$ 127389 -86273 72472 -340346 -76010 -295390 -270124 -156151 65969 -70561 -26060 -59112
18282e9112a1109E7944d09364B14191n6757a72539e9915K1528D6854i5419j07727
$$ -59112 -11109 57944 -409364 214191 157434 -172539 -59915 -38387 46854 -95419 -203146
18271b03146B6988I961a51552H8594j6609M3888b20727N9594c3581p5922I8952
$$ -203146 26988 9961 -151552 88594 71985 115873 -220727 -161133 -33581 -109503 98952
18259E1188K30353A3981N4697d078B1145P5803m4663a4483m71170l0558A40747
$$ 51188 281541 13981 68678 -4078 21145 96948 52285 -14483 -485653 -516211 140747
18247f9927F4980a05319m3565b3139A60655G0589c9128q0914C3883a56006f0040
$$ -69927 64980 -105319 -148884 -23139 160655 70589 -39128 -120042 33883 -156006 -60040
18235B11625e27980C59705j40460i2072b352j8433k26908A00755a14543q40C7560
$$ 211625 -527980 359705 219245 -92072 -2352 -20785 -247693 100755 -114543 -115383 37560
18223A46573i6453H7295l4299b05228A72654a41282A54007D150K74106d68195
$$ 146573 -96453 87295 52996 -205228 172654 -141282 154007 4150 278256 -468195
18212H4099J10805g6645j48806H9066b40664P9500C8623J96328a31741A92100
$$ 84099 194904 -76645 -225451 89066 -240664 -161164 38623 234951 -131741 192100
18201A60303d3308a0480o3602A21818l0120N516a04121q5216A62207a52915m760
$$ 160303 -43308 -10480 -74082 121818 91698 97214 -104121 -189337 162207 -152915 -157675
18190a57675f3591k51801J52646K5570B439a49876B38316j18017a57537k8702
$$ -157675 -63591 -315392 -162746 -137176 2439 -149876 238316 120299 -157537 -186239
18180a86239c3430k95538i1308k936m44078C90207D9817a01675j71170J36015
$$ -186239 -33430 -328968 -91308 -94244 -538322 390207 49817 -101675 -272845 -136830
18170a36830o8563K7258A40115c73790D04789e3447B6256j1366a97367A1181L55017
$$ -136830 -205393 -178135 140115 -373790 404789 -53447 26256 14890 -197367 11181 366198
18159C66198E9547c381A366i8475d0088C5846P1267B8750a98863j23425a54321
$$ 366198 59547 -3381 1366 -98475 -40088 35846 107113 28750 -198863 -322288 -154321
18147b77846R9943A06619i3936A81948a62987D8382J86856b09653I703i2129d1297
$$ -277846 -177903 106619 -93936 181948 -162987 48382 235238 -209653 9703 -92129 -41297
18135I4494P8739h6451l20899m8552B80672h8872K2526h454k0327k53396J39422
$$ 94494 173233 -86451 -407350 -455902 280672 -88872 -66346 -8454 -28781 -282177 -142755
18124a42755K0514b7612B22422a18263J7590I4897A0318O5205d02516B46351F6215
$$ -142755 -122241 -27612 222422 -118263 -100673 94897 10318 75523 -402516 246351 66215
18112b37485A01423b48665n2184a03653j43424K2437M9957A5411J17795a05354
$$ -237485 101423 -248665 -300849 -103653 -247077 -224640 -174683 15411 133206 -105354
18101E9835j0942J66416A1937a45375M7835j170F9880b97614A95919a47328A40976
$$ 59835 48893 215309 11937 -145375 -97540 -98710 69880 -297614 195919 -147328 140976
18089E0091J40191d5362F5692K53157a5241j43142l396a7734m0628j39307h2091
$$ 50091 190282 -45362 65692 318849 -15241 -158383 -161779 -17734 -58362 -197669 -82091
18077a6699l1037j16661a7860B18425a05745N1653B46019J8791d7667H4834D0450
$$ -16699 -47736 -164397 -17860 218425 -105745 -54092 246019 264810 -47667 84834 40450
18065f0316B47036p9025c14680A09485c15503A67367c98993i0837A36406I427
$$ -60316 247036 168011 -314680 109485 -315503 167367 -398993 -90837 136406 9427
18054a68982N9673I6893k3951a78611a4673A39008d350k05113D6704M5152B0069
$$ -168982 -109309 96893 72942 -178611 -14673 139008 -4350 -209463 46704 91856 20069
18042A1557c18587b2351m9565l4742o0005c9710G827K88769m4801j06878A4249
$$ 11557 -318587 -22351 -71916 -106658 -166663 -39710 7827 296596 251795 144917 14249
18030f3997B47255k4479a07573A24432N5594f9314B06477i1538b7103G9017h4139
$$ -63997 247255 222776 -107573 124432 180026 -69314 206477 -91538 -27103 79017 -84139
18018A30148a08849E3008c92038b1567A64419B0527e8440A27329l9110a5609A01654
$$ 130148 -108849 53008 -392038 -21567 164419 20527 -58440 127329 88219 -15609 101654
18006A05103g6227j29339F8414h7930k77835I675J6764b09196i8920J0212q3456
$$ 105103 -76227 -205566 68414 -87930 -365765 9675 26439 -209196 -98920 -88708 -172164
17995a72164C76284i9247b4441a1314r5051L4332B1681a88738p0104g6773b7579
$$ -172164 376284 -99247 -24441 -11314 -106365 -72033 21681 -188738 -258842 -76773 -27579
17983b33059A16238J84511a36511H9891N9169a56992A57761a34287N8089A10081
$$ -233059 116238 300749 -136511 89891 149060 -156992 157761 -134287 -76198 110081
17972a3220A23543C5028b32194A69572a45511j21323f3947j12272c5819F412a37507
$$ -13220 123543 35028 -232194 169572 -145511 -266834 -63947 -176219 -35819 6412 -137507
17960A37482M2603a13023d0796k40536I2656m868C2185a65654K8205L061c5925
$$ 137482 180085 -113023 -40796 -281332 92656 87788 32185 -165654 -137449 -134388 -35925
17948b49940Q4002I0383c1068D0723J21946a30868A77668a9767j07205c7061l34145
$$ -249940 -165938 90383 -31068 40723 162669 -130868 177668 -19767 -126972 -37061 -371206
17937c71206J43855f0370A48450a40098j28791A21124Q9264J4934b33912D0180
$$ -371206 -227351 -60370 148450 -140098 -268889 121124 210388 225322 -233912 40180
17926A18403e15537a62183A51175c81140b3038n1753J3527j51511D55456c8073
$$ 118403 -515537 -162183 151175 -381140 -23038 -74791 -61264 -212775 455456 -38073
17915a25594A7059d4313A44931G1834f1262C7251c8094G1853n537o408k9267K30057
$$ -125594 17059 -44313 144931 71834 -61262 37251 -38094 71853 66316 59908 30641 260698
17903B60698a2274D8012f3979n5977e1266j13238A55406i234A44204a02392A24001
$$ 260698 -12274 48012 -63979 -119956 -51266 -164504 155406 -9234 144204 -102392 124001
17891c6204a4836l8386l27300B57989a01878A09612i0900q819j45373J15230m5003
$$ -36204 -14836 -53222 -380522 257989 -101878 109612 -90900 -99719 -245092 -129862 -174865
17880a74865Q3884J3597j52480D3265b2282P379l88554A32756c13617d2753D8443
$$ -174865 -90981 -77384 -229864 43265 -22282 -14903 -403457 132756 -313617 -42753 48443
17868B02832F0698c6394F4920i6575I4837d17769B09484b09487F9553b089G4948
$$ 202832 60698 -36394 64920 -96575 94837 -417769 209484 -209487 69553 -2089 74948
17856A01934d0473A57966e6669B3792K18160F9793i7911l2089b2060j17425E6840
$$ 101934 -40473 157966 -56669 23792 241952 69793 -97911 -130000 -22060 -139485 56840
17844g508H3523a19697E5898f8823M956C482K69342F297a86529a5169K509C42220
$$ -7508 83523 -119697 55898 -68823 -63867 3482 272824 6297 -186529 -15169 -12660 342220
17831a3863q2368G8031J39012c9972A4186d7798G4513C3516a50132j53720B47596
$$ -13863 -96231 78031 217043 -39972 14186 -47798 74513 33516 -150132 -303852 247596
17819A81535D6211M4477b19819f6779K9103r3146M0137H8262J03323J95567a49070
$$ 181535 46211 90688 -219819 -66779 -37676 -130822 -90685 88262 191585 387152 -149070
17807h3199l52644a1029o1844B62857G8741b9733A45548a98327o166C6446J104
$$ -83199 -435843 -11029 -72873 262857 78741 -29733 145548 -198327 -204493 36446 37550
17796C7550b17750B8070J1394J3488J59838H33a65741c5849E6943a42332A00445
$$ 37550 -217750 28070 39464 52952 212790 833 -165741 -35849 56943 -142332 100445
17784A16240P5630i9659k71675D2600J83741m185b94673C01433b32753B34644
$$ 116240 191870 -99659 -371334 42600 226341 222156 -294673 301433 -232753 234644
17773c6398r4202E4153d0310A61365K49187b34717a5510B670K15632b55966A84585
$$ -36398 -130600 54153 -40310 161365 410552 -234717 -15510 2670 218302 -255966 184585
17761g531k59825B73267f8544A21735J52733d3815D6a2094J348A02023a91176
$$ -7531 -267356 273267 -68544 121735 274468 -43815 46 -12094 -10746 102023 -191176
17749G0300K72102b35394C8927P2870b71984A23842h4728m3448B14201a77878
$$ 70300 342402 -235394 38927 111797 -271984 123842 -84728 -128176 214201 -177878
17738a17540e2826j24998a111j02541e1297o1611A32040a31650C594K56699g8254
$$ -117540 -52826 -177824 -1111 -103652 -51297 -112908 132040 -131650 3594 260293 -78254
17726a28641d3164k50392A11523a62242E5237J57159k5549B1385K34567o6515
$$ -128641 -43164 -293556 111523 -162242 55237 212396 186847 21385 255952 189437
17716A89437P0927q3334K3065c2512k4078a9430B21850j10582d9870j70548L9096
$$ 189437 260364 177030 200095 -32512 -56590 -19430 221850 111268 -49870 -220418 -181322
17705a81322C9069g5988D167a89099j26225J44282C4223J61201b00321G89R9141
$$ -181322 39069 -75988 4167 -189099 -315324 -171042 34223 195424 -200321 789 99930
17694I9930K0786c6731j46733R1006c0130p1735C9625h9264A45357c5964j07733
$$ 99930 120716 -36731 -183464 -92458 -30130 -101865 39625 -89264 145357 -35964 -143697
17683a43697e7259J9236m9629C45552I2097a95865b6758q0298j58417A07599L36573
$$ -143697 -57259 -38023 -87652 345552 92097 -195865 -26758 -107056 -265473 107599 444172
17672D44172i0644A98975e0917J5870A21018m8324C4318M42819A41912B9781a26403
$$ 444172 -90644 198975 -50917 -35047 121018 72694 34318 477137 141912 29781 -126403
17660I4894c6668B18615j7122j1247a94070D13316A7474N7886a95172B43621J4551
$$ 94894 -36668 218615 201493 190246 -194070 413316 17474 75360 -195172 243621 258172
17649B58172a37705H4070l1329a48084C46939H2429a3099A77524a04298j13606
$$ 258172 -137705 84070 52741 -148084 346939 82429 -13099 177524 -104298 -217904
17639b17904d7244j4926j0845I7460K40582j23421a13851e1109B70775c234k7264
$$ -217904 -47244 -62170 -73015 97460 338042 214621 -113851 -51109 270775 -3234 -30498
17628c0498r7864d2922B05045p6954j8693m5795a98721A50172G0673a65690A83684
$$ -30498 -128362 -42922 205045 128091 109398 63603 -198721 150172 70673 -165690 183684
17616i8329B80374d7339C3310g1239A28093o2995O4085A9366i4819B66997D4248
$$ -98329 280374 -47339 33310 -71239 128093 65098 129183 19366 -94819 266997 44248
17604F7695L3356N5575c95957b8246j77430f1454j04496B20101a32492e9816G2872
$$ 67695 101051 156626 -395957 -28246 -205676 -61454 -165950 220101 -132492 -59816 72872
17592A63746L5296g2699k0612j61254A67514b11170R4996B6797J42357K11383
$$ 163746 199042 -72699 -93311 -254565 167514 -211170 -116174 26797 169154 380537
17582C80537n706a7432A76288g4057Q616C46984F1418f3226q8218A69831G8143
$$ 380537 374831 -17432 176288 -74057 -65441 346984 61418 -63226 -151444 169831 78143
17570A23477a87936N2522B53002D5189J31686a24682A15442g5469n260C13094
$$ 123477 -187936 -135414 253002 45189 176875 -124682 115442 -75469 -80729 313094
17559a51074q2588E7937c5853K000e788H9828Q4564j6059E8980c8859o6406a4513
$$ -151074 -233662 57937 -35853 -33853 -5788 89828 174392 158333 58980 -38859 -105265 -14513
17546A28676b25583B48893b8759I7892m6829g2563A2575a80166m9343R1930k16411
$$ 128676 -225583 248893 -28759 97892 51063 -72563 12575 -180166 -229509 -137579 -353990
17535c53990B80182j14754a24747F9607K598J24745R1877h0463n6325D4957R2139
$$ -353990 280182 165428 -124747 69607 72205 196950 288827 -80463 -136788 44957 137096
17524A37096A8368Q8256a94743d1174A1851f5660A99296b03507B6440j0655P832
$$ 137096 18368 106624 -194743 -41174 11851 -65660 199296 -203507 26440 15785 23617
17513B3617c2156C24169d8220G3800J14251E9706L26100j26002E1873L2607f3283
$$ 23617 -32156 324169 -48220 73800 188051 59706 385806 259804 51873 84480 -63283
17501C04406B2189F910i776A19092E6716a50988c2200D08145b42412A65600L3022
$$ 304406 22189 6910 -9776 119092 56716 -150988 -32200 408145 -242412 165600 198622
17490A98622K8734m8767R3853a17323A58035F2400K26872B7457K06028a22453
$$ 198622 227356 178589 272442 -117323 158035 62400 289272 27457 233485 -122453
17479C79592A86240H2267J01917A4203a4204j28525A21421J09225a6429A8025
$$ 379592 186240 82267 184184 14203 -14204 -142729 121421 230646 -16429 18025
17468a37602A15203J86896o4434K30349j62181g486j85109f7271k16110A29551
$$ -137602 115203 302099 237665 468014 305833 -7486 -192595 -67271 -283381 129551
17457A36099a03817C93834c5677l1737A66635k6021e9150B35958E6959J18624
$$ 136099 -103817 393834 -35677 -67414 166635 140614 -59150 235958 56959 175583
17447A75583H6482J86819A29936f7422m1174A94798n7978l3044K98853l2089l1489
$$ 175583 86482 273301 129936 -67422 -108596 194798 136820 103776 402629 370540 339051
17436C39051Q1111B07873n617J81875G0222j8720J24580o7776J81351l9588p7184
$$ 339051 420162 207873 202256 384131 70222 51502 176082 108306 289657 250069 172885
17425A72885K90910j93115k0587n7252M8034K51091A33924L86144h5846C04707
$$ 172885 463795 270680 250093 192841 240875 491966 133924 520068 -85846 304707
17414a65141A16605L71236i0085C44443o9056n9885d9231a553D80440k20113C1503
$$ -165141 116605 487841 -90085 344443 275387 215502 -49231 -1553 480440 260327 31503
17402A73540K65671M1414j46593D450Q5625L36392B02686n6999a2743D48727A63625
$$ 173540 439211 480625 334032 4450 90075 426467 202686 145687 -12743 448727 163625
17390A29903O1025J50469A03450d6538B06118C8772c6583p3516B29827B6089K27206
$$ 129903 190928 341397 103450 -46538 206118 38772 -36583 -110099 229827 26089 253295
17379B53295q2401L50906e4048C17266H3401N366j8548a2709B09770a02528C2561
$$ 253295 170894 521800 -54048 317266 83401 88767 70219 -12709 209770 -102528 32561
17367B12595a64018p952B50318b0528k87617c9869D06630a91581c0106n0114A93064
$$ 212595 -164018 -171970 250318 -20528 -308145 -39869 406630 -191581 -30106 -80220 193064
17355e2481B38580A9290K39418F5887Q265J04967c6689C11083c26523A18711a13744
$$ -52481 238580 19290 258708 65887 74152 179119 -36689 311083 -326523 118711 -113744
17343B30009d3139A87076f0503G2759K74211j70064H3047a1251E488b4888C20362
$$ 230009 -43139 187076 -60503 72759 346970 176906 83047 -11251 5488 -24888 320362
17331D0491J96558N818b53337h5466A31188K46391A59536a01352b7943A01108
$$ 40491 237049 242867 -253337 -85466 131188 377579 159536 -101352 -27943 101108
17320H2722n895c30580A4631J36992J52990A39936Q0493D3195K91622M2040a57193
$$ 82722 76827 -330580 14631 151623 304613 139936 220429 43195 334817 376857 -157193
17308g1288A95653m8351M45125c6207B4944a07695D54108A9384r121L45131a89387
$$ -71288 195653 147302 592427 -36207 24944 -107695 454108 19384 10263 355394 -189387
17296A41434b2788j89275D22055m4321F4559J85234F2190N1022L318K65880A84248
$$ 141434 -22788 -212063 422055 377734 64559 249793 62190 113212 116530 382410 184248
17284e0688I4462l8562J45260a54880B98568g6472b6319A64753a98244B34818
$$ -50688 94462 55900 201160 -154880 298568 -76472 -26319 164753 -198244 234818
17273a08498D92283D0330Q3177K87886c2983A09965J23833J86079k08905r7253
$$ -108498 492283 40330 123507 411393 -32983 109965 233798 419877 210972 113719
17263A13719b1216B66964D0886P696c911B33044R0543c3189A11909g417k03132
$$ 113719 -21216 266964 40886 48582 -3911 233044 323587 -33189 111909 -7417 -210549
17252b10549B18409k2884n2788r597K43254B9353J93248m7729J78239r4923J14294
$$ -210549 218409 195525 142737 133140 376394 29353 222601 174872 353111 258188 372482
17241C72482c7227A94952a02164A90771K8396J59069A84162R5864p2378J98544
$$ 372482 -37227 194952 -102164 190771 219167 378236 184162 280026 207648 406192
17231D06192J55755a48472C75672A31979R7003K35967L7829b60972a21705A86930
$$ 406192 561947 -148472 375672 131979 228982 464949 502778 -260972 -121705 186930
17220C02991i4091A81765c7886B38597n4523L59191A54912C4135L96562F5311
$$ 302991 -94091 181765 -37886 238597 184074 543265 154912 34135 430697 65311
17209C41194g227A91489l8152f1687d562B99218J9872N4212o4456r8226G8886
$$ 341194 -7227 191489 153337 -61687 -4562 299218 319090 373302 308846 210620 78886
17197B05543K17225h98B54468J59063m7227k9493l5915j17605J8372K63520a57156
$$ 205543 422768 -898 254468 413531 366304 336811 300896 183291 201663 465183 -157156
17185B02784H7695q286a2651C34541A45771L03895j84310m1215H0713O2216J79340
$$ 202784 87695 79409 -12651 334541 145771 449666 265356 224141 80713 142929 322269
17174C22269H3073j7120L98762A57378o7800N7502k6946K44737A44529a3013B07512
$$ 322269 83073 65953 464715 157378 89578 147080 120134 364871 144529 -13013 207512
17162B11035a231B37347f9715A53767o1130J4476J21145K11308j58338Q5927L5320
$$ 211035 -1231 237347 -69715 153767 92637 107113 228258 439566 281228 367155 402475
17151D02475A08808K93544q3738A27884K29672F9127J38831a54590D61508a09653
$$ 402475 108808 402352 318614 127884 357556 69127 207958 -154590 461508 -109653
17140E68117m0245k51519j05887J57722l1492K01029A36203B1354J1776M02574
$$ 568117 527872 276353 170466 328188 296696 497725 136203 21354 33130 435704
17130D35704j08567m6097J85469F9674C0130L22066J4301j71771J51825j00796
$$ 435704 327137 281040 466509 69674 30130 352196 366497 194726 346551 245755
17120B45755E650K14725e9711E13237b27863F20242l01684L14762D9544O6904
$$ 245755 5650 220375 -59711 513237 -227863 620242 318558 633320 49544 116448
17110A16448M23222H9345L88024H9299J58816K77462k00958m5993k6137K37039
$$ 116448 539670 89345 477369 89299 248115 525577 324619 278626 252489 489528
17100D89528j48522j05225J19201j15317l320L03859B35072l7542h2276D73592
$$ 489528 341006 235781 354982 239665 236345 540204 235072 197530 -82276 473592
17089B32622L7281G5327J52617b2690B17998R1562H1596K46776P1496p2303J32220
$$ 232622 269903 75327 227944 -22690 217998 309560 81596 328372 399868 327565 459785
17078D59785P0196A45076K69075p5291L2813k683o3111Q0017J02930j31470k3641
$$ 459785 529981 145076 414151 338860 371673 368990 305879 385896 488826 357356 333715
17067C33715Q2029j18544J395A45721K43672p0267F4709N15215B08258J95171
$$ 333715 415744 297200 298595 145721 389393 319126 64709 579924 208258 403429
17057D03429j48231I7776J71125M64751J39078k51851o370q8479R9322j51878
$$ 403429 255198 97776 268901 733652 872730 620879 614509 526030 625352 473474
17047D73474m6779j79133L60658B97314L16014B12790J19943J52552k2126p6228
$$ 473474 426695 247562 608220 297314 613328 212790 332733 485285 463159 386931
17037C86931K13569J59226k67278J3003L08M42998B43991J25522K63336k51460
$$ 386931 600500 759726 492448 505451 505759 948757 243991 369513 632849 381389
17027C81389K27228j91871r6600M74655B38880M36479P0827k53719j13101L81211
$$ 381389 608617 416746 320146 794801 238880 675359 746186 492467 379366 760577
17017G60577j34920k52902L18891n3703A75388L19148O109j04344J55553j34934
$$ 760577 625657 372755 691646 637943 175388 494536 500645 396301 551854 416920
17007D16920J4484q406L90939k34460n1902K48K17801l1256o9203R6819k35832
$$ 416920 431404 422998 813937 579477 527575 527823 745624 714368 645165 741984 506152
16996E06152P2947j60329L80494p363j77625J1010O8178O5580j0372B48428M77515
$$ 506152 579099 418770 799264 791901 614276 625286 693464 759044 748672 248428 725943
16985G25943C40085M41607k76809J50057M8677k31641L51799l93749O57766l62912
$$ 725943 340085 781692 504883 654940 703617 471976 823775 430026 1087792 724880
16975G24880k27660K20577r7856j1461L77788C97011r645J45560L7416P8368J3229
$$ 724880 497220 717797 619941 608480 986268 397011 387366 532926 570342 648710 661939
16964F61939k52219N88762l39802j55425O4932K42659C87401L51687k8473l09178
$$ 661939 409720 998482 658680 503255 568187 810846 387401 739088 710615 401437
16954D01437M43894j24770J45906k76998L32802j37738q0163J85332L4494J56624
$$ 401437 845331 720561 866467 589469 922271 784533 704370 889702 924196 1080820
16944A080820l85842L6826M37968n55436K65594K13123J76828m19134J05938m60346
$$ 1080820 694978 731804 1169772 614336 879930 1093053 1269881 850747 956685 496339
16934D96339J79917J36391L04128j04232l81012L12863L4568j29358K05862k25503
$$ 496339 676256 812647 1116775 1012543 631531 944394 978962 849604 1055466 829963
16924H29963O8768j40799L95082J2078r326k44497J64776K23652n3121l56780
$$ 829963 898731 757932 1153014 1165092 1155766 911269 1076045 1299697 1246576 889796
16914H89796K93177j288o5743j24397J76701o9462j30181J28794K55664k39221
$$ 889796 1182973 1181685 1115942 991545 1168246 1098784 968603 1097397 1353061 1113840
16904A113840r0661K49363n31035M99495K38758N197l65431j6492o60K26006k15917
$$ 1113840 1023179 1272542 741507 1241002 1479760 1484957 1119526 1103034 1102374 1328380 1112463
16893A112463N35485l78577M31005k51536J51446m03589K57860k53651K65770
$$ 1112463 1647948 1269371 1700376 1448840 1600286 1196697 1454557 1200906 1466676
16884A466676J58500q8589J36264n1393K50906k62868J76014j55587Q6845k43939
$$ 1466676 1625176 1536587 1672851 1621458 1872364 1609496 1785510 1629923 1716768 1472829
16874A472829L95573l15556L594J82086r7324M30843l84352K21123j38096K13244
$$ 1472829 1868402 1552846 1556440 1738526 1641202 2072045 1687693 1908816 1770720 1983964
16864A983964m2997j54163N07766n28860L99159k96501M63436l91301J22675K69708
$$ 1983964 1940967 1786804 2294570 1765710 2164869 1868368 2331804 1940503 2063178 2332886
16854B332886r9669k49092N40426k01814K82718k77639n0421K85362K1820j3557
$$ 2332886 2233217 1984125 2524551 2322737 2605455 2327816 2277395 2562757 2584577 2571020
16844B571020K13954j25252J32541k04661J63779O5236j24262Q3058L8446J09215
$$ 2571020 2784974 2659722 2792263 2587602 2751381 2816617 2692355 2775413 2813859 2923074
16834B923074L42934k57501K08238J0157k0792k35983K02788L12698k20533J25845
$$ 2923074 3266008 3008507 3216745 3226902 3206110 2970127 3172915 3485613 3265080 3390925
16824C390925j1910l94128O82749n7712m7166M20228l40201K95248k42540L29422
$$ 3390925 3379015 2984887 3667636 3609924 3562758 3982986 3642785 3938033 3695493 4024915
16814D024915N26760n35524K82908j46551J21437M12926k76102J65485j15308
$$ 4024915 4551675 4016151 4299059 4152508 4273945 4686871 4410769 4576254 4460946
16805D460946M06004J51825j56363L27076J1791M32693l97620J43373K02363r3446
$$ 4460946 4866950 5018775 4862412 5189488 5201279 5633972 5236352 5379725 5582088 5488642
16795E488642K14642J92249L49926o3873K65504K95603j36704K74791m7455N06412
$$ 5488642 5703284 5895533 6245459 6181586 6447090 6742693 6605989 6880780 6833325 7339737
16785G339737j25300J4762N30489M05128j80107N49493j15383J64335K08199M67633
$$ 7339737 7214437 7229199 7759688 8164816 7984709 8534202 8418819 8583154 8791353 9258986
16775I258986L40145K11153R2906M91373O6899K26351L10924L09369P94084k0677
$$ 9258986 9599131 9810284 9903190 10394563 10461462 10687813 10998737 11308106 12102190 12081513
16765A2081513K67036M04701N53632M57546L63568N81243N33856M40401K73234
$$ 12081513 12348549 12753250 13306882 13764428 14127996 14709239 15243095 15683496 15956730
16756A5956730O60717O15337N61668Q01269P45944N15084J020208Q46055Q12222
$$ 15956730 16617447 17232784 17794452 18595721 19341665 19856749 20876957 21723012 22535234
16747B2535234Q66984P69540J469604J096392Q44472J476976J412379J394511
$$ 22535234 23402218 24171758 25641362 26737754 27582226 29059202 30471581 31866092
16739C1866092J392955J675695J427431K164158J761782J864209K145316K596438
$$ 31866092 33259047 34934742 36362173 38526331 40288113 42152322 44297638 46894076
16731D6894076K424378K907406K992440L166165L192232L873396L789492M216755
$$ 46894076 49318454 52225860 55218300 58384465 61576697 65450093 69239585 73456340
16723G3456340M406210N238467N152761N614193N632878O556233P065199P458888
$$ 73456340 77862550 83101017 88253778 93867971 99500849 106057082 113122281 120581169
16715A20581169P661441Q120200P914222Q551724Q558712Q513732Q876365P910120
$$ 120581169 128242610 136362810 144277032 152828756 161387468 169901200 178777565 186687685
16707A86687685P673172O901750N974353M930484L675039J854669Q9226j501708
$$ 186687685 194360857 201262607 207236960 212167444 215842483 217697152 217786378 216284670
16699B16284670k641573m537188n219645p187832p675913q314353q575437q673932
$$ 216284670 213643097 209105909 203886264 196698432 189022519 180708166 172132729 163458797
16691A63458797r054531q661320q662323q445423p894478p224501p343031o613294
$$ 163458797 154404266 145742946 137080623 128635200 120740722 113516221 106173190 99559896
16683I9559896o066361o278280n461803m909824m656738m550180l640820m197025
$$ 99559896 93493535 87215255 81753452 76843628 72186890 67636710 63995890 59798865
16675E9798865l669115l026167k713096l233391k367810k334978k229055k170376
$$ 59798865 56129750 53103583 50390487 47157096 44789286 42454308 40225253 38054877
16667C8054877j889174j888064j571646j530721j506336j058396j253925r70668
$$ 38054877 36165703 34277639 32705993 31175272 29668936 28610540 27356615 26385947
16659B6385947j337653j542052n19954r64064j172055l58457r03997p60379r76833
$$ 26385947 25048294 23506242 22986288 22022224 20850169 20491712 19587715 18827336 17850503
16650A7850503j01875q87785n39007o70168m79544p30416o65816n02652J51245
$$ 17850503 17748628 16860843 16321836 15651668 15172124 14441708 13775892 13273240 13424485
16641A3424485q27264l550o05522m19275j77902n29565j28036l91804m00626m77694
$$ 13424485 12597221 12593671 11988149 11568874 11390972 10861407 10733371 10341567 9940941 9463247
16631I463247K53887o72744n82156K08420j6876k12318n76004m28358k90973Q2485
$$ 9463247 9717134 9044390 8462234 8670654 8653778 8441460 7865456 7437098 7146125 7228610
16621G228610R7977j88297j2280k91968k76837k88300l73257K981j672l71694
$$ 7228610 7326587 7138290 7126010 6834042 6557205 6268905 5895648 5898629 5896957 5525263
16611E525263k47193K18351R890n94154L21618k85872j24494l05507N2966M4768
$$ 5525263 5278070 5496421 5506311 4912157 5233775 4947903 4823409 4517902 4570868 4615636
16601D615636R0340m67203K18921l16504j59334J00310k51952j12234j33570K22698
$$ 4615636 4705976 4238773 4457694 4141190 3981856 4082166 3830214 3717980 3584410 3807108
16591C807108l57451L46225n5776k66250k28376L5369J08534k83038j77282L35617
$$ 3807108 3449657 3795882 3740106 3473856 3245480 3280849 3389383 3106345 2929063 3264680
16581C264680l18966j17093j03480J57327q6080m5402M0898q6318k15800L2131
$$ 3264680 2945714 2828621 2725141 2882468 2796388 2750986 2791884 2705566 2489766 2521897
16571B521897r3051k12502Q89093p53485M7609k93639M46485k20251J10094m29105
$$ 2521897 2428846 2216344 3105437 2351952 2399561 2105922 2552407 2332156 2442250 2013145
16561B013145L67750j51968o5703j09092M8308k97025K10575K263l99432J50944
$$ 2013145 2380895 2228927 2163224 2054132 2102440 1805415 2015990 2018253 1618821 1769765
16551A769765J38983j0396k00340L88722m02158J95183k88281k53130K53032O4075
$$ 1769765 1908748 1898352 1698012 2086734 1684576 1879759 1591478 1338348 1591380 1655455
16541A655455k36420N9955J59865j51292M253Q8618l79082J57186L17970l26153
$$ 1655455 1419035 1478990 1638855 1487563 1491816 1580434 1201352 1358538 1676508 1350355
16531A350355Q2467p7321J13107R0618j64217k85817R9727J81846j87742l3873
$$ 1350355 1432822 1355501 1468608 1559226 1395009 1109192 1208919 1390765 1203023 1169150
16521A169150J76973k36726k8121J70348q1211M89891q13908J98312K87238J0167
$$ 1169150 1346123 1109397 1081276 1251624 1170413 1660304 846396 1044708 1331946 1342113
16511A342113j6011j00126m3979K07276m55848J74179j76537k22885K50787J74069
$$ 1342113 1326102 1225976 1181997 1389273 933425 1107604 931067 708182 958969 1133038
16501A133038m07722M74016k99150L7762K68395l42232J38204R802k32827J21674
$$ 1133038 725316 1199332 900182 937944 1206339 864107 1002311 1012113 779286 900960
16491I00960r7448r6702J31107k20392J44563K35037m4884J95067l99998k03672
$$ 900960 803512 706810 837917 617525 762088 997125 952241 1147308 747310 543638
16481E43638J22061J92201J27369m36546J7127L38727C67849K56798J55076C77844
$$ 543638 665699 857900 985269 548723 565850 904577 367849 624647 779723 377844
16470G21848J22753k38865K8183l6864j8313K05061j87714K5232k50625Q870M04921
$$ 721848 844601 605736 633919 597055 578742 783803 596089 621321 370696 379566 784487
16459G84487j19289j97798L32104k11097K50751k10187k09111L13764k49848k23173
$$ 784487 665198 467400 799504 588407 839158 628971 419860 733624 483776 260603
16449B60603L05078k53455R3812j04366K47787j41116k856q4511K43117j50346
$$ 260603 565681 312226 406038 301672 549459 408343 405487 320976 564093 413747
16439D13747J05142k06524M99537l74945K00118k00124e2459E16527m8715r4594
$$ 413747 518889 312365 811902 436957 637075 436951 -52459 516527 467812 373218
16429C73218j39114J80388l3680l0162J66905J5966k08942M192q1688K09564A06467
$$ 373218 234104 414492 380812 350650 517555 533521 324579 328771 247083 456647 106467
16417A61544J96677L1725H2713O79656l51251J27718o321o9556j10551L3397o5147
$$ 161544 358221 389946 82713 762369 411118 538836 532515 462959 352408 385805 320658
16406C20658J65073k00259J28005n4330K15397L4542j27453A92322J72958A21280
$$ 320658 485731 285472 413477 359147 574544 609086 481633 192322 365280 121280
16395C71295J44992p2281m4738o9489n5462E9769K85484o1711J12041j67405K47179
$$ 371295 516287 444006 399268 329779 274317 59769 345253 283542 395583 228178 475357
16384D75357E6471M00400k1215j18123j17510r5035K28247D5548J61832B0949
$$ 475357 56471 456871 435656 317533 200023 104988 333235 45548 207380 20949
16373E24247j51108j04917L38103j30738G1296L11746j6615K45703F6654M06438
$$ 524247 373139 268222 606325 475587 71296 383042 366427 612130 66654 473092
16363D73092n3771J75372j69623j55213r0269a02739D08126A43843M1805L61261
$$ 473092 419321 594693 425070 269857 179588 -102739 408126 143843 185648 546909
16353E46909j25045j22684J22421A91740a9488D3653N9104J78627J2580L1916
$$ 546909 421864 299180 421601 191740 -19488 43653 102757 281384 293964 325880
16343C25880k6121o6157j01495J77744J04159M0451j62984M7695I5254J93946
$$ 325880 299759 233602 132107 309851 414010 454461 291477 339172 95254 289200
16333B89200J27985k02855G6069C2196J01476Q5712h3737C30983j63693K12769
$$ 289200 417185 214330 76069 32196 133672 219384 -83737 330983 167290 380059
16323C80059a27854B4491Q0098M0948K86327j19941a1643j0291D46162p7335Q3485
$$ 380059 -127854 24491 104589 145537 431864 311923 -11643 -21934 446162 368827 452312
16312D52312j45532I0925K79402G0447R1487k739J69670q2645H4182J3747l9642
$$ 452312 306780 90925 370327 70447 161934 159195 328865 246220 84182 97929 58287
16301E8287M0652J64448e2503C64209e549C7799R4977K23190J28870b6786E6985
$$ 58287 98939 263387 -52503 364209 -5549 37799 132776 355966 484836 -26786 56985
16289A09344E489R5558A512a7271q0033J9020p7301A29982n5157K21329A46568
$$ 109344 5489 101047 1512 -17271 -97304 -78284 -155585 129982 74825 296154 146568
16277a7594I0126k0687b9314k888H658K49461j23755C0401K19068e0521A04915
$$ -17594 90126 69439 -29314 -32202 8658 258119 134364 30401 249469 -50521 104915
16265b0899A67697f8960A96610i4507D473a493m8807k62253C33257a9563q5005
$$ -20899 167697 -68960 196610 -94507 4473 -1493 -50300 -312553 333257 -19563 -104568
16254a04568B15341n0411l5215K44596g3673I8144P3513J79708G4012L5814L23422
$$ -104568 215341 164930 129715 374311 -73673 98144 171657 351365 74012 109826 433248
16243D33248A82856H7989b56427f011C21123I5955J12707M6378K19701A67495
$$ 433248 182856 87989 -256427 -6011 321123 95955 208662 255040 474741 167495
16232d35728g0590J499K1324k6364b4853B40945N5826A194a85888G7556c6204
$$ -435728 -70590 -69091 -47767 -74131 -24853 240945 296771 1194 -185888 77556 -36204
16220C39663H2701l8688J91752C0530J14810P6961j01045c4347A3133J27375b34622
$$ 339663 82701 44013 235765 30530 145340 222301 121256 -34347 13133 140508 -234622
16208c4244B82816L4208m0586G7597M6920a38822A78332J14370r8586O6659I3885
$$ -34244 282816 317024 276438 77597 124517 -138822 178332 292702 194116 260775 93885
16196A12472f7036G8895Q0977f518C69371j25801a26718L9880B00405I5050K2866
$$ 112472 -67036 78895 159872 -6518 369371 243570 -126718 -86838 200405 95050 117916
16185A17916B9484a05610C9270J45498R5629J50193g740A10633b43322a2782k3838
$$ 117916 29484 -105610 39270 184768 280397 430590 -7740 110633 -243322 -12782 -36620
16174c6620D25491C5567i0486A04593m0573N4296E2767P6237d5530l9316o3968
$$ -36620 425491 35567 -90486 104593 64020 118316 52767 129004 -45530 -84846 -148814
16163a48814A46520d2745A98802a9842C14452A15658i7684B10811c3668k20883
$$ -148814 146520 -42745 198802 -19842 314452 115658 -97684 210811 -33668 -254551
16153b54551D8575n721i855C3555K51497A11448n2252a95958C4137c2061k84121
$$ -254551 48575 42854 -9855 33555 285052 111448 59196 -195958 34137 -32061 -316182
16142c16182A853J29188c39192D98072f8559B54474F2984g0111o8145L3603E4971
$$ -316182 1853 131041 -339192 498072 -68559 254474 62984 -70111 -138256 -104653 54971
16130A12599K02442A17028A1971K23301d1580j93087j58179g1806E7330a8416
$$ 112599 315041 117028 11971 235272 -41580 -234667 -392846 -71806 57330 -18416
16119i7387B92525H4012d87241a53567a2970m3097D2776d2632o554E3356K3767
$$ -97387 292525 84012 -487241 -153567 -12970 -56067 42776 -42632 -49186 53356 77123
16108G7123h4798D8558b33171j35788J69458A16277L49193b07086A12366a67851
$$ 77123 -84798 48558 -233171 -368959 -199501 116277 465470 -207086 112366 -167851
16097E531J2075J1744f5470C6188M3979a49195j50984h2162J5837p8271D22306
$$ 5531 17606 29350 -65470 36188 80167 -149195 -300179 -82162 -66325 -144596 422306
16085A88579a47763b5595A23211C4998R0479b23692f6136A25607e00790A21921
$$ 188579 -147763 -25595 123211 34998 125477 -223692 -66136 125607 -500790 121921
16074G4060R34J10910a72317j1684k17565B02914b99659g1249p4913j05882p7282
$$ 74060 74994 185904 -172317 -184001 -401566 202914 -299659 -71249 -146162 -252044 -329326
16063c29326D2243J24844m82a67561N5135B68410O9927f3378k9076d1383j09889
$$ -329326 42243 167087 166605 -167561 -112426 268410 338337 -63378 -92454 -41383 -151272
16052a51272P1041b413o2838b7083j90079B4045a729j76378G6283b7704C9294
$$ -151272 -80231 -2413 -65251 -27083 -217162 24045 -1729 -178107 76283 -27704 39294
16040a10627j57233d4884G6648K75153b45152I9232c60978G2111a7566k60961
$$ -110627 -267860 -44884 76648 351801 -245152 99232 -360978 72111 -17566 -278527
16030b78527r9728A61056J7654D1302a53496G2406Q2347i3538j0663n0964A22450
$$ -278527 -378255 161056 178710 41302 -153496 72406 154753 -93538 -104201 -155165 122450
16018A13244E0598e4368A15394R9948P3107B2047a65781A00178d1273k24029J03378
$$ 113244 50598 -54368 115394 215342 288449 22047 -165781 100178 -41273 -265302 -161924
16007a61924A53507O8603a17408c6341F5467d3623j34819A77222F2723L5465K13843
$$ -161924 153507 222110 -117408 -36341 65467 -43623 -178442 177222 62723 98188 312031
15996C12031j21060c55589B4611L58648g4628B19550B2949a9595j97354F2593
$$ 312031 190971 -355589 24611 383259 -74628 219550 22949 -19595 -216949 62593
15985H3092c29543B43225O7249f824k54283b426k09706A53077J17168d9650A47826
$$ 83092 -329543 243225 310474 -6824 -261107 -2426 -212132 153077 270245 -49650 147826
15973F1973g1937I2333e5191B16516a75376A82066J194J82603F8970b05970I2017
$$ 61973 -71937 92333 -55191 216516 -175376 182066 183260 365863 68970 -205970 92017
15961A06151a24535C8119a0797j7008j18794k07957a24732B78974D3357R0449
$$ 106151 -124535 38119 -10797 -27805 -146599 -354556 -124732 278974 43357 133806
15951A33806l9337d09692A66582L33E6198B449K8439Q495a36390j28667h6986
$$ 133806 94469 -409692 166582 166915 56198 2449 30888 39383 -136390 -265057 -86986
15939C03185b3625l42619B45986g9734C86676A30909c76425G8644a69793A77864
$$ 303185 -23625 -366244 245986 -79734 386676 130909 -376425 78644 -169793 177864
15928b28018J11340L4475k43609E02221c71607O9802a33529B13076A3710e2551
$$ -228018 -116678 -82203 -325812 502221 -371607 -301805 -133529 213076 13710 -52551
15917A98352A2164Q7909g3953I327i5894J2927k64481J48251h4985H9268c27626
$$ 198352 12164 100073 -73953 9327 -95894 -82967 -347448 -199197 -84985 89268 -327626
15905B285b02197P0022N9949j81591j04445B04019b38331O3555B034c23348J50226
$$ 2285 -202197 -132175 -72226 -253817 -358262 204019 -238331 -174776 2034 -323348 -173122
15894a73122l9016A27258b49544h0364I2175c91680D5076d67929a74846D5434
$$ -173122 -212138 127258 -249544 -80364 92175 -391680 45076 -467929 -174846 45434
15883I1640a03865A92203a15692B117b5942D5174a47965m3700N0898C3542f2484
$$ 91640 -103865 192203 -115692 2117 -25942 45174 -147965 -191665 -140767 33542 -62484
15871H3257N6627c88070I2909c32971A47310a2250E821g8068A7478K34042b8318
$$ 83257 139884 -388070 92909 -332971 147310 -12250 5821 -78068 17478 251520 -28318
15859a71197P9141o8725j55j7920l12329A22251b08103k19711J82975J19009A03203
$$ -171197 -92056 -160781 -160936 -178856 -491185 122251 -208103 -427814 -244839 -125830 103203
15847f8356A15011e11205I1751B4284i9290H9348g4796a6693j61672C6348L7098
$$ -68356 115011 -511205 91751 24284 -99290 89348 -74796 -16693 -178365 36348 73446
15836G3446a49976l00835h7356k87589d4341n4894A46451C1733a69091k3841C1565
$$ 73446 -149976 -450811 -87356 -374945 -44341 -99235 146451 31733 -169091 -192932 31565
15824d8044B42947a83568h9754j07268A81765H1221J48443a00495A11237J0620
$$ -48044 242947 -183568 -89754 -197022 181765 81221 229664 -100495 111237 121857
15814A21857O1037k0756b64419A654a34749B07525a43504e7381j56972j5798k3403
$$ 121857 182894 162138 -264419 1654 -134749 207525 -143504 -57381 -214353 -230151 -253554
15803b53554A79305i2870m3253I0789p496J22387c25756i0090j29203G4339a09763
$$ -253554 179305 -92870 -136123 90789 83293 205680 -325756 -90090 -219293 74339 -109763
15791c44836C7389b17595A03458i1997j96613C792J36111g1464l73996A73154
$$ -344836 37389 -217595 103458 -91997 -288610 3792 139903 -71464 -445460 173154
15780A91322E0786b47470e8770B24161f1672A51057a60269k12025d5614G9853
$$ 191322 50786 -247470 -58770 224161 -61672 151057 -160269 -372294 -45614 79853
15769a89432G2477H343L43016h6829j78253k8387J25385b9482k9223F2750a28792
$$ -189432 72477 8343 351359 -86829 -265082 -293469 -168084 -29482 -58705 62750 -128792
15757F7337M2579M2875a04823a7207B3489K05486c54186I8528Q495c5853j13272
$$ 67337 109916 152791 -104823 -17207 23489 228975 -354186 98528 107023 -35853 -149125
15746a49125n4293a3409k88808a41019C38200A62000L315B74a765B07392a57499
$$ -149125 -203418 -13409 -302217 -141019 338200 162000 165315 274 -1765 207392 -157499
15734I0108o098N1050d48028g2622B25761c2161M406B47243f0892p7534r837C5676
$$ 90108 84010 135060 -448028 -72622 225761 -32161 -27755 247243 -60892 -138426 -148263 35676
15721a62821k51219e3208a3771I4173d4266A89781c2072A5890N9659J6066b38492
$$ -162821 -414040 -53208 -13771 94173 -44266 189781 -32072 15890 75549 91615 -238492
15709b43539B57736b8229k8056R792A75884E5558J50041g542n5131H3354b06768
$$ -243539 257736 -28229 -56285 -46493 175884 55558 205599 -7542 -62673 83354 -206768
15697B05196A00917b21762H9836b07929d3739k76814p364A42460f5068B38775
$$ 205196 100917 -221762 89836 -207929 -43739 -320553 -327917 142460 -65068 238775
15686a42021B460L13495a42823p159A46087c9214A26618a3951B55721a23559G633
$$ -142021 2460 315955 -142823 -149982 146087 -39214 126618 -13951 255721 -123559 7633
15674a9049H2964a59612A89253D8867b16142R9329j20087B61006H1366d13092
$$ -19049 82964 -159612 189253 48867 -216142 -116813 -236900 261006 81366 -413092
15663F68b34733B77614b8481m2547B8316M67435i222A19297a98939b7505A39510
$$ 668 -234733 277614 -28481 -71028 28316 495751 -9222 119297 -198939 -27505 139510
15651i5737A31862C6069c08556a274A83363b54953A42244a19724I9902D9709J30362
$$ -95737 131862 36069 -308556 -1274 183363 -254953 142244 -119724 99902 49709 180071
15640A80071b39875J09N8262D6737g3148l6444r9405g1908j7855O355H9370O9981
$$ 180071 -239875 -239766 -181504 46737 -73148 -109592 -208997 -71908 -89763 -83408 89370 159351
15628A59351K6567C3521A4582B905b72719j58621a75769H3782a20632l0724L1521
$$ 159351 185918 33521 14582 2905 -272719 -431340 -175769 83782 -120632 -151356 -119835
15617a19835k43875B16203d02161G6794a9143n1906J5227B03401a23534A7299
$$ -119835 -363710 216203 -402161 76794 -19143 -71049 -55822 203401 -123534 17299
15606f0970k46324B25553h9258L486Q865C81339c98906a35181e4155e158l0738
$$ -60970 -307294 225553 -89258 -85772 -76907 381339 -398906 -135181 -54155 -5158 -35896
15595c5896k1299B93048a85376A04182b49387a3206k5576G3179a21985q8252e8886
$$ -35896 -57195 293048 -185376 104182 -249387 -13206 -38782 73179 -121985 -210237 -58886
15583A44042d615r0731I7870a01376j08341j7087C04640f7227I3096a89008A78574
$$ 144042 -4615 -95346 97870 -101376 -209717 -226804 304640 -67227 93096 -189008 178574
15571A50965k3325e6351A05826D3723J5168b24347D250L1371g4257c1288F3740
$$ 150965 127640 -56351 105826 43723 58891 -224347 4250 35621 -74257 -31288 63740
15559b01115c2341H4798a97449e4087G8972K0023a82810D910c28415D2686a38551
$$ -201115 -32341 84798 -197449 -54087 78972 98995 -182810 4910 -328415 42686 -138551
15547e6681D1716K45643b91034A14005i8669k26946A64617c81057a16593J1350
$$ -56681 41716 287359 -291034 114005 -98669 -325615 164617 -381057 -116593 -105243
15537a05243k1093A06512b7566k09731P6675A3024h8879D0063e3154A22083G045
$$ -105243 -126336 106512 -27566 -237297 -160622 13024 -88879 40063 -53154 122083 7045
15525A85572a57347I7922B2244a60685F9603a78523A40757n7393a22544l4865
$$ 185572 -157347 97922 22244 -160685 69603 -178523 140757 83364 -122544 -157409
15515a57409a678E4745i8380d7278a9104l4048B17948I2892a93872b601j10561
$$ -157409 -1678 54745 -98380 -47278 -19104 -53152 217948 92892 -193872 -2601 -113162
15504a13162a3295C22040b1046A7298N07271f4871C1911A1073b8478m4518A28333
$$ -113162 -13295 322040 -21046 17298 524569 -64871 31911 11073 -28478 -72996 128333
15492A88215d48j99448N4352N144A20516b48889Q8059A32857J02853a9057B14555
$$ 188215 -448 -199896 -145544 -140400 120516 -248889 -160830 132857 235710 -19057 214555
15480A68606a68217A53300b20311D03018I6931a82937e4029l44412H8240J3100
$$ 168606 -168217 153300 -220311 403018 96931 -182937 -54029 -398441 88240 101340
15470A01340D3558b2575B08450I3304a62615b1239E3239K18873J9463A31693a02174
$$ 101340 43558 -22575 208450 93304 -162615 -21239 53239 272112 291575 131693 -102174
15458b19497L874E4258f4465A41627h876j26956k55320a81953B09278b02621H0033
$$ -219497 -215623 54258 -64465 141627 -8876 -135832 -391152 -181953 209278 -202621 80033
15446a427A3134a74792A52827a36764A22735O6933A9592K00906a96665c4595j42095
$$ -1427 13134 -174792 152827 -136764 122735 189668 19592 220498 -196665 -34595 -176690
15435a76690A69907d7328A50333a02548F819a20540q4703L8728d837A62072e7380
$$ -176690 169907 -47328 150333 -102548 6819 -120540 -205243 -166515 -4837 162072 -57380
15423A24611o975d5633A37817a85318k6299B04027K0677b29835j29090B5926a62367
$$ 124611 117636 -45633 137817 -185318 -211617 204027 224704 -229835 -358925 25926 -162367
15411a88140A22249a6675j79081D4049N8377P8142Q7081a01667C431K9567a15978
$$ -188140 122249 -16675 -195756 44049 102426 180568 267649 -101667 3431 32998 -115978
15399A50529d4587j42638C91765j43878a18809M7893A12192b46529B32376b9985
$$ 150529 -44587 -187225 391765 247887 -118809 -70916 112192 -246529 232376 -29985
15388B94405G7015a14454B49764K37142A26145a60697G4855B0713K48735b00409
$$ 294405 77015 -114454 249764 486906 126145 -160697 74855 20713 269448 -200409
15377A48220a58321N0966H2359O3331K3297c73043A58266J37471D400a6961j57437
$$ 148220 -158321 -107355 82359 145690 168987 -373043 158266 295737 4400 -16961 -174398
15366a74398l1715m64014e8596l7405D8488a74701B05047a24150K8756F7343d24180
$$ -174398 -206113 -670127 -58596 -96001 48488 -174701 205047 -124150 -95394 67343 -424180
15354e9831p2745j71013h4773l208r5478A45233c385A72655b1606B3059K458e40
$$ -59831 -132576 -303589 -84773 -87981 -183459 145233 -3385 172655 -21606 23059 25517 -540
15341C57145i6285L1292J7328k35859c3174j03607b4284A40515l8558B7255a48717
$$ 357145 -96285 -64993 -47665 -283524 -33174 -136781 -24284 140515 101957 27255 -148717
15329A7173K56020a36609A05394l1800d2026A20158K962a37939A08997b08127
$$ 17173 273193 -136609 105394 73594 -42026 120158 123120 -137939 108997 -208127
15318b93392A85464q8808J90652B5323P8085g6370J1770j11641f3296r510D0659
$$ -293392 185464 96656 287308 25323 103408 -76370 -64600 -176241 -63296 -72806 40659
15306A69660a56085D1494a4001C65495a1736A85660N961a52546g5775A86023a19990
$$ 169660 -156085 41494 -14001 365495 -11736 185660 191621 -152546 -75775 186023 -119990
15294c3706H0663J70691c8166J4058B6153J23646M2139A4116J3808b13658o5216
$$ -33706 80663 251354 -38166 -24108 26153 149799 191938 14116 27924 -213658 -278874
15283b78874A01269a42699j56027B66676c3046F1115f8595A47279n7719N469g477
$$ -278874 101269 -142699 -298726 266676 -33046 61115 -68595 147279 89560 95029 -7477
15271a83542B68605F0943J65191b41247P1537c1098a4898D12201a25663j91560
$$ -183542 268605 60943 226134 -241247 -169710 -31098 -14898 412201 -125663 -317223
15261c17223f9057K153H8733C6482M8101P3197k6838j587n8502J17588a55112
$$ -317223 -69057 -66904 88733 36482 84583 157780 130942 129355 70853 188441 -155112
15249d15380A16351a84711A36693Q5446f4609A23259M798L9312a30059D8929K09097
$$ -415380 116351 -184711 136693 222139 -64609 123259 128057 167369 -130059 48929 258026
15238B58026J4423N7219L3851N72151m29063M12551R0425D24627j04082A31789
$$ 258026 272449 329668 363519 935670 506607 919158 1009583 424627 320545 131789
15227D00566Q1676d5502C6791J84100B3815j493M7341J91663g6179A09501d471
$$ 400566 482242 -45502 36791 220891 23815 22322 69663 261326 -76179 109501 -4471
15215I1551a28702B02188a1820A04016f9342B83862G7168i7594B67616r9124J39474
$$ 91551 -128702 202188 -11820 104016 -69342 283862 77168 -97594 267616 168492 307966
15204C07966b4064l50268A16533J0635K77103a13971A42615F3433a03183B83202
$$ 307966 -24064 -374332 116533 127168 404271 -113971 142615 63433 -103183 283202
15193A10809f0972B24932R1112B0284J78126b4569B59524e2384B8368K3323b95772
$$ 110809 -60972 224932 316044 20284 198410 -24569 259524 -52384 28368 51691 -295772
15181B71304a34610f5938k57412c1445l21886B53243q5950b3475A97181G9014
$$ 271304 -134610 -65938 -323350 -31445 -353331 253243 167293 -23475 197181 79014
15170A63133G2910M9904J88310A05737L18322e6807k88472A34807J10273J45925
$$ 163133 72910 122814 311124 105737 424059 -56807 -345279 134807 245080 391005
15160C91005G9537K85749C8510b8090d184l3734D73493c0878A29784J1566h8485
$$ 391005 79537 365286 38510 -28090 -4184 -37918 473493 -30878 129784 141350 -88485
15148b9187A58346A2755K05108j05056J37606K2595K8688p1046r0498B7045K62039
$$ -29187 158346 12755 217863 112807 250413 273008 301696 230650 140152 27045 289084
15137B89084J5922A7557N40770k27823A54858P5588R5489q3862F0314L75531A30199
$$ 289084 305006 17557 558327 330504 154858 230446 325935 242073 60314 435845 130199
15125A02139g8953A72606K32580A0324f0848A38981M747o9519j0766O3816J6639
$$ 102139 -78953 172606 405186 10324 -60848 138981 143728 74209 63443 127259 143898
15114A43898j7999Q5752a02558B96119n7769i1653I0041k1587f50B13997D7288
$$ 143898 125899 211651 -102558 296119 238350 -91653 90041 68454 -650 213997 47288
15102A57853d35727g2028A90561m5421a85577i309m305B27897J80172a61362g9809
$$ 157853 -435727 -72028 190561 145140 -185577 -9309 -13614 227897 408069 -161362 -79809
15090F5660a7774B1414L6192K21705J64789D388K63070q0212K2310n7957a36131
$$ 65660 -17774 21414 57606 279311 444100 4388 267458 187246 209556 151599 -136131
15078a13482B50657o093A22095a62288B24978I979Q0282J51304r5871J08792J6972
$$ -113482 250657 244564 122095 -162288 224978 9979 90261 241565 145694 254486 271458
15067B71458k9512h0961D06532G4540J38795D5364L34986j18248H5449J93317
$$ 271458 241946 -80961 406532 74540 213335 45364 380350 262102 85449 278766
15057B78766K23087A79613q9209g8091B14354a20949a887B91424h4522A57935
$$ 278766 501853 179613 90404 -78091 214354 -120949 -1887 291424 -84522 157935
15046A47520M6370o8176e8620B83707k7394J50585I9669R3188K4015B553K65502
$$ 147520 193890 125714 -58620 283707 256313 406898 99669 192857 216872 2553 268055
15035B68055J1097e211E6009K85042n7374O3088A13780e6344C1228g0485E01642
$$ 268055 279152 -5211 56009 341051 283677 346765 113780 -56344 31228 -70485 501642
15023C96071D1931K11713o9804o5206L36951B26145j1984B4982M04963D036L55555
$$ 396071 41931 253644 183840 118634 455585 226145 214161 24982 429945 4036 359591
15012C59591j64093G5423Q5834o9565P8500a05187C12147K43385A56760J25211
$$ 359591 195498 75423 161257 91692 170192 -105187 312147 555532 156760 281971
15002B81971A13912a35787A29737N3723J74769j40591M7059k9785A4810c388B87867
$$ 281971 113912 -135787 129737 183460 358229 217638 264697 234912 14810 -3388 287867
14990a48683D38175h3438d964C44852l8311o9163J38292L2782R0705F7650J53111
$$ -148683 438175 -83438 -4964 344852 306541 237378 375670 408452 499157 67650 220761
14979B20761A9196i4888B52067k0961L611N8986M9817A58996J64034D1413J77536
$$ 220761 19196 -94888 252067 231106 234717 293703 343520 158996 323030 41413 218949
14968B18949J62964O5311j07466j13960k9036p7921L245K33628p7922G9451J38000
$$ 218949 381913 447224 339758 225798 196762 118841 122086 355714 277792 79451 217451
14957B17451a48281B23268J66833b10317B09836q8431J89389o2336a312B41594
$$ 217451 -148281 223268 390101 -210317 209836 121405 310794 248458 -1312 241594
14946F9102M51221k39935k9632J07081A29447K91702k4241p8210F1400J56861
$$ 69102 520323 280388 250756 357837 129447 421149 396908 318698 61400 218261
14936B18261A7605N80265k02398j32401l5787r7593a05823B86990n4645n3857
$$ 218261 17605 597870 395472 263071 227284 129691 -105823 286990 232345 178488
14926A78488J01176J92029J15678k71362M1294j71997N7605p0881R8187J67038
$$ 178488 279664 471693 587371 316009 357303 185306 242911 172030 270217 437255
14916D37255A15713M01573k30219J04820e5203D03713l1397P4069j91676p841
$$ 437255 115713 517286 287067 391887 -55203 403713 372316 446385 254709 246868
14906B46868N3831g146B71400A17206M9294k3535L16396A28797J36550L79481
$$ 246868 300699 -7146 271400 117206 166500 142965 459361 128797 265347 644828
14896F44828A59841a3754A78144M6271M27095B51903J36277R2981o9249J3202
$$ 644828 159841 -13754 178144 224415 651510 251903 388180 481161 411912 425114
14886D25114k02434k2585O442K17139j21561J41667j28415K25342j54430A44099
$$ 425114 222680 200095 206537 423676 302115 443782 315367 540709 386279 144099
14875C87979r7093J63777J69153B87041K77512j02288k19779n5704K19L12890
$$ 387979 290886 454663 623816 287041 564553 462265 242486 186782 187001 499891
14865D99891k05154L4788R9651J14943j13858m6384l7525R2541J64641G0808P1528
$$ 499891 294737 329525 429176 544119 430261 383877 346352 438893 603534 70808 142336
14854A42336J28430k181J78797Q1710B23654M4836K19419j71167p710o757Q935
$$ 142336 270766 268585 447382 529092 223654 268490 487909 316742 309032 302275 311210
14843C11210J59795j97950K2308j41877L19104j00896q5452K56261j25304m118
$$ 311210 471005 273055 295363 153486 472590 371694 286242 542503 417199 413081
14833D13081j53779R7267J23183p8514M14296C02855J66229c7785D22074m2183
$$ 413081 259302 356569 479752 401238 815534 302855 469084 -37785 422074 379891
14823C79891J8937P2849J60248j03878B34680P50188l91323M514K25451k76588
$$ 379891 398828 471677 631925 528047 234680 984868 593545 598059 823510 546922
14813E46922J47327j38123j37987L77422k42705O0340J107J41816j72536r8527
$$ 546922 694249 556126 418139 795561 552856 613196 614303 756119 583583 485056
14803D85056O8427j63854A45826K60915J44340K08653C61731K95835j11058K9964
$$ 485056 553483 389629 145826 406741 551081 759734 361731 657566 546508 576472
14793E76472j48946K5470O6709j37224M12055B75273L83672N734j29972L67100
$$ 576472 427526 452996 519705 382481 794536 275273 658945 664679 534707 901807
14783I01807m25699J16798k76593K20483j33972Q5306J85071l10852J93061Q70
$$ 901807 476108 592906 316313 536796 402824 488130 673201 362349 555410 556280
14773E56280j49668K21937A76358L60028k0767n5993K89960l50835N83971l81424
$$ 556280 406612 628549 176358 536386 515619 459626 749586 398751 982722 601298
14763F01298n6853k07158K25892K02579p5365q7478j7279K47484l99716K10394
$$ 601298 544445 337287 563179 765758 690393 602915 585636 833120 433404 643798
14753F43798L50607m70573K95279k21374L68269m42564L03958l57442Q033j08176
$$ 643798 994405 523832 819111 597737 966006 523442 827400 469958 477991 369815
14743C69815O56655k26930k50586J45001B60264N96036o515l09687N3440K08881
$$ 369815 1026470 799540 548954 693955 260264 856300 849785 540098 593538 802419
14733H02419l18362L23573j11413k94156L85098J62322R2330k00474j12046j27636
$$ 802419 484057 807630 696217 402061 787159 949481 1041811 841337 729291 601655
14723F01655J4687J80524N788k9278J16698K12248l61852P041L72269m35721M9058
$$ 601655 616342 796866 802654 773376 890074 1102322 740470 747511 1119780 684059 733117
14712G33117K49855l90384N6314n7581O25132n92296L11915k40912K21460K8780
$$ 733117 982972 592588 648902 591321 1216453 624157 936072 695160 916620 945400
14702I45400j55889p7090j24012J24461J00223j20367J31617k55044O58052k59099
$$ 945400 789511 712421 588409 712870 813093 692726 824343 569299 1227351 968252
14692I68252k04496j55972J88992M2153j3321L92621n94787N37027n01862L13245
$$ 968252 763756 607784 796776 838929 825608 1218229 623442 1160469 658607 971852
14682I71852p9058L43546m01284o9620J42866J53038J14051j28594O2990l93401
$$ 971852 892794 1236340 835056 765436 908302 1061340 1175391 1046797 1109787 716386
14672G16386J3648K69031j38138L52041k64251j72125J50672J5702m2563j32712
$$ 716386 730034 999065 860927 1212968 948717 776592 927264 942966 900403 767691
14662G67691M76816n5990l27536M69755l95137K9981J3372N2863J03336k26729
$$ 767691 1244507 1188517 860981 1330736 935599 965580 978952 1031815 1135151 908422
14652I08422J9484Q7777J34053J50932k98984K356j00836L76682r0647J58102
$$ 908422 927906 1015683 1149736 1300668 1001684 1004040 903204 1279886 1189239 1347341
14642A347341l88895R6227l6272M46697k58513j29963K52308Q9707m72514J58336
$$ 1347341 958446 1054673 1018401 1465098 1206585 1076622 1328930 1418637 946123 1104459
14632A104459L32024k34949K14662l51284K49428L0343k45570j89753M27850J91799
$$ 1104459 1436483 1201534 1416196 1064912 1314340 1344683 1099113 909360 1337210 1529009
14622A529009l85586L13952N5131J12063l88203R015J36035k32917Q3869J02035
$$ 1529009 1143423 1457375 1512506 1624569 1236366 1245381 1381416 1148499 1232368 1334403
14612A334403L43542m28293J23838m0143j06471L47361k14388O6785k62446K83002
$$ 1334403 1677945 1249652 1373490 1333347 1226876 1574237 1359849 1426634 1164188 1447190
14602A447190o6934J76540L7241M5626J60437j37222j76189J1959J14839L95977
$$ 1447190 1380256 1556796 1594037 1639663 1800100 1662878 1486689 1498648 1613487 2009464
14592B009464j47495l36879R8906L00370j95041k52473M13734n38453N89681L3254
$$ 2009464 1861969 1525090 1623996 1924366 1729325 1476852 1890586 1352133 1941814 1975068
14582A975068k24580k46945L24176j73692K03654K488j27947l5869j07084M53224
$$ 1975068 1750488 1503543 1827719 1654027 1857681 1860169 1732222 1696353 1589269 2042493
14572B042493K14530k29894k5298q2437J55549N8127r1763k01747J42839P9561
$$ 2042493 2257023 2027129 2001831 1919394 2074943 2133070 2041307 1839560 1982399 2061960
14562B061960N2372j03139L17891p3162O0395n22240O50229m0999q084L09179
$$ 2061960 2114332 2011193 2329084 2255922 2316317 1794077 2444306 2403307 2395223 2704402
14552B704402k52709K35078J3043J38177K70170j8286J31628l146k8915k0718
$$ 2704402 2451693 2686771 2699814 2837991 3108161 3089875 3221503 3218357 3189442 3168724
14542C168724N56316O8109N28092L48592M45641Q58909R40053J589583K196315
$$ 3168724 3725040 3793149 4321241 4669833 5115474 5974383 6914436 8504019 10700334
14533A0700334M094242O341089P898318j870889p938562o407743m532422k168381
$$ 10700334 14794576 21135665 29033983 27163094 19224532 12816789 8284367 6115986
14525F115986j089367j279178m99701k77496l03400K16596j02011j05924j21907
$$ 6115986 5026619 3747441 3247740 2970244 2666844 2883440 2781429 2675505 2553598
14516B553598j20437k0979J73936J59379j91844K10339l01811J61212l62164M91834
$$ 2553598 2433161 2412182 2586118 2745497 2553653 2763992 2462181 2623393 2261229 2753063
14506B753063k02670j22571J16461n279K58924p0720j1607K48532m3514j93819
$$ 2753063 2550393 2427822 2544283 2539004 2797928 2727208 2715601 2964133 2920619 2726800
14496B726800J45817k8492L36459j12962j3038K75207k12439P9205r4552Q9352
$$ 2726800 2872617 2844125 3180584 3067622 3054584 3329791 3117352 3196557 3102005 3191357
14486C191357N21168n00880N27585j40566j24466L8487J95734j65020k49012K14172
$$ 3191357 3712525 3211645 3739230 3598664 3474198 3512685 3708419 3543399 3294387 3508559
14476C508559n9668K61122N47923k69405J05421m08750J20198L11723j85004k63854
$$ 3508559 3448891 3710013 4257936 3988531 4093952 3685202 3805400 4117123 3932119 3668265
14466C668265L47517N04909k89558k22575K69903q5092K36025N4983j25196K74158
$$ 3668265 4015782 4520691 4231133 4008558 4278461 4193369 4429394 4484377 4359181 4633339
14456D633339k06430K31360O9665p9758L05776j08732q7562j66541K89377M08283
$$ 4633339 4426909 4658269 4727934 4648176 4953952 4845220 4757658 4591117 4880494 5288777
14446E288777l35394K46837j15760K73089j36001N1154l4842M82277j12891k26199
$$ 5288777 4953383 5200220 5084460 5357549 5221548 5272702 5237860 5720137 5607246 5381047
14436E381047K79028m6243R657J98577J84613J95167k01150L33068N4868j55661
$$ 5381047 5660075 5613832 5623489 5822066 6006679 6201846 6000696 6333764 6388632 6232971
14426F232971L37765k49818M88760p1788j04679k60953N35049N3660L0417L20612
$$ 6232971 6570736 6320918 6809678 6737890 6633211 6372258 6907307 6960967 6991384 7311996
14416G311996K21687m87254M41185J21573J21658K35679l63846M60188R9938l494
$$ 7311996 7533683 7046429 7487614 7609187 7730845 7966524 7602678 8062866 8162804 8159310
14406H159310M5630J74255R6455L53545J07962J82897K09799q4349o5685K90431
$$ 8159310 8204940 8379195 8475650 8829195 8937157 9120054 9329853 9245504 9179819 9470250
14396I470250l4620O5661M18144J3895J90655R3486L78267K79001j31729j2014
$$ 9470250 9435630 9501291 9919435 9933330 10123985 10217471 10595738 10874739 10743010 10730996
14386A0730996M14247K68274K86666j19456O65450l1452Q4106L78835j05237M99761
$$ 10730996 11145243 11413517 11700183 11580727 12246177 12214725 12298831 12677666 12572429 13072190
14376A3072190k13885Q89427o590J18219L70919n9642N23185K1281N30556L21919
$$ 13072190 12858305 13747732 13741142 13859361 14230280 14170638 14693823 14715104 15245660 15567579
14366A5567579J18362M24619L37495L52972J52543J0786Q13085K19554J84108
$$ 15567579 15685941 16110560 16448055 16801027 16953570 16964356 17777441 17996995 18181103
14357A8181103N80914L22933L56183N44513L21594N30350K08767J71077R18837
$$ 18181103 18762017 19084950 19441133 19985646 20307240 20837590 21046357 21217434 22136271
14348B2136271J22003R96493M36718N70276M52278N18060O61467M25998Q06944
$$ 22136271 22258274 23254767 23691485 24261761 24714039 25232099 25893566 26319564 27126508
14339B7126508P70651O69674O92752L98157O94652J206083N82888R17357P41742
$$ 27126508 27897159 28566833 29259585 29657742 30352394 31558477 32141365 33058722 33800464
14330C3800464O00126J181601R64314J229588R94914J187025J035789R88684J363763
$$ 33800464 34400590 35582191 36546505 37776093 38771007 39958032 40993821 41982505 43346268
14321D3346268R76380J539368J614510J362464J424567J695486J235428J892972
$$ 43346268 44322648 45862016 47476526 48838990 50263557 51959043 53194471 55087443
14313E5087443J866308K138395K083459J908444K338887K214290K237986K942730
$$ 55087443 56953751 59092146 61175605 63084049 65422936 67637226 69875212 72817942
14305G2817942K388133L115069K850454K979402L469046L742015L324861L910981
$$ 72817942 75206075 78321144 81171598 84151000 87620046 91362061 94686922 98597903
14297I8597903M154278M463370L988714N255568N016837N468225N460824O101178
$$ 98597903 102752181 107215551 111204265 116459833 121476670 126944895 132405719 138506897
14289A38506897O473113O858432O879366P736447P891723Q318066Q972587Q867779
$$ 138506897 144980010 151838442 158717808 166454255 174345978 182664044 191636631 200504410
14281B00504410J0109158J0447194J0770117J1642813J2345600J2222208J3229844
$$ 200504410 210613568 221060762 231830879 243473692 255819292 268041500 281271344
14274B81271344J3639183J3826756J4658789J4856728J4738818J3842669J4169668
$$ 281271344 294910527 308737283 323396072 338252800 352991618 366834287 381003955
14267C81003955J2796204J2594132J1353167J0901209R877023Q975950P482423
$$ 381003955 393800159 406394291 417747458 428648667 438525690 447501640 454984063
14260D54984063O109092M261807K075805P28429l83231k059800p259615q527350
$$ 454984063 461093155 465354962 467430767 468159196 467775965 465716165 458456550 449929200
14252D49929200p346586q662889r521754j1070908j2480257j2877362j3415758
$$ 449929200 442582614 433919725 424397971 413327063 400846806 387969444 374553686
14245C74553686j3810115j3848578j4209956j3283489j3938260j3625379j2795706
$$ 374553686 360743571 346894993 332685037 319401548 305463288 291837909 279042203
14238B79042203j2780221j2524754j2154833j1620645j1116581j1033018j0244279
$$ 279042203 266261982 253737228 241582395 229961750 218845169 207812151 197567872
14231A97567872r695879r423004q742118q050692p659140p001257o929116o033581
$$ 197567872 187871993 178448989 169706871 161656179 153997039 146995782 140066666 134033085
14223A34033085o067297n407132n062409n170174m665601m136971m072111l925099
$$ 134033085 127965788 122558656 117496247 112326073 107660472 103523501 99451390 95526291
14215I5526291l638776l640136l201126l375532k864922k767333k663881k763367
$$ 95526291 91887515 88247379 85046253 81670721 78805799 76038466 73374585 70611218
14207G0611218k557084j888393k329178j955036k306602k072387j489710j729580
$$ 70611218 68054134 66165741 63836563 61881527 59574925 57502538 56012828 54283248
14199E4283248j545431j573946j371848j618640j456752j295991j080842j293686
$$ 54283248 52737817 51163871 49792023 48173383 46716631 45420640 44339798 43046112
14191D3046112p68175j542336j066859j275905r36742p62079j023301j220887
$$ 43046112 42277937 40735601 39668742 38392837 37456095 36694016 35670715 34449828
14183C4449828n87349j049583q06830r59506p00412o39795p00311o32463p44508
$$ 34449828 33862479 32812896 32006066 31046560 30346148 29706353 29006042 28373579 27629071
14174B7629071o86034m88474o87233m30917q45851l29404p72363m99885l51594
$$ 27629071 26943037 26454563 25767330 25336413 24490562 24161158 23388795 22888910 22537316
14165B2537316l75519l78981n96983k49413n61376r31407L16472n65146k01371
$$ 22537316 22161797 21782816 21185833 20936420 20375044 19443637 19760109 19194963 18993592
14156A8993592o09794j38663m77507m84979j09910k87011o02666j46790k18943
$$ 18993592 18383798 18245135 17767628 17282649 17172739 16885728 16283062 16136272 15917329
14147A5917329o07125k42605N019n28441j25454j02848m99854k45188j22183K5104
$$ 15917329 15310204 15067599 15072618 14544177 14418723 14315875 13816021 13570833 13448650 13473754
14137A3473754o15643j72455L17676m84377l27594N2392l89525J45857n52357
$$ 13473754 12858111 12685656 13003332 12518955 12191361 12243753 11854228 12000085 11447728
14128A1447728k4774l45707P7323R0485l98733k07137k27614k92183l65893J66576
$$ 11447728 11422954 11077247 11154570 11245055 10846322 10639185 10411571 10119388 9753495 9920071
14118I920071m3204j19671j5796l52713l0743j61701j94390n23568J07803M040
$$ 9920071 9876867 9757196 9741400 9388687 9357944 9196243 9001853 8478285 8586088 8590128
14108H590128j65170j97439J47781k09581m8727l9409l07671M3063k54420K5759
$$ 8590128 8424958 8227519 8375300 8165719 8116992 8077583 7769912 7812975 7558555 7584314
14098G584314k37267o7382J58135r7583k73567L5454j06696J02126k33715m34168
$$ 7584314 7347047 7279665 7437800 7340217 7066650 7102104 6995408 7097534 6863819 6429651
14088F429651j7410k5105k40510N30442m45045j80675L8848j65278k75936J84824
$$ 6429651 6412241 6387136 6146626 6677068 6232023 6051348 6090196 5924918 5648982 5833806
14078E833806K60233l21468J43153J60648o16151J51536J25372k95551j45836
$$ 5833806 6094039 5772571 5915724 6076372 5460221 5611757 5737129 5441578 5295742
14069E295742j7611R0093k18472j88572K83022l44694m6784L59790n4689m24588
$$ 5295742 5278131 5368224 5149752 4961180 5244202 4899508 4852724 5212514 5157825 4733237
14059D733237J30282q8577j14640j68705J96747k44673O4328j16775o1145k00608
$$ 4733237 4863519 4774942 4660302 4491597 4688344 4443671 4507999 4391224 4330079 4129471
14049D129471J38666L01089n59527K07827K30946l47699K50645k31585j29305
$$ 4129471 4268137 4569226 4009699 4217526 4448472 4100773 4351418 4119833 3990528
14040C990528J19926j10785k61748N467Q9380j92860K80576k57306j29408J59991
$$ 3990528 4110454 3999669 3737921 3743388 3832768 3639908 3920484 3663178 3533770 3693761
14030C693761k26300k6823k62073L35580Q1098M4205k20963L7129l02465L05505
$$ 3693761 3467461 3440638 3178565 3514145 3595243 3639448 3418485 3455614 3153149 3458654
14020C458654j74188j01252Q1022N1400k51569J48330l83445N2077K20193k35244
$$ 3458654 3284466 3183214 3264236 3315636 3064067 3212397 2828952 2881029 3101222 2865978
14010B865978O3138L91544n18736J29412o6585j15111J16077J75668k76261J33589
$$ 2865978 2929116 3320660 2801924 2931336 2864751 2749640 2865717 3041385 2765124 2898713
14000B898713m86597M59340k09205m2266N977M4404k85977M31859j64171q8708
$$ 2898713 2412116 2871456 2662251 2619985 2625962 2670366 2384389 2816248 2652077 2563369
13990B563369J55700M815r6003j1486k44227R5018J46570K2136k1253M39735o5960
$$ 2563369 2719069 2723884 2627881 2616395 2372168 2467186 2613756 2635892 2614639 3054374 2988414
13979B988414J85345M38199J57322O95164J417761J584201K644130N846280Q902941
$$ 2988414 3173759 3611958 3769280 4464444 5882205 7466406 10110536 15956816 24859757
13970B4859757J748576n288786n770637m145416k722136k266063n66033q40157
$$ 24859757 26608333 21319547 15548910 11403494 8681358 6415295 5849262 5009105
13962E009105r27423J01107n95597J73919m46029l95798K58605j51784j07235
$$ 5009105 4081682 4182789 3587192 3761111 3315082 2919284 3177889 3026105 2918870
13953B918870n24882O19387o61436P610L59448l74048J10507j32450K63934l81334
$$ 2918870 2393988 3013375 2351939 2359549 2718997 2344949 2455456 2323006 2586940 2205606
13943B205606K57120m67792R2886J3442J54528m9613k02276j10715J99888k51234
$$ 2205606 2462726 1994934 2087820 2101262 2255790 2206177 2003901 1893186 2093074 1841840
13933A841840j9146k3080J75451K00709J85945l09532k97567l90614M79272J41701
$$ 1841840 1822694 1799614 1975065 2175774 2361719 2052187 1754620 1364006 1843278 1984979
13923A984979j24492J75921k19184r4874J48088r9399J16265m4473l07704L7151
$$ 1984979 1860487 2036408 1817224 1722350 1870438 1771039 1887304 1842831 1535127 1572278
13913A572278q2873J66540J53684j87446q1817o846K27931k23607j5780l03807
$$ 1572278 1489405 1655945 1809629 1622183 1540366 1533520 1761451 1537844 1522064 1218257
13903A218257L28388O4030N9774M0140M727o8732J0930m47666N52697k47317J6526
$$ 1218257 1546645 1610675 1670449 1710589 1715316 1646584 1657514 1209848 1762545 1515228 1531754
13892A531754K26563m52610K36921j16733N9186k60769J77619M910l6208K98651
$$ 1531754 1758317 1305707 1542628 1425895 1485081 1224312 1401931 1406841 1370633 1669284
13882A669284o27176J04238R0629J9556J16962j35646J08864k59337R4893J92356
$$ 1669284 1042108 1146346 1236975 1256531 1373493 1237847 1346711 1087374 1182267 1374623
13872A374623j77515L04894p3226l17321L93518l72414K10528j00771K72618j34511
$$ 1374623 1197108 1502002 1428776 1111455 1504973 1132559 1343087 1242316 1514934 1380423
13862A380423m61549J43145L64669l12535k10148J76055K68665n11017J46054
$$ 1380423 918874 1062019 1426688 1114153 904005 1080060 1348725 837708 983762
13853I83762R0924J92338k53031J03308j41995J41055m1065J68656j98914K3634
$$ 983762 1074686 1267024 1013993 1117301 975306 1116361 1075296 1243952 1045038 1068672
13843A068672L3205M25379m82388M3846r5793L78644l58313k07967L90534k64324
$$ 1068672 1101877 1527256 1044868 1088714 992921 1371565 1013252 805285 1195819 931495
13833I31495L44016n39424M23264k4779J00131l55326J03540J21407j68876Q9597
$$ 931495 1275511 736087 1159351 1134572 1234703 879377 982917 1104324 935448 1025045
13823A025045L11711j89122m3679J19890q7420k866l28239O4117J54453L2764
$$ 1025045 1336756 1147634 1103955 1223845 1136425 1133559 805320 869437 1023890 1056654
13813A056654l15772J59260K58488l14740K4937K07743L0377l18153J13907j70044
$$ 1056654 740882 900142 1158630 843890 868827 1076570 1106947 788794 902701 732657
13803G32657K47828M6350o2612N6928k51966M74356l70216K91432P5328k60354
$$ 732657 980485 1026835 964223 1021151 769185 1243541 873325 1164757 1240085 979731
13793I79731l54925L44821m56800L80357k12861J13207k94851M66045J15K1314
$$ 979731 624806 969627 512827 893184 680323 793530 498679 964724 964839 986153
13783I86153m91623N14589k45650K19056l59041J3467K36109J13292n7717r1052
$$ 986153 494530 1009119 763469 982525 623484 636951 873060 986352 928635 837583
13773H37583j39427L69813n21818K10324n7174j82423L92532k82264q0431Q5775
$$ 837583 698156 1067969 546151 756475 699301 516878 909410 627146 546715 632490
13763F32490L20529C63717L60423K99129l17186p1291J29966J88779D51284K50922
$$ 632490 953019 363717 724140 1023269 706083 634792 764758 953537 451284 702206
13753G02206m5688N0016K19501m35708K87983k19805R2644j85770M58006l65068
$$ 702206 656518 706534 926035 490327 778310 558505 651149 465379 923385 558317
13743E58317j5791M15673k07271P4606m0585j47042J26367j03772J26557n2199
$$ 558317 542526 958199 750928 825534 784949 637907 764274 660502 787059 734860
13733G34860j76641p6269K10415J11636j22417Q1029j523n1330J51265l61705
$$ 734860 558219 481950 692365 804001 681584 762613 761090 709760 861025 499320
13723D99320k6742M45161k24576m3007J82177l5513l84972K34836j90032r6921
$$ 499320 472578 917739 693163 650156 832333 796820 411848 646684 456652 359731
13713C59731J09270o6445K9039J89670J54104C32045J23378L63275l47323K60491
$$ 359731 469001 402556 431595 621265 775369 332045 455423 818698 471375 731866
13703G31866k00984K76102C80697L41678j08102K26812l16253L41746l13812J85650
$$ 731866 530882 806984 380697 722375 614273 841085 524832 866578 552766 738416
13693G38416B72779N87012L5105j94011J12756n2683l18593J69725k86026C4N33422
$$ 738416 272779 859791 894896 700885 813641 760958 442365 612090 326064 34 533456
13682E33456O4245A79996N75963q7689j15231K12387m3656j08369k08046O7533
$$ 533456 597701 179996 755959 668270 553039 765426 721770 613401 405355 472888
13672D72888L22598C47853I8280L51088J07822j36388J18278O2707n1239o3943
$$ 472888 795486 347853 98280 449368 557190 420802 539080 601787 550548 486605
13662D86605j93971L84480l03170j21835K57115m686O1953R3549j44514L8252
$$ 486605 292634 677114 373944 252109 509224 504538 566491 660040 515526 553778
13652E53778k72056M13312j85277R2444M0599j96057j29733K56433j22166K67521
$$ 553778 281722 695034 509757 602201 642800 446743 317010 573443 451277 718798
13642G18798k91283M1702j35261J24578K46971k65262J68771k04158K2548j08304
$$ 718798 427515 469217 333956 458534 705505 440243 609014 404856 427404 319100
13632C19100P8107j73580J98422k04026r284K20184J47847j10563A78161K22022
$$ 319100 397207 223627 422049 218023 208739 428923 576770 466207 178161 400183
13622D00183N102A60656K98654J1198J11918j38103J49428k05617l8618K19465
$$ 400183 405285 160656 459310 470508 582426 444323 593751 388134 349516 568981
13612E68981j09735A21632J57384J50626J93292j39705A83884L48032M9310q2614
$$ 568981 459246 121632 279016 429642 622934 483229 183884 531916 581226 498612
13602D98612r5673A57640J78435q5914J71854j22212L1235j53667P4407K13740
$$ 498612 402939 157640 336075 250161 422015 299803 331038 177371 251778 465518
13592D65518J77009F1325M693K97814j21921J91072F2028K32880K23084B26837
$$ 465518 642527 61325 66018 363832 241911 432983 62028 294908 517992 226837
13581G5350R7663M44887p1539j61404j1059K8686L1693A66616L94447j23335A91965
$$ 75350 173013 617900 546361 384957 373898 402584 434277 166616 561063 437728 191965
13569B66114k0206L38330j81760A52688M53816j94219j96655m6478L78457N7558
$$ 266114 245908 584238 402478 152688 606504 412285 215630 169152 547609 605167
13559F05167N6501B37839B8151p215K04488K25923M2729K5488r1855A70076K65138
$$ 605167 661668 237839 28151 20936 225424 451347 494076 519564 427709 170076 435214
13548D35214K165P6206j20998j11845j23362K33043J94258A15278i1274B73120
$$ 435214 437379 513585 392587 280742 157380 390423 584681 115278 -91274 273120
13537C50238O0124j07740P3755J6354p1560Q0670j5685N9301Q0608E9619O9651
$$ 350238 410362 302622 376377 392731 321171 401841 386156 445457 526065 59619 129270
13526A29270M18500k11701l6323K39164n9009j27214F567K8406L38311n8117m7271
$$ 129270 547770 336069 299746 538910 479901 352687 6567 34973 373284 315167 267896
13515B67896J22225a1288C55798j52727K46299n4250j06780A17131M7292J19078
$$ 267896 390121 -11288 355798 203071 449370 395120 288340 117131 164423 283501
13505B83501j3851J84879j64124n4974J49187J81171B69808J36906k0934G6623
$$ 283501 269650 454529 290405 235431 384618 565789 269808 406714 385780 76623
13494A03974J64486E6885Q2023K18303L1945K1686H3012L03893a44337A9909N60139
$$ 103974 268460 56885 138908 357211 389156 410842 83012 386905 -144337 19909 580048
13483E80048e2530E27951k16634N7212O801Q2939A56959b04675C03684a61083
$$ 580048 -52530 527951 311317 368529 375330 458269 156959 -204675 303684 -161083
13472B63180J22825a79121B47946N9288I6499J70364A24137L71688j11196N8187
$$ 263180 386005 -179121 247946 307234 96499 266863 124137 495825 384629 442816
13462D42816B09437L24084A86065K32417O8907G6586J03020q9598J23414O1876
$$ 442816 209437 533521 186065 418482 487389 76586 179606 90008 213422 275298
13452B75298K02559k31252j05690k8851O8495L1637L6756l3342J77432n3131A01890
$$ 275298 477857 246605 140915 112064 180559 212196 248952 215610 393042 339911 101890
13440B3644h2374C65416j63763L00925F7134J00851N68537l06500L5275k03858
$$ 23644 -82374 365416 201653 502578 67134 167985 736522 430022 465297 261439
13430B61439j22646L35937j34230r9005J38910I9351K1375j7810M08160k33735
$$ 261439 138793 474730 340500 241495 380405 99351 120726 102916 511076 277341
13420B77341Q366b28520C83619f067B92381J70270B15093l9017J42054p2555A20712
$$ 277341 285707 -228520 383619 -6067 292381 462651 215093 176076 318130 245575 120712
13408C32725r6379o4985K49153j25607J83176G7190a09070B81279j22917J8093
$$ 332725 236346 171361 420514 294907 478083 77190 -109070 281279 158362 176455
13398A76455P6377J38416o2397K2625E5122L9461J33121J43532A08088Q8158C4198
$$ 176455 252832 391248 328851 351476 55122 94583 227704 371236 108088 196246 34198
13386B02805q4974d1709C8311j7614f7770G0021a86626I6266J81649m6921K62826
$$ 202805 117831 -41709 38311 20697 -67770 70021 -186626 96266 277915 230994 493820
13375D93820o2695b0523I4834k9432J2178P6248K66550j81405J09640L1854A36083
$$ 493820 431125 -20523 94834 65402 77580 153828 420378 238973 348613 380467 136083
13363A91572P7078K80813D5692J98423k4564K67740B08568r7800b20671A51095
$$ 191572 268650 549463 45692 244115 219551 487291 208568 110768 -220671 151095
13352B10564L5372J36132l0408j06306j2634o2654K4218J19248K13340A29783
$$ 210564 245936 382068 351660 245354 232720 170066 194284 313532 526872 129783
13341B98888j10559P1421A03251J74575k6473m0175f818C64287j04550m2602N108
$$ 298888 188329 259750 103251 277826 251353 211178 -6818 364287 259737 217135 222243
13330B22243O2359j00205L140J09208C4313K66699d4488B9800K4456K2166J8514
$$ 222243 284602 184397 187537 296745 34313 301012 -44488 29800 54256 76422 94936
13319I4936P5290P963K9962n9844J86921j49149K0687m238P5978H5899L22554
$$ 94936 170226 178189 208151 148307 335228 186079 206766 202528 278506 85899 408453
13308D08453A75882K96649A1780K75397j6251a7296m5385B54635a94500D18303
$$ 408453 175882 472531 11780 287177 270926 -17296 -62681 254635 -194500 418303
13297H8819P6353J69572q8979b7923A20376m9399L92128A67580M2871q6382a0111
$$ 88819 165172 334744 245765 -27923 120376 70977 463105 167580 210451 124069 -10111
13285a56456A85353b4134H9714o111K33233j19993Q5307L25483B38388b18269
$$ -156456 185353 -24134 89714 83603 316836 196843 282150 607633 238388 -218269
13274B63533J4928K838j3387e0421A27325O2439K92499r1423G2129b58055B35533
$$ 263533 278461 281299 267912 -50421 127325 189764 482263 390840 72129 -258055 235533
13262a8467m2242G9049L44138a8383A97759M3085H2542J35457r7676f8323D7430
$$ -18467 -60709 79049 423187 -18383 197759 240844 82542 217999 120323 -68323 47430
13250a24015B49695a23041M8327A70035L59235j72787h6663k1094B69900h2957
$$ -124015 249695 -123041 -74714 170035 529270 356483 -86663 -107757 269900 -82957
13239C84824C8693J61774B6893K60707A17178d8884B35449J0093O6555B9907K05867
$$ 384824 38693 200467 26893 287600 117178 -48884 235449 245542 312097 29907 235774
13228B35774a34811H7716K53239j46179e3515m4166l6025b1597B35032d3127A08731
$$ 235774 -134811 87716 340955 194776 -53515 -97681 -133706 -21597 235032 -43127 108731
13216A23381J42493G3205A2225b31085D02402j57355h7342A30444c6192B33532
$$ 123381 265874 73205 12225 -231085 402402 245047 -87342 130444 -36192 233532
13205B34781a43219b1310D90467A76883e3870l8429A57839K37936A73075k3713
$$ 234781 -143219 -21310 490467 176883 -53870 -92299 157839 395775 173075 149362
13195A49362p4217R3267L9523g9315p611A94330N5859j14123n3817J83377a32864
$$ 149362 75145 168412 207935 -79315 -86926 194330 250189 136066 82249 265626 -132864
13183G2775K4056R9734a89403B72364a8026A03359f4015E88621A98969N4164J52166
$$ 72775 96831 196565 -189403 272364 -18026 103359 -64015 588621 198969 253133 405299
13172D05299A83660h7941a3315l03657d1153B67254e9146B17580G2886K9405a62303
$$ 405299 183660 -87941 -13315 -316972 -41153 267254 -59146 217580 72886 102291 -162303
13160A78818H1159Q3231M6135E5150J55414q1039j5112J10159A12101a12832A18874
$$ 178818 81159 164390 210525 55150 210564 129525 114413 224572 112101 -112832 118874
13148C36014I4150K8793j7136J88261c3887j58552E7731a8927A68645G8426M88312
$$ 336014 94150 122943 105807 294068 -33887 -192439 57731 -18927 168645 78426 566738
13137E66738A03752L14645j19895m3496b41006J2433J05463A9869J52269i6929
$$ 566738 103752 418397 298502 255006 -241006 -228573 -123110 19869 172138 -96929
13126A97680j7774J18853n7769d4006C5875L0848a75916A2945K6772N4561e8528
$$ 197680 179906 298759 240990 -44006 35875 66723 -175916 12945 39717 94278 -58528
13114A66344G5125J44123q8705J53327q7711K17370H5912a67344A24315d82693
$$ 166344 75125 219248 130543 283870 196159 413529 85912 -167344 124315 -482693
13103D77960A19528L18486I5299f0418H9955K0264O2091L32198i3521C6543K44471
$$ 477960 119528 438014 95299 -60418 89955 110219 172310 504508 -93521 36543 281014
13092B81014m5853a05409A55439g8994G2783a70765c3068C70490f7460A07377
$$ 281014 235161 -105409 155439 -78994 72783 -170765 -33068 370490 -67460 107377
13081b71984J03474e9882J1571j96864D85212B21601J37132d7600m8402p1579
$$ -271984 -168510 -59882 -48311 -245175 485212 221601 358733 -47600 -96002 -167581
13071a67581c6660k9391A71379f0899A53069A8537K34437d0353p7434E660g427
$$ -167581 -36660 -66051 171379 -60899 153069 18537 252974 -40353 -117787 5660 -7427
13059A55409R9339o1414f3530k3810A61707a5623C41408E0331f6486F5984L2559
$$ 155409 254748 193334 -63530 -87340 161707 -15623 341408 50331 -66486 65984 98543
13048I8543f9407H4903d3153p287C02941c0452B2893e2872j30844E2342L73645
$$ 98543 -69407 84903 -43153 -50440 302941 -30452 22893 -52872 -183716 52342 425987
13037D25987a21245B07339Q457K8309K4168R7250c33908B22010J61680j46557
$$ 425987 -121245 207339 215796 244105 268273 365523 -333908 222010 383690 237133
13027B37133a7337p2677A04378B6618L1962B8072K42554A5409K46461r2515l753
$$ 237133 -17337 -90014 104378 26618 58580 28072 270626 15409 261870 169355 165602
13016A65602d9049H5633J53487a56838c1142A93559F3984a7396C28457B721L5071
$$ 165602 -49049 85633 239120 -156838 -31142 193559 63984 -17396 328457 2721 37792
13005C7792R2282c2500B98244d5197A32198n7748g9309B99111G7766C234c5357
$$ 37792 130074 -32500 298244 -45197 132198 74450 -79309 299111 77766 3234 -35357
12993B33133j9071i8442A77812a38943H7581i1725H588K07712e9137b7940a3655
$$ 233133 214062 -98442 177812 -138943 87581 -91725 8588 216300 -59137 -27940 -13655
12981A59151d08952A27913A9492K26874D4320a47483B25417L6120A1408N0700
$$ 159151 -408952 127913 19492 246366 44320 -147483 225417 261537 11408 62108
12971F2108N6729J1451A5074a18264j40468A42728N0868b4116B0256g7306B06520
$$ 62108 118837 130288 15074 -118264 -258732 142728 193596 -24116 20256 -77306 206520
12959f98j3474C57637i1515C5717g8731C31539n1347j05236H2496J57152n4713
$$ -698 -14172 357637 -91515 35717 -78731 331539 280192 174956 82496 239648 184935
12948A84935L36960B40471H1313k237h3971F2376B1045b4472F9305M40942H0521
$$ 184935 521895 240471 81313 79076 -83971 62376 21045 -24472 69305 510247 80521
12936A09560h3136A10338L000c4481l1490b6011D4579R833f2483j79495e481k07110
$$ 109560 -83136 110338 113338 -34481 -65971 -26011 44579 54412 -62483 -241978 -5481 -212591
12924b12591B69702o8691I225J25412a14264A98862N0982H6847c40819a46224
$$ -212591 269702 201011 9225 134637 -114264 198862 249844 86847 -340819 -146224
12913A78673b15044A31390D6001K15696M3254c21321A68488m9024N5282n2794
$$ 178673 -215044 131390 46001 261697 304951 -321321 168488 119464 174746 121952
12903A21952N2417J30286j08813b07016A46893a50446G7808a90676F721K53076
$$ 121952 174369 304655 195842 -207016 146893 -150446 77808 -190676 6721 259797
12893B59797g2062A199b16360A69037D5814a07879B15151i2777m9388f7168A44206
$$ 259797 -72062 1199 -216360 169037 45814 -107879 215151 -92777 -142165 -67168 144206
12881a92546B03313k6371G5415L133l0858K41583K154g5283r223B05690k1393
$$ -192546 203313 176942 75415 78548 47690 289273 291427 -75283 -84506 205690 184297
12870A84297a42332p3292A19546a11692C71277b9822E7595a94892a0185A15002
$$ 184297 -142332 -215624 119546 -111692 371277 -29822 57595 -194892 -10185 115002
12859a64887N9354a7027j58645A59798b11741g8339a1165l0120q8956B0119J11641
$$ -164887 -105533 -17027 -175672 159798 -211741 -78339 -11165 -41285 -130241 20119 131760
12848A31760k1202e4737C66548j54234G7239a77782F4391C334L17952a10959L2362
$$ 131760 110558 -54737 366548 212314 77239 -177782 64391 3334 321286 -110959 -78597
12837g8597A36698F370j68J27561C9745K21591a01306a3226k20266a07185k34910
$$ -78597 136698 6370 6202 133763 39745 261336 -101306 -13226 -233492 -107185 -342095
12826c42095A20606i6878D98090a98647C06904A28713k2467d65552B69657a16661
$$ -342095 120606 -96878 498090 -198647 306904 128713 106246 -465552 269657 -116661
12815C45471A26314J80718F514a78668B99578r7299a15187K3952n4475B12937
$$ 345471 126314 307032 6514 -178668 299578 202279 -115187 -91235 -145710 212937
12804a1498D9591J51691J09452d7578A40636P2591a25143B85334a47158G6834
$$ -11498 49591 201282 310734 -47578 140636 213227 -125143 285334 -147158 76834
12793b03337I1975l4195a98056F8841K72423c26585A49366b645A23492C8850f8325
$$ -203337 91975 57780 -198056 68841 341264 -326585 149366 -2645 123492 38850 -68325
12781C07195r3811K43201h1098D7266d3138A529J35836C8292a22734I9436K7639
$$ 307195 213384 456585 -81098 47266 -43138 1529 137365 38292 -122734 99436 127075
12770A27075C3001J80413B9244a2273I981b10335Q3881G2198J50559o675j07995
$$ 127075 33001 213414 29244 -12273 9981 -210335 -126454 72198 222757 216082 108087
12759A08087a34520a3726j40640M3537I5187J08815p4712b76127R4212K4546B1322
$$ 108087 -134520 -13726 -154366 -110829 95187 204002 129290 -276127 -181915 -157369 21322
12747B95763d17137h9454m1391E5570J22982B036K92229C0630N0834J58929I7289
$$ 295763 -417137 -89454 -130845 55570 178552 2036 294265 30630 81464 240393 97289
12735c06238a36608A65520b3343A99989m87q286J08804H0760K14771b616B46472
$$ -306238 -136608 165520 -23343 199989 199502 191216 300020 80760 295531 -2616 246472
12723B12518b8933B81323A37315j8219p332J61351a37635B19195e6408j27232
$$ 212518 -28933 281323 137315 119096 111764 273115 -137635 219195 -56408 -183640
12713a83640A9169R6443O7538o6669C4475b9198A37724F5358b05158B3275a6086
$$ -183640 19169 115612 183150 116481 34475 -29198 137724 65358 -205158 23275 -16086
12701c4226G1463O648a55088k40679a7858r0159A48109j7352m2199M9901K11319
$$ -34226 71463 78111 -155088 -395767 -17858 -108017 148109 130757 88558 138459 349778
12690C49778a77033B59627E1355Q882a1728r9797A32254c8914p9676A72202b00963
$$ 349778 -177033 259627 51355 60237 -11728 -111525 132254 -38914 -118590 172202 -200963
12678a68349A59703p2962a13542b1434B06872m5905e3574K0381G7349J13069c2379
$$ -168349 159703 86741 -113542 -21434 206872 160967 -53574 -33193 77349 190418 -32379
12666A62998A1245b71517c302l56514A11734J37935F4b28448h2221F0690b3717
$$ 162998 11245 -271517 -3302 -359816 111734 249669 64 -228448 -82221 60690 -23717
12654C65130G1288K44360I6398J6474P1151M7480L76246k08290g1167j49591h053
$$ 365130 71288 315648 96398 112872 184023 231503 607749 399459 -71167 -220758 -8053
12642F5444J73496A19136K04060M973A37348k3400j4911J38607J45135c17818
$$ 65444 238940 119136 323196 328169 137348 113948 99037 237644 382779 -317818
12631c8586f797B32076O9800j27614e0246J2657j99225H8385b09875j59433A0860
$$ -38586 -6797 232076 301876 174262 -50246 -37589 -236814 88385 -209875 -369308 10860
12619B35122a11403C69730b6277A62460L46910B7771L02217H9232J55048A00510
$$ 235122 -111403 369730 -26277 162460 509370 27771 329988 89232 244280 100510
12608a17015A05700k2391K88472j73932k0362M13773C4930M4256B2490C881Q5067
$$ -117015 105700 83309 371781 197849 177487 591260 34930 79186 22490 3881 88948
12597H8948b72309E7762N1837M6672d7645C3319J78730c58981h9446C76084m4958
$$ 88948 -272309 57762 109599 156271 -47645 33319 212049 -358981 -89446 376084 331126
12586C31126E0006K03827A17703m8223l67Q0596P7074A1946K12346D5715L82944
$$ 331126 50006 253833 117703 69480 69113 149709 226783 11946 224292 45715 428659
12575D28659E7369j532g0977p0867A94816I0063a26106C55585a13747B44991g3439
$$ 428659 57369 55837 -70977 -141844 194816 90063 -126106 355585 -113747 244991 -73439
12563F1553J07415b93441E027i2877j48292A58226E1071J36679K2978o1874E6054
$$ 61553 168968 -293441 5027 -92877 -241169 158226 51071 187750 210728 148854 56054
12551D17060a17140B16069k2047G6581K1475k7926P7970J41673g7792G2743j7463
$$ 417060 -117140 216069 194022 76581 98056 70130 148100 289773 -77792 72743 55280
12540E5280L5297k2515L6427i5079A13542h2669a2780m24722g7111l641m820G1685
$$ 55280 90577 68062 104489 -95079 113542 -82669 -12780 -437502 -77111 -80752 -85572 71685
12527b12781F2764A284a40916D8631J17715a17500c9861J2979j53577d0450k41959
$$ -212781 62764 1284 -140916 48631 166346 -117500 -39861 -26882 -180459 -40450 -282409
12516b82409A9489M652c44417A44963m8985K32420I7684A5858b17306c4125B11890
$$ -282409 19489 24141 -344417 144963 95978 328398 97684 15858 -217306 -34125 211890
12504F5762C2046P1048a20645B21430k3650C1075g8668G9202g4784K4701F1593
$$ 65762 32046 103094 -120645 221430 197780 31075 -78668 79202 -74784 -50083 61593
12492g4860D5652g6820m832D1623a63497l8362j53404A47589a06784j28924H5354
$$ -74860 45652 -76820 -81652 41623 -163497 -201859 -355263 147589 -106784 -235708 85354
12480h0807H1837a23846D1919d67065B72911b7308H5894b1903D35g3404A31705
$$ -80807 81837 -123846 41919 -467065 272911 -27308 85894 -21903 435 -73404 131705
12468b41501R2330f1366A49611d6335k9438H3377a72785A21966m4643H346a77546
$$ -241501 -149171 -61366 149611 -46335 -75773 83377 -172785 121966 77323 8346 -177546
12456b17638E0429R970a37172l0318H7525b92114A92361a63566G0041J2618h5546
$$ -217638 50429 60399 -137172 -167490 87525 -292114 192361 -163566 70041 82659 -85546
12444f0738j97513g8728j76717r7714F0059k3722o938K06453G153a75710L7404
$$ -60738 -258251 -78728 -255445 -353159 60059 36337 29399 235852 7153 -175710 -138306
12433a38306D4662m699a00758G5606L2156i1811B26814b25939H8451b1089B28398
$$ -138306 44662 39963 -100758 75606 107762 -91811 226814 -225939 88451 -21089 228398
12421h6675H6825c27145I6098J05974q089b55350B28731M5452a44903K1520A8272
$$ -86675 86825 -327145 96098 202072 193983 -255350 228731 274183 -144903 -123383 18272
12409B38787r5292B5870J59647F8300k2053a08332D2177a41248N2074H683J9634
$$ 238787 143495 25870 185517 68300 46247 -108332 42177 -141248 -89174 8683 28317
12398B8317e7951A65430b07669M1812A02325j9845J6571D2738J8707a0791m34635
$$ 28317 -57951 165430 -207669 -165857 102325 82480 99051 42738 61445 -10791 -445426
12387d45426A75105c77466B76624a44898k16305g0937j42811b5930B42610R3355
$$ -445426 175105 -377466 276624 -144898 -361203 -70937 -213748 -25930 242610 335965
12377C35965C3110L88389j80062g9446G0014J21079a44212A52039N8173P1488
$$ 335965 33110 421499 241437 -79446 70014 191093 -144212 152039 210212 281700
12367B81700m2873g9725j1975A64369K57100I6034a04312B86610A5386O1114J99149
$$ 281700 238827 -79725 -91700 164369 421469 96034 -104312 286610 15386 76500 275649
12356B75649f1403o7035A30399C8403j8571J16535Q3776f7892a4846F3563G885
$$ 275649 -61403 -128438 130399 38403 19832 136367 220143 -67892 -14846 63563 7885
12344A08708k4691b2066j62302A27587a04705o6674h0598C5605a42376b2148j37679
$$ 108708 84017 -22066 -184368 127587 -104705 -171379 -80598 35605 -142376 -22148 -159827
12333a59827B13183a80143q0059m12d1715l19904C9279J13118e0730B19317G0909
$$ -159827 213183 -180143 -260202 -260614 -41715 -361619 39279 152397 -50730 219317 70909
12321A163i7579p2041I6462i5254d4646k57656A6875e0920j03774e1708A20194
$$ 1163 -97579 -169620 96462 -95254 -44646 -302302 16875 -50920 -154694 -51708 120194
12309C4465J13750G2644K23202A39315m2977b45458f2225A16493b2140o2567K2360
$$ 34465 148215 72644 295846 139315 96338 -245458 -62225 116493 -22140 -84707 -62347
12298f2347C37082I6912f1734B0050B275a67362A07080m9864h0621b3230Q888
$$ -62347 337082 96912 -61734 20050 2275 -167362 107080 57216 -80621 -23230 -14342
12287a4342l3597B20799G8815b0021B43269a43872A83659L8355i1108A14042J78333
$$ -14342 -47939 220799 78815 -20021 243269 -143872 183659 222014 -91108 114042 292375
12276B92375f7795b5405k60343a13824K5398C9774a1814A95840j10d14309F6569
$$ 292375 -67795 -25405 -285748 -113824 -88426 39774 -11814 195840 195730 -414309 66569
12264b26351A51815k739b02362a3168A47520L2181M0332r7760L45653H3070c27220
$$ -226351 151815 149076 -202362 -13168 147520 179701 220033 122273 467926 83070 -327220
12252I9000l7237k3372i2117H6456c78622E9439c02996C00042h7615D0586L26208
$$ 99000 61763 38391 -92117 86456 -378622 59439 -302996 300042 -87615 40586 366794
12241C66794b19474d6637B26422n9132A5842a53092A22968l7878R4624A3235L35956
$$ 366794 -219474 -46637 226422 167290 15842 -153092 122968 85090 179714 13235 349191
12230C49191A12505N3163a87814B3104J49033K13159c2142B78013b0887l6985
$$ 349191 112505 165668 -187814 23104 172137 385296 -32142 278013 -20887 -57872
12220e7872E04527b83259A24184F1478N2137c0537m6698A17253L0423l088b53412
$$ -57872 504527 -283259 124184 61478 113615 -30537 -77235 117253 147676 144588 -253412
12208D40519a63241O6658D24259m7259j32735n9599K11606j2071A25113A2264
$$ 440519 -163241 -96583 424259 377000 244265 184666 396272 384201 125113 12264
12197b4787A76433J23068D6884b6177G9616C5796K84015d8444A68820J46141A03281
$$ -24787 176433 299501 46884 -26177 79616 35796 319811 -48444 168820 314961 103281
12185A67007l1322J41380A00293J74840H5863k1407J81120a09107D60894j60312
$$ 167007 135685 277065 100293 275133 85863 64456 245576 -109107 460894 300582
12175C00582n6265E9371K7044C6838g8172B30689C8576N4326b59304B23445g2723
$$ 300582 244317 59371 86415 36838 -78172 230689 38576 92902 -259304 223445 -72723
12163a50562A7914K62787d5694D42365j07254m8053J44070k09852j06628J30422
$$ -150562 17914 280701 -45694 442365 335111 287058 431128 221276 114648 245070
12153B45070l4631r9744Q845K9860f2645B02678g8192A44287f01857B26976k8867
$$ 245070 210439 110695 119540 149400 -62645 202678 -78192 144287 -601857 226976 198109
12142A98109b02459B15347a90742B87204a54540a8714A56770d5618l0591B79299
$$ 198109 -202459 215347 -190742 287204 -154540 -18714 156770 -45618 -76209 279299
12131a02795j30596C47343a18006b8850j86301A6151a42161G5223h9791B86016
$$ -102795 -233391 347343 -118006 -28850 -215151 16151 -142161 75223 -89791 286016
12120a04426D2286b03808G0685N3533B9102L9428b00711f5069B66891a70318c0076
$$ -104426 42286 -203808 70685 124218 29102 68530 -200711 -65069 266891 -170318 -30076
12108D9973K19771a99737F6272Q9374a33955o585b514B33615r5313k8290A4621
$$ 49973 269744 -199737 66272 155646 -133955 -140540 -2514 233615 138302 110012 14621
12096A0934J23090j7091a52305A0769c10279A17632a32592b8223j92563i3181
$$ 10934 134024 116933 -152305 10769 -310279 117632 -132592 -28223 -220786 -93181
12085a53480d5596o3717d5547p8315I8033O085g6704j41597A66283A4590a25220
$$ -153480 -45596 -109313 -45547 -123862 98033 104118 -76704 -218301 166283 14590 -125220
12073b68083B67781e8429j85119A00033b63501J02433A70205c7880A21835f7962
$$ -268083 267781 -58429 -243548 100033 -263501 -161068 170205 -37880 121835 -67962
12062A06588L7391K71689j12400H0005L36331C9985N50107L95855m29830j34649
$$ 106588 143979 415668 303268 80005 416336 39985 590092 985947 556117 421468
12052D21468j40948K74118A45668A4506J79863c3331D6431K88129e8431H3889
$$ 421468 280520 554638 145668 14506 194369 -33331 46431 334560 -58431 83889
12041f1895p8631N9960l57521a8311j35755C170M4618c90848J83131L7129B76622
$$ -61895 -140526 -80566 -438087 -18311 -154066 3170 47788 -390848 -207717 -170588 276622
12029D7229c119C7233N1228J77847a91396H6571b86989D16164a38744A66160H0380
$$ 47229 -3119 37233 88461 266308 -191396 86571 -286989 416164 -138744 166160 80380
12017a43386c4833j11253A76674J0359b39187E8449a74802B14136j04456k0307
$$ -143386 -34833 -146086 176674 187033 -239187 58449 -174802 214136 109680 89373
12007H9373a81944c0403k7319A21510l3275b81870H0853B254e7944C53950b95817
$$ 89373 -181944 -30403 -57722 121510 88235 -281870 80853 2254 -57944 353950 -295817
11995I0411J58042a82914M7988M7521B60591A15109O7198L1704o6642h527l70873
$$ 90411 248453 -182914 -134926 -87405 260591 115109 182307 214011 147369 -8527 -379400
11984c79400A4593L15185j32736C446J70805g1627I658b39464q0881J46692B1907
$$ -379400 14593 329778 197042 3446 174251 -71627 9658 -239464 -320345 -173653 21907
11972b63538a6284B45098b08164D2989Q9074E4198J33430j9991g8308B69903j31083
$$ -263538 -16284 245098 -208164 42989 132063 54198 187628 167637 -78308 269903 138820
11961A38820J26748E4741b93526L2275h9085k19075i1313D57872F865K6048h6125
$$ 138820 265568 54741 -293526 -261251 -89085 -308160 -91313 457872 6865 32913 -86125
11949e8420j97072c8884j30176A01960k6749a50889B41508i4885A45884F0659
$$ -58420 -255492 -38884 -169060 101960 75211 -150889 241508 -94885 145884 60659
11938a07010E1338f8520j69541H1807c89537e9129A39688J9394e2559j39741b4416
$$ -107010 51338 -68520 -238061 81807 -389537 -59129 139688 159082 -52559 -192300 -24416
11926D3471C410c18001A98695C8233A6020M7976m818M510a07385d7308k8787n2681
$$ 43471 3410 -318001 198695 38233 16020 63996 59178 63688 -107385 -47308 -76095 -128776
11914a28776k27013C6982J56i8282A7348b06521O3075J7649B46458b42843A54816
$$ -128776 -355789 36982 37138 -98282 17348 -206521 -143446 -125797 246458 -242843 154816
11902a1294k04753J9734L0640j03827C4586a28905K9478b2863k0546a8650j68231
$$ -11294 -216047 -196313 -165673 -269500 34586 -128905 -99427 -22863 -43409 -18650 -186881
11891a86881e4576q6782B91687a52912a5391E0644g1595P986j16580B5740J83808
$$ -186881 -54576 -141358 291687 -152912 -15391 50644 -71595 -63609 -180189 25740 209548
11880B09548i9388j5434F5689B2540J29517D3723J01116n7558f969l03350d7727
$$ 209548 -99388 -114822 65689 22540 152057 43723 144839 87281 -6969 -310319 -47727
11868i1610o4307m5777O1184j81913A32987N1884a63073B6641O9754A0039e2503
$$ -91610 -155917 -201694 -140510 -322423 132987 184871 -163073 26641 96395 10039 -52503
11856A54556K5493F1946A5463h1573D72826k18734j09211c5397k68141b9090A77461
$$ 154556 180049 61946 15463 -81573 472826 254092 144881 -35397 -303538 -29090 177461
11844h0199B06619a88508N3178B52610a15215B37183b85968M200B62120r4311
$$ -80199 206619 -188508 -135330 252610 -115215 237183 -285968 -281768 262120 167809
11834A67809b5637m847l89142E2826j3620j7096a63406O2027A92923a91742d1487
$$ 167809 -25637 -30484 -419626 52826 39206 22110 -163406 -101379 192923 -191742 -41487
11822h0826j4321A89877a40131n2152j9933E948R5819c11127K6371P4588R7666
$$ -80826 -95147 189877 -140131 -192283 -212216 5948 101767 -311127 -284756 -210168 -112502
11811a12502H5600B9069J26809D2037a82083A41020J6422i3174A30409D0909J825
$$ -112502 85600 29069 155878 42037 -182083 141020 157442 -93174 130409 40909 42734
11800D2734K80372H4028c78434J52372B01797f1145r3164L2834k56274I6311a99646
$$ 42734 323106 84028 -378434 -226062 201797 -61145 -154309 -121475 -377749 96311 -199646
11788D3607a03022C89619A16404a04120A25853e6043j26591A66108b25655b4432
$$ 43607 -103022 389619 116404 -104120 125853 -56043 -182634 166108 -225655 -24432
11777A26692b62811B24896b53333J06122B750J90015a81509b8026h624q0097A18082
$$ 126692 -262811 224896 -253333 -147211 2750 192765 -181509 -28026 -8624 -88721 118082
11765A02417a73158K7283A13097b79117c7323j41225B84805J9425b9222G5638
$$ 102417 -173158 -145875 113097 -279117 -37323 -178548 284805 304230 -29222 75638
11754i2704p2939A34782a91291B17989C6922J23821C944b75447a18414B31514
$$ -92704 -165643 134782 -191291 217989 36922 160743 3944 -275447 -118414 231514
11743A76982J54111a49914D4777P1641Q8688g4658c584j67869a5828p9926A58536
$$ 176982 331093 -149914 44777 116418 205106 -74658 -3584 -171453 -15828 -95754 158536
11731E9805N4838C6539b18104P2474O7582H950L19144a21674C16787G0560a78874
$$ 59805 114643 36539 -218104 -145630 -78048 8950 328094 -121674 316787 70560 -178874
11719e884B2924F37a47855A52058c5197A87728a27006D1843f1030E65639B49656
$$ -5884 22924 637 -147855 152058 -35197 187728 -127006 41843 -61030 565639 249656
11707A45927b69131E2711b865A27749a09033C04385m9943j9337a9302A99723f9253
$$ 145927 -269131 52711 -2865 127749 -109033 304385 254442 235105 -19302 199723 -69253
11695a43983m1029N2263C35735B0673K8606J34277E4705b2436A72840J24800a04552
$$ -143983 -185012 -132749 335735 20673 49279 183556 54705 -22436 172840 297640 -104552
11683a54332k12514h479A9969J94225C9042Q402P9397R1919l2021F6627k3979
$$ -154332 -366846 -8479 19969 214194 39042 47444 126841 218760 186739 66627 42648
11672D2648f3797B48355e0130B35944m198b43553a12144j00991P4165A7927J96754
$$ 42648 -63797 248355 -50130 235944 231746 -243553 -112144 -213135 -138970 17927 214681
11661B14681p1767P6248a83621o8323H3647J4865b74958B16380a50233q5322A42969
$$ 214681 142914 219162 -183621 -251944 83647 98512 -274958 216380 -150233 -235555 142969
11649C9754b6260B29360A06587b3762D13154B4694d7749j57943B09249N2594a59202
$$ 39754 -26260 229360 106587 -23762 413154 24694 -47749 -205692 209249 261843 -159202
11637a04571H0937J2536a1240A43089O9455H549K00522a5090C53642a20323l8367
$$ -104571 80937 93473 -11240 143089 212544 8549 209071 -15090 353642 -120323 -158690
11626a58690L172C23490a50994m9349C7571i4139F0581k8806J65961a21367N4295
$$ -158690 -155518 323490 -150994 -200343 37571 -94139 60581 31775 197736 -121367 -67072
11615f7072a7871A04859L1199c1110m84811A55615J22096a45019L8323C9339f1276
$$ -67072 -17871 104859 136058 -31110 -515921 155615 277711 -145019 -106696 39339 -61276
11603A761P8203C8863K21175q7287a3255j93988A14872J2660E6757N4335a04242
$$ 1761 79964 38863 260038 172751 -13255 -207243 114872 127532 56757 111092 -104242
11591a15291A08670A5763R5274J8496a15369r396K9899B12300L3489j00670k9242
$$ -115291 108670 15763 111037 129533 -115369 -124765 -94866 212300 245789 145119 115877
11580A15877b38675b0209B05896b9893D1971a51562C50393C040K38465c2355p6205
$$ 115877 -238675 -20209 205896 -29893 41971 -151562 350393 3040 241505 -32355 -108560
11569a08560A17381J43681q3619D6349a61467M9964J4435B39300i5830B12285
$$ -108560 117381 261062 177443 46349 -161467 -111503 -97068 239300 -95830 212285
11558A16512e21728A40733c3578H4182j7842j5227J12043b82547C96295i9591
$$ 116512 -521728 140733 -33578 84182 66340 51113 163156 -282547 396295 -99591
11547c8188j48679N7702k7361B70424D2022q121A6493J86008L8608d19502a81058
$$ -38188 -186867 -129165 -156526 270424 42022 33901 16493 202501 241109 -419502 -181058
11535B90713a41180A50161a38842f5479F9450L581M8579f69n4830C3896J22227
$$ 290713 -141180 150161 -138842 -65479 69450 73031 121610 -669 -55499 33896 156123
11524A56123R9862K9419b42783g2145H6981L6953J58889H2870c9123B96057E1751
$$ 156123 255985 285404 -242783 -72145 86981 123934 282823 82870 -39123 296057 51751
11512I4866b20586G6914J02950F345K473N6318Q3757e29709i749B3698J47381
$$ 94866 -220586 76914 179864 6345 8818 65136 148893 -529709 -9749 23698 171079
11501A71079i0578B01640d9705j70553A75038P6968q1662r110a22598K8519D7464
$$ 171079 -90578 201640 -49705 -220258 175038 252006 170344 161234 -122598 -94079 47464
11489C2886P6662N1322K14435A23981J64862b6518G3518K10001A06149h4983F9842
$$ 32886 109548 160870 375305 123981 288843 -26518 73518 283519 106149 -84983 69842
11477B46500r0439N2618b28491A62128K60015A45603K76987A58733E7971a48432
$$ 246500 156061 208679 -228491 162128 422143 145603 422590 158733 57971 -148432
11466i2670B041K29128J09064R0432B3566M7553C1477D104R0885L9865l3519K45026
$$ -92670 2041 231169 340233 430665 23566 71119 31477 4104 94989 134854 101335 346361
11454C46361p2718j19398J81255A36147D7416B277a01320C0261J30754n3642K00518
$$ 346361 273643 154245 335500 136147 47416 2277 -101320 30261 161015 107373 307891
11443C07891j0719C6399Q032L45765a14956B70672J5019E4565a89861A0724g4407
$$ 307891 297172 36399 44431 390196 -114956 270672 285691 54565 -189861 10724 -74407
11431B6643b38172C43039k2058r9246e3826j4870A67288b12514A17074b43639
$$ 26643 -238172 343039 320981 221735 -53826 -68696 167288 -212514 117074 -243639
11420a8550A91742G2511J98178g6559A09985k6194c2023A25383a54380I8419b15057
$$ -18550 191742 72511 270689 -76559 109985 83791 -32023 125383 -154380 98419 -215057
11408B23447m2511a20887A53060b12348K2617C56136K2354i5988j37353B89098
$$ 223447 180936 -120887 153060 -212348 -189731 356136 378490 -95988 -233341 289098
11397A9335a98015A90044B6174O5136a33989A02094C8149b83651j1422A32310
$$ 19335 -198015 190044 26174 91310 -133989 102094 38149 -283651 -295073 132310
11386C363b65521j2866A5770e4481B01034d4893A73208H3219b46389a2797D4906
$$ 3363 -265521 -278387 15770 -54481 201034 -44893 173208 83219 -246389 -12797 44906
11374f8790j51292e5837b654j76132B3625C94d5646r1907J0535F2682g8735I4596
$$ -68790 -220082 -55837 -2654 -178786 23625 394 -45646 -137553 -127018 62682 -78735 94596
11361a06493j09394F8851b24244f4279C569c4781k5228K4899e239D1401P414c71621
$$ -106493 -215887 68851 -224244 -64279 3569 -34781 -60009 -35110 -5239 41401 48815 -371621
11348b8241q4263A55709C5418g682B76773a73671A06390J6302b8515q5674J5179
$$ -28241 -112504 155709 35418 -7682 276773 -173671 106390 122692 -28515 -114189 -99010
11337i9010D76555n4228E8243J5155c40850B46728a27107j16228C43158d9879
$$ -99010 476555 422327 58243 73398 -340850 246728 -127107 -243335 343158 -49879
11326g2153k97866A1749c30875g0094B16719h0516A81481e3565l2960j04489k05335
$$ -72153 -370019 11749 -330875 -70094 216719 -80516 181481 -53565 -86525 -191014 -396349
11315c96349A72056a04126M5801j40079R3216A47421a87009A45918m8200J63519
$$ -396349 172056 -104126 -58325 -198404 -105188 147421 -187009 145918 97718 261237
11305B61237A00314f4122j14762I4668J85119a58487j21599A5728J1598b16912
$$ 261237 100314 -64122 -178884 94668 279787 -158487 -280086 15728 27326 -216912
11294a64964r1047E995J72661b34867q5534A77264E2147O5791m692a13320M3122
$$ -164964 -256011 5995 178656 -234867 -320401 177264 52147 117938 113246 -113320 -70198
11283g0198m7937C7441K47954b12467j61722A29145n4992J21884k8779d7214F070
$$ -70198 -118135 37441 285395 -212467 -374189 129145 74153 196037 167258 -47214 6070
11271C2842a04228B40345a7709A00758D0702K94622e8106f0l16268e2516B7916
$$ 32842 -104228 240345 -17709 100758 40702 335324 -58106 -60 -316328 -52516 27916
11259a39923q6782i2954A84404o405e5077k7826c6842A88037a83831m9805a0462
$$ -139923 -226705 -92954 184404 177999 -55077 -82903 -36842 188037 -183831 -233636 -10462
11247d3080N489B10314j03100C8501b56615a11636C9957J56949G4747a96576b2182
$$ -43080 -37591 210314 107214 38501 -256615 -111636 39957 196906 74747 -196576 -22182
11235a50147k3919g682l81639D9398a34258c3583l571A53888a1825j30841f7365
$$ -150147 -174066 -7682 -389321 49398 -134258 -33583 -37154 153888 -11825 -142666 -67365
11223a52911k89915o0996b327C5501b00374G4785a9305q7389K447a4106k83102
$$ -152911 -442826 -503822 -2327 35501 -200374 74785 -19305 -106694 -104247 -14106 -297208
11212b97208B69218a30427K1485p240D52154b20366J5355A84265b6647j56232
$$ -297208 269218 -130427 -108942 -116182 452154 -220366 -205011 184265 -26647 -182879
11202a82879A80433a39698A44755B6672J17149D997a7334j71124f4115j19091
$$ -182879 180433 -139698 144755 26672 143821 4997 -17334 -188458 -64115 -183206
11192a83206G3013A5455K67280C7305K43908b73794a28041H253a70477g8915r4970
$$ -183206 73013 15455 282735 37305 281213 -273794 -128041 8253 -170477 -78915 -173885
11181a73885j39694J5439I5756N7371m2631c33225a66065I4322m137a83398B53375
$$ -173885 -313579 -298140 95756 153127 110496 -333225 -166065 94322 90185 -183398 253375
11169I7479e23987K39064E0762N9082m5183P1593b76143K5535C29095c31221A8762
$$ 97479 -523987 -284923 50762 109844 64661 136254 -276143 -250608 329095 -331221 18762
11157c013q4819B13774p7181a04139a144j11638m4840C0006J8033c2153H8044
$$ -3013 -87832 213774 136593 -104139 -1144 -112782 -157622 30006 48039 -32153 88044
11145A20057n1945a51506F2911b01945e6206C808N374b93202a29349A48534D1649
$$ 120057 68112 -151506 62911 -201945 -56206 3808 9182 -293202 -129349 148534 41649
11133a33762D48386A22434d68315B02155K1816g162k02059k00523a82082D6085
$$ -133762 448386 122434 -468315 202155 223971 -7162 -209221 -409744 -182082 46085
11122b70731H1491K27447C1320L1613b99942G1531m414J80329B5772b70069J27251
$$ -270731 81491 308938 31320 62933 -299942 71531 67117 247446 25772 -270069 -142818
11111a42818B23512B526J08115K1743A8284K64013a56867A27846b9661j71208
$$ -142818 223512 2526 110641 132384 18284 282297 -156867 127846 -29661 -200869
11101b00869d9909A32089i86j55776F9882K6161K59692g6004A88186m8285a95197
$$ -200869 -49909 132089 -986 -156762 69882 96043 355735 -76004 188186 139901 -195197
11089I4067J28031n9659c578C32559m3205D9239L8039P4930o2678J07470K39047
$$ 94067 222098 162439 -3578 332559 289354 49239 87278 162208 99530 207000 446047
11078D46047k17102K8195R1888b4806G9611B2921K55553L4122J89956B24381A01507
$$ 446047 228945 257140 349028 -24806 79611 22921 278474 312596 502552 224381 101507
11066C40019A63223b44780E84256j17077D3905K3166J95066L82414B98695K02881
$$ 340019 163223 -244780 584256 467179 43905 67071 262137 644551 298695 501576
11056E01576k22585L1278j29271Q9641K47904K01079l11403A76759J42126L54261
$$ 501576 278991 310269 180998 270639 518543 719622 408219 176759 318885 673146
11046F73146j3125B80327J10548j56435L50680r9704R232N7772n5520K51626k71548
$$ 673146 660021 280327 390875 234440 585120 485416 494648 552420 496900 748526 476978
11035D76978Q4800N0067J84060l09208J71055J16761m6321k5823P9390J25579
$$ 476978 561778 611845 795905 486697 657752 774513 728192 702369 781759 907338
11025I07338j95768J14206j36206J54030C41170M23322J7671K29627k80615K92271
$$ 907338 711570 825776 689570 843600 341170 764492 782163 1011790 731175 1023446
11015A023446D69344J09859P1075j28532J53305j47171J28669k37847O4117L04219
$$ 1023446 469344 579203 650278 521746 675051 527880 656549 418702 482819 787038
11005G87038l14278K69508J88402D11585K14994J86927j26451R6029K00307m46842
$$ 787038 472760 742268 930670 411585 626579 813506 687055 783084 983391 536549
10995E36549N2439J60747O5915B91772J89272l7046J69487K57841k60810K25499
$$ 536549 588988 749735 815650 291772 481044 443998 613485 871326 610516 836015
10985H36015j35129J42722o6126l6474N5908J33149j17464k70867P0527L4983
$$ 836015 700886 843608 777482 741008 796916 930065 812601 541734 612261 647244
10975F47244L7436K48011k6841J39991l08582M20219Q5373j81874j19655K28854
$$ 647244 684680 932691 905850 1045841 737259 1157478 1242851 1060977 941322 1170176
10965A170176K80262q5820M77049q8329K46989k8699J83108K63519J42573j70478
$$ 1170176 1450438 1364618 1841667 1753338 2000327 1971628 2154736 2418255 2560828 2390350
10955B390350Q8574r0315j56449n13362K6662k91455o1164K05207r9814k2477
$$ 2390350 2478924 2388609 2232160 1718798 1745460 1454005 1392841 1598048 1498234 1475757
10945A475757r975K59385m40506J14361k50873J72243J05971k02164k21364j86006
$$ 1475757 1465782 1725167 1284661 1399022 1148149 1320392 1426363 1224199 1002835 816829
10935H16829l24861P4195j43460Q450j07975j6555O2688j58743E6722K74866r9459
$$ 816829 491968 566163 422703 431153 323178 306623 369311 210568 56722 331588 232129
10924B32129K76927h169C4598L1964K8326J92501F4965K25686c68883A63109L4166
$$ 232129 509056 -8169 34598 66562 94888 287389 64965 290651 -368883 163109 197275
10913A97275c0123A00404L3681g713A08681c09737i533k64140C9392a3759D9815
$$ 197275 -30123 100404 134085 -7713 108681 -309737 -9533 -273673 39392 -13759 49815
10901a36138N7983F8387i3085H5692i5631M3507C11175a23747n8485N2568J1881
$$ -136138 -78155 68387 -93085 85692 -95631 -52124 311175 -123747 -182232 -129664 -117783
10890a17783E5886J19217O3308g8094K003A25216b3940A41580a62355f2402G0514
$$ -117783 55886 175103 238411 -78094 -76091 125216 -23940 141580 -162355 -62402 70514
10878A46143f331p6754B53647j11200a14542k48693B11045h4171A15028d0475
$$ 146143 -6331 -83085 253647 142447 -114542 -363235 211045 -84171 115028 -40475
10867h7238l5350G8355e2871B86538c9830j71031R5341q449A41569j6996b20972
$$ -87238 -122588 78355 -52871 286538 -39830 -210861 -115520 -123969 141569 124573 -220972
10855b82118B8807f5762r8519m3271D6360I515L9934i65j04507M3718A19925L26313
$$ -282118 28807 -65762 -164281 -207552 46360 9515 49449 -965 -105472 -61754 119925 446238
10843D46238h7228E6032a79424A34826J53685b2898A22655h9799k028k70102B08112
$$ 446238 -87228 56032 -179424 134826 288511 -22898 122655 -89799 -91827 -361929 208112
10831a94208A79962b38493a14214j8826k36687f9432q8010C8395i3857B93192
$$ -194208 179962 -238493 -114214 -133040 -369727 -69432 -157442 38395 -93857 293192
10820C08655b00811I3141c1529j58888A57090P3804d8168A5759e7013r2983B5391
$$ 308655 -200811 93141 -31529 -190417 157090 230894 -48168 15759 -57013 -149996 25391
10808A95828K47364b38768R438a7683l14783a17586A42290a06483K071j62698
$$ 195828 443192 -238768 -229330 -17683 -332466 -117586 142290 -106483 -104412 -267110
10798b67110R6799A24280J85534d979a452j18578A84782b12215P6368N4720B62070
$$ -267110 -170311 124280 309814 -4979 -1452 -120030 184782 -212215 -135847 -81127 262070
10786B59330R0894b15566o4546a26445N3561a4963j66415p7490H8031D0692A0353
$$ 259330 350224 -215566 -280112 -126445 -72884 -14963 -181378 -258868 88031 40692 10353
10774I7788g406k1660j31854A53772a55933A53457b58071B7897f1448j40171B8069
$$ 97788 -7406 -29066 -160920 153772 -155933 153457 -258071 27897 -61448 -201619 28069
10762A24337b1831k4233j0981p2110b1267k70498e2911r0957p042n3492A7415
$$ 124337 -21831 -46064 -57045 -129155 -21267 -291765 -52911 -143868 -150910 -204402 17415
10750H8799a55013O9758g366j13711B82053a2860k88588B74992O5363g366B00116
$$ 88799 -155013 -85255 -7366 -121077 282053 -12860 -301448 274992 340355 -7366 200116
10738b6045A70692H128O2189q957J51070J12933C7642a82840A21596j5718i9845
$$ -26045 170692 8128 70317 61360 212430 325363 37642 -182840 121596 105878 -99845
10726f7616p790F8017L8179a09282g516o9882A08930Q8575O2264j22139n7025
$$ -67616 -75406 68017 106196 -109282 -7516 -77398 108930 197505 259769 137630 80605
10715H0605A1236J74645e8106q3472d8038j6659j47960L1548B77498F3949c255
$$ 80605 11236 185881 -58106 -141578 -48038 -64697 -212657 -181109 277498 63949 -3255
10703c2969j27222J012O411j3105a1566Q48E4213h083l37167C6589a45604e9016
$$ -32969 -160191 -159179 -152768 -165873 -11566 -10718 54213 -8083 -345250 36589 -145604 -59016
10690h6076a5067k7783c901k59190R5003E3014a11743n927G8456k0133b43624
$$ -86076 -15067 -42850 -3901 -263091 -168088 53014 -111743 -117670 78456 58323 -243624
10678H8502K23853a22727H9679r698a29700j07819B71050B4245K5081Q8297E5184
$$ 88502 312355 -122727 89679 79981 -129700 -237519 271050 24245 49326 137623 55184
10666c17621c0267D0980C309K9310N0871c53181H6144J9480m247l5121K35172
$$ -317621 -30267 40980 3309 32619 83490 -353181 86144 105624 101377 66256 301428
10655C01428A00191C9948J48915f3085n9621l0420H8703b88218k1946j68724B03801
$$ 301428 100191 39948 188863 -63085 -122706 -153126 88703 -288218 -310164 -478888 203801
10643B0665l967g1152A05347f2751E8873N4184b36809f4401n911q7264k22461
$$ 20665 16698 -71152 105347 -62751 58873 113057 -236809 -64401 -70312 -157576 -380037
10632c80037a69111C50054e3856j02948b2017l48531J50262H4495c61882d4297
$$ -380037 -169111 350054 -53856 -156804 -22017 -370548 -220286 84495 -361882 -44297
10621A12054C4908c15532a46570o746j49176c5722B13004C7522c66771A5743d70428
$$ 112054 34908 -315532 -146570 -153316 -302492 -35722 213004 37522 -366771 15743 -470428
10609B44508A0244N3613a17766B96629E4343c02647h9453H4446d4776j38146h8171
$$ 244508 10244 63857 -117766 296629 54343 -302647 -89453 84446 -44776 -182922 -88171
10597c6827l68251G1256c53591C8754J96068G3350B818J11133c8180B22073j08471
$$ -36827 -405078 71256 -353591 38754 234822 73350 2818 113951 -38180 222073 113602
10586A13602B4585b56747B28204g2608B19876E7005a26973c6706q6458G7783K8315
$$ 113602 24585 -256747 228204 -72608 219876 57005 -126973 -36706 -123164 77783 106098
10575A06098Q3216q8126D3708h1945A48923J69611a4754p5239B17787B8455a11255
$$ 106098 189314 101188 43708 -81945 148923 318534 -14754 -89993 217787 28455 -111255
10563g9784L3332k19983A86889a53500I005d76112f4291l04557a33994B08451
$$ -79784 -46452 -266435 186889 -153500 9005 -476112 -64291 -368848 -133994 208451
10552C7651a67589B7500J23286Q9044q4733D3391a81282L7186p7447q7958i5382
$$ 37651 -167589 27500 150786 239830 155097 43391 -181282 -144096 -221543 -309501 -95382
10540b22281j16621n9121G2863N3783b17924j16538a514A18305G804a42113j6841
$$ -222281 -338902 -398023 72863 126646 -217924 -334462 -1514 118305 7804 -142113 -158954
10529a58954A3450a66127P6298j63492b9733j89723A19529P5435c65412J76654
$$ -158954 13450 -166127 -89829 -253321 -29733 -219456 119529 194964 -365412 -188758
10519a88758A07114e0246A5928a20583e5793C63343c8724j4383j00352C34141
$$ -188758 107114 -50246 15928 -120583 -55793 363343 -38724 -53107 -153459 334141
10508b27139g7275A18231d2512k12596A09044a33995E931K73398L851a48349A43490
$$ -227139 -77275 118231 -42512 -255108 109044 -133995 5931 279329 283180 -148349 143490
10496h3486k29954h273A0208d46947b7530q4545h603k38966A34017c12642G5118
$$ -83486 -313440 -8273 10208 -446947 -27530 -112075 -8603 -247569 134017 -312642 75118
10484A51760J74876C5870K624i2568D0030d9754B15411a47390e6425k4116p5670
$$ 151760 326636 35870 38494 -92568 40030 -49754 215411 -147390 -56425 -80541 -156211
10473a56211B2524K04057Q6741A46825B6420P0959L48596k10151K30578B07084
$$ -156211 22524 226581 313322 146825 26420 97379 445975 235824 466402 207084
10462A88768A5119e2416A37424L0050b062B7339K183e3947B23317h1129F8080
$$ 188768 15119 -52416 137424 167474 -2062 27339 29522 -53947 223317 -81129 68080
10450i2762A91241a73456k20668B17663I2928Q118g3846K0738C259M0272L1954
$$ -92762 191241 -173456 -394124 217663 92928 101046 -73846 -53108 3259 43531 75485
10439G5485m326a7023A55302K7095o5719B3844J20173g707B6831c19170h8189
$$ 75485 71159 -17023 155302 182397 116678 23844 144017 -7707 26831 -319170 -88189
10427C38461c6586N653n38058e3783b6373A46250f9273C3912K0034P5067J95315
$$ 338461 -36586 -30933 -568991 -53783 -26373 146250 -69273 33912 53946 129013 324328
10416C24328b4071A8254J48350a6805B55461G5245b05907P3415I7180a89789e9531
$$ 324328 -24071 18254 166604 -16805 255461 75245 -205907 -132492 97180 -189789 -59531
10404a27837a7977l3503b0889j41189A67339J2054a06828k843B56287E2489e2539
$$ -127837 -17977 -51480 -20889 -162078 167339 179393 -106828 -109671 256287 52489 -52539
10392I2425R6028i4442A18669h1074j85357I6996b58691A61770F0680a5752A32292
$$ 92425 188453 -94442 118669 -81074 -266431 96996 -258691 161770 60680 -15752 132292
10380c6619A62302a00783a7289C57803b6792j57121A87834e1171l58614i8118
$$ -36619 162302 -100783 -17289 357803 -26792 -183913 187834 -51171 -409785 -98118
10369a99154A17660a47058P2139A90338J47596o3952P2981I7630K68853B7176
$$ -199154 117660 -147058 -74919 190338 337934 273982 346963 97630 366483 27176
10358B19248j05923l6768K079L00206N9936p9990j53864J62563j78748K94778
$$ 219248 113325 76557 78636 378842 438778 358788 204924 367487 188739 483517
10348D83517q3261d8170E5929K78256a0922D28829e4393D46683j24384K9550q7876
$$ 483517 400256 -48170 55929 334185 -10922 428829 -54393 446683 322299 351849 263973
10337B63973K061K52828J9953J01131k17782j32928l120p6282L0937k0693k3972
$$ 263973 266034 518862 538815 639946 422164 289236 286116 209834 240771 220078 196106
10326A96106K353Q4201j00214K26993J28344d6028B62380a46825j48818B5091
$$ 196106 198459 282660 182446 409439 537783 -46028 262380 -146825 -295643 25091
10315G9168a55517e3380D2257K63307d8601A77231K9826I8713Q0483N2432C6681
$$ 79168 -155517 -53380 42257 305564 -48601 177231 207057 98713 179196 231628 36681
10303A92130o214n475Q6436j3187p9358q6922a63385C99250g9222D9777c7159
$$ 192130 185916 180441 266877 253690 174332 87410 -163385 399250 -79222 49777 -37159
10291h3133A47716j1333e0673o1343n714C06718I9386J38006l5610J05687g1825
$$ -83133 147716 136383 -50673 -112016 -117730 306718 99386 237392 201782 307469 -71825
10279B39941E6565b31131F0715d06H037J08052b00922G473N2930k9796c20209
$$ 239941 56565 -231131 60715 -406 8037 116089 -200922 7473 60403 30607 -320209
10267c0588J368j73376F4926J79315G6286p61e8780l483k78086G1517d56048a07520
$$ -30588 -29220 -202596 64926 244241 76286 75525 -58780 -62263 -340349 71517 -456048 -107520
10254A81902L6215J5735o5185a83830B71914b82221A75757a28793A13015d1480
$$ 181902 218117 233852 168667 -183830 271914 -282221 175757 -128793 113015 -41480
10243B74319p1224J61255j29545C3988a23083E0224J21614a56108B35573b0235
$$ 274319 203095 364350 234805 33988 -123083 50224 171838 -156108 235573 -20235
10232f8161G4140K02719b14061h2896O20a4694B92792F1446c25848a36072m15018
$$ -68161 74140 276859 -214061 -82896 -82276 -14694 292792 61446 -325848 -136072 -551090
10221e51090i1756j17240K9509D4194a39179B89888a96446p4625I3956i312A99797
$$ -551090 -91756 -208996 -179487 44194 -139179 289888 -196446 -271071 93956 -9312 199797
10209b13819j70185B87192J29398a73585j44254a19169k2409B25263e3825n75222
$$ -213819 -384004 287192 416590 -173585 -317839 -119169 -141578 225263 -53825 -629047
10199f29047h8687A38730Q4716b10100i1513k50568G3929J92888g6276B0659d0733
$$ -629047 -88687 138730 223446 -210100 -91513 -342081 73929 266817 -76276 20659 -40733
10187a67902C16065a18613A62218b32557A8722h3876C53346b30605f9250j02828
$$ -167902 316065 -118613 162218 -232557 18722 -83876 353346 -230605 -69250 -172078
10177a72078f8242G178b58646C31053g280n1419F7635c9038n5702A41096e1561
$$ -172078 -68242 7178 -258646 331053 -7280 -58699 67635 -39038 -94740 141096 -51561
10165f482A23641k4918a55553d940j26455J7069k04813a8334j52025O0018b8931
$$ -6482 123641 98723 -155553 -4940 -131395 -114326 -319139 -18334 -170359 -110341 -28931
10153b05600N4083f6849j06192N0762e1931C347d89935H6003a51564D2803j8908
$$ -205600 -151517 -66849 -173041 -122279 -51931 3347 -489935 86003 -151564 42803 23895
10142B3895a81310A36613h8019B04842O3133E598a12236B81951p4239a59184m0942
$$ 23895 -181310 136613 -88019 204842 267975 5598 -112236 281951 207712 -159184 -200126
10131b00126f3847A8347c85782a28839A51069c5687B13914d04629J36954a14446
$$ -200126 -63847 18347 -385782 -128839 151069 -35687 213914 -404629 -267675 -114446
10120b13669e6700k76307B8338b18227A22433a43773a332j18785K9755k62912
$$ -213669 -56700 -333007 28338 -218227 122433 -143773 -1332 -120117 -90362 -353274
10110c53274d5050G6568q821c12900J18308P9297d6516L026j5426m69357a68104
$$ -353274 -45050 76568 67747 -312900 -194592 -115295 -46516 -43490 -58916 -528273 -168104
10098A50663a89692I8411a00779a1177o5670m1395D5824A888a910k06082R5562
$$ 150663 -189692 98411 -100779 -11177 -76847 -118242 45824 1888 -1910 -207992 -112430
10087a12430J7975A12968a89283d5604m8880b2302j46143o6199F0631c70339C18371
$$ -112430 -94455 112968 -189283 -45604 -94484 -22302 -168445 -234644 60631 -370339 318371
10075b71406d8062A39761b13347R1233n4701C30940b39280q18a2893j39985P5103
$$ -271406 -48062 139761 -213347 -122114 -176815 330940 -239280 -240098 -12893 -152878 -77775
10064g7775K7867F0229h0829C3983d26227P3227J59593D815J37162e3684p2541
$$ -77775 -49908 60229 -80829 33983 -426227 -353000 -193407 4815 141977 -53684 -126225
10053a26225k56754A44792a59098l0403A12744C6089P1618a1321m0000B58877
$$ -126225 -382979 144792 -159098 -189501 112744 36089 107707 -11321 -51321 258877
10042A3191h9070j26251B30263a28153B3490d21320a51309j86871a68560Q3148
$$ 13191 -89070 -215321 230263 -128153 23490 -421320 -151309 -338180 -168560 -85412
10032h5412q0135A41110o4557i6118A03666a60565A8082J06833c49700A7319K9231
$$ -85412 -165547 141110 76553 -96118 103666 -160565 18082 124915 -349700 17319 46550
10021D6550o912b50026A29350J5069b00725A17722f9238b819k65368b6806E3719
$$ 46550 39638 -250026 129350 144419 -200725 117722 -69238 -2819 -268187 -26806 53719
10009A21146h7997H1589J70165j13013J69816A2293O6843J0553L07997A43473
$$ 121146 -87997 81589 251754 138741 308557 12293 79136 89689 397686 143473
9998G2581c88403C38026a28668L1965C5323b32905a9565E11520a75288p8502A09150
$$ 72581 -388403 338026 -128668 -96703 35323 -232905 -19565 511520 -175288 -253790 109150
9986a46370O4642j1129j90734N5331i2811a6830j43937j61491J6912a683j07850
$$ -146370 -81728 -92857 -283591 -228260 -92811 -16830 -160767 -322258 -305346 -1683 -109533
9975a09533o2847K4060k09585B7582J2687K33178B9428O5121c10321G0040g9545
$$ -109533 -172380 -148320 -357905 27582 40269 273447 29428 94549 -310321 70040 -79545
9963c72584f3804j57659b108l630j8377j96399c6336J440A09797L52934a30076
$$ -372584 -63804 -221463 -2108 -5738 -24115 -220514 -36336 -34896 109797 462731 -130076
9951e9415A52332n3105a75304D2002B005J56198F3624b14356f0158G2281a08A05020
$$ -59415 152332 99227 -175304 42002 2005 158203 63624 -214356 -60158 72281 -108 105020
9938A03244a41333j15350b5596j30836d9196k06672A44513a84525g218E2687R8268
$$ 103244 -141333 -256683 -25596 -156432 -49196 -255868 144513 -184525 -7218 52687 150955
9927A50955D1759j3714K4807K24355A00880a37476f0461l9355J8034j87643a29376
$$ 150955 41759 28045 52852 277207 100880 -137476 -60461 -99816 -81782 -269425 -129376
9915B13597b0610A24943c11167a89H4258c6334A22812f3213H1825M4615O1291
$$ 213597 -20610 124943 -311167 -189 84258 -36334 122812 -63213 81825 126440 187731
9904A87731c0135k24663E8389A9536c8091k50462e7490k6349a3523l00648F8810
$$ 187731 -30135 -254798 58389 19536 -38091 -288553 -57490 -83839 -13523 -314171 68810
9892b71138A50234a64078l3017A23462C0181b23916g0384p4249M4866A2046b27272
$$ -271138 150234 -164078 -197095 123462 30181 -223916 -70384 -144633 -99767 12046 -227272
9880a7501r8720K7116j58105N5046l22086D4887L9440f1440N867B45790a4733
$$ -17501 -116221 -89105 -247210 -192164 -514250 44887 84327 -61440 -55573 245790 -14733
9868c7728Q622n87790i982j85434f2830e319j13011j63885A65183o5808a48202
$$ -37728 -29106 -616896 -9982 -195416 -62830 -5319 -118330 -282215 165183 99375 -148202
9856A86716L2579I5575a75640C5907c54849J29265A94418c00638M4285D06113
$$ 186716 219295 95575 -175640 35907 -354849 -225584 194418 -300638 -256353 406113
9845b08554o6811I5812a61448a7549F0925g8619D5370a19202b0492B67921c58137
$$ -208554 -275365 95812 -161448 -17549 60925 -78619 45370 -119202 -20492 267921 -358137
9833a70163g9376n791j26516l00895i84A99625a42867K6558N0963I9037a43721
$$ -170163 -79376 -85167 -211683 -512578 -984 199625 -142867 -116309 -65346 99037 -143721
9821a75256O5611j4115j97367R9660A8455a85751A36179C5227b38229R4605k21576
$$ -175256 -109645 -123760 -321127 -221467 18455 -185751 136179 35227 -238229 -143624 -365200
9810c65200A2457b80779a08035j85640A11961a32098A60246k4162h9706c6570
$$ -365200 12457 -280779 -108035 -293675 111961 -132098 160246 136084 -89706 -36570
9799a64685e7434j27622h7215j67723Q3942F0618j5370b19368l9685A78121G9289
$$ -164685 -57434 -185056 -87215 -254938 -170996 60618 45248 -219368 -259053 178121 79289
9787a03036M3997A49064b33622c9367H2234b0227F9838J74348a7220F5168n168
$$ -103036 -59039 149064 -233622 -39367 82234 -20227 69838 244186 -17220 65168 60000
9776F0000a35594A11372g0693A44976d3914D9071A5333b14130A97354m3172i9857
$$ 60000 -135594 111372 -70693 144976 -43914 49071 15333 -214130 197354 154182 -99857
9764b00100f2044I3995b30241B9374c02008B4557K06946B3285a80708A14974c97121
$$ -200100 -62044 93995 -230241 29374 -302008 24557 231503 23285 -180708 114974 -397121
9752b14289g4535K7884r9163a4279A54744a29629m6801N4968j07589c3094A30350
$$ -214289 -74535 -46651 -145814 -14279 154744 -129629 -176430 -121462 -229051 -33094 130350
9740a37445D0440a23814o2258j48443a00913c2916j84763L418K5128L6190A30818
$$ -137445 40440 -123814 -186072 -334515 -100913 -32916 -217679 -214261 -189133 -152943 130818
9728H7955h3564A407K4704a63938a4607l6547A10913c51132i2308j72810D8561
$$ 87955 -83564 1407 26111 -163938 -14607 -51154 110913 -351132 -92308 -265118 48561
9716e74457h9529J3001k46406C7808b5450j28902H9448a21554j96338Q908G9947
$$ -574457 -89529 -76528 -322934 37808 -25450 -154352 89448 -121554 -317892 -308984 79947
9704f2992q4223J1614C13443E1131a00394M1111A21410b58122K4851j07182H567
$$ -62992 -147215 -135601 313443 51131 -100394 -59283 121410 -258122 -233271 -340453 8567
9692B22454b03254O8887H7113Q2999G8801Q605a23885E8800N0860b87516L6435
$$ 222454 -203254 -134367 87113 170112 78801 87406 -123885 58800 109660 -287516 -251081
9681b51081A25835a86446g6938b2535p6900E6468c44509c0504D83141C8000a64172
$$ -251081 125835 -186446 -76938 -22535 -99435 56468 -344509 -30504 483141 38000 -164172
9669a38118B4097c669j65193J360A30831F4810g7861k03048k3773B1073c52619
$$ -138118 24097 -3669 -168862 -167502 130831 64810 -77861 -280909 -304682 21073 -352619
9657B0562b43933J13431E7733K34836b60598B02231a47213C4834b68462I6338
$$ 20562 -243933 -130502 57733 292569 -260598 202231 -147213 34834 -268462 96338
9646c09828d0827j04086l8446A02230m101c479k8586k78860A1744a36392M5353
$$ -309828 -40827 -144913 -183359 102230 98129 -3479 -32065 -310925 11744 -136392 -91039
9635i1039j71516B16448b56384N8102m575l55854b14533J00446j7269J5813D7069
$$ -91039 -262555 216448 -256384 -198282 -202857 -558711 -214533 -114087 -131356 -115543 47069
9623b71728A2320d2034D9723A0939d04961a84016P6275H1953R4723C5498M1415
$$ -271728 12320 -42034 49723 10939 -404961 -184016 -107741 81953 176676 35498 76913
9612G6913b73285f0353j0672l5501I703J93000e2539A41165M326j8485b64253
$$ 76913 -273285 -60353 -71025 -106526 9703 202703 -52539 141165 145491 127006 -264253
9600b1091A40072L653J1591C8757b23639N225a02829m5293k12238a19982k4176
$$ -21091 140072 143725 155316 38757 -223639 -218414 -102829 -148122 -360360 -119982 -144158
9589a44158b8205j53879B08674g1037G9049a86487e8203A6130M0443J47203a83228
$$ -144158 -28205 -182084 208674 -71037 79049 -186487 -58203 16130 56573 203776 -183228
9577A31714m7096e4889k80765D1612a92219N9086J4366B61355a98321f2596I2539
$$ 131714 84618 -54889 -335654 41612 -192219 -133133 -118767 261355 -198321 -62596 92539
9565a52424f2634K6878H4324c14181A47619e8820G6328k4301a4225o8547A11513
$$ -152424 -62634 -35756 84324 -314181 147619 -58820 76328 52027 -14225 -82772 111513
9553d4546l17087I6833R202J14041c962j96647j48584A29802Q477f7427A12854
$$ -44546 -361633 96833 106035 220076 -3962 -200609 -349193 129802 138279 -67427 112854
9541A32224a18854B70069a62711A12623a66262k52810a58628e4321j34604M8706
$$ 132224 -118854 270069 -162711 112623 -166262 -419072 -158628 -54321 -188925 -140219
9531a40219A5244a30487p1081B16929h9602j25110C4296a01212A863c17996g6343
$$ -140219 15244 -130487 -201568 216929 -89602 -214712 34296 -101212 1863 -317996 -76343
9519a237B2734P3533J38822c34832r5453a01040A8074J11748l2829a53049N7855
$$ -1237 22734 96267 235089 -334832 -430285 -101040 18074 129822 96993 -153049 -95194
9508i5194A8350a57325A13501a34108j87208J56372J8210f5577A43296a96469
$$ -95194 18350 -157325 113501 -134108 -321316 -164944 -146734 -65577 143296 -196469
9497a09830c3852r7417k31722H4813A4669a52503B57040b32320a3008A58111a09664
$$ -109830 -33852 -131269 -362991 84813 14669 -152503 257040 -232320 -13008 158111 -109664
9485a39259r597j19081e7368A04547E0493L5481a69254a1274j77096b5744A22300
$$ -139259 -148856 -267937 -57368 104547 50493 85974 -169254 -11274 -188370 -25744 122300
9473a20349n7552m406K7403d7142m00327a14474B8707J4173a59776P0779a9793
$$ -120349 -177901 -182307 -154904 -47142 -447469 -114474 28707 42880 -159776 -88997 -19793
9461E6321L2722c41847a9879k67728B22077r2427N4993N8310j15768c0308m74069
$$ 56321 89043 -341847 -19879 -287607 222077 129650 184643 242953 127185 -30308 -504377
9450e04377b17396j6976g5728A24213b05100B83771a04928j66950f4115E0761
$$ -504377 -217396 -234372 -75728 124213 -205100 283771 -104928 -271878 -64115 50761
9439a35914A41106b85257j14925J49792B03963a97122B0916a6800F6436h7329
$$ -135914 141106 -285257 -400182 -250390 203963 -197122 20916 -16800 66436 -87329
9428a5253j64130M6886B14743a56786e1785j94661J06211H9425b22206Q7188p08
$$ -15253 -179383 -132497 214743 -156786 -51785 -246446 -140235 89425 -222206 -135018 -135726
9417a35726e0564A89741A6189b54210a3622m09135a31683J3648B34045a31879
$$ -135726 -50564 189741 16189 -254210 -13622 -422757 -131683 -118035 234045 -131879
9406E073b27019a04087m3545B3530a43612B8179a66796l7358a4071n7193k54589
$$ 5073 -227019 -104087 -147632 23530 -143612 28179 -166796 -204154 -14071 -71264 -325853
9395c25853L5618c2234k43428G5889A9186a10648D6434a4151B20904I4971J57292
$$ -325853 -290235 -32234 -275662 75889 19186 -110648 46434 -14151 220904 94971 252263
9384B52263b7181a0402j01245G7526c2438l403F7643d1370D9129R5128c11951
$$ 252263 -27181 -10402 -111647 77526 -32438 -35841 67643 -41370 49129 144257 -311951
9372F4888a56780G0206c3710A12014b31242O8690j11515Q8703c8074k01100A11294
$$ 64888 -156780 70206 -33710 112014 -231242 -162552 -274067 -185364 -38074 -239174 111294
9360I343N2000K29669a14903k8868j24775B78625e9066C16133D7274l488a50285
$$ 9343 61343 291012 -114903 -143771 -268546 278625 -59066 316133 47274 43786 -150285
9348A48433C0992L5252b66468J11992A42615a00935a1604j2185A0294a6467m8859
$$ 148433 30992 66244 -266468 -154476 142615 -100935 -11604 -23789 10294 -16467 -65326
9337f5326R909A56572B4263K938c80625a51335K8148J5379m3048c8378k16364
$$ -65326 -55417 156572 24263 27201 -380625 -151335 -123187 -107808 -150856 -38378 -254742
9326b54742f3317o9302A99120L02I936R202G615a16447j13520j61180f2995j88691
$$ -254742 -63317 -132619 199120 199422 9936 19138 7615 -116447 -229967 -391147 -62995 -251686
9314b51686I3326b21160a08670J9449H5385a73218p6282A20496a58583H4057B4444
$$ -251686 93326 -221160 -108670 -89221 85385 -173218 -249500 120496 -158583 84057 24444
9302b88973I7259a3629H2182A9459d5520E5513e3684k1713j3343o0445A15048
$$ -288973 97259 -13629 82182 19459 -45520 55513 -53684 -75397 -88740 -149185 115048
9290e69123e6631n328F7609L36a12353d1401O174r4487a26l00167E2774b978E4994
$$ -569123 -56631 -61959 67609 67945 -112353 -41401 -35227 -129714 -126 -300293 52774 -2978 54994
9276e2323A3233c25735g2567j13585j2542M5950A97235j6238a09926J5227p6931
$$ -52323 13233 -325735 -72567 -186152 -198694 -152744 197235 180997 -109926 -94699 -171630
9265a71630d1249n9187l3396o6935l0961A26644a88354c0022B62411E9176a72303
$$ -171630 -41249 -100436 -133832 -200767 -231728 126644 -188354 -30022 262411 59176 -172303
9253a74098h3492C4282P5624k2708r580j5810M6326b50231M4066D06081c90496
$$ -174098 -83492 34282 109906 87198 77618 61808 108134 -250231 -206165 406081 -390496
9241c73175A23712E9001b1477k05504I573a5593F0366a82764j7042e8314A41253
$$ -373175 123712 59001 -21477 -226981 9573 -15593 60366 -182764 -199806 -58314 141253
9229d5173k44879H0106J32005e4814b732A00311a44603k46481b1153A39103d9050
$$ -45173 -290052 80106 212111 -54814 -2732 100311 -144603 -391084 -21153 139103 -49050
9217a67212l9155a00666J7717b6150j83779H9519J4561b5370j73720g3067k73358
$$ -167212 -206367 -100666 -82949 -26150 -209929 89519 104080 -25370 -199090 -73067 -346425
9206c46425B79568B3319a06095j64363D3889K9952r570c24742B31127r9289o887
$$ -346425 279568 23319 -106095 -270458 43889 73841 64271 -324742 231127 131838 124951
9195A24951k5573K00047c19701J24378L3369j67786E8943K1456c14875I8004c15419
$$ 124951 99378 299425 -319701 -195323 -161954 -329740 58943 80399 -314875 98004 -315419
9183a79082a1369l9694C9891b79406a12039A82717N3397a53579D1190H479a83905
$$ -179082 -11369 -51063 39891 -279406 -112039 182717 236114 -153579 41190 8479 -183905
9171B7923j2588P1795d70678A16478b30260J5687I4770d2024J0673D2638a42277
$$ 27923 15335 87130 -470678 116478 -230260 -214573 94770 -42024 -31351 42638 -142277
9159a71468f4565j03231O0827P240J1913j27069f5897p4504M6214A41214b56661
$$ -171468 -64565 -167796 -106969 -99729 -87816 -214885 -65897 -140401 -94187 141214 -256661
9147a26698j46529J35660O3837j27794h2366I4468a94588A34907J1085a2462j34998
$$ -126698 -273227 -137567 -73730 -201524 -82366 94468 -194588 134907 145992 -12462 -147460
9136a47460B47302b34174e8239m63019b19726J03860A35480K96860b137H3959
$$ -147460 247302 -234174 -58239 -521258 -219726 -115866 135480 432340 -2137 83959
9125f157j83588g5184j15697A16698n047m0432g4607j47692A18124A547J28813
$$ -6157 -189745 -75184 -190881 116698 111651 71219 -74607 -222299 118124 1547 130360
9114A30360a84745A79782i9233l336K5201j31976j71501h8311C5024a1415A20738
$$ 130360 -184745 179782 -99233 -102569 -77368 -209344 -380845 -88311 35024 -11415 120738
9102B57159a78963A1282f2439C8514c44617b73B61720b23402A67695a12485p8858
$$ 257159 -178963 11282 -62439 38514 -344617 -273 261720 -223402 167695 -112485 -191343
9091a91343A0481c00513e5800I726a50747i115m03335e0534A5954d24939I371
$$ -191343 10481 -300513 -55800 9726 -150747 -9115 -412450 -50534 15954 -424939 9371
9079A54572A8876a11979A92970a81847B0891J40892E5157f4575r1585a8818j6941
$$ 154572 18876 -111979 192970 -181847 20891 161783 55157 -64575 -156160 -18818 -35759
9068c5759r0831c0811A81778a97176A06776b81771A52380d58934B11765b70632
$$ -35759 -126590 -30811 181778 -197176 106776 -281771 152380 -458934 211765 -270632
9057a06685B75748E1821a0096C9503d12005f4686k12001A00003a1100p3095j9007
$$ -106685 275748 51821 -10096 39503 -412005 -64686 -276687 100003 -11100 -84195 -103202
9046a03202A60858b05343C11118a41811A59770G7953c461l1706b753j19615j09093
$$ -103202 160858 -205343 311118 -141811 159770 77953 -3461 -35167 -2753 -122368 -231461
9035b31461b6583B89432E4416a82290H2826b4740m64947J63177f5247B7917K65842
$$ -231461 -26583 289432 54416 -182290 82826 -24740 -489687 -326510 -65247 27917 293759
9024B93759F790b3962j22873e9173k03691A74279h2343j35986B15650d5605B07019
$$ 293759 6790 -23962 -146835 -59173 -262864 174279 -82343 -218329 215650 -45605 207019
9012c1242l36782I6967b79862B6213e8710d730H0091b96827J34631L2723j28711
$$ -31242 -368024 96967 -279862 26213 -58710 -4730 80091 -296827 -162196 -129473 -258184
9001b58184e6085A78503J62656h9433D6844J0856a22441k2562k62358J10872R9619
$$ -258184 -56085 178503 341159 -89433 46844 57700 -122441 -145003 -407361 -296489 -196870
8990a96870q4777J38072j25333A81439c64770a35586A65522a22724d2469j15953
$$ -196870 -281647 -143575 -268908 181439 -364770 -135586 165522 -122724 -42469 -158422
8980a58422k8851k4319g5390p2248d4425H3855c09494B20724r5536a34539i887
$$ -158422 -187273 -211592 -75390 -147638 -44425 83855 -309494 220724 125188 -134539 -9887
8968A08599O1688M1661h4785A45875O7268h2217f138A66325b91661J45105A8749
$$ 108599 170287 211948 -84785 145875 213143 -82217 -6138 166325 -291661 -146556 18749
8956A04300a23523K8871J3212L5757k30927E0433q183e8281H5989j2206J7680
$$ 104300 -123523 -94652 -81440 -45683 -276610 50433 42250 -58281 85989 73783 91463
8945I1463h2736j88365F3212b22947i9239k19675A29186f9914Q232A61603F838
$$ 91463 -82736 -271101 63212 -222947 -99239 -318914 129186 -69914 -61682 161603 6838
8933e0360B51730a684l2279H057a0591l03197J00918A00148A2034P6748g4034
$$ -50360 251730 -1684 -33963 8057 -10591 -313788 -212870 100148 12034 88782 -74034
8921a03294a6406A76551L7600E4179J46937D6177O8398g7861C4291K97322A48262
$$ -103294 -16406 176551 214151 54179 201116 46177 114575 -77861 34291 331613 148262
8909E62881M39147P34699J373441M589550k919720k014234j304268m88358k92979
$$ 562881 1002028 1736727 3110168 7699718 4779998 2765764 1461496 973138 680159
8900F80159k25358j71921j03948k2306o1370p424L037f6955D2149a83865f779
$$ 680159 454801 282880 178932 156626 95256 87832 90869 -66955 42149 -183865 -6779
8888D52965a39556B76829b47013p9819d8224A42431a60117k03301f3238j6944
$$ 452965 -139556 276829 -247013 -326832 -48224 142431 -160117 -363418 -63238 -80182
8878h0182B71775a36264q7930O99g2291G4832c597B61122g3120k4995I842b39006
$$ -80182 271775 -136264 -224194 -223495 -72291 74832 -3597 261122 -73120 -98115 9842 -239006
8865B38677h6788A16507a18666j86684g3225E6683c37932i3689j98642A06644
$$ 238677 -86788 116507 -118666 -305350 -73225 56683 -337932 -93689 -292331 106644
8854h6355L6129f871k9139A61663o0266b33453C53587j68244b36109K9959j17037
$$ -86355 -50226 -6871 -36010 161663 101397 -233453 353587 185343 -236109 -206150 -323187
$$ [...]
##END NTUPLES=NMR SPECTRUM
##END=
