
##TITLE=AC1108_Colombia_5867723_BWHFcMVOUX
##JCAMPDX= 6.0         $$ Bruker NMR JCAMP-DX V2.0
##DATA TYPE= NMR SPECTRUM
##DATA CLASS= NTUPLES
##ORIGIN= BRUKER
##OWNER= Administrator
$$ 1.72 TOPSPIN		Version 2.1
$$ 2012-03-30 23:54:50.328 -0500  Administrator@TOPSPIN
$$ Compression mode = diff/dup
##.OBSERVE FREQUENCY= 400.13188235
##.OBSERVE NUCLEUS= ^1H
##.ACQUISITION MODE= SIMULTANEOUS (DQD)
##.ACQUISITION SCHEME= undefined
##.AVERAGES= 64
##.DIGITISER RES= 22
##SPECTROMETER/DATA SYSTEM= spect
##.PULSE SEQUENCE= noesygpps1d.comp
##.SOLVENT NAME= COFFEE_meoh
##.SHIFT REFERENCE= INTERNAL, COFFEE_meoh, 1, 14.96659
##AUDIT TRAIL= $$ (NUMBER, WHEN, WHO, WHERE, PROCESS, VERSION, WHAT)
$$ ##TITLE= Audit trail, TOPSPIN		Version 2.1
$$ ##JCAMPDX= 5.01
$$ ##ORIGIN= Bruker BioSpin GmbH
$$ ##OWNER= Administrator
$$ $$ C:\Bruker\TOPSPIN/data/COFFEE/nmr/AC1108_Colombia_5867723_BWHFcMVOUX/12/pdata/1/auditp.txt
$$ ##AUDIT TRAIL=  $$ (NUMBER, WHEN, WHO, WHERE, PROCESS, VERSION, WHAT)
(   1,<2012-03-30 23:54:45.609 -0500>,<Administrator>,<TOPSPIN>,<go>,<TOPSPIN 2.1>,
      <created by zg
	started at 2012-03-30 23:43:13.937 -0500,
	POWCHK enabled, PULCHK disabled,
       configuration hash MD5:
       1A 1E CE 29 27 FD 77 03 67 4E F0 E3 C4 B2 CB 90
       data hash MD5: 64K
       B8 1C 0E 95 B3 8E 1D BC C0 2C E5 0C BC E7 03 3C>)
(   2,<2012-03-30 23:54:48.359 -0500>,<Administrator>,<TOPSPIN>,<proc1d>,<TOPSPIN 2.1>,
      <Start of raw data processing
       efp LB = 0.3 FT_mod = 6 PKNL = 1 PHC0 = 0 PHC1 = 0 SI = 128K 
       data hash MD5: 128K
       50 3E CB CC 4D 72 BF 3E D0 83 DA D7 1E A2 EF E6>)
(   3,<2012-03-30 23:54:49.578 -0500>,<Administrator>,<TOPSPIN>,<proc1d>,<TOPSPIN 2.1>,
      <pk PHC0 = 30.6189 PHC1 = 0 
       data hash MD5: 128K
       3A 26 AE 85 69 DB 82 8D 49 15 96 D2 E3 3C 2D 46>)
(   4,<2012-03-30 23:54:49.812 -0500>,<Administrator>,<TOPSPIN>,<proc1d>,<TOPSPIN 2.1>,
      <abs ABSG = 1 
       data hash MD5: 128K
       30 2A 5E 0D 68 6B 2F 0B 3C C4 FD 01 D9 36 7C 51>)
(   5,<2012-03-30 23:54:49.890 -0500>,<Administrator>,<TOPSPIN>,<proc1d>,<TOPSPIN 2.1>,
      <abs ABSG = 2 
       data hash MD5: 128K
       78 76 28 D5 40 74 22 05 22 02 E0 99 65 68 C5 73>)
(   6,<2012-03-30 23:54:49.953 -0500>,<Administrator>,<TOPSPIN>,<proc1d>,<TOPSPIN 2.1>,
      <abs ABSG = 3 
       data hash MD5: 128K
       26 AE E0 55 EE F6 70 18 0A D8 A6 BC F9 D8 0E 31>)
(   7,<2012-03-30 23:54:50.187 -0500>,<Administrator>,<TOPSPIN>,<proc1d>,<TOPSPIN 2.1>,
      <abs ABSG = 4 
       data hash MD5: 128K
       44 05 13 C7 48 2E C3 C2 4E 79 65 4E DF B5 1B 9A>)
(   8,<2012-03-30 23:54:50.234 -0500>,<Administrator>,<TOPSPIN>,<proc1d>,<TOPSPIN 2.1>,
      <abs ABSG = 5 
       data hash MD5: 128K
       38 36 5A E4 74 80 B9 F4 6E 35 7A 0B 57 23 CD 70>)
$$ ##END=
$$ 
$$ $$ hash MD5
$$ $$ CE 8D D3 94 1D 33 12 78 E2 C7 65 0E 60 29 AE 8F
##$RELAX= 
##$RELAX= 
##$RELAX= 
##$RELAX= 
##$RELAX= 
##$RELAX= 
##$RELAX= 
##$RELAX= 
$$ Bruker specific parameters
$$ [...]
##$TP07= 0
##$TPNAME0= <>
##$TPNAME1= <>
##$TPNAME2= <>
##$TPNAME3= <>
##$TPNAME4= <>
##$TPNAME5= <>
##$TPNAME6= <>
##$TPNAME7= <>
##$TPOAL= (0..7)
0.5 0.5 0.5 0.5 0.5 0.5 0.5 0.5
##$TPOFFS= (0..7)
0 0 0 0 0 0 0 0
##$TUNHIN= 0
##$TUNHOUT= 0
##$TUNXOUT= 0
##$USERA1= <user>
##$USERA2= <user>
##$USERA3= <user>
##$USERA4= <user>
##$USERA5= <user>
##$V9= 5
##$VALIST= <valist>
##$VCLIST= <CCCCCCCCCCCCCCC>
##$VD= 0
##$VDLIST= <DDDDDDDDDDDDDDD>
##$VPLIST= <PPPPPPPPPPPPPPP>
##$VTLIST= <TTTTTTTTTTTTTTT>
##$WBST= 2048
##$WBSW= 25
##$XGAIN= (0..3)
0 0 0 0
##$XL= 0
##$YL= 0
##$YMAX_a= 10271509
##$YMIN_a= -5950059
##$ZGOPTNS= <>
##$ZL1= 120
##$ZL2= 120
##$ZL3= 120
##$ZL4= 120
##$ABSF1= 14.96659
##$ABSF2= -5.58594
##$ABSG= 5
##$ABSL= 3
##$ALPHA= 0
##$AQORDER= 0
##$ASSFAC= 0
##$ASSFACI= 0
##$ASSFACX= 0
##$ASSWID= 0
##$AUNMP= <proc_prof1d_extract.lims>
##$AXLEFT= 0
##$AXNAME= <>
##$AXNUC= <1H>
##$AXRIGHT= 0
##$AXTYPE= 0
##$AXUNIT= <>
##$AZFE= 0.1
##$AZFW= 0.1
##$BCFW= 0
##$BC_mod= 0
##$BYTORDP= 0
##$COROFFS= 0
##$CY= 15
##$DATMOD= 1
##$DC= 0
##$DFILT= <>
##$DTYPP= 0
##$F1P= 0
##$F2P= 0
##$FCOR= 0.5
##$FTSIZE= 131072
##$FT_mod= 6
##$GAMMA= 0
##$GB= 0
##$INTBC= 1
##$INTSCL= 1
##$ISEN= 128
##$LB= 0.3
##$LEV0= 0
##$LPBIN= 0
##$MAXI= 10000
##$MC2= 0
##$MEAN= 0
##$ME_mod= 0
##$MI= 0
##$NCOEF= 0
##$NC_proc= -3
##$NLEV= 6
##$NOISF1= 0
##$NOISF2= 0
##$NSP= 0
##$NTH_PI= 0
##$NZP= 0
##$OFFSET= 14.96659
##$PC= 1
##$PHC0= 30.6189
##$PHC1= 0
##$PH_mod= 1
##$PKNL= yes
##$PPARMOD= 0
##$PPDIAG= 0
##$PPIPTYP= 0
##$PPMPNUM= 2147483647
##$PPRESOL= 1
##$PSCAL= 4
##$PSIGN= 0
##$PYNMP= <proc.py>
##$REVERSE= no
##$SF= 400.130005611094
##$SI= 131072
##$SIGF1= 0
##$SIGF2= 0
##$SINO= 400
##$SIOLD= 131072
##$SPECTYP= <>
##$SREGLST= <1H.CDCl3>
##$SSB= 0
##$STSI= 131072
##$STSR= 0
##$SW_p= 8223.68421052632
##$SYMM= 0
##$S_DEV= 0
##$TDeff= 65536
##$TDoff= 0
##$TI= <>
##$TILT= no
##$TM1= 0
##$TM2= 0
##$TOPLEV= 0
##$USERP1= <user>
##$USERP2= <user>
##$USERP3= <user>
##$USERP4= <user>
##$USERP5= <user>
##$WDW= 1
##$XDIM= 131072
##$YMAX_p= 418447621
##$YMIN_p= -187874337
##$CURPLOT= <Network HP LaserJet P1505>
##$CURPRIN= <$Network HP LaserJet P1505>
##$DFORMAT= <normdp>
##$LAYOUT= <+/1D_H.xwp>
##$LFORMAT= <normlp>
##$PFORMAT= <normpl>
##$SURQMSG= 1
$$ End of Bruker specific parameters
$$ ---------------------------------
##NTUPLES= NMR SPECTRUM
##VAR_NAME=  FREQUENCY,     SPECTRUM/REAL,   SPECTRUM/IMAG
##SYMBOL=    X,             R,               I
##VAR_TYPE=  INDEPENDENT,   DEPENDENT,       DEPENDENT
##VAR_FORM=  AFFN,          ASDF,            ASDF
##VAR_DIM=   131072,        131072,          131072
##UNITS=     HZ,            ARBITRARY UNITS, ARBITRARY UNITS
##FACTOR=    0.0627417313425165, 1,          1
##FIRST=     8223.62146879498, 1962,         -98199
##LAST=      0,             2365,            -98808
##MIN=       0,             -187874337,      0
##MAX=       8223.62146879498, 418447621,    0
$$ Real data points
##PAGE= N=1
##DATA TABLE= (X++(R..R)), XYDATA
$$ [...]
63730C72920l688k320j595k733m842o031n416l874k854k735k652j876p52N5O17
63715C32224J294J668R40o46j812j844j224n15K79R12O69l51q19k4Q96O32l09
63698C31970n63j82k39o76l38Q57J642J561J659K344K306P36r15q61M48J355J809
63681C42913L132N186N917M291K015J244J907K436K257K056K073J836J651K803
63667C81717N491P762P632N657M195M307M715M081L111L476N265O619N945L709
63653D53682J650P70O17L39j72l96n7N60J024J054M09r67k443k982k392j766j990
63636D46940k282j201J128K990L302K619J647J74j700k536j070J943M568N780
63622D62302N696M459K385Q08J031K434L174K945L324M887N771M284J574K45J041
$$ y = [372920, 369232, 366912, 365317, 362584, 357742, 351711, 346295, 342421, 339567, 336832, 334180, 332304, 331552, 331607, 332224, 333518, 335186, 336126, 335480, 333668, 331824, 330600, 330085, 330364, 331276, 331945, 331594, 330775, 330751, 331647, 332279, 331970, 331407, 331225, 330986, 330310, 329972, 330829, 332471, 334032, 335691, 338035, 340341, 341077, 340162, 339301, 339749, 341104, 342913, 346045, 351231, 357148, 361439, 363454, 364698, 366605, 369041, 371298, 373354, 375427, 377263, 378914, 381717, 387208, 394970, 402602, 408259, 412454, 416761, 421476, 425557, 428668, 432144, 437409, 444028, 449973, 453682, 455332, 456102, 456719, 457058, 456886, 456490, 456433, 456993, 458017, 459071, 459480, 458513, 456070, 453088, 450696, 448930, 446940, 444658, 443457, 444585, 447575, 450877, 453496, 455143, 455317, 453617, 451081, 450011, 451954, 456522, 462302, 467998, 472457, 474842, 475650, 476681, 479115, 482289, 485234, 488558, 493445, 499216, 503500, 505074, 505319, 506360]
63607E06360K376K740K157J274K97p59j627k031k029j819j583j580k056k825l340
63592D95555l358l250l350l280k305m42J215J649J142R59J836L342M852O333P716
63577E08614Q282P653O985P946J0533J2959J3882J3753J3674J3958J4324J4639
63565F47202J4884J5098J5852J7913K0933K3314K4219K4859K6876L0203L3517
63554H94870L6140L8233L9658M0198M0771M2863M6451M9760N1604N2742N4144
63543A387434N4871N2782M7016L8805K9894K0970J1977L362l707q408j0997j2297
63531A611702j2883j3356j4931j8711k4221k9555l3415l6211l8759m0733m1214
63520A307713m0093l8090l5878l3836l2195l0634k8247k4730k1057j8156j5546
$$ y = [506360, 508736, 511476, 513633, 514907, 515204, 514445, 512818, 510787, 508758, 506939, 505356, 503776, 501720, 498895, 495555, 492197, 488947, 485597, 482317, 480012, 479570, 480785, 482434, 483576, 484535, 486371, 489713, 494565, 500898, 508614, 516896, 524549, 531534, 539480, 550013, 562972, 576854, 590607, 604281, 618239, 632563, 647202, 662086, 677184, 693036, 710949, 731882, 755196, 779415, 804274, 831150, 861353, 894870, 931010, 969243, 1008901, 1049099, 1089870, 1132733, 1179184, 1228944, 1280548, 1333290, 1387434, 1442305, 1495087, 1542103, 1580908, 1610802, 1631772, 1643749, 1647111, 1643404, 1634996, 1623999, 1611702, 1598819, 1585463, 1570532, 1551821, 1527600, 1498045, 1464630, 1428419, 1389660, 1348927, 1307713, 1267620, 1229530, 1193652, 1159816, 1127621, 1096987, 1068740, 1044010, 1022953, 1004797, 989251]
63509I89251j2315q748n746l153j14L344O510R512J2965J6300J8280J9360K1524
63496A066970K5269K8562K9701K9665L0638L3507L7753M2626M7344N1182N4329
63485A477546N7779O1452O3373O1562N5818M6945L5530K2591J0183n9q247j4927
63473A869546j9497k1339k1574k2021k3075k4280k6364l0726l7013m3036m7286
63462A553335n0124n2385n4278n5777n6733n6364n4007n0555m7783m6003m3685
63451I85641l9799l5097l0745k7055k4259k3019k3249k3442k2292k0144j8054
63440F98486j6183j4058j1806j0070r103q595q153p362n852l913k491j967j526
63427E97407m15O45L01j473l174l479k333l66J941M135N481N408M264L191L037
$$ y = [989251, 976936, 968188, 962442, 959289, 959175, 962519, 969029, 978541, 991506, 1007806, 1026086, 1045446, 1066970, 1092239, 1120801, 1150502, 1180167, 1210805, 1244312, 1282065, 1324691, 1372035, 1423217, 1477546, 1535325, 1596777, 1660150, 1721712, 1777530, 1824475, 1860005, 1882596, 1892779, 1892720, 1884473, 1869546, 1850049, 1828710, 1807136, 1785115, 1762040, 1737760, 1711396, 1680670, 1643657, 1600621, 1553335, 1503211, 1450826, 1396548, 1340771, 1284038, 1227674, 1173667, 1123112, 1075329, 1029326, 985641, 945842, 910745, 880000, 852945, 828686, 805667, 782418, 758976, 736684, 716540, 698486, 682303, 668245, 656439, 646369, 637266, 628671, 620518, 613156, 607304, 603391, 600900, 598933, 597407, 596992, 597637, 597938, 596465, 593291, 589812, 587479, 587113, 589054, 593189, 598670, 604078, 608342, 611533, 614570]
63412F14570L345K762P11j628k537j888j302j979l190l374k134l71J129K350L314
63397F09778L629L141K591L026M642O471P421P470P610Q713J0694J2879J4796
63384G02861J6366J7706J9190K1341K4091K6478K7785K8828L1223L5391M0140
63373I91400M4198M7171M8738M8058M4832M0209L5927L2847L0770K9269K8285
63362A421704K8290L0170L4376L9905M4895M8684N2492N7394O2384O5245O4712
63351A950251O0903N4230M5006L3934K2037J0207n22q795j3956j7020j9654k2350
63339B094271k4640k6919l0672l6543m3308m9263n3838n7269n9381n9650n8156
63328A594632n5880n3785n1872m9335m5732m1766l8416l5331l1014k5122j9585
$$ y = [614570, 617915, 620677, 621388, 619760, 617223, 615335, 614033, 612054, 608864, 605490, 603356, 602985, 604114, 606464, 609778, 613407, 616548, 619139, 622165, 626807, 633278, 640699, 648169, 655779, 664492, 675186, 688065, 702861, 719227, 736933, 756123, 777464, 801555, 828033, 855818, 884646, 915869, 951260, 991400, 1035598, 1082769, 1131507, 1179565, 1224397, 1264606, 1300533, 1333380, 1364150, 1393419, 1421704, 1449994, 1480164, 1514540, 1554445, 1599340, 1648024, 1700516, 1757910, 1820294, 1885539, 1950251, 2011154, 2065384, 2110390, 2144324, 2166361, 2176568, 2176046, 2167251, 2153295, 2136275, 2116621, 2094271, 2069631, 2042712, 2012040, 1975497, 1932189, 1882926, 1829088, 1771819, 1712438, 1652788, 1594632, 1538752, 1484967, 1433095, 1383760, 1338028, 1296262, 1257846, 1222515, 1191501, 1166379, 1146794]
63317A146794j6366j4707j2058p443k294K136O415J1222J5571J8045J8941K0002
63305A186258K2440K6231L0883L5789M0130M3505M6679N0765N5563N9578O1870
63294A659691O2959O3570O3257O0860N5856M8627L9740K9646J9024Q784m37q418
63282B103159j4905j9488k2154k3656k5047k7017k9994l4452m0525m7303n3098
63271A765520n6716n8188n8233n7331n5586n3123n0321m7620m5082m2057l7602
63260A203661l1682k5822k1922k0562k1086k3141k6825l1174l3966l3922l2054
63249I01505k9947k7890k5712k4136k3662k3060k0928j8144j6634j6082j4258
63238F61052j0845q393q647j0077j0283r033p451n913m400l708m437n569n713
$$ y = [1146794, 1130428, 1115721, 1103663, 1096220, 1093926, 1096062, 1102477, 1113699, 1129270, 1147315, 1166256, 1186258, 1208698, 1234929, 1265812, 1301601, 1341731, 1385236, 1431915, 1482680, 1538243, 1597821, 1659691, 1722650, 1786220, 1849477, 1910337, 1966193, 2014820, 2054560, 2084206, 2103230, 2112014, 2111577, 2103159, 2088254, 2068766, 2046612, 2022956, 1997909, 1970892, 1940898, 1906446, 1865921, 1818618, 1765520, 1708804, 1650616, 1592383, 1535052, 1479466, 1426343, 1376022, 1328402, 1283320, 1241263, 1203661, 1171979, 1146157, 1124235, 1103673, 1082587, 1059446, 1032621, 1001447, 967481, 933559, 901505, 871558, 843668, 817956, 793820, 770158, 747098, 726170, 708026, 691392, 675310, 661052, 650207, 641814, 633167, 623090, 612807, 603774, 596323, 590410, 586010, 582302, 577865, 572296, 566583]
63225E66583n133m985n199m783l758l050k681j775l02P63J143J524K036K001J462
63210E43846J342J678J364L31K44K004M071M672M399M963O317O915O436O358P608
63195F02548R269J0156J0410J0829J1565J2332J3214J4580J6413J8368K0289K2208
63183G72181K4078K5926K8045L0510L2695L3862L4217L4748L5816L6615L6440
63172A125133L6009L6689L8554M0003L9591L7601L5436L3970L3100L2632L2672
63161A521390L3065L3111L2356L1139K9816K7745K3740J7562J0344L247l820j1621
63149A748074j9996k7525l2937l6375l8871m0961m2294m2457m1486l9492l6441
63138A349239l2713k9332k6954k4913k1998j8047j3989j0262o191j438K842N289
$$ y = [566583, 561450, 556465, 551266, 546483, 542725, 539675, 536994, 535219, 534917, 535680, 536823, 538347, 540383, 542384, 543846, 545188, 546866, 548230, 548561, 548805, 550809, 554880, 559552, 563951, 568914, 575231, 582146, 588582, 594940, 602548, 611817, 621973, 632383, 643212, 654777, 667109, 680323, 694903, 711316, 729684, 749973, 772181, 796259, 822185, 850230, 880740, 913435, 947297, 981514, 1016262, 1052078, 1088693, 1125133, 1161142, 1197831, 1236385, 1276388, 1315979, 1353580, 1389016, 1422986, 1456086, 1488718, 1521390, 1554455, 1587566, 1619922, 1651061, 1680877, 1708622, 1732362, 1749924, 1760268, 1763515, 1759695, 1748074, 1728078, 1700553, 1667616, 1631241, 1592370, 1551409, 1509115, 1466658, 1425172, 1385680, 1349239, 1316526, 1287194, 1260240, 1235327, 1213329, 1195282, 1181293, 1171031, 1164840, 1163402, 1166244, 1171533]
63126A171533O319P679J0059J2330J3533J4415J6106J7988J8205J6202J3588J2111
63114A330068J1682J1063R788Q583P991P416N694K168k982q992j4885j9891k3919
63101A323784k7475l0857l3563l4860l4862l4592l4622l4225l2459k9882k8211
63090I68176k7995k7592k5277k1666j8901j7781j7063j5649j3942j2446j0495
63079G59369p480m337k442j827j793k524m399o066n260j872J571L021K971K704
63065G31636K262J345Q61J841L639M725M759M544M368L979L928N203P279Q141
63051G88510O823M746L863M556O003P524Q594Q468O986N338M831N190N178M773
63037H71383N291P122Q644Q318O895O335P060P573O819N592N168N665O421P182
$$ y = [1171533, 1177852, 1185531, 1195590, 1207920, 1221453, 1235868, 1251974, 1269962, 1288167, 1304369, 1317957, 1330068, 1341750, 1352813, 1362601, 1371184, 1379175, 1386591, 1392285, 1394453, 1391471, 1382479, 1367594, 1347703, 1323784, 1296309, 1265452, 1231889, 1197029, 1162167, 1127575, 1092953, 1058728, 1026269, 996387, 968176, 940181, 912589, 887312, 865646, 846745, 828964, 811901, 796252, 782310, 769864, 759369, 751889, 747552, 745110, 743283, 741490, 738966, 734567, 728501, 723241, 721369, 722940, 725961, 728932, 731636, 733898, 735243, 736104, 737945, 741584, 746309, 751068, 755612, 759980, 763959, 767887, 773090, 780369, 788510, 795333, 800079, 803942, 808498, 814501, 822025, 830619, 839087, 846073, 851411, 856242, 861432, 866610, 871383, 876674, 883796, 892440, 900758, 907653, 913988, 921048, 928621, 935440, 941032, 946200, 951865, 958286, 965468]
63023I65468P952Q353Q192Q295R635J1784J3415J4344J5764J8217K0630K2029
63011A124078K3010K4635K6837K8920L0848L2945L5003L6922L9661M4169M9546
63000A496574N3728N6075N8066O1186O5396O9996P4735P9305Q2818Q4802Q6143
62989B268824Q8139R0897R3278R4137R3099R0535Q7534Q5577Q5348Q5712Q4688
62978C247768Q1625P7850P4767P1928O7594O0895N2439M2618L0368J4510l968
62967C818394k2141l7783n0992o2841p3406q1887q8023r2336r5083r5905r4586
62956C023411r1503q7179q1878p5739o8836o1056n2374m3328l4880k7606k1312
62945B377720j5327r029k288M211R323J2551J4611J6571J8757K0907K2732K3694
$$ y = [965468, 973420, 981773, 989965, 998260, 1007895, 1019679, 1033094, 1047438, 1063202, 1081419, 1102049, 1124078, 1147088, 1171723, 1198560, 1227480, 1258328, 1291273, 1326276, 1363198, 1402859, 1447028, 1496574, 1550302, 1606377, 1664443, 1725629, 1791025, 1861021, 1935756, 2015061, 2097879, 2182681, 2268824, 2356963, 2447860, 2541138, 2635275, 2728374, 2818909, 2906443, 2992020, 3077368, 3163080, 3247768, 3329393, 3407243, 3482010, 3553938, 3621532, 3682427, 3734866, 3777484, 3807852, 3822362, 3818394, 3796253, 3758470, 3707478, 3644637, 3571231, 3489344, 3401321, 3308985, 3213902, 3117997, 3023411, 2931908, 2844729, 2762851, 2687112, 2618276, 2557220, 2504846, 2461518, 2426638, 2399032, 2377720, 2362393, 2353364, 2351076, 2355287, 2364610, 2377161, 2391772, 2408343, 2427100, 2448007, 2470739, 2494433]
62933B494433K2892K0319J7597J6174J5131J2339P600K772j408o580j4057k2772
62921B564440l1057l8847m6605n3451n8268o1781o5524o9131p0589o9233o6749
62910A933205o4790o3060o0398n6661n2672m9060m5897m3082m0437l7594l4341
62899A385213l1109k8698k7358k6273k4298k1404j9099j8829k0101k0938k0266
62888A126840j9063j8727j9230j9660j9713j9703j9492j8554j6979j5446j4244
62877I26029j3047j1732j0677j0222j0236j0264r734q360o681n782n907o001n268
62864H12118m409m305m248k998j084l29j113j879j658j373j974k785k689j840
62850G79434j304j780l338n553p259p151n362l633l250l728m097m286m348l654
$$ y = [2494433, 2517325, 2537644, 2555241, 2571415, 2586546, 2598885, 2606485, 2609257, 2607849, 2601269, 2587212, 2564440, 2533383, 2494536, 2447931, 2394480, 2336212, 2274431, 2208907, 2139776, 2069187, 1999954, 1933205, 1868415, 1805355, 1744957, 1688296, 1635624, 1586564, 1540667, 1497585, 1457148, 1419554, 1385213, 1354104, 1325406, 1298048, 1271775, 1247477, 1226073, 1206974, 1188145, 1168044, 1147106, 1126840, 1107777, 1089050, 1069820, 1050160, 1030447, 1010744, 991252, 972698, 955719, 940273, 926029, 912982, 901250, 890573, 880351, 870115, 859851, 850117, 841757, 835076, 829294, 823387, 817386, 812118, 807709, 803404, 799156, 796158, 795074, 794745, 793632, 791753, 790095, 788722, 786748, 783963, 781274, 779434, 778130, 776350, 773012, 767459, 760200, 753049, 747687, 744054, 740804, 737076, 732979, 728693, 724345, 720691]
62836G20691k056q06q57j290r26n10j318k359j392J349K927J855J91M36K096K846
62820G20877J898O09K68O69P55j02j489k263j728n93j02j83M51K037L001K312
62804G26417J217J301J964J540J28o30k71Jm26p59n65m76m88N74K890M613M231
62787G41261K627J374L29j356k838k360j41J551J347J60p07j103j222o64P10K091
62771G41059K702K757K794K787K653K902L975N433O525P124P490P635P624Q039
62757H11499R227J0403J0415R409Q871R929J2255J4693J6392J7178J7480J8184
62745I65935K0044K2729K4787K5122K4483K4908K7436L0845L3235L4550L6549
62734A270623M0164M4123M7021M9673N3890N9609O5064O9775P5423Q3180R1971
$$ y = [720691, 718635, 717829, 716972, 715682, 714756, 714246, 712928, 710569, 709177, 710526, 713453, 715308, 715499, 715935, 718031, 720877, 722775, 723384, 723652, 724321, 725076, 724974, 723485, 721222, 719494, 718901, 718799, 718616, 719067, 721104, 724105, 726417, 727634, 728935, 730899, 732439, 732567, 731937, 731666, 731667, 731241, 730482, 729917, 729441, 728953, 729527, 732417, 737030, 741261, 743888, 745262, 745591, 744235, 741397, 739037, 738896, 740447, 741794, 741954, 741247, 740144, 738922, 738258, 738968, 741059, 743761, 746518, 749312, 752099, 754752, 757654, 761629, 767062, 773587, 780711, 788201, 795836, 803460, 811499, 820726, 831129, 841544, 850953, 859824, 869753, 882008, 896701, 913093, 930271, 947751, 965935, 985979, 1008708, 1033495, 1058617, 1083100, 1108008, 1135444, 1166289, 1199524, 1234074, 1270623, 1310787, 1354910, 1401931, 1451604, 1505494, 1565103, 1630167, 1699942, 1775365, 1858545, 1950516]
62723A950516J00186J07514J14020J18981J22117J24603J27220J28615J27216
62714C020988J23719J19415J12869J01032Q3692O4271M5537K6813O390j5324l6367
62703C653035n5526p2647q7641j00368j10877j18884j23688j25205j24454j22497
62693B611248j19677j16316j13019j09635j05042r8798r2015q5767p9753p3539
62683A617687o7892o3429n9034n3255m6747m1577l8471l6246l3866l1410k8960
62672A116800k6011k2447j8931j5838j2733r328o206m092k989k264j248K98J926
62659I96937K876L236M364P354J1407J4753J7028J9505K2944K6552K9430L1811
62647A188197L4312L7085M0438M5215N1481N7612O1693O3624O4943O6930O9563
$$ y = [1950516, 2050702, 2158216, 2272236, 2391217, 2513334, 2637937, 2765157, 2893772, 3020988, 3144707, 3264122, 3376991, 3478023, 3561715, 3625986, 3671523, 3698336, 3704726, 3689402, 3653035, 3597509, 3524862, 3437221, 3336853, 3225976, 3107092, 2983404, 2858199, 2733745, 2611248, 2491571, 2375255, 2262236, 2152601, 2047559, 1948761, 1856746, 1770979, 1691226, 1617687, 1549795, 1486366, 1427332, 1374077, 1327330, 1285753, 1247282, 1211036, 1177170, 1145760, 1116800, 1090789, 1068342, 1049411, 1033573, 1020840, 1011512, 1005306, 1001214, 998225, 995961, 994713, 995011, 996937, 999813, 1003049, 1007413, 1014767, 1026174, 1040927, 1057955, 1077460, 1100404, 1126956, 1156386, 1188197, 1222509, 1259594, 1300032, 1345247, 1396728, 1454340, 1516033, 1579657, 1644600, 1711530, 1781093]
62636A781093P1989P3195P2404O9559O5425O0582N4432M5889L4996K3055J1085
62625B363704j001j3345k5071l5097m3568n1633n9826o7377p3244p7109p8949
62614A837484p8453p5680p1946o8913o6722o3989n9944n5678n2542n0079m6558
62603A146980m1355l5831l1831k9912k9130k8052k5958k3400k1504k0486j9266
62592H40255j7037j4625j3331j2899j1909j0123r016r583j0810j0985r540o992
62580G03405m051j596o69j303j926r81J080K374K059J233J265K037K268J271k3
62565G06443J17K219M694N437M446L985N676Q372R806R565R164R505R923R950
62551G99302J0605J3092J7021K0785K3356K5131K7187L0128L3622L6809L9242
$$ y = [1781093, 1853082, 1926277, 1998681, 2068240, 2133665, 2194247, 2248679, 2294568, 2329564, 2352619, 2363704, 2362703, 2349358, 2324287, 2289190, 2245622, 2193989, 2134163, 2066786, 1993542, 1916433, 1837484, 1759031, 1683351, 1611405, 1542492, 1475770, 1411781, 1351837, 1296159, 1243617, 1193538, 1146980, 1105625, 1069794, 1037963, 1008051, 978921, 950869, 924911, 901511, 880007, 859521, 840255, 823218, 808593, 795262, 782363, 770454, 760331, 751315, 741732, 730922, 719937, 710397, 703405, 699354, 697758, 697089, 695786, 693860, 692879, 693959, 696333, 698392, 699625, 700890, 702927, 705195, 706466, 706443, 706560, 708779, 713473, 718910, 723356, 727341, 733017, 741389, 751195, 760760, 769924, 779429, 789352, 799302, 809907, 822999, 840020, 860805, 884161, 909292, 936479, 966607, 1000229, 1037038, 1076280]
62540A076280M1373M3994M7354N1176N5228N9145O1844O2094O0049N7284N4872
62529A670693N2153M7995M2410L5909K7904J7242M360q237j8305k5894l2571l9210
62517A774449m5350n0365n4340n7394n8893n8084n5452n2735n1214n0398m8932
62506A191292m6394m3460m0458l6811l2321k8048k5133k3350k1731k0139j9157
62495H54290j8502j6847j3700j0422q682q464q340p307n627l965k573j488r19
62482G47454j014j480j681j142K79K471N086P289P944O512L959K326K970N329
62468G86302P797R654J1522J3960J6426J8102J9205K0793K3383K6479K9346L1789
62456A014758L4059L6416L9012M1848M4518M6208M6266M4844M2790M0643L7791
$$ y = [1076280, 1117653, 1161647, 1209001, 1260177, 1315405, 1374550, 1436394, 1498488, 1558537, 1615821, 1670693, 1722846, 1770841, 1813251, 1849160, 1877064, 1894306, 1898666, 1890429, 1872124, 1846230, 1813659, 1774449, 1729099, 1678734, 1624394, 1567000, 1508107, 1450023, 1394571, 1341836, 1290622, 1240224, 1191292, 1144898, 1101438, 1060980, 1024169, 991848, 963800, 938667, 915317, 893586, 873447, 854290, 835788, 818941, 805241, 794819, 786137, 777673, 769333, 762026, 756399, 752434, 749861, 748373, 747454, 746440, 744960, 743279, 742137, 742416, 744887, 749973, 757262, 765206, 771718, 775677, 778003, 780973, 786302, 794099, 803753, 815275, 829235, 845661, 863763, 882968, 903761, 927144, 953623, 982969, 1014758, 1048817, 1085233, 1124245, 1166093, 1210611, 1256819, 1303085, 1347929, 1390719, 1431362, 1469153]
62445A469153L2944K5763J7797J1178O412K085l015q233j2057j4138j5426j6587
62433A495876j7225j6687j4850j1977q439m708j034K928P570J2348J6194J9083
62421A479079K2318K6845L2025L6657M0380M3384M5392M5933M5269M4106M2515
62410A903903L9899L5859L0376K3363J4964O141k076j0060j9191k9622l9483m6970
62398A907103n2318n6777o0338o1886o1322o0134n9394n8255n5310n0781m6475
62387A284113m3657m1711l9061l4873k9699k4792k1079j8505j6292j3896j1697
62376I88851j0395r762q636o397l939k741l363n181p236q823r776j0711j2592
62363H89299j5354j7438j7489j6140j5044j4494j3312j1009q633p170o520o458
$$ y = [1469153, 1502097, 1527860, 1545657, 1556835, 1563247, 1565332, 1562317, 1554084, 1542027, 1527889, 1512463, 1495876, 1478651, 1461964, 1447114, 1435137, 1426698, 1421990, 1420956, 1423884, 1431454, 1443802, 1459996, 1479079, 1501397, 1528242, 1560267, 1596924, 1637304, 1680688, 1726080, 1772013, 1817282, 1861388, 1903903, 1943802, 1979661, 2010037, 2033400, 2048364, 2054505, 2052429, 2042369, 2023178, 1993556, 1954073, 1907103, 1854785, 1798008, 1737670, 1675784, 1614462, 1554328, 1494934, 1436679, 1381369, 1330588, 1284113, 1240456, 1198745, 1159684, 1124811, 1095112, 1070320, 1049241, 1030736, 1014444, 1000548, 988851, 978456, 968694, 960058, 953661, 949722, 946981, 943618, 938437, 931201, 922378, 912602, 901891, 889299, 873945, 856507, 839018, 822878, 807834, 793340, 780028, 769019, 760386, 753216, 746696, 740238]
62351G40238p225q427q675p283n304l978l189k378j941k385l033k869j977r05
62337F80669N66K630M295M627M557N536O956O871N169L808L824M196M159M452
62323G42315N491O249O195O692R142J2913J6345J8717K0140K0623K0485K0845
62311I06152K2449K4651K6573K8531L1263L4526L7612M0619M4033M7760N1601
62300A295770N6155O1962O8319P4138P9551Q5349R1183R5528R7189R5724R0789
62289B191657Q2408P1768O0328M8221L4783K0537P142m730j6010k7353l8052m7332
62277B383367n5456o2731o8522p2114p3824p4398p3855p1740o8150o3756n8967
62266A639854n3660m7854m2256l7924l5371l4077l3090l2127l1627l1589l1070
$$ y = [740238, 733013, 724586, 715911, 708628, 703324, 699346, 696157, 693779, 691838, 689453, 686420, 683551, 681574, 680669, 681235, 683865, 688160, 692787, 697344, 702880, 709836, 716707, 721876, 725684, 729508, 733704, 737863, 742315, 747806, 754055, 760250, 766942, 776084, 788997, 805342, 824059, 844199, 864822, 885307, 906152, 928601, 953252, 979825, 1008356, 1039619, 1074145, 1111757, 1152376, 1196409, 1244169, 1295770, 1351925, 1413887, 1482206, 1556344, 1635895, 1721244, 1812427, 1907955, 2005144, 2100868, 2191657, 2274065, 2345833, 2406161, 2454382, 2489165, 2509702, 2516844, 2512114, 2496104, 2468751, 2430699, 2383367, 2327911, 2265180, 2196658, 2124544, 2050720, 1976322, 1902467, 1830727, 1762577, 1698821, 1639854, 1586194, 1538340, 1496084, 1458160, 1422789, 1388712, 1355622, 1323495, 1291868, 1260279, 1229209]
62255A229209k9436k7431k6240k5951k5794k5396k4805k3834k2542k1804k2013
62244I53963k1655j9009j5000j2302j1486j0403p958n968n928o236m609j657K49
62231H32001N29O38J437K425L322M400N346N625N917P415R562J0340R292Q467
62217I06716R611J1915J3577J4335J5361J7453K0390K3544K6214K7826K8592K9671
62205A145205L1952L4996L7805M0308M3412M7792N3419O0141O7970P6380Q4036
62194A723416Q9760R3610R6471R8343R7513R1999Q1871O9512N7171M4853L1257
62183B575776J6412K221r745k0086l0710m2714n5468o7303p6578q2587q5916q7762
62171B035540q8593q7890q5288q1409p7018p2032o6184o0215n5346n1633m7796
$$ y = [1229209, 1199773, 1172342, 1146102, 1120151, 1094357, 1068961, 1044156, 1020322, 997780, 975976, 953963, 932308, 913299, 898299, 885997, 874511, 864108, 856150, 850182, 844254, 838018, 833409, 831752, 832001, 832530, 833168, 834605, 837030, 840352, 844752, 850098, 855723, 861640, 869055, 878617, 888957, 898249, 906716, 916327, 928242, 941819, 956154, 971515, 988968, 1009358, 1032902, 1059116, 1086942, 1115534, 1145205, 1177157, 1212153, 1249958, 1290266, 1333678, 1381470, 1434889, 1495030, 1563000, 1639380, 1723416, 1813176, 1906786, 2003257, 2101600, 2199113, 2291112, 2372983, 2442495, 2499666, 2544519, 2575776, 2592188, 2594409, 2584664, 2564578, 2533868, 2491154, 2435686, 2368383, 2291805, 2209218, 2123302, 2035540, 1946947, 1859057, 1773769, 1692360, 1615342, 1543310, 1477126, 1416911, 1361565, 1309932, 1262136]
62160A262136m2976l7845l3503k9976k6471k2691j9128j6091j3158r958o992n148
62148I98199m428l712k026K25J687J714J224J705L585N813O970O608N501M745
62134A027810M733N048N212N279N574O116O686P379Q602J0354J1973J2886J3339
62121A130991J3991J4988J5851J6252J6505J7133J8220J9496K1040K3584K7699
62110A335750L2579L6300L7907L8921M1883M7386N3549N8611O2728O6474O8825
62099A880913O8074O4086N8048N0288M0105K7925J5922N707l292j2365k1549k9979
62087B143883l7184m3019m7208n0088n2873n5935n7507n5758n1641m7928m5435
62076A599307m2293l7329l2081k8292k5048k0219j3820q110m542k342l10J393
$$ y = [1262136, 1219160, 1181315, 1147812, 1117836, 1091365, 1068674, 1049546, 1033455, 1020297, 1010339, 1003347, 998199, 993771, 990059, 988033, 988258, 989945, 991659, 992883, 994588, 998173, 1003986, 1010956, 1017564, 1023065, 1027810, 1032543, 1037591, 1042803, 1048082, 1053656, 1059772, 1066458, 1073837, 1082439, 1092793, 1104766, 1117652, 1130991, 1144982, 1159970, 1175821, 1192073, 1208578, 1225711, 1243931, 1263427, 1284467, 1308051, 1335750, 1368329, 1404629, 1442536, 1481457, 1523340, 1570726, 1624275, 1682886, 1745614, 1812088, 1880913, 1948987, 2013073, 2071121, 2121409, 2161514, 2189439, 2205361, 2211068, 2207776, 2195411, 2173862, 2143883, 2106699, 2063680, 2016472, 1966384, 1913511, 1857576, 1800069, 1744311, 1692670, 1644742, 1599307, 1557014, 1519685, 1487604, 1459312, 1434264, 1414045, 1400225, 1392115, 1387573, 1385231, 1384921, 1386314]
62064A386314J971J538R80O49p0j855m476o806p662o776n168m495n724q342j0938
62049A329140j2585j3494j4273j4943j4984j4139j2614j0526p886n299l839l441
62037A201117k204J535O695J0303J1041J0554J0814J1565J1425J0489J0324J1755
62025A305413J3956J5805J7147J8438J9939K1503K2671K2984K2629K2721K4298
62014A527504K7147L0221L3036L5813L8336L9806M0113M0292M1226M2746M4491
62003A940731M6781M9915N3170N5259N5369N3021M7572L8779K7732J6353N894
61992B390576l534j2242k0482k8569l6616m4082n0329n5819o1753o8149p3053
61981A935948p4564p3171p1156o9798o8203o5138o1110n7712n5364n2769m8766
$$ y = [1386314, 1388285, 1389823, 1390803, 1391452, 1391382, 1389527, 1385051, 1378245, 1370583, 1363807, 1358639, 1354144, 1348420, 1340078, 1329140, 1316555, 1303061, 1288788, 1273845, 1258861, 1244722, 1232108, 1221582, 1213696, 1208397, 1204558, 1201117, 1198913, 1200448, 1207143, 1217446, 1228487, 1239041, 1249855, 1261420, 1272845, 1283334, 1293658, 1305413, 1319369, 1335174, 1352321, 1370759, 1390698, 1412201, 1434872, 1457856, 1480485, 1503206, 1527504, 1554651, 1584872, 1617908, 1653721, 1692057, 1731863, 1771976, 1812268, 1853494, 1896240, 1940731, 1987512, 2037427, 2090597, 2145856, 2201225, 2254246, 2301818, 2340597, 2368329, 2384682, 2390576, 2387042, 2374800, 2354318, 2325749, 2289133, 2245051, 2194722, 2138903, 2077150, 2009001, 1935948, 1861384, 1788213, 1717057, 1647259, 1579056, 1513918, 1452808, 1395096, 1339732, 1286963, 1238197]
61970A238197m3788l9006l4837l1087k8019k6096k4854k3192k0965j9169j8181
61959I29003j6993j4934j3005j2503j3064j3372j3168j3148j3180j2194j0018
61948G83424p849o498n395l874k238q55P14K789M627N440N592N854O034N441M251
61933G97457L231K446J409L30j00j84j055k830m169m288m201n094o489p116o955
61918G62392p203q376r510r442q186o788o209o473o669n850m075k438j780j714
61904F77679j358o38l12p84j598k098j990j155M39K392L886M438M337M077L702
61889F91017L049K463K740M228O214P552P984Q545J0330J3085J5582J7262J8619
61876H08670J9771J9787J8268J6623J6437J7037J6190J3124R404O708N210M598
$$ y = [1238197, 1194409, 1155403, 1120566, 1089479, 1061460, 1035364, 1010510, 987318, 966353, 947184, 929003, 912010, 897076, 884071, 871568, 858504, 845132, 831964, 818816, 805636, 793442, 783424, 775575, 769077, 763682, 759808, 757570, 756715, 757429, 760218, 764845, 770285, 775877, 781731, 787765, 793206, 797457, 800688, 803134, 804543, 804873, 804773, 804589, 803534, 800704, 796535, 792247, 788046, 782952, 776463, 769347, 762392, 755189, 746813, 737303, 727861, 719675, 712887, 706678, 700205, 693536, 687686, 683611, 681173, 679393, 677679, 676321, 675683, 675371, 674587, 672989, 670891, 668901, 667746, 668185, 670577, 674463, 678901, 683238, 687315, 691017, 694066, 696529, 699269, 703497, 709711, 717263, 725247, 733792, 744122, 757207, 772789, 790051, 808670, 828441, 848228, 866496, 883119, 899556, 916593, 932783, 945907, 955311, 962019, 967229, 971827]
61864I71827N027O069O088L956O55k116m220o691r463j0904r749o468k597N63
61850I41977K422L117L418M241N981Q285J0311J1058J0046P958O150N063L688
61837A023715J155j894m287n926p397q710r556j0393j1702j2556j1567r330q213
61824I23339r259j0829j1013j0017r241r135r151r054r084r070q360o774n039
61811H07313m098m099m139l206j395K64J455L255O267R028R739R143R732J2126
61797H51385J4255J4700J4799J6346J8936K0918K1764K2189K2907K4410K6917
61786A069526K9445L0060K8226K5829K4489K3153J9933J5151J0622O783K638j983
61774A283872o208r777j2865j4535j3669j1374j0014r456o826r63N119P701O582
$$ y = [971827, 976854, 982923, 989011, 992967, 993622, 991506, 987286, 980595, 971132, 960228, 950479, 944011, 941414, 941977, 944399, 947516, 950934, 955175, 961156, 969441, 979752, 990810, 1000856, 1008814, 1014964, 1020027, 1023715, 1024870, 1022976, 1018689, 1012763, 1005366, 996656, 987100, 976707, 965005, 952449, 940882, 931552, 923339, 914080, 903251, 892238, 882221, 872980, 863845, 854694, 845640, 836556, 827486, 819126, 812352, 807313, 803215, 799116, 794977, 791771, 790376, 790640, 792095, 795350, 801617, 810645, 820384, 829527, 839259, 851385, 865640, 880340, 895139, 911485, 930421, 951339, 973103, 995292, 1018199, 1042609, 1069526, 1098971, 1129031, 1157257, 1183086, 1207575, 1230728, 1250661, 1265812, 1276434, 1283217, 1285855, 1283872, 1277664, 1267887, 1255022, 1240487, 1226818, 1215444, 1205430, 1195974, 1189148, 1188185, 1193304, 1201005, 1207587]
61761A207587M400L137K939L269L372J941k024p831j3503j7660k0405k2520k4481
61748A118221k6276k7655k8367k8386k7821k6673k4932k3019k1667k1131k0799
61737H41495j9823j7910j5497j3391j2186j1674j0928r384p611o544o252o231
61725G04064o477p165p518o354l949k001j407j366j135j269k251l198l100k437
61711F54437k282k404j582M02K154K225O63j068j403l6J820K729K494J913J338
61696F61400M86l16r6J099J905J710J660K509K925J463p91j506m30M69P0n83l55
61679F71619K07j38j570l137l743k911j166J80K42l44k40P31J407J115P38J448
61663F64438L076M267L953K403J037J156K563L632L181J972J626K292K489J364
$$ y = [1207587, 1211987, 1215124, 1218063, 1221332, 1224704, 1226645, 1224621, 1216790, 1203287, 1185627, 1165222, 1142702, 1118221, 1091945, 1064290, 1035923, 1007537, 979716, 953043, 928111, 905092, 883425, 862294, 841495, 821672, 803762, 788265, 774874, 762688, 751014, 740086, 730702, 723091, 716547, 710295, 704064, 697587, 690422, 682904, 676550, 672601, 670600, 669193, 667827, 666692, 665423, 663172, 659974, 656874, 654437, 652155, 649751, 648169, 648571, 650725, 652950, 653613, 652545, 651142, 651106, 652926, 655655, 658149, 660062, 661400, 661886, 661570, 661474, 662573, 664478, 666188, 667848, 670357, 673282, 674745, 673954, 672448, 672018, 672487, 672557, 671974, 671619, 671826, 671688, 670118, 666981, 663238, 660327, 659161, 659341, 659583, 659239, 658999, 659730, 661137, 662252, 662990, 664438, 667514, 671781, 675734, 678137, 679174, 680330, 682893, 686525, 689706, 691678, 693304, 695596, 698085, 699449]
61649F99449Lo4J144K153J662l83l024n120o096o156n837n442n086m910m780m029
61633F53484k363p61o81k180l734m078l475k903k807k999l096k690j734j016j539
61618F17428l070m203m191l752l453k529l98J578J415p44k675k893k149j856k203
61603E86305k468k327k097k012j871j184M11K593M124L798J967M57N44J519J889
61588E91648J356P72N28K02k37o3R76K087K674L201M111M656L861K103O48j34
61572F18389q89j812k319k311k559l341l813l400k869l296m570n573n398l873
61558E72366j464P78J792J551J013O48j52j705l209m114n139o722p532o345m575
61543E37191m857p144q420o790l980k799l645m723m758m134l792m058m617m971
$$ y = [699449, 699452, 699388, 700532, 702685, 704347, 703964, 700940, 695820, 689724, 683568, 677731, 672289, 667203, 662293, 657513, 653484, 651121, 650360, 649679, 647499, 643765, 639687, 636212, 633309, 630502, 627503, 624407, 621717, 619983, 618967, 617428, 614358, 610155, 605964, 602212, 598759, 596230, 595832, 597410, 598825, 598081, 595406, 592513, 590364, 588508, 586305, 583837, 581510, 579413, 577401, 575530, 574346, 574757, 577350, 581474, 585272, 587239, 587696, 588240, 589759, 591648, 593004, 593776, 594304, 594506, 594269, 594206, 595182, 597269, 599943, 603144, 607255, 611911, 615772, 617875, 618523, 618389, 617500, 615688, 613369, 611058, 608499, 605158, 601345, 597945, 595076, 591780, 587210, 581637, 576239, 572366, 570902, 571680, 573472, 575023, 576036, 576684, 576532, 574827, 571618, 567504, 562365, 555643, 548111, 541766, 537191, 532334, 525190, 516770, 509980, 506000, 503201, 499556, 494833, 490075, 485941, 482149, 478091, 473474, 468503]
61529D68503m826m215l391k663k433l014m031m461l913l389l878m678m307k746
61515D16558j373p11P5J187J413J35j415j853j387r07m86M7Q1q47j782j311N29
61498D07953K403L372L412K677J283k14j050r55j40J167K592L414L195K279J195
61483D32583k1j335k199k263k047k030j739o86M01M87l6J81J341K166J717M83
61467D27003m88o49j20M12o2j829l668l996k764j288l84K03N46K31l92n0J465
61450D14170K388J204j019j706N7K502L423K561J338Q05O02Jp16o75%L3j119k133
61432D21716j442N69K070K145J517J062P41K14m66j091j451j171j38P33J88j628
61416D23568k956k363j87K251M021M764M420L403K550K252K100J655J040M31l63
$$ y = [468503, 463677, 459462, 456071, 453408, 450975, 447961, 443930, 439469, 435556, 432167, 428289, 423611, 419304, 416558, 415185, 414474, 414549, 415736, 417149, 417284, 415869, 414016, 412629, 411722, 411236, 411283, 411364, 410517, 408735, 407424, 407953, 410356, 413728, 417140, 419817, 421100, 420886, 419836, 418881, 418741, 419908, 422500, 425914, 429109, 431388, 432583, 432562, 431227, 429028, 426765, 424718, 422688, 420949, 420263, 420664, 421151, 421115, 421296, 422637, 424803, 426520, 427003, 426515, 425866, 425746, 426158, 426096, 424267, 420599, 416603, 413839, 412551, 412167, 412370, 412916, 413147, 412755, 412705, 414170, 416558, 417762, 416743, 415037, 415094, 417596, 421019, 423580, 424918, 425723, 426325, 426326, 425610, 424935, 424935, 424968, 423849, 421716, 420274, 420843, 422913, 425058, 426575, 427637, 428378, 428592, 428126, 427035, 425584, 424413, 424275, 425008, 425196, 423568, 420612, 418249, 418062, 420313, 424334, 429098, 433518, 436921, 439471, 441723, 443823, 445478, 446518, 446949, 446586]
61401D46586j345j996j980j607j153l60Q45J805J965J688J684J969K080J902J709
61386D53792J647J675J698J404M51q17j308m11J244K677L669M412M717M365L743
61371D82958L352L043K440J730J276R06L77J52P76J813K343K174J739J129M01
61356E06609M43K042M098M433K707J084J252K235K219J307R28J140L40k174m775
61341E23888n406m052k446j804j800j790j914k410k653j979j074j186j852j000
61327D92522J930M437M004J546j4M1l34k215l836l395j590j4J440L636N737N832
61311E09727L853J965J784K607K975K669K435K536K510K073J583J606K295L204
61297E43822L774M056M651N663O133N279M018M210O165P978P876O383N255N055
$$ y = [446586, 445241, 443245, 441265, 439658, 438505, 438145, 438990, 440795, 442760, 444448, 446132, 448101, 450181, 452083, 453792, 455439, 457114, 458812, 460216, 460667, 459850, 458542, 458131, 459375, 462052, 465721, 470133, 474850, 479215, 482958, 486310, 489353, 491793, 493523, 494799, 495705, 496082, 496234, 497010, 498823, 501166, 503340, 505079, 506208, 506609, 507052, 509094, 513192, 517625, 520332, 521416, 522668, 524903, 527122, 528429, 529357, 530497, 530837, 528663, 523888, 518482, 514430, 511984, 510180, 508380, 506590, 504676, 502266, 499613, 497634, 496560, 495374, 493522, 492522, 494452, 498889, 502893, 504439, 504425, 504466, 504132, 501917, 498081, 494686, 493096, 493082, 494522, 498158, 503895, 509727, 513580, 515545, 517329, 519936, 522911, 525580, 528015, 530551, 533061, 535134, 536717, 538323, 540618, 543822, 547596, 551652, 556303, 561966, 568099, 573378, 577396, 581606, 587771, 595749, 603625, 610008, 615263, 620318]
61283F20318M829M014L450M154N852P237P394O576N690N292N151M733M013L578
61269F92281L846M415M472L724K668K017K091K620K873K184P70j58M65K333M196
61254G30797N393O309P293P937P936P954Q948J0884J2700J3486J3330J2994J3032
61241H58993J3215J2658J0703P768N086L450K478J281n10k586m437n673o258o716
61227H89452p660q876r460r242r290j0335j1476j1462j0580r898r103o821l204
61214G72045n33m37j770k161p64J380L018L678L538L229L618N017O682P642P826
61199H12008P781P466O084L411P70J17K039M859O142N132L345K505K617K636K328
61184H69240K299K566K591K670L687N165N278L578K033K259L210L053K050J706
$$ y = [620318, 625147, 629161, 632611, 636765, 642617, 649854, 657248, 663824, 669514, 674806, 679957, 684690, 688703, 692281, 696127, 700542, 705014, 708738, 711406, 713423, 715514, 718134, 721007, 723191, 723961, 723803, 724268, 726601, 730797, 736190, 742499, 749792, 757729, 765665, 773619, 782567, 793451, 806151, 819637, 832967, 845961, 858993, 872208, 884866, 895569, 903337, 908423, 911873, 914351, 915632, 915122, 912536, 908099, 902426, 896168, 889452, 881792, 872916, 863456, 854214, 844924, 834589, 823113, 811651, 801071, 791173, 782070, 775249, 772045, 771512, 771075, 769305, 767144, 766380, 767760, 770778, 774456, 777994, 781223, 784841, 789858, 796540, 804182, 812008, 819789, 827255, 833339, 836750, 837520, 837637, 839676, 844535, 850677, 855809, 859154, 861659, 864276, 866912, 869240, 871539, 874105, 876696, 879366, 883053, 888218, 893496, 897074, 899107, 901366, 904576, 907629, 909679, 911385]
61170I11385K041J702M35n17m03L33J430L258N694P949R816J1609J2771J2049
61156I79552R619P544P336Q318R171R771J0489J0770R712P539N390M018L521L977
61142A086727N314O744P194O496N668N954P656R802J0857J0192Q963R018J0709
61129A191294J2235J1488Q098L480n51k813l126k315j565j445j794k532l835n275
61115A201344n810n222m717n281o218o209n208m230l754l522l688m860o826q368
61101A127431q676q263q024q025p751p208p226q503j0535j1722j0895q593o434
61088A015576n248m571m095m524o288q340r387r671j0258j1050j0966j0029r523
61075I11626r631q473m519R88N126O324N480M471M484N563O938P664P542P553
$$ y = [911385, 913426, 915128, 915563, 915046, 914643, 914976, 916406, 919664, 925358, 933307, 943123, 954732, 967503, 979552, 989171, 996715, 1004051, 1012369, 1021540, 1031311, 1041800, 1052570, 1062282, 1069821, 1075211, 1079229, 1082750, 1086727, 1092041, 1098785, 1105979, 1112475, 1118143, 1124097, 1131753, 1141555, 1152412, 1162604, 1171567, 1180585, 1191294, 1203529, 1215017, 1223115, 1226595, 1226044, 1223231, 1220105, 1217790, 1216225, 1214780, 1212986, 1210454, 1206619, 1201344, 1195534, 1190312, 1185595, 1180314, 1174096, 1167887, 1162679, 1158449, 1154695, 1151173, 1147485, 1142625, 1135799, 1127431, 1118755, 1110492, 1102468, 1094443, 1086692, 1079484, 1072258, 1063755, 1053220, 1041498, 1030603, 1022010, 1015576, 1010328, 1005757, 1001662, 997138, 990850, 982510, 973123, 963452, 953194, 942144, 931178, 921149, 911626, 901995, 893522, 889003, 889991, 895117, 901441, 906921, 911392, 915876, 921439, 928377, 936041, 943583, 951136]
61061I51136Q923J1674J4465J6108J6811J7741J9592K1993K4200K5916K7258K8257
61049A184074K8794K8939K9009K9183K9353K9365K9205K8814K7992K6567K4445
61038A495740K1502J7721J3485R274N061N45l901p197q946j0157j1888j3768j4699
61025A492772j4739j5256j7103j9456k0749k0248j8532j6769j5717j5207j4549
61014A304447j3476j2451j1851j1278j0127q451o583m324j297K047M740O679Q804
61001A246879J1587J4191J5691J6639J8721K2833K7846L1432L2379L2053L3223
60990A503474L7117M2147M6012M8519N1455N6025O1609O7089P2293P7620Q3124
60979B146484Q8546R3920R9672J06215J13519J20901J27491J33396J40045J48803
$$ y = [951136, 960059, 971733, 986198, 1002306, 1019117, 1036858, 1056450, 1078443, 1102643, 1128559, 1155817, 1184074, 1212868, 1241807, 1270816, 1299999, 1329352, 1358717, 1387922, 1416736, 1444728, 1471295, 1495740, 1517242, 1534963, 1548448, 1557722, 1562783, 1563328, 1559427, 1552230, 1543284, 1533127, 1521239, 1507471, 1492772, 1478033, 1462777, 1445674, 1426218, 1405469, 1385221, 1366689, 1349920, 1334203, 1318996, 1304447, 1290971, 1278520, 1266669, 1255391, 1245264, 1236813, 1230230, 1225906, 1224609, 1226656, 1231396, 1238075, 1246879, 1258466, 1272657, 1288348, 1304987, 1323708, 1346541, 1374387, 1405819, 1438198, 1470251, 1503474, 1540591, 1582738, 1628750, 1677269, 1728724, 1784749, 1846358, 1913447, 1985740, 2063360, 2146484, 2235030, 2328950, 2428622, 2534837, 2648356, 2769257, 2896748, 3030144, 3170189, 3318992]
60969C318992J59610J71801J85815K02823K22696K43667K64365K85246L07930
60960E362945L34144L65417M02670M46058M96275N55569O25709P05398P92746
60951A0086931Q90576J005734J142136J299561J481378J692816J915352K080218
60943B1594702K085478J863233J441158R35441M79588J58032l227j0633J02951
60934B8646723K57042L26168J99148j47007o30991j124025j522738j780653j897337
60925B2326330j898210j821172j703752j570481j431187j290548j154955j029856
60917A0426169r16293q13637p22870o44590n76329n14713m58793m09147l65326
60908E004471l26324k92272k63483k38618k15753j94481j75358j58150j42340
$$ y = [3318992, 3478602, 3650403, 3836218, 4039041, 4261737, 4505404, 4769769, 5055015, 5362945, 5697089, 6062506, 6465176, 6911234, 7407509, 7963078, 8588787, 9294185, 10086931, 10977507, 11983241, 13125377, 14424938, 15906316, 17599132, 19514484, 21594702, 23680180, 25543413, 26984571, 27920012, 28399600, 28557632, 28554405, 28543772, 28646723, 28903765, 29229933, 29429081, 29282074, 28651083, 27527058, 26004320, 24223667, 22326330, 20428120, 18606948, 16903196, 15332715, 13901528, 12610980, 11456025, 10426169, 9509876, 8696239, 7973369, 7328779, 6752450, 6237737, 5778944, 5369797, 5004471, 4678147, 4385875, 4122392, 3883774, 3668021, 3473540, 3298182, 3140032, 2997692]
60899B997692j28578j17698j08844j00396r2314q5636q0014p3798o6658o0153
60889B083603n5220n0768m5424l9265l3201k7757k3193j9679j6701j3274r356
60878A749765o175m462l344j810l25K05L13J418L596N335N725N673O426P762Q406
60863A778508P642N792L488J287j62m38j37p13l185p265j1936j6455k0500k3878
60849A712048k6562k8678l0034l0084k9010k8320k9361l1425l2411l1456k9793
60838A384914k8631k7420k5134k2322k0638k0612k0969k0289j8586j6952j6269
60827A147092j6543j7259j7940j8227j7664j5920j3624j2435j3413j5319j5559
60816I73189j3255j0417r506j0649j2032j2218j1060q943o482m807m885o313p607
$$ y = [2997692, 2869114, 2751416, 2642572, 2542176, 2449862, 2364226, 2284212, 2210414, 2143756, 2083603, 2028383, 1977615, 1932191, 1892926, 1859725, 1831968, 1808775, 1789096, 1772395, 1759121, 1749765, 1743590, 1739128, 1735784, 1733974, 1733649, 1733854, 1734167, 1735585, 1739181, 1744516, 1750241, 1755914, 1762340, 1770102, 1778508, 1786150, 1791942, 1795430, 1796717, 1796555, 1796117, 1795980, 1795267, 1792082, 1784817, 1772881, 1756426, 1735926, 1712048, 1685486, 1656808, 1626774, 1596690, 1567680, 1539360, 1509999, 1478574, 1446163, 1414707, 1384914, 1356283, 1328863, 1303729, 1281407, 1260769, 1240157, 1219188, 1198899, 1180313, 1163361, 1147092, 1130549, 1113290, 1095350, 1077123, 1059459, 1043539, 1029915, 1017480, 1004067, 988748, 973189, 959934, 949517, 940011, 929362, 917330, 905112, 894052, 885109, 878627, 873820, 868935, 862622, 855015]
60803H55015p839p315o670o206o221p025q263r066r257r676j0804j1761j1363
60790G43549r664p791o576n978n697n660n717n397m355k928j972k013k751l538
60776F73512m144m722n096m807m084m036n131o095n306l072j441j595k460k313
60762F19210r12N79J231J177J079J336J798J958J543R38P71J084J312J177J027
60747F35308J024O14p07k390l295l020k314k088k387k503k003j424j687k800l560
60732F06768k973j643j060j602k061j420k56J16o93j875k486k303j882k109l397
60717E81124n050n759n011l639k736k531k593k496j783l8K284L588K709M69j197
60702E57341j433r62n31J1R08J674J645Q46p2n52m97j69K12Q96K392M525O092
$$ y = [855015, 847176, 839861, 833191, 826985, 820764, 813739, 805476, 796410, 787153, 777477, 766673, 754912, 743549, 733885, 726094, 719518, 713540, 707843, 702183, 696466, 691069, 686714, 683786, 681814, 679801, 677050, 673512, 669368, 664646, 659550, 654743, 650659, 646623, 641492, 635397, 630091, 627019, 625578, 623983, 621523, 619210, 618298, 618877, 620108, 621285, 622364, 623700, 625498, 627456, 628999, 629937, 630708, 631792, 633104, 634281, 635308, 636332, 636946, 636239, 633849, 630554, 627534, 625220, 623132, 620745, 618242, 616239, 614815, 613128, 610328, 606768, 603795, 602152, 601092, 599490, 597429, 596009, 595753, 595869, 595176, 593301, 590815, 588512, 586630, 584521, 581124, 576074, 570315, 565304, 561665, 558929, 556398, 553805, 551309, 549526, 549488, 551772, 555360, 558069, 558538, 557341, 555908, 554946, 554415, 554426, 555334, 557008, 558653, 559499, 559427, 558875, 558378, 558209, 558421, 559317, 561709, 566234, 572326]
60685E72326O076N029M411M653M720L676J753m57k786m861n657m712l204k805
60671E78162l773n029n906o626p122o717n442m575n034o069o459o419o978p779
60657D94234p082m348j454m38j059j713j972k650l671l593j785L95J336J061N66
60642D67827K22m8K02J426K920L488L145L043L491L411K102M97j11K09M71L81
60626D92676N74J422K515L461M479N772O710O361M859L670M048N491O402O216
60612E54656N957O396O692N795M411M133M795M311J578j732l121k089j98R95J124
60597E93703N63k20q78j369j921k551k872k709k397k049j075P43K289K242Q73
60582E82372l87j059j995l494m492m260l714l920m257l373j589q78k291m545n616
$$ y = [572326, 578402, 583431, 587842, 592495, 597215, 600891, 602644, 602187, 599401, 594540, 588883, 584171, 580967, 578162, 574389, 569360, 563454, 556828, 549706, 542989, 537547, 532972, 527938, 521869, 515410, 508991, 502013, 494234, 487152, 482804, 481350, 480912, 479853, 478140, 476168, 473518, 469847, 466254, 464469, 464864, 466200, 467261, 467827, 468049, 468001, 468203, 469629, 472549, 476037, 479182, 482225, 485716, 489127, 491229, 491726, 491615, 491824, 492295, 492676, 493250, 494672, 497187, 500648, 505127, 510899, 517609, 523970, 528829, 532499, 536547, 542038, 548440, 554656, 560613, 567009, 573701, 579496, 583907, 588040, 592835, 597146, 598724, 596992, 593871, 591782, 591584, 592579, 593703, 594266, 594046, 593168, 591799, 589878, 587327, 584455, 581746, 579349, 577300, 576225, 576968, 579257, 581499, 582372, 581985, 580926, 578931, 575437, 570945, 566685, 562971, 559051, 554794, 551421, 549832, 548954, 546663, 542118, 536502]
60567E36502m865l118j325M1O67L70n07j163j083m89M4L05O40J425K344K427J180
60550E33395m16p07N83J777J323j63q93m52o1l21k15J070K672L318L073K781K580
60533E49344K254K339L329M139L031L26j366k38K585M638M845L958L050K567K446
60518E87247K508K772L575N038O438O851O596P118R105J1544J3174J3868J3952
60505F89786J3232J1646R924Q439O202K388j727l866l567k460j865j618j401j571
60491G23542k076j870k28K227M583O820R268J1536J2980J3823J4931J6555J7894
60478H29985J7964J6562J4329J2029R767P033L713P99m89l12k69j529l490m559
60464I01533l914k179p75q88k658m978o257n584l062O71M688P700Q759Q434Q545
$$ y = [536502, 531637, 528519, 527194, 527235, 527902, 528272, 527765, 526602, 525519, 525030, 525074, 525379, 526019, 527444, 529788, 532215, 533395, 532979, 532272, 532855, 534632, 535955, 535792, 534899, 534447, 534386, 534065, 533850, 534920, 537592, 540910, 543983, 546764, 549344, 551598, 553937, 557266, 561405, 564436, 564762, 563396, 563158, 565743, 570381, 575226, 579184, 582234, 584801, 587247, 589755, 592527, 596102, 601140, 607578, 614429, 621025, 628143, 637248, 648792, 661966, 675834, 689786, 703018, 714664, 724588, 733027, 739229, 741617, 739890, 736024, 732457, 729997, 728132, 726514, 725113, 723542, 721466, 719596, 719368, 721595, 726178, 732998, 742266, 753802, 766782, 780605, 795536, 812091, 829985, 847949, 864511, 878840, 890869, 900636, 907669, 911382, 912181, 911692, 911380, 911111, 909582, 906092, 901533, 897619, 895440, 894665, 893777, 891119, 886141, 879884, 874300, 871238, 871909, 876597, 884297, 893056, 901490, 910035]
60449I10035J0265J3004J5641J8149K1321K5381K9518L2694L4490L5487L7115
60438A183100M0601M5531M9751N1152M9289M4921L8736L1155K2730J3681L390
60427A574037q591k1150l2162m0539m6750n1183n3139n2107m9291m6844m5619
60416A126662m4490m2035l8376l4834l2095k9551k6596k3721k1587j9839j7940
60405G95598j6657j7036j7983j6855j3174r821r198r884q927o247m449m874o114
60392F54379o452n729m581l683l991n917p856p405m646k334k024k038n41J316
60378E98498J178r43k949l711l853l924l746l470l610l816k982r66R75J837J956
60363E70474K067K090J448J03j115j088O00K931L971K656nj964k152j094M9L64
$$ y = [910035, 920300, 933304, 948945, 967094, 988415, 1013796, 1043314, 1076008, 1110498, 1145985, 1183100, 1223701, 1269232, 1318983, 1370135, 1419424, 1464345, 1503081, 1534236, 1556966, 1570647, 1574037, 1565446, 1544296, 1512134, 1471595, 1424845, 1373662, 1320523, 1268416, 1219125, 1172281, 1126662, 1082172, 1040137, 1001761, 966927, 934832, 905281, 878685, 854964, 833377, 813538, 795598, 778941, 761905, 743922, 727067, 713893, 704072, 694874, 684990, 676063, 669816, 665367, 660493, 654379, 647927, 642198, 637617, 633934, 629943, 624026, 616170, 608765, 604119, 601785, 599761, 597723, 597182, 598498, 599676, 598733, 595784, 592073, 588220, 584296, 580550, 577080, 573470, 569654, 566672, 565706, 566681, 568518, 570474, 572541, 574631, 576079, 576182, 575067, 573979, 574579, 577510, 581481, 584137, 584132, 582168, 580016, 578922, 578971, 579335]
60347E79335l62j261p44J729M516N445M442L392L561M418N055N287M947L572J667
60332F24999R99K561M919N749M545K918K469L179L829L379J968Q72J400L620O388
60317F73794Q505R423Q874O815M101K181J529J182M91L69J831M125N677O283O915
60302G42095P668P510O268N316N711O872P810Q633R909J1348J2221J2622J3260
60289H57243J4075J4020J2319R250N470J306k883o295q410r802j1452j3069j3023
60276H48749j0462o934m979n276o193o278o094o803p821p226m369r31J005J066
60262G77454K58n62j053p33Q89L334N231N901O261P552R708J1741J3461J5635
60248H55077J8396K0752K2231K3745K5723K6424K3747J8196J2166O408p12r778
$$ y = [579335, 578973, 577712, 576968, 578697, 583213, 588658, 593100, 596492, 600053, 604471, 609526, 614813, 619760, 623332, 624999, 625998, 628559, 633478, 639227, 643772, 646690, 649159, 652338, 656167, 659546, 661514, 662386, 663786, 667406, 673794, 682299, 691722, 700596, 707411, 711512, 713693, 715222, 716404, 716895, 717264, 719095, 723220, 728897, 735180, 742095, 749763, 757273, 763541, 768857, 774568, 781440, 789250, 797883, 807792, 819140, 831361, 843983, 857243, 871318, 885338, 897657, 906907, 912377, 913683, 910800, 904505, 896095, 886293, 874841, 861772, 848749, 838287, 831353, 826374, 821098, 814905, 808627, 802533, 795730, 787909, 780683, 776314, 775383, 776388, 777454, 777712, 777150, 776097, 775364, 776253, 779587, 784818, 790719, 796980, 804532, 814240, 825981, 839442, 855077, 873473, 894225, 916456, 940201, 965924, 992348, 1016095, 1034291, 1046457, 1052865, 1052153, 1042375]
60236A042375j8276k3434k5589k6949k8028k7429k4773k1745j9778j8333j6209
60225G91832j3430j0968r343q233p190o167n358m761m000k843j937k397m127n265
60211G05813m272k101j074j825k777k693k237k440k958k814k043j651k334l798
60197F70796n015m871l093p84N45O30M29L96n6r94j269j62J329J943J941K238
60181F64003K567J948O56K41J438L123L676K772J654J928L933O043O086L743Q73
60166G04684r35k023l081l196j239J688L176K765K233K580K738J917J294K130
60152G14731L640M180L715L721N064P106Q741R376Q967P875O799O394O829P797
60138H04935Q714Q859P917O713O682Q038R015P834N059L098L268M269L904J668
$$ y = [1042375, 1024099, 1000665, 975076, 948127, 920099, 892670, 867897, 846152, 826374, 808041, 791832, 778402, 767434, 758091, 749858, 742668, 736501, 731143, 726382, 722382, 719539, 717602, 715205, 711078, 705813, 701541, 699440, 698366, 696541, 693764, 691071, 688834, 686394, 683436, 680622, 678579, 676928, 674594, 670796, 665781, 660910, 657817, 657033, 657578, 658208, 658637, 659033, 658977, 657983, 656714, 656552, 657881, 659824, 661765, 664003, 666570, 668518, 669174, 669415, 670853, 673976, 677652, 680424, 682078, 684006, 687939, 693982, 700068, 703811, 704684, 703749, 701726, 698645, 695449, 694210, 695898, 699074, 701839, 704072, 706652, 709390, 711307, 712601, 714731, 718371, 722551, 726266, 729987, 735051, 742157, 750898, 760274, 769241, 777116, 783915, 790309, 797138, 804935, 813649, 822508, 830425, 837138, 843820, 851858, 860873, 868707, 873766, 876864, 880132, 884401, 888305, 889973]
60124H89973j003k674l378l998m689m733l846k934l043l965m675m878n295o279
60110H34583p024o556n006l451k840l400m585n400n115m042l178k822k082k72
60096G78810J782K524J534j25j259j502j013K2J189J809J566J043J194K344L941
60081G93859N248N962O057N357L810K132J505K345L790M932O006P560Q832Q215
60067H65610N570K896K032K604L089L130L550M407M367K473l42k192k242j234
60053H93718k18P23K217M284N733N210K868O23L47J890L171K459K42j410j365
60038I20492o79r28j837j670n6J002j59k371l207k328j402j109l41J217K045J271
60022I09940L26N41P58p20l011l731k647j937k745l689l379k536k692m055n717
$$ y = [889973, 888970, 886296, 882918, 878920, 874231, 869498, 865652, 862718, 859675, 855710, 851035, 846157, 840862, 834583, 827559, 821003, 815997, 812546, 809706, 806306, 801721, 796321, 791206, 787164, 783986, 781164, 779082, 778810, 780592, 783116, 784650, 784525, 783266, 781764, 780751, 780773, 781962, 783771, 785337, 786380, 787574, 789918, 793859, 799107, 805069, 811126, 816483, 820293, 822425, 823930, 826275, 830065, 834997, 841003, 848563, 857395, 865610, 871180, 874076, 876108, 878712, 881801, 884931, 888481, 892888, 897255, 899728, 899386, 897194, 894952, 893718, 893500, 894223, 896440, 900724, 906457, 911667, 914535, 915158, 915505, 917395, 920566, 923025, 923267, 921857, 920492, 919813, 918885, 917048, 915378, 915322, 916324, 916165, 913794, 910587, 908259, 906857, 905748, 905407, 906624, 908669, 909940, 910266, 910807, 911565, 910845, 907834, 904103, 901456, 899519, 896774, 893085, 889706, 887170, 884478, 880423, 874706]
60007H74706p098q124q665q669q521q633q966r316r652r815r343q146o874o170
59993G56714n848n291m314l198k201j521j514k295l154k934j247R19K071J751
59979G27938J107J747L887N883N911M009K030J575K451L333L388K827K168J494
59965G69748O06m11j134j449j894k977m125m145l026k506m020o610p943p190n763
59950G17161n163n418n945o648p426p526o440m845l790l405l210l218l711m238
59936F46178l891k660j594j422j684j522p20L53J313J905J928J499J178J473K213
59921F44547K724K692K615L154M127M433L225R96q68j580j630j795j984j515k51
59906F58890J107J896K073J734O16j349l205l498j927j4M99k87o76L05J629J758
$$ y = [874706, 867608, 859484, 850819, 842150, 833629, 824996, 816030, 806714, 797062, 787247, 777904, 769758, 762884, 756714, 750866, 745575, 741261, 738063, 735862, 734341, 732827, 730532, 727378, 724444, 723197, 724116, 726187, 727938, 729045, 730792, 734679, 740562, 746473, 750482, 752512, 754087, 756538, 759871, 763259, 766086, 768254, 769748, 770354, 769943, 768809, 767360, 765466, 762489, 758364, 754219, 751193, 748687, 744667, 738057, 730114, 722924, 717161, 711998, 706580, 700635, 693987, 686561, 679035, 672595, 667750, 663960, 660555, 657345, 654127, 650416, 646178, 642287, 639627, 638033, 636611, 634927, 633405, 632685, 633038, 634351, 636256, 638184, 639683, 640861, 642334, 644547, 647271, 649963, 652578, 655732, 659859, 664292, 667517, 668513, 667645, 666065, 664435, 662640, 660656, 659141, 658890, 659997, 661893, 663966, 665700, 666316, 664967, 661762, 658264, 656337, 656323, 656822, 656535, 655859, 656164, 657793, 659551]
59890F59551O89l00n05m22n62o49k91K71N58M71J31l99q54o21N68K053K808K496
59872F64993J592O87R9N2P39J988L227L955M186M276M460M652M741M873N197N456
59856G15173N315N036N350O279O788O173N226N151N629N116K954J79j874k739
59842G69756k437j110N34J428J352J006N69n83k152k310p8K842M084L765L984
59827G80650N602P170P171N875M613M251M790N672O169N964N426M913M163L078
59813H55507K575L467M767M504K366J15q50r07o76K43J929K804J350j404k558
59798H73232n69L272O610Q220Q166O781M395J751j51j014j601k680l765l619k196
59783H96832j269k354m664o176o471p135r184j1421j2069j0965r275p783o472
$$ y = [659551, 660240, 659940, 659435, 659013, 658451, 657802, 657511, 657782, 658340, 658811, 658942, 658543, 657689, 657068, 657636, 659689, 662497, 664993, 666585, 667272, 667371, 667423, 668162, 670150, 673377, 677332, 681518, 685794, 690254, 694906, 699647, 704520, 709717, 715173, 720488, 725524, 730874, 737153, 743941, 750114, 755340, 760491, 766120, 771236, 774190, 774369, 772495, 769756, 767319, 766209, 766743, 768171, 769523, 770529, 771098, 770515, 768363, 766053, 765975, 768817, 772901, 776666, 780650, 786252, 793422, 800593, 806468, 811081, 815332, 820122, 825794, 831963, 837927, 843353, 848266, 852429, 855507, 858082, 861549, 866316, 870820, 873186, 873301, 872451, 871544, 870868, 871111, 873040, 875844, 877194, 875790, 873232, 872663, 875935, 882545, 890765, 898931, 905712, 910107, 911858, 911707, 910693, 909092, 906412, 902647, 899028, 896832, 895563, 893209, 888545, 882369, 875898, 868763, 859579, 848158, 836089, 825124, 815849, 808066, 801594]
59770H01594n343m654m366m169l943l689l046j631K04J488J599P55m39j524k249
59755G70587k467k111j187J59J461K117J944J272K86j188k889l768l291k622l360
59740G54943n198o095n088l763m076n609o129m563k230r44q48p44p3L31m28j859
59724G07627k476j593j86L30q9p3J269K993L272J588n49j169K15K442M138M859
59708G22598M895M498L693K627J735J479K076L336M513M524K824K83j257o39J499
59693G58684L539M419M093K900J325M17J431M354P300Q178O988N799O283P899
59679H23609Q887Q450P277O186N165L986L044K848L012K416O32j302j884p95P33
59664H72264J266O15l51j055j995l792n788o251m264j036J093R56m72j477j529
$$ y = [801594, 796251, 791597, 787231, 783062, 779119, 775430, 772384, 770753, 770957, 772445, 774044, 774799, 774360, 772836, 770587, 768120, 766009, 764822, 764981, 766442, 768559, 770503, 771775, 772061, 770873, 767984, 764216, 760925, 758303, 754943, 749745, 743650, 738562, 734799, 730723, 725114, 718985, 714422, 712192, 711248, 710400, 709656, 709583, 709914, 709486, 707627, 705151, 703558, 703372, 703702, 703613, 703540, 704809, 707802, 711074, 712662, 712113, 710944, 711159, 713601, 717739, 722598, 727493, 731991, 735684, 738311, 740046, 741525, 743601, 746937, 751450, 755974, 758798, 759081, 757824, 757185, 758684, 762223, 766642, 770735, 773635, 774960, 775377, 776808, 781162, 788462, 796640, 803628, 809427, 815710, 823609, 832496, 840946, 848223, 854409, 859574, 863560, 866604, 869452, 872464, 874880, 875512, 874210, 872326, 871531, 872264, 873530, 874145, 873794, 872739, 870744, 866952, 861164, 854913, 850649, 849613, 850706, 851662, 851190, 849713, 848184]
59649H48184j505k087k609j936k09J042O82p73k103k873l213k663n77K324M154
59634H35838M131L628M181N343N464L933J608n05j856k033j052k4k69j605k528
59619H54254k375k159k810l698l712k995k587k848l244l478l893m659n347n568
59605H04881n448n164m513l337k185j963k781l442k490J57K903L949K876O65j446
59590G82662k690k671j336P38K534L415L494L074K207J046J30k44o04j584k764
59575G87407k991j977r10r03j469j343n57n33j768k618j346J251K555J289j245
59560G74842l195m074m256l906l275l165m016n129n581n348m761l660k009o58
59546G21809l01l39P9N34K63k9R24K551K926J669N28O63J131P25k24o55k45N79
$$ y = [848184, 846679, 844592, 841983, 840047, 839838, 840880, 841562, 840789, 838686, 835813, 832600, 829937, 829360, 831684, 835838, 839969, 843597, 847778, 853121, 858585, 862518, 864126, 863621, 861765, 859732, 858680, 858656, 858387, 856782, 854254, 851879, 849720, 846910, 843212, 839500, 836505, 833918, 831070, 827826, 824348, 820455, 815796, 810449, 804881, 799433, 794269, 789756, 786419, 784234, 782271, 779490, 776048, 773558, 773715, 776618, 780567, 783443, 784108, 782662, 779972, 777301, 775965, 776703, 779237, 782652, 786146, 789220, 791427, 792473, 792603, 792359, 791755, 790171, 787407, 784416, 782439, 781529, 780626, 779157, 777814, 777257, 776724, 774956, 772338, 770992, 772243, 774798, 776087, 774842, 771647, 767573, 763317, 759411, 756136, 752971, 748955, 743826, 738245, 732897, 728136, 724476, 722467, 721809, 721508, 721169, 721248, 721782, 722045, 722016, 722940, 725491, 728417, 730086, 730614, 731277, 732408, 733133, 732909, 732254, 732009, 732588]
59528G32588J089M64j263k408j293J168K364J684J034J089j71l634o492n909l296
59513G17014k153l072l672k642r42O36K255L250K294m4j183R1J897J857L7j643
59497G13980j848o81J058K674L797M245L672J910%PK691N994P248O455N933P041
59481G64176Q926J0451J1636J2933J4552J6651J8783J9093J5699R192K254l262
59469I01084p347r942j0337q956p564o721n061k180q6k58j204q42K74K57p68j059
59453H39290l15p4j067k181k381k141k460l558m915n913o156n727n161m773m289
59438G88179l549l059l252l687l742l563l501l122j788J59J684K298K112J200
59424G66369r0n88O26K720L900L723L467M055M873N104N110N747O930P660P204
$$ y = [732588, 733677, 734141, 732878, 730470, 729177, 730345, 732709, 734393, 735427, 736516, 736345, 732711, 726219, 720310, 717014, 714861, 711789, 708117, 705475, 704533, 705169, 707424, 710674, 712968, 712924, 711741, 711832, 713729, 715586, 715623, 713980, 712132, 711451, 712509, 715183, 718980, 723225, 726897, 728807, 728807, 728814, 731505, 737499, 744747, 751202, 757135, 764176, 773102, 783553, 795189, 808122, 822674, 839325, 858108, 877201, 892900, 902092, 904346, 901084, 893737, 883795, 873458, 864502, 856938, 850217, 845156, 842976, 842890, 842632, 841428, 840586, 840860, 841117, 840349, 839290, 838975, 838901, 837834, 835653, 833272, 831131, 828671, 825113, 820198, 814285, 808129, 802402, 797241, 792468, 788179, 784630, 781571, 778319, 774632, 770890, 767327, 763826, 760704, 758916, 759075, 760759, 763057, 765169, 766369, 766279, 765691, 766317, 769037, 772937, 776660, 780127, 784182, 789055, 794159, 799269, 805016, 811946, 819606, 826810]
59409H26810N794M213L070K451K084J756J433J112P93O96J117J947K703L152L458
59394H62589L683L767M129N438P471R106R887J0531J1326J1222R494P175N557
59381I61375M198J852j330m054n738o562o204m371k333j962l223m271m233m044
59367I19100m185l585j525R40K439K985L456M476O541R952J3868J6499J7136J7177
59353A005274J8479K1682K6431L1720L5129L3339K5104J3034J355p354j2492j4032
59341A177669j2414q906m499Q28O333R113O550m22q484j5830k2617k7955k9564
59328A069802k7286k4232k2888k2034j9333j5286j2305j0918r364o884n060n113
59316H89099n620m223q85J834J801j76j302P4K795M556M655M307M480M638M187
$$ y = [826810, 832604, 836817, 839887, 842338, 844422, 846178, 847611, 848723, 849516, 850212, 851329, 853276, 855979, 859131, 862589, 866272, 870039, 874168, 879606, 887077, 896183, 906070, 916601, 927927, 939149, 948643, 955818, 961375, 965573, 967425, 966095, 962041, 956303, 949741, 943537, 939166, 936833, 934871, 931648, 927377, 923144, 919100, 914915, 911330, 909805, 910745, 913184, 916169, 919625, 924101, 930642, 940594, 954462, 970961, 988097, 1005274, 1023753, 1045435, 1071866, 1103586, 1138715, 1172054, 1197158, 1210192, 1211547, 1204193, 1191701, 1177669, 1165255, 1156349, 1151850, 1152678, 1159011, 1168124, 1174674, 1174252, 1165768, 1149938, 1127321, 1099366, 1069802, 1042516, 1018284, 995396, 973362, 954029, 938743, 926438, 915520, 906156, 899272, 894212, 889099, 883479, 879256, 878371, 880205, 882006, 881830, 880528, 880602, 883397, 887953, 892608, 896915, 901395, 906033, 910220]
59301I10220L998N253P289Q109P058N704N664O776Q085R515J1403J3036J3028
59288A015138J1157Q870P711Q047R444J1503J3847J5784J6527J5718J3663J1351
59276A158760R944R681R168O674K403j313k643k309k275l317m889o770r177j1368
59262A152569j1805j0183q160p347p597p928q065q039p170m820j835J44Q57J786
59248A072407M010O740Q414Q429P088M535P57l604p328r792j1498j3071j4208
59235A052879j4036j2405j0313q930q499q389q044p591p516p971q469q231o865
59222I35620m787k977k136k156k401k333j745o15Q39K052K489K281K228L049M838
59207I34246P195R495J1010J1249J0424R314Q386P362N812L841J881J06j569l108
$$ y = [910220, 914218, 919471, 926760, 934869, 941927, 947631, 953295, 960071, 968156, 977671, 989074, 1002110, 1015138, 1026295, 1035165, 1042876, 1050923, 1060367, 1071870, 1085717, 1101501, 1118028, 1133746, 1147409, 1158760, 1168704, 1178385, 1187553, 1194227, 1196630, 1195317, 1192674, 1190365, 1188090, 1184773, 1179884, 1173114, 1163937, 1152569, 1140764, 1130581, 1122421, 1115074, 1107477, 1099549, 1091484, 1083445, 1076275, 1071455, 1069620, 1069764, 1070621, 1072407, 1076417, 1083157, 1091571, 1100000, 1107088, 1111623, 1112380, 1108776, 1101448, 1091656, 1080158, 1067087, 1052879, 1038843, 1026438, 1016125, 1007195, 998696, 990307, 982263, 974672, 967156, 959185, 950716, 942485, 935620, 930833, 927856, 925720, 923564, 921163, 918830, 917085, 916470, 917309, 919361, 921850, 924131, 926359, 929408, 934246, 941441, 950936, 961946, 973195, 983619, 992933, 1001319, 1008681, 1014493, 1018334, 1020215, 1020321, 1018752, 1015644]
59193A015644m329n191n846o506p245p840p706o409m350k609j822j645j587j781
59179I50778k429k963k504j001O79J793K310K600K932L088K257j63l084l867j135
59164I49291K922M493K433o75j972j382o72r45k055l473m500m295k894j701j949
59149I32626l045l411k565j288k25M47K47j204k842k792q08J080J097j76r82p09
59133I15450n8L85O59P30L47l61q29o78R6J460L293M972N571M705K911J083k08
59116I39528q21p74j27R52K078K737K651K127J908K565M163O404Q737J0264J0135
59101I92527Q460O528N539N327M767L314J607M66o0m78r99j293j041m49k01r69
59085A023045k889n420p573q436p845o667o100o413o681o110n190m923n293n530
$$ y = [1015644, 1011315, 1006124, 1000278, 993772, 986527, 978687, 970981, 964572, 960222, 957613, 955791, 954146, 952559, 950778, 948349, 945386, 942882, 941881, 942560, 944353, 946663, 949263, 952195, 955283, 957540, 957377, 954293, 950426, 949291, 952213, 956706, 959139, 958464, 956492, 955110, 954438, 953493, 951438, 947965, 943465, 939170, 936276, 934575, 932626, 929581, 926170, 923605, 922317, 922092, 922539, 922786, 921582, 918740, 915948, 915140, 916220, 917317, 917141, 916159, 915450, 915392, 915777, 916436, 917166, 917513, 917152, 916323, 915645, 915741, 917201, 920494, 925466, 931037, 935742, 938653, 939736, 939528, 938707, 937933, 937806, 938758, 940836, 943573, 946224, 948351, 950259, 952824, 956987, 963391, 972128, 982392, 992527, 1000987, 1007515, 1013054, 1018381, 1023148, 1026462, 1028069, 1028535, 1028475, 1027997, 1026998, 1025705, 1024664, 1024215, 1024014, 1023045, 1020156, 1014736, 1007163, 998727, 990882, 984215, 978115, 971702, 965021, 958911, 953721, 948798, 943505, 937975]
59071I37975n609o180o858o102l523r99l52j012j117j33J103K112L009L401K780
59056I18495J852J959L110M172N030O769R331J0794R956Q071O970O628N777M080
59042A002994K442J797K450M137N842O072M238J432q13k072k798l262l499l692
59028A015268l764l133j653l05l8m88p02p41j457l033m812o367p735q687q821
59013I63532q342p895p602o995n902m696l814l713m922p144q515p142l612p98
58999H82440o98k375l537l321k741k876l464l395k190o67K5o6K58J555K601J863
58983H63412l70k210k437j589p65l06N0L93M99J55n38r17p1K181M751O362P037
58966H75637P823R193J0419J0530R268P295O010O870R865J2920J3809J2641J1341
$$ y = [937975, 932366, 926186, 919328, 913226, 909703, 908704, 908352, 907340, 906223, 906090, 907193, 909305, 912314, 915715, 918495, 920347, 922306, 925416, 929588, 934618, 941387, 950718, 961512, 971468, 979539, 986509, 993137, 998914, 1002994, 1005436, 1007233, 1009683, 1013820, 1019662, 1025734, 1029972, 1031404, 1030591, 1028519, 1025721, 1022459, 1018960, 1015268, 1011504, 1008371, 1006718, 1006413, 1006375, 1005887, 1005185, 1004444, 1002987, 999954, 995142, 988775, 981040, 972353, 963532, 955190, 947295, 939693, 932698, 926796, 922100, 918286, 914573, 909651, 902507, 893992, 886850, 883238, 882440, 881742, 879367, 875830, 872509, 869768, 866892, 863428, 860033, 857843, 857176, 857201, 857135, 857393, 858948, 861549, 863412, 863042, 860832, 858395, 856806, 856041, 855735, 855785, 856178, 856677, 856832, 856294, 855377, 855306, 857487, 862238, 868600, 875637, 883460, 892653, 903072, 913602, 922870, 930165, 936175, 943045, 952910, 965830, 979639, 992280, 1003621]
58953A003621J0897J0419R102P498O259N056L639K804L174L857L495K213J447
58940A073481K052L381M244M144L511L163L541M325M800M666M325M338M832N387
58926A130190N360M508L545L552M441M732L592K348K739M382N616O306P841J0462
58912A199614J2796J4342J6104J7999J8115J5892J3778J3868J4872J4440J2968
58901A364788J2577J3377J3433J2012J0426R645R130Q227O829M491P41l421o018
58888A456237o641p009q493j0483j1731j2011j1768j1327j1166j1830j2896j2955
58876A327927j1364r151p615o914o742p320q691r776r352p609n737m311l072k064
58862A228209j818k181k046q45M09L25r93k091k177k036k458k665j234J644M122
$$ y = [1003621, 1014518, 1024937, 1034039, 1041537, 1047796, 1052852, 1056491, 1059295, 1062469, 1066326, 1069821, 1072034, 1073481, 1075533, 1078914, 1083158, 1087302, 1090813, 1093976, 1097517, 1101842, 1106642, 1111308, 1115633, 1119971, 1124803, 1130190, 1135550, 1140058, 1143603, 1147155, 1151596, 1156328, 1159920, 1162268, 1165007, 1169389, 1175005, 1181311, 1189152, 1199614, 1212410, 1226752, 1242856, 1260855, 1278970, 1294862, 1308640, 1322508, 1337380, 1351820, 1364788, 1377365, 1390742, 1404175, 1416187, 1426613, 1436258, 1445388, 1453615, 1460444, 1464935, 1465676, 1462255, 1456237, 1449596, 1442587, 1434094, 1423611, 1411880, 1399869, 1388101, 1376774, 1365608, 1353778, 1340882, 1327927, 1316563, 1307412, 1299797, 1292883, 1286141, 1278821, 1270130, 1260354, 1251002, 1243393, 1237656, 1233345, 1230273, 1228209, 1226391, 1224210, 1222164, 1221319, 1221728, 1222053, 1221060, 1218969, 1216792, 1214756, 1212298, 1209633, 1208399, 1210043, 1214165]
58847A214165N117N583O777Q411R621J0874J3294J6411J8163J7493J5644J4377
58835A355930J3945J3462J2414J1008R641Q816R137J0596J2102J2472J1850J1456
58823A492829J1845J2137J1300R650Q452Q234Q136P145N286L063L16l508p900
58810A566985j1252j2731j3403j4761j6713j7807j7181j5415j3584j2266j1600
58799A410272j1627j2241j3107j3825j4032j3532j2593j1947j2086j2751j3491
58788A269040j4320j5325j5900j5252j3542j1803j0615r655q691q198q578r347
58776A127814r606r077q352q274r090j0009r660p535m950l934m880n876m815j797
58762A029959J086K109J470O04M63Q28R52N93K46N87J734L005L420K656J574J481
$$ y = [1214165, 1219282, 1224865, 1231642, 1240053, 1249674, 1260548, 1273842, 1290253, 1308416, 1325909, 1341553, 1355930, 1369875, 1383337, 1395751, 1406759, 1416400, 1425216, 1434353, 1444949, 1457051, 1469523, 1481373, 1492829, 1504674, 1516811, 1528111, 1537761, 1546213, 1554447, 1562583, 1569728, 1575014, 1578077, 1578393, 1574885, 1566985, 1555733, 1543002, 1529599, 1514838, 1498125, 1480318, 1463137, 1447722, 1434138, 1421872, 1410272, 1398645, 1386404, 1373297, 1359472, 1345440, 1331908, 1319315, 1307368, 1295282, 1282531, 1269040, 1254720, 1239395, 1223495, 1208243, 1194701, 1182898, 1172283, 1162628, 1153937, 1145739, 1137161, 1127814, 1118208, 1109131, 1100779, 1092505, 1083415, 1073406, 1063746, 1056211, 1051261, 1047327, 1042447, 1036571, 1031756, 1029959, 1031045, 1033154, 1034624, 1035228, 1035691, 1036519, 1037471, 1038064, 1038310, 1038897, 1040631, 1043636, 1047056, 1049712, 1051286, 1052767]
58746A052767K614L681L255J315j018k968m600o064p173p777p774o858n136l872
58732A010392m485o619q422q899q648q062o565m346k959l055l241k508k046k868
58718I37669l463k116p7L60j93O22K353J904j480m777n790n991p201q278p371
58703H96171n382m615n245n477m527l314k485j750j115j150j722j663j76K154
58689H59704M096M993N081M926M774M437L840L477L819M434M351L444K691K895
58675I16962L909N279O711P585P108N551M477M984O439P634Q376R061R326Q295
58661A011697O017L772K842L349M298M529L843L240L723M922N579N346N161N547
58647A073865N638M540K786J515Q34j65k012m236o041p175q243j0165j3065j5649
$$ y = [1052767, 1055381, 1059062, 1062317, 1063632, 1062614, 1059646, 1055046, 1048982, 1041809, 1034032, 1026258, 1019400, 1014264, 1010392, 1005907, 999288, 990866, 981967, 973319, 965257, 958692, 954346, 951387, 948332, 945091, 942583, 940537, 937669, 934206, 932090, 932013, 932373, 932180, 932802, 935155, 937059, 935579, 930802, 925012, 919021, 911820, 903542, 896171, 890789, 886174, 880929, 875452, 870925, 867611, 865126, 863376, 862261, 861111, 859389, 857726, 857550, 859704, 863800, 868793, 873874, 878800, 883574, 888011, 891851, 895328, 899147, 903581, 907932, 911376, 914067, 916962, 920871, 926150, 932861, 940446, 947554, 953105, 957582, 962566, 969005, 976639, 985015, 994076, 1003402, 1011697, 1017714, 1021486, 1024328, 1027677, 1031975, 1036504, 1040347, 1043587, 1047310, 1052232, 1057811, 1063157, 1068318, 1073865, 1079503, 1084043, 1086829, 1088344, 1089178, 1089013, 1087001, 1082765, 1076724, 1069549, 1061306, 1051141, 1038076, 1022427]
58633A022427j6342j5118j3536j2961j3426j4285j4917j4605j2849j0295q405
58622H75688p753p552p097o558o027n151m235m268n131n192l629j706p28j38J003
58607H11526K059J989J348J382J995K343K733M062N813O459N704M655L836K604
58593H58508O24j492l210m558n438n514m861l990l227k800l043l666l507k130
58579H11696r73j495k773k740j346m70p78p42P49K768M056M670N034M837L858
58564H26351K769K170J837J707K446M066M992L825J451M2M00J461K269L144M556
58549H63486N911O218N468M652M437M421L839K634J488J040J401K222K742K057
58535I12016P7j828k088q90L5k06n81Q5J476K774M032N488O524O663O845Q177
$$ y = [1022427, 1006085, 990967, 977431, 964470, 951044, 936759, 921842, 907237, 894388, 884093, 875688, 867935, 860383, 853286, 846728, 840701, 835550, 831315, 827047, 821916, 816724, 813095, 811389, 810661, 810523, 811526, 813585, 815574, 816922, 818304, 820299, 822642, 825375, 829437, 835250, 841709, 847413, 852068, 855904, 858508, 859132, 857640, 854430, 849872, 844434, 838920, 834059, 830069, 826842, 824042, 820999, 817333, 813826, 811696, 810723, 809228, 806455, 803715, 802369, 801899, 801121, 800379, 801128, 803896, 807952, 812622, 817656, 822493, 826351, 829120, 831290, 833127, 834834, 837280, 841346, 846338, 850163, 851614, 851656, 852056, 853517, 855786, 858930, 863486, 869397, 875615, 881083, 885735, 890172, 894593, 898432, 901066, 902554, 903594, 904995, 907217, 909959, 912016, 912093, 910265, 908177, 907287, 907322, 907116, 906535, 906620, 908096, 910870, 914902, 920390, 926914, 933577, 940422, 948599]
58519I48599R971J0512R576Q619Q625R175R781J0707J2068J3172J3248J2187J0546
58506A086786R490J0427J3683J7544J9740J9909J9729K0595K2212K3551K4109
58495A287775K3948K3238K2001J9914J6547J2358Q870O952N507L127M21q81q55
58482A428922j468l682o406q723j1255j4422j6963j7501j6525j5792j6336j7905
58470A281944j9584k0324j9413j7226j5058j3752j2858j1501r635q078p603q133
58458A118779q586p798o034n060n935p340p304n917m792m169k755n34N00o53k164
58443A050238j811J80J923K356J733N48p20j384j121l90K90R88J733K158K407
58428A059128L427N491P178O927N101L587L681N157P082Q765R944J0647J0994
$$ y = [948599, 958570, 969082, 978658, 987277, 995902, 1005077, 1014858, 1025565, 1037633, 1050805, 1064053, 1076240, 1086786, 1096276, 1106703, 1120386, 1137930, 1157670, 1177579, 1197308, 1217903, 1240115, 1263666, 1287775, 1311723, 1334961, 1356962, 1376876, 1393423, 1405781, 1414651, 1421603, 1427110, 1430237, 1430658, 1429777, 1428922, 1427454, 1423772, 1417366, 1408643, 1397388, 1382966, 1366003, 1348502, 1331977, 1316185, 1299849, 1281944, 1262360, 1242036, 1222623, 1205397, 1190339, 1176587, 1163729, 1152228, 1142593, 1134515, 1126912, 1118779, 1110193, 1102395, 1096361, 1091301, 1085366, 1078026, 1070722, 1064805, 1060013, 1055844, 1053089, 1052555, 1053055, 1052402, 1050238, 1048427, 1048607, 1050530, 1052886, 1054619, 1055167, 1054447, 1053063, 1051942, 1051552, 1051842, 1052830, 1054563, 1056721, 1059128, 1062555, 1068046, 1075224, 1082151, 1087252, 1090839, 1094520, 1099677, 1106759, 1115524, 1125468, 1136115, 1147109]
58415A147109J1025J0967J1399J2639J3995J4353J3410J1535Q714M879J252l24
58403A260953J36N11l97j184j78J883K998K699K226K414K818K790K377K135K788
58388A284969M830P783J0000R801O890K568j206l123l463l881n591p767q653q023
58374A285134p282p004o035l600p64J164K344L487M513N228O190P609Q420P759
58360A307163O535O215O772P183P234P365P315O363M640K790O83k127m831n763
58346A357537m550k688j711j770k155k186j350M62K399L091K245J259J696L382
58332A355661M665M513L820M229N988P643P898O971N725M304K583J240J148K005
58318A418393K777L386M611O391P605P726P422P285P361Q100J0200J3045J4844
$$ y = [1147109, 1158134, 1169101, 1180500, 1193139, 1207134, 1221487, 1234897, 1246432, 1255146, 1260025, 1261277, 1260953, 1261089, 1261600, 1261203, 1260019, 1259841, 1261724, 1264722, 1267421, 1269647, 1272061, 1274879, 1277669, 1280046, 1282181, 1284969, 1289799, 1297582, 1307582, 1317383, 1324273, 1326841, 1325635, 1322512, 1319049, 1315168, 1309577, 1301810, 1293157, 1285134, 1277852, 1270848, 1264813, 1261213, 1260449, 1261613, 1263957, 1267444, 1271957, 1277185, 1283375, 1290984, 1299404, 1307163, 1313698, 1319913, 1326685, 1333868, 1341102, 1348467, 1355782, 1362145, 1366785, 1369575, 1370258, 1368131, 1363300, 1357537, 1352987, 1350299, 1348588, 1346818, 1344663, 1342477, 1341127, 1341589, 1343988, 1347079, 1349324, 1350583, 1352279, 1355661, 1360326, 1364839, 1368659, 1372888, 1378876, 1386519, 1394417, 1401388, 1407113, 1411417, 1414000, 1415240, 1416388, 1418393, 1421170, 1424556, 1429167, 1435558, 1443163, 1450889, 1458311, 1465596, 1472957, 1481057, 1491257, 1504302, 1519146]
58305A519146J4916J4468J4589J4913J4962J5185J5822J6223J6182J6541J7521
58294A690468J7964J7319J6848J7608J8635J8508J7539J6916J6704J6116J4906
58283A879531J3284J1361R847J0212J2846J5914J7398J7523J7942J9353K1215
58272B046426K3091K4955K6631K7938K9010K9772K9802K9197K8739K8637K8215
58261B352413K7271K6522K6190K5643K4960K5149K6106K6422K6021K6843K9663
58250B643203L2470L3466L3545L4152L4927L5216L5856L7366L8509L8669L9601
58239C036980M2486M5350M5992M5533M6428M8725N1069N3557N6690N9161N9874
58228C591845O0667O3744O7716O9590O9549P0322P2652P4899P6444P8150P9792
$$ y = [1519146, 1534062, 1548530, 1563119, 1578032, 1592994, 1608179, 1624001, 1640224, 1656406, 1672947, 1690468, 1708432, 1725751, 1742599, 1760207, 1778842, 1797350, 1814889, 1831805, 1848509, 1864625, 1879531, 1892815, 1904176, 1914023, 1924235, 1937081, 1952995, 1970393, 1987916, 2005858, 2025211, 2046426, 2069517, 2094472, 2121103, 2149041, 2178051, 2207823, 2237625, 2266822, 2295561, 2324198, 2352413, 2379684, 2406206, 2432396, 2458039, 2482999, 2508148, 2534254, 2560676, 2586697, 2613540, 2643203, 2675673, 2709139, 2742684, 2776836, 2811763, 2846979, 2882835, 2920201, 2958710, 2997379, 3036980, 3079466, 3124816, 3170808, 3216341, 3262769, 3311494, 3362563, 3416120, 3472810, 3531971, 3591845, 3652512, 3716256, 3783972, 3853562, 3923111, 3993433, 4066085, 4140984, 4217428, 4295578, 4375370]
58217D375370Q0379Q0939Q3970R0059R7519J04919J11611J16548J19439J22463
58207E383216J28085J35670J42812J49022J55370J61651J67131J73161J81787
58198F777905J92390K02886K13399K25535K38871K51582K63792K77077K91462
58189H934899L06114L21812L39347L56821L72364L88208M08088M31826M56508
58180A2315987M81510N08098N35675N63281N93273O28419O66790P04795P43567
58171A7741395P86688Q33278Q79878R27694R80932J039053J098154J159220J227055
58162B6673347J301386J377569J456660J546260J650384J766791J895512K041318
58154C9709227K206178K387710K586837K808709L055198L325662L625900L965965
$$ y = [4375370, 4455749, 4536688, 4620658, 4710717, 4808236, 4913155, 5024766, 5141314, 5260753, 5383216, 5511301, 5646971, 5789783, 5938805, 6094175, 6255826, 6422957, 6596118, 6777905, 6970295, 7173181, 7386580, 7612115, 7850986, 8102568, 8366360, 8643437, 8934899, 9241013, 9562825, 9902172, 10258993, 10631357, 11019565, 11427653, 11859479, 12315987, 12797497, 13305595, 13841270, 14404551, 14997824, 15626243, 16293033, 16997828, 17741395, 18528083, 19361361, 20241239, 21168933, 22149865, 23188918, 24287072, 25446292, 26673347, 27974733, 29352302, 30808962, 32355222, 34005606, 35772397, 37667909, 39709227, 41915405, 44303115, 46889952, 49698661, 52753859, 56079521, 59705421, 63671386]
58146F3671386M347702M765537N221525N728316O296521O933191P654935Q486815
58138A13105928R444445J0532828J1764330J3155598J4701521J6380045J8195002
58131B07279697K0180371K2325655K4492608K6387411K7550114K7342969K5059835
58124C80618660K0252582J3099114M477265m361748j2264702j8477570k2703321
58117C60640280k5026337k5785027k5414287k4308860k2769800k1019629j9219772
58110A97096568j7470326j5821916j4302144j2925997j1688249j0567593r546020
58103A04774323q616012p770299o998403o296081n666878n110557m618212m180682
58095E5517199l793372l450991l145798k873513k633746k422574k231611k056508
$$ y = [63671386, 68019088, 72784625, 78006150, 83734466, 90030987, 96964178, 104619113, 113105928, 122550373, 133083201, 144847531, 158003129, 172704650, 189084695, 207279697, 227460068, 249785723, 274278331, 300665742, 328215856, 355558825, 380618660, 400871242, 413970356, 418447621, 414085873, 401821171, 383343601, 360640280, 335613943, 309828916, 284414629, 260105769, 237335969, 216316340, 197096568, 179626242, 163804326, 149502182, 136576185, 124887936, 114320343, 104774323, 96158311, 88388012, 81389609, 75093528, 69426650, 64316093, 59697881, 55517199, 51723827, 48272836, 45127038, 42253525, 39619779, 37197205, 34965594, 32909086]
58087C2909086j899616j761939j638631j524902j420598j326219j239593j159071
58079B0938517j085497j018403r54376q91594q32354p78883p30085o84298o41992
58070A3321035o03839n69035n37198n09213m84706m61436m38501m17452l98994
58061H900661l81219l62447l43428l25390l08157k91333k75378k60499k46371
58052F106439k33435k22466k12544k01825j90714j81680j75399j69844j63809
58043D354723j58428j54053j48566j40502j31566j24298j19085j14864j10975
58034C152386j06846j01472r4800q8389q3433p9266p4829p0374o6631o3440o0299
58023B262607n7313n4597n1568m7699m3357l9376l6415l4921l4751l4689l3385
$$ y = [32909086, 31009470, 29247531, 27608900, 26083998, 24663400, 23337181, 22097588, 20938517, 19853020, 18834617, 17880241, 16988647, 16156293, 15377410, 14647325, 13963027, 13321035, 12717196, 12148161, 11610963, 11101750, 10617044, 10155608, 9717107, 9299655, 8900661, 8519442, 8156995, 7813567, 7488177, 7180020, 6888687, 6613309, 6352810, 6106439, 5873004, 5650538, 5437994, 5236169, 5045455, 4863775, 4688376, 4518532, 4354723, 4196295, 4042242, 3893676, 3753174, 3621608, 3497310, 3378225, 3263361, 3152386, 3045540, 2944068, 2849268, 2760879, 2677446, 2598180, 2523351, 2452977, 2386346, 2322906, 2262607, 2205294, 2150697, 2099129, 2051430, 2008073, 1968697, 1932282, 1897361, 1862610, 1827921, 1794536]
58012A794536l1101k9472k9375l0090l0725l1159l1257l0401k8373k5835k3575
58001A473173k1964k1144k0963k0803k0336k0171k0779k1263k0475j8888j7882
57990A248505j7633j7240j6587j6334j6362j5962j5305j4851j3813j1284q527
57979A084607p651q264q122p133p620j0091j2055j2137j2203j3726j4989j4149
57967I56467j2606j2752j4210j4895j4397j3809j3210j1876j0425j0410j1864
57956H16013j3117j3006j1747r823p604n948n694o354o518n681m725m433m491
57943G16872m137l154k045j655k517m260n709n870m646k584m89O41R1j651l206
57928F75681l987m836o435p912p847o098l940k752l083m373n215m587l326l459
$$ y = [1794536, 1763435, 1733963, 1704588, 1674498, 1643773, 1612614, 1581357, 1550956, 1522583, 1496748, 1473173, 1451209, 1430065, 1409102, 1388299, 1367963, 1347792, 1327013, 1305750, 1285275, 1266387, 1248505, 1230872, 1213632, 1197045, 1180711, 1164349, 1148387, 1133082, 1118231, 1104418, 1093134, 1084607, 1076956, 1068692, 1060570, 1053437, 1045817, 1035726, 1023671, 1011534, 999331, 985605, 970616, 956467, 943861, 931109, 916899, 902004, 887607, 873798, 860588, 848712, 838287, 827877, 816013, 802896, 789890, 778143, 768320, 760716, 754768, 749074, 742720, 736202, 730521, 725796, 721363, 716872, 712735, 709581, 707536, 705881, 703364, 699104, 693395, 687525, 682879, 680295, 679806, 680447, 680538, 678887, 675681, 671694, 666858, 660423, 652511, 644664, 638566, 634626, 631874, 628791, 624418, 619203, 614616, 611290, 607831]
57914F07831n429p108o499m416l078k887k249l31J753K655K284J142o42k851m542
57899E75633m708l380j637n46m04r07j724k650l235k720q71J186J641j40k779
57884E52759m235l699j956k44Q99J827L045M273M453L075J286R30K399M254N073
57869E74139M837M084K771P92j107j979j992k199l070m000m385m642n669p390
57855E50190q293o919l926j924k619m612n088l355j408q63r61l33O65N72r93k938
57839E07195m138m278l557k424j580j650k701m274n585n631l789q03J450J744
57825D69979O75k75l07L49R77P23q25k821l642k809j579j044o73K20P39k71j867
57808D57549j809L16K417K508P65j339k658k746j684j84Q93J537K449L674M195
$$ y = [607831, 602402, 595294, 588795, 584379, 581301, 578414, 576165, 575834, 577587, 580242, 582526, 583668, 583026, 580175, 575633, 570925, 567545, 565908, 565362, 564958, 564051, 562327, 559677, 556442, 553722, 552851, 554037, 555678, 555538, 552759, 548524, 544825, 542869, 542625, 543524, 545351, 548396, 552669, 557122, 560197, 561483, 562413, 564812, 569066, 574139, 578976, 583060, 585831, 586623, 585516, 583537, 581545, 579346, 576276, 572276, 567891, 563249, 557580, 550190, 541897, 534978, 531052, 529128, 526509, 521897, 516809, 513454, 512046, 511183, 510222, 509889, 510554, 511126, 510133, 507195, 503057, 498779, 495222, 492798, 491218, 489568, 486867, 482593, 477008, 471377, 467588, 466785, 468235, 469979, 470654, 470379, 470072, 470421, 471398, 472121, 471296, 468475, 464833, 462024, 460445, 459401, 458728, 458948, 459687, 459416, 457549, 455740, 456056, 458473, 460981, 461746, 460407, 457749, 455003, 453319, 453135, 454028, 455565, 458014, 461688, 465883]
57793D65883L325J756O44K35k2m68r64j382j858k518l186l453l047k381k475l879
57777D46210n733o424n327l335j607m81J04l8q75j652j732j609k131k795j998
57762D10577N78K881K759P42n65J37J326Q89j160l173m250m887n450n349m163
57747C90892k672k097k782m049m908m632l141j354o84j682l337m059l154j118
57733C51223J008K277K310J628J222J389J496J154R68J451K036K041J986K671
57719C74860L441K873J241N39J600K696K080O15M47J768K614J659l00j974l161
57704C90998m019m026k866j701k114l959n427n409m640m175l931l358k571j827
57690C40975o08J551L739M370L243J852J490J936K194J835J274J293K373L972
$$ y = [465883, 469208, 470964, 471608, 471843, 471821, 471353, 470389, 469007, 467149, 464631, 461445, 457992, 454945, 452564, 450089, 446210, 440477, 434053, 428726, 425391, 423784, 423303, 423407, 423369, 422494, 420842, 419110, 417501, 415370, 412575, 410577, 411155, 414036, 416795, 417537, 416972, 417109, 418435, 419324, 418164, 414991, 410741, 405854, 400404, 395055, 390892, 388220, 386123, 383341, 379292, 374384, 369752, 366611, 365257, 364573, 362891, 359554, 355495, 352341, 351223, 352231, 354508, 356818, 358446, 359668, 361057, 362553, 363707, 364675, 366126, 368162, 370203, 372189, 374860, 378301, 381174, 382415, 382954, 384554, 387250, 389330, 389945, 390392, 392160, 394774, 396433, 396133, 394159, 390998, 386979, 382953, 380087, 378386, 376272, 372313, 366886, 361477, 356837, 352662, 348731, 345373, 342802, 340975, 340367, 341918, 345657, 350027, 353270, 355122, 356612, 358548, 360742, 362577, 363851, 365144, 367517, 371489]
57676C71489M588L307J131j21j52k08p50o91N25J563J033m72j426j638k117l071
57660C72990l487k792j823j776k730l558l096j367K93M21j179l450n120n222l156
57645C34948N00L306K703r12m221m843l790l251l445l139k074j043k51O72J422
57630C16582J305N30j8jM49J456K742L028J669K92R88L312N065N685O736Q980
57614C58800J1255J2769J4446J7193K0625K4232K8203L2174L4577L4039L0208
57603F18521K2814J1564k115j4741k3271k7048k7018k4642k2103k1407k1979k0942
57591D47633j7214j3611j3166j5029j6000j4842j2860j1141r542p935o349m187
57579C05757j225J047J032l15n91M50P66l85j207n66o2j504m002n284m727l515
$$ y = [371489, 376077, 379384, 380515, 380394, 380242, 380034, 379284, 378593, 379118, 380681, 381714, 381242, 379816, 378178, 376061, 372990, 369503, 366711, 364888, 363112, 360382, 356824, 353728, 352361, 352654, 353075, 351896, 348446, 343326, 338104, 334948, 335448, 338754, 341457, 340545, 336324, 331481, 327691, 324440, 320995, 317856, 315782, 314739, 314488, 315160, 316582, 317887, 318417, 318399, 318398, 318847, 320303, 323045, 326073, 327742, 328034, 329022, 332334, 337399, 343084, 349820, 358800, 370055, 382824, 397270, 414463, 435088, 459320, 487523, 519697, 554274, 588313, 618521, 641335, 652899, 650784, 636043, 612772, 585724, 558706, 534064, 511961, 490554, 468575, 447633, 430419, 416808, 403642, 388613, 372613, 357771, 344911, 333770, 324228, 316293, 309944, 305757, 304532, 305579, 306611, 306296, 305705, 306155, 306921, 306536, 305329, 304763, 304701, 303197, 299195, 293911, 289184, 285669]
57563B85669k511j559n60Q3K20K40M85Q62J068Q04j83j804l390m095l647k578
57547B69104j691j310j098p04n11j276k845l745k786p55K54p47k643l607k917
57532B42723j280m2j99j608l073l575l356l160k777j399O08J663J077L5k23p4
57516B25340m71j249j528j235j007r73p67n04o61r96o78L56J148J071P13R08J525
57499B20992J696R24m50j660k121j770r98k27L24M19m34k461m837n949m759j762
57483A96927J433L368L647K971K359K103J509Oj714k186r82O95J398R48J52l45
57467B12289m17j45J45j17r66j343k32J725K769K368J931K646L683L560K487J958
57451B32341K309K232R99k62l21K64R7q81j487j244r29j032r10L5J146J306M01
$$ y = [285669, 283158, 281599, 281039, 281122, 281342, 281582, 282067, 282929, 283997, 284801, 284618, 282814, 279424, 275329, 271682, 269104, 267413, 266103, 265005, 264301, 263790, 262514, 259669, 255924, 253138, 252383, 252637, 251890, 249247, 245640, 242723, 241443, 241401, 241202, 239594, 236521, 232946, 229590, 226430, 223653, 222254, 222862, 224525, 225602, 225637, 225414, 225340, 224869, 223620, 222092, 220857, 219850, 218877, 218110, 217606, 216945, 215949, 215271, 215627, 216775, 217846, 218559, 219467, 220992, 222688, 223612, 223162, 221502, 219381, 217611, 216613, 216386, 216710, 217129, 216695, 214234, 209397, 203448, 198689, 196927, 198360, 201728, 205375, 208346, 210705, 212808, 214317, 214323, 212609, 210423, 209441, 210136, 211534, 212482, 212634, 212289, 211872, 211727, 211872, 211755, 210789, 209446, 209214, 210939, 213708, 216076, 218007, 220653, 224336, 227896, 230383, 232341, 234650, 236882, 237881, 237619, 237298, 237562, 237659, 236778, 235291, 234047, 233118, 232086, 231176, 231211, 232357, 233663, 234064]
57434B34064o93j333j669k067k462k441j777q17l42q35j746j900q47N82J356J534
57418B18607J856K394K321J074p95k112k060p67P49J313Q29O56K058M275N104
57403B35502L694J835J715L178M214L659K358J633J750K060J846P42r07j765m62
57388B61052K547M842M632K941K187L023L922L831L615M107M259K666K08n89J210
57373C04453L886N528O034N957M939K706O88Q27K879M473M145K933K554L238M132
57358C59372M810N303N327M628L865M104N456O861P268O555N375M621M859N812
57344D34216O575O778P092Q004Q625P873O409O080P386Q861R329R285R376Q992
57330E44881P522N965N826P028Q259R010R732J0287R858Q705Q378R530J0793J0713
$$ y = [234064, 233371, 232038, 230369, 228302, 225840, 223399, 221622, 220805, 220463, 219628, 217882, 215982, 215135, 215717, 217073, 218607, 220463, 222857, 225178, 226252, 225457, 223345, 221285, 220518, 221267, 222580, 223409, 224065, 226123, 230398, 235502, 239196, 241031, 242746, 245924, 250138, 253797, 256155, 257788, 259538, 261598, 263444, 264186, 263279, 261514, 261052, 263599, 268441, 273073, 276014, 278201, 281224, 285146, 288977, 292592, 296699, 300958, 303624, 303832, 303243, 304453, 308339, 313867, 319901, 325858, 330797, 333503, 334191, 335018, 337897, 342370, 346515, 349448, 352002, 355240, 359372, 364182, 369485, 374812, 379440, 383305, 387409, 392865, 399726, 406994, 413549, 418924, 423545, 428404, 434216, 440791, 447569, 454661, 462665, 471290, 479163, 485572, 491652, 499038, 507899, 517228, 526513, 535889, 544881, 552403, 558368, 564194, 571222, 579481, 588491, 598223, 608510, 618368, 627073, 635451, 644981, 655774, 666487]
57316F66487R710R067Q872Q372P819Q313R785J0532R501P804P150P559P673O932
57302G85576O295O787Q245R758J0625J0578R772Q895Q866R857J1105J1973J2666
57289I10998J3370J3410J2300J1158J1761J4106J6071J6004J4592J3561J3474
57278A060805J3644J3533J3236J2891J2634J2991J4395J6165J6716J5209J2536
57267A214755J0488J0186J1327J2747J3552J3891J4529J5504J5720J4362J2331
57256A359392J1483J2442J4037J5008J5370J5813J6559J7424J8410J9487K0130
57245A535555J9826J8886J8227J8330J8909J9542K0145K0769K1257K1283K0608
57234A753337J9405J8364J8204J8761J8991J8295J7504J7837J9190K0373K1051
$$ y = [666487, 676197, 685264, 694136, 702508, 710327, 718640, 728425, 738957, 748458, 756262, 763412, 770971, 778644, 785576, 791871, 798658, 806903, 816661, 827286, 837864, 847636, 856531, 865397, 875254, 886359, 898332, 910998, 924368, 937778, 950078, 961236, 972997, 987103, 1003174, 1019178, 1033770, 1047331, 1060805, 1074449, 1087982, 1101218, 1114109, 1126743, 1139734, 1154129, 1170294, 1187010, 1202219, 1214755, 1225243, 1235429, 1246756, 1259503, 1273055, 1286946, 1301475, 1316979, 1332699, 1347061, 1359392, 1370875, 1383317, 1397354, 1412362, 1427732, 1443545, 1460104, 1477528, 1495938, 1515425, 1535555, 1555381, 1574267, 1592494, 1610824, 1629733, 1649275, 1669420, 1690189, 1711446, 1732729, 1753337, 1772742, 1791106, 1809310, 1828071, 1847062, 1865357, 1882861, 1900698, 1919888, 1940261, 1961312]
57223A961312K2211K4309K6134K6555K6576K8187L1436L3989L4030L2437L1539
57212B278715L2423L4206L5390L5133L3491L1210K9341K8505K8345K8038K7391
57201B622188K7111K7882K9479L1001L1880L2378L2962L3432L3054L1709L0342
57190B963418K9805K9687K9172K8639K9193L0491L0625K8770K6606K6048K6758
57179C279212K7356K8034L0124L3568L6721L8653M0011M1526M3165M4880M6545
57168C689795M7023M5078M1588L9113L8687L8815L8324L8045L8572L8522L6767
57157D130329L4641L3934L4097L3752L3760L6164M0475M3713M4423M4537M6596
57146D556421N0666N4632N6469N5697N3445N1326M9801M7894M4965M1866L9341
$$ y = [1961312, 1983523, 2007832, 2033966, 2060521, 2087097, 2115284, 2146720, 2180709, 2214739, 2247176, 2278715, 2311138, 2345344, 2380734, 2415867, 2449358, 2480568, 2509909, 2538414, 2566759, 2594797, 2622188, 2649299, 2677181, 2706660, 2737661, 2769541, 2801919, 2834881, 2868313, 2901367, 2933076, 2963418, 2993223, 3022910, 3052082, 3080721, 3109914, 3140405, 3171030, 3199800, 3226406, 3252454, 3279212, 3306568, 3334602, 3364726, 3398294, 3435015, 3473668, 3513679, 3555205, 3598370, 3643250, 3689795, 3736818, 3781896, 3823484, 3862597, 3901284, 3940099, 3978423, 4016468, 4055040, 4093562, 4130329, 4164970, 4198904, 4233001, 4266753, 4300513, 4336677, 4377152, 4420865, 4465288, 4509825, 4556421, 4607087, 4661719, 4718188, 4773885, 4827330, 4878656, 4928457, 4976351, 5021316, 5063182, 5102523]
57135E102523L6535L2792K9785K9493L0658L0035K7199K5189K5864K7351K7211
57124E424635K5607K3839K2042K0104J9065J9550K0190J9469J8039J7407J7390
57113E647337J6780J5713J5332J5567J5181J3838J2420J1240R525O917M219K283
57101E786352J069k0j491l454n369o285n970n398n491n887n729m935l722j538
57087E732132K131O376R650J1704J3272J4079J2754Q859L489k503r444j7541k6010
57074E758948l4293m3228n4110o7287q2176r8113j14689j31843j50019j69772
57064D813418j91075k13776k38975k68729l03549l41138l78839m17003m58768
57055B001566n06559n59895C17827c61586p49565q30872r24129j028782j145791
$$ y = [5102523, 5139058, 5171850, 5201635, 5231128, 5261786, 5291821, 5319020, 5344209, 5370073, 5397424, 5424635, 5450242, 5474081, 5496123, 5516227, 5535292, 5554842, 5575032, 5594501, 5612540, 5629947, 5647337, 5664117, 5679830, 5695162, 5710729, 5725910, 5739748, 5752168, 5763408, 5772933, 5779850, 5784069, 5786352, 5787421, 5787401, 5785910, 5782456, 5777087, 5770802, 5764832, 5759434, 5753943, 5748056, 5742327, 5737392, 5733670, 5732132, 5734263, 5740639, 5750289, 5761993, 5775265, 5789344, 5802098, 5810957, 5814446, 5811943, 5802499, 5784958, 5758948, 5724655, 5681427, 5627317, 5560030, 5477854, 5379741, 5265052, 5133209, 4983190, 4813418, 4622343, 4408567, 4169592, 3900863, 3597314, 3256176, 2877337, 2460334, 2001566, 1495007, 935112, 317827, -361586, -1111151, -1942023, -2866152, -3894934, -5040725]
57046e040725j278916j433111j612385j819517k057289k329290k639634k992403
57038b1203270l391545l840769m342884m898306n503767o153130o840675p563176
57030f3737522q315308r078795r813774j0461999j0962316j1267456j1347020
57023a34984190j1170236j0681261r795333q434719o587682m344280j876636O21144
57015a87253193K987516N113152O933387Q415982R553741J0358299J0852548J1064382
57007a21974186J1023821J0762928J0317315R727536R037539Q289927P521746
57000e5293374O763476O039180N365412M750374M195790L700059L259768K870040
56992a8349275K525679K222465J956674J723859J519315J339580J182321J044781
$$ y = [-5040725, -6319641, -7752752, -9365137, -11184654, -13241943, -15571233, -18210867, -21203270, -24594815, -28435584, -32778468, -37676774, -43180541, -49333671, -56174346, -63737522, -72052830, -81131625, -90945399, -101407398, -112369714, -123637170, -134984190, -146154426, -156835687, -166631020, -175065739, -181653421, -185997701, -187874337, -187253193, -184265677, -179152525, -172219138, -163803156, -154249415, -143891116, -133038568, -121974186, -110950365, -100187437, -89870122, -80142586, -71105047, -62815120, -55293374, -48529898, -42490718, -37125306, -32374932, -28179142, -24479083, -21219315, -18349275, -15823596, -13601131, -11644457, -9920598, -8401283, -7061703, -5879382, -4834601]
56984d834601R23386Q15092P18345O32519N57193M92044b59335A30773L50599
56975D81372L16252K85326K56118K27269J98584J71237J46781J25878J07966R2028
56965B408811P7586O4899N4094M4353L4429K4011J3983N088l064j1245j9467k7134
56953B666344l3819l9260m3019m5113m6878n0320n6157o2988o8645p2259p4926
56942B072960p8513q3883r0203r5981j00641j04800j09077j13122j15895j16401
56932A064444j14023j08834j01928r4824q8028q0665p2031o2897n4666m7820m1948
56921A96780l6754l2156k7780k3346j9433j6805j5164A1880D64i144q149o278
56909b3571l777j619o65m54J38J627L840O582h313C851J3658J4209J4586J5093
$$ y = [-4834601, -3911215, -3096123, -2377778, -1745259, -1188066, -696022, -259335, 130773, 481372, 797624, 1082950, 1339068, 1566337, 1764921, 1936158, 2082939, 2208817, 2316783, 2408811, 2486397, 2551296, 2605390, 2649743, 2684172, 2708183, 2722166, 2727254, 2724190, 2712945, 2693478, 2666344, 2632525, 2593265, 2550246, 2505133, 2458255, 2407935, 2351778, 2288790, 2220145, 2147886, 2072960, 1994447, 1910564, 1820361, 1724380, 1623739, 1518939, 1409862, 1296740, 1180845, 1064444, 950421, 841587, 739659, 644835, 556807, 476142, 404111, 341214, 286548, 238728, 196780, 160026, 127870, 100090, 76744, 57311, 40506, 25342, 11880, 464, -9144, -17293, -23571, -27348, -28967, -29632, -30086, -29948, -28321, -24481, -17899, -8313, 3851, 17509, 31718, 46304, 61397]
56895F1397J5101J3835J1287Q165N172K651Q87J89L50M54j63q91n40R66K440L279
56879A24579M396O631R105J0221R842R403J0122J2015J4376J6156J5984J3045
56867B55875Q161L097j272n152q333r897r854r683j0448j1442j1476j0636r629
56854A69311q298o105l712k664l298m071l433j748p88j620l395m328l557j762
56840A20532R9K030M449O833P993P736P196P136P084O780P333R763J3167J5709
56826B23840J7016J8191J9548J9863J8161J5132J2187R999Q515P611P153O826
56814C84042O469O215O095O004O288P633R860J1615J2086J2473J4612J8300K1170
56801E22862K1681K1197K2166K4619K5601K2346J5354P807K331r17l248n535p791
$$ y = [61397, 76498, 90333, 101620, 109785, 114957, 117608, 118495, 118684, 119034, 119488, 119325, 118434, 117894, 118860, 121300, 124579, 128975, 135606, 144711, 154932, 164774, 174177, 184299, 196314, 210690, 226846, 242830, 255875, 264036, 267133, 265861, 260709, 252376, 242479, 232625, 222942, 212494, 201052, 189576, 178940, 169311, 161013, 154908, 151196, 148532, 145234, 141163, 137730, 135982, 135194, 133574, 130179, 125851, 122294, 120532, 120631, 122661, 127110, 133943, 141936, 149672, 156868, 164004, 171088, 177868, 185201, 194964, 208131, 223840, 240856, 259047, 278595, 298458, 316619, 331751, 343938, 353937, 362452, 370063, 377216, 384042, 390511, 396726, 402821, 408825, 415113, 422746, 432606, 444221, 456307, 468780, 483392, 501692, 522862, 544543, 565740, 587906, 612525, 638126, 660472, 675826, 683633, 685964, 685047, 681799, 676264, 668473]
56788F68473r641j0375r044n573j526J327L251O226J1088J6252J9922K2450K5513
56775G38343K9683L3999L7267L8480L6311K9859K0158R712J03q873j7291k3720
56763I24031k6767k7153k6827k6394k4571k0378j4814r865o378l502K7M392Q620
56750G50421J1775J3967J6050J8332J9931J9520J6522J1301M452l633j2324k0240
56738H46074k5679k7834k7459k6005k4132k1462j7908j4483j2130j0410q331o128
56726F24113m857m195k300J513N334P008O803O393N967M044o0n047r135j1671
56712F23910j3126j4352j5978j7737j8430j7370j5649j4960j5285j4980j3209
56701D52834j0896r080p751o860o942p865q204o966n078m094m280m920n677o510
$$ y = [668473, 658832, 648457, 639413, 633840, 632314, 633641, 636892, 643118, 654206, 670458, 690380, 712830, 738343, 768026, 802025, 839292, 877772, 914083, 943942, 964100, 973812, 973915, 965042, 947751, 924031, 897264, 870111, 843284, 816890, 792319, 771941, 757127, 747262, 740884, 737382, 737409, 741801, 750421, 762196, 776163, 792213, 810545, 830476, 849996, 866518, 877819, 882271, 878638, 866314, 846074, 820395, 792561, 765102, 739097, 714965, 693503, 675595, 661112, 648982, 638572, 630241, 624113, 619256, 615061, 612761, 614274, 619608, 626616, 633419, 639812, 645779, 649823, 649763, 644716, 635581, 623910, 610784, 596432, 580454, 562717, 544287, 526917, 511268, 496308, 481023, 466043, 452834, 441938, 432858, 425107, 418247, 411305, 403440, 395236, 388270, 383192, 379098, 374818, 369898, 364221, 357711]
56687C57711o907o455n736n434m996l417j161J09k48j083j222q83r14j527k276
56672C15561k795l006k891k441j746j022n30l14M9R57J932J950R96M58J231K216
56656C10605J868O17K61J189J843J164P8j01N25J018J088J083J120J034Q63P54
56640C25009O91O78Q33R31L42r88j945j309O90K434K620J517M70L73R17J296J306
56623C35865J293J219N53n67r90q7J118J378J065J353K018J766O22K11J249K452
56607C50518K554J858R54m46k266l095k042m30p5o12k03J687L721M579L949K026
56591C62677m67j991j532j76K13l03p3J030J054q01k449j835R1R13J32p87j095
56574C54601j440k014j872o69L13k03j693k538k042r41j40K38M33L70j15o77p54
$$ y = [357711, 350804, 344349, 338613, 333179, 328183, 324766, 323605, 323714, 323466, 322383, 321161, 320278, 319364, 317837, 315561, 312766, 309760, 306869, 304428, 302682, 301660, 301130, 300816, 300865, 301822, 303754, 305704, 306700, 307158, 308389, 310605, 312473, 313090, 313351, 314540, 316383, 317547, 317625, 317524, 318049, 319067, 320155, 321238, 322358, 323392, 324255, 325009, 325700, 326378, 327211, 328142, 328484, 327496, 325551, 324242, 324932, 327366, 329986, 331503, 331973, 332346, 333263, 334559, 335865, 337158, 338377, 338930, 338363, 337373, 337286, 338404, 339782, 340847, 342200, 344218, 345984, 346606, 346817, 348066, 350518, 353072, 354930, 355884, 355438, 353172, 350077, 348035, 347605, 347530, 346918, 346715, 348402, 352123, 356702, 360651, 362677, 362210, 360219, 358687, 358511, 358724, 358421, 358348, 359378, 360432, 359631, 357182, 355347, 355438, 356351, 356483, 355696, 354601, 353161, 351147, 349275, 348606, 348919, 348716, 347023, 344485, 342443, 341502, 341362, 341600, 342033, 342403, 342288, 341611, 340857]
56557C40857m85p02j680k376j639N3R56L28o06m72K61J03j093j833j198j88j71
56540C30115q32p63L13R97J78j410k116j258M93K207L378L702L010J663M82k1
56524C40138mJ54K94L59L70N98J292J986J698L01q95m99J390L474M725M943M302
56507C64626L330L065M227O064O854N907M407M024N221P218Q990R862R575Q248
56493D51618O180L600Q87j100j550p65N7K90M19P20L81j219l151l905l335k517
56477D46610k027j528j122j664l241m486m185k865j964k009k537l209m035m557
56463D07181m044k715j920k534l850m551m281l566k642j260K92R13j38k170l664
56448C71051l670k457r95j95m04j111j149K59K477L801L149J193m02p55m85p30
$$ y = [340857, 340372, 339670, 337990, 335614, 333975, 334028, 334984, 335312, 334706, 334234, 334495, 334598, 333505, 331672, 330474, 330286, 330115, 329283, 328520, 328833, 329830, 330008, 328598, 326482, 325224, 325717, 327924, 331302, 335004, 338014, 339677, 340159, 340138, 340134, 340288, 340582, 340941, 341311, 341909, 343201, 345187, 346885, 347186, 346291, 345792, 347182, 350656, 355381, 360324, 364626, 367956, 371021, 375248, 381312, 388166, 394073, 398480, 402504, 407725, 414943, 423933, 433795, 443370, 451618, 457798, 461398, 462285, 461185, 459635, 458870, 458927, 459217, 459636, 460356, 460737, 459518, 456367, 452462, 449127, 446610, 444583, 443055, 441933, 440269, 437028, 432542, 428357, 425492, 423528, 421519, 418982, 415773, 411738, 407181, 403137, 400422, 398502, 395968, 392118, 387567, 383286, 379720, 377078, 375818, 376110, 377023, 376885, 374715, 371051, 367381, 364924, 363929, 363734, 363330, 362219, 361070, 361329, 363806, 367607, 370756, 371949, 371547, 370792, 370307, 369577]
56432C69577j725k506j960j23J629J826M22j074j083M41K079K430J381j12j180
56417C70022j830k613l632m110l134q49J410K448K379K100J956J576R23O21R02
56402C68169J089O26Oq5J07qj00N56J469J334J74l46N82J445N53j367k133j021
56384C71050O84J753K144K084J507P92P34J247J216K43n85m61k57r73j790j233
56368C78155K16M77j066k431j731L41J626J250K05l34j02O38J539K041J608N07
56352C82939k67j82K64M69O90J405K194K122J076k0l85k8P66J782K451K001N36
56335C97813p59j019n76R4J271L016M168L643K151J232J030N04m41p18K4R29J620
56318D13982K609L651L482J892M28M7j77r55j305n51pp06j029R20L854M835L636
$$ y = [369577, 367852, 365346, 363386, 363263, 364892, 366718, 367140, 366066, 364983, 365424, 367503, 369933, 371314, 371202, 370022, 368192, 365579, 361947, 357837, 354703, 353854, 355264, 357712, 360091, 362191, 364147, 365723, 366646, 367267, 368169, 369258, 369884, 369890, 369805, 369912, 369904, 369804, 370360, 371829, 373163, 373337, 372991, 373573, 375018, 375571, 374204, 372071, 371050, 371734, 373487, 375631, 377715, 379222, 380014, 380748, 381995, 383211, 383454, 382869, 382408, 382151, 381178, 379388, 378155, 378371, 378848, 377782, 375351, 373620, 373961, 375587, 376837, 377042, 376708, 376606, 377244, 378783, 380824, 382432, 382939, 382672, 382490, 382754, 383223, 383913, 385318, 387512, 389634, 390710, 390690, 390305, 390277, 391043, 392825, 395276, 397277, 397813, 397054, 396035, 395459, 395553, 396824, 399840, 404008, 407651, 409802, 411034, 412064, 412568, 412127, 411409, 411433, 412362, 413982, 416591, 420242, 423724, 425616, 426044, 426091, 425914, 424959, 423654, 423103, 423096, 422390, 421361, 422281, 426135, 430970, 434606]
56301D34606K676K824K409P91p4J080K509K129O47K03J254K567L372L765L589
56286D64347K511R65j30m78l62J04Q65J504J807K254L085L338J980k73j291J86
56270D80412L297O024O843N704L990L331L901M231L198J631J106J726K222K037
56256E29653J995K823M105M968N029M415L534K987L091L403L397L381L941M629
56242E81351M337L160K586L525N254O853Q362R758J0124R161Q412R423J1218J1453
56228F84977R883Q836R875J1715J2335J1764J1525J2324J3690J5319J7239J8787
56216H38269J8960J8188J8456K0947K4470K6980K7958K8435K9312L0697L2719
56205A115391L5770L9633M3259M5859M7869N0449N4279N9090O4183O9244P4689
$$ y = [434606, 437282, 440106, 442515, 443306, 443232, 444312, 446821, 448950, 449597, 449800, 451054, 453621, 456993, 460758, 464347, 466858, 467823, 467693, 467215, 466853, 466957, 467822, 469326, 471133, 473387, 476472, 479810, 481790, 481517, 480226, 480412, 483709, 489733, 496576, 502280, 506270, 509601, 513502, 517733, 520931, 522562, 523668, 525394, 527616, 529653, 531648, 534471, 538576, 543544, 548573, 552988, 556522, 559509, 562600, 566003, 569400, 572781, 576722, 581351, 585688, 588848, 591434, 594959, 600213, 607066, 615428, 625186, 635310, 644471, 652883, 662306, 673524, 684977, 694860, 703696, 713571, 725286, 737621, 749385, 760910, 773234, 786924, 802243, 819482, 838269, 857229, 875417, 893873, 914820, 939290, 966270, 994228, 1022663, 1051975, 1082672, 1115391, 1151161, 1190794, 1234053, 1279912, 1327781, 1378230, 1432509, 1491599, 1555782, 1625026, 1699715]
56194A699715Q1100Q8236R5031J00955J06982J14520J23601J33021J42054J50841
56184B836056J58905J64658J67101J67087J65947J63505J58254J48965J35264
56175D265742J17224R5564P1948M8039K4132m10k5460m9706p1947r1892j09440
56164D273794j24066j35438j43940j50002j53327j53402j50667j46628j42622
56155B973702j38639j33597j26837j19096j11719j05084r8434r1372q4704p9171
56145A885049p4210o8888o3590n9489n6514n3147m8576m3835m0205l7517l4758
56134A304320l1593k8417k5464k2800k0811j9765j8990j7426j5047j2943j1821
56123A079243j1147j0059q530p101n977m928l842k832j880q97r8K46N67J838M267
$$ y = [1699715, 1780815, 1869051, 1964082, 2065037, 2172019, 2286539, 2410140, 2543161, 2685215, 2836056, 2994961, 3159619, 3326720, 3493807, 3659754, 3823259, 3981513, 4130478, 4265742, 4382966, 4478530, 4550478, 4598517, 4622649, 4622239, 4596779, 4547073, 4475126, 4383234, 4273794, 4149728, 4014290, 3870350, 3720348, 3567021, 3413619, 3262952, 3116324, 2973702, 2835063, 2701466, 2574629, 2455533, 2343814, 2238730, 2140296, 2048924, 1964220, 1885049, 1810839, 1741951, 1678361, 1618872, 1562358, 1509211, 1460635, 1416800, 1376595, 1339078, 1304320, 1272727, 1244310, 1218846, 1196046, 1175235, 1155470, 1136480, 1119054, 1104007, 1091064, 1079243, 1068096, 1058037, 1049507, 1042406, 1036429, 1031501, 1027659, 1024827, 1022947, 1022050, 1021952, 1022198, 1022765, 1024603, 1028870]
56108A028870O583P259O287N235N509P073Q935J0347J1271J1992J2806J4019J5906
56095A152092J8346K0629K1998K2712K4210K7587L1982L5418L7507M0253M5353
56084A478087N1830N7586O2356O7307P2138P4853P4571P2502O9447O4447N7046
56073B202170M9061M2614L7804L3796L0770K9003K7250K4044J9898J6305J3260
56062B525975R709N733K109k059q801j8303k8497l7843m6439n4013n9063o0858
56050B227650o0395n8495n4596m8466m1524l5350l0192k5844k2671k0660j8773
56039A810684j6409j4437j3556j2707j0470p135m035j521J100M100P010R466J1361
56026A763451J2544J3231J4282J6199J8242J9442K0050K1024K2435K3350K3190
$$ y = [1028870, 1035453, 1042712, 1048999, 1054234, 1059743, 1066816, 1075751, 1086098, 1097369, 1109361, 1122167, 1136186, 1152092, 1170438, 1191067, 1213065, 1235777, 1259987, 1287574, 1319556, 1354974, 1392481, 1432734, 1478087, 1529917, 1587503, 1649859, 1717166, 1789304, 1864157, 1938728, 2011230, 2080677, 2145124, 2202170, 2251231, 2293845, 2331649, 2365445, 2396215, 2425218, 2452468, 2476512, 2496410, 2512715, 2525975, 2535684, 2541417, 2543526, 2541467, 2532666, 2514363, 2485866, 2448023, 2401584, 2347571, 2288508, 2227650, 2167255, 2108760, 2054164, 2005698, 1964174, 1928824, 1898632, 1872788, 1850117, 1829457, 1810684, 1794275, 1779838, 1766282, 1753575, 1743105, 1735970, 1731935, 1730414, 1731514, 1735614, 1742624, 1752090, 1763451, 1775995, 1789226, 1803508, 1819707, 1837949, 1857391, 1877441, 1898465, 1920900, 1944250, 1967440]
56015A967440K2523K2459K3679K5793K7490K7773K7287K7661K9322L0905L1382
56004B263714L1615L2951L5266L7425L8899L9852M0356M0636M1510M3520M6110
55993B691854M8564N1112N4013N6231N6480N5236N4473N5375N7391N9427O1067
55982C301223O2590O4511O7031O9520P1022P1715P3083P6034P9643Q2705Q5574
55971D104651Q9319R3864R8383J02921J08097J13689J18971J24177J30171J36758
55961E221001J42811J48162J54094J61663J70567J79914J89400J99490K10909
55952F778011K23918K37896K52066K66668K82483K98805L13456L25859L38654
55943I317816L54821L74246L94789M15688M38147M63107M90223N18663N47614
$$ y = [1967440, 1989963, 2012422, 2036101, 2061894, 2089384, 2117157, 2144444, 2172105, 2201427, 2232332, 2263714, 2295329, 2328280, 2363546, 2400971, 2439870, 2479722, 2520078, 2560714, 2602224, 2645744, 2691854, 2740418, 2791530, 2845543, 2901774, 2958254, 3013490, 3067963, 3123338, 3180729, 3240156, 3301223, 3363813, 3428324, 3495355, 3564875, 3635897, 3707612, 3780695, 3856729, 3936372, 4019077, 4104651, 4193970, 4287834, 4386217, 4489138, 4597235, 4710924, 4829895, 4954072, 5084243, 5221001, 5363812, 5511974, 5666068, 5827731, 5998298, 6178212, 6367612, 6567102, 6778011, 7001929, 7239825, 7491891, 7758559, 8041042, 8339847, 8653303, 8979162, 9317816, 9672637, 10046883, 10441672, 10857360, 11295507, 11758614, 12248837, 12767500, 13315114]
55934A3315114N76625O06623O39680O76492P15283P54696P96187Q41510Q89388
55925A9811598R37432R86348J039542J098985J164068J234054J309498J391827
55917B8973352J483762J589286J710922J847853J998866K165825K351989K559067
55909D4680922K789139L047266L338086L661438M015681M404151M834785N316029
55901G6087497N858033O475007P179890P978463Q874888R880383J1009755J2273463
55893A45617379J3681469J5247571J6973629J8826793K0728922K2521717K3865701
55886B77463181K4156954K2647083J8814967J2752259N237906k570118r584793
55879C48917439j5096340j8844270k0931765k1677135k1461582k0621465j9411527
$$ y = [13315114, 13891739, 14498362, 15138042, 15814534, 16529817, 17284513, 18080700, 18922210, 19811598, 20749030, 21735378, 22774920, 23873905, 25037973, 26272027, 27581525, 28973352, 30457114, 32046400, 33757322, 35605175, 37604041, 39769866, 42121855, 44680922, 47470061, 50517327, 53855413, 57516851, 61532532, 65936683, 70771468, 76087497, 81945530, 88420537, 95600427, 103578890, 112453778, 122334161, 133343916, 145617379, 159298848, 174546419, 191520048, 210346841, 231075763, 253597480, 277463181, 301620135, 324267218, 343082185, 355834444, 361072350, 358502232, 348917439, 333821099, 314976829, 294045064, 272367929, 250906347, 230284882, 210873355]
55872B10873355j8016212j6565430j5141788j3791735j2540429j1397944j0359027
55865A13060790r409259q535903p731107o988397o303160n676397n112121m610123
55857E8694323m164797l770231l422130l115176k843002k601262k387471k197981
55849C4192273k028189j875354j738021j613104j496859j388620j290369j202597
55841B1559160j123395j051250r85680r25089q67145q11654p60400p13763o69970
55832A3650814o28055n89126n54361n23822m97543m75484m56034m36620m16401
55823I073368l96740l78757l62153l46380l31172l15651k98839k81277k64607
55814F097792k49412k35053k21624k10198k00975j92911j85337j78374j71710
$$ y = [210873355, 192857143, 176291713, 161149925, 147358190, 134817761, 123419817, 113060790, 103651531, 95115628, 87384521, 80396124, 74092964, 68416567, 63304446, 58694323, 54529526, 50759295, 47337165, 44221989, 41378987, 38777725, 36390254, 34192273, 32164084, 30288730, 28550709, 26937605, 25440746, 24052126, 22761757, 21559160, 20435765, 19384515, 18398835, 17473746, 16606601, 15794947, 15034547, 14320784, 13650814, 13022759, 12433633, 11879272, 11355450, 10857907, 10382423, 9926389, 9489769, 9073368, 8676628, 8297871, 7935718, 7589338, 7258166, 6942515, 6643676, 6362399, 6097792, 5848380, 5613327, 5391703, 5181505, 4980530, 4787619, 4602282, 4423908, 4252198]
55805D252198j64681j57620j51403j45534j38520j30350j22804j16985j12193
55796C012108j07507j02791r7791r1980q5778q0436p6268p2466o8857o6181o4379
55785B097674o2254n9320n6326n3546n0288m6580m3581m1679l9695l6802l3648
55774A573955l0986k8667k6721k5870k6099k6209k5528k4709k4093k2997k1446
55763A290630k0896k1939k2886k2073k0227j9096j8889j8759j8715j9274j9831
55752A068045j9160j7332j5676j4909j4418j3392j1780j0122r135r214r770r440
55740I13697p646n486m319l939l054j288K73M97n88k138l456m375m908m739l265
55725H65266m11K766M781M958L473M77l849q444j1833j3682j4865j5604j4887
$$ y = [4252198, 4087517, 3929897, 3778494, 3632960, 3494440, 3364090, 3241286, 3124301, 3012108, 2904601, 2801810, 2704019, 2612039, 2526261, 2445825, 2369557, 2297091, 2228234, 2162053, 2097674, 2035420, 1976100, 1919774, 1866228, 1815940, 1769360, 1725779, 1684100, 1644405, 1607603, 1573955, 1542969, 1514302, 1487581, 1461711, 1435612, 1409403, 1383875, 1359166, 1335073, 1312076, 1290630, 1269734, 1247795, 1224909, 1202836, 1182609, 1163513, 1144624, 1125865, 1107150, 1087876, 1068045, 1048885, 1031553, 1015877, 1000968, 986550, 973158, 961378, 951256, 942121, 932907, 923137, 913697, 906051, 900565, 896246, 892307, 889253, 887965, 888238, 888735, 888147, 886009, 882553, 878178, 873270, 868531, 865266, 864855, 867621, 872402, 877360, 880833, 881310, 877461, 869017, 857184, 843502, 828637, 813033, 798146]
55712G98146j2315r234p081n689m368l634m519o717q755r820j0422j1339j2651
55699F91602j3727j3688j2194j0177r155r335r184p586n548m790n521o794q406
55686E75497j0746j3070j3614j1744q804o379m811l781l372l776m566n046n115
55673D80673n253n787o415o590o167n599n501o070p005p770p767o586m589l053
55659C96521k982l793l948k876j394j86R94K258K905K536J739R30l91k289l525
55644C86499l246k537k785l355k650r73k97j287k495k915l457n053o757p012n857
55629C35823m825n029o210p323p327n663k701J61J344L84j578k692k018l93M98
55614B92451N8n19J24J608K197R78j114k646l335l889m579m655l310r36R98J423
$$ y = [798146, 785831, 776597, 769516, 763827, 759459, 755825, 751306, 744589, 735834, 726014, 715592, 704253, 691602, 677875, 664187, 651993, 641816, 632661, 623326, 614142, 606556, 601008, 596218, 590697, 583903, 575497, 564751, 551681, 538067, 526323, 517519, 511140, 506329, 502548, 499176, 495400, 490834, 485788, 480673, 475420, 469633, 463218, 456628, 450461, 444862, 439361, 433291, 426286, 418516, 410749, 404163, 399574, 396521, 393539, 389746, 385798, 382922, 381528, 381342, 382336, 384594, 387499, 390035, 391774, 392704, 392313, 390024, 386499, 383253, 380716, 377931, 374576, 371926, 370953, 370656, 369369, 366874, 363959, 360502, 355449, 348692, 341680, 335823, 330998, 325969, 319759, 312436, 305109, 299446, 296745, 296906, 298250, 298634, 297056, 294364, 292346, 291953, 292451, 292509, 291990, 292114, 293722, 295919, 296897, 295783, 293137, 289802, 285913, 281334, 276679, 273369, 272433, 273431, 274854]
55598B74854O48l57j243k181k739j955J37K030K463J803J190Q86M05l29p83n62
55582B74267K64J252J610P06r31j876j717j720k769l766l427k583k881l962m127
55567B48340l404l548m833n270l845k287k375l280l162k064j400j492j338n31
55553B09511J74J53l55q89j288j489j521j771k666m002m999n134m565l776l048
55538A74335k288j360n74o66j786k656j659R76K891K239j40j911k060j453r54
55523A62934l15P17J368P18q56j939j731p93p9J87L85P39J202J858K782L512L317
55506A74006K193J001L49m9o05j164j550k001k472k283j428j359l120n269n251
55491A50998k863p61j155l343n013m886l476k101j699j992j606K35K236K403R35
$$ y = [274854, 275502, 275145, 273902, 271721, 268982, 267027, 267164, 269194, 271657, 273460, 274650, 275536, 275941, 275612, 274829, 274267, 274531, 275783, 277393, 278099, 277168, 275292, 273575, 271855, 269086, 265320, 261893, 259310, 256429, 252467, 248340, 244936, 241388, 236555, 231285, 227440, 225153, 222778, 219498, 216336, 214272, 212872, 211380, 210042, 209511, 209685, 209838, 209483, 208594, 207306, 205817, 204296, 202525, 199859, 195857, 190858, 185724, 181159, 177383, 174335, 172047, 170687, 170113, 169447, 167661, 165005, 163346, 164322, 167213, 169452, 169312, 167401, 165341, 163888, 162934, 162619, 163336, 164704, 165422, 164566, 162627, 160896, 160103, 160024, 160211, 160596, 161335, 162537, 164395, 167177, 170689, 174006, 176199, 177200, 177549, 177500, 176895, 175731, 174181, 172180, 169708, 167425, 165997, 164638, 161518, 156249, 150998, 148135, 147374, 146219, 142876, 137863, 132977, 129501, 127400, 125701, 123709, 122103, 122338, 124574, 126977, 127912]
55476A27912J98J397K927K867J580N29j50j225k358k321r68L53L56j072l109m409
55460A22507l757j361Q11J013k33j011n72J47K94N2l18j010j897k265j788j033
55444A09579n97l66l9K08j2p07j450j695j122j3P53N27k71n57K48J698K779K579
55426A11542Q94j299k366j687l89K70N96J456K206J299j015k381j350P61J750
55411A10287J113j27j067j351p95L20J038P66M0m48r70j969k818k670j960j695
55395I7694j470J31K957M692L594O62j791k733k672k184j452q99j053j630j699
55380I2147r00J87J037J777K520K731J891L78q17j097o64m7L76M80L66K76L85
55363A01026O41Q22P03J61o39j189j085o18m64p79j046j042j174j488j164K28
$$ y = [127912, 128110, 129507, 132434, 135301, 136881, 137410, 137260, 136035, 133677, 131356, 130388, 130741, 131097, 130025, 126916, 122507, 118750, 117389, 118200, 119213, 118980, 117969, 117397, 117544, 117838, 117890, 117572, 116562, 114665, 112400, 110612, 109579, 108982, 108616, 108577, 108785, 108773, 108066, 106616, 104921, 103799, 103786, 104539, 105066, 104795, 104238, 104486, 106184, 108963, 111542, 112436, 111137, 108771, 107084, 106695, 106965, 107561, 109017, 111223, 112522, 111507, 109126, 107776, 108537, 110287, 111400, 111273, 110206, 108855, 108060, 108380, 109418, 110184, 110224, 109776, 108806, 106837, 104019, 101349, 99389, 97694, 96224, 96355, 99312, 104004, 107598, 108260, 106469, 103736, 101064, 98880, 97428, 96529, 95476, 93846, 92147, 91247, 91434, 92471, 94248, 96768, 99499, 101390, 101768, 100951, 99854, 99190, 99143, 99519, 99999, 100365, 100641, 101026, 101667, 102489, 103192, 103353, 102714, 101525, 100440, 99822, 99358, 98579, 97533, 96491, 95317, 93829, 92665, 92893]
55347I2893J696J969J214M80r8j162k322k186n75Q15O49l77r50j045j276j338
55331H8387m57J080K182K460K430K371K033J390O98j66j452k614k564j169L32
55316I4941P65L01m4L03J007J343R20L3o46p02k17N63J410J730Q64p92j720j154
55298I8905l13o74j625j348K88J381P99k55j25J200K535K993K274M41j587k268
55282A02621j094N65J198R73Q77P54l93k479m109m365l703k815j665q4J417K070
55266H9768J712Q34N7k33j9K84J17p01j845k795l095k406q11R25J875J922J816
55249H7405K084K338J986J193O83P77J138J379J409J179N04n29j371j434o67M84
55233I8558J478J915J635Q63J28k45m68q49j228j325j336j595j731j058J23N87
$$ y = [92893, 94589, 96558, 97772, 98252, 98154, 96992, 94670, 92484, 91909, 92724, 93373, 92996, 92046, 91001, 89725, 88387, 87930, 89010, 91192, 93652, 96082, 98453, 100486, 101876, 102574, 102408, 100956, 98342, 95778, 94609, 94941, 95706, 96007, 95963, 96266, 97273, 98616, 99536, 99569, 98923, 98221, 98004, 98567, 99977, 101707, 102571, 101779, 100059, 98905, 98592, 97918, 96293, 94945, 95233, 96614, 97413, 97158, 97033, 98233, 100768, 103761, 106035, 106476, 104889, 102621, 101527, 102092, 103290, 104263, 105140, 105894, 105501, 103022, 98913, 94548, 90845, 88030, 86365, 86281, 87698, 89768, 91480, 92314, 92371, 92138, 92119, 92403, 92520, 91819, 89974, 87179, 84084, 81678, 80867, 81792, 83667, 85589, 87405, 89489, 91827, 93813, 95006, 95689, 96466, 97604, 98983, 100392, 101571, 102075, 101546, 100175, 98741, 98074, 98558, 100036, 101951, 103586, 104449, 104577, 104332, 103864, 103015, 101787, 100462, 99126, 97531, 95800, 94742, 94865, 95452]
55217I5452K8k87N55J469Q76p69j421k76J359K164K294K396K426K208K046J964
55201A12484J232l89j842k145j811j837j927j113L85J326J359J305J463J153K70
55186A09913j41M04Q12L7j277j857j727j850k320k130q00Q26J619J283L82j50
55170A03024M28J839K545J262j133k221j050N28L38j223j918q51N37O09n10j554
55154A00650j667q22N38J639J700Q31J50M44J121J083K29p06j468k358l063k529
55138I5772n32J528K073J231N58J062K048K082Q18m25j25J438K178O94j716k488
55122A06196j079M05K02q12p96K55Q12M16K08R08J724J763J235O14k19j175j317
55105A09340k25P67K9j940k928j872Q1J522K395K950K529O57j424j842o20K60
$$ y = [95452, 95480, 95193, 95748, 97217, 98093, 97324, 95903, 95627, 96986, 99150, 101444, 103840, 106266, 108474, 110520, 112484, 113716, 113327, 111485, 109340, 107529, 105692, 103765, 102652, 103037, 104363, 105722, 107027, 108490, 109643, 109913, 109772, 110176, 110988, 111025, 109748, 107891, 106164, 104314, 101994, 99864, 99064, 99890, 101509, 102792, 103174, 103024, 103452, 105291, 107836, 109098, 107965, 105744, 104694, 105222, 105560, 104337, 102419, 101568, 102105, 102714, 102204, 100650, 98983, 98161, 98699, 100338, 102038, 102869, 103019, 103463, 104584, 105667, 105896, 105190, 103722, 101364, 98301, 95772, 95240, 96768, 98841, 100072, 100630, 101692, 103740, 105822, 106640, 106215, 106090, 107528, 109706, 110400, 108684, 106196, 105117, 105522, 105724, 104912, 104116, 104371, 105183, 105599, 105807, 106715, 108439, 110202, 111437, 112051, 111832, 110657, 109340, 109115, 109882, 109911, 107971, 105043, 103171, 103252, 104774, 107169, 110119, 112648, 113305, 111881, 110039, 109419, 109679]
55089A09679m41j596j437K1J071N40r19j723j048N33J826K153J637N79r66k628
55073A07281l231j840P26K374K154J353J532K383K538J817J252J123M96r58k021
55058A16979j626m76j8n02j093j401j747j998j315M84K142K165M61j594k509j835
55042A06117k71J008J339J147J450K465L040J936m40k221k142q21L12P32R30J233
55026A15814J394J279J198J343J484J405J174P81J06n00k65R39K142K393J905
55011A32592J458J204Q59O51J032J564J230j0r08o33O8l5j104k436l591m459m443
54994A23039k723L68K980L472K183Q57L70j30j501k895k708q94Q91J478J335J151
54978A27273O84j68m43L64Q41n09k572k757p82P92K50j005q84L86J119Q85O86
$$ y = [109679, 109238, 107642, 106205, 106226, 107297, 107837, 106918, 105195, 104147, 104680, 106506, 108659, 110296, 110875, 109909, 107281, 104050, 102210, 102936, 105310, 107464, 108817, 110349, 112732, 115270, 117087, 118339, 119462, 119958, 119000, 116979, 115353, 114877, 114859, 114357, 113264, 111863, 110116, 108118, 106803, 107287, 109429, 111594, 112055, 110461, 107952, 106117, 105846, 106854, 108193, 109340, 110790, 113255, 116295, 118231, 117791, 115570, 113428, 112607, 112919, 113651, 114581, 115814, 117208, 118487, 119685, 121028, 122512, 123917, 125091, 125872, 125978, 125478, 125213, 126152, 128294, 130687, 132592, 134050, 135254, 136113, 136764, 137796, 139360, 140590, 140580, 139672, 139039, 139107, 139072, 137968, 135532, 131941, 127482, 123039, 120316, 120684, 123664, 127136, 129319, 130176, 130546, 130416, 128915, 126020, 123312, 122418, 123309, 124787, 126122, 127273, 127957, 127789, 127346, 127710, 128551, 128042, 125470, 122713, 121931, 122723, 122973, 121968, 121084, 121470, 122589, 123474, 124160]
54961A24160J037J275P64l32j489k251k246j434k38Q81J846K568K643J965J205
54946A30354J014J129R00L53l7k73p32j267j220l68P04J203P93j40n91K53J883
54929A33958K630J613k6o20j37O9o78j773k502k685k127o21J226K259K151J693
54913A34430J466J092J54j020j882k241j921o61J173K478K561J890J225O54o4
54898A39334p11q12k90N68J422J836J359J14j089j628j623j312m83Q68K001K242
54882A41796J923J628J029n45k510l247k084j24J271J896K105J722M93q64j123
54867A43366r0J090J362Q20J58k49k13O81K599M693N559M634K688R36J35N36J967
54850A70672L686M761N069N394O108O322N024K574K85j215k364l511m278m300
$$ y = [124160, 125197, 126472, 127236, 126904, 125415, 123164, 120918, 119484, 119246, 120127, 121973, 124541, 127184, 129149, 130354, 131368, 132497, 133397, 133750, 133713, 133440, 132708, 131441, 130221, 129853, 130557, 131760, 132553, 132413, 131822, 132075, 133958, 136588, 138201, 138175, 137555, 137418, 137487, 136809, 135036, 132534, 129849, 127722, 127101, 128327, 130586, 132737, 134430, 135896, 136988, 137142, 136122, 134240, 131999, 130078, 129417, 130590, 133068, 135629, 137519, 138744, 139398, 139334, 138623, 137811, 137521, 138089, 139511, 141347, 142706, 142820, 141731, 140103, 138480, 137168, 136685, 137553, 139554, 141796, 143719, 145347, 146376, 145831, 143321, 140074, 137990, 137866, 139137, 141033, 143138, 144860, 145353, 144489, 143366, 143276, 144366, 145728, 146548, 146706, 146457, 146244, 146925, 149524, 154217, 159776, 164410, 167098, 168034, 168169, 168705, 170672, 174358, 179119, 184188, 189582, 195690, 202012, 207036, 209610, 209895, 208680, 206316, 202805, 198527, 194227]
54836A94227l894l655l774l932l599k464r29r7p55k292l184k625j326n73q20j277
54820A59031p32J055K674K304J30j294%K626L438J567p20j165K02K280M513O368
54804A82277O815N742M706M889N159L677O88j809k749k815k784k660k495k749
54790A95892l527m391n048n329m644k665n26k3j219k114j208P14J907J710M88
54775A70017j412l658n448o102n799m968l329m71K741M384L414Q51j308k097k163
54760A44652k500l007k711j357j30j55q03m67J011J915J074l83n13R85K705L390
54744A43706K862J561J36o94p54p33j132j221o7J700K445J807J084J090J144P27
54728A53661O25J381J855P96j021j737j036k82j81Q2J132K261K554K085J401P16
$$ y = [194227, 190333, 186678, 182904, 178972, 175373, 172909, 171980, 171883, 171128, 168836, 165652, 163027, 161701, 161128, 160308, 159031, 158299, 159354, 162028, 164332, 164462, 163168, 163168, 165794, 169232, 170799, 170079, 168914, 169116, 171396, 175909, 182277, 189092, 194834, 199540, 204429, 209588, 213265, 213953, 212144, 209395, 206580, 203796, 201136, 198641, 195892, 192365, 187974, 182926, 177597, 172953, 170288, 169762, 169739, 168520, 166406, 165198, 165912, 167819, 169529, 170017, 168605, 164947, 159499, 153397, 147598, 142630, 139301, 138830, 141571, 145955, 149369, 150220, 148912, 146815, 144652, 142152, 139145, 136434, 135077, 134947, 134792, 133989, 133522, 134533, 136448, 137522, 137139, 136626, 137611, 140316, 143706, 146568, 148129, 148265, 147571, 146817, 146084, 144952, 143731, 143664, 145364, 147809, 149616, 150700, 151790, 152934, 153661, 154286, 155667, 157522, 158318, 157297, 155560, 154524, 154242, 154061, 154143, 155275, 157536, 160090, 162175, 163576, 164292]
54712A64292K63N87J695K514K048O63m36o39j39Q32K124L216L494L090K771K981
54696A89356L433L733L816L788L704L620L398K601J054o01j530j818k225k847
54682B09482k946k318j890k377l196l440l310l583m143m076l136k112j538j026
54668A70391j88N42O00K78L56R65J437J227N57O4J62R08K154L575M585M598L567
54651A95778K259J702K150K807K876K688L131L838K875q82n553p724o190l257
54637A96498j809k166k615k208j683j921k726l366l356k447q23M29m6k177m074
54622A65510l954j973K98J539J353Kj666k465k000j240j331k104k508k159j545
54607A45757r45j68N94O14l82j682k260j579J97K149K892J727m16j781j617o09
$$ y = [164292, 164555, 165142, 166837, 169351, 171399, 172062, 171626, 170987, 170848, 171680, 173804, 177020, 180514, 183604, 186375, 189356, 192789, 196522, 200338, 204126, 207830, 211450, 214848, 217449, 218503, 217902, 216372, 214554, 212329, 209482, 206536, 204218, 202328, 199951, 196755, 193315, 190005, 186422, 182279, 178203, 175067, 172955, 171417, 170391, 170203, 170745, 171345, 171623, 171979, 172944, 174381, 175608, 176165, 176229, 176391, 177299, 179453, 183028, 187613, 192211, 195778, 198037, 199739, 201889, 204696, 207572, 210260, 213391, 217229, 220104, 219222, 213669, 205945, 199755, 196498, 194689, 192523, 189908, 187700, 186017, 184096, 181370, 178004, 174648, 172201, 171378, 171807, 171761, 169584, 165510, 161556, 159583, 159881, 161420, 162773, 162775, 161109, 158644, 156644, 155404, 154073, 151969, 149461, 147302, 145757, 144812, 144644, 145238, 145852, 145470, 143788, 141528, 139949, 140146, 142295, 145187, 146914, 146498, 144717, 143100, 142491]
54591A42491L35Q94R79N78J47K92Q38R52M77K14O87J394J632J250L11j078k252
54574A50141k273j244m59p15j318j299p22j12N31J335J945K015J660Q77n26j897
54558A47939j756J19J776J427k30j323j504j668j755p47J300K905L082K212R87
54543A52764k34r67p34J23P86J120J440J428O66oO32J977K143R55L84J347K106
54526A65930J021r35j953k158k808l717l405j394J183L061L610K520R8k218k962
54511A55873k316j651j523j326q81q79j317r76P33K385K036m31l189m301l034
54496A39203J29L758N948N550L277J043j5l58p65j055n94M59J285J584J784K058
54480A63291J965J337P16M40pj061j992j620J18K018K902K440Q89j113k505k396
$$ y = [142491, 142826, 143720, 144699, 145277, 145424, 145716, 146554, 147506, 147983, 148197, 148884, 150278, 151910, 153160, 153471, 152393, 150141, 147868, 146624, 146165, 145450, 144132, 142833, 142111, 141999, 142530, 143865, 145810, 147825, 149485, 150362, 149836, 147939, 146183, 146302, 148078, 149505, 149275, 147952, 146448, 144780, 143025, 142278, 143578, 146483, 149565, 151777, 152764, 152530, 151563, 150829, 150952, 151738, 152858, 154298, 155726, 156392, 156386, 157018, 158995, 161138, 162093, 162477, 163824, 165930, 166951, 166016, 164063, 161905, 159097, 155380, 151975, 150581, 151764, 154825, 158435, 160955, 161053, 158835, 155873, 153557, 151906, 150383, 149057, 148176, 147297, 145980, 145004, 145737, 148122, 150158, 149727, 146538, 142237, 139203, 139332, 143090, 149038, 154588, 157865, 158908, 158893, 158535, 157770, 156715, 156121, 156580, 157865, 159449, 161233, 163291, 165256, 166593, 167309, 167749, 167742, 166681, 164689, 163069, 163187, 165205, 168107, 170547, 171436, 170323, 167818, 165422]
54464A65422j106L0P7o50j271j287o84L46J347J682J001m58k010k887k616j497
54448A55439n24l09l50N9N71L57k91j16J108K050J690O70J31K36M71O03O05L55
54430A62755J01M59J345J721J136N41O93Q60K45k55P19K702L981M121M206M574
54414A89904M142K339J92j187j958k650k993k468j309k61J84j40j172k231k198
54399A78194p15J187K149J830Q18k32q71q65m78m21q87j036j45J036J052j53r55
54382A79508l00O32j09k480m162l266m80J972K875K660J926O08j037j862j118
54367A75367L79J299J538J854K224J892J071J096K406L559L077J313m13j730l114
54352A91818m275m008j879R49K947L633L434K880K397K406K811K728J433m31j409
$$ y = [165422, 164316, 164346, 164423, 163773, 162502, 161215, 160531, 160877, 162224, 163906, 164907, 164449, 162439, 159552, 156936, 155439, 154915, 154606, 154256, 154315, 154886, 155243, 154952, 154836, 155944, 157994, 159684, 160354, 160485, 160721, 161192, 161795, 162400, 162755, 162856, 163315, 164660, 166381, 167517, 168058, 168751, 169611, 169856, 169601, 170320, 173022, 177003, 181124, 185330, 189904, 194046, 196385, 196577, 195390, 193432, 190782, 187789, 185321, 184012, 183751, 183935, 183795, 182623, 180392, 178194, 177479, 178666, 180815, 182645, 183463, 183231, 182360, 181495, 181017, 180596, 179709, 178673, 178528, 179564, 180616, 180463, 179508, 179208, 179840, 179731, 177251, 173089, 169823, 169343, 171315, 174190, 176850, 178776, 179384, 178347, 176485, 175367, 175746, 177045, 178583, 180437, 182661, 184553, 185624, 186720, 189126, 192685, 195762, 197075, 196662, 194932, 191818, 187543, 183535, 181656, 182605, 185552, 189185, 192619, 195499, 197896, 200302, 203113, 205841, 207274, 206843, 205434]
54337B05434j068m44k36L39J938L253K307m64k285j568J36O47M0k90j96n20j004
54320B06019n88L75L30q49j387m31O01M92K58J235K569K463R85j22k5O13J315
54303B13853K364L560L873K878J320M4p58r31k10J036J904K235K747L498L492
54288B40905K431J591J826J888J36k734m360l847k663k294k480k287j629r99n21
54273B24963j08lm43j212j987k739l272l024j938j000j065j570j348m22J38K9
54257B04999J77J099J892J487R2j195j615j077R2J060P78q34k372k376j041K02
54241B01368N15K32n7j40N9M42M27m74j667j904r22K13O33O24N86Q7j165k187
54223A96670j697oJ185R69K96M59J276J417K81j228j891j584j078p84l61L47P92
$$ y = [205434, 204366, 203922, 203686, 204025, 205963, 209216, 211523, 211059, 208774, 207206, 207342, 207989, 208029, 207739, 207543, 207023, 206019, 205431, 205806, 206136, 205287, 203900, 203469, 204070, 204562, 204820, 206055, 208624, 211087, 212072, 211950, 211925, 212538, 213853, 216217, 219777, 223650, 226528, 227848, 227892, 227134, 226203, 225993, 227029, 228933, 231168, 233915, 237413, 240905, 243336, 244927, 246753, 248641, 248777, 246043, 241683, 237836, 235173, 232879, 230399, 228112, 226483, 225484, 224963, 224855, 224852, 224409, 223197, 221210, 218471, 215199, 212175, 210237, 209237, 208172, 206602, 205254, 204832, 204970, 204999, 205176, 206275, 208167, 209654, 209746, 208551, 206936, 205859, 205951, 207011, 207789, 206955, 204583, 202207, 201166, 201368, 201883, 202115, 202058, 201918, 201977, 202419, 202846, 202372, 200705, 198801, 197879, 198092, 198725, 199349, 199935, 200022, 198857, 196670, 194973, 194967, 196152, 197121, 197417, 197876, 199152, 200569, 200850, 199622, 197731, 196147, 195069, 194285, 193924, 194271, 195063]
54206A95063O21N49J557L403M623M082K005m61k166k533j924j413j543j443K9
54191B00449K292L304K067j71j625j775j047J46J280J702J624K126L267L365J415
54176B18419r58j665j369k317m463n167l161n13L18n10j299j474j588j728j339
54161A91186l20Q00J475J247j20j825k062r5K220K288O9j812j365O19K058K171
54145A96534J637J029J85q91j463q88M29J400J490J178J001O98j95j224j296j92
54129A99432R80J246R63R35Q82j82k183l591l164j428j4J49m69q30l92O03J520
54112A94457J805J380P50O26J183J798J759J159O67L96l61j807k713j695P24K281
54096B02409J414j019k806k557p10J181J824J260O84R98J677J585O61j23l83o55
$$ y = [195063, 195684, 196233, 197790, 201193, 205816, 209898, 211903, 211442, 209276, 206743, 204819, 203406, 201863, 200420, 200449, 202741, 206045, 208112, 207941, 206316, 204541, 203494, 203640, 204920, 206622, 208246, 210372, 213639, 217004, 218419, 217461, 215796, 214427, 212110, 207647, 202480, 199319, 198806, 199124, 198614, 197315, 195841, 194253, 192525, 191186, 190866, 191666, 193141, 194388, 194268, 192443, 190381, 190286, 192506, 194794, 194863, 193051, 191686, 192305, 194363, 196534, 198171, 199200, 199385, 198494, 197031, 196143, 196572, 197972, 199462, 200640, 201641, 202339, 202144, 200920, 199624, 199432, 200412, 201658, 202621, 203556, 204438, 204256, 202073, 198482, 195318, 193890, 193876, 194025, 193556, 192726, 192334, 192937, 194457, 196262, 197642, 198392, 199018, 200201, 201999, 203758, 204917, 205584, 205980, 205619, 203812, 201099, 199404, 200128, 202409, 203823, 202804, 199998, 197441, 196731, 197912, 199736, 200996, 201680, 202678, 204355, 205940, 206601, 206478, 206095, 205440]
54080B05440r81n43O73J299N20n26m55L90R24J233J890K225J114r11k174k255
54064B07863k088j865q51N88R53J54K7J399K610K179J240J638K966L319K235J087
54048B23454Q48J030Q05m0j219k177k262j450o53n86o54J52J562K221J431m2r53
54031B21467p27J78O24j38j341j254N39K303K495J927K212K993K567Q03o00p76
54015B33272n21j96J126L546N246M748K931J637J359J502J843K420K749K462K313
54000B66437L347N397P359Q497Q608P474N253K978J508L41j419l262l768k725
53986C06025j271J7J655L498M233L399K508K899L627K983J449J321L421N737O052
53971C47553M688L689L977M501M088K986K164J789J219J60r41j713k419l281l765
$$ y = [205440, 204459, 203916, 204589, 205888, 206408, 205882, 205427, 205817, 206741, 207974, 209864, 212089, 213203, 212292, 210118, 207863, 205775, 203910, 203059, 203647, 204600, 204754, 204781, 206180, 208790, 210969, 212209, 213847, 216813, 220132, 222367, 223454, 224302, 225332, 226137, 226097, 224878, 222701, 220439, 218989, 218336, 217750, 217096, 217248, 218810, 221031, 222462, 222420, 221467, 220740, 220918, 221542, 221404, 220063, 218809, 219348, 221651, 224146, 226073, 228285, 231278, 233845, 234648, 234048, 233272, 232751, 232555, 233681, 237227, 242473, 247221, 250152, 251789, 253148, 254650, 256493, 258913, 261662, 264124, 266437, 269784, 275181, 282540, 291037, 299645, 307119, 312372, 315350, 316858, 317199, 315780, 312518, 308750, 306025, 304754, 304771, 306426, 309924, 314157, 317556, 320064, 322963, 326590, 329573, 331022, 332343, 335764, 341501, 347553, 352241, 355930, 359907, 364408, 368496, 371482, 373646, 375435, 376654, 376814, 375873, 374160, 371741, 368460, 364695]
53956C64695l089j398J23M16m26j470k046k316k773l473l969l976l836m081m667
53941C27714m867m119k783j928k288l418l994l152j537o80j220k160k199j305
53927B92064l80J67O03Q56M06o55j468j658j717j768j060M92J412N19j031r86
53911B85796J022L049L382K306J097M41L73Q64J763K525K601K034J519J898L342
53896C14012M803M695K676L00q13r69j471k105j265J227L182K820J146M36J359
53881C30033K927M486O233Q092R406R867R734R206Q405P802P689P381O107M647
53867D32015M700O378P792P784P682R201J1737J3242J3266J3478J5101J7145J7572
53854E77093J5391J1212O550K881P49o85k619m996o578o943p341q792j0197r692
$$ y = [364695, 361606, 360208, 360331, 360747, 360321, 358851, 356805, 354489, 351716, 348243, 344274, 340298, 336462, 332381, 327714, 322847, 318728, 315945, 314017, 311729, 308311, 304317, 301165, 299628, 298948, 297728, 295568, 293369, 292064, 291684, 291851, 292454, 293310, 293716, 293061, 291593, 289935, 288218, 286450, 285390, 285882, 287294, 287813, 286782, 285796, 286818, 289867, 293249, 295555, 296652, 297093, 297466, 298330, 300093, 302618, 305219, 307253, 308772, 310670, 314012, 318815, 323510, 326186, 326486, 325673, 324704, 323233, 321128, 319863, 321090, 324272, 327092, 328238, 328674, 330033, 332960, 337446, 343679, 351771, 361177, 371044, 380778, 389984, 398389, 406191, 413880, 421261, 427368, 432015, 436715, 443093, 450885, 458669, 466351, 475552, 487289, 500531, 513797, 527275, 542376, 559521, 577093, 592484, 603696, 610246, 613127, 613876, 613191, 610572, 605576, 598998, 592055, 584714, 575922, 565725, 556033]
53840E56033p433n632n703o663o918o503o700q063r741j0578j0158q881p538o878
53826D48644p156p879q160p404n830m500m636o402q359q737p429o005n539n360
53812C55248m550l601l508l887l439k016r03r00j485j965k340k582k321j766j886
53797C18099k883l479k618j060l35p11j253j354j129o25J48N29k97j991l254l421
53781B94366k938k109n89J364K377J636L81N53K263L661L230J319p56k226l034
53766B99498l148k447j117K68J177J437J241R96J081J560K172K752L396M057M206
53751C17129L452K434K489M065N938O470N552M623M760N235M542K581J075J491
53737C71836L027L531K334J181J740L145L155J390j74k9J014J477J282J074N93
$$ y = [556033, 548600, 542968, 537265, 530602, 523684, 517181, 510481, 502418, 492677, 482099, 471941, 463060, 455522, 448644, 441488, 433609, 425449, 418045, 412215, 407715, 403079, 396677, 388318, 379581, 372152, 366147, 360608, 355248, 350698, 347097, 343589, 339702, 336263, 334247, 333344, 332444, 330959, 328994, 326654, 324072, 321751, 319985, 318099, 315216, 311737, 309119, 308059, 307724, 307013, 305760, 304406, 303277, 302652, 302800, 303329, 303032, 301041, 297787, 294366, 291428, 289319, 288730, 290094, 292471, 294107, 294488, 295041, 297304, 300965, 304195, 305514, 304758, 302532, 299498, 296350, 293903, 292786, 293054, 294231, 295668, 296909, 297905, 298986, 300546, 302718, 305470, 308866, 312923, 317129, 320581, 323015, 325504, 329569, 335507, 341977, 347529, 352152, 356912, 362147, 366689, 369270, 370345, 371836, 374863, 378394, 380728, 381909, 383649, 386794, 389949, 391339, 391165, 391136, 392150, 393627, 394909, 395983, 396576]
53722C96576o92k058k293j730j774k447k296j202j243l701o670p369n782m353
53708C52966m549n397n496m776l829k747j480o08p20j338j310l73L21l15j735
53693C18614k313j481n80j086k511k947j612J25N75l00j236j317n91M97J487J885
53677C07209J543J055J218J987K391J652K00n76L55K522M158L920K431J597K290
53662C33952L391L502K857K854M101N742O497N806M148K741K638L615M336M104
53648C90284L851M641N805N778M419L194K984L084K634J819J223R20R09J535K804
53633D35884L887L995L339K687K409K357K270J829Q12m09r72n95j16m02j205j682
53617D54088j679j812k411l075l246k777j906j022m84l71m73o76j042j336r10
$$ y = [396576, 395884, 393826, 391533, 389803, 388029, 385582, 383286, 382084, 380841, 377140, 370470, 363101, 357319, 352966, 348417, 343020, 337524, 332748, 328919, 326172, 324692, 324084, 323364, 322026, 320716, 320343, 320664, 320349, 318614, 316301, 314820, 314240, 313154, 310643, 307696, 306084, 306209, 306784, 306484, 305248, 303931, 303340, 303837, 305324, 307209, 308752, 309807, 311025, 313012, 315403, 317055, 317255, 316679, 317034, 319556, 323714, 327634, 330065, 331662, 333952, 337343, 340845, 343702, 346556, 350657, 356399, 362896, 368702, 372850, 375591, 378229, 381844, 386180, 390284, 394135, 398776, 404581, 410359, 414778, 417972, 420956, 424040, 426674, 428493, 429716, 430636, 431545, 433080, 435884, 439771, 443766, 447105, 449792, 452201, 454558, 456828, 458657, 459469, 459060, 458088, 457493, 457377, 456975, 455770, 454088, 452409, 450597, 448186, 445111, 441865, 439088, 437182, 436160, 435676, 435305, 434832, 434156, 433114, 431778, 430868]
53602D30868M05J624J480l3j511j635m08J103J941J964J718J765K078K050J237
53587D44646j0p86m87P17K155L236L829M183M465M368L465K049J178J502K342
53572D76852K502J914J884L454N975P734P803O903O356O595O985O965O798O932
53558E55652P072O539N452M906N663P181Q310Q642Q741R214R899R908Q395N462
53544F61036K401O68M05L83l76j419j763j324p45k56L10N61k35j835k949k902
53528F51960k475k573k893k688k091j789j835j830j966k751l679l494k109j133
53514F18654j731k918k938j660m74j92l29m08o01o92K62K433M413M817M033L363
53498F26032L151K957L130M496O554P507O687N513N328N561N123M595N566Q272
$$ y = [430868, 431273, 432897, 434377, 434344, 432833, 431198, 430790, 431893, 433834, 435798, 437516, 439281, 441359, 443409, 444646, 444636, 443850, 443363, 444080, 446235, 449471, 453300, 457483, 461948, 466316, 469781, 471830, 473008, 474510, 476852, 479354, 481268, 483152, 486606, 492581, 500315, 508118, 515021, 521377, 527972, 534957, 541922, 548720, 555652, 562724, 569263, 574715, 579621, 585284, 592465, 600775, 609417, 618158, 627372, 637271, 647179, 655574, 661036, 663437, 664105, 664510, 664893, 664517, 663098, 661335, 660011, 659266, 659010, 659320, 659881, 659646, 657811, 654862, 651960, 649485, 646912, 644019, 641331, 639240, 637451, 635616, 633786, 631820, 629069, 625390, 621896, 619787, 618654, 616923, 614005, 611067, 609407, 608933, 608741, 608412, 608004, 607403, 606711, 606973, 609406, 613819, 618636, 622669, 626032, 629183, 632140, 635270, 639766, 646320, 653827, 660514, 666027, 671355, 676916, 682039, 686634, 692200, 700472]
53484G00472J1271J3291J4213J4206J3244J1810J1050J1650J3208J4977J6529
53473H45921J7472J7527J7336J8252K0530K2554K2848K2214K2714K4956K7613
53462A079937K9379L0139L0200K9849L0069L2156L5727L8288L8039L6314L6003
53451A446100L8004M0583M1855M1532M0232L8631L7647L8023L9059L8835L6623
53440A877124L4166L3676L5230L7032L7662L7002L5483L3565L1900L0956L0351
53429B254147K9312K7745K6250K5193K4541K4391K4738K4840K3732K1418J8616
53418B524923J5345J1027O131K391O46m68k860o790j1119j4944j8087k0449k1917
53405B463829k2800k3617k4633k5916k7582k9446l0802l1181l0983l0938l1238
$$ y = [700472, 711743, 725034, 739247, 753453, 766697, 778507, 789557, 801207, 814415, 829392, 845921, 863393, 880920, 898256, 916508, 937038, 959592, 982440, 1004654, 1027368, 1052324, 1079937, 1109316, 1139455, 1169655, 1199504, 1229573, 1261729, 1297456, 1335744, 1373783, 1410097, 1446100, 1484104, 1524687, 1566542, 1608074, 1648306, 1686937, 1724584, 1762607, 1801666, 1840501, 1877124, 1911290, 1944966, 1980196, 2017228, 2054890, 2091892, 2127375, 2160940, 2192840, 2223796, 2254147, 2283459, 2311204, 2337454, 2362647, 2387188, 2411579, 2436317, 2461157, 2484889, 2506307, 2524923, 2540268, 2551295, 2557426, 2559817, 2560463, 2559995, 2557135, 2550345, 2539226, 2524282, 2506195, 2485746, 2463829, 2441029, 2417412, 2392779, 2366863, 2339281, 2309835, 2279033, 2247852, 2216869, 2185931, 2154693]
53394B154693l1616l1792l1325k9639k6879k4253k2723k1805k0475j8669j6904
53383A878613j4878j1816q017m699k231K08K934N049N961O442P532R233J1072
53370A885403J3081J5376J7449J8866K0300K2837K6383K9602L1571L2870L4837
53359B148575L8086M1974M5281M7358M8672N0220N2423N4810N6910N9042O1910
53348B705261O5646O9637P3157P5870P7873P9684Q2002Q5005Q7836Q9283Q9160
53337C580414Q8638Q8898Q9760Q9958Q8616Q6017Q2977Q0004P7237P4785P2590
53326D499894P0161O6890O2605N7454N1304M3863L5491K7299K0086J3619P168
53315D955834K79p322j5949k5488l5036m3794n1978o0205o8148p4623p9027q2003
$$ y = [2154693, 2123077, 2091285, 2059960, 2030321, 2003442, 1979189, 1956466, 1934661, 1914186, 1895517, 1878613, 1863735, 1851919, 1843902, 1839203, 1836972, 1837180, 1840114, 1845163, 1851124, 1857566, 1865098, 1874331, 1885403, 1898484, 1913860, 1931309, 1950175, 1970475, 1993312, 2019695, 2049297, 2080868, 2113738, 2148575, 2186661, 2228635, 2273916, 2321274, 2369946, 2420166, 2472589, 2527399, 2584309, 2643351, 2705261, 2770907, 2840544, 2913701, 2989571, 3067444, 3147128, 3229130, 3314135, 3401971, 3491254, 3580414, 3669052, 3757950, 3847710, 3937668, 4026284, 4112301, 4195278, 4275282, 4352519, 4427304, 4499894, 4570055, 4636945, 4699550, 4757004, 4808308, 4852171, 4887662, 4914961, 4935047, 4948666, 4955834, 4956113, 4948791, 4932842, 4907354, 4872318, 4828524, 4776546, 4716341, 4648193, 4573570, 4494543, 4412540]
53303D412540q4557q7058q9162r0229q9856q8484q7212q6479q5135q1850p7339
53292C465179p3977p2902p2598p1030o8201o5702o4281o2957o0421n6526n2260
53281B744324m8761m6502m5143m3834m1605l7688l2098k6277k2530k1919k2935
53270B355032k3213k2312k1655k1789k1405j9545j7214j5716j4689j3081j1089
53259B153324r631q701p585o234m960l215j99L449O162P628R065J1239J3626J5874
53245B179842J8509K1599K4050K5061K5414K6503K8832L1913L4901L6841L7280
53234B490745L7153L8042L9888M0599L8770L5737L3524L1856K8868K4312K0015
53223B859509J6895J3434P913R72n144r234j2135j5409j9834k5038k9985l3721
$$ y = [4412540, 4327983, 4240925, 4151763, 4061534, 3971678, 3883194, 3795982, 3709503, 3624368, 3542518, 3465179, 3391202, 3318300, 3245702, 3174672, 3106471, 3040769, 2976488, 2913531, 2853110, 2796584, 2744324, 2695563, 2649061, 2603918, 2560084, 2518479, 2480791, 2448693, 2422416, 2399886, 2377967, 2355032, 2331819, 2309507, 2287852, 2266063, 2244658, 2225113, 2207899, 2192183, 2177494, 2164413, 2153324, 2143693, 2134992, 2127407, 2121173, 2116213, 2112998, 2112799, 2116248, 2122410, 2130038, 2139103, 2150342, 2163968, 2179842, 2198351, 2219950, 2244000, 2269061, 2294475, 2320978, 2349810, 2381723, 2416624, 2453465, 2490745, 2527898, 2565940, 2605828, 2646427, 2685197, 2720934, 2754458, 2786314, 2815182, 2839494, 2859509, 2876404, 2889838, 2897751, 2898723, 2893579, 2884345, 2872210, 2856801, 2836967, 2811929, 2781944, 2748223]
53211B748223l6036l7531l8968m0597m2224m3744m5324m7066m8712m9811n0198
53200B268012n0240n0571n1519n2720n3326n2618n0567m7982m6044m5301m5095
53189A722029m4221m2327m0341l9229l8720l7715l5782l3609l2040l1105l0264
53178A316676k9077k7456k5518k3459k1540j9947j8797j8163j7902j7484j6446
53167A080887j5190j4863j6083j7991j9110j9019j8730j9273k0367k0960k0690
53156H78611k0322k0527k0855k0324j8831j7322j6597j6521j6590j6673j6685
53145F77364j6045j4269j1902j0239j0027j0963j2305j3393j3615j2723j1430
53134E40453j0961j1553j2016j1201r282p158n249l550k365k053k349k690l039
$$ y = [2748223, 2712187, 2674656, 2635688, 2595091, 2552867, 2509123, 2463799, 2416733, 2368021, 2318210, 2268012, 2217772, 2167201, 2115682, 2062962, 2009636, 1957018, 1906451, 1858469, 1812425, 1767124, 1722029, 1677808, 1635481, 1595140, 1555911, 1517191, 1479476, 1443694, 1410085, 1378045, 1346940, 1316676, 1287599, 1260143, 1234625, 1211166, 1189626, 1169679, 1150882, 1132719, 1114817, 1097333, 1080887, 1065697, 1050834, 1034751, 1016760, 997650, 978631, 959901, 940628, 920261, 899301, 878611, 858289, 837762, 816907, 796583, 777752, 760430, 743833, 727312, 710722, 694049, 677364, 661319, 647050, 635148, 624909, 614882, 603919, 591614, 578221, 564606, 551883, 540453, 529492, 517939, 505923, 494722, 485440, 478282, 473033, 469483, 467118, 465065, 462716, 460026, 456987]
53121D56987l661m244m122l321k567k233k041j928k272l037l522l349k989k892
53107D14809k757k133j117J8J224K214K216J009m74j299j885l178m869n523m546
53092C93709k886j592o79J26L85m47j994l279l883m002l486j716J129L491L874
53077C78750K704J815J970J915M41j460j791n07K84o25j866j669m87p5p07r73
53061C77719j22R00J064O83O65J204J777J920J470M88o96j591k037k315k688l078
53045C75363l219k873j952q41l50p45j096m49M77k1k011l313k291j28P63j11j030
53028C56173o47L29L57q94k293k661k070j516j493j316k02J339K003J511R33R32
53012C50485P41m17j841k259j668j180j338j588j340o69N4N85P43N20K74L92Q03
$$ y = [456987, 453326, 449082, 444960, 441639, 439072, 436839, 434798, 432870, 430598, 427561, 424039, 420690, 417701, 414809, 412052, 409919, 408802, 408820, 410044, 412258, 414474, 415483, 415009, 413710, 411825, 408647, 403778, 398255, 393709, 390823, 389231, 388552, 388678, 389063, 388616, 386622, 383343, 379460, 375458, 371972, 370256, 371385, 374876, 378750, 381454, 383269, 385239, 387154, 387595, 386135, 384344, 383837, 384121, 383496, 381630, 379961, 379474, 379399, 378692, 377719, 377597, 378497, 379561, 380244, 380909, 382113, 383890, 385810, 387280, 387768, 387072, 385481, 383444, 381129, 378441, 375363, 372144, 369271, 367319, 366478, 366128, 365383, 364287, 363838, 364315, 364294, 362283, 358970, 356679, 356551, 357314, 357203, 356173, 355526, 355855, 356212, 355318, 353025, 350364, 348294, 346778, 345285, 343969, 343767, 345106, 347109, 348620, 349553, 350485, 351226, 350809, 348968, 346709, 345041, 343861, 342523, 340935, 339595, 338926, 338980, 339565, 340308, 340828, 341102, 341494, 342297]
52995C42297J104R81J85j383k987l032o83K618M271L198P55r38q26O96K304K528
52979C51088R66j055j698o61N79N61q68k983m849n386l931j284O47P89m8m83r4
52962C31290P69J813K694K748J742N44K58Q51J279Q48m1m11L01J659K437J823
52946C50604N70K85J303J996P97j617l028k221j20J404J232l05j741j636O3J879
52930C49465K488K217K286K963L359K833J666L02j090k084j973p69M78P82K84
52915C63207l06p24j068j111l97R71K190K499J839Q24L37J057K883M726N284M319
52899C86530K969K401K409J790N8j891l048l604m369n265n274l892j897n29l91
52884C65997j304k628l485l346k735k744l462l568k050K65J671J615R93O99Q40
$$ y = [342297, 343401, 344382, 344567, 343184, 340197, 337165, 336482, 339100, 343371, 346569, 347324, 346386, 345560, 346256, 348560, 351088, 352054, 350999, 349301, 348640, 349219, 349780, 348912, 345929, 341080, 335694, 331763, 330479, 331126, 331915, 331867, 331384, 331290, 332059, 333872, 336566, 339314, 341056, 341600, 341858, 342709, 343988, 344836, 344795, 344384, 344685, 346344, 348781, 350604, 351174, 351459, 352762, 354758, 355555, 353938, 350910, 348689, 348569, 349973, 351205, 350900, 349159, 347523, 347586, 349465, 351953, 354170, 356456, 359419, 362778, 365611, 367277, 367579, 366489, 364405, 362432, 361663, 362141, 362923, 363207, 362901, 362177, 361109, 359998, 359601, 360572, 362762, 365261, 367100, 367924, 368261, 369318, 372201, 376927, 382211, 386530, 389499, 391900, 394309, 396099, 396157, 394266, 391218, 387614, 383245, 377980, 372706, 368814, 366917, 366388, 365997, 364693, 362065, 358580, 355234, 352499, 349755, 346293, 342725, 340675, 340940, 342611, 344226, 345219, 345918, 346758]
52869C46758J166J441J263K85j164k210k254j370j0J190J586J128O62Q36R77k4
52853C50260j789k621j827o93n70j121j258q39m10N5R12J685J343j96j769k336
52837C38826j912r93J25J170J645J320O15J59J49L81O09O57L78j24m22j21P24
52820C43186J641K079J674M78q09j139j42J220J464K33j293j738r53J68P97O78
52804C47544j02j103j446n00J135K080J814J221J167J312J010O39R42J488J017
52789C58218n90j928j968j460j689k591k936k122j038r87k186l520l681k514j169
52774C27839q44j545k313k456k029j231j06R74J290P33K13N52J355J517O27o64
52758C23912j481j444p02K78R87J268J350J364J001l6j439k439k366j103O93J695
$$ y = [346758, 347924, 349365, 350628, 350913, 349749, 347539, 345285, 343915, 343905, 345095, 346681, 347809, 348471, 349307, 350284, 350260, 348471, 345850, 344023, 343330, 342760, 341639, 340381, 339542, 339132, 339187, 340099, 341784, 343127, 342931, 341162, 338826, 336914, 335921, 336046, 337216, 338861, 340181, 340796, 340955, 341104, 341485, 342094, 342751, 343129, 343005, 342583, 342462, 343186, 344827, 346906, 348580, 349058, 348249, 347110, 346968, 348188, 349652, 349885, 348592, 346854, 345901, 346069, 346866, 347544, 347442, 346339, 344893, 344393, 345528, 347608, 349422, 350643, 351810, 353122, 354132, 354771, 355713, 357201, 358218, 357628, 355700, 353732, 352272, 350583, 347992, 345056, 342934, 341896, 340909, 338723, 335203, 331522, 329008, 327839, 326995, 325450, 323137, 320681, 318652, 317421, 317315, 318289, 319579, 320312, 320525, 321077, 322432, 323949, 324576, 323912, 322431, 320987, 320285, 320563, 321550, 322818, 324168, 325532, 326533, 326497, 325058, 322619, 320253, 319150, 319843, 321538]
52742C21538J019n29j033J30J323Q50p14j604j512j553j942j583l36J65j087k712
52726C10420k736j099P95K314L820N099N150L724J956R64N43l12k114m338n746
52711C18440n150k397J091L222L114J823R74R70Q89p4j605k696k722j919j013
52696C12947n70o52r02q58k48R32K464L992N030N089L993K212O80K2P0K12J24
52679C34537j23n48j291k062k056p95J281L328M908N879N832M370J915l34j530
52664C53311j847j859j731j427j263j675k466k843k381j560j026p41l27L7k88
52649C31914j252j885j563q89n78p2J577L626L902J599j288k234j027N57J250
52634C33637J222R56N67K66L28L82k37j181j218o9J057J307J404K081K421J132
$$ y = [321538, 322557, 322028, 320995, 321125, 322448, 323298, 322584, 320980, 319468, 317915, 315973, 314390, 314054, 314219, 313132, 310420, 307684, 306585, 307380, 309694, 313514, 318613, 323763, 327487, 329443, 330407, 330950, 330638, 328524, 324186, 318440, 313290, 310893, 311984, 315206, 318320, 320143, 321117, 322087, 322976, 322902, 321297, 318601, 315879, 313960, 312947, 312377, 311725, 310823, 309965, 309717, 310649, 313113, 317105, 322135, 327224, 331217, 333429, 334109, 334131, 334201, 334413, 334537, 334414, 333866, 332575, 330513, 328457, 327662, 328943, 332271, 337179, 343058, 348890, 353260, 355175, 354841, 353311, 351464, 349605, 347874, 346447, 345184, 343509, 341043, 338200, 335819, 334259, 333233, 332492, 332165, 332202, 331914, 330662, 328777, 327214, 326325, 325747, 325675, 327252, 330878, 334780, 336379, 335091, 332857, 331830, 332387, 333637, 334859, 335815, 336382, 336648, 336976, 337358, 337121, 335940, 334722, 334653, 335710, 337017, 338421, 340502, 342923, 344055]
52618C44055j140k314j568k09L57K92M70J010J314J074O72Q45K110M057N118L801
52602C59944N83k049k074n8J692J737N54o28j230j313q99K38K061L847M498L469
52586C70372J367o48j924k438k088o79J113J668J62k149l151k141k21J222J626
52571C62091J174N53O90J807K843K848K687M003O294O840M406J387P46J900J653
52556D01922j108l750l517j173J41j042k905k845p02J198R50o78j514q86k33p38
52540C83120j665j775j242r43o63L98J673J482n34k677l270k239l51J708K995
52525C76017K520P30m80k53m9j187k386j491J091K643J755j24r68n20J18O3p52
52508C76727j684j757o55M90K71r67j343mJ650J883O41r96k339l139k960j587
$$ y = [344055, 342915, 340601, 339033, 338824, 339181, 339473, 339943, 340953, 342267, 343341, 344013, 344858, 346968, 351025, 356143, 359944, 360527, 358478, 356404, 356346, 358038, 359775, 360329, 359701, 358471, 357158, 356259, 356497, 358558, 362405, 366903, 370372, 371739, 371091, 369167, 366729, 364641, 363962, 365075, 366743, 366905, 364756, 361605, 359464, 359243, 360465, 362091, 363265, 363818, 364508, 366315, 369158, 372006, 374693, 378696, 384990, 391830, 396236, 397623, 398369, 400269, 401922, 400814, 397064, 393547, 392374, 392515, 391473, 388568, 385723, 385021, 386219, 387169, 386491, 384977, 384091, 383858, 383120, 381455, 379680, 378438, 377495, 376832, 377230, 378903, 380385, 379851, 377174, 373904, 371665, 371314, 373022, 376017, 378537, 379267, 378787, 378534, 378485, 377298, 374912, 373421, 374512, 377155, 378910, 378786, 377818, 377298, 377416, 377479, 376727, 375043, 373286, 372631, 373121, 373392, 372425, 371082, 371078, 372728, 374611, 375252, 374256, 371917, 368778, 365818, 364231]
52492C64231L00J781K592K818K179M91j551k879l108k576j718j029j069j669j607
52477C57186m5K100L203K927K221J712J343J270J681J787N67j292j739j16J794
52462C74599K182J298L53k43o24n78j00J47kM35J877K864K015L22k68J14j71j009
52444C83211l05K585N387N843M300K330M47j405k425j852n58j43p31j060o11k89
52428C94724q17j609j650q70j80m13j340j654k50K210L548K373k83k222k469j690
52412C87408p64J8O34J159J819K391J956L17p89N48L539N243M245K158R35M91
52396D11308rk90J32L72o20k006k016o93m2j327l603n109m992l476j401O8K00
52379C86496m81p85l48J28J74J08J87J63M8L13R59J191N63l10p25q16q68n29N64
$$ y = [364231, 364531, 366312, 368904, 371722, 373901, 374392, 372841, 369962, 366854, 364278, 362560, 361531, 360462, 358793, 357186, 357141, 359241, 362444, 365371, 367592, 369304, 370647, 371917, 373598, 375385, 375952, 374660, 372921, 372805, 374599, 376781, 378079, 378432, 378189, 377565, 376987, 376887, 377034, 377032, 377467, 379344, 382208, 384223, 384545, 384277, 384391, 384220, 383211, 382906, 385491, 390878, 396721, 401021, 403351, 403798, 402393, 399968, 398116, 397558, 397415, 396684, 395624, 395013, 394724, 393907, 392298, 390648, 389778, 389598, 389185, 387845, 386191, 385941, 388151, 391699, 394072, 393789, 391567, 389098, 387408, 386644, 386662, 387296, 388455, 390274, 392665, 394621, 394938, 394149, 394697, 398236, 403479, 407724, 409882, 410817, 411308, 411299, 411009, 411141, 411513, 410893, 408887, 406871, 406178, 406136, 404809, 401206, 396097, 391105, 387629, 386228, 386296, 386496, 386015, 385230, 384882, 385010, 385184, 385292, 385479, 385642, 385690, 386003, 386962, 388153, 388716, 388406, 387681, 386865, 385997, 385468, 386032]
52360C86032J854K477K387K198K165K115K110K426L047L784M760O111P315P674
52346D36455P424P645Q835J0246J0792R948P559L555j435n684p433o573m766l816
52332D72752m112m712m560l368j599OQ50P54J53r4O64K271L838M434L782K446
52316D73505J499J822L427N349O351N855M344L024L066M704O849P991P872P769
52302E43427Q597R303Q135N268K903K539L371L834L632L493L787M377N210O202
52288F14078O924P171P472Q251R079R509J0131J1806J4206J6213J7488J8585J9777
52275G70690K0837K1872K3148K4261K4756K5564K8217L2343L5448L5826L4365
$$ y = [386032, 387886, 390363, 392750, 394948, 397113, 399228, 401338, 403764, 406811, 410595, 415355, 421466, 428781, 436455, 443879, 451524, 460359, 470605, 481397, 491345, 498904, 502459, 501024, 495340, 487907, 481334, 476568, 472752, 468640, 463928, 459368, 456000, 454401, 454407, 455257, 456011, 456164, 456070, 456734, 459005, 462843, 467277, 471059, 473505, 475004, 476826, 480253, 485602, 491953, 497808, 502152, 505176, 508242, 512946, 519795, 527786, 535658, 543427, 552024, 561327, 569462, 574730, 577633, 580172, 583543, 587377, 591009, 594502, 598289, 602666, 607876, 614078, 621002, 628173, 635645, 643896, 652975, 662484, 672615, 684421, 698627, 714840, 732328, 750913, 770690, 791527, 813399, 836547, 860808, 885564, 911128, 939345, 971688, 1007136, 1042962, 1077327]
$$ [...]
##END NTUPLES=NMR SPECTRUM
##END=
